##TITLE=AC1652_NBEAH14353_8530975_WknsuoUOY3
##JCAMPDX= 6.0         $$ Bruker NMR JCAMP-DX V2.0
##DATA TYPE= NMR SPECTRUM
##DATA CLASS= NTUPLES
##ORIGIN= BRUKER
##OWNER= Administrator
$$ 1.72 TOPSPIN		Version 2.1
$$ 2014-03-14 14:15:23.287 -0800  Administrator@X
$$ Compression mode = diff/dup
##.OBSERVE FREQUENCY= 400.02188249412
##.OBSERVE NUCLEUS= ^1H
##.ACQUISITION MODE= SIMULTANEOUS (DQD)
##.ACQUISITION SCHEME= undefined
##.AVERAGES= 64
##.DIGITISER RES= 22
##SPECTROMETER/DATA SYSTEM= spect
##.PULSE SEQUENCE= noesygpps1d.comp
##.SOLVENT NAME= COFFEE_meoh
##.SHIFT REFERENCE= INTERNAL, COFFEE_meoh, 1, 14.96098
##AUDIT TRAIL= $$ (NUMBER, WHEN, WHO, WHERE, PROCESS, VERSION, WHAT)
$$ ##TITLE= Audit trail, TOPSPIN		Version 2.1
$$ ##JCAMPDX= 5.01
$$ ##ORIGIN= Bruker BioSpin GmbH
$$ ##OWNER= Administrator
$$ $$ E:\/data/COFFEE/nmr/AC1652_NBEAH14353_8530975_WknsuoUOY3/12/pdata/1/auditp.txt
$$ ##AUDIT TRAIL=  $$ (NUMBER, WHEN, WHO, WHERE, PROCESS, VERSION, WHAT)
(   1,<2014-03-14 14:15:18.146 -0800>,<Administrator>,<X>,<go>,<TOPSPIN 2.1>,
      <created by zg
	started at 2014-03-14 14:03:48.011 -0800,
	POWCHK enabled, PULCHK disabled,
       configuration hash MD5:
       C8 4E 4E 5D D3 5C D8 9E 9F 52 82 E0 59 8A DE 15
       data hash MD5: 64K
       DD F2 F7 94 C2 10 43 91 27 4E 6A 1B DF CD 92 46>)
(   2,<2014-03-14 14:15:21.256 -0800>,<Administrator>,<X>,<proc1d>,<TOPSPIN 2.1>,
      <Start of raw data processing
       efp LB = 0.3 FT_mod = 6 PKNL = 1 PHC0 = 0 PHC1 = 0 SI = 128K 
       data hash MD5: 128K
       7C D1 C8 62 34 F3 BE 6C DF 91 DB 38 45 3E 47 92>)
(   3,<2014-03-14 14:15:22.256 -0800>,<Administrator>,<X>,<proc1d>,<TOPSPIN 2.1>,
      <pk PHC0 = -82.30957 PHC1 = 0 
       data hash MD5: 128K
       6C 63 FB C0 AF 27 66 63 73 B9 C3 25 B5 CC 59 39>)
(   4,<2014-03-14 14:15:22.693 -0800>,<Administrator>,<X>,<proc1d>,<TOPSPIN 2.1>,
      <abs ABSG = 1 
       data hash MD5: 128K
       A4 AD 41 65 FA 38 5A DC 36 DA C8 2C E2 53 B7 31>)
(   5,<2014-03-14 14:15:22.803 -0800>,<Administrator>,<X>,<proc1d>,<TOPSPIN 2.1>,
      <abs ABSG = 2 
       data hash MD5: 128K
       A4 4F 0A 92 FA 67 BD C6 AE DE 4E 32 BE 95 E2 53>)
(   6,<2014-03-14 14:15:22.896 -0800>,<Administrator>,<X>,<proc1d>,<TOPSPIN 2.1>,
      <abs ABSG = 3 
       data hash MD5: 128K
       5F 50 37 45 8E EA BC F5 BA 91 56 D7 63 F5 76 42>)
(   7,<2014-03-14 14:15:22.990 -0800>,<Administrator>,<X>,<proc1d>,<TOPSPIN 2.1>,
      <abs ABSG = 4 
       data hash MD5: 128K
       E3 79 CD 32 3C 5F C2 E7 58 9E FC 51 92 19 84 2A>)
(   8,<2014-03-14 14:15:23.068 -0800>,<Administrator>,<X>,<proc1d>,<TOPSPIN 2.1>,
      <abs ABSG = 5 
       data hash MD5: 128K
       91 EB E3 CD C0 87 90 35 77 32 BD CA 4D FE E6 0A>)
$$ ##END=
$$ 
$$ $$ hash MD5
$$ $$ 9E 65 90 5F A8 96 99 90 B9 65 97 05 B5 F7 4C 0C
##$RELAX= 
##$RELAX= 
##$RELAX= 
##$RELAX= 
##$RELAX= 
##$RELAX= 
##$RELAX= 
##$RELAX= 
$$ Bruker specific parameters
$$ --------------------------
##$DU= <E:\>
##$EXPNO= 12
$$ [...]
##$TP07= 0
##$TPNAME0= <>
##$TPNAME1= <>
##$TPNAME2= <>
##$TPNAME3= <>
##$TPNAME4= <>
##$TPNAME5= <>
##$TPNAME6= <>
##$TPNAME7= <>
##$TPOAL= (0..7)
0.5 0.5 0.5 0.5 0.5 0.5 0.5 0.5
##$TPOFFS= (0..7)
0 0 0 0 0 0 0 0
##$TUNHIN= 0
##$TUNHOUT= 0
##$TUNXOUT= 0
##$USERA1= <user>
##$USERA2= <user>
##$USERA3= <user>
##$USERA4= <user>
##$USERA5= <user>
##$V9= 5
##$VALIST= <valist>
##$VCLIST= <CCCCCCCCCCCCCCC>
##$VD= 0
##$VDLIST= <DDDDDDDDDDDDDDD>
##$VPLIST= <PPPPPPPPPPPPPPP>
##$VTLIST= <TTTTTTTTTTTTTTT>
##$WBST= 1024
##$WBSW= 4
##$XGAIN= (0..3)
0 0 0 0
##$XL= 0
##$YL= 0
##$YMAX_a= 5581372
##$YMIN_a= -12567059
##$ZGOPTNS= <>
##$ZL1= 120
##$ZL2= 120
##$ZL3= 120
##$ZL4= 120
##$ABSF1= 14.96098
##$ABSF2= -5.597201
##$ABSG= 5
##$ABSL= 3
##$ALPHA= 0
##$AQORDER= 0
##$ASSFAC= 0
##$ASSFACI= 0
##$ASSFACX= 0
##$ASSWID= 0
##$AUNMP= <proc_prof1d_extract.lims>
##$AXLEFT= 0
##$AXNAME= <>
##$AXNUC= <1H>
##$AXRIGHT= 0
##$AXTYPE= 0
##$AXUNIT= <>
##$AZFE= 0.1
##$AZFW= 0.1
##$BCFW= 0
##$BC_mod= 0
##$BYTORDP= 0
##$COROFFS= 0
##$CY= 15
##$DATMOD= 1
##$DC= 0
##$DFILT= <>
##$DTYPP= 0
##$F1P= 0
##$F2P= 0
##$FCOR= 0.5
##$FTSIZE= 131072
##$FT_mod= 6
##$GAMMA= 0
##$GB= 0
##$INTBC= 1
##$INTSCL= 1
##$ISEN= 128
##$LB= 0.3
##$LEV0= 0
##$LPBIN= 0
##$MAXI= 10000
##$MC2= 0
##$MEAN= 0
##$ME_mod= 0
##$MI= 0
##$NCOEF= 0
##$NC_proc= -2
##$NLEV= 6
##$NOISF1= 0
##$NOISF2= 0
##$NSP= 0
##$NTH_PI= 0
##$NZP= 0
##$OFFSET= 14.96098
##$PC= 1
##$PHC0= -82.30957
##$PHC1= 0
##$PH_mod= 1
##$PKNL= yes
##$PPARMOD= 0
##$PPDIAG= 0
##$PPIPTYP= 0
##$PPMPNUM= 2147483647
##$PPRESOL= 1
##$PSCAL= 4
##$PSIGN= 0
##$PYNMP= <proc.py>
##$REVERSE= no
##$SF= 400.020009645067
##$SI= 131072
##$SIGF1= 0
##$SIGF2= 0
##$SINO= 400
##$SIOLD= 131072
##$SPECTYP= <>
##$SREGLST= <1H.CDCl3>
##$SSB= 0
##$STSI= 131072
##$STSR= 0
##$SW_p= 8223.68421052631
##$SYMM= 0
##$S_DEV= 0
##$TDeff= 65536
##$TDoff= 0
##$TI= <>
##$TILT= no
##$TM1= 0
##$TM2= 0
##$TOPLEV= 0
##$USERP1= <user>
##$USERP2= <user>
##$USERP3= <user>
##$USERP4= <user>
##$USERP5= <user>
##$WDW= 1
##$XDIM= 131072
##$YMAX_p= 380902257
##$YMIN_p= -33993
##$CURPLOT= <Network HP LaserJet P1505>
##$CURPRIN= <$Network HP LaserJet P1505>
##$DFORMAT= <normdp>
##$LAYOUT= <+/1D_H.xwp>
##$LFORMAT= <normlp>
##$PFORMAT= <normpl>
##$SURQMSG= 1
$$ End of Bruker specific parameters
$$ ---------------------------------
##NTUPLES= NMR SPECTRUM
##VAR_NAME=  FREQUENCY,     SPECTRUM/REAL,   SPECTRUM/IMAG
##SYMBOL=    X,             R,               I
##VAR_TYPE=  INDEPENDENT,   DEPENDENT,       DEPENDENT
##VAR_FORM=  AFFN,          ASDF,            ASDF
##VAR_DIM=   131072,        131072,          131072
##UNITS=     HZ,            ARBITRARY UNITS, ARBITRARY UNITS
##FACTOR=    0.0627417313425164, 1,          1
##FIRST=     8223.62146879497, -1107,        -58093
##LAST=      0,             1320,            -58720
##MIN=       0,             -33993,          0
##MAX=       8223.62146879497, 380902257,    0
$$ Real data points
##PAGE= N=1
##DATA TABLE= (X++(R..R)), XYDATA
$$ [...]
65156 201510 205402 209672 214488 219878 225749 231892 238117 244581 251904 260815 271789 285162 301367
65143 301367 320641 342641 366807 393105 421927 453080 485292 516837 546375 573213 597379
65132 597379 619692 641141 661769 680532 696553 709898 720582 727448 728954 724893 716482 704910
65120 704910 690619 674021 655889 636534 615252 591068 563769 533932 502427 470258 438566
65109 438566 408379 380443 355375 333614 314964 298601 283843 270610 258930 248438 238817 230328
65097 230328 223309 217380 211764 206282 201452 197606 194459 191610 188993 186734 185026 184211 184478 185318 185779
65082 185779 185562 185374 185887 186819 187491 187865 188378 189032 189376 189401 189741 190797 192193 193368 194261 195041 195563 195509
65064 195509 194899 194042 193128 192216 191570 191596 192388 193610 194871 196027 197088 198071 199037 200070 201134 202089 202838
65047 202838 203338 203441 202948 201875 200496 199124 197978 197212 196789 196340 195424 193988 192222 189982 186847 182941
65031 182941 179172 176234 173798 171158 168344 165986 164244 162550 160469 158273 156462 155146 154084 153067
65017 153067 152103 151438 151493 152480 154022 155417 156378 157252 158449 159991 161712 163607 165820 168527 171957 176215
65001 176215 180936 185419 189252 192546 195433 197738 199361 200586 201635 202273 202252 201937 201997 202629 203461 204191
64985 204191 204935 206042 207871 210687 214393 218316 221568 223629 224478 224313 223442 222248 220854 218841 215703
64970 215703 211532 206938 202386 198006 193977 190579 187812 185411 183328 181701 180335 178775 177066 175794
64956 175794 175096 174239 172666 170881 169722 169163 168480 167347 166099 165076 164334 163926 163846 163713 163126 162393 162309
64939 162309 163078 164061 164796 165665 167166 169041 170565 171428 171889 172276 172688 173026 173024 172415 171357 170502 170324 170567
64921 170567 170697 170680 170853 171184 171219 170839 170581 171023 172164 173594 174999 176312 177632 179178 181115 183265 185220
64904 185220 186970 189184 192630 197423 203123 209491 216794 225308 234719 244160 252757 260095 266292 271702
64890 271702 276554 280811 284289 286888 288695 289938 290872 291699 292460 292911 292466 290418 286401 280750 274272
64875 274272 267622 261045 254740 249189 244844 241719 239556 238269 237831 237881 237923 237919 238121 238231 237363 235167 232409
64858 232409 229958 227593 224396 220027 214983 209798 204683 199930 195951 192642 189286 185476 181814 179364
64844 179364 178579 178972 179636 179914 179717 179477 179725 180565 181580 182271 182426 182018 180972 179308 177493 176417 176837
64827 176837 178741 181276 183414 184779 185798 187030 188609 190488 192937 196393 200871 205914 211168 216760
64813 216760 223051 230344 238813 248456 259015 270182 281904 294163 306479 318009 328130 336503
64801 336503 342512 345251 344360 340423 334172 325745 315188 303300 291392 280273 269948 260293 251594
64788 251594 244317 238622 234220 230644 227602 225082 223082 221361 219756 218687 218866 220417 222716 225347
64774 225347 228624 232824 237505 242204 247403 254046 262296 271504 281279 291828 303148 314528 325068
64761 325068 334254 341937 348321 354037 359673 364927 368713 370362 370367 369758 369115 368467 367706 366719 365294 363255
64745 363255 360558 357067 352390 346124 338187 328826 318520 307954 297830 288504 279931 272084 265223
64732 265223 259678 255521 252520 250171 247799 244988 242070 239899 238980 239005 239344 239654 239953 240455 241566 243688
64716 243688 246744 250193 253739 257680 262288 267169 271602 275181 277791 279192 279111 277608 274922 271124 266270
64701 266270 260829 255494 250573 245936 241480 237274 233255 229207 225178 221569 218692 216502 214861 213777
64687 213777 213208 212923 212850 213424 215259 218445 222399 226560 231095 236652 243450 250971 258711 266929 276236
64672 276236 286693 297813 309366 321432 333521 344386 353140 359950 365004 367294 365280 358682 348914
64659 348914 337735 326088 314348 302995 292651 283657 275933 269237 263501 258975 255885 253916 252342
64646 252342 250985 250710 252483 256208 261076 266851 274061 282945 293045 304142 316883 331994 349293
64633 349293 367801 386413 404188 420383 434585 446565 455756 461238 462526 459972 454091 444947 432679
64620 432679 418229 402919 387525 372325 357924 345350 335185 327023 320018 313708 308246 304059
64608 304059 301410 300158 299872 300193 301022 302276 303653 304771 305393 305322 304334 302437 300062 297663 295254 292608
64592 292608 289722 286695 283261 278985 274081 269657 266871 265975 266290 266976 267741 268924 271017 274118 277878
64577 277878 281947 286283 290915 295601 299923 303562 306241 307553 307180 305237 302148 298260 293798 289010
64563 289010 283978 278403 271990 265013 258103 251554 245351 239876 235860 233355 231272 228415 224736 221270
64549 221270 219069 218461 219034 219935 220316 219859 218943 218168 217857 218058 218759 219834 221030 222226 223515 224813 225643
64532 225643 225586 224738 223437 221821 220027 218505 217603 216958 215936 214684 214132 214787 216076 217179 218045 219177
64516 219177 220698 222147 223116 223765 224658 226319 228944 232313 235944 239477 243013 247079 252274 258993 267387
64501 267387 277411 288806 301133 313917 326771 339327 351075 361385 369735 375859 379512 380170
64489 380170 377232 370680 361420 350774 339749 328881 318635 309622 302350 296950 293195 290602 288547
64476 288547 286503 284306 282027 279508 276219 271771 266504 261392 257359 254731 253278 252662 252822 253968 256177
64461 256177 259039 261802 263982 265730 267499 269384 270948 271695 271585 270972 270173 269282 268418 267960 268350 269733
64445 269733 271927 274664 277675 280629 283263 285739 288606 292247 296541 301232 306407 312361 319170 326736
64431 326736 335238 345219 357235 371641 388719 408777 432186 459553 491816 529872 574248 625559
64419 625559 685318 755681 838027 932020 1036127 1148455 1266511 1386427 1503336 1613059
64409 1613059 1713509 1804403 1885538 1955224 2010257 2047459 2065262 2063895 2044398 2007940 1956147
64398 1956147 1891410 1816206 1731982 1638949 1537125 1427763 1314070 1200643 1091909 990729
64388 990729 898286 814984 741038 676274 620057 571760 530951 496806 467855 442810 421380
64377 421380 403788 389733 378283 368589 360133 352398 344882 337495 330481 323893 317458 310908 304150
64364 304150 297281 290806 285586 281965 279101 275833 272196 269339 267894 267231 266589 266157 266580 268073 270634
64349 270634 274680 280742 288692 297737 307004 315748 323235 328936 332760 334754 334680 332281 327885 322345 316413
64334 316413 310467 304844 300105 296872 295473 295671 296623 297342 297573 298153 300123 303505 307196 310086 311954
64319 311954 313177 313897 313750 312348 309851 306974 304477 302635 301125 299350 296820 293419 289488 285565 281821
64304 281821 277751 272683 266606 260237 254303 249137 244982 242095 240192 238288 235659 232813 230996 230810
64290 230810 231716 232855 233971 235479 237981 241841 246971 252807 258596 263911 268991 274638 281641 290089
64276 290089 299188 308012 316444 325177 334748 344955 355249 365153 373981 380664 384415 385345 384063 381044
64262 381044 376875 372712 369677 367831 366369 364842 363628 363164 363327 363601 363261 361279 356693 349449 340557
64247 340557 331147 321676 312142 302655 293517 285052 277547 271132 265638 260868 257102 254984 254793 256124
64233 256124 258334 260888 263266 265015 266174 267162 268033 268302 267741 266852 266241 265985 265957 266206 266541 266225 264785
64216 264785 262806 261270 260287 259040 256908 254088 251168 248624 246680 245139 243388 241100 238985 238347 239814
64201 239814 242864 246584 250307 253501 255796 257520 259689 262981 267036 271190 275655 281522 289788 300744
64187 300744 314220 329884 347120 364913 382063 397585 410925 421855 430094 434975 435622 431634
64175 431634 423525 412391 399284 385064 370605 356667 343497 330919 319002 308319 299367 291959
64163 291959 285515 279810 275032 271155 267651 264031 260446 257595 256120 256179 257405 259156 260912 262621 264596
64148 264596 267022 269706 272446 275402 278810 282469 285830 288607 291004 293278 295369 297093 298430 299404
64134 299404 299769 298996 296621 292704 288067 284016 281579 280895 281428 282708 284574 286815 289041 291245 294179
64119 294179 298782 305258 312937 320930 328746 336434 344448 353402 363684 375155 387253 399344 410926
64106 410926 421578 430909 438617 444531 448707 451551 453795 456166 459121 462917 467817 474005 481374 489538
64092 489538 498029 506292 513530 518828 521606 521931 520331 517368 513377 508500 502827 496462 489500 481954
64078 481954 473741 464714 454769 444011 432879 422001 411783 402224 393289 385379 379107 374518 370850
64065 370850 367195 363254 359330 355862 353221 351643 351017 350790 350472 350297 351069 353242 356370 359594 362545
64050 362545 365582 369296 373988 379734 386743 395381 405787 417672 430673 444767 460105 476565 493751
64037 493751 511387 529320 547072 563743 578468 590648 599668 604895 606247 604368 599915 593150 584667
64024 584667 576043 568952 563686 559175 554465 549565 544764 539845 534242 527522 519349 509418 497845 485388
64010 485388 472950 460997 449720 439534 431021 424344 419006 414255 409662 405293 401447 398224 395352
63997 395352 392474 389569 386985 385141 384374 385104 387742 392192 397602 402894 407587 412000 416746 422188 428318
63982 428318 434939 441827 448784 455676 462566 469806 477895 487088 497169 507750 518804 530713 543777
63969 543777 557877 572733 588408 605389 624262 645343 668519 693361 719482 746945 776316
63958 776316 808267 843204 881384 923367 970219 1023303 1084057 1154105 1235444 1330275 1440481
63947 1440481 1567412 1712267 1876550 2061862 2269213 2498832 2750623 3024408 3319291
63938 3319291 3632965 3961954 4302343 4649838 4999051 5343127 5674270 5984459 6265730
63929 6265730 6510383 6711724 6864983 6967530 7018141 7016054 6960738 6852616 6693953 6489007
63919 6489007 6243451 5963977 5658373 5335253 5002823 4667660 4334840 4009048 3694981
63910 3694981 3396574 3116273 2855411 2615036 2396231 2199756 2025503 1872094 1737098
63901 1737098 1618046 1513474 1422723 1344668 1277180 1218147 1166575 1122119 1083777 1049659 1018074
63890 1018074 988267 959964 932678 905837 879307 853390 828261 803740 779755 756840 735922
63879 735922 717622 702018 689185 679663 673988 671836 672085 673956 677817 684646 694871 707991 723155
63866 723155 739825 757900 777529 798890 821981 846460 871669 896842 921320 944631 966372
63855 966372 985983 1002777 1016389 1027181 1035880 1042639 1046662 1046956 1043323 1036426 1027028 1015326 1000903
63842 1000903 983064 961352 936096 908517 880039 851316 821996 791491 759824 727651 695559
63831 695559 663687 632164 601772 573676 548324 524930 502482 481095 461837 445243 430621
63820 430621 417080 404630 393745 384241 375299 366505 358239 350933 344429 338265 332263 326666 321935
63807 321935 318554 316730 316041 315533 314408 312581 310509 308634 307057 305613 304011 301956 299339 296413 293655
63792 293655 291299 289022 286176 282419 278057 273694 269692 266132 263177 261098 259861 258997 258097 257202 256510
63777 256510 255919 255116 253986 252697 251514 250693 250299 249867 248562 246120 243495 242010 241898 242184 242015 241542
63761 241542 241284 241198 240795 239870 238734 237842 237439 237449 237549 237480 237449 237956 239077 240175 240561 240253 239816 239687 239965
63742 239965 240674 241813 243220 244783 246785 249656 253289 256974 260161 263021 266009 269094 271692 273349
63728 273349 274248 275010 276181 278055 280935 285271 291284 298425 305496 311478 316155 319796 322463 323998 324608
63713 324608 324971 325556 326105 326038 325155 323759 322277 321077 320528 320774 321409 321703 321302 320545 320008 320066 321024 323262
63695 323262 326789 330795 334211 336819 339449 342853 346731 350105 352420 353868 354775 355151 354942 354285 353220
63680 353220 351430 348685 345503 342987 341856 341850 342212 342498 342727 342919 342924 342743 342696 343086 343828 344562 345018 345139 344941
63661 344941 344373 343262 341307 338331 334648 330953 327545 323875 319284 314138 309723 306888 305209 303769
63647 303769 302296 301078 300068 298698 296732 294862 294138 294937 296664 298388 299647 300687 302106 304358 307510
63632 307510 311342 315593 320137 324984 330131 335413 340600 345720 351140 357177 363722 370478 377464 384984
63618 384984 393178 402052 412026 423901 437997 453749 470523 488526 508466 530627 554765 580655
63606 580655 608105 636552 665288 694080 722822 750390 774590 793732 807777 817488 822949 823619
63594 823619 819645 812421 803649 794274 784432 774022 763041 751473 739096 725412 709825 692029
63582 692029 672327 651533 630555 610059 590457 572052 555138 540014 526872 515637 506010 497835
63570 497835 491394 487217 485588 486270 488631 491905 495422 498834 502165 505559 509032 512600 516552 521250
63556 521250 526707 532752 539771 548863 560884 575598 592175 610368 630818 654306 681243 711870
63544 711870 746357 784327 824582 865403 904710 939708 967061 984245 990879 988515 979363 965567
63532 965567 949343 932871 917672 904323 892769 882463 872186 860309 845611 827630 806184
63521 806184 781047 752354 720969 688139 655120 623321 594271 568814 546483 526097 506928
63510 506928 489077 472941 458741 446435 435688 425962 416902 408614 401376 395222 390019 385635 381695
63497 381695 377460 372511 367443 363412 361014 360000 359932 360554 361534 362400 362861 362865 362395 361643 361285 361979 363505
63480 363505 365087 366621 368854 372121 375692 378864 381965 385577 389236 391775 392730 392669 392149 391097 389384
63465 389384 387408 385676 384056 381813 378466 374471 370970 368765 367589 366612 365613 365340 366506 368854 371585
63450 371585 374406 377661 381527 385648 389667 393760 398469 404232 411127 418867 426948 435065 443483 452897
63436 452897 463868 476593 491263 508409 528737 552703 580224 610508 641881 671912 698081
63425 698081 718703 733455 743278 749841 754938 760142 766825 776325 789839 808007 830633 856935 886072
63412 886072 917283 949491 980970 1009544 1033127 1050145 1059806 1062400 1059324 1052361 1042710 1030853
63400 1030853 1017321 1003044 988591 973489 956813 938239 917954 895735 870910 843368 813953
63389 813953 783600 752696 721711 691879 664512 639793 616806 594794 574050 555547 540033
63378 540033 527574 517746 510113 504536 501035 499550 500050 502819 508134 515526 523790 532066 540633 550347
63364 550347 561642 574471 588834 604801 622233 641099 661989 685747 712586 742107 774168
63353 774168 808952 845842 882804 917402 948225 974980 997403 1014582 1025462 1029811 1028525 1022967
63341 1022967 1014103 1002479 988998 975223 962296 949671 935511 918463 898599 876563 852489
63330 852489 826266 798389 769882 741529 713765 687302 663304 642715 625729 612087 601589
63319 601589 594134 589518 587466 587667 589336 590672 589071 582253 569436 551623 530947 509679 489432
63306 489432 470898 454230 439777 428311 420298 415019 410869 406730 402741 399474 396761 393819 390390
63293 390390 387121 384684 382909 381031 378456 375069 371064 366823 362786 359111 355537 351846 348373 345740
63279 345740 344058 342727 341203 339687 338850 339019 339909 341034 342067 342819 343207 343464 344105 345424 347091 348497
63263 348497 349427 350217 351374 353331 356426 360700 365571 370110 373850 377172 380745 384824 389209 393650 398150
63248 398150 403076 409042 416308 424184 431515 438131 445361 454614 465863 478149 491254 505997 522958
63235 522958 541795 562102 584088 608019 633602 660478 688824 718848 749955 781050 811546
63224 811546 841518 870950 899429 926753 953409 980180 1007521 1035493 1064053 1093131 1122463
63213 1122463 1151563 1179854 1206628 1230822 1251089 1266378 1276451 1281476 1280978 1273569 1258178 1235467
63201 1235467 1207491 1175921 1141130 1103315 1063902 1025163 988569 954225 922019 892720 867509
63190 867509 846802 830035 816497 805981 798628 794607 794130 797437 804450 814618 827414 842846 861131
63177 861131 881884 903981 926238 947919 968602 988100 1006794 1025550 1044791 1063860 1081683
63166 1081683 1097851 1112556 1125620 1136150 1143179 1146096 1144395 1137544 1125402 1108382 1086944 1061241
63154 1061241 1031547 998718 963946 928262 892555 857808 824906 794190 765530 738754 713939
63143 713939 691401 671694 655421 642653 632507 623640 615289 607619 600984 595122 589372 583580 578496
63130 578496 575139 573908 574459 576306 579270 583298 588134 593457 599235 605695 612873 620375 627551 633846
63116 633846 639119 643820 648746 654273 659808 664288 667201 668937 670202 671493 673112 675142 677141 678247
63102 678247 677950 676602 674941 673357 671782 670047 668062 665837 663593 661660 660104 658690 657439 656915 657637
63087 657637 659436 661707 664038 666229 668010 669296 670588 672585 675380 678491 681674 685200 689291 693802
63073 693802 698627 703991 710091 716840 724181 732347 741556 751749 762907 775368 789522 805404 822912
63060 822912 842321 864215 888909 916255 946104 978764 1014906 1055121 1099670 1148582 1201872
63049 1201872 1259563 1321498 1387149 1455671 1526099 1597475 1668893 1739662 1809508 1878490 1946650
63038 1946650 2013862 2079994 2145023 2208899 2271535 2333141 2394290 2455276 2515231 2572137 2623800
63027 2623800 2668684 2705714 2733461 2749836 2752666 2740560 2713250 2671279 2615577 2547425 2468810
63016 2468810 2382626 2292195 2200403 2109287 2020503 1935990 1857820 1787349 1724830 1670071 1623213
63005 1623213 1584664 1554574 1532799 1519338 1514246 1516991 1526275 1540729 1559575 1582410 1608640 1637462
62993 1637462 1668286 1700825 1734777 1769623 1804722 1839508 1873632 1907031 1939773 1971643 2001920
62982 2001920 2029627 2053820 2073391 2086772 2092224 2088522 2075240 2052400 2020203 1979218 1930567 1875685
62970 1875685 1815932 1752519 1686689 1619825 1553345 1488571 1426628 1368358 1314177 1263969 1217132
62959 1217132 1172973 1131217 1092117 1055976 1022602 991352 961640 933239 906119 880225 855562
62948 855562 832379 811045 791617 773538 755855 737902 719876 702758 687600 674814 664030
62937 664030 654509 645705 637579 630436 624409 619159 614235 609685 606003 603407 601470 599624 597701 595740
62923 595740 593617 591257 589001 587273 585988 584675 583056 581032 578156 573831 568220 562469 557662 553932
62909 553932 550834 548133 545772 543415 540641 537605 534971 533058 531416 529460 527272 525545 524785 524718 524537
62894 524537 523696 522393 521249 520540 519891 518764 517074 515186 513436 511954 510919 510650 511252 512322 513219 513572
62878 513572 513391 512864 512235 511847 511927 512198 511963 510784 508889 506742 504497 502193 500323 499581 499939 500433 500168
62861 500168 499266 498559 498617 499316 500101 500363 499795 498787 498361 499244 501016 502473 502796 502066 500721 498986 496927
62844 496927 494654 492291 490001 488127 486989 486398 485674 484319 482480 480677 479312 478573 478450 478642 478716 478635
62828 478635 478871 479781 481141 482546 484018 485792 487702 489261 490399 491722 493931 497187 501166 505470 509875
62813 509875 514307 518758 523217 527639 531968 536240 540636 545500 551228 558024 565665 573631 581539 589384
62799 589384 597350 605579 614261 623764 634424 646292 659247 673224 688169 704037 721224 740866
62787 740866 764246 791787 823047 857900 897307 942578 994148 1051523 1114405 1183431 1259650
62776 1259650 1343523 1434633 1532211 1635625 1744261 1856955 1971678 2085775 2196507 2301313
62766 2301313 2397625 2482623 2553464 2607838 2644272 2661918 2660205 2638945 2598796 2541536 2469759
62755 2469759 2386251 2293551 2193914 2089475 1982322 1874418 1767524 1663237 1563009 1467925
62745 1467925 1378472 1294705 1216769 1145104 1079933 1020790 966875 917862 873958 835117 800602
62734 800602 769552 741704 717255 696210 678124 662310 648098 635083 623435 613780 606492 601158
62722 601158 596941 593271 589932 586852 584322 583143 583925 586325 589581 593718 599459 607003 615872 626231
62708 626231 639336 655983 675350 696292 719249 745823 776756 811380 849135 890655 937036
62697 937036 988750 1045619 1107285 1173279 1243036 1316211 1392678 1471874 1552389 1632432 1710362
62686 1710362 1784410 1852134 1910651 1957455 1990865 2009888 2014015 2003265 1978211 1939940 1890018
62675 1890018 1830353 1762835 1689064 1610559 1529197 1447275 1367015 1289982 1216935 1148091 1083491
62664 1083491 1023156 967047 915071 867265 823865 785045 750563 719814 692213 667364 644902
62653 644902 624508 606173 590124 576273 563946 552356 541164 530345 519844 509736 500514 492656
62641 492656 485973 479913 474532 470518 468099 466544 465171 464303 464602 465850 467099 467859 468306 468263 466892 463845
62625 463845 460100 457022 454908 453008 450793 448583 447005 446415 446980 448797 451614 454797 457932 461339 465682
62610 465682 471156 477329 483707 490223 497065 504311 511934 520147 529541 540698 553735 568349 584461
62597 584461 602745 624466 650725 681864 717490 756989 799992 846461 896351 949193 1004021
62586 1004021 1059658 1114955 1168689 1219383 1265385 1305080 1336943 1359567 1371989 1374041 1366236 1349288
62574 1349288 1323897 1290993 1251888 1208059 1160906 1111783 1061982 1012472 963742 916140 870340
62563 870340 827325 787875 752148 719819 690623 664670 642164 622837 605882 590566 576736
62552 576736 564505 553633 543561 534054 525396 517875 511445 506066 502040 499645 498626 498329 498231 498085
62538 498085 497651 496645 495051 493287 491922 491262 491189 491339 491445 491548 491913 492792 494387 496982 500917 506390
62522 506390 513437 522180 532891 545759 560771 577948 597540 619894 645325 674203 706903 743415
62510 743415 783180 825531 870147 916875 965335 1014976 1065251 1115264 1163258 1206979 1244798
62499 1244798 1276292 1301564 1320259 1331537 1335020 1331607 1323303 1312332 1300568 1289694 1281512 1277610
62487 1277610 1278812 1285381 1297884 1317393 1344580 1378994 1419531 1465308 1515677 1569720 1626150 1683234
62475 1683234 1738046 1786002 1822355 1844814 1854375 1853205 1842024 1819705 1784819 1736964 1676969 1606718
62463 1606718 1529071 1447463 1364964 1283505 1203973 1127045 1053914 986269 925562 872317 826158
62452 826158 786470 752892 725123 702454 683808 668372 656028 646975 641009 637450 635797 636091 638301
62439 638301 641724 645554 649962 655895 663588 671881 679307 685282 689723 692080 691567 688087 682154 674036
62425 674036 663756 651937 639743 627722 615401 602373 589148 576527 564724 553602 543338
62414 543338 534237 526151 518555 511080 503630 496230 489137 482873 477632 472840 467794 462697 458552 455948
62400 455948 454412 453094 451756 450928 451301 453172 456249 459807 463060 465543 467266 468697 470613 473756 478299
62385 478299 483642 488905 493650 498080 502648 507666 513186 518984 524713 530292 536195 543114 551259 560184
62371 560184 569323 578505 587834 597311 606831 616548 627116 639447 654177 671354 690747 712533 737562
62358 737562 766848 800863 839438 882152 928547 978044 1030005 1083922 1139173 1194359 1247028
62347 1247028 1294312 1333909 1364594 1386186 1399315 1405063 1404450 1398127 1386490 1369878 1348562 1322772
62335 1322772 1293117 1260858 1227474 1193903 1160516 1127842 1096906 1068584 1042913 1019322 997359
62324 997359 976850 957507 938772 920071 900857 880393 857990 833706 808487 783306 758379
62313 758379 733547 709244 686566 666326 648397 632172 617419 604459 593555 584381 576306 569209
62301 569209 563772 560633 559253 558085 556170 554213 553663 555007 557588 560899 565232 570814 577086 583447
62287 583447 590253 598433 608264 619071 630045 640848 651368 661410 670874 679953 688902 697692 706046
62274 706046 713723 720700 727081 732908 738009 742124 745257 747851 750528 753761 757918 763495 771098 781180
62260 781180 794050 810159 830170 854703 884138 918672 958327 1002843 1051745 1104558 1160666
62249 1160666 1218683 1276155 1330150 1378260 1418984 1451412 1474905 1489185 1494445 1491116 1479533 1459906
62237 1459906 1432557 1398087 1357349 1311355 1261235 1208187 1153449 1098395 1044618 993723 946858
62226 946858 904405 866160 831792 801084 773827 749699 728345 709567 693336 679577 667936
62215 667936 657854 648920 641112 634539 628985 623971 619337 615458 612649 610612 608867 607557 607344 608532
62201 608532 610805 613938 618126 623238 628246 632078 634859 637762 641730 646849 652978 660254 668656 677494
62187 677494 685877 693519 700799 708217 716118 724815 734464 744651 754434 763004 770178 776101 780733 783993
62173 783993 786402 789219 793723 800402 809001 819341 832030 848359 869549 896035 927397 962816
62161 962816 1001497 1042591 1084822 1126428 1165569 1200751 1230913 1255366 1273833 1286405 1293230 1294270
62149 1294270 1289545 1279552 1265185 1247153 1225656 1200695 1172603 1142260 1110945 1080078 1050924 1024316
62137 1024316 1000597 979815 961967 947087 935140 925817 918314 911437 904140 896062 887467 878670 869680
62124 869680 860464 851380 843179 836539 831610 827970 825095 822924 821904 822398 824192 826736 829710 833087
62110 833087 836729 840290 843498 846144 847712 847423 844879 840464 834976 829127 823528 818865 815761 814522
62096 814522 814994 816359 817050 815411 810962 804802 798504 792886 788145 784674 782971 782806 783254 783810 785012
62081 785012 787643 791739 796728 802315 808784 816479 825394 835455 846934 860279 875487 891939 909043
62068 909043 926857 945797 965837 986457 1007494 1029590 1053484 1079163 1106081 1133860 1162187
62057 1162187 1190000 1215356 1236353 1252004 1262166 1266999 1266778 1261997 1253283 1241015 1225094 1205137
62045 1205137 1180905 1152582 1120659 1085717 1048417 1009587 970026 930213 890522 851817 815400
62034 815400 782107 751680 723346 696800 672343 650316 630846 613933 599297 586137 573515
62023 573515 561091 549212 538343 528720 520439 513408 507153 501133 495402 490567 486934 484099 481550
62010 481550 479285 477564 476388 475571 475156 475416 476500 478273 480473 482881 485465 488462 492227 496808 501721
61995 501721 506248 509951 512935 515612 518167 520129 520559 518929 515755 512090 508390 504182 498880 492558
61981 492558 485784 479006 472360 465825 459314 452792 446540 441100 436736 433057 429397 425506 421743 418714
61967 418714 416813 415967 415567 414750 412941 410174 406914 403719 401087 399285 398068 396759 394890 392687 390786
61952 390786 389623 389318 389911 391318 393119 394839 396615 399292 403610 409366 415515 421123 426162 431437 437827
61937 437827 445668 454804 465016 476114 487670 498937 509319 518872 528188 537744 547382 556376 563977
61924 563977 569982 574806 578932 582334 584566 585327 584668 582609 579017 574200 569276 565525 563433 562754 563458
61909 563458 566111 571149 578150 586127 594363 602707 611142 619377 626872 633108 637738 640641 641888 641565
61895 641565 639590 635857 630722 625215 620482 616956 614194 611548 608814 606222 604020 602189 600393 598068
61881 598068 594728 590319 585078 578949 571433 562286 552074 541695 531607 521938 513098 505641 499524
61868 499524 494170 489404 485818 483964 483662 484373 485867 488193 491314 495095 499435 504213 509334 515033 521862
61853 521862 530222 540226 552079 566060 581788 598085 614069 630050 646812 664376 682001 698992
61841 698992 714748 728252 738439 745183 749232 751061 750430 747249 742189 736101 729438 722699 716865 712805
61827 712805 710494 709429 709664 711947 716792 723823 732042 740367 747778 753373 756602 757449 756139 752714 747040
61812 747040 739269 730030 719976 709227 697530 685034 672632 661379 651749 643556 636330 629487 622359
61799 622359 614550 606291 598124 590222 582358 574538 567250 560921 555518 550912 547283 544750 542782 540403
61785 540403 537070 533143 529509 526879 525375 524563 523793 522700 521430 520371 519725 519414 519297 519309 519395 519536 519898
61768 519898 520748 522133 523726 525132 526268 527417 529017 531510 535201 540035 545556 551337 557454 564261
61754 564261 571636 578744 584790 589747 594008 597476 599377 598999 596255 591479 585088 577642 569940 562701
61740 562701 556243 550622 545883 541963 538471 534893 531005 526942 522933 519214 516133 514109 513361 513777 515031
61725 515031 516717 518439 519941 521199 522273 523132 523734 524220 524876 525928 527519 529773 532574 535230 536675
61710 536675 536267 534364 531954 529703 527465 524722 521392 518057 515304 513007 510442 507117 503253 499399
61696 499399 495798 492318 488800 485239 481677 478106 474456 470587 466400 462033 457813 453895 450120 446331
61682 446331 442572 438840 434997 431261 428375 426776 425819 424429 422408 420451 418926 417406 415628 414174
61668 414174 413743 414162 414594 414447 413738 412868 412378 412692 413724 414924 415995 417309 419242 421413 423044 424017
61652 424017 425086 427095 430227 433958 437387 439716 440785 441175 441524 441872 441945 441836 441859 441844 441260 440170 439399
61635 439399 439462 439902 440116 440351 441339 443198 445236 446735 447487 447636 447379 446839 445846 443853 440430 435883 431105
61618 431105 426729 422684 418645 414654 411212 408877 407742 407069 405596 402582 398579 394798 391719 388774
61604 388774 385440 382064 379253 376939 374503 371554 368200 364771 361667 359243 357454 355729 353554 350989
61590 350989 348318 345476 342335 339306 337059 335664 334552 333281 331860 330418 329163 328606 329105 330045 330241
61575 330241 329396 328509 328518 329147 329565 329552 329477 329559 329715 329894 330118 330449 331209 332836 335083 336856 337396 337277 337621
61556 337621 338704 339932 340919 341822 342769 343674 344548 345343 345622 345079 344320 344380 345401 346570 347424 348362 349608
61539 349608 350571 350757 350655 351034 351850 352485 352869 353693 355522 358110 360670 362575 363753 364513 365034 365051 364133
61522 364133 362193 359547 356584 353721 351545 350469 350163 349801 349090 348623 348937 349679 349968 349307 347850 346171
61506 346171 345102 345375 346924 348702 349670 349827 349965 350602 351610 352712 353810 354749 355231 355198 355034 355206 355826
61489 355826 356652 357409 358066 358892 360232 362116 364044 365298 365586 365362 365513 366697 368929 371774 374846 378037
61473 378037 381233 384079 386206 387655 388879 390362 392329 394638 396660 397520 396910 395621 394800 394669 394451
61458 394451 393623 392608 392002 391681 391109 390179 389331 389085 389759 391307 393071 394018 393683 392721 392197 392547 393502 394728
61440 394728 396022 397102 397741 398072 398393 398746 399087 399647 400600 401464 401473 400656 399976 400143 400733 400840 400341 400100 400975
61421 400975 402857 404739 405691 405760 405914 407023 408980 410901 412137 412877 413740 414950 416019 416235 415379 413953
61405 413953 412707 411998 411697 411538 411324 410820 409828 408537 407511 407160 407406 407913 408362 408465 408103 407635 407628 408015
61387 408015 408041 407404 406922 407556 409209 411145 413218 415834 418900 421708 423968 426207 428929 432021 435196
61372 435196 438444 441727 444721 447140 449033 450538 451709 452729 453925 455364 456810 458229 459944 462059
61358 462059 464185 466097 468301 471582 476135 481465 486940 492139 496898 501423 506361 512405 519653 527347
61344 527347 534308 539676 543407 546057 548055 549335 549829 550002 550406 550835 550507 549236 547800 546889 546209 545025
61328 545025 543187 541148 539267 537543 535797 533748 531097 528003 525335 524028 524226 525402 527227 529923
61314 529923 533828 538993 545267 552498 560626 569804 580425 592764 606683 621930 638600 656854 676161
61301 676161 695235 712860 728418 741505 751463 757643 759942 758786 754702 748140 739610 729759 719285
61288 719285 708853 698890 689284 679448 669000 658395 648581 639978 632075 624106 615924 608111 601504
61275 601504 596810 594364 593859 594428 595313 596463 598182 600317 602246 603691 605041 606751 608905 611650 615524
61260 615524 620936 627678 635384 644042 653437 662466 669807 675240 679538 683033 685103 685318 684315 683033
61246 683033 681626 679649 676922 673715 670297 666818 663482 660461 657735 655288 653372 652276 651936 651988 652132
61231 652132 652363 653052 654862 658272 662985 668221 673770 680336 688508 697878 707611 717418 727376 737212 746532
61216 746532 755477 764358 772807 780157 786633 793225 800212 806680 811804 815831 819378 822518 825061 827148
61202 827148 829025 830798 833008 836914 843468 852366 862814 874828 888931 904800 921256 937648 954245
61189 954245 970901 986189 998483 1007368 1013408 1016918 1017686 1015777 1011979 1007263 1002122 996495 990078 982557
61175 982557 973688 963310 951299 937603 922483 906671 891112 876391 862372 848390 833779 818287
61163 818287 802121 785716 769503 753814 738880 724778 711469 698965 687405 676907 667544 659703
61151 659703 654304 652178 653096 655781 659081 662806 667154 671638 674985 675958 674015 669375 662925 656011 649834
61136 649834 644809 640681 637230 634632 633197 633126 634586 637646 642045 647414 653935 662452 673615 687151
61122 687151 702226 718393 735941 755483 777423 801713 827819 854936 882466 910375 938965
61111 938965 968271 997727 1026473 1053986 1080381 1105991 1130580 1153092 1172417 1188310 1201305
61100 1201305 1211781 1219473 1223861 1224494 1220718 1211610 1196776 1177111 1154396 1130134 1104928 1078813
61088 1078813 1051883 1024628 997895 972518 948931 927191 907361 889528 873405 858381 844311
61077 844311 831908 821906 814071 807485 801681 797031 794067 792807 792767 793324 794186 795788 799115 804752 812152
61062 812152 820122 827941 835692 843755 852500 862379 873805 886880 901551 917947 936142 955734 976232
61049 976232 997784 1020965 1045873 1072077 1099512 1128666 1159655 1191772 1224277 1257188 1290903
61038 1290903 1325491 1360638 1395947 1430927 1465001 1497840 1529512 1560192 1589981 1619006 1647307
61027 1647307 1674587 1700605 1725950 1751797 1778648 1805927 1833141 1860749 1889385 1918757 1947951
61016 1947951 1976524 2004837 2033744 2064552 2099057 2139017 2185656 2239899 2302842 2375588 2458948
61005 2458948 2553741 2661431 2784653 2928068 3099471 3309940 3572989 3904275 4322248 4847684
60995 4847684 5501694 6305124 7280282 8450736 9836484 11448666 13285966 15323023 17482316
60986 17482316 19607516 21478476 22885568 23724214 24041320 24002798 23816246 23663967 23664801
60977 23664801 23846061 24118618 24284054 24101404 23391019 22111290 20361742 18324208 16191278
60968 16191278 14119803 12214560 10530028 9080686 7855069 6828939 5974003 5262485
60960 5262485 4669609 4174622 3760349 3412360 3118616 2869052 2654762 2467840 2302359
60951 2302359 2155012 2024174 1908340 1805563 1713891 1631776 1558201 1492630 1434576 1382841
60941 1382841 1335384 1290148 1245800 1201627 1157292 1113120 1070142 1029255 990524 953712 919202
60930 919202 887808 859783 834570 811488 790262 770922 753652 738752 726320 715861 706481 697583
60918 697583 689139 681318 674147 667552 661444 655722 650438 645983 642832 641055 640315 640346 641072 642135 642726
60903 642726 642186 640608 638576 636406 633922 630882 627331 623417 619069 614099 608594 603018 597799 592898
60889 592898 587948 582808 577766 573106 568700 564227 559672 555288 551069 546580 541402 535515 529082 522116
60875 522116 514635 507071 500158 494351 489527 485350 481701 478587 475832 473159 470578 468484 467273 467044
60861 467044 467736 469376 471923 474918 477589 479575 481603 485179 491320 499423 507557 513985 518383 521490
60847 521490 523931 525784 527200 528825 531302 534687 538618 542697 546313 548361 547666 543861 537635 530178
60833 530178 522552 515341 508482 501470 494077 486869 480706 475804 471745 468360 465947 464390 462646 459641
60819 459641 455463 451228 447806 445007 442011 438342 434316 430615 427501 424535 421135 417334 413684 410488
60805 410488 407498 404507 401793 399654 397813 395754 393466 391433 389893 388572 387198 385880 384801 383870
60791 383870 382957 382187 381666 381108 380138 378993 378451 378901 379837 380605 381392 382973 385539 388261 390168 391014 391081
60774 391081 390599 389802 389266 389627 390960 392845 394960 397298 399850 402518 405321 408258 410924 412752 413735
60759 413735 414488 415389 416138 416372 416298 416312 416306 415800 414613 413088 411727 410851 410427 410032 409129 407687 406337 405625
60741 405625 405315 404741 403687 402452 401123 399220 396209 392020 387056 381944 377375 373796 371064 368652 366363
60726 366363 364568 363585 363113 362626 362108 361975 362317 362707 362915 363378 364557 366089 367058 367078 366706 366673 367118 367804
60708 367804 368684 369868 371237 372545 373819 375333 377174 379159 381181 383239 385137 386523 387345 387973 388736
60693 388736 389691 390907 392588 394607 396276 396943 396657 395988 395384 395001 394982 395506 396544 397828 399137 400423
60677 400423 401698 402995 404459 406288 408496 410824 412940 414724 416309 417883 419365 420295 420127 418628 415949
60662 415949 412358 408128 403701 399706 396655 394613 393228 392035 390812 389816 389659 390745 392782 394983 396772
60647 396772 398159 399537 401306 403614 406109 407994 408618 408010 406551 404306 401153 397499 394158 391424 388907
60632 388907 386451 384525 383434 382834 382476 382699 383675 384801 385533 386321 387927 390232 392482 394353 395929 396859
60616 396859 396521 395038 393265 391686 390051 388263 386935 386758 387792 389507 391089 391722 391149 390094 389637
60601 389637 390047 390707 391135 391445 391752 391907 392055 392796 394397 396401 398371 400515 403226 406484 410082 413991
60585 413991 418082 421908 425106 427673 429573 430563 430770 430832 430987 430575 429171 427786 428127 430822 435123 440252
60569 440252 446242 453389 461656 470956 481452 493245 506118 519855 534490 549901 565388 579956
60557 579956 592849 603582 611554 616049 616696 613753 607869 599734 590141 580243 571361 564359 559333 556063
60543 556063 554626 555279 557937 562175 567846 575325 585060 597157 611549 628269 647384 668906 692870
60530 692870 719129 746827 774360 800055 822606 840718 852983 858649 858232 852876 843402 830558
60518 830558 815789 800800 786262 771665 756662 741888 728221 715890 704778 695156 687595 682364
60506 682364 679335 678361 679427 682553 687807 695392 705627 719065 736664 759503 788033 821896 860764
60493 860764 904978 954857 1009683 1067962 1128544 1190670 1252818 1312241 1366207 1413289 1453137
60482 1453137 1485445 1509703 1525608 1532924 1530810 1517921 1493428 1457688 1411807 1357003 1294742 1227197
60470 1227197 1157117 1087226 1019866 956946 899707 848391 802464 761383 725091 693734 667082
60459 667082 644368 624586 606794 590311 574906 560845 548548 538017 528652 519787 511350 503833
60447 503833 497583 492320 487398 482399 477323 472428 468149 465012 463212 462206 461017 459081 456617 454181
60433 454181 452208 451068 450991 451584 451787 450866 449263 448008 447422 446926 446009 444792 443554 442323 441171 440437
60417 440437 440319 440630 441289 442721 445315 448653 451662 453529 454202 454179 454125 454672 456201 458598 461326 463823
60401 463823 465813 467340 468636 469956 471456 473126 474849 476453 477792 478945 480312 482274 484749 487341
60387 487341 489940 492805 495894 498676 501003 503719 507686 512400 516351 518802 520491 522298 523987 524858
60373 524858 525134 525872 527642 529946 532040 533707 535013 535914 536538 537472 539190 541348 543190 544664 546583
60358 546583 549504 552945 556016 558465 560718 563159 565932 569348 573964 580124 587766 596727 606790 617304
60344 617304 627199 635684 642584 647716 650294 649520 645675 640090 633952 627454 620232 612266 604104 596383
60330 596383 589418 583261 577947 573478 569577 565630 561115 556135 551355 547320 543966 540928 538118 535823
60316 535823 534330 533708 533954 535134 537393 540983 546256 553413 562251 572402 583925 597446 613531 631994
60302 631994 651945 672490 693227 713997 734185 752393 766974 776933 782183 782886 778762 769320 754704
60289 754704 736093 715311 694224 674403 656867 641882 629119 618186 608913 601118 594350 588053
60277 588053 581827 575437 568795 562173 556153 551000 546156 540720 534459 528026 522168 517092 512696 509019
60263 509019 506123 503786 501665 499670 497901 496299 494662 492983 491493 490349 489614 489530 490512 492648 495459
60248 495459 498292 500772 502730 504008 504602 504852 505131 505369 505097 503980 502149 500137 498657 498306 499175 500742
60232 500742 502381 504005 505985 508567 511667 515244 519438 524179 529018 533609 538125 542926 547992 553037
60218 553037 558042 563355 569179 575297 581479 587998 595429 603905 612877 621828 631043 641249 652457 663679
60204 663679 674058 683815 693567 703027 711211 717845 723769 729688 735318 740179 744524 748726 752198 753819
60190 753819 753389 751900 750180 747879 744064 738374 731290 723580 715828 708360 701258 694415 687660 680947
60176 680947 674409 668322 662935 658226 653877 649656 645795 642718 640346 637946 634948 631730 629235 627737
60162 627737 626322 623835 620209 616558 613966 612577 611981 612083 613102 614871 616679 617973 618913 620038 621671
60147 621671 623728 625866 627689 629183 631083 634386 639158 644182 648232 651510 655351 660707 667400 674793
60133 674793 682646 691137 700428 710443 720833 731017 740389 748577 755455 760946 765050 768010 770257
60120 770257 772214 774306 777023 780600 784645 788387 791379 793749 795778 797525 798883 799744 800001 799577 798489
60105 798489 796651 793670 789132 783148 776356 769338 762241 754914 747152 738930 730846 724228 720205 718496
60091 718496 717619 716465 715135 714096 713299 712646 712658 713877 715920 717848 719326 720735 722340 724102 726247
60076 726247 729058 731798 732679 730475 725701 719627 712560 703778 692958 680883 668638 656702 645162
60063 645162 634334 624681 616283 608815 602045 596031 590760 585906 581146 576526 572356 568858 566147 564469
60049 564469 564176 565362 567681 570635 573986 577884 582649 588427 594996 601979 609337 617510 626774 636510
60035 636510 645395 652410 657439 660844 662831 663408 662622 660543 657157 652600 647292 641615 635600 629228 622835
60020 622835 616689 610229 602280 592237 580746 569035 557939 547764 538677 530737 523676 517126 511138
60007 511138 506176 502480 499734 497523 495926 495383 495986 497098 497800 497647 496938 496340 496435 497658 500337 504414
59991 504414 509149 513502 517122 520734 525316 530948 536780 542004 546529 550635 554376 557532 559833 560967
59977 560967 560547 558428 555000 550934 546672 542341 538058 533997 530168 526451 522954 520107 518352 517953 519159
59962 519159 522191 526871 532540 538641 545246 552760 561168 569749 577442 583280 586623 587327 585794 582746
59948 582746 578954 575220 572366 570801 570103 569353 568051 566420 564724 562616 559496 555358 550915 546850 543286
59933 543286 540083 537390 535595 534854 535029 536113 538381 541919 546329 551199 556695 563258 570783 578518 585851
59918 585851 592744 599198 604726 608748 611281 612911 614309 616078 618845 622972 628157 633677 639096 644476
59904 644476 649929 655243 660014 663839 666401 667641 667952 667940 667897 667692 667236 666800 666810 667553 669187 671836 675535
59887 675535 680239 685930 692519 699573 706405 712690 718866 725678 733305 741093 748224 754570 760770 767412
59873 767412 774232 780324 785067 788509 790747 791382 790023 787042 783262 778910 773395 766240 757788 748842
59859 748842 739996 731502 723459 715840 708513 701444 694769 688584 682840 677525 672767 668733 665636 663852
59845 663852 663738 665338 668520 673382 680114 688427 697579 707080 716822 726317 734365 739958 743190 744963
59831 744963 746185 747620 750065 753934 758750 763443 767048 768801 767877 763638 756195 746327 734892 722608
59817 722608 710214 698308 686998 676100 665672 656008 647177 639049 631745 625582 620465 615831 611450
59804 611450 607831 605537 604353 603464 602340 601150 600368 600122 599994 599393 598170 596782 595767 595122 594348 593038
59788 593038 591245 589359 587865 587165 587347 588036 588647 588794 588363 587352 585949 584618 583707 582965 581904 580652
59772 580652 579993 580441 581742 583452 585463 587665 589670 591453 593844 597734 602880 608129 612817 617392 622636
59757 622636 628923 636452 645666 656948 670092 684395 699094 713532 727211 740136 753038 766790
59745 766790 781488 796234 809785 821242 830233 836887 841731 845339 847882 849217 849403 848773 847383 844823
59731 844823 840894 836178 831538 827238 822966 818529 814011 809349 804326 799038 793864 788826 783502 777748
59717 777748 772068 766972 762407 758196 754539 751599 748910 745889 742817 740695 739995 740084 740089 739997 740597 742557
59701 742557 745793 749645 753506 757247 761092 765145 769137 772760 776086 779439 782825 785742 787665 788595
59687 788595 788979 789172 789090 788445 787221 785750 784302 782764 780849 778491 775806 772714 768938 764354 759027
59672 759027 752865 745695 737851 730233 723479 717461 711901 707074 703324 700254 697080 693802 691437 691009
59658 691009 692726 696169 700791 706056 711541 717177 723137 729348 735379 740911 745998 750612 754165 755724
59644 755724 754690 751131 745579 738563 730291 720745 710056 698697 687250 676238 666333 658374 652716
59631 652716 648700 645201 641704 638409 635412 632313 628657 624244 618913 612583 605690 599047 593033 587389
59617 587389 582025 577366 573514 569674 565024 559821 555047 551312 548668 547236 547234 548407 550073 551884 554059
59602 554059 556723 559478 561764 563315 564134 564404 564536 564961 565651 566129 566093 565754 565396 564946 564260 563484 562808 562061
59584 562061 561008 559887 559153 558628 557428 555004 551911 549199 547220 545462 543442 541327 539510 537959 536272
59569 536272 534256 532217 530745 530260 530662 531266 531201 530098 528366 526771 525855 525805 526523 527522 527970 527345 526086
59552 526086 525258 525513 526598 527792 528500 528484 528006 527913 529175 532064 536067 540688 546051 552559 560429 569929
59536 569929 581799 596893 615244 635533 655355 672010 683429 688830 688711 684357 677552 670519 665374
59523 665374 663130 663370 665089 667553 670192 672244 673092 672722 671322 668646 664261 658302 651403 643907 635636
59508 635636 626470 616696 606741 597042 588248 581042 575481 570826 566242 561511 557007 553289 550782 549513
59494 549513 549016 548707 548454 548584 549340 550635 552302 554210 556099 557819 559820 562855 566939 571101 574507
59479 574507 577378 580394 583687 586955 590213 593735 597399 600713 603519 606203 609147 612387 615804 619209
59465 619209 622127 623971 624616 624557 624414 624519 625056 626295 628539 632003 636781 642730 649403 656426 663882 672004
59449 672004 680474 688477 695516 701656 706773 710126 711042 709656 706539 701904 695631 687851 679048 669727
59435 669727 660410 651821 644615 638950 634622 631549 629742 628889 628464 628337 628987 631125 635362 642138 651515
59420 651515 663008 676025 690466 706506 723890 742099 761297 782355 805526 829709 853501
59409 853501 876445 898452 918114 932367 938170 934536 923224 907850 892293 879384 870617 866750
59397 866750 868303 875185 885875 897217 905215 906511 899862 886691 870041 852608 835644 819508
59385 819508 804691 791925 781680 774026 768774 765360 762852 760574 758661 757562 757159 756825 756312 755996
59371 755996 756229 756900 757696 758369 758642 758306 757673 757621 758930 761649 765176 768842 772442 776382 781327 787580
59355 787580 794896 803004 812027 822134 833159 845069 858511 874222 891973 910752 929951 949670
59343 949670 969819 989688 1008644 1026534 1043069 1057450 1069001 1077597 1083054 1084711 1082167 1075988
59331 1075988 1067148 1056142 1043078 1028180 1011595 993108 972724 951372 930429 910666 892110
59320 892110 874654 858246 842707 828052 814841 803545 793665 784204 774974 766629 759349 752375 745139
59307 745139 738015 731456 725105 718497 712096 706826 702764 699092 695349 692076 690067 689571 690503 692992 697373
59292 697373 703916 712907 724691 739159 755110 770393 782683 790058 791265 786169 776210 763947 751701
59279 751701 740727 731693 725430 722729 723708 727964 735256 745575 758558 773366 789223 805685 822371
59266 822371 838878 854990 870487 884561 895975 904018 908873 910813 909573 904959 897641 888762 879019
59253 879019 868635 858069 848225 839917 833449 828732 825479 823237 821484 819831 818227 817087 817156 818902
59239 818902 821976 825644 829834 835177 841681 847990 852584 855350 857304 858977 859757 858710 855377 849748
59225 849748 842124 833156 823485 813151 801719 789054 775636 762084 748877 736546 725524 715605
59213 715605 706084 696721 688152 681010 675079 669754 664999 661362 659144 657991 657298 656697 656136 655780 655997
59198 655997 657215 659601 662832 666317 669736 673366 677746 683003 688662 694245 699882 706098 713114 720560
59184 720560 727871 734727 741151 747404 753724 759883 765036 768339 769809 770314 770646 770871 770637 769807 768621
59169 768621 767502 766951 767376 768752 770462 771784 772575 773350 774539 775747 775858 773953 770028 764691 758251
59154 758251 750436 741057 730571 719749 709055 698649 688684 679142 669576 659552 649356 639797 631340
59141 631340 623855 617209 611459 606355 601291 596116 591508 588140 585865 584171 583058 582851 583383 584044 584690
59126 584690 585947 588444 592165 596786 602279 608849 616515 625070 634395 644516 655388 666814 678566
59113 678566 690365 701776 712399 722223 731534 740331 748129 754529 759730 764110 767499 769283 769225 767804
59099 767804 765686 763227 760521 757495 753829 749153 743612 737954 732932 728908 726096 724672 724310 724070 723194
59084 723194 721750 720118 718222 715673 712378 708459 703803 698215 691858 685121 678191 671174 664395 658060
59070 658060 651856 645495 639440 634380 630143 625925 621622 618032 615522 613290 610391 606837 603231 599826
59056 599826 596521 593425 590880 589017 587636 586511 585593 584973 584746 584851 584991 584867 584401 583583 582325 580789
59040 580789 579681 579647 580451 581250 581633 581840 582038 582147 582529 584056 587218 591774 597542 604799 613595 623465
59024 623465 634332 647036 662282 679621 697994 716654 734829 751088 764013 773275 779254 781859
59012 781859 780620 775796 768516 759789 750135 740211 730969 722963 716152 710587 706711 704710 704189 704807 706742
58997 706742 710229 715011 720574 726510 732340 737359 741111 743768 745704 746947 747420 747503 747804 748335 748447 747719
58981 747719 746639 746161 746838 748665 751642 756138 762581 771003 781095 792633 805669 820247 836090
58968 836090 852612 869182 885382 901166 916734 932125 946887 960312 972032 982155 990699 997204
58956 997204 1001101 1002167 1000203 994480 984199 969687 952624 934633 915901 895740 874383 853560
58944 853560 835029 818990 804431 790702 778144 767256 758015 750339 744618 741233 739789 739400 739645
58931 739645 740817 743207 746537 750178 753618 756647 759279 761474 762789 762485 760282 756839 753047 748976
58917 748976 744113 738662 733863 730686 728730 726919 724918 723416 723177 724326 726544 729611 733635 738901
58903 738901 745607 753765 763373 774611 787662 802327 818017 834179 850519 866847 883030 899237
58891 899237 915970 933657 952415 972245 993181 1015031 1037244 1059222 1080587 1100943 1119587
58880 1119587 1135688 1148629 1158041 1163691 1165564 1163929 1159139 1151385 1140813 1127873 1113457 1098635
58868 1098635 1084221 1070569 1057825 1046293 1036292 1027565 1019194 1010406 1001246 992134 983112 973971 964842
58855 964842 956027 947399 938648 930028 922186 915221 908621 902160 896045 890012 883076 874549 864639 853729
58841 853729 841701 828376 813992 798859 783171 767560 753159 740569 729290 718670 708832 700118
58829 700118 692266 684976 678839 674898 673409 673694 675064 677349 680613 684841 689842 695173 700290 705021
58815 705021 709618 714196 718576 722880 727574 732455 736284 738093 738347 738084 737426 735785 733093 729861 726205
58800 726205 721764 716601 711327 706213 700775 694394 686892 678548 670003 662080 655227 649158 643437 638247
58786 638247 634252 631947 631560 633199 636564 640861 645671 651560 659151 667922 676653 684715 692051 698207
58772 698207 702414 704559 705040 703615 699396 692153 682818 672532 662059 652266 644130 637856 632757 628407
58758 628407 625205 623451 622626 622147 622227 623365 625386 627480 628949 629519 629215 628288 627100 625861 624704 624150
58742 624150 625245 628970 635598 644555 654605 664308 672774 680108 686834 692969 698108 702341 706412 710862
58728 710862 715559 720189 724619 728546 731446 733245 734645 736438 738788 741433 744244 747338 750956 755440
58714 755440 760974 767120 772938 777828 781974 785701 788673 789992 788935 785375 779593 771898 762373 750929
58700 750929 737579 722606 706412 689389 672053 654970 638237 621401 604365 588149 574143
58689 574143 562700 553058 544550 537270 531449 526803 522747 518833 514832 510761 506906 503519 500492 497650
58675 497650 495236 493602 492537 491480 490446 490239 491756 495541 501920 510822 521402 532511 543780 555667
58661 555667 568307 580864 592177 601361 607537 609685 607363 601280 592844 583317 573482 563707 554041
58648 554041 544506 535489 527624 521246 516172 511915 507863 503475 498835 494916 492739 492300 492861 494175 496664
58633 496664 500351 504357 507772 510479 512875 515167 517062 517849 516877 514384 511675 509839 508523 506721 504627
58618 504627 503722 504931 507736 511361 515859 521512 527928 534397 540692 547030 553497 559763 565222 569374
58604 569374 572383 575129 578258 581413 583874 585584 586756 586878 585233 582251 579226 576692 574251 572015
58590 572015 570977 571748 574185 578499 585377 594599 604856 615512 627278 640547 654330 667529 680059
58577 680059 691908 702313 710856 718307 725365 731568 736500 741195 747243 755322 765696 779330 797190
58564 797190 818918 843368 870045 899015 929848 961738 994232 1026694 1057252 1083300 1103072
58553 1103072 1116072 1122324 1122140 1116638 1107812 1097910 1088868 1081781 1076410 1071622 1066745 1061991 1057169 1050844
58539 1050844 1041423 1028348 1011437 989980 963651 933854 903049 873012 844573 818522 795622
58528 795622 775894 758811 744093 731617 720839 711189 702798 696052 690669 685956 681687 677935 674344
58515 674344 670417 666332 662703 659723 657256 655449 654424 653584 652081 649863 647512 645271 642988 640863
58501 640863 639388 638605 638109 637750 637653 637614 637169 636267 635324 634687 634513 635081 636688 639350 642976 647707 653728
58484 653728 661046 669838 680668 693921 709378 726771 746361 768390 792296 816873 840821 862779
58472 862779 881315 895355 904218 907051 903123 893190 879709 864985 849860 834810 821315 811019
58460 811019 804265 800485 799497 801451 806158 813549 824245 838589 855523 873352 891085 907957 922304
58447 922304 932193 936900 936627 931180 920294 905082 887763 869800 851329 832530 814594 799117
58435 799117 787109 778641 772953 769025 766535 766023 767772 771086 775226 780493 787644 796769 807402 819124
58421 819124 831279 842601 851818 858115 860661 858671 852654 844505 835478 825122 813128 800871 789796
58408 789796 779473 768776 757972 748013 738780 729814 722049 716924 714311 712997 712626 713474 714973 716318
58394 716318 718003 720933 724463 727235 729476 732466 736072 738878 740570 742147 743829 744870 745520 747170
58380 747170 750288 753987 757809 762191 767003 771407 775433 780067 785580 791398 797736 805654 815239 825389
58366 825389 835667 846779 859019 871819 885082 899412 914716 929993 944711 959019 972591
58355 972591 984650 995037 1003743 1009639 1011466 1010122 1008126 1006730 1005217 1003067 1000922 999288 998103 997885
58341 997885 999621 1003295 1008033 1013750 1021099 1029973 1039794 1051114 1065036 1081223 1098388 1116437 1135999
58328 1135999 1156021 1174222 1189918 1204024 1216271 1224924 1229521 1231438 1231479 1229391 1226058 1223641 1222952
58315 1222952 1223050 1223879 1226795 1231998 1237964 1244105 1251563 1260746 1270501 1280420 1291539 1304031 1316536 1328563
58301 1328563 1341285 1355313 1369968 1385264 1402223 1420651 1438980 1456808 1475121 1493692 1510985
58290 1510985 1527118 1544019 1562110 1579752 1596615 1614508 1634163 1654340 1675006 1698272 1725116
58279 1725116 1754262 1785186 1819041 1855642 1892834 1929945 1968417 2007781 2044461 2076049 2103484
58268 2103484 2127791 2148348 2166049 2184690 2207286 2233935 2264714 2301257 2343938 2390802 2440747
58257 2440747 2494395 2550634 2606121 2659641 2713116 2767034 2819254 2869931 2923042 2980965 3041945
58246 3041945 3104981 3172575 3246319 3324399 3406032 3493824 3589142 3689674 3794187 3905113 4023890
58235 4023890 4148579 4278680 4417301 4565848 4721825 4884700 5058548 5245949 5445021
58226 5445021 5655584 5882299 6128360 6392277 6674401 6980171 7313325 7672661 8059338
58217 8059338 8480195 8939892 9437467 9975062 10562103 11206564 11911095 12682954 13538691
58208 13538691 14493824 15558173 16747743 18091419 19620944 21367482 23376903 25718427
58200 25718427 28474624 31742591 35661383 40433368 46319463 53634577 62752265 74084516
58192 74084516 88039466 105013052 125405436 149566616 177659431 209548825 244690650
58185 244690650 281779264 318156282 349604266 371243881 379350372 372903201 353804690
58178 353804690 325832472 293239839 259755737 228118745 199981888 176052570 156331917
58171 156331917 140303732 127068008 115557276 104863904 94491697 84363962 74648901
58164 74648901 65580275 57355001 50083726 43777422 38374378 33781215 29892306 26594645
58156 26594645 23782348 21371906 19298173 17502965 15937286 14567827 13369869 12316724
58148 12316724 11382832 10551149 9808950 9140767 8532506 7977614 7472024 7007512 6576522
58139 6576522 6178753 5816142 5485462 5181882 4905316 4656633 4431390 4223589 4032198
58130 4032198 3858003 3697157 3543591 3395079 3251877 3112387 2975495 2844425 2723115
58121 2723115 2610869 2504868 2405305 2313614 2228299 2147161 2071376 2002981 1940440 1880793 1824060
58110 1824060 1771468 1721400 1671122 1620585 1570728 1519869 1465583 1408434 1350418 1291449 1230918
58099 1230918 1170992 1114993 1064034 1018211 979180 948215 923403 902011 884003 870251 859200
58088 859200 848656 839194 832464 827578 822397 816926 812181 807015 799344 789465 779126 768338 756000
58075 756000 742614 729476 716180 701707 687086 674231 662981 651800 640515 629937 619730
58064 619730 609221 599386 591623 585374 579209 573258 568223 563067 556190 548036 540186 532676 524517 516038
58050 516038 508396 501553 494929 489221 485355 482421 478774 474396 470191 465906 460889 455939 452149 448765
58036 448765 444324 439065 434095 429132 423319 417397 412700 408739 403994 398404 392884 387169 380420 373297
58022 373297 367113 361573 355571 349538 344736 340864 336755 332868 330621 329596 327838 324759 321506 318601
58008 318601 315430 312014 309228 307279 305746 304906 305189 305694 305195 304279 304484 305637 306145 305752 305887 307285
57992 307285 309187 310913 312343 312835 311462 308472 305018 301642 298532 296769 297356 299233 300173 299531 298278
57977 298278 296584 293523 289249 285441 283166 281957 281230 281094 281549 282310 283512 285321 287070 288138 289258
57962 289258 291360 293520 293929 292596 291161 290261 289071 287381 285983 284821 282794 279722 276660 273908 270539
57947 270539 266330 262433 259704 257906 256940 257259 258702 260482 262765 266752 272858 280237 288456 298116 309321
57932 309321 320928 331750 341320 349293 355344 359835 363211 364667 362817 357797 351194 343838 335277 325535
57918 325535 315576 305727 295504 285427 277185 271299 266333 261188 256558 253309 251011 249119 248226 249019
57904 249019 251041 253439 255953 258374 259951 260190 259453 258186 256405 254517 253703 254775 257384 260862 265083
57889 265083 270015 275229 280402 285624 290794 295415 299317 302862 306167 308836 310682 311922 312488 311891 309973
57874 309973 307034 303195 298437 293273 288474 284184 280192 276854 274605 272773 270293 267597 266317 267014
57860 267014 268610 270267 272337 275142 278314 281792 286050 290901 295411 299494 304191 309851 315424 320068
57846 320068 324055 327539 329897 331047 331949 332969 333114 331847 330315 329691 329466 328536 327008 325704 324702
57831 324702 323516 322212 321304 320910 320707 320365 319575 318118 316300 314678 313126 310924 307999 305113 302550
57816 302550 299705 296359 293180 290434 287348 283401 279151 275136 271093 266966 263473 260758 257535 252564
57802 252564 246094 239007 231508 223649 216255 210191 205376 201399 198426 196581 195173 193575 192314 192323 193557
57787 193557 195242 197050 199271 202174 205849 210345 215405 220542 225751 231605 238293 245304 252358 259710
57773 259710 267018 273059 277312 280843 284771 288719 291692 293467 294147 293247 290511 286989 284092 281989 279989
57758 279989 277956 276180 274249 271374 267852 265133 264191 264473 264618 263854 262692 262411 263656 265449 266107 265181
57742 265181 263767 262732 261662 259991 258071 256422 254843 253119 251723 250975 250322 249426 249167 250495 252854
57727 252854 254827 255887 256564 257368 258490 260120 262089 263567 264023 264172 265109 266821 268372 269217 269537 269621
57711 269621 269673 269913 270107 269408 267360 264692 262391 260462 258305 255789 253092 249970 246059 241544 236758
57696 236758 231577 226091 221355 218488 217274 216496 215235 213084 209672 205170 200952 198545 197905 197654 196943
57681 196943 196283 196683 198854 203200 209736 218036 228004 240858 258932 284447 318670 361755 412950
57668 412950 471472 537653 612405 694479 778350 855171 915378 950470 954555 926863 873039 802667
57656 802667 725001 647022 573974 509450 454545 408319 369570 337527 311178 289272 271218
57645 271218 256958 245783 236297 227757 220527 214979 210746 207301 204493 202232 200318 198774 197787 197177
57631 197177 196432 195334 194005 192452 190588 188601 186668 184463 181627 178597 176233 174678 173264 171426
57617 171426 169021 165948 162296 158781 156167 154245 152176 149798 147781 146440 145269 143823 142307 141141
57603 141141 140499 140398 140623 140539 139581 137989 136476 135182 133547 131207 128399 125469 122568 119821 117274 114710
57587 114710 111964 109260 106768 104189 101368 98938 97558 96804 95685 93996 92265 90581 88480 85873
57573 85873 83121 80236 76977 73743 71344 69789 68158 65808 62913 59815 56715 54086 52491 51856 51660
57558 51660 51857 52779 54135 55056 55224 55055 54689 53818 52744 52644 54370 57669 61745 65805 68898 70125
57542 70125 69448 67751 65900 64260 63082 62549 62358 61949 61260 60645 60167 59741 59733 60415 60990 60347 58802 57851
57524 57851 58098 58662 58829 58969 59413 59751 59846 60356 61564 62759 63489 64416 66190 68320 69931 70870 71404 71588
57506 71588 71627 72126 73227 74150 74245 73909 73784 73689 73030 71774 70303 68752 67081 65397 63711 61750 59430
57489 59430 57090 54947 52878 50984 49611 48426 46314 42809 38924 35952 34137 33123 32932 33656 34747
57474 34747 35485 35774 35747 35002 33004 29987 26798 24068 22038 20800 20112 19258 17732 15824 14136 12794
57458 12794 11580 10456 9497 8629 7904 7657 7917 8090 7667 6874 6169 5544 4854 4384 4421 4611 4374 3760 3316
57439 3316 3323 3625 3984 4181 4010 3600 3465 3894 4668 5677 7240 9318 10965 11289 10549 9618 8721 7458
57421 7458 5808 4259 3002 1725 261 -1127 -2164 -2795 -3086 -3240 -3617 -4344 -4980 -4973 -4311 -3360 -2355 -1496
57403 -1496 -1296 -2216 -4020 -6005 -7839 -9660 -11404 -12634 -13116 -13135 -12990 -12541 -11490 -9928 -8386 -7353
57387 -7353 -6801 -6217 -5103 -3308 -829 2424 6295 10016 12833 14990 17404 20186 22179 22348 20986 19047
57371 19047 16882 14282 11372 8684 6503 4736 3305 2116 754 -1213 -3623 -5798 -7379 -8700 -10305
57356 -10305 -12254 -13927 -14412 -13296 -11247 -9642 -9352 -10098 -11104 -12045 -13020 -13909 -14332 -14184 -13852 -13822 -14254
57339 -14254 -14899 -15297 -15185 -14831 -14862 -15640 -16977 -18516 -20118 -21739 -23228 -24471 -25516 -26362 -26824 -26794 -26502
57322 -26502 -26370 -26789 -28016 -29969 -32018 -33353 -33759 -33759 -33869 -33993 -33699 -32797 -31486 -30216 -29482 -29460 -29756 -29796
57304 -29796 -29545 -29501 -29957 -30628 -31017 -30785 -29820 -28414 -27289 -26853 -26496 -25265 -23232 -21373 -20030 -18417 -15933
57287 -15933 -13066 -10529 -8294 -6059 -4012 -2482 -1318 -105 1351 3023 4745 6001 6242 5686 5216
57272 5216 5163 4918 4126 3409 3337 3423 2866 1728 716 278 530 1545 3078 4433 5240 6019 7438 9452
57254 9452 11675 14146 17163 20731 24643 28689 32391 35146 37078 39153 41906 44762 47175 49649 52826
57239 52826 56263 59094 61353 63682 66127 68264 70238 72679 75660 78615 81254 83841 86581 89358
57225 89358 92111 94975 98116 101768 106184 111185 116040 120226 123984 127780 131645 135529 139737 144486
57211 144486 149478 154545 160212 166958 174345 181598 188732 196396 204911 214087 223709 233594 243482 253409
57197 253409 263842 274920 285940 296159 305734 315319 325160 335100 344989 354597 363582 372070 380681
57184 380681 389448 397357 403589 408584 413275 418067 423275 429664 437522 445874 453651 461058 468836 476771
57170 476771 484085 490845 497919 505937 515258 526551 540373 556464 574291 593837 615088 637353
57158 637353 660127 684039 709950 737649 766512 796732 828632 861319 893402 924692 955908
57147 955908 987119 1017766 1047906 1078007 1107662 1135881 1162614 1188900 1215573 1242861 1271032
57136 1271032 1300261 1329990 1359426 1388568 1417885 1447426 1477238 1508156 1541021 1575555 1611245
57125 1611245 1648887 1689973 1734856 1782793 1833432 1887033 1943630 2003270 2066744 2134894 2207506
57114 2207506 2284098 2365304 2452319 2545576 2645286 2752762 2870058 2999165 3142990 3306416
57104 3306416 3495042 3713824 3968642 4268601 4625995 5056123 5579827 6225822 7029618
57095 7029618 8032475 9283711 10841618 12767831 15119249 17942758 21269212 25104261
57087 25104261 29425257 34190209 39346413 44826052 50538210 56367598 62160327 67677569
57079 67677569 72558392 76371583 78767732 79627428 79084777 77416671 74897860 71719505
57071 71719505 67990210 63782250 59181559 54315065 49344731 44438223 39740111 35358739
57063 35358739 31364845 27793377 24647991 21909717 19545954 17516052 15775185 14278691
57055 14278691 12985377 11858780 10868256 9990338 9208218 8509319 7883726 7323839 6822964
57046 6822964 6373287 5966269 5595138 5255604 4944162 4657355 4392930 4150091 3927947
57037 3927947 3724808 3539187 3370185 3216532 3076369 2948195 2831011 2723527 2624530 2534113
57027 2534113 2453241 2381901 2318957 2264072 2218588 2184171 2161651 2151472 2154217 2170051 2197810
57016 2197810 2233848 2270456 2295807 2297596 2268313 2207530 2120247 2014412 1899232 1783197 1672025
57005 1672025 1568564 1474336 1390183 1315675 1249450 1190625 1139047 1094271 1055485 1022513 995713
56994 995713 974732 958420 946078 937694 932932 931107 932179 936484 943300 951005 958938 967864 978179
56981 978179 988732 997745 1003729 1005242 1001043 991225 977325 960910 942806 923855 905327 888186
56969 888186 872885 860119 850631 843934 838494 833793 831172 832010 836113 842591 851335 862677 876310
56956 876310 891306 906648 920815 931209 934837 929741 915784 894483 868417 840358 812471 786137
56944 786137 762224 741151 722894 707519 695518 687180 682019 679616 680662 686205 696158 709723 727137
56931 727137 749561 776902 806759 835608 859893 875970 880707 873239 855382 829839 798828 764694
56919 764694 730469 698645 670003 644305 621566 602017 585448 571303 559106 548371 538509 529198
56907 529198 520440 512053 503660 495424 488159 482412 477974 474478 471844 470006 468899 468966 470897 474645 479473
56892 479473 485257 492899 503147 515880 530921 548605 568977 591226 614428 637917 660168 678071
56880 678071 688408 689980 683921 672466 657961 642481 627480 613720 601815 592650 587068 585455
56868 585455 587886 594414 605103 620273 640897 668373 703602 746541 796597 852756 912994 973672
56856 973672 1029418 1073468 1099092 1102328 1084086 1049215 1003589 952511 900981 853427 812299 777951
56844 777951 750458 730833 720300 719533 729156 750012 782410 826052 881184 948785 1028944 1119804
56832 1119804 1218268 1319955 1417124 1497792 1549123 1562749 1537617 1479374 1398068 1305103 1209977
56821 1209977 1118698 1034897 961468 900398 851825 814633 788011 771942 766561 771921 788306 816137
56809 816137 855588 906555 968481 1039353 1114647 1187297 1248520 1289162 1301991 1284465 1239822
56798 1239822 1175331 1099442 1019943 943066 872769 810735 757481 713313 678184 651381 632033
56787 632033 619633 613860 614478 621762 636322 658134 686289 719737 757002 794425 825857 845369
56775 845369 850051 839798 815609 779433 734936 686773 638793 593436 552262 515928 483913 455343
56763 455343 430149 408710 390674 375034 361255 349450 339562 331228 324435 319419 315756 312341 308479
56750 308479 304441 300801 297730 295113 292955 291436 290699 290609 290634 290107 288734 286688 284257 281835 280214 280113
56734 280113 281086 281667 281092 280254 280390 281456 282490 282992 283140 283146 283255 284064 285986 288537 290790 292302 293015
56717 293015 292704 291304 289613 288794 289236 290429 291779 292961 293680 293794 293636 293697 294121 294888 296174 297952 299526
56700 299526 300158 299998 299807 299895 299914 299618 299251 299150 299367 299682 299753 299411 298914 298623 298354 297626 296632 296195 296490 296733
56680 296733 296684 297416 299723 302693 304901 306293 307683 308994 309344 308569 307400 306258 305031 303929 303422 303301
56664 303301 302842 301967 301325 301166 301092 301009 301415 302548 304003 305365 306522 307269 307369 307194 307595 308936 310763
56647 310763 312471 313720 314182 313497 311666 309072 306113 303187 300810 299202 297928 296516 295225 294578 294371
56632 294371 293862 292774 291429 290026 288550 287243 286384 285680 284579 283083 281589 280076 278329 276768 276194
56617 276194 276660 277364 277577 276975 275277 272584 269993 268794 268935 269213 269037 268948 269246 269284 268634 267982 268177 269038
56599 269038 269685 269619 269061 268622 268941 270252 272024 273315 273614 273116 272237 271360 270879 270933 271109 270966 270750 270999
56581 270999 271591 271963 272173 272881 274196 275402 276003 276199 276197 275882 275501 275870 277458 279873 282610 285755 289657
56564 289657 294400 299988 306616 314475 323623 334143 346093 359113 372396 384898 395184 401427 402459
56551 402459 398991 393123 386548 379832 373341 367819 363585 359879 355596 350393 344803 339557 335004 330943
56537 330943 327007 323333 320533 318650 316648 313729 310788 309565 310485 312298 313807 314818 315344 315086 314202
56522 314202 313614 313984 315038 316235 317352 318117 318062 317193 316147 315263 314062 312082 309656 307492 305982 305197
56506 305197 304984 304764 303781 301908 299763 297823 295932 293900 291978 290435 289136 287862 286612 285441 284414
56491 284414 283837 284051 284901 285846 286566 286941 286681 285801 285372 286755 289845 292971 294787 295413 295546 295446 295207
56474 295207 295090 295008 294430 293302 292373 292128 292106 291829 291740 292561 294133 295478 295743 294741 292903 291010 289718
56457 289718 289147 289091 289502 290308 291037 291306 291506 292176 292874 292686 291844 291694 292910 294843 296863 299076 301288
56440 301288 302538 302395 301751 301578 301623 300995 299340 296975 294549 292971 292857 293581 293719 292813 291856 291652 291772
56423 291772 291675 291716 292248 292716 292546 292118 292048 292282 292678 293638 295304 296901 297810 298610 300144 302179 303940 305358
56405 305358 306836 308248 309115 309406 309359 308972 308414 308442 309494 310789 311180 310583 309788 309231 308793 308502 308580 308900
56387 308900 309060 308943 308729 308592 308787 309668 311198 312763 313869 314614 315192 315516 315716 316392 317885 319908 322278
56370 322278 325188 328286 330355 330783 330554 330935 331921 332840 333799 335415 337593 339652 341372 342971 344298 344987
56354 344987 345270 345881 347183 348931 350661 351904 352370 352376 352682 353472 354064 354023 353891 354225 354695 354889 355295 356644
56336 356644 358881 361562 364709 368437 372377 376296 380638 385590 390273 393836 396732 399904 403353 406575
56322 406575 409778 413358 416591 418225 418189 417573 417054 416442 415629 414852 414013 412828 411716 411655 413039 415359 417968
56305 417968 420531 422892 425189 427953 431495 435450 439494 444048 449523 455376 460819 465968 471335 476634
56291 476634 481230 485477 490421 496370 502863 509894 517995 527071 536284 545313 554732 564942 575573 586209
56277 586209 597067 608704 621452 635229 649527 663803 678237 693830 711268 730133 749788
56266 749788 770518 793076 817705 844490 874225 907888 945581 987026 1032883 1084616 1143240
56255 1143240 1209171 1283203 1366705 1460889 1566600 1684661 1815681 1959748 2116974 2287928
56245 2287928 2472625 2669366 2875339 3087891 3304194 3520130 3730655 3931054 4116747
56236 4116747 4282209 4421501 4530090 4605316 4645360 4649077 4617083 4552030 4457496 4337221 4195362
56225 4195362 4036550 3865339 3685891 3502023 3317009 3133550 2954288 2781810 2617600
56216 2617600 2461660 2313887 2175093 2045874 1925417 1812642 1707733 1611147 1521861 1438261
56206 1438261 1360393 1289665 1226450 1169549 1117893 1071209 1028921 989932 953814 921000 891610
56195 891610 865198 841720 821516 804185 788578 774075 760830 748690 736970 725460 714684
56184 714684 705038 696449 688896 682370 676446 670740 665562 661227 657132 652594 648217 645231 643734 642812
56170 642812 642106 641949 642280 642833 644191 647220 651535 655854 659775 663929 668666 674015 680699 689555 699998
56155 699998 710592 721170 732868 746188 760617 776243 794121 814860 838389 865279 896895
56144 896895 934147 977507 1028298 1088322 1158098 1236948 1324880 1422629 1529514 1642625 1758252
56133 1758252 1872485 1980402 2076816 2158925 2227397 2284725 2333709 2377263 2417603 2454657 2486175
56122 2486175 2509616 2523132 2525283 2515705 2496266 2469993 2438529 2401623 2358417 2307272 2244729 2167209
56110 2167209 2074559 1970561 1860069 1747444 1637445 1534897 1442451 1360303 1288519 1227869
56100 1227869 1178055 1137047 1102808 1074225 1050214 1029729 1012865 1000188 990829 983040 976587 972503
56088 972503 970490 968890 967395 967418 969463 972486 976167 981368 987918 994471 1001024 1009083 1018799 1028529 1037826
56073 1037826 1048162 1059937 1071476 1081960 1092768 1104955 1117906 1131466 1146745 1163692 1180354
56062 1180354 1195637 1210504 1225554 1239943 1253654 1268143 1283592 1298134 1310915 1323321 1336072
56051 1336072 1347870 1358117 1368280 1379306 1390433 1401702 1414802 1430173 1446198 1462603 1481636
56040 1481636 1504433 1529276 1554962 1582762 1613346 1644918 1676200 1708207 1741212 1772952 1801719
56029 1801719 1828284 1853060 1874556 1892509 1909339 1926676 1943726 1960940 1981627 2007805 2037973
56018 2037973 2071244 2109866 2155128 2204466 2255434 2309061 2366604 2426569 2487814 2552072 2620497
56007 2620497 2691148 2762719 2837177 2915932 2997177 3079948 3166985 3260459 3358732 3460351 3567189
55996 3567189 3680594 3798802 3921541 4052766 4195219 4346745 4505525 4674277 4855631
55987 4855631 5048292 5251725 5469596 5704581 5955158 6221708 6510106 6824905 7165008
55978 7165008 7530707 7928478 8363777 8836051 9346520 9903830 10516267 11186264 11919197
55969 11919197 12729699 13632722 14637572 15758796 17024353 18465923 20112797 22006137
55961 22006137 24210476 26804642 29878893 33560068 38036611 43557036 50424532 59004140
55953 59004140 69709877 82962450 99172260 118758415 142113791 169477761 200817690
55946 200817690 235734324 273160507 310754007 344501437 369342820 380902257 377286411
55939 377286411 359705801 331661741 297497992 261221195 225896497 193478786 164914558
55932 164914558 140411767 119743110 102466733 88061270 76023829 65929736 57434887
55925 57434887 50252715 44149155 38945634 34502408 30696679 27422398 24598724 22161872
55917 22161872 20051034 18210812 16600250 15187944 13942089 12833731 11844542 10961940
55909 10961940 10170091 9453198 8803197 8216055 7683666 7196312 6749605 6342185 5969525
55900 5969525 5626192 5311065 5024194 4761245 4516635 4289423 4080725 3888037 3707384
55891 3707384 3538519 3382838 3238392 3101812 2973045 2853639 2742461 2637470 2539583 2450549
55881 2450549 2369014 2292686 2222305 2159575 2103318 2051599 2005506 1966597 1932410 1898390 1862497
55870 1862497 1824164 1780721 1729156 1670287 1607446 1542203 1474767 1407115 1341837 1278720 1215912
55859 1215912 1153785 1094773 1040435 991633 950520 919154 896654 880289 868536 860722 854946 849078
55847 849078 842874 836651 828983 818213 805112 791556 777685 762731 747434 733016 718929 704162
55835 704162 689643 676780 664745 651905 638926 627819 618834 610896 604137 599248 595169 590153 584496
55822 584496 579609 575022 569014 561643 554478 547698 540090 531699 524010 517605 511920 507180 504354 503311
55808 503311 503041 503593 505796 509346 513170 517430 523189 530283 537502 544662 552507 560696 567737 572860 576143
55793 576143 577008 574410 568395 559828 548851 535371 520776 507285 495704 485526 477006 471246 468197
55780 468197 466269 463960 460429 454826 446823 437735 429454 422331 415623 409718 406092 405171 406038 408244 412090
55765 412090 416846 420386 421058 418746 414055 407676 400584 393552 386453 379043 372034 366103 360384 353529
55751 353529 345867 338768 332155 324592 315813 307262 299936 293448 287506 282595 278743 275134 271392 268001
55737 268001 265175 262620 260631 260021 260618 261180 261128 261176 261913 262977 263929 264742 265137 264517 262852 260647 257899
55720 257899 254191 249870 245960 242735 239537 236174 233376 231721 231212 231995 234281 237424 240268 242617 245214
55705 245214 248191 250755 252564 254054 255200 255252 254038 252234 249956 246392 241340 235920 231219 227228 223629
55690 223629 220620 218489 217258 217179 218689 221504 224578 227276 229814 232435 235157 238442 242938 248259 253147
55675 253147 257160 260985 264678 266901 266665 264758 262687 261031 259540 258069 256612 255006 253290 251973
55661 251973 251521 251935 253031 254668 256556 258433 260527 263188 266086 268555 270685 273106 275554 276757 275964
55646 275964 273571 270012 265174 259248 253028 246814 240039 232531 225163 218718 213040 207850 203432 199934
55632 199934 196976 194595 193531 193738 193602 191664 188449 185629 184004 183258 183095 183435 183719 183112 181514 179723
55616 179723 178508 177897 177296 175932 173377 170007 166786 164384 162713 161453 160600 160202 160030 159846 159637 159284
55600 159284 158408 156898 155221 153880 152834 151730 150398 148932 147565 146598 146127 145775 145157 144591 144743 145499
55584 145499 145926 145579 145126 145267 145711 145751 145359 145159 145583 146511 147518 148266 148800 149513 150578 151580 152247 153319
55566 153319 155835 159553 163064 165679 168090 170706 172424 171904 169338 166070 162993 160199 157786 156054
55552 156054 154989 154304 154030 154492 155650 156907 157720 158213 159094 160970 163669 166278 168053 169147 170197 171420
55536 171420 172626 173941 175722 177726 179102 179414 179000 178164 176720 174590 172105 169463 166590 163825 161931
55521 161931 160963 159916 158008 155594 153268 150792 147648 144080 140866 138383 136521 135150 134170 133426 133009
55506 133009 133219 133859 134121 133613 132890 132433 131778 130379 128755 127896 127872 127911 127613 127333 127490 128180 129315 130502
55488 130502 130979 130316 129047 128021 127272 126213 124790 123732 123624 124378 125682 127337 129033 130320 131067 131507
55472 131507 131657 131060 129397 127118 125223 124376 124341 124265 123595 122673 122326 122826 123546 123719 123264 122705 122538 122898
55454 122898 123591 124172 124194 123652 123068 122952 123288 123716 124040 124381 124949 125775 126536 126646 125730 124072 122396 121258
55436 121258 120877 121333 122438 123512 123941 124024 124617 125827 126788 126923 126680 126661 126763 126667 126531 126628 126831 127019 127505
55417 127505 128489 129470 129794 129449 128820 128051 127132 126222 125370 124280 122868 121636 120947 120402 119576 118911 119095 119856
55399 119856 120288 120257 120594 121793 123231 123892 123377 122006 120360 118922 117913 117320 117114 117373 118139 119399 121261
55382 121261 123716 126079 127260 126989 126253 126048 126195 126041 125794 126251 127484 128706 129430 129939 130509 130937 131041
55365 131041 131017 131019 130827 130182 129156 128019 126996 126210 125630 125095 124648 124708 125565 126746 127354 127078 126493 126285 126543
55346 126543 126916 127142 127178 126980 126431 125520 124567 124126 124461 125119 125229 124352 122880 121551 120784 120515 120381 119963
55328 119963 119183 118550 118644 119279 119619 119248 118624 118324 118429 118942 120107 121845 123401 124103 124038 123570 122761 121839
55310 121839 121618 122706 124595 126246 127203 127529 127136 126058 125050 124934 125417 125355 124253 122825 122021 122090 122619
55293 122619 123022 123002 122910 123435 124583 125335 124897 123816 123079 122562 121363 119451 117871 117278 117350 117822 119032 121032
55275 121032 123027 124206 124583 124640 124682 124849 125247 125698 125796 125488 125210 125272 125488 125614 125694 125789 125823 125903 126337 127052 127399
55254 127399 126831 125558 124291 123586 123602 124257 125354 126619 127734 128375 128410 128173 128273 128838 129241 128895 128022 127182
55236 127182 126397 125391 124438 124203 124745 125396 125657 125669 125807 126387 127700 129649 131351 131848 131265 130542 129975 128918
55218 128918 127138 125602 125410 126533 128010 128943 128989 128359 127645 127306 127177 126824 126385 126442 127041 127583 127831 128177
55200 128177 128688 128753 128148 127610 127724 127990 127710 127227 127470 128610 129947 130941 131627 132122 132280 131884 130826 129224
55182 129224 127645 126965 127593 128920 129898 130071 129773 129528 129621 130112 130873 131593 132039 132320 132756 133505 134423 135171
55164 135171 135436 135188 134774 134543 134374 133877 133066 132488 132581 133283 134383 135809 137391 138758 139763 140668 141584
55147 141584 142067 141612 140372 139132 138671 139231 140322 140955 140399 138866 137221 135982 135024 134274 134021 134283 134416
55130 134416 133873 132950 132360 132380 132779 133305 133792 134006 133757 133091 132208 131397 131084 131573 132526 133178 133259 133252 133488 133598
55110 133598 133319 133227 134033 135540 136961 137966 138755 139343 139533 139530 139869 140685 141606 142441 143444 144730 145875 146383
55092 146383 146308 146208 146605 147550 148694 149757 150890 152398 154091 155292 155668 155656 155758 155788 155234 154111 152904
55075 152904 151839 150768 149682 148799 148112 147365 146597 146250 146525 147023 147233 147115 146918 146665 146165 145504 145194 145719
55057 145719 146955 148154 148499 147736 146346 145209 144990 145626 146276 145969 144510 142632 141190 140444 140289 140761
55041 140761 141772 142621 142457 141276 139898 138984 138684 139159 140577 142330 143163 142578 141453 140761 140366 139729 139099
55024 139099 139067 139385 139246 138638 138430 139041 139834 140147 140217 140672 141514 142113 142079 141775 141859 142486 143102 143072 142391 141588
55004 141588 141032 140672 140424 140398 140558 140578 140294 140035 140265 141136 142552 144308 146034 147371 148382 149302 149777 149044
54986 149044 147238 145767 145731 146555 146942 146669 146598 147254 148343 149533 150798 151909 152346 151937 151041 150034 149102
54969 149102 148542 148728 149697 151185 153056 155258 157408 158936 159632 159687 159297 158708 158442 158839 159417 159321 158410 157346
54951 157346 156617 156172 156029 156432 157218 157697 157494 157012 156791 156825 156765 156377 155626 154690 153982 153795 153885 153862 153963 154832
54931 154832 156548 158587 160885 164090 168447 173225 177768 182379 187633 193381 199144 205018 211479 218527
54917 218527 225627 232358 238583 244069 248370 250961 251190 248427 242724 235165 227090 219095 211124 203305
54903 203305 196122 189906 184654 180312 176801 173812 171111 169026 168076 168052 168059 167708 167686 168737 170493 171913
54887 171913 172687 173622 175540 178328 181348 184389 187845 192117 197287 203333 210191 217500 224680 231503 238196
54872 238196 244632 249748 252264 251870 249265 245194 239954 233764 226995 219863 212428 205115 198663 193233
54858 193233 188039 182351 176540 171716 168516 166659 165492 164491 163323 161862 160251 158684 157159 155632
54844 155632 154295 153390 152778 152040 151027 150034 149361 148947 148514 147857 146955 146009 145467 145780 147005 148735 150463
54827 150463 151854 152644 152614 151844 150777 149752 148670 147399 146385 146422 147738 149625 151144 151898 151975 151502 150689
54810 150689 150067 150154 150790 151266 151208 150995 151114 151527 151939 152335 152788 153001 152554 151613 150928 151002 151593 152165 152558 152997
54790 152997 153606 154181 154429 154299 154035 153961 154234 154824 155678 156819 158297 160145 162354 164755 166925 168563 170010
54773 170010 172081 175081 178370 181301 184319 188586 194594 201673 208948 216235 223767 231454 238768 245099
54759 245099 249871 252452 252315 249457 244534 238413 231557 223954 215793 208045 201958 197768 194263 190060
54745 190060 185097 180492 177113 174826 173099 171755 170882 170486 170535 171096 172166 173521 174890 176138 177222
54730 177222 178216 179501 181680 185089 189516 194487 199688 205042 210627 216615 223092 229751 235880 240745
54716 240745 243875 244991 243961 240981 236619 231520 226158 220836 215677 210486 204900 198894 193022 187960
54702 187960 183874 180361 176957 173630 170791 168885 167923 167411 166795 165901 164903 163995 163228 162509 161623 160432
54686 160432 159272 158895 159636 160846 161525 161380 160846 160365 160213 160817 162352 163993 164396 163190 161337 159748
54670 159748 158359 156959 156077 156273 157125 157724 157861 158007 158332 158471 158224 157820 157465 157115 156757 156497 156338 156195
54652 156195 156054 155809 155087 153747 152465 152269 153328 154666 155248 155013 154630 154606 154923 155317 155598 155696 155615 155431
54634 155431 155288 155337 155631 156032 156256 156081 155486 154644 153863 153505 153735 154298 154750 154982 155263 155680 155895 155670 155311
54615 155311 155220 155279 155093 154664 154359 154300 154245 154136 154307 155042 156180 157308 158080 158331 158107 157662 157154 156370 155048
54596 155048 153561 152828 153319 154512 155633 156631 157941 159488 160508 160478 159737 159000 158609 158544 158767 159114 159140 158647
54578 158647 158238 158654 159476 159304 157662 155992 156021 157609 159043 159233 158658 158165 157860 157562 157553 158243 159541 161050
54560 161050 162529 163787 164467 164403 163952 163601 163479 163524 163807 164329 164853 165327 166127 167418 168632 169174 169310 169692
54542 169692 170198 170071 169267 168846 169717 171552 173286 174272 174631 174759 174918 175169 175445 175711 176099 176722 177325 177382
54524 177382 176665 175536 174510 173682 172799 171784 170939 170535 170370 169935 169093 168455 168805 170130 171475 171884 171257
54507 171257 170114 168850 167607 166667 166405 166745 167039 166681 165649 164349 163160 162278 161785 161686 161904 162388 163173
54490 163173 164261 165484 166568 167321 167737 167873 167716 167288 166890 167029 167877 168936 169515 169497 169338 169347 169391 169401 169699
54471 169699 170556 171828 173297 174997 176860 178397 179233 179738 180606 181925 183205 184219 185285 186627 187856
54456 187856 188308 187618 185920 183706 181556 179766 178198 176611 175083 173903 173117 172474 171886 171677 172289 173770
54440 173770 175539 176704 176796 176303 176194 176804 177543 177901 178223 179024 180000 180404 180206 180116 180452 180664 180171 179162
54422 179162 178357 178304 179023 180045 180811 181272 181963 183183 184347 184693 184389 184230 184314 183975 183105 182598 183043 183780
54404 183780 183883 183441 183243 183555 183943 184080 184133 184384 184931 185714 186588 187385 188109 188941 189916 190793 191480 192286 193519
54385 193519 194983 196130 196535 196092 195021 193903 193357 193375 193220 192330 191097 190378 190530 191310 192523 194231 196366
54368 196366 198664 201034 203636 206482 209334 212084 214936 217981 220834 222990 224458 225793 227400 228931
54354 228931 229565 228900 227382 225722 224106 222224 219888 217217 214242 210898 207575 205157 204076 203655 202780
54339 202780 201033 198802 196535 194388 192539 191295 190684 190264 189552 188534 187677 187537 188327 189719 191033 191689
54323 191689 191515 190625 189215 187668 186692 186957 188450 190362 191775 192389 192564 192720 192884 192794 192314 191576 190734
54306 190734 189808 188903 188348 188355 188668 188922 189241 190008 190974 191183 190100 188426 187390 187446 188034 188404 188258 187675 186855
54287 186855 185979 185061 183905 182420 180963 180174 180484 181883 184014 186260 187981 189023 189916 191178 192485
54272 192485 192990 192509 191874 191879 192306 192371 191887 191476 191695 192369 192976 193413 194119 195477 197312 199046 200218 200776
54254 200776 200996 201268 201936 203104 204514 205720 206557 207293 208193 209021 209177 208346 206837 205203 203706 202257
54238 202257 200822 199659 199054 198905 198723 198144 197347 196824 196785 196884 196631 195950 195321 195377 196422 198239 200320 202283
54220 202283 204077 205773 207252 208206 208453 208194 207919 208042 208515 208813 208454 207567 206754 206345 206105 205812 205653 205725
54202 205725 205549 204710 203656 203135 202956 202221 200822 199875 200243 201414 202283 202345 201594 199928 197518 195321 194322
54185 194322 194381 194573 194589 195072 196487 198391 200052 201258 202256 203234 204134 204768 205013 204997 205082 205446 205759 205554 204790
54166 204790 203752 202534 201123 199847 199149 198846 198200 196909 195568 194927 195132 195912 196956 197791 197802 196868 195657
54149 195657 194823 194228 193472 192877 193256 194719 196382 197406 197840 198198 198684 199191 199700 200239 200575 200389 199819 199411
54131 199411 199395 199266 198423 197098 196345 196964 198664 200474 201782 202720 203605 204406 204943 205300 205719 206194 206493 206584
54113 206584 206786 207392 208362 209501 210731 212083 213593 215425 217944 221379 225412 229311 232504 234897 236744
54098 236744 238487 240698 243794 247617 251431 254422 256034 255822 253463 249195 244019 239079 234914 231472
54084 231472 228598 226230 224310 222904 222285 222625 223713 225263 227305 229957 233030 236311 239966 244077 247941
54069 247941 250615 252120 253357 254712 255507 255095 253711 251796 249279 246120 242938 240342 238068 235526 232961
54054 232961 231295 230917 231312 231942 232894 234506 236757 239209 241393 243266 245389 248453 252431 256513 260190
54039 260190 263977 268601 273870 279010 283865 288998 294746 300982 307782 315429 323526 330964 337203 342978
54025 342978 349232 355875 362008 366926 370438 372688 374282 376247 379123 382159 383977 384015 382768 380680 377525
54010 377525 373159 368231 363558 359064 353955 347908 341553 335622 330079 324365 318194 311727 305207 298879
53996 298879 293218 288739 285441 282839 280637 278985 277854 276552 274259 270906 267236 264090 261756 259901
53982 259901 257995 255959 254454 254243 255246 256604 257726 258693 259415 259174 257618 255599 254260 253683 253285 253154
53966 253154 253946 255549 256973 257784 258751 260736 263766 267598 272422 278468 285508 293404 302693 313998 326999
53951 326999 340380 352546 362063 367815 369416 367509 363365 358163 352774 347882 343909 340886 338745 337636
53937 337636 337658 338398 339116 339448 339634 339967 340271 340155 339756 339933 341494 344236 347103 349509 352161 356174 361610
53920 361610 367471 373099 378858 385292 392282 399518 407274 416097 425930 436071 445897 455265 464262 473002
53906 473002 481611 490025 497679 503712 507708 510137 511908 513436 514230 513455 510983 507683 504558 501749 498632
53891 498632 494778 490320 485336 479330 471623 462013 450909 439064 427352 416493 406682 397584 388870
53878 388870 380594 372968 366043 359803 354337 349623 345282 340807 335994 331027 326223 321772 317637 313688
53864 313688 309995 306878 304411 302042 299067 295440 291735 288294 284961 281621 278432 275351 272104 268877
53850 268877 266414 265075 264316 263491 262556 261574 260181 258212 256374 255535 255647 255980 256057 255746 254803 253159 251478
53833 251478 250644 250710 251013 251183 251365 251625 251892 252488 253919 256053 258200 260022 261696 263082 263649 263447 263380
53816 263380 264062 265000 265348 264985 264484 264495 265547 267933 271274 274581 277204 279547 282546 286730 292067 298306
53800 298306 305054 311777 318212 324616 331310 338216 345115 352049 359023 365583 371167 375776 379862 383667
53786 383667 387097 390154 393015 395580 397365 397945 397284 395526 392745 389004 384421 379047 372798 365607 357672
53771 357672 349606 342358 336708 332573 328957 324884 320314 315871 311837 307857 303632 299404 295580 292239
53757 292239 289226 286405 283637 280810 278147 276109 274652 272925 270234 267088 264748 263827 263936 264680 266183
53742 266183 268323 270154 270749 270257 269526 268921 268155 267174 266482 266429 266743 266970 266924 266520 265633 264470 263702 263808
53724 263808 264479 265061 265409 265922 266906 268296 269968 271862 273722 275112 275929 276697 278109 280292 282683 284597
53708 284597 285853 286787 287780 288924 290215 291897 294290 297385 300833 304374 307973 311497 314666 317504 320485
53693 320485 323962 327754 331529 335237 338757 341524 343077 343886 344989 346735 348316 348640 347317 344783 341859
53678 341859 339310 337477 336172 335165 334746 335423 336999 338401 338652 337672 336029 334323 333109 332944 333898 335165
53662 335165 335672 335172 334368 333903 333618 333037 332286 332108 332967 334475 335836 336626 336951 337066 337219 337738 338807 340042
53644 340042 340731 340792 341150 342808 345700 348809 351240 352882 354174 355636 357530 359653 361499 362891 364297
53629 364297 366189 368246 369690 370291 370580 371181 372498 374962 378878 383837 388878 393479 397913 402476 407015
53614 407015 411490 416314 421615 426691 430761 433939 436935 440097 443285 446435 449636 452745 455411 457461
53600 457461 458929 459868 460510 461414 462948 464666 465707 465771 465280 464620 463812 462935 462297 461901 461219 459810 457901
53583 457901 456070 454630 453537 452674 451876 450796 449055 446624 443981 441838 440616 439989 438990 436838 433753
53568 433753 430698 428297 426308 424321 422524 421395 420941 420774 420833 421449 422574 423515 423744 423631 423979 425016
53552 425016 426235 427165 427944 429091 430932 433263 435406 436682 437114 437600 439032 441209 443040 444011 444981 447142
53536 447142 450499 453899 456465 458564 461308 465498 471141 477731 484788 492213 500221 508994 518542 528923
53522 528923 540213 552012 563358 573705 583797 594940 607449 620440 633225 646240 660360
53511 660360 675980 693183 712198 733055 755164 777791 800766 824186 847704 870694 893021
53500 893021 915018 936669 957357 976600 994642 1012152 1029613 1047079 1064217 1080518 1095733
53489 1095733 1110269 1124990 1140570 1157154 1174523 1192194 1209438 1225733 1241364 1257188 1273583
53478 1273583 1290011 1305870 1321291 1336580 1351201 1363976 1374296 1382583 1389400 1394601 1397617 1398171
53466 1398171 1396292 1391875 1384790 1375414 1364713 1353593 1342444 1331333 1320320 1309385 1298330 1287015
53454 1287015 1275461 1263463 1250343 1235559 1219476 1203106 1187050 1171089 1154833 1138349 1121987
53443 1121987 1105999 1090560 1075787 1061586 1047878 1035286 1025092 1017973 1013091 1008960 1004987 1001606
53431 1001606 999101 997137 995597 995138 996483 999612 1003962 1009115 1014877 1021054 1027607 1034910 1043403 1053047
53417 1053047 1063488 1074747 1087398 1101981 1118487 1136550 1155861 1176245 1197574 1219935 1243816
53406 1243816 1269781 1297832 1327193 1356886 1386512 1416504 1447767 1481201 1517410 1556546 1598237
53395 1598237 1641744 1686401 1731955 1778492 1826028 1874190 1922352 1970088 2017525 2065143 2113179
53384 2113179 2161255 2208618 2254643 2298989 2341433 2381916 2420722 2458202 2494067 2527156 2556111
53373 2556111 2580130 2598970 2612567 2621091 2625197 2625709 2622784 2615540 2602635 2583236 2557597 2526914
53361 2526914 2492626 2455643 2416222 2374594 2331525 2287981 2244405 2200669 2156756 2113169 2070622
53350 2070622 2029564 1990109 1952180 1915677 1880683 1847457 1815932 1785214 1754026 1721849 1689323
53339 1689323 1657391 1626450 1596636 1568463 1542571 1518928 1496829 1475830 1456375 1439363 1425207
53328 1425207 1413410 1402848 1392407 1381404 1369484 1356311 1341628 1325745 1309596 1293951 1278730
53317 1278730 1263423 1248051 1233236 1219387 1206316 1193798 1182096 1171714 1163036 1156414 1152162 1149998
53305 1149998 1148805 1147470 1145971 1145264 1146163 1148717 1152682 1158138 1165453 1174918 1186629 1200531 1216403 1233910
53291 1233910 1252819 1273055 1294459 1316603 1338929 1360980 1382418 1402966 1422491 1441046 1458691
53280 1458691 1475253 1490294 1503268 1513736 1521572 1527032 1530426 1531674 1530326 1526186 1519692 1511496 1501753
53267 1501753 1490102 1476281 1460492 1443148 1424466 1404442 1383098 1360663 1337593 1314455 1291647
53256 1291647 1269155 1246574 1223521 1200037 1176621 1153757 1131433 1109197 1086839 1064914 1044330
53245 1044330 1025298 1006913 987925 967819 946997 926133 905638 885685 866467 848228 831150
53234 831150 815233 800345 786402 773552 762088 752205 743935 737262 731982 727409 722513 716539 709272
53221 709272 700662 690613 679366 667568 655493 642538 627988 612026 595497 579000 562878 547777
53209 547777 534341 522369 511097 500424 491043 483120 475719 467943 459939 452245 444756 436998 428961
53196 428961 421015 413275 405648 398240 391126 383894 376045 367822 360159 353735 348507 344133 340379 336947
53182 336947 333305 329044 324334 319811 315960 312708 309703 306938 304810 303442 302315 300983 299860 299667
53168 299667 300199 300369 299621 298498 297598 296794 295954 295584 296000 296503 296177 295122 294102 293372 292709 292312 292677 293618
53150 293618 294295 294300 293960 293492 292626 291223 289585 287919 286068 284012 282081 280510 279275 278527 278629 279516 280526
53133 280526 281114 281353 281546 281789 282155 282909 284213 285897 287627 289084 289965 290303 290777 292165 294321 296280
53117 296280 297589 298908 300961 303505 305812 307653 309269 310698 311725 312264 312305 311652 310212 308398 306836
53102 306836 305744 304903 304153 303522 302928 302064 300646 298625 296229 293888 291989 290567 289400 288414 287690 286925
53086 286925 285431 283066 280799 279805 280186 281083 281901 282799 283968 285033 285443 285069 284153 282919 281522 280229
53070 280229 279336 278872 278567 278200 277883 277880 278125 278068 277215 275756 274467 273940 274075 274318 274242 273805 273323 273331 274329 276422
53050 276422 279180 281867 283767 284471 284143 283505 283243 283350 283318 282967 282706 282836 283085 283116 283099 283355 283734 283795 283524
53031 283524 283414 283837 284604 285189 285147 284374 283225 282374 282308 282902 283621 284127 284522 285017 285603 286179 286872 288008 289621
53012 289621 291119 291729 291423 291162 291877 293348 294480 294652 294316 294206 294429 294597 294475 294195 294058 294309 294879 295277
52994 295277 295094 294722 295120 296587 298224 298937 298676 298360 298900 300662 303498 306900 310260 313327 316206 318794
52978 318794 320651 321704 322533 323515 324223 324193 323772 323546 323398 322915 322396 322538 323327 324134 324854 326041 327861 329774
52960 329774 331358 332677 333669 333943 333436 332537 331338 329502 327146 325106 323888 322986 321696 320015 318329
52945 318329 316783 315510 314876 314860 314612 313346 311434 309994 309515 309510 309369 308949 308278 307257 305909 304600 303768
52928 303768 303533 303640 303754 303757 303817 304129 304694 305426 306377 307506 308308 308123 306936 305469 304287 303247 302095 301158
52910 301158 300958 301393 301731 301355 300252 298910 297940 297646 297759 297768 297558 297406 297309 296878 296168 295899 296321 296517 295639
52891 295639 294376 294212 295456 297033 298230 299539 301498 303641 305172 305963 306279 306008 304838 302978 301174
52876 301174 300081 299909 300536 301738 303439 305859 309172 312907 316148 318605 321079 324452 328547 332415 335408
52861 335408 337433 338478 338547 338016 337323 336242 334050 330629 326809 323354 320067 316297 311948 307503 303295
52846 303295 299288 295576 292549 290315 288308 285852 283070 280889 279989 279964 279785 279019 278203 277910 277880 277494 276829
52829 276829 276682 277507 278845 279940 280493 280586 280286 279739 279362 279516 280077 280650 281102 281520 281741 281370 280408 279534
52811 279534 279554 280675 282445 284297 286086 288088 290519 293013 294676 294703 292960 289961 286521 283501 281579
52796 281579 280895 280917 280901 280442 279557 278428 277334 276577 276105 275379 274019 272421 271305 270791 270437 270139 270291 271006
52778 271006 271858 272648 273789 275457 276953 277438 277024 276592 276750 277385 278065 278434 278339 277898 277446 277157 276828 276251
52760 276251 275562 275030 274740 274777 275410 276707 278228 279506 280634 281926 283167 283749 283490 282917 282746 283409 284995
52743 284995 287227 289565 291725 293959 296455 298716 300108 300860 301796 303080 303979 304077 304026 304730 306338 308408
52727 308408 310597 312708 314394 315283 315329 314747 313694 312202 310324 308234 306290 304933 304291 303942 303385 302701
52711 302701 302274 301911 300921 299293 298091 298241 299392 300483 301021 301213 301249 301141 301152 301707 302752 303650 303835 303304
52693 303304 302486 301901 301948 302680 303731 304636 305199 305403 305136 304355 303422 302841 302587 302071 300907 299428 298265 297608
52675 297608 297110 296453 295776 295504 295805 296318 296487 296142 295664 295567 296044 296964 298122 299325 300384 301244 302059 303035
52657 303035 304185 305397 306618 307889 309257 310791 312564 314499 316377 318110 319822 321433 322364 321980 320300
52642 320300 317999 315782 314012 312832 312255 312009 311656 311034 310365 309848 309374 308845 308491 308614 309145 309786 310534
52625 310534 311746 313624 315885 318022 319633 320323 319610 317390 314445 312011 310631 309761 308723 307634 307016
52610 307016 306762 306152 304907 303631 303005 302993 303146 303258 303389 303501 303532 303701 304340 305458 306743 307988 309222
52593 309222 310417 311367 311923 312178 312348 312615 313091 313792 314531 315012 315153 315274 315839 316970 318311 319488 320689
52576 320689 322581 325422 328426 330315 330490 329370 327672 325806 324084 322922 322386 321902 320942 319808 319223
52561 319223 319231 319055 318121 316790 315848 315583 315554 315086 313824 311927 309885 308111 306717 305648 304903 304413 303900
52544 303900 303157 302421 302127 302330 302732 303308 304361 305795 306837 306949 306692 307156 308586 310062 310637 310376 310116
52527 310116 310538 311698 313264 314866 316312 317666 319114 320627 321885 322757 323740 325528 328097 330605 332425
52512 332425 334027 336474 340206 344615 348743 352103 354814 357184 359198 360298 359715 357257 353652 349866
52498 349866 346132 341944 336980 331672 326781 322757 319605 317089 314935 313089 311854 311577 312188 313301 314696
52483 314696 316300 317695 318222 317755 316922 316333 316040 315940 316237 317135 318547 320438 322958 325864 328354 330024
52467 330024 331544 333764 336560 339235 341685 344355 347230 349738 351631 353189 354451 354932 354281 352644 350279
52452 350279 347331 344057 340729 337223 333316 329440 326504 324814 323810 323018 322538 322296 321637 320235 318822
52437 318822 318328 318710 319227 319485 319546 319294 318405 316945 315376 313948 312582 311391 310857 311261 312309 313505 314658
52420 314658 315813 316909 317754 318332 318929 319841 320990 321940 322357 322440 322796 323961 326192 329598 334231 339952
52404 339952 346481 353706 361773 370760 380414 390268 399743 407941 413648 415902 414651 410598 404505 396856
52390 396856 388228 379639 372193 366349 361807 358237 355922 355355 356292 357724 358922 360031 361332 362505 363217
52375 363217 364073 366065 369164 372332 375039 377922 381647 385910 390107 394258 398525 402290 404555 405094 404486
52360 404486 403086 400682 397273 393608 390648 388813 387929 387682 387927 388687 389936 391345 392348 392595 392333 392211
52344 392211 392763 394146 396183 398454 400563 402591 405150 408689 412877 417048 421145 425788 431393 437750
52330 437750 444626 452329 461313 471528 482605 494557 507795 522365 537583 552730 567838 583333
52318 583333 598973 613725 626946 639325 652197 666196 681077 696729 713640 732200 752121
52307 752121 772926 794602 817362 841079 865373 890073 915204 940642 966123 991461 1016436
52296 1016436 1040580 1063369 1084476 1103504 1119662 1132164 1140924 1146506 1149412 1149844 1148163 1145123 1141403
52283 1141403 1137167 1132243 1126578 1120384 1113978 1107572 1101158 1094653 1088186 1082153 1076858 1072327 1068696 1066481
52269 1066481 1066030 1066830 1067951 1069220 1071423 1075227 1080358 1086154 1092513 1100018 1109474 1121551 1136500 1153729
52255 1153729 1171905 1189967 1208060 1227117 1247569 1268779 1289691 1309580 1327962 1344157 1357354
52244 1357354 1367134 1373722 1377732 1379747 1380176 1379282 1377141 1373573 1368299 1361296 1352935 1343622 1333373 1321898
52230 1321898 1309155 1295649 1282008 1268384 1254482 1240196 1225970 1212333 1199246 1186243 1173253
52219 1173253 1160841 1149391 1138417 1127252 1116313 1107003 1100140 1095044 1090572 1086602 1083903 1082798 1082681
52206 1082681 1082926 1083680 1085514 1088670 1092882 1097618 1102262 1106341 1109864 1113322 1117202 1121645 1126719 1132722
52192 1132722 1139840 1147625 1155214 1162182 1168888 1175850 1182896 1189071 1193339 1195331 1195478 1194485 1192589 1189274
52178 1189274 1183794 1176081 1167017 1157645 1148211 1138304 1127948 1118134 1109949 1103469 1097954 1092957 1088732 1085567
52164 1085567 1083340 1081964 1081726 1082844 1085084 1088267 1092699 1098480 1104576 1109293 1111756 1112422 1112103 1111107 1109559
52149 1109559 1108001 1107127 1107154 1107797 1108790 1110191 1112229 1115047 1118479 1121935 1124675 1126396 1127484 1128452 1129269 1129454
52133 1129454 1128887 1128255 1128643 1130821 1135005 1141132 1149170 1159187 1171300 1185633 1202222 1220840 1240977
52120 1240977 1262102 1283951 1306492 1329726 1353666 1378364 1403635 1428713 1452527 1474524 1494987
52109 1494987 1514456 1533154 1551222 1569102 1587236 1605602 1624037 1642864 1662742 1683835 1705527
52098 1705527 1726907 1747076 1765066 1780010 1791646 1800222 1805727 1807525 1804925 1797796 1786496 1771637
52086 1771637 1754111 1734938 1714758 1693738 1672233 1651199 1631544 1613308 1595903 1579058 1563144
52075 1563144 1548601 1535450 1523519 1512936 1504229 1497866 1493750 1491296 1490161 1490777 1493825 1499211 1506041
52062 1506041 1513808 1523127 1534946 1549388 1565751 1583343 1601800 1620803 1640093 1659716 1679705 1699397
52050 1699397 1717527 1733169 1746276 1757108 1765487 1770858 1772824 1771323 1766430 1758326 1747508 1734822
52038 1734822 1721125 1706917 1692298 1677236 1661755 1645915 1629752 1613406 1597138 1581057 1564929
52027 1564929 1548554 1532209 1516259 1500299 1483297 1464886 1445969 1427591 1409667 1391484 1373151
52016 1373151 1355737 1339932 1325267 1310875 1296509 1282567 1269508 1257422 1245861 1233961 1221046
52005 1221046 1207247 1193101 1178507 1162587 1144822 1125788 1106448 1087210 1068177 1049890 1033134
51994 1033134 1018129 1004400 991428 978956 966686 954212 941317 927972 913888 898437 881271
51983 881271 862888 844363 826521 809375 792312 774850 757222 740089 723687 707584 691484
51972 691484 675980 662094 650331 640698 633524 629535 628916 630918 634743 640372 648028 657078 665984 673322
51958 673322 678538 681760 683211 682843 680383 675705 669242 661905 654533 647540 641216 636116 632840 631587
51944 631587 632246 634832 639564 646569 655803 667218 680743 696159 713272 732060 752228 772672 791921
51931 791921 809272 825035 839476 851902 861037 865865 865814 860507 849842 834171 814051 789961 762622
51918 762622 733425 704134 676174 650424 627490 607731 591050 577075 565615 556617 549743 544503
51906 544503 540948 539751 541338 545216 550403 556243 562489 568820 574615 579174 581912 582419 580544 576376
51892 576376 570002 561331 550374 537661 524219 511145 499294 489256 481380 475727 472142 470463 470626
51879 470626 472616 476429 482015 489130 497292 506024 515181 524885 535094 545346 554905 562970 568694 571328
51865 571328 570693 567504 563011 558247 553701 549649 546459 544369 543153 542352 541895 542312 544179 547406 551141
51850 551141 554321 556302 557017 556632 555105 552064 547166 540513 532658 524216 515578 507000 498749 491093 484267
51835 484267 478526 474060 470736 468146 466115 465048 465535 467668 470895 474383 477268 478748 478463 476889 474941
51820 474941 472995 470615 467420 463897 461052 459514 459289 460147 461831 463896 465770 467120 467966 468398 468396 467961
51804 467961 467187 466103 464649 462940 461348 460161 459297 458550 458005 458048 459006 460929 463663 466840 469769 471592
51788 471592 471804 470570 468474 466067 463771 461962 460772 459814 458480 456686 455098 454452 454858 455981 457744
51773 457744 460534 464729 470252 476593 483113 489415 495774 503204 512669 523917 535296 544974 552239 557385
51759 557385 560546 561143 558598 553170 545775 537170 527669 517589 507494 497801 488417 479078 469947 461659
51745 461659 454822 449708 446268 444144 442691 441403 440431 440435 441811 444355 447800 452263 457931 464601 471848
51730 471848 479362 486774 493398 498551 502033 504000 504637 504354 504058 504635 506205 508285 510518 512662 513931
51715 513931 513181 510067 505528 500872 496777 493343 490536 488186 485899 483353 480509 477409 474166 471350
51701 471350 469949 470553 472894 476381 480605 484915 488051 488873 487402 484669 481747 479280 477613 476674 475796
51686 475796 474233 471937 469392 466790 463953 461096 458943 457779 456908 455500 453643 452146 451477 451399 451586
51671 451586 452137 453216 454503 455461 456174 457615 460893 466494 474456 484881 497586 511259 523672 533082
51657 533082 539029 541602 540656 536348 529866 522807 515972 509471 503877 500442 500040 502516 507241 513580 520440
51642 520440 525887 527881 525478 519252 510777 501758 493340 485922 479644 474929 472251 471342 471053 470290 468888
51627 468888 467427 466449 466016 465825 465515 464974 464420 464040 463524 462163 459504 455703 451278 446740 442487 438629
51611 438629 434803 430525 425927 421773 418566 416030 413719 411713 410312 409438 408855 408803 409822 412076 415328
51596 415328 419545 425008 431775 439523 448106 457856 469033 481133 492899 502853 509794 513083 512759 509327
51582 509327 503451 495998 488331 482058 478131 476359 476163 477692 481870 489466 500453 514259 530121 547125
51568 547125 564448 582049 600874 621840 644617 667861 690618 713172 736437 761052 787339
51557 787339 815729 846634 879882 914473 948807 980909 1008493 1029212 1041132 1043136 1035147 1018130
51545 1018130 993701 963457 928667 890703 851463 812964 776533 742683 711728 684164 660454
51534 660454 640864 625573 614587 607297 602456 598827 595678 592547 588787 583653 576754 568265 558777
51521 558777 549052 539754 531222 523478 516412 509835 503393 496796 490238 484268 479036 473994 468670 463456
51507 463456 459207 456122 453473 450448 446961 443516 440612 438427 436834 435584 434604 434195 434730 436008 437175
51492 437175 437587 437599 438097 439210 439975 439544 438402 437940 438869 440509 441716 442033 441735 441133 440268 439140 437824
51475 437824 436377 434900 433680 432954 432561 432090 431374 430604 429936 429225 428152 426353 423487 419537 415156 411327
51459 411327 408518 406365 404281 402029 399630 397099 394599 392601 391546 391485 392251 393814 396229 399423 403353
51444 403353 408280 414597 422391 431414 441492 452745 465328 478990 492828 505503 515917 523861
51432 523861 529899 534570 537907 539897 540965 541506 541030 538315 532617 524465 515173 505826 496853 488305 480160
51417 480160 472430 465166 458525 452764 448116 444695 442471 441306 440944 441068 441437 442015 442787 443482 443680 443378
51401 443378 443276 444215 446355 449132 451920 454455 456707 458849 461519 465609 471437 478365 485611 493282 502254
51386 502254 513183 526020 540591 557356 577462 602120 631981 667014 706914 751487 800462
51375 800462 852984 907603 962898 1017778 1070893 1119899 1161533 1192428 1209887 1212469 1200452 1175737
51363 1175737 1140874 1098022 1048937 995678 940741 886313 833700 783596 736595 693250 653893
51352 653893 618770 588273 562783 542135 525367 511071 498055 485746 474194 463841 455181 448314
51340 448314 442665 437369 432207 427983 425575 424680 423932 422322 420058 417919 416349 415553 415961 417915 421003
51325 421003 424220 426761 428418 429333 429748 429889 429744 428968 427349 425272 423355 421762 420259 418899 418119 418145
51309 418145 418790 419889 421474 423323 424803 425443 425307 424630 423420 421692 419754 417914 416079 413946 411415
51294 411415 408538 405252 401492 397491 393710 390490 387981 386383 386014 387052 389318 392374 395816 399521
51280 399521 403633 408305 413476 418993 424875 431173 437486 442946 446958 449824 452314 454668 456373 456956
51266 456956 456758 456753 457739 459855 462750 465986 469225 472127 474184 474754 473421 470428 466675 463060 459790 456440
51250 456440 452643 448500 444261 439970 435658 431666 428324 425436 422515 419536 417014 415177 413539 411553
51236 411553 409324 407347 405807 404575 403715 403562 404302 405739 407468 409106 410481 411838 413689 416161 418645
51221 418645 420373 421252 421764 422173 422267 421904 421325 420816 420415 420139 420214 420877 422126 423796 425716 427714 429666
51204 429666 431621 433765 436173 438704 441152 443387 445370 447197 449090 451185 453353 455414 457364 459184
51190 459184 460515 460912 460413 459518 458596 457650 456640 455697 454931 454341 453907 453415 452235 449843 446726 444241 443246
51173 443246 443291 443394 443154 442695 442013 441043 440194 440192 441330 443234 445382 447462 449250 450581 451672 453131 455317
51156 455317 457779 459575 460166 459818 459090 458132 456667 454607 452387 450514 448984 447362 445387 443250 441321
51141 441321 439778 438544 437470 436558 436087 436334 437043 437399 436898 436069 435919 436794 438277 440106 442502 445435
51125 445435 448252 450405 452137 454050 456336 458774 461099 462998 464069 464247 464136 464478 465433 466679 468028
51110 468028 469539 471141 472616 473975 475514 477445 479635 481755 483520 484867 486054 487558 489712 492420
51096 492420 495216 497476 498625 498478 497540 496699 496419 496465 496507 496590 496778 496829 496655 496738 497499 498468 498704 497984 497071
51077 497071 496796 497366 498599 500273 502029 503303 503698 503328 502708 502421 502894 504314 506691 510054 514536 520262
51061 520262 527378 536405 548264 563566 581991 602621 624710 647659 670365 691156 708547 721917
51049 721917 731632 738972 745809 753677 762723 771726 779185 784180 786387 785817 782765 777582 770348 761101
51035 761101 750534 740093 731176 724452 719907 716995 714448 710457 703571 693439 680668 666344 651887
51022 651887 638822 628106 619820 613768 610123 609065 610056 612124 614877 618848 624784 632952 643208 655257
51008 655257 668570 682307 695670 708303 720213 731323 741223 749391 755556 759814 762455 763724 763769
50995 763769 762661 760381 756884 752331 747217 742079 737137 732503 728779 727053 728018 731353 736306 742731
50981 742731 751237 762430 776535 793735 814351 838242 864369 891457 919081 947688 977505 1007952
50969 1007952 1038558 1070196 1104860 1144120 1188269 1237098 1290985 1350623 1415875 1485569 1558613
50958 1558613 1634819 1714320 1796330 1878807 1959179 2035268 2105741 2170059 2228003 2279002 2321876
50947 2321876 2355494 2379710 2395509 2404179 2406572 2403330 2395610 2385304 2374435 2364287 2354946 2345459
50935 2345459 2334476 2321016 2304873 2286440 2266233 2244546 2221333 2196168 2168348 2137238 2102592
50924 2102592 2064352 2022148 1975270 1923325 1866750 1806585 1744009 1680352 1617189 1555908 1497183
50913 1497183 1441216 1388446 1339562 1294810 1253788 1216099 1181752 1150638 1122053 1095170 1069750
50902 1069750 1046017 1023992 1003369 983972 965970 949609 935009 922268 911579 903162 897071 892947
50890 892947 889950 887196 884415 881926 879874 877905 875928 874746 875385 877945 881616 885720 890273 895671
50876 895671 902390 910934 921432 933185 945187 957287 970375 985248 1001740 1019180 1037278 1056301
50864 1056301 1076738 1099093 1123721 1150681 1180004 1212208 1248209 1288526 1333079 1382043 1436482
50853 1436482 1497804 1567000 1644837 1732354 1830516 1939492 2058862 2188504 2328799 2479883
50843 2479883 2641073 2811073 2988403 3171497 3358484 3546800 3732791 3911759 4078688
50834 4078688 4229050 4359052 4465625 4546801 4602123 4632312 4638576 4622571 4587023 4535882 4473702
50823 4473702 4405075 4334538 4266398 4204149 4150146 4105772 4071425 4045963 4026469 4009058 3989927
50812 3989927 3965588 3932508 3887296 3827487 3752000 3660795 3554419 3434049 3301755 3160347
50802 3160347 3012847 2862063 2710568 2560903 2415775 2277931 2149669 2032306 1926137
50793 1926137 1830961 1746501 1672306 1607462 1550804 1501495 1459177 1423520 1393864 1369397 1349421
50782 1349421 1333244 1320043 1309121 1300175 1292993 1286963 1281233 1275326 1269311 1263325 1257223 1250732 1243548
50769 1243548 1235220 1225391 1214419 1203382 1193049 1183073 1172557 1161214 1149548 1138045 1126759 1115737
50757 1115737 1105299 1095586 1086270 1077128 1068735 1062194 1058214 1056745 1057529 1060670 1066573 1075525 1087620 1102996
50743 1102996 1122023 1145157 1172744 1204973 1241950 1283770 1330514 1382295 1439331 1501860 1569827
50732 1569827 1642607 1719251 1799167 1882516 1969755 2060781 2154684 2250290 2346610 2442598 2536803
50721 2536803 2627662 2713962 2794592 2867843 2931382 2982986 3020875 3043256 3048264 3034963 3004334
50710 3004334 2958985 2902254 2838076 2771251 2706710 2647873 2596028 2551557 2515318 2488414 2470866
50699 2470866 2461008 2456222 2453888 2451524 2446372 2435383 2415778 2385697 2344372 2291908 2229072 2157268
50687 2157268 2078446 1994890 1909022 1823229 1739606 1659773 1585088 1516935 1456479 1404039 1359099
50676 1359099 1321128 1290045 1265630 1246984 1233076 1223610 1218805 1218502 1221979 1228546 1237779 1249192 1262176
50663 1262176 1276260 1290974 1305470 1318853 1330955 1342332 1353483 1364595 1376027 1388352 1401766
50652 1401766 1416126 1431725 1449255 1468671 1488888 1509241 1530693 1554965 1582885 1614120 1648136
50641 1648136 1684760 1724093 1766468 1812314 1861494 1912967 1965618 2019199 2073896 2129129 2183465
50630 2183465 2235701 2285537 2333195 2378928 2423030 2465876 2507799 2548929 2588726 2624975 2653427
50619 2653427 2669318 2669838 2655363 2628871 2594916 2558799 2525322 2497330 2475546 2459917 2450555 2447085
50607 2447085 2447770 2450028 2451700 2451348 2447523 2438360 2422087 2397619 2364471 2322411 2271467 2212387 2146909
50594 2146909 2077420 2006235 1935124 1865320 1797687 1732786 1670968 1612521 1557583 1505815 1456544
50583 1456544 1409515 1365290 1324520 1287052 1252214 1219908 1190816 1165520 1143938 1125850 1111476
50572 1111476 1101139 1094578 1091026 1089914 1091263 1095371 1102266 1111556 1122751 1135646 1150296 1166648 1184455
50559 1184455 1203626 1224350 1246631 1269955 1293740 1317844 1342209 1366153 1388637 1409246 1428447
50548 1428447 1446827 1464629 1482132 1499847 1518038 1536504 1555263 1575028 1596642 1620334 1646044
50537 1646044 1674300 1706264 1742939 1784717 1831725 1884228 1942463 2006267 2075095 2148494 2226578
50526 2226578 2310013 2399539 2495531 2597995 2706678 2820840 2938887 3058599 3177902 3295251
50516 3295251 3409169 3517629 3618005 3707473 3783320 3843100 3884809 3907129 3909611 3892775 3857906
50505 3857906 3806529 3740120 3660625 3571235 3476240 3379972 3286079 3197850 3118704 3051947 3000144
50494 3000144 2964824 2946489 2944533 2957262 2982312 3017034 3058423 3102717 3145172 3180179 3201786
50483 3201786 3204722 3185547 3143156 3078455 2993861 2893023 2780375 2660384 2537091 2414095
50473 2414095 2294371 2179818 2071412 1970091 1877008 1792620 1716116 1646380 1583143 1526505
50463 1526505 1475682 1429216 1386493 1348222 1315132 1286837 1262396 1241508 1224769 1212998 1206620
50452 1206620 1205410 1208511 1214826 1223662 1234994 1249102 1266151 1286168 1309032 1334331 1361544 1390665
50440 1390665 1422346 1457010 1493825 1530671 1564938 1594246 1616914 1632386 1641305 1644839 1643905 1639261
50428 1639261 1632074 1623749 1615020 1605698 1595602 1585365 1575985 1567943 1561297 1556511 1554646 1556575 1562354
50415 1562354 1571629 1584512 1601878 1624807 1653823 1688572 1728190 1771982 1819742 1871395 1926404
50404 1926404 1983693 2042066 2100563 2158416 2214826 2268775 2318899 2363595 2401510 2431903 2454169
50393 2454169 2466938 2468080 2455962 2430551 2393109 2345132 2287998 2223487 2154122 2082737 2011899
50382 2011899 1943785 1880457 1824040 1776464 1738871 1711246 1692887 1683299 1682401 1689678 1703443 1721217
50370 1721217 1740567 1759198 1774533 1783867 1785136 1777308 1760091 1733665 1698753 1656707 1609412 1559213
50358 1559213 1508693 1459998 1414290 1372010 1333536 1299246 1269100 1242660 1219603 1199774 1182753
50347 1182753 1167762 1154027 1140775 1126870 1111057 1092801 1072593 1051436 1030451 1010896 993805
50336 993805 979295 966804 956253 948432 943944 942405 943040 945454 949325 954035 959318 965814 974209 984063
50322 984063 994200 1004091 1014207 1025106 1036823 1049082 1061428 1073115 1083431 1092275 1100003 1106676
50310 1106676 1111934 1115683 1118412 1120679 1122684 1124601 1127026 1130898 1137149 1146538 1159616 1176623 1197515
50297 1197515 1222194 1250845 1284145 1323169 1368863 1421398 1480007 1542960 1606660 1664204 1705804
50286 1705804 1722407 1710179 1672042 1615460 1549080 1480547 1415555 1357553 1308007 1267061 1233954
50275 1233954 1207259 1185571 1168336 1155739 1147628 1142925 1140280 1138960 1138901 1140213 1142875 1146653 1151120
50262 1151120 1155896 1160970 1166526 1172433 1178261 1183998 1190430 1198503 1208544 1220246 1233100 1246540 1259850
50249 1259850 1272298 1283469 1293362 1302245 1310406 1317872 1324306 1329395 1333325 1336559 1338983 1339610 1337402 1332159
50235 1332159 1324506 1315358 1305737 1296780 1289378 1283795 1279962 1278031 1278203 1279906 1281452 1280611 1275424 1264610
50221 1264610 1247723 1225329 1198889 1170208 1140910 1112288 1085294 1060381 1037515 1016687 998283
50210 998283 982587 968907 955768 942286 929040 917135 906684 896744 886728 877208 869046 862181
50198 862181 855696 848812 841459 834030 826969 820591 814999 810102 805737 801704 797646 793177 788358 783826
50184 783826 780185 777401 775027 772791 770644 768443 765986 763306 760588 757863 755041 752145 749216 746175
50170 746175 743191 741010 740349 740943 741671 741743 741358 741137 741374 741949 742574 742907 742816 742729 743450 745396 748300 751791
50152 751791 756026 761486 768405 776679 786256 797381 810315 824774 839711 853977 867426 881243
50140 881243 896881 914854 934814 956496 980033 1005473 1032561 1060990 1090395 1120185 1150045
50129 1150045 1180609 1212864 1246617 1280032 1310857 1337507 1358876 1373920 1382027 1383265 1377842 1365741
50117 1365741 1347251 1323414 1295531 1264724 1232383 1200463 1170732 1143980 1120341 1099934 1082703
50106 1082703 1068142 1055814 1045783 1037834 1030579 1022159 1011778 999978 987576 974948 962197 949296
50094 949296 936032 922417 909157 897191 886804 877741 870104 864353 860362 857267 854538 852553 851690
50081 851690 851438 850920 850038 849638 850682 853604 858336 864578 871954 880046 888435 896809 905101 913428 921787
50066 921787 929994 938071 946423 955170 963418 969775 973716 975991 977479 978126 977362 975221 972510 969862 967022
50051 967022 963237 958153 952174 946032 940243 935094 930899 927961 926199 925170 924656 925041 926953 930757 936581
50036 936581 944551 954664 966560 979745 993921 1008848 1024123 1039544 1055542 1072808 1091447 1110842
50024 1110842 1130294 1149439 1168151 1186520 1204947 1223776 1242740 1261188 1278874 1295986 1312242
50013 1312242 1326408 1337041 1343474 1346028 1345728 1344007 1342181 1340719 1339078 1336376 1331923 1325024 1314812
50000 1314812 1300748 1283123 1262730 1240236 1216181 1191413 1167062 1143994 1122479 1102352 1083337
49989 1083337 1065304 1048366 1032683 1018083 1003923 989398 973885 957040 938858 919862 901027
49978 901027 883293 867159 852684 839649 827629 816258 805636 796272 788438 781850 776122 771202
49966 771202 767032 763117 758914 754498 750379 746746 743333 740055 737349 735801 735737 737220 740059 743780 748022
49951 748022 753194 760358 770074 781531 793076 803439 812167 819158 824318 827778 829951 831113 831141 829840
49937 829840 827290 823601 818629 812230 804665 796312 787069 776491 764516 751617 738181 724375 710894
49924 710894 699189 690320 683915 678831 674579 671488 669692 668806 668721 669890 672464 675735 678877 681806 684926
49909 684926 688389 692049 695969 700512 706082 713071 721864 732511 744437 756822 769254 781752 794177
49896 794177 805913 816222 824757 831637 837090 841055 843124 842941 840531 836039 829225 819639 807476 793943
49882 793943 780427 767483 754887 742512 730752 720099 710596 701828 693388 685334 678179 672307 667453
49869 667453 663016 658988 656206 655468 656644 658927 661651 664596 667788 671545 676600 683692 692976 704090
49855 704090 716727 730805 746089 761962 777529 791772 803813 813443 821286 828061 833809 838243
49843 838243 841604 844355 845967 844816 839761 831334 821007 809736 797702 784994 771974 759140 747203
49830 747203 737133 729565 724118 719817 716271 714034 713666 714818 716534 718287 720500 724158 730003 737975
49816 737975 747311 757243 767620 778724 790467 802036 812495 821495 829190 835654 840754 844510 847189
49803 847189 848902 849489 848936 847606 845773 843164 839347 834446 829039 823330 816782 808694 798839 787429
49789 787429 774855 761738 748951 737207 726757 717764 710772 706321 704117 702984 701828 700410 699129
49776 699129 698396 698428 699394 701461 704694 709085 714590 721027 727998 735104 742218 749441 756774 763916 770378
49761 770378 775741 779851 782865 785109 786768 787630 787180 785023 781225 776172 770112 762924 754377 744633 734426
49746 734426 724784 716530 709924 704681 700364 696882 694489 693254 692685 692197 691809 692044 693127 694749 696789
49731 696789 699832 704584 711040 718594 726663 734760 742148 748138 752928 757761 764039 772428 782842 794897
49717 794897 808156 822163 836508 850797 864568 877310 888482 897238 902237 902278 897390 889007 878823
49704 878823 867770 856309 845286 835968 829301 825511 824390 825473 827833 830060 830805 829325 825563 819934
49690 819934 813279 806798 801654 798458 797214 797877 800785 806359 814408 824018 834303 845199 857461 872042
49676 872042 889549 910039 933082 958110 984818 1012743 1039969 1062643 1076740 1080778 1076494 1066997
49664 1066997 1054935 1042497 1031947 1024991 1021895 1022096 1025566 1032713 1042682 1052327 1057266 1054024 1041472
49651 1041472 1020896 994981 966502 937640 910162 885620 864817 847446 832846 821054 812456
49640 812456 806579 802131 798474 796259 796216 797922 800248 802399 803922 804281 803172 800953 798001 793826 787581
49625 787581 779407 770585 762303 754862 748099 741875 735968 730163 724809 720731 718227 716590 714979 713319
49611 713319 711943 710877 710071 710033 711437 714126 717127 719711 721905 723864 725281 725774 725520 725157 725177 725590
49595 725590 726035 726111 725748 725398 725628 726396 726904 726426 725147 724052 724052 725336 727350 729240 730509 731493 733017
49578 733017 735338 737651 739033 739703 740845 743237 746679 750871 756163 763034 771341 780694 791225 803257
49564 803257 816416 829764 842879 856032 868981 880323 888592 893620 896161 896406 893648 887569 879266
49551 879266 870605 862832 856093 850098 844902 840985 838781 838200 838642 839478 840531 841935 843571 844872 845349
49536 845349 845102 844650 844444 844808 846199 849091 853557 859386 866815 876765 889967 906077 924129 943875
49522 943875 966202 991981 1020757 1050649 1079251 1104338 1124177 1137964 1146292 1150853 1153375 1154979
49510 1154979 1156605 1159547 1164976 1172920 1182121 1190950 1198076 1202221 1201797 1195320 1182195 1162953 1138910
49497 1138910 1111839 1083766 1056621 1031875 1010443 992731 978465 966674 956328 947127 939413 933227
49485 933227 927893 922796 918225 915009 913441 912951 912818 912887 913501 914924 917001 919261 921295 923105 925073
49470 925073 927495 930252 933046 935936 939357 943598 948502 953779 959324 965004 970377 974956 978728 982087
49456 982087 985205 987725 989197 989553 988933 987250 984296 980252 975742 971220 966612 961806 957207 953398 950416
49441 950416 947881 945961 945658 947788 952030 957411 963453 970314 977971 985976 994180 1003117 1013338 1024861
49427 1024861 1037640 1052192 1069224 1088885 1110920 1135394 1162662 1192650 1224767 1258476 1292877
49416 1292877 1325036 1349373 1360054 1354759 1336223 1310342 1283035 1258501 1239243 1226633 1221125 1222231
49404 1222231 1228658 1238788 1251306 1265575 1281390 1298430 1315994 1333205 1349314 1363820 1376580
49393 1376580 1387922 1398421 1408295 1417102 1424112 1428845 1431035 1430321 1426320 1419011 1408765 1396002 1381163
49380 1381163 1365036 1348638 1332528 1316587 1300800 1285944 1273121 1262790 1254802 1249272 1246781 1247483
49368 1247483 1250499 1254555 1258917 1263338 1267394 1270456 1272249 1272929 1272454 1270290 1265972 1259659 1251922 1243172
49354 1243172 1233559 1223287 1212709 1202184 1192158 1183365 1176635 1172336 1170131 1169405 1169748 1170874 1172245
49341 1172245 1173050 1172687 1171199 1169169 1167149 1165130 1162512 1158537 1152816 1145517 1137260 1128902 1121298 1114995
49327 1114995 1110209 1107246 1106918 1110183 1117223 1127242 1139468 1154150 1172105 1193341 1216513 1239750
49315 1239750 1261455 1280026 1293339 1299334 1297372 1288765 1275781 1260220 1242975 1224525 1205413 1186245
49303 1186245 1167650 1150513 1136045 1125219 1118055 1113655 1111032 1109725 1109620 1110516 1112171 1114563 1117661
49290 1117661 1120959 1123622 1125235 1126079 1126468 1126058 1124076 1120122 1114519 1107970 1101153 1094611 1088760 1083928 1080470
49275 1080470 1078839 1079341 1081766 1085447 1089805 1094661 1099906 1104973 1108947 1111242 1112047 1112032 1111648 1110799 1109093
49260 1109093 1106366 1102958 1099577 1096944 1095624 1096191 1099530 1106780 1118786 1135494 1155912 1178603 1202096
49247 1202096 1224868 1245147 1260993 1270644 1272898 1267482 1255287 1238206 1218476 1197995 1178171 1160169
49235 1160169 1144947 1132946 1123900 1117158 1112292 1109493 1109336 1111987 1116540 1121368 1125380 1128797 1132459 1136628
49221 1136628 1140942 1145378 1150578 1156937 1163962 1170955 1177989 1185677 1194164 1202871 1211233 1219242 1227124 1234874
49207 1234874 1242409 1250094 1258841 1269570 1282595 1297547 1313944 1331635 1350552 1370149 1389471 1407911
49195 1407911 1425582 1442758 1459261 1474625 1488713 1501801 1514096 1525385 1535075 1542552 1547704 1551333
49183 1551333 1554826 1559154 1564365 1570272 1577348 1586563 1598616 1613878 1632940 1656612 1685312 1718991
49171 1718991 1757770 1802156 1852371 1907662 1966124 2024565 2078359 2122275 2152457 2168073 2171281
49160 2171281 2165915 2156109 2145291 2135480 2127248 2120450 2114983 2110842 2107790 2105367 2103292 2101720 2101211 2102461
49146 2102461 2105873 2111255 2118089 2126200 2135957 2147754 2161478 2176608 2192542 2208725 2224818 2241047
49134 2241047 2258107 2276407 2295569 2314884 2334021 2352992 2371697 2389909 2407548 2424588 2440882
49123 2440882 2456517 2472170 2488657 2506122 2524138 2542670 2562597 2585250 2611743 2642856 2679246
49112 2679246 2721732 2771739 2831626 2904318 2992520 3098509 3224555 3372717 3543100 3731522
49102 3731522 3928679 4122545 4303796 4470917 4629757 4785383 4931722 5048896 5112728 5109726
49092 5109726 5045247 4938653 4810374 4671472 4522546 4360419 4185542 4004250 3825802 3658403
49082 3658403 3507534 3376267 3265626 3174618 3100785 3041296 2993539 2954913 2922673 2894375 2868469
49071 2868469 2844442 2822472 2802837 2785370 2769395 2754277 2739934 2726615 2714303 2702704 2691757
49060 2691757 2681751 2672811 2664625 2656800 2649163 2641588 2633959 2626590 2620247 2615341 2611359 2607585 2604146 2601854
49046 2601854 2601165 2601875 2603783 2606973 2611147 2615234 2618014 2618785 2617168 2612715 2605338 2596022 2586706 2579340 2575067
49031 2575067 2573925 2574956 2576783 2578546 2580342 2582537 2584821 2586281 2586277 2584795 2582057 2578341 2574215 2570382 2567110
49016 2567110 2564283 2562159 2561502 2562612 2564783 2567235 2570088 2573940 2578838 2584395 2590594 2597652 2605068 2611625
49002 2611625 2616640 2620625 2624412 2628134 2631407 2634045 2636076 2637304 2637369 2636184 2634002 2631106 2627659 2623777
48988 2623777 2619446 2614468 2608753 2602593 2596368 2590021 2583161 2575706 2568118 2560824 2553596 2545711 2536649 2526628
48974 2526628 2516525 2507196 2498632 2489724 2479128 2466595 2453323 2440886 2429932 2420036 2410674 2402053
48962 2402053 2395009 2390352 2388460 2389383 2393114 2399656 2408807 2420017 2432664 2446513 2461788 2478774 2497511
48949 2497511 2517956 2540171 2564078 2589157 2614702 2640251 2665468 2689690 2712133 2732778 2752653
48938 2752653 2772975 2794275 2816642 2840492 2866550 2895152 2926027 2958870 2993773 3030934 3070253
48927 3070253 3111402 3154124 3198279 3243768 3290623 3339184 3389984 3443402 3499395 3557527 3617249
48916 3617249 3678160 3740041 3802604 3865328 3927607 3989010 4049248 4107938 4164513 4218447 4269575
48905 4269575 4318294 4365461 4411727 4456676 4498831 4536964 4571390 4603491 4633935 4661835 4685811
48894 4685811 4705341 4720764 4732444 4740539 4745400 4747580 4747376 4744731 4739694 4732679 4724093 4713858 4701408
48881 4701408 4686183 4668147 4647842 4625926 4602622 4577678 4550833 4522048 4491260 4458170 4422500
48870 4422500 4384252 4343550 4300480 4255256 4208312 4159925 4110098 4059244 4008751 3960332 3914803
48859 3914803 3871831 3830787 3791376 3753520 3717188 3682578 3650069 3619826 3591695 3565534 3541286
48848 3541286 3518704 3497467 3477737 3460181 3445215 3432561 3421824 3413068 3406527 3402137 3399819 3399931
48836 3399931 3402899 3408490 3415945 3424838 3435414 3447959 3462186 3477392 3493086 3509300 3526336 3544212
48824 3544212 3562403 3580242 3597664 3615294 3633630 3652385 3670976 3689426 3708309 3727808 3747318
48813 3747318 3766107 3783969 3801050 3817496 3833626 3850150 3867693 3886111 3904703 3923151 3941956
48802 3941956 3961816 3982930 4005114 4028348 4052779 4078168 4103621 4128041 4150761 4171684 4190971
48791 4190971 4208724 4224964 4239781 4253430 4266211 4278130 4288694 4297182 4303212 4306906 4308412 4307321
48779 4307321 4302639 4293234 4278384 4258189 4233662 4206152 4176361 4144028 4108790 4071067 4031619 3990511
48767 3990511 3947246 3901950 3855636 3808938 3761386 3712554 3663405 3615594 3569663 3524759 3480179
48756 3480179 3436450 3394660 3355428 3318867 3285034 3253823 3224683 3196915 3170270 3144995 3121446
48745 3121446 3099887 3080530 3063478 3048757 3036578 3027446 3021660 3018763 3017839 3018341 3020340 3023924 3028711
48732 3028711 3034101 3039727 3045464 3051254 3057119 3063271 3070025 3077670 3086490 3096663 3107908 3119392 3130236
48719 3130236 3140050 3148728 3155860 3160774 3163295 3164155 3164389 3164405 3163914 3162701 3161289 3160685 3161533 3163591 3166077 3168393
48703 3168393 3170441 3172353 3174220 3176225 3178789 3182272 3186599 3191390 3196423 3201810 3207752 3214351 3221583 3229202
48689 3229202 3236666 3243432 3249374 3254687 3259453 3263671 3267726 3272399 3278187 3284968 3292445 3300487 3308747 3316406
48675 3316406 3322842 3328331 3333685 3339381 3345488 3352258 3360203 3369573 3380166 3391644 3403437 3414158 3421494
48662 3421494 3423039 3417125 3402788 3379357 3346502 3304746 3255709 3201683 3144868 3086932 3029225 2973220
48650 2973220 2920383 2871577 2827000 2786944 2752107 2722646 2697226 2673793 2651214 2629592 2609018
48639 2609018 2588895 2568718 2548756 2529417 2510497 2491598 2472922 2455004 2437825 2420730 2403170
48628 2403170 2385119 2366763 2348224 2329640 2311239 2293268 2276089 2260289 2246398 2234376 2223688
48617 2223688 2214071 2205979 2200051 2196214 2193670 2191833 2190989 2191724 2193859 2196355 2198286 2199439 2199765 2198765 2195983
48602 2195983 2191818 2187299 2183147 2179635 2177219 2176548 2177634 2179648 2181742 2183569 2184709 2184288 2181699 2177274
48588 2177274 2171702 2165061 2156886 2146953 2135511 2122863 2109123 2094311 2078439 2061689 2044712 2028413
48576 2028413 2013148 1998495 1984183 1970859 1959459 1950163 1942617 1936862 1933377 1932352 1933602 1936974 1942046
48563 1942046 1947486 1951581 1953570 1953653 1951533 1945949 1936174 1923252 1909039 1894559 1879968 1865628 1852331
48550 1852331 1840457 1829642 1819312 1808981 1797949 1785319 1770699 1754660 1738255 1722220 1706740
48539 1706740 1691769 1677347 1663644 1650836 1638995 1628069 1618032 1609071 1601544 1595758 1591813 1589691
48527 1589691 1589373 1590889 1594431 1600558 1610140 1623681 1640492 1658509 1674951 1687171 1693072 1691364 1682000
48514 1682000 1666401 1646929 1625941 1605354 1586828 1571782 1560927 1554072 1550789 1551175 1555694 1564260
48502 1564260 1575756 1588664 1602171 1616629 1632840 1650837 1669271 1685809 1697884 1703137 1699850 1687731
48490 1687731 1668329 1644146 1617194 1588659 1559765 1532096 1506746 1483738 1462734 1443840 1427288
48479 1427288 1412769 1399705 1387917 1377511 1368369 1360257 1353173 1347062 1341433 1335873 1330749 1326710 1323640
48466 1323640 1320835 1318242 1316738 1317005 1318826 1321777 1325961 1331579 1338219 1344999 1351233 1356656 1361220 1364881
48452 1364881 1367420 1368325 1367103 1363848 1359256 1353930 1347951 1341265 1334132 1326950 1319824 1312532 1304720 1296014
48438 1296014 1286220 1275606 1264770 1254013 1243103 1231887 1220912 1211139 1203112 1196598 1190965 1185691
48426 1185691 1180569 1175634 1170972 1166576 1162362 1158259 1154109 1149523 1144107 1137957 1131707 1125920 1120497 1114866
48412 1114866 1108703 1102317 1096291 1090840 1085627 1080231 1074667 1069263 1064138 1059139 1054362 1050305 1047244 1044810
48398 1044810 1042522 1040452 1038889 1037582 1035862 1033431 1030547 1027412 1023906 1019964 1015760 1011436 1007033 1002812
48384 1002812 999297 996869 995582 995406 996296 997951 999762 1001136 1001786 1001786 1001562 1001574 1001731 1001303 999847 997961 996702
48367 996702 996464 996973 998123 1000173 1003302 1007718 1014113 1023168 1034583 1047412 1061423 1077354 1095621
48354 1095621 1115585 1136275 1156980 1176664 1193524 1205718 1212364 1213840 1211638 1208033 1205234 1204555 1206627
48341 1206627 1212071 1221239 1233557 1248222 1265521 1286452 1311075 1338518 1368743 1402986 1442106 1485802
48329 1485802 1534044 1588028 1649179 1718336 1796472 1885132 1985732 2099767 2230234 2381774
48319 2381774 2559412 2769234 3021271 3330606 3715812 4198714 4805897 5567462 6513107
48310 6513107 7671535 9072572 10743266 12697537 14929264 17404378 20029218 22597916
48302 22597916 24776789 26185575 26551062 25826673 24193541 21961006 19450868 16925833
48294 16925833 14565060 12466382 10662910 9146468 7887922 6849410 5992025 5281818
48286 5281818 4691860 4200146 3787940 3440700 3148341 2902982 2697106 2524050 2378665
48277 2378665 2256515 2153354 2065823 1991672 1928808 1875017 1828967 1790402 1758871 1733085 1711871
48266 1711871 1694782 1681330 1670549 1661788 1655166 1650735 1647928 1646295 1646075 1647451 1649824 1652366 1654876
48253 1654876 1657695 1661267 1666175 1673078 1681965 1691585 1699884 1704817 1704822 1699228 1688712 1675064 1660096 1644851
48239 1644851 1629820 1615396 1601836 1589269 1578112 1569174 1562991 1559237 1557026 1555517 1553977 1551577 1547554
48226 1547554 1541550 1533625 1523987 1512814 1500205 1486201 1470904 1454482 1436861 1417536 1396020 1372462
48214 1372462 1347488 1321445 1294220 1265877 1237002 1208224 1179771 1151653 1123967 1096825 1070276
48203 1070276 1044479 1019774 996403 974398 953741 934389 916061 898344 881142 864736 849428
48192 849428 835463 823272 813274 805216 798159 791311 784521 777813 770983 764004 757376 751638 746823 742685
48178 742685 739158 736208 733577 731122 729155 728041 727630 727462 727319 727224 727080 726750 726326 725910 725279 724235 723150
48161 723150 722638 722652 722435 721493 720215 719343 719149 719308 719336 718941 718088 716975 715977 715566 716161 717835 720065 721971
48143 721971 723030 723477 723839 724326 724947 725955 727672 729959 732354 734730 737333 740084 742354 743655 744173
48128 744173 744431 744823 745681 747340 749752 752357 754722 757023 759580 762234 764694 767231 770386 774051 777352
48113 777352 779609 781048 782520 784866 788595 793722 799752 806143 812957 820781 829959 840204 851093 862512
48099 862512 874447 886742 899417 912898 927555 943204 959359 975758 992409 1009421 1027186
48088 1027186 1046376 1067193 1088742 1109690 1129507 1148562 1167103 1184800 1201506 1217806 1234428
48077 1234428 1251444 1268412 1285023 1301229 1316856 1331497 1344847 1357038 1368605 1380093 1391632
48066 1391632 1402936 1413838 1424718 1436075 1447743 1458873 1468722 1477136 1484231 1490045 1494652 1498209
48054 1498209 1500710 1501986 1502079 1501179 1498996 1494726 1488003 1479569 1470616 1461807 1453222 1444767 1436059 1426197 1414327
48039 1414327 1400435 1385145 1368841 1351462 1333051 1313998 1294658 1275167 1255666 1236365 1217247
48028 1217247 1197954 1177978 1156844 1134266 1110465 1086233 1062369 1039145 1016620 995217 975493
48017 975493 957438 940473 924104 908171 892581 877387 863117 850380 839015 828174 817383
48006 817383 807007 797453 788510 779784 771308 763336 755877 748820 742368 737023 733191 730865 729508 728289
47992 728289 726791 725512 725302 726211 727344 727917 727939 727711 727298 726775 726444 726399 726355 726258 726489 726987 726796 725200 722858
47973 722858 721002 719873 718776 717451 716391 715752 714902 713350 711365 709313 707048 704450 702082 700687 700263
47958 700263 700120 699751 699257 698947 698918 699117 699549 700320 701531 703259 705605 708660 712378 716522 720915 725799
47942 725799 731746 739016 747112 755310 763560 772554 782800 794034 805697 817648 829990 842358 853970
47929 853970 864556 874835 885679 896959 907588 916675 924181 930270 934543 936428 936182 934878 933274
47916 933274 931151 927950 923594 918302 911990 904383 895610 886156 876207 865501 854040 842568 832116
47903 832116 823165 815480 808552 802048 795935 790401 785696 781968 779166 777174 775990 775720 776413 777982 780277
47888 780277 783114 786168 789023 791590 794471 798608 804402 811370 818862 826920 836073 846381 857078 867237
47874 867237 876522 885244 893932 902916 912007 920435 927361 932495 936040 938052 938279 936725 933837 929901
47860 929901 924677 917928 909888 900828 890553 878799 865852 852333 838615 824914 811600 798899
47848 798899 786555 774416 763098 753398 745215 737838 731255 726258 723109 721038 719412 718633 719300 721126
47834 721126 723350 725768 728668 732032 735488 738999 743040 747961 753530 759139 764318 769091 774029 779880
47820 779880 786908 794656 802473 810150 817971 826413 836008 847227 860109 874226 889306 905736 924059
47807 924059 944098 965026 986234 1007657 1029150 1049996 1069285 1086491 1101444 1113882 1123276 1129083
47795 1129083 1131118 1129714 1125545 1119207 1110971 1101013 1089778 1077892 1065699 1053195 1040493 1028185
47783 1028185 1017050 1007492 999384 992365 986233 981131 977436 975369 974577 974204 973507 972460 971674 971772 972845
47768 972845 974338 975243 974479 971346 965848 958531 950008 940671 930828 920832 910866 900766 890373 880039
47754 880039 870535 862411 855647 849966 845204 841247 837919 835185 833323 832614 833010 834337 836606 839800 843526
47739 843526 847375 851707 857666 866204 877298 890170 903972 918200 932841 948303 964985 982776
47727 982776 1001222 1020277 1040397 1061660 1083131 1103503 1122114 1138991 1154194 1167560 1178996
47716 1178996 1188531 1196053 1201338 1204277 1204769 1202477 1197084 1188819 1178327 1165987 1151734 1135657 1118323
47703 1118323 1100284 1081684 1062714 1044167 1027076 1011786 997734 984249 971368 959715 949759
47692 949759 941443 934585 929441 926590 926284 928108 931431 936010 942053 949825 959410 970712 983436 997122
47678 997122 1011477 1026718 1043368 1061560 1080657 1099580 1117486 1134238 1150322 1166237 1181811
47667 1181811 1196191 1208633 1219062 1227614 1233935 1237408 1238024 1236439 1233040 1227433 1219037 1207788 1194028
47654 1194028 1178132 1160607 1142295 1124021 1106141 1088628 1071488 1054821 1038627 1022848 1007623
47643 1007623 993348 980557 969799 961424 955320 951021 948207 946952 947383 949465 953358 959648 968835
47630 968835 980717 994622 1010068 1026915 1045180 1065227 1087926 1113934 1142674 1172476 1201821
47619 1201821 1229979 1256362 1279920 1299623 1315150 1326566 1333394 1334473 1328783 1316285 1297911 1274937
47607 1274937 1248367 1218771 1186557 1152231 1116326 1079219 1041308 1003424 966818 932569 901098
47596 901098 872383 846502 823757 804243 787422 772281 758026 744633 732582 722025 712454 703414
47584 703414 695218 688448 682874 677446 671545 665687 660719 656751 653280 649954 646659 643071 638810 634137
47570 634137 629998 627150 625527 624618 624112 623866 623466 622212 619647 615919 611568 607090 602734 598587 594681
47555 594681 591010 587549 584294 581206 578095 574742 571227 568012 565515 563717 562305 561081 559986 558842
47541 558842 557469 556038 554967 554370 553933 553449 553090 552982 552864 552500 552145 552259 552959 554050 555396 556895 558223
47524 558223 559030 559382 559689 560173 560710 561187 561715 562370 562982 563310 563345 563381 563832 564930 566492 568105 569613 571261
47506 571261 573215 575166 576690 577823 578898 579905 580480 580537 580510 580785 581156 581055 580181 578831 577685 577329 577828
47489 577828 578716 579410 579549 579026 578022 577217 577496 579008 580781 581772 582094 582650 583801 585139 586537 588533
47473 588533 591441 594835 598288 601981 606105 610219 613754 616777 619789 623074 626683 630674 634880 638709
47459 638709 641697 644046 646161 647911 648937 649456 650109 651041 651703 651709 651453 651786 653387 656518 661081 666740
47443 666740 673235 680594 688991 698559 709605 722763 738464 756252 775021 793975 813036 832262
47431 832262 851220 869091 885177 899255 911612 922683 932425 940113 944996 947082 947002 945287 942191
47418 942191 938133 933729 929234 924352 918716 912243 904951 896845 888114 879054 869658 859691 849365 839477
47404 839477 830533 822075 813217 803595 793533 783548 774080 765462 757741 750567 743586 736840 730596 724966
47390 724966 720019 716148 713863 713181 713607 714797 716879 720007 723908 728199 732989 738776 745780 753669 762027
47375 762027 770802 780012 789292 798168 806787 815807 825274 833990 840451 844231 845993 846342 845280 842816
47361 842816 839369 835133 829495 821631 811578 800304 788732 776976 764505 750801 735868 720374
47349 720374 705383 691748 679560 668214 657074 646114 635870 626798 618776 611270 603913 596791
47337 596791 590155 584111 578713 574153 570611 567984 565946 564207 562624 561264 560561 561137 563075 565554 567658
47322 567658 569430 571628 574572 577841 581122 584578 588182 591406 594029 596703 600125 603978 607193 608975
47308 608975 609205 608197 606602 605306 604774 604577 603970 602903 601955 601427 601014 600459 600036 600298 601656 604249 607919
47291 607919 612222 616791 621754 627541 634280 641645 649341 657441 666184 675702 686034 697166 709041
47278 709041 721744 735686 751276 768368 786360 805025 824968 846966 870865 895204 917793
47267 917793 936577 950133 957722 959246 955385 947631 937792 927197 916439 905959 896423 888211 880768
47254 880768 873043 864582 855804 847200 838681 829877 820726 811598 803013 795327 788492 781997 775236 768047
47240 768047 760781 753888 747612 742101 737513 733980 731609 730481 730406 730831 731363 732400 734844 739054 744419
47225 744419 750026 755378 760409 765411 771246 779124 789588 801890 814707 827325 839786 852127 863972
47212 863972 874836 884402 892466 898926 903902 907566 909730 909881 907724 903528 897768 890615 882019 872206
47198 872206 861919 852049 843142 835274 828346 822360 817377 813372 810235 807882 806313 805613 806027 807883
47184 807883 811279 815862 821161 827184 834486 843555 854276 866134 878809 892514 907751 924826 943584
47171 943584 963584 984446 1005935 1027709 1049267 1070297 1090850 1110903 1129925 1147212 1162465
47160 1162465 1175666 1186557 1194802 1200652 1204815 1207445 1207766 1205037 1199458 1191834 1182769 1172576 1161598
47147 1161598 1150101 1138066 1125593 1113406 1102486 1093081 1084425 1075560 1066289 1057365 1049885 1044499 1041051
47134 1041051 1038979 1038042 1038489 1040550 1044050 1048675 1054312 1060885 1068125 1075812 1084022 1092777 1101613 1109790
47120 1109790 1116768 1122210 1125771 1127289 1127004 1125127 1121244 1114662 1105302 1093860 1081084 1067351 1052971
47107 1052971 1038373 1023765 1008957 993781 978474 963503 949231 935839 923273 911136 898875
47096 898875 886296 873741 861636 850074 838971 828417 818647 809772 801721 794465 788265 783653 781048
47083 781048 780238 780354 780636 781167 782647 785523 789671 794884 801165 808397 816103 823801 831370 838884 846263
47068 846263 853268 859633 865124 869666 873550 877216 880689 883461 885111 885761 885780 885401 884836 884432 884336 884291 884171
47051 884171 884473 885852 888319 891332 894587 898282 902678 907914 914280 922110 931155 940413 948894 956426
47037 956426 963582 970998 978925 987257 995828 1004657 1013882 1023365 1032542 1041018 1049309 1058551 1069270 1080743
47023 1080743 1091824 1102141 1112224 1122706 1133734 1145009 1156007 1166125 1174849 1181881 1187037 1190131
47011 1190131 1191161 1190486 1188538 1185388 1180873 1175115 1168579 1161535 1153743 1144866 1135051 1124983 1115475 1107065
46997 1107065 1099852 1093586 1088027 1083316 1079853 1077834 1077114 1077507 1078898 1080967 1083194 1085468 1088398 1092629
46983 1092629 1098036 1104010 1110413 1117793 1126674 1137032 1148566 1161045 1174296 1188134 1202480 1217300
46971 1217300 1232409 1247605 1263049 1279106 1295707 1312203 1327983 1342903 1356923 1369849 1381714
46960 1381714 1392941 1403667 1413238 1420903 1426753 1431485 1435402 1438196 1439644 1440023 1439787 1439303 1438916 1438864 1439043
46945 1439043 1439229 1439545 1440384 1441897 1444004 1446890 1450946 1456086 1461668 1467328 1473457 1480637 1489025 1498547 1509255
46930 1509255 1521108 1533708 1546626 1559722 1572853 1585677 1598201 1611172 1625346 1640404 1655119
46919 1655119 1668490 1680193 1689893 1696717 1699665 1698314 1692948 1684291 1673214 1660379 1645852 1629189
46907 1629189 1610191 1589558 1568633 1548462 1529218 1510572 1492543 1475842 1461384 1449627 1440548
46896 1440548 1434146 1430670 1430344 1433130 1438937 1447810 1459743 1474564 1492170 1512691 1536073 1561674 1588597
46883 1588597 1616359 1644895 1673956 1702811 1730578 1756577 1780374 1801779 1820917 1838001 1852937
46872 1852937 1865362 1875171 1882750 1888631 1893166 1896709 1899881 1903362 1907508 1912330 1917779 1923919 1930927 1939161
46858 1939161 1949162 1961415 1975930 1992144 2009316 2027063 2045476 2064678 2084278 2103388 2121204
46847 2121204 2137404 2151922 2164508 2174824 2182879 2188997 2193243 2195181 2194365 2190940 2185539 2178725 2170701
46834 2170701 2161593 2151800 2141943 2132455 2123283 2114151 2105237 2097425 2091694 2088289 2086825 2087196 2090039 2096095
46820 2096095 2105471 2117782 2132776 2150290 2169647 2189620 2209297 2228701 2248204 2267416 2285017
46809 2285017 2299800 2311597 2320961 2328101 2332462 2333361 2330665 2324697 2315780 2304268 2290835 2276323 2261198
46796 2261198 2245423 2228930 2211916 2194616 2177109 2159582 2142516 2126354 2111111 2096600 2082954
46785 2082954 2070667 2060068 2050948 2042803 2035331 2028693 2023303 2019384 2016729 2014942 2013807 2013205 2012713 2011668
46771 2011668 2009834 2007722 2005965 2004566 2003174 2001857 2001119 2001113 2001395 2001676 2002405 2004306 2007651 2012340 2018476 2026395
46755 2026395 2036119 2047205 2059227 2072101 2085819 2100129 2114790 2129956 2146072 2163360 2181550
46744 2181550 2200056 2218167 2235180 2250606 2264434 2277054 2288846 2299884 2309973 2318679 2325394 2329774
46732 2329774 2332409 2334703 2337750 2341465 2345145 2348630 2352390 2356665 2361210 2366027 2371714 2378747 2386890 2395650
46718 2395650 2404872 2414436 2423809 2432474 2440595 2448667 2456537 2463306 2468169 2470885 2471414 2469621 2465427 2458814
46704 2458814 2449486 2436972 2421259 2402955 2382612 2360192 2335502 2308832 2280859 2252082 2222623
46693 2222623 2192427 2161451 2129774 2097818 2066342 2036000 2006980 1979177 1952519 1926941 1902290
46682 1902290 1878622 1856473 1836465 1818574 1802067 1786216 1770879 1756371 1742887 1730124 1717421
46671 1717421 1704381 1691494 1679917 1670411 1662649 1655909 1650278 1646669 1645650 1646859 1649779 1654614 1661929
46658 1661929 1671745 1683553 1697148 1712945 1731225 1751364 1772064 1792249 1811533 1829917 1847328
46647 1847328 1863573 1878541 1892117 1903890 1913189 1919602 1923336 1924978 1925112 1924338 1923401 1922868 1922737 1922819 1923648
46632 1923648 1926622 1933010 1943052 1956271 1972406 1991735 2014543 2040543 2068789 2098044 2127329 2156276
46620 2156276 2184891 2212849 2239150 2262573 2282261 2297682 2308278 2313558 2313479 2308398 2298618 2284270
46608 2284270 2265676 2243548 2218717 2191873 2163550 2134069 2103451 2071715 2039458 2007898 1978166
46597 1978166 1950721 1925477 1902189 1880433 1859561 1839105 1819228 1800502 1783229 1767152 1751746
46586 1751746 1736551 1721298 1706032 1691135 1677006 1663606 1650461 1637168 1623698 1610145 1596497
46575 1596497 1582916 1570125 1559132 1550402 1543401 1537103 1530936 1525100 1519995 1515578 1511496 1507704 1504546
46562 1504546 1502148 1500089 1497954 1495932 1494455 1493439 1492373 1491203 1490600 1491131 1492589 1494446 1496624 1499395
46548 1499395 1502763 1506479 1510636 1515825 1522530 1530656 1539740 1549327 1559100 1568955 1579219 1590451 1602775
46535 1602775 1615573 1628207 1640956 1654933 1671050 1689323 1709173 1730087 1751898 1774707 1798756
46524 1798756 1824199 1850860 1878310 1906323 1935146 1965173 1996459 2028572 2060784 2092291 2122523
46513 2122523 2151471 2179527 2206688 2232066 2254555 2273884 2290569 2304949 2316770 2325849 2332552 2337289
46501 2337289 2339985 2340497 2339267 2337072 2334268 2330726 2326395 2321496 2316190 2310470 2304401 2298049 2291125 2283050
46487 2283050 2273479 2262474 2250109 2236274 2220937 2204173 2185766 2165202 2142347 2117740 2091836
46476 2091836 2064316 2034559 2002609 1969206 1934991 1900159 1864890 1829644 1794893 1760840 1727562
$$ [...]
##END NTUPLES=NMR SPECTRUM
##END=
