##TITLE=AC1653_NARAH14389_8531193_FYCxipjwgZ
##JCAMPDX= 6.0         $$ Bruker NMR JCAMP-DX V2.0
##DATA TYPE= NMR SPECTRUM
##DATA CLASS= NTUPLES
##ORIGIN= BRUKER
##OWNER= Administrator
$$ 1.72 TOPSPIN		Version 2.1
$$ 2014-03-14 14:48:20.570 -0800  Administrator@X
$$ Compression mode = diff/dup
##.OBSERVE FREQUENCY= 400.02188249412
##.OBSERVE NUCLEUS= ^1H
##.ACQUISITION MODE= SIMULTANEOUS (DQD)
##.ACQUISITION SCHEME= undefined
##.AVERAGES= 64
##.DIGITISER RES= 22
##SPECTROMETER/DATA SYSTEM= spect
##.PULSE SEQUENCE= noesygpps1d.comp
##.SOLVENT NAME= COFFEE_meoh
##.SHIFT REFERENCE= INTERNAL, COFFEE_meoh, 1, 14.96084
##AUDIT TRAIL= $$ (NUMBER, WHEN, WHO, WHERE, PROCESS, VERSION, WHAT)
$$ ##TITLE= Audit trail, TOPSPIN		Version 2.1
$$ ##JCAMPDX= 5.01
$$ ##ORIGIN= Bruker BioSpin GmbH
$$ ##OWNER= Administrator
$$ $$ E:\/data/COFFEE/nmr/AC1653_NARAH14389_8531193_FYCxipjwgZ/12/pdata/1/auditp.txt
$$ ##AUDIT TRAIL=  $$ (NUMBER, WHEN, WHO, WHERE, PROCESS, VERSION, WHAT)
(   1,<2014-03-14 14:48:12.237 -0800>,<Administrator>,<X>,<go>,<TOPSPIN 2.1>,
      <created by zg
	started at 2014-03-14 14:36:38.464 -0800,
	POWCHK enabled, PULCHK disabled,
       configuration hash MD5:
       C8 4E 4E 5D D3 5C D8 9E 9F 52 82 E0 59 8A DE 15
       data hash MD5: 64K
       2C BF 30 DF 49 07 17 92 D7 A0 9F A4 41 06 78 5F>)
(   2,<2014-03-14 14:48:16.653 -0800>,<Administrator>,<X>,<proc1d>,<TOPSPIN 2.1>,
      <Start of raw data processing
       efp LB = 0.3 FT_mod = 6 PKNL = 1 PHC0 = 0 PHC1 = 0 SI = 128K 
       data hash MD5: 128K
       B6 0D 12 70 85 0F 82 6D 36 15 A5 E7 58 7C 82 BC>)
(   3,<2014-03-14 14:48:18.192 -0800>,<Administrator>,<X>,<proc1d>,<TOPSPIN 2.1>,
      <pk PHC0 = -84.36951 PHC1 = 0 
       data hash MD5: 128K
       54 E2 51 D7 94 74 43 63 72 8C 84 3E 2A 25 35 46>)
(   4,<2014-03-14 14:48:19.031 -0800>,<Administrator>,<X>,<proc1d>,<TOPSPIN 2.1>,
      <abs ABSG = 1 
       data hash MD5: 128K
       79 6F 20 4C 3A 7D D1 4F 8E B5 48 9A E0 C7 99 9F>)
(   5,<2014-03-14 14:48:19.296 -0800>,<Administrator>,<X>,<proc1d>,<TOPSPIN 2.1>,
      <abs ABSG = 2 
       data hash MD5: 128K
       62 55 C5 74 5B 37 D0 B4 3F F2 8D 84 EE 0F 32 9B>)
(   6,<2014-03-14 14:48:19.669 -0800>,<Administrator>,<X>,<proc1d>,<TOPSPIN 2.1>,
      <abs ABSG = 3 
       data hash MD5: 128K
       1F 8B D2 54 11 33 71 95 33 32 B0 D4 43 F2 B1 49>)
(   7,<2014-03-14 14:48:19.902 -0800>,<Administrator>,<X>,<proc1d>,<TOPSPIN 2.1>,
      <abs ABSG = 4 
       data hash MD5: 128K
       C0 F0 F8 D4 90 B1 23 4A 60 18 12 F5 2A 92 E6 F7>)
(   8,<2014-03-14 14:48:20.166 -0800>,<Administrator>,<X>,<proc1d>,<TOPSPIN 2.1>,
      <abs ABSG = 5 
       data hash MD5: 128K
       06 57 2D 57 AA 92 FD D0 03 8F A9 1A BB 7A 85 33>)
$$ ##END=
$$ 
$$ $$ hash MD5
$$ $$ 97 D1 39 8F FB A9 3C D9 62 E8 F9 70 98 9F 2B 11
##$RELAX= 
##$RELAX= 
##$RELAX= 
##$RELAX= 
##$RELAX= 
##$RELAX= 
##$RELAX= 
##$RELAX= 
$$ Bruker specific parameters
$$ --------------------------
##$DU= <E:\>
##$EXPNO= 12
$$ [...]
##$TP07= 0
##$TPNAME0= <>
##$TPNAME1= <>
##$TPNAME2= <>
##$TPNAME3= <>
##$TPNAME4= <>
##$TPNAME5= <>
##$TPNAME6= <>
##$TPNAME7= <>
##$TPOAL= (0..7)
0.5 0.5 0.5 0.5 0.5 0.5 0.5 0.5
##$TPOFFS= (0..7)
0 0 0 0 0 0 0 0
##$TUNHIN= 0
##$TUNHOUT= 0
##$TUNXOUT= 0
##$USERA1= <user>
##$USERA2= <user>
##$USERA3= <user>
##$USERA4= <user>
##$USERA5= <user>
##$V9= 5
##$VALIST= <valist>
##$VCLIST= <CCCCCCCCCCCCCCC>
##$VD= 0
##$VDLIST= <DDDDDDDDDDDDDDD>
##$VPLIST= <PPPPPPPPPPPPPPP>
##$VTLIST= <TTTTTTTTTTTTTTT>
##$WBST= 1024
##$WBSW= 4
##$XGAIN= (0..3)
0 0 0 0
##$XL= 0
##$YL= 0
##$YMAX_a= 6131581
##$YMIN_a= -12936874
##$ZGOPTNS= <>
##$ZL1= 120
##$ZL2= 120
##$ZL3= 120
##$ZL4= 120
##$ABSF1= 14.96084
##$ABSF2= -5.597342
##$ABSG= 5
##$ABSL= 3
##$ALPHA= 0
##$AQORDER= 0
##$ASSFAC= 0
##$ASSFACI= 0
##$ASSFACX= 0
##$ASSWID= 0
##$AUNMP= <proc_prof1d_extract.lims>
##$AXLEFT= 0
##$AXNAME= <>
##$AXNUC= <1H>
##$AXRIGHT= 0
##$AXTYPE= 0
##$AXUNIT= <>
##$AZFE= 0.1
##$AZFW= 0.1
##$BCFW= 0
##$BC_mod= 0
##$BYTORDP= 0
##$COROFFS= 0
##$CY= 15
##$DATMOD= 1
##$DC= 0
##$DFILT= <>
##$DTYPP= 0
##$F1P= 0
##$F2P= 0
##$FCOR= 0.5
##$FTSIZE= 131072
##$FT_mod= 6
##$GAMMA= 0
##$GB= 0
##$INTBC= 1
##$INTSCL= 1
##$ISEN= 128
##$LB= 0.3
##$LEV0= 0
##$LPBIN= 0
##$MAXI= 10000
##$MC2= 0
##$MEAN= 0
##$ME_mod= 0
##$MI= 0
##$NCOEF= 0
##$NC_proc= -2
##$NLEV= 6
##$NOISF1= 0
##$NOISF2= 0
##$NSP= 0
##$NTH_PI= 0
##$NZP= 0
##$OFFSET= 14.96084
##$PC= 1
##$PHC0= -84.36951
##$PHC1= 0
##$PH_mod= 1
##$PKNL= yes
##$PPARMOD= 0
##$PPDIAG= 0
##$PPIPTYP= 0
##$PPMPNUM= 2147483647
##$PPRESOL= 1
##$PSCAL= 4
##$PSIGN= 0
##$PYNMP= <proc.py>
##$REVERSE= no
##$SF= 400.020009701436
##$SI= 131072
##$SIGF1= 0
##$SIGF2= 0
##$SINO= 400
##$SIOLD= 131072
##$SPECTYP= <>
##$SREGLST= <1H.CDCl3>
##$SSB= 0
##$STSI= 131072
##$STSR= 0
##$SW_p= 8223.68421052631
##$SYMM= 0
##$S_DEV= 0
##$TDeff= 65536
##$TDoff= 0
##$TI= <>
##$TILT= no
##$TM1= 0
##$TM2= 0
##$TOPLEV= 0
##$USERP1= <user>
##$USERP2= <user>
##$USERP3= <user>
##$USERP4= <user>
##$USERP5= <user>
##$WDW= 1
##$XDIM= 131072
##$YMAX_p= 383261893
##$YMIN_p= -10985
##$CURPLOT= <Network HP LaserJet P1505>
##$CURPRIN= <$Network HP LaserJet P1505>
##$DFORMAT= <normdp>
##$LAYOUT= <+/1D_H.xwp>
##$LFORMAT= <normlp>
##$PFORMAT= <normpl>
##$SURQMSG= 1
$$ End of Bruker specific parameters
$$ ---------------------------------
##NTUPLES= NMR SPECTRUM
##VAR_NAME=  FREQUENCY,     SPECTRUM/REAL,   SPECTRUM/IMAG
##SYMBOL=    X,             R,               I
##VAR_TYPE=  INDEPENDENT,   DEPENDENT,       DEPENDENT
##VAR_FORM=  AFFN,          ASDF,            ASDF
##VAR_DIM=   131072,        131072,          131072
##UNITS=     HZ,            ARBITRARY UNITS, ARBITRARY UNITS
##FACTOR=    0.0627417313425164, 1,          1
##FIRST=     8223.62146879497, -1257,        -58968
##LAST=      0,             27,              -59853
##MIN=       0,             -10985,          0
##MAX=       8223.62146879497, 383261893,    0
$$ Real data points
##PAGE= N=1
##DATA TABLE= (X++(R..R)), XYDATA
$$ [...]
61576C22066j930j942j275q37r41r40k40R23J822J906J180K39q2N12J385J625
61560C23471J063L44P7L25Q42J396J707J554J109R23J313J950K202J813J133P12
61544C41934P77J001Q36J19o60q42l41K73M59L02L96J138K218K750K073N18q07
61527C52144j079n58j55l85r49j237r88m61k11o45j594k342k256j369k46N84R07
61510C39160P20K35j28j23j4k70q41j127o85L06J356K125K498K487K181J768J460
61493C51108J494K053K939L476L102K079J257J073J157R79N17R7o1J03O57J569
61477C73599K566L271L453L104K406J662J051M39m28j472k258k515k437k281j963
61462C78197j266m10m5n84j680k534k703k471k281k048j321j27Q73J253J402J869
$$ plain form
61576 322066 320136 318194 316919 316082 315141 314201 313961 314884 316706 318612 319792 320031 319949 320461 321846 323471
61560 323471 324534 324878 324955 325280 326122 327518 329225 330779 331888 332811 334124 336074 338276 340089 341222 341934
61544 341934 342711 343712 344548 344667 344007 343165 342824 343097 343556 343858 344254 345392 347610 350360 352433 352951 352144
61527 352144 351065 350507 350352 349967 349018 347781 346793 346332 346121 345476 343882 341540 339284 337915 337669 338253 339160
61510 339160 339880 340115 339987 339864 339850 339580 338739 337612 336927 337233 338589 340714 343212 345699 347880 349648 351108
61493 351108 352602 354655 357594 361070 364172 366251 367508 368581 369738 370717 371234 371331 371270 371373 372030 373599
61477 373599 376165 379436 382889 385993 388399 390061 391112 391551 391123 389651 387393 384878 382441 380160 378197
61462 378197 376931 376521 376476 375892 374212 371678 368975 366504 364223 362175 360854 360727 361600 362853 364255 366124
61446C66124K491K696K345J767J166O33N46J261K353K889K572K070K080K582L140
61431C96715L376L073K300J613J501J644J362Q66J081K044K459J532L12L32J574
61416D21784K710K893K370J611P44q5n91o94o06n56p57j415k260k430j400J07
61400D21425P69K00p51j117o76L03J464K368K629K295J761J307R49P53Q28J008
61384D35515R14M88Q6K4K24L93L04k6k47P4Q86J528J530J275J357J591J282L61
61366D47559m60o87n42l39o4J82k8p65j354j077k4J136K020K779L666M630N413
61349D62045N855O003N981N733N088M094L098K322J690J272J529K600L679L812
61335E14801L150K690K795K761K079J273J069J301J212M76n20j236j446j219p58
$$ plain form
61446 366124 368615 371311 373656 375423 376589 377222 377768 379029 381382 384271 386843 388913 390993 393575 396715
61431 396715 400091 403164 405464 407077 408578 410222 411584 412450 413531 415575 418034 419566 419878 420210 421784
61416 421784 424494 427387 429757 431368 432112 432027 431436 430742 430136 429580 428823 427408 425148 422718 421318 421425
61400 421425 422194 422394 421643 420526 419850 420153 421617 423985 426614 428909 430670 431977 432926 433679 434507 435515
61384 435515 436429 436917 437003 437027 437251 437644 437948 437922 437675 437749 438635 440163 441693 442968 444325 445916 447198 447559
61366 447559 447099 446412 445870 445531 445467 445649 445621 444856 443502 442425 442401 443537 445557 448336 452002 456632 462045
61349 462045 467900 473903 479884 485617 490705 494799 497897 500219 501909 503181 504710 507310 510989 514801
61335 514801 517951 520641 523436 526197 528276 529549 530618 531919 533131 533607 533087 531851 530405 529186 528428
61320E28428j75O08J634K597L077L093L163L682M571N539O429P253Q202R593J1461
61305E99155J3223J4220J4498J4524J4146J2626R835O658L907J470j056l576n752
61292F93878p459q552q799q529q721r786j0836j0783r686q373p286o522o446p167
61278E74933p648o545l973j510k88N1L36P77J186J553J860J915J792J965K612
61263E69016L249L462L544L978M696N322N794O181O173N382M130L254L031K829
61249F30041K038Q96N3l57p12j137j259q74m32n31j145j704j840j739j681j617
61233F18000j355q94l18M77J634L005M218N112N892O737P454P665P337O951P001
61218F78916P380P471O926O168N939O431P130P388O904N782M459L538L275L265
$$ plain form
61320 528428 528253 528861 530495 533092 536169 539262 542425 546107 550678 556217 562646 569899 578101 587694 599155
61305 599155 612378 626598 641096 655620 669766 682392 692227 698885 702792 704262 703206 699630 693878
61292 693878 686419 677867 669068 660539 651818 642032 631196 620413 610727 602354 595068 588546 582100 574933
61278 574933 567285 560740 556767 555257 554969 555020 555356 556133 557319 558872 560732 562647 564439 566404 569016
61263 569016 572265 575727 579271 583249 587945 593267 599061 605242 611415 616797 620927 624181 627212 630041
61249 630041 632079 632975 633028 632671 631959 630822 629563 628689 628257 627726 626581 624877 623037 621298 619617 618000
61233 618000 616645 615751 615433 615910 617544 620549 624767 629879 635771 642508 649962 657627 664964 671915 678916
61218 678916 686296 693767 700693 706861 712800 719231 726361 733749 740653 746435 750894 754432 757707 760972
61204G60972L010K749L129M085M722M663M712N752P561R342J0799J2025J2756
61191H46277J2623J1856J0864R308O587L231P22l15q78k018l429m189m292m519
61177H81828n168n726n843n920o486p443q198q405q338q513r113r807j0122r907
61163G72839r372q805q412q341q615q955q912q240p093n806m564l327j958m35
61149F80004R94K007K592L107L635L505J948p87l378m634m488l677k863k206j525
61134F74234n50Q42K448L936N208O390P460Q264Q990J0224J2213J4381J5992J7055
61120G87087J8217J9851K1692K3376K4991K6841K8904L0718L1845L2330L2626
61109A078478L3016L3171L2517L1047K9519K8677K8420K7898K6328K3592K0156
$$ plain form
61204 760972 763982 766731 769860 773945 778667 783330 788042 793794 801355 810697 821496 833521 846277
61191 846277 858900 870756 881620 890928 897515 900746 901468 901153 900275 898257 894828 890639 886347 881828
61177 881828 876660 870934 865091 859171 852685 845242 837044 828639 820301 811788 802675 792868 782746 772839
61163 772839 763467 754662 746250 737909 729294 720339 711427 703187 696094 690288 685724 682397 680439 680004
61149 680004 680998 683005 685597 688704 692339 695844 697792 697005 693627 688993 684505 680828 677965 675759 674234
61134 674234 673684 674526 676974 680910 686118 692508 699968 708232 717222 727446 739659 754040 770032 787087
61120 787087 805304 825155 846847 870223 895214 922055 950959 981677 1013522 1045852 1078478
61109 1078478 1111494 1144665 1177182 1208229 1237748 1266425 1294845 1322743 1349071 1372663 1392819
61098A392819J6609J3269J0100O958L902J206q75k218k792k810k922l790n243
61085A424213o241o115n520n659o682p573p709p822q936j0790j2079j2116j1613
61072A315358j1625j2315j3161j3894j4640j5245j5210j4476j3762j3732j4167
61061A163131j4311j3758j2690j1407j0092q822p513n957m288l189l061l167k273
61048A062603j38K245M046N436O871Q240R292J0391J2100J4325J6366J7779J8744
61035A188300J9675K0765K1915K2938K3928K5426K7817L0579L2658L3876L5384
61024A483261L8166M1721M4836M7182M9326N1589N3902N6732O1154O7754P6181
61013B071804Q5946R7065J09630J23350J37981J54023J72958J97084K29043K71061
$$ plain form
61098 1392819 1409428 1422697 1432797 1439755 1443657 1444863 1443988 1441770 1438978 1436168 1433246 1429456 1424213
61085 1424213 1417972 1411857 1406337 1400678 1393996 1386423 1378714 1370892 1361956 1351166 1339087 1326971 1315358
61072 1315358 1303733 1291418 1278257 1264363 1249723 1234478 1219268 1204792 1191030 1177298 1163131
61061 1163131 1148820 1135062 1122372 1110965 1100873 1092051 1084538 1078581 1074293 1071104 1068043 1064876 1062603
61048 1062603 1062465 1064710 1068756 1074192 1081063 1089303 1098595 1108986 1121086 1135411 1151777 1169556 1188300
61035 1188300 1207975 1228740 1250655 1273593 1297521 1322947 1350764 1381343 1414001 1447877 1483261
61024 1483261 1521427 1563148 1607984 1655166 1704492 1756081 1809983 1866715 1927869 1995623 2071804
61013 2071804 2157750 2254815 2364445 2487795 2625776 2779799 2952757 3149841 3378884 3649945
61003C649945L24839L92624M77934N83844P10080Q52389J005240J165344J333607
60994A0495846J513324J701142J870964J964242J907128J655876J238510P53115
60986B3100147L19047K1028j13226j02008L963J22884J51112K145l41530q09307
60976B2354255j279623j645408j857034j920159j867995j738312j564910j375269
60968I105545j188349j014556q58882p23468o07854n09648m26747l58291l03037
60959C114713k58328k21609j91765j67959j48288j30908j15611j02869r1900q1224
60949A604252p0780o1889n5081m9411m4231m0239l8143l7370l6799l6006l5081
60938A099222l3885l2288l0633k9270k7913k6133k4204k2788k1940k1036j9651
$$ plain form
61003 3649945 3974784 4367408 4845342 5429186 6139266 6991655 7996895 9162239 10495846
60994 10495846 12009170 13710312 15581276 17545518 19452646 21108522 22347032 23100147
60986 23100147 23419194 23440222 23326996 23224988 23228951 23351835 23502947 23505092 23163562 22354255
60976 22354255 21074632 19429224 17572190 15652031 13784036 12045724 10480814 9105545
60968 9105545 7917196 6902640 6043758 5320290 4712436 4202788 3776041 3417750 3114713
60959 3114713 2856385 2634776 2443011 2275052 2126764 1995856 1880245 1777376 1685476 1604252
60949 1604252 1533472 1471583 1416502 1367091 1322860 1282621 1244478 1207108 1170309 1134303 1099222
60938 1099222 1065337 1033049 1002416 973146 945233 919100 894896 872108 850168 829132 809481
60927H09481j8024j6577j5420j4380j3273j2054j0941j0274j0039r693q741p422
60915F62643o392n864n453m937m667m996n610n760n070l907k962k556k401k063
60901F00005j550j360j842k716l428l748l838l877l984m368n173o153o859p165
60887E43944p218o915n965m635l824l995m527m621m439m671n194n061l938k696
60873D76245k180k007j203K41J249J101L44J7M41J187J898K638L428L982M115
60858D91496M108M328M676M678M149L428K893K465J785P72j55m76q4N63Q02K61
60842E25689r30k293l350l897m115m491n407o693p678p889p588p368p290o866
60828D49834n926n034m739m783m524l935l610l777l859l304k382j796j740j795
$$ plain form
60927 809481 791457 774880 759460 745080 731807 719753 708812 698538 688499 678806 670065 662643
60915 662643 656251 650387 644934 639997 635330 630334 624724 618964 613894 609987 607025 604469 602068 600005
60901 600005 598455 597095 595253 592537 589109 585361 581523 577646 573662 569294 564121 557968 551109 543944
60887 543944 536726 529811 523846 519211 515387 511392 506865 502244 497805 493134 487940 482879 478941 476245
60873 476245 474065 472058 470855 471096 472345 473446 473790 473807 474248 475435 477333 479971 483399 487381 491496
60858 491496 495604 499932 504608 509286 513435 516863 519756 522221 524006 524778 524623 524147 524063 524626 525428 525689
60842 525689 524759 522466 519116 515219 511104 506613 501206 494513 486835 478946 471358 463990 456700 449834
60828 449834 443908 438874 434135 429352 424828 420893 417283 413506 409647 406343 403961 402165 400425 398630
60814C98630j661j564j775k114k183j915j637j595j624j426j031p91q86j014p41
60799C76673j22L58M44N12R82J645J902J637J365J417J454J114P12Q23J335J494
60783C93745R48K55J35N58Q37M13o75j953k858l034k523j789j389j513j814j727
60767C77616j036j75J28l56j009j031l76K71M37L62M51O51O55M28J38j69m54m75
60749C76056j17J71j84j005j417q34M04J520J988J637N28r33k011k231j880j696
60733C69996k039k509k449j687p29j74p5L3M67J030J407J637J905K096J967J616
60717C72492J343J114O89K59L53R77J391J079M09l4k53n68r00q85n19j76j29l99
60699C76243r36j539j839j715j600j817j891j197j76r4j322k607k502j102J90
$$ plain form
60814 398630 396969 395405 393630 391516 389333 387418 385781 384186 382562 381136 380105 379314 378428 377414 376673
60799 376673 376551 376909 377353 377865 378847 380492 382394 384031 385396 386813 388267 389381 390093 390916 392251 393745
60783 393745 394693 394948 395083 395641 396478 396891 396216 394263 391405 388371 385848 384059 382670 381157 379343 377616
60767 377616 376580 376405 376533 376177 375168 374137 373761 374032 374469 374831 375282 375933 376588 377016 377154 376985 376531 376056
60749 376056 375939 376110 375926 374921 373504 372670 373074 374594 376582 378219 378747 377814 375803 373572 371692 369996
60733 369996 367957 365448 362999 361312 360583 360409 360334 360367 360834 361864 363271 364908 366813 368909 370876 372492
60717 372492 373835 374949 375638 375897 376250 377227 378618 379697 380106 380072 379819 379251 378351 377466 376947 376771 376642 376243
60699 376243 375307 373768 371929 370214 368614 366797 364906 363709 363533 363439 362117 359510 357008 355906 356096
60684C56096L97o8j41O05J630K192K178K055K161K377K516K688K964L062K737
60669C83449K292K127J921Q95j019k847l620l333k608j916j373r37m97j3K58N3
60653C72832l06j01P37J355J203Q92J308K322L101L313L169K615J309n16k043
60638C91190k865l273l488l333k836k422k238j967j557j375j312n87R31J960J284
60623C68112m27j239k86J382K215J731N94k80m04M2M96O47P44R96J029M37l07
60606C75482k77O09J384J306P01K91L06N34P42O69J05o24o91K85J669K558K756
60589C87805K585K212J733J568K047K684K580J569M51k0J48N20Q59J166J497J962
60573D11366K717L783M970N959O462O411O196O491P584R010J0167J0934J1367
$$ plain form
60684 356096 356493 356425 356284 356889 358519 360711 362889 364944 367105 369482 371998 374686 377650 380712 383449
60669 383449 385741 387868 389789 390684 389665 386818 383198 379865 377257 375341 373968 373031 372534 372521 372779 372832
60653 372832 372526 372425 373162 374517 375720 376612 377920 380242 383343 386656 389825 392440 393749 393233 391190
60638 391190 388325 385052 381564 378231 375395 372973 370735 368768 367211 365836 364524 363937 364868 366828 368112
60623 368112 367685 366446 366160 367542 369757 371488 372082 371802 371398 371440 371936 372583 373327 374323 375352 375789 375482
60606 375482 375205 375814 377198 378504 379205 379496 379802 380336 381078 381747 381852 381228 380537 380822 382491 385049 387805
60589 387805 390390 392602 394335 395903 397950 400634 403214 404783 405234 405214 405362 405882 406741 407907 409404 411366
60573 411366 414083 417866 422836 428795 435257 441668 447864 454355 461939 470949 481116 492050 503417
60560E03417J1041R455O952M500K509N79j471l121m060m729n471n769m975l343
60546E05514j661k80R61K125L215M528O281Q042R246J0192J1778J4143J6371J7698
60532F08153J8414J9138J9779J9606J8035J5048J1091O900L147q5l277o684r750
60519G19515j1652j2205j1946j1378j0573r448q126o825n630m461l212j866n33
60506F21660O51J778L290N661Q875J2323J5416J8256K1517K5634L0211L4385L7617
60493H37274M0013M1867M3242M3991M3861M2429L9272L4572K9268K4181J9119
60482A239089J3259O363j005q512j6623k5718l5006m2888m8262n1200n2435n2521
60470I24541n1467m9023m5291m0991l6923l3155k9124k4687k0624j7724j5778
$$ plain form
60560 503417 514458 523913 530865 535365 537874 538453 536982 533861 529801 525072 519601 513832 508857 505514
60546 505514 503853 503573 504534 506659 509874 514402 520683 528725 537971 548163 559941 574084 590455 608153
60532 608153 626567 645705 665484 685090 703125 718173 729264 736164 739311 739226 735949 729265 719515
60519 719515 707863 695658 683712 672334 661761 652313 644187 637362 631732 627271 624059 622193 621660
60506 621660 622311 624089 627379 633040 641915 654238 669654 687910 709427 735061 765272 799657 837274
60493 837274 877287 919154 962396 1006387 1050248 1092677 1131949 1166521 1195789 1219970 1239089
60482 1239089 1252348 1258711 1257706 1249194 1232571 1206853 1171847 1128959 1080697 1029497 977062 924541
60470 924541 873074 824051 778760 737769 700846 667691 638567 613880 593256 575532 559754
60459E59754j4020j2253j0912j0180r745r390r156q789p762o124m663l879l360
60446D49521k630k058k219k759k680j705o30k50m98q15r05q52q58j126j683k153
60430D25700j979j146m57o72j495j802r76K82P73K81j85K28J027J028O1o75j91
60413D19802R63J494J063N21O40J341K138K699K770K216J429J154J612K218K462
60398D44522K534K737K803K331J579J197J339J595J708J844K207K767L337L634
60384D76134L375K685K216K485L201L658L598L218K577J680J028J288K241K805
60370E12189K377J553J151J218J365J578K069K675K979K849K500K194K227K914
60356E41838M156N274N751O000O818Q289R710J0534J0723J0170Q580O190L980
$$ plain form
60459 559754 545734 533481 522569 512389 502644 493254 484098 475309 467547 461423 456760 452881 449521
60446 449521 446891 444833 442614 439855 437175 435470 434840 434590 434092 433277 432372 431520 430662 429536 427853 425700
60430 425700 423721 422575 422118 421446 419951 418149 417173 417455 418228 418509 418324 418552 419579 420607 420668 419993 419802
60413 419802 420765 422259 423322 423843 424483 425824 427962 430661 433431 435647 437076 438230 439842 442060 444522
60398 444522 447056 449793 452596 454927 456506 457703 459042 460637 462345 464189 466396 469163 472500 476134
60384 476134 479509 482194 484410 486895 490096 493754 497352 500570 503147 504827 505855 507143 509384 512189
60370 512189 514566 516119 517270 518488 519853 521431 523500 526175 529154 532003 534503 536697 538924 541838
60356 541838 545994 551268 557019 563019 569837 578126 587836 598370 609093 619263 627843 634033 638013
60343F38013K526J147j156m140o455p356p516p855q212p818o644n585n266n350
60329E68333n167m542l748l090k791k943l257l208k750k476k699k782j930l01
60315E26649J306K665M260O284Q243R716J0818J1787J2590J3120J3297J2910J1849
60302F45494J0585R755R262Q351O672M523K000j203m865q040j0266j2080j3839
60289F46349j4947j4946j4377j3683j2227r497o626n216n097m679l400k378k504
60276E36772l194l491l300l025k837k862l385m341n102n196m768m156l454k846
60262D84815k657k795k594j676n03K37L69N4n79j253j397o75N38J539J953J862
60246D77238J584J488J735J994J815J313J036J059Q74L83K31O75Q81J33q47o84
$$ plain form
60343 638013 640539 641686 640530 636390 629935 622579 615063 607208 598996 591178 584534 578949 573683 568333
60329 568333 563166 558624 554876 551786 548995 546052 542795 539587 536837 534361 531662 528880 526950 526649
60315 526649 527955 530620 534880 541164 549407 559123 569941 581728 594318 607438 620735 633645 645494
60302 645494 656079 665834 675096 683447 690119 694642 696642 695439 690574 682534 672268 660188 646349
60289 646349 631402 616456 602079 588396 576169 566672 560046 554830 549733 545054 541654 539276 536772
60276 536772 533578 530087 526787 523762 520925 518063 514678 510337 505235 500039 495271 491115 487661 484815
60262 484815 482158 479363 476769 475093 474590 474827 475196 475250 474671 473418 472021 471346 471884 473423 475376 477238
60246 477238 478822 480310 482045 484039 485854 487167 488203 489262 490136 490519 490750 491425 492306 492439 491592 490908
60230D90908P74K214K534K033J764K222K952L229K910K645L193M530N872O604
60216E34384O837O905O773O370O089O422P345Q436R371R901R691Q774P930P998
60202F43226Q843R534R452Q690P549O280N277M822M507L579J999N56k42q17j745
60187G11510k864l636l977m326n090o239p334p786p397o762o703p165p197o318
60173F28716n271m905m863m166k787j703j496j736j924k191k646k816k297j493
60159E88422j088j095r97o36l06j02K27O84Q47N20J32K35Q55J528J815J662J450
60142E94153J676K365K906K808K557L110M531N833O401O780P525Q116P820O998
60128F63579O560O448N789M475L444L225L204K790K347K445K876L080L057L180
$$ plain form
60230 490908 491682 493896 496430 498463 500227 502449 505401 508630 511540 514185 517378 521908 527780 534384
60216 534384 541221 548126 554899 561269 567358 573780 581125 589561 598932 608833 618524 627298 635228 643226
60202 643226 652069 661603 671055 679745 687294 693574 698851 703673 708180 711759 713758 714314 714072 713255 711510
60187 711510 708646 705010 701033 696707 691617 685378 678044 670258 662861 656099 649396 642231 635034 628716
60173 628716 623445 618540 613677 609511 606724 605021 603525 601789 599865 597674 595028 592212 589915 588422
60159 588422 587334 586239 585242 584606 584300 584198 584425 585109 585956 586476 586608 586843 587698 589226 591041 592703 594153
60142 594153 595829 598194 601100 603908 606465 609575 614106 619939 626340 633120 640645 648761 656581 663579
60128 663579 670139 676587 682376 686851 690295 693520 696724 699514 701861 704306 707182 710262 713319 716499
60114G16499L435L461L216L075L275L533L253K044K62j084j321j060j573l177
60100G33838m828n593n732n850n783n144m407m435n142n423m556k994j740j397
60086F70814j872k562k817k533k260k385k539k176j457r84q77p86p79j437k948
60071F42402m744o162p021p390p283o802o261n926n820n794n582m958m112l629
60057E60918l732l859l517l145l336l492k419j91J724K479K815L581M397M625
60043E56848M645N154N919O241O221O440O710O302N266M502M321L967K867J534
60029F26937P16L22l48j635l314n005o461p579q485r412j0346j0955j1051j0817
60015E42567j0392r556q161o614n495m809m060l050k179j824j811j702j384j117
$$ plain form
60114 716499 719934 723395 726611 729686 732961 736494 739747 741791 742053 740969 739648 738588 737015 733838
60100 733838 729010 723417 717685 711835 706052 700908 696501 692066 686924 681501 676945 673951 672211 670814
60086 670814 668942 666380 663563 661030 658770 656385 653846 651670 650213 649229 648352 647566 646787 645350 642402
60071 642402 637658 631496 624475 617085 609802 603000 596739 590813 584993 579199 573617 568659 564547 560918
60057 560918 557186 553327 549810 546665 543329 539837 537418 537227 538951 541430 544245 547826 552223 556848
60043 556848 561493 566647 572566 578807 585028 591468 598178 604480 609746 614248 618569 622536 625403 626937
60029 626937 627653 627975 627627 625992 622678 617673 611212 603633 595148 585736 575390 564435 553384 542567
60015 542567 532175 522619 514458 507844 502349 497540 493480 490430 488251 486427 484616 482914 481530 480413
60001D80413j113j265j195n49O50J850K385K145J680J531J694J917K250K860L535
59986D98788L823L664L455L457L494L343L009K527J803Q24k89j525k891m009m301
59971E15172l783l184k979k829k388k029k203k489k044p29Q55K213L210L650L409
59956E03852K919K775K887K665K046J556J302Q09j9n43l63J27M48N84M52l33j595
59939E19569k248j581l41K01j29m91l41J21O48J321K163L063L966M736M860L952
59923E39469K492J458J177J029L52q94k329l444l558k201J45K169L024L107L252
59908E45248L557L507K968K476K445K580K294J521P90N48O00M06j83p08p10k92
59892E67047J20L94P99J529K436L271L961M542N069N602O145O496O374N818N269
$$ plain form
60001 480413 479300 478035 476840 476291 476941 478791 481176 483321 485001 486532 488226 490143 492393 495253 498788
59986 498788 502611 506275 509730 513187 516681 520024 523033 525560 527363 528187 527898 526373 523482 519473 515172
59971 515172 511389 508205 505226 502397 500009 497980 495777 493288 491244 490515 491370 493583 496793 500443 503852
59956 503852 506771 509546 512433 515098 517144 518700 520002 520811 520792 520249 519886 520013 520461 521045 521497 521164 519569
59939 519569 517321 515740 515399 515600 515471 514980 514639 514760 515408 516729 518892 521955 525921 530657 535517 539469
59923 539469 541961 543419 544596 545625 545977 545083 542754 539310 535752 533551 533696 535865 538889 541996 545248
59908 545248 548805 552312 555280 557756 560201 562781 565075 566596 567386 567934 568534 568940 568757 568049 567339 567047
59892 567047 567167 567561 568360 569889 572325 575596 579557 584099 589168 594770 600915 607411 613785 619603 624872
59877F24872N149N422N696N590M964L931K801J925J364P78k15j504k452k528j930
59862F53863j405j445j807j946j729j485j395j186n46M23J424K373L329M149M566
59847F57183M585M570M851N503O370P087P024N667L286R86k17l47k92o89j163
59832G04404p88P09K333K553Q26j831l849m638m900n552o755q036q965r396r330
59817F46785q919q427p926p035n356l186j444p77r13j061p44r4M86P40O67M09
59801F03205J56N4J67M78P80O76j42j486k745l475l762l894l937l899m002m371
59785E73803m557l929k628j642j720k600l446l698l283k426j580j136q73r8J216
59770E41403K025J573P91J308L217M875N153M829N247O395P188P082O589O371
$$ plain form
59877 624872 630021 635443 641139 646729 651693 655624 658425 660350 661714 662492 662277 660773 658321 655793 653863
59862 653863 652458 651013 649206 647260 645531 644046 642651 641465 640919 641342 642766 645139 648468 652617 657183
59847 657183 661768 666338 671189 676692 683062 690149 697173 702840 706126 707112 706895 706548 706256 705567 704404
59832 704404 703616 704325 706658 709211 710037 708206 704357 699719 694819 689267 682512 674476 665511 656115 646785
59817 646785 637866 629439 621513 614478 609122 605936 604492 603715 602802 601741 600997 600903 601389 602129 602796 603205
59801 603205 603361 603415 603582 604060 604840 605516 605374 603888 601143 597668 593906 590012 586075 582176 578174 573803
59785 573803 569246 565317 562689 561047 559327 556727 553281 549583 546300 543874 542294 541158 540285 540187 541403
59770 541403 543428 545001 545792 547100 550317 555192 560345 565174 570421 576816 584004 591086 597675 604046
59756F04046O617P305Q353R410J0023J0196J0367J0729J0927J0610R947R324Q818
59743G26672Q202P287O081M710L400K372J566N66r26k568l599l633l061k583k489
59728G41997k577k586k496k365k142j795j550j783k585l466l667k873j586o75
59714G09851m77n40l09J58M82O67J049J572J737J492J527K371L626M638N416O281
59698G39541O905O540N167L715K970K891L067L189K872J735L3j308j751j751j948
59683G71867k178j953j501j637k645l885m666n059n618o594p649q263q244p824
59669G04151p300o727o073n505n204m926m126k659j018K69J138J744K069K096
59655F67929K056K198K440K609K794L242L954M655M955M437K852N09j759l366
$$ plain form
59756 604046 610663 617968 626321 635731 645754 655950 666317 677046 687973 698583 708530 717854 726672
59743 726672 734874 742161 748242 752952 756352 758724 760290 760856 759930 757362 753763 750130 747069 744486 741997
59728 741997 739420 736834 734338 731973 729831 728036 726486 724703 722118 718652 714985 712112 710526 709851
59714 709851 709374 708834 708525 708683 709165 709832 710881 712453 714190 715682 717209 719580 723206 727844 733260 739541
59698 739541 746446 752986 758153 761868 764838 767729 770796 773985 776857 778592 778625 777317 775566 773815 771867
59683 771867 769689 767736 766235 764598 761953 758068 753402 748343 742725 736131 728482 720219 711975 704151
59669 704151 696851 690124 684051 678546 673342 668416 664290 661631 660613 660882 662020 663764 665833 667929
59655 667929 669985 672183 674623 677232 680026 683268 687222 691877 696832 701269 704121 704630 702871 699505
59641F99505m493n618o764p613q080q348q432q128p352o227m919l644k771k499
59627F14617k585k705k966l700m807n736o221o536o949p152o557n030l254k245
59613E48174k412l075l147k335j379r47p63j68Q52J725K145K303K335K139J733
59598E47180J319R20L80j84l63J8O42J098J264J232J084Q14L72k16o72o44k86
59581E53958k98j040j907k152k020k387l333l995l913l687l885m021l260j719
59567E16341m15l6k76l80rN39P42L99k03n51l71K18Q47J135R12M04R0K60P75J362
59547E21783J915K325K373K150K283L311M994O631P861Q818R763J1165J3616J6829
59533F15817J8870J7497J2510O060M35l584o111p031o240m386k517j262o67m59
$$ plain form
59641 699505 695012 689394 682630 675017 666937 658589 650157 642029 634677 628450 623531 619887 617116 614617
59627 614617 612032 609327 606361 602661 597854 592118 585897 579361 572412 565260 558703 553673 550419 548174
59613 548174 545762 542687 539540 537205 535826 534879 534116 533948 534800 536525 538670 540973 543308 545447 547180
59598 547180 548499 549419 549799 549615 549252 549270 549912 551010 552274 553506 554590 555404 555776 555560 554888 554244 553958
59581 553958 553660 552620 550713 548561 546541 544154 540821 536826 532913 529226 525341 521320 518060 516341
59567 516341 515926 515890 515614 515234 515225 515764 516506 516905 516702 516151 515780 515998 516845 517980 518892 519296 519386 519646 520421 521783
59547 521783 523698 526023 528396 530546 532829 536140 541134 547765 555626 564444 574207 585372 598988 615817
59533 615817 634687 652184 664694 670754 671189 667605 661494 654463 648223 643837 641320 640058 639391 638932
59519F38932j34O43J308P03j354l437m152l930m288n697p098p498p067o536o281
59504E84114o382o864p398p205n866m057k968k962l188k715j679r72r54r64l14
59489E29626P71J592K023K495L043L138K610K098K275L090M062M843N166M730
59475E71562L707K947L071L620L625K910K186J951J909J593J064P09O98R28J265
59460F03745J592J743J621J420J555K276L408M569N568O455P155P290O585N306
59446F60288M001K934K002J102K35p66k169l889n396o195o226n730n003m270l515
59431F27403k487j171n6M69P71J438K271K653K872M077O607R385J1457J3191J5260
59416F94140J7310J8559J9134J9829K0941K2171K3297K3927K2879J8903J2233
$$ plain form
59519 638932 638798 639441 640749 641452 640098 636661 632509 628579 624291 618594 611496 603998 596931 590395 584114
59504 584114 577732 570868 563470 556265 550399 546342 543374 540412 537224 534509 532830 531858 530904 529940 529626
59489 529626 530397 531989 534012 536507 539550 542688 545298 547396 549671 552761 556823 561666 566832 571562
59475 571562 575269 578216 581287 584907 588532 591442 593628 595579 597488 599081 600145 600854 601552 602480 603745
59460 603745 605337 607080 608701 610121 611676 613952 617360 621929 627497 633952 641107 648397 654982 660288
59446 660288 664289 667223 669225 670327 670562 669796 667627 663738 658342 652147 645921 640191 635188 630918 627403
59431 627403 624916 623745 623689 624158 624929 626367 628638 631291 634163 638240 644847 654232 665689 678880 694140
59416 694140 711450 730009 749143 768972 789913 812084 835381 859308 882187 901090 913323
59405I13323M699j735n992p770p356n652l551j064K211N638P356N913J573m182
59391I03411r800j4089j6336j6732j6259j5661j4725j2971j0749q992q116p611
59379G51370o778n457l959k709k073k301l240m147m067k571k21J834K724K427
59365G20832J615J094J287K059K896L390L558L706M092M853O058P552Q822R521
59351G81335J0032J1068J2676J4175J5167J5933J6591J6662J5905J4969J4478
59340I38991J4009J2688J0450P945N500K919J46k615n358q150j0668j2536j4024
59327I39297j5703j7367j8151j7825j7201j6963j6790j6092j5017j4184j3730
59316G60274j3140j1937j0258q730p826p390o837n928n117m874m933m672l998
$$ plain form
59405 913323 918022 916287 910295 902525 895169 889517 885966 884902 887113 892751 900107 906020 907593 903411
59391 903411 893611 879522 863186 846454 830195 814534 799809 786838 776089 767097 758981 751370
59379 751370 744592 739135 735176 732467 730394 728093 724853 720706 716639 714068 713847 715681 718405 720832
59365 720832 722447 723541 724828 726887 729783 733173 736731 740437 744529 749382 755440 762992 771814 781335
59351 781335 791367 802435 815111 829286 844453 860386 876977 893639 909544 924513 938991
59340 938991 953000 965688 976138 984083 989583 992502 992648 990033 984675 976525 965857 953321 939297
59327 939297 923594 906227 888076 870251 853050 836087 819297 803205 788188 774004 760274
59316 760274 747134 735197 724939 716209 708383 700993 694156 688228 683111 678237 673304 668632 664634
59303F64634l276k517j304M07K081L387M725O570Q842J1047J2766J3592J2884
59290G33838J0047N119r83o807j1094j3308j3598j2321r901p093m787l155j521
59277F64436M70K201L203M310O602R545J1538J2179J2752J4129J5471J5568J4454
59264G86858J2927J1340R577P705N874L939J775l68k207l760n002n643n590n159
59250H12266m498l397j996j045r01q59j42R29J355P22n44j718k114j356j9N66
59234G97249k17j394j810j836k652m267n486n805o104p101q248q709q615q674
59220G26331r023r134q668p892p274o984o769o250n349m411l796l450l067k598
59206F41666k224j882j170J34J716L038L760L862L487K873K338K219K685L515
$$ plain form
59303 664634 661358 658841 657537 657944 660025 663412 668137 674707 683549 694596 707362 720954 733838
59290 733838 743885 749004 748021 741214 730120 716812 703214 690893 680992 673899 669112 665957 664436
59277 664436 664906 667107 670310 674620 681222 690767 702305 714484 727236 741365 756836 772404 786858
59264 786858 799785 811125 820702 828407 834281 838220 839995 839627 837420 833660 828658 823015 817425 812266
59250 812266 807768 804371 802375 801330 800429 799570 799428 800357 801712 802434 801890 800172 798058 796702 796683 797249
59234 797249 797032 795638 793828 791992 789340 785073 779587 773782 767678 760577 752329 743620 735005 726331
59220 726331 717308 708174 699506 691614 684340 677356 670587 664337 658988 654577 650781 647331 644264 641666
59206 641666 639442 637560 636390 636524 638240 641278 645038 648900 652387 655260 657598 659817 662502 666017
59192F66017M095L919L181K611K554K603K351K056K147K476K573K396K134J524
59178G02637K09j324j961j438q25j183k301l210l409l041k282j222j91L90N24
59163F81373O29R48J297J393J108M27n56j568k372l155m373o060p564q265q289
59148F44973q213q196p857o984n998n472n522n817n983n796n248m614m215l877
59134E61181k943j265K00L45o20j329q83L28J514K473L410M376N306O202O880
59119E85175P010O804P126Q380R774J0348J0343J0664J1303J1293J0349R439R327
59106G07335R375Q502O779N237M368L598K354R66J63Q8K33J27l32j138k239l202
59090G42214l290k289j038o04j068j540j468j410k258m039n847o829o975o971
$$ plain form
59192 666017 670112 674031 677212 679823 682377 684980 687331 689387 691534 694010 696583 698979 701113 702637
59178 702637 702846 701522 699561 698123 697298 696115 693814 690604 687195 684154 681872 680650 680459 680849 681373
59163 681373 682002 682950 684247 685640 686748 687175 686619 685051 682679 679524 675151 669091 661527 653262 644973
59148 644973 636760 628564 620707 613723 607725 602253 596731 590914 584931 579135 573887 569273 565058 561181
59134 561181 558238 556973 557173 557518 556898 555569 554686 555014 556528 559001 562411 566787 572093 578295 585175
59119 585175 592185 598989 606115 614495 624269 634617 644960 655624 666927 678220 688569 698008 707335
59106 707335 716710 725212 731991 737228 741596 745194 747548 748514 748677 748765 748998 749125 748793 747655 745416 742214
59090 742214 738924 736635 735597 734993 733925 732385 730917 729507 727249 723210 717363 710534 703559 696588
59076F96588p389q082q417q134p749p795p950p473o435n726n688n474m327k808
59062F03141k078k379k963l246l285l183k828k327k156k551l077l026k083o39
59048E67320M74N89j14p24n74%K16q8l61k16J62N10R09J492K080K335K183K005
59030E78198K364L464M773N523N697O180P649R670J1388J2651J3846J4894J5224
59017F91521J4662J3557J1951R477O221K945K22j990l658m333l978l463l581m076
59003G25477m169l628k721j441M38K677M541N535N671N103L919K345P99l73j018
58988G43155j146j038j191j817k483k685k551k488k280j229O23K207K737K847
58974G32661L830O067Q664J0530J1290J1297J1192J1499J2209J2717J2469J1621
$$ plain form
59076 696588 689199 681117 672700 664566 656817 649022 641072 633599 627164 621438 615750 610276 605949 603141
59062 603141 601063 598684 595721 592475 589190 586007 583179 580852 578696 576145 573068 570042 567959 567320
59048 567320 567794 568383 568269 567545 566971 566971 567187 567099 566738 566522 566684 567194 568103 569595 571675 574010 576193 578198
59030 578198 580562 584026 588799 594322 600019 606199 613848 623518 634906 647557 661403 676297 691521
59017 691521 706183 719740 731691 741168 747389 750334 750556 748566 744908 740575 736597 733134 729553 725477
59003 725477 721308 717680 714959 713518 713956 716633 721174 726709 732380 737483 741402 743747 744546 744173 743155
58988 743155 742009 740971 739780 737963 735480 732795 730244 727756 725476 724247 724870 727077 729814 732661
58974 732661 736491 742558 751222 761752 773042 784339 795531 807030 819239 831956 844425 856046
58962H56046J0772J0086R214P970O517M712K052j346m412o361p801r843j2441
58949H65165j4381j4888j4400j3778j3390j3166j2921j2372j1290r852q494p387
58937G18846o347n276m180k894j422l99m57j008o69Q75K376K757K393K013J386
58922G07994J8j587k465k570k656l024l300l282l108k738j993j041j99O34J716
58907F82399K841L695M563N933P590Q938J0049J1474J3079J4009J3944J3494J3212
58894H05220J2997J2676J2460J2567J2976J3704J4765J5766J6246J6393J6694
58883I62464J6914J6194J4322J1960R567P000M399K328P06j339l992o176p103
58870A027244p449q173r065r400r315r415r564r124q192p594p713q137q418q510
$$ plain form
58962 856046 866818 876904 886118 894088 900605 905317 907369 906023 901611 895250 887449 877606 865165
58949 865165 850784 835896 821496 807718 794328 781162 768241 755869 744579 734727 726233 718846
58937 718846 712499 707223 703043 700149 698727 698328 697871 696863 696194 697069 699445 702202 704595 706608 707994
58922 707994 708012 706425 703960 701390 698734 695710 692410 689128 686020 683282 681289 680248 680049 680683 682399
58907 682399 685240 688935 693498 699431 707021 715959 726008 737482 750561 764570 778514 792008 805220
58894 805220 818217 830893 843353 855920 868896 882600 897365 913131 929377 945770 962464
58883 962464 979378 995572 1009894 1021854 1031421 1038421 1042820 1045148 1045854 1044515 1040523 1034347 1027244
58870 1027244 1019795 1011622 1002557 993157 983842 974427 964863 955739 947547 939953 932240 924103 915685 907175
58856I07175q528q659r216j0185j0876j0620r756r229r276r204q552p845p884
58843G87345q741r719j0090r700r032q743r015r366r270q772q328q124p887p273
58829F63285o200m839l477k342j389l60P78J664K042K177K523L111L632L976M294
58814F68875M537M384L691K769K122K031K360K574K047O49r19j751j801k052l335
58799F86181n169o195n846n087n210o155o644n936m734m117m185m324m233l916
58785F14430l095j539K29J443K238L357M705N329N053M918N474N749M731K976
58771F55998J634O12j083l510n503o301o388o498o602o304n702n279n149m852
58757E95073l984k775j832j248m36R16K113K298J832J856K504K610J636P51J247
$$ plain form
58856 907175 898647 889988 880772 870587 859711 849091 839335 830106 820830 811626 803074 795229 787345
58843 787345 778604 768885 758795 749095 740063 731320 722305 712939 703669 694897 686569 678445 670558 663285
58829 663285 657085 652246 648769 646427 645038 644678 645456 647120 649162 651339 653862 656973 660605 664581 668875
58814 668875 673412 677796 681487 684256 686378 688409 690769 693343 695390 696039 695120 693369 691568 689516 686181
58799 686181 681012 674817 668971 663884 658674 652519 645875 639939 635205 631088 626903 622579 618346 614430
58785 614430 611335 609796 610025 611468 613706 617063 621768 627097 632150 637068 642542 648291 653022 655998
58771 655998 657632 658244 657161 653651 648148 641847 635459 628961 622359 616055 610353 605074 599925 595073
58757 595073 591089 588314 586482 585234 584798 585714 587827 590125 591957 593813 596317 598927 600563 601314 602561
58742F02561K722L837M205M495N047N506N704N882O056N992N792N785N833N531
58728F74948N044M959N239N151M405L641L515L886M219M297M272M359M727N416
58714G38078O210O807P048O770N690L892K121R48k01k332n287p791r252j0497
58700G42204j2293j4124j5161j5655j6402j7223j7067j5597j3744j2447j1569
58689E80922j0472r141q131p620p122o261n361m975n085n141m750l986l066k137
58675D97674j463j409j945k414k003m17J936M169N425N589N603O587Q526J0209
58661E36067J0647R937Q538O422L559O02j647l152m377n414o008o243o469o682
58647E35780o481n699m581l535l013l325m081m232l239j893j218r91k03J291K576
$$ plain form
58742 602561 605283 609120 613325 617820 622867 628373 634077 639959 646015 652007 657799 663584 669417 674948
58728 674948 679992 684951 690190 695341 699746 703387 706902 710788 715007 719304 723576 727935 732662 738078
58714 738078 744288 751095 758143 764913 770603 774495 776616 777564 777363 775031 769744 761953 752701 742204
58700 742204 729911 715787 700626 684971 668569 651346 634279 618682 604938 592491 580922
58689 580922 570450 561309 553178 545558 538436 532175 526814 521839 516754 511613 506863 502877 499811 497674
58675 497674 496211 494802 492857 490443 488440 488023 489959 494128 499553 505142 510745 517332 525858 536067
58661 536067 546714 556651 565189 571611 575170 575772 574125 570973 566596 561182 555174 548931 542462 535780
58647 535780 529299 523600 519019 515484 512471 509146 505065 500833 497594 495701 494483 493492 493289 494580 497156
58632D97156L041K958K660K062J219M77r1p18j226j117n01j02j19Q3Q05J435J523
58615E09545J580K214L151L837M397N246O117O304N698M903M414M219M102L887
58601E69614L378K537J725J369J305Q71j66j104j080j97N57N58M01J128K927M984
58585E88807O559P578Q129Q099P704P724Q579R635R991R650R221Q909Q537Q333
58571G07455Q809R870J0845J1511J2362J3825J5804J8108K0663K3173K5132K6351
58559I03908K7071K7451K7296K6311K4146K0451J5429J0152N648J819k022n714
58547A081946q250r187r082q451p338o222o304q319j1668j5236j8427k1060k2906
58534I29496k3879k4234k4137k3442k2112k0465j8747j6953j5143j3463j1773
$$ plain form
58632 497156 500197 503155 505815 507877 509096 509573 509482 508764 507538 506421 505920 505818 505699 505782 506587 508022 509545
58615 509545 511125 513339 516490 520327 524724 529970 536087 542391 548089 552992 557406 561625 565727 569614
58601 569614 572992 575529 577254 578623 579928 580799 580633 579529 578449 578252 578809 579367 579768 580896 583823 588807
58585 588807 595366 602944 611073 619172 626876 634600 643179 652814 662805 672455 681676 690585 699122 707455
58571 707455 716264 726134 736979 748490 760852 774677 790481 808589 829252 852425 877557 903908
58559 903908 930979 958430 985726 1012037 1036183 1056634 1072063 1082215 1087863 1089682 1087660 1081946
58547 1081946 1073696 1064509 1055427 1046976 1039638 1033416 1027112 1018793 1007125 991889 973462 952402 929496
58534 929496 905617 881383 857246 833804 811692 791227 772480 755527 740384 726921 715148
58523G15148r769p642n965m866l964l221l071l506l840l650l211k763k205j683
58509F55792j659k002j931j255p67r45j158p30J7M69P02J054J354J286R93P32
58493F51952M89L89Q86J999L036L627M334N641P092Q121R036J0455J2351J4327
58479G33735J6257J7939J8833J8865J8813J9032J8479J5991J1969P782L943Jm080
58466H97559p529r730j0742j0837j0249r195p613n093j683J599L826N369P254
58453H42936R557J1297J1893J1790J1535J0859Q939N283L34m661q572j1321j3564
58440H86305j5339j5781j4546j2654j1189r866p794n032k451m13J356K808L605
58427G99009M051N029O827Q720R829R979R584R103Q559P371M935J564j583l845
$$ plain form
58523 715148 705379 697737 691772 686906 682942 679721 676650 673144 669304 665654 662443 659680 657475 655792
58509 655792 654133 652131 650200 648945 648178 647233 646075 645345 645362 645831 646533 647587 648941 650227 651220 651952
58493 651952 652441 652830 653716 655715 658751 662378 666712 672353 679445 687566 696602 707057 719408 733735
58479 733735 749992 767931 786764 805629 824442 843474 861953 877944 889913 897695 901638 901639 897559
58466 897559 890030 880300 869558 858721 848472 839277 831664 826571 824888 826487 830313 835682 842936
58453 842936 852493 863790 875683 887473 899008 909867 918806 924089 924423 919762 911190 899869 886305
58440 886305 870966 855185 840639 827985 816796 806930 799136 794104 791653 791240 792596 795404 799009
58427 799009 803060 808089 814916 823636 833465 843444 853028 862131 870690 878061 882996 884560 882977 879132
58413H79132n754p875r697j0366r991r349q741q028p398p179p069o354m858l016
58399G73457j195M49J692K409K899L474L995M282M522M802M757M300M064M431
58385H18338M698M132L277L247M070M806M989M990N066N050M905M884N123N558
58371H83133O096O509O635O926Q144J0039J1340J1591J1933J3148J4262J4290
58359A004046J4147J5154J6609J6785J5632J4527J3693J1907Q737N266K401J87
58347A139091j120q42P99K525L520L992M229M357N066P125R955J2025J2931J3778
58333A217431J5223J6464J6689J6340J6296J6711J7185J7369J6982J5752J3664
58322A396106J0963P993N426M143M261M723M669M606N412O875Q286R680J1249
$$ plain form
58413 879132 873378 865503 855806 845440 835449 826100 817359 809331 801933 794754 787685 781331 776473 773457
58399 773457 772262 772711 774403 776812 779711 783185 787180 791462 795984 800786 805543 809843 813907 818338
58385 818338 823036 827168 830445 833692 837762 842568 847557 852547 857613 862663 867568 872452 877575 883133
58371 883133 889229 895738 902373 909299 917443 927482 938822 950413 962346 975494 989756 1004046
58359 1004046 1018193 1033347 1049956 1066741 1082373 1096900 1110593 1122500 1131237 1136503 1138904 1139091
58347 1139091 1137971 1137129 1137928 1140453 1143973 1147965 1152194 1156551 1161617 1168742 1178697 1190722 1203653 1217431
58333 1217431 1232654 1249118 1265807 1282147 1298443 1315154 1332339 1349708 1366690 1382442 1396106
58322 1396106 1407069 1415062 1420488 1424631 1428892 1433615 1438284 1442890 1448302 1455177 1463463 1473143 1484392
58309A484392J2305J2312J2299J3608J5828J7531J8474J9320J9882J9603J9300
58298A664854K0238K1728K1891K0682J9955K0555K1536K2357K3572K5108K6032
58287A908508K6410K7319K8722K9428K9436L0104L1619L2524L2303L2247L3139
58276B241759L4164L4790L5614L6704L7165L7143L8299M1496M5824N0433N5526
58265B688917O0971O5867P0087P4415P8788Q2279Q4981Q7808R0261R0820Q9707
58254C564901Q8814Q8600Q7886Q6970Q7927R1128R4515R7197J00823J06423J12773
58243D607957J18929J25578J32934J40143J47598J56881J67659J77780J87231
58234E962690J98473K12066K25661K38443K52571K68976K85787L02529L21724
$$ plain form
58309 1484392 1496697 1509009 1521308 1534916 1550744 1568275 1586749 1606069 1625951 1645554 1664854
58298 1664854 1685092 1706820 1728711 1749393 1769348 1789903 1811439 1833796 1857368 1882476 1908508
58287 1908508 1934918 1962237 1990959 2020387 2049823 2079927 2111546 2144070 2176373 2208620 2241759
58276 2241759 2275923 2310713 2346327 2383031 2420196 2457339 2495638 2537134 2582958 2633391 2688917
58265 2688917 2749888 2815755 2885842 2960257 3039045 3121324 3206305 3294113 3384374 3475194 3564901
58254 3564901 3653715 3742315 3830201 3917171 4005098 4096226 4190741 4287938 4388761 4495184 4607957
58243 4607957 4726886 4852464 4985398 5125541 5273139 5430020 5597679 5775459 5962690
58234 5962690 6161163 6373229 6598890 6837333 7089904 7358880 7644667 7947196 8268920
58225H268920L44673L69647L96028M25963M60150M96478N34807N78551O29505
58216A2504722O85815P47122Q16611Q95916R83506J080553J192603J323089J471534
58207B1701471J640891J839824K074895K348403K667926L050510L514299M075855
58199D2914074M761435N612816O678731Q011130R669537J1702217J4097784J6760016
58191A20207740J9551131K2372989K5208273K8051394L0692200L2427991L1987520
58184C10499238K7992537J9871400Q552460l757384j4635901k2508242k6975712
58177B99038396k8470861k7795859k5860476k3509889k1318948j9471295j7858571
58170A34752497j6306845j4727710j3126785j1551748j0055492q679684p447253
$$ plain form
58225 8268920 8613593 8983240 9379268 9805231 10265381 10761859 11296666 11875217 12504722
58216 12504722 13190537 13937659 14754270 15650186 16633692 17714245 18906848 20229937 21701471
58207 21701471 23342362 25182186 27257081 29605484 32273410 35323920 38838219 42914074
58199 42914074 47675509 53288325 59967056 67978186 77647723 89349940 103447724 120207740
58191 120207740 139758871 162131860 187340133 215391527 246083727 278511718 310499238
58184 310499238 338491775 358363175 366915635 363158251 348522350 326014108 299038396
58177 299038396 270567535 242771676 216911200 193401311 172082363 152611068 134752497
58170 134752497 118445652 103717942 90591157 79039409 68983917 60304233 52856980
58163E2856980o365399n433101m641839l974248l410552k935865k538010k202834
58155B1355132j917447j674889j470753j298179j150282j024218r18442q28737
58147A1072185p50642o82852o24565n72382n23325m78110m38023m01236l65534
58138F235516l32000l02603k76538k52301k31064k14744k02547j92392j83921
58129D047406j77197j70322j61376j51276j42094j33796j25141j16401j08719
58120B761084j01997r5595q9980q5610q1383p6142p0566o5825o1668n7512n4031
58109A920775n1789m9712m6888m4544m4293m5478m6201m5949m5440m4805m3695
58098A411981m2283m0568l7550l2732k7490k3429k0335j7243j4542j3302j3361
$$ plain form
58163 52856980 46491581 41058480 36416641 32442393 29031841 26095976 23557966 21355132
58155 21355132 19437685 17762796 16292043 14993864 13843582 12819364 11900922 11072185
58147 11072185 10321543 9638691 9014126 8441744 7918419 7440309 7002286 6601050 6235516
58138 6235516 5903516 5600913 5324375 5072074 4841010 4626266 4423719 4231327 4047406
58129 4047406 3870209 3699887 3538511 3387235 3245141 3111345 2986204 2869803 2761084
58120 2761084 2659087 2563492 2473512 2387902 2306519 2230377 2159811 2093986 2032318 1974806 1920775
58109 1920775 1868986 1819274 1772386 1727842 1683549 1638071 1591870 1545921 1500481 1455676 1411981
58098 1411981 1369698 1329130 1291580 1258848 1231358 1207929 1187594 1170351 1155809 1142507 1129146
58087A129146j3677j3926j4338j4661j4700j5082j6167j7049j6946j6682j7315
58076I58603j8258j8346j7909j8085j8728j8796j8303j8076j7919j6779j4716
58065G62688j3093j2583j2319j1337r843q710q390q563q506p802o980p017q054
58052F39491r161r675r897j0003r328p595n926n525o062o372o144n887n723n379
58038E36814n045n232n900o485o614o292n660n088n077n653o290o767p418q236
58024D51057q541q068p494p288o980o152n218m501l567k294j578k035k901l116
58010C81324k639j819m98J148K024J599J026J485K317K185J315R64J323J606J774
57995C95134K495L525L718K707J351L47m74j450k579l755m736n045m614m207m434
$$ plain form
58087 1129146 1115469 1101543 1087205 1072544 1057844 1042762 1026595 1009546 992600 975918 958603
58076 958603 940345 921999 904090 886005 867277 848481 830178 812102 794183 777404 762688
58065 762688 749595 737012 724693 713356 703513 694803 686413 677850 669344 661542 654562 647545 639491
58052 639491 630330 620655 610758 600755 591427 583832 577906 572381 566319 559947 553803 547916 542193 536814
58038 536814 531769 526537 520637 514152 507538 501246 495586 490498 485421 479768 473478 466711 459293 451057
58024 451057 442516 434448 426954 419666 412686 406534 401316 396815 393248 390954 389376 387341 384440 381324
58010 381324 378685 376866 376368 377516 379540 381139 382165 383650 385967 388152 389467 390431 391754 393360 395134
57995 395134 397629 401154 404872 407579 408930 409277 408803 407353 404774 401019 396283 391238 386624 382417 377983
57980C77983m781m449l683l258l211l076k850k671k018n17R34J196O51N56J008
57965C51814J032N24M32R94J354J145R92J075O23o48j836k245k449l280m495n117
57949C39915m564l124j630q38p09l70P19J882K212K052K513L678M593M965N601
57934C56895O801P727P805P645P813P657O143L308J34k556m531n898o933p932
57920C84078q848r271q958q166p361o875o760o714o141m778l106j794q91r4M12
57905C04733J75o04j191j409j753k388k797k728k605k661k440j592n37J27M69
57890B82799R19J560K093K342K371K230J863J260O34L81P45J406J681J329R20
57875C04533J052J536J765J607J422J434J650K148K871L381L389L295L646M291
$$ plain form
57980 377983 373202 368753 365070 361812 358601 355525 352675 350004 347986 347469 348403 349599 350250 350806 351814
57965 351814 352846 353370 353802 354796 356150 357295 358287 359362 359985 359337 357501 355256 352807 349527 345032 339915
57949 339915 335351 332227 330597 329759 329050 328680 329399 331281 333493 335545 338058 341736 346329 351294 356895
57934 356895 363696 371423 379228 386873 394686 402343 408486 411794 411928 409372 404841 398943 392010 384078
57920 384078 375230 365959 357001 348835 341474 334599 327839 321125 314984 310206 307100 305306 304415 304321 304733
57905 304733 304908 304304 303113 301704 299951 297563 294766 292038 289433 286772 284332 282740 282203 282330 282799
57890 282799 283718 285278 287371 289713 292084 294314 296177 297437 298071 298452 299197 300603 302284 303613 304533
57875 304533 305585 307121 308886 310493 311915 313349 314999 317147 320018 323399 326788 330083 333729 338020
57861C38020M680M766M868M969M851M693M741M632L872K816K276K303K256J884
57847C91627J416P00o22k158l065l366l862m639m836m151l417l272l326l046k517
57832C51466j870r19J45O26M41M67J319K493L284L646L673L067J873R44R52J488
57816C73095J793J746J524J020K82k3N54J302J040n59k808m884o291o829o791
57801C54171o909p567q266q255p466o389n257l914k390j136o62j058j792j955
57787B91155j044M04J303J278J022J346K312L440M304M655M487M203M266M534
57773C27665M412L795L248L040K682J697K91j102k330l309l871m147m504m813
57759C22754m472l446k571k391k395j979j306o47L60J955L415L844L489L395M013
$$ plain form
57861 338020 342700 347466 352334 357303 362154 366847 371588 376220 380092 382908 385184 387487 389743 391627
57847 391627 393043 393743 393121 390963 387898 384532 380670 376031 371195 367044 363627 360355 357029 353983 351466
57832 351466 349596 348677 348822 349448 349889 350356 351675 354168 357452 361098 364771 367838 369711 370655 371607 373095
57816 373095 374888 376634 378158 379178 379460 379437 379991 381293 382333 381774 378966 374082 367791 360962 354171
57801 354171 347262 339695 331429 323174 315708 309319 304062 300148 297758 296622 295960 294902 293110 291155
57787 291155 290111 290515 291818 293096 294118 295464 297776 301216 305520 310175 314662 318865 323131 327665
57773 327665 332077 335872 339120 342160 344842 346539 346830 345728 343398 340089 336218 332071 327567 322754
57759 322754 318282 314836 312265 309874 307479 305500 304194 303547 303907 305862 309277 313121 316610 320005 324018
57744C24018M863N396N536N415N105M594L814K780J860J556J862K214K236K008
57730C73257J583R13M21P14J420J326J45q51p05j82l99j035j105p14p11j099j158
57713C71820q94j074j861k540k632k333j889j399j142j263j250n80K28K67k21
57698C53237KJ420L144M219M528M214L243J876P75K85J54K19O78J415J852J710
57682C82971J398J371J711K519M034O053P981R800J2327J6114K0630K5007K9088
57669E21004L3299L7918M2888M7800N1437N1569M5944L3784J6411l295k1925l6683
57657H20151m6215n0661n0946m8188m3619l8432l3297k8262k3352j8973j5438
57646D22768j2476r630p001n124m152l587k896k105j575j394j211p63k64j43m48
$$ plain form
57744 324018 328881 334277 339813 345228 350333 354927 358741 361521 363381 364937 366799 369013 371249 373257
57730 373257 374840 375753 376174 376888 378308 379634 379779 378928 378223 378041 377642 376607 375502 374788 374077 372978 371820
57713 371820 370926 369852 367991 365451 362819 360486 358597 357198 356056 354793 353543 352963 353191 353458 353237
57698 353237 353239 354659 357803 362022 366550 370764 374007 375883 376658 376943 377097 377316 377994 379409 381261 382971
57682 382971 384369 385740 387451 389970 394004 400057 408038 417838 430165 446279 466909 491916 521004
57669 521004 554303 592221 635109 682909 734346 785915 831859 865643 882054 878759 856834 820151
57657 820151 773936 723275 672329 624141 580522 542090 508793 480531 457179 438206 422768
57646 422768 410292 400662 393661 388537 384385 380798 377902 375797 374222 372828 371617 370854 370590 370447 369999
57631C69999q39j124j504k044k308j865r89m11m44o79o08k08K13M69O02O67O31
57614C59558N03N00R13J698K305K203J530R12O18L55K3N2O37J194J132P82Q29
57597C75744J149R76J20p36j045j034j091j077o38J69Q35R01L15n46j144j171
57581C71727o93O5R08J485J372N68k59n42m92o32q90p81l17j6j1J38N86Q27M85
57562C73528pJ03J019K254L178L455L193K800K607K604K711L125M072N239N886
57547D15767N605M609L336K149J449J529K100K392K006J371J168J575K274K902
57533D50232L212L095K650K145J762J514J508J957K770L404L450L216L334L859
57519D88108M050L320K107J569K356L963N354N965N863N274M388L572L167L007
$$ plain form
57631 369999 369160 368036 366532 364488 362180 360315 359326 358915 358471 357792 357184 356976 357189 357658 358260 358927 359558
57614 359558 360061 360561 361474 363172 365477 367680 369210 370122 370740 371095 371118 371170 371807 373001 374133 374915 375744
57597 375744 376893 377869 377989 377253 376208 375174 374083 373006 372368 372537 373372 374273 374588 374042 372898 371727
57581 371727 371034 371099 372007 373492 374864 375432 375173 374631 374139 373507 372617 371836 371519 371503 371492 371630 372216 373043 373528
57562 373528 373521 373624 374643 376897 380075 383530 386723 389523 392130 394734 397445 400570 404642 409881 415767
57547 415767 421372 425981 429317 431466 432915 434444 436544 438936 440942 442313 443481 445056 447330 450232
57533 450232 453444 456539 459189 461334 463096 464610 466118 468075 470845 474249 477699 480915 484249 488108
57519 488108 492158 495478 497585 499154 501510 505473 510827 516792 522655 527929 532317 535889 539056 542063
57505E42063K662K244K370L097L592L241K492K026J789J458J361J965K848L077
57491E76285K518J948J910K267K839L618M267M227L563L084L299L878M341M716
57477F22760N217N699N806N341M388L257K406K065K003J988K284L211M328M734
57463F75487M165L277K776K923L735M961N859N829N392N646O603O996O130M962
57449G44741M758N514O342O814P113P324P401P575Q149Q907R312R112Q451P576
57435H49089O790O479O683O913O795O678P160Q122Q753Q557P896P497P632P999
57421I53043Q222Q344Q709R370R829R574Q788Q185Q209Q740R485J0236J0741J0830
57407A082305J0766J0916J1029J0455R277Q589R120J0153J0376R587Q939R455
$$ plain form
57505 542063 544725 546969 549339 552436 556028 559269 561761 563787 565576 567034 568395 570360 573208 576285
57491 576285 578803 580751 582661 584928 587767 591385 595652 599879 603442 606526 609825 613703 618044 622760
57477 622760 627977 633676 639482 644823 649211 652468 654874 656939 658942 660930 663214 666425 670753 675487
57463 675487 679652 682929 685705 688628 692363 697324 703183 709012 714404 720050 726653 733649 739779 744741
57449 744741 749499 755013 761355 768169 775282 782606 790007 797582 805731 814638 823950 833062 841513 849089
57435 849089 855879 862358 869041 875954 882749 889427 896587 904709 913462 922019 929915 937412 945044 953043
57421 953043 961265 969609 978318 987688 997517 1007091 1015879 1024064 1032273 1041013 1050498 1060734 1071475 1082305
57407 1082305 1093071 1103987 1115016 1125471 1134748 1143337 1152457 1162610 1172986 1182573 1191512 1200967
57395A200967J0825J1833J1782J1211J1149J1868J2710J3197J3693J4572J5326
57384A339133J5270J4838J5150J6354J7353J7369J6814J6335J5879J5260J4847
57373A514602J5021J5478J5691J5581J5266J4599J3578J2703J2383J2347J2193
57362A669442J2166J2788J3948J4982J5526J5809J6205J6826J7553J8123J8296
57351A841664J8143J7977J7969J8013J8141J8648J9596K0562K1055K0931K0255
57340B052954J9251J8479J8510J9222J9869K0145K0482K1144K1697K1777K1676
57329B275206K1712K1658K1357K1232K1536K1760K1494K1305K1955K3166K3964
57318B516345K3989K3716K3655K4001K4779K5748K6321K6283K6187K6531K6914
$$ plain form
57395 1200967 1211792 1223625 1235407 1246618 1257767 1269635 1282345 1295542 1309235 1323807 1339133
57384 1339133 1354403 1369241 1384391 1400745 1418098 1435467 1452281 1468616 1484495 1499755 1514602
57373 1514602 1529623 1545101 1560792 1576373 1591639 1606238 1619816 1632519 1644902 1657249 1669442
57362 1669442 1681608 1694396 1708344 1723326 1738852 1754661 1770866 1787692 1805245 1823368 1841664
57351 1841664 1859807 1877784 1895753 1913766 1931907 1950555 1970151 1990713 2011768 2032699 2052954
57340 2052954 2072205 2090684 2109194 2128416 2148285 2168430 2188912 2210056 2231753 2253530 2275206
57329 2275206 2296918 2318576 2339933 2361165 2382701 2404461 2425955 2447260 2469215 2492381 2516345
57318 2516345 2540334 2564050 2587705 2611706 2636485 2662233 2688554 2714837 2741024 2767555 2794469
57307B794469K6678K6038K5695K5691K5533K5281K5553K6446K7264K7464K7256
57296C083368K7152K7440K8117K8919K9409K9429K9345K9536K9965L0621L1859
57285C405160L3692L5251L5737L5589L5867L6865L8241M0140M3032M6588M9885
57274C836047N2789N5894N8980O0763O0676N9760N9149N8637N7487N5976N5181
57263D471339N5597N6664N7615N8267N8922N9776O0495O0469N9675N9028N9486
57252E117333O0908O2294O3062O3446O3574O3042O1646N9942N8667N8019N7835
57241E789768N8001N8398N8882N9562O0646O1753O1851O0335N7803N5339N3368
57230F435706N1555M9587M7550M5775M4663M4522M5277M6421M7564M8864N0644
$$ plain form
57307 2794469 2821147 2847185 2872880 2898571 2924104 2949385 2974938 3001384 3028648 3056112 3083368
57296 3083368 3110520 3137960 3166077 3194996 3224405 3253834 3283179 3312715 3342680 3373301 3405160
57285 3405160 3438852 3474103 3509840 3545429 3581296 3618161 3656402 3696542 3739574 3786162 3836047
57274 3836047 3888836 3944730 4003710 4064473 4125149 4184909 4244058 4302695 4360182 4416158 4471339
57263 4471339 4526936 4583600 4641215 4699482 4758404 4818180 4878675 4939144 4998819 5057847 5117333
57252 5117333 5178241 5240535 5303597 5367043 5430617 5493659 5555305 5615247 5673914 5731933 5789768
57241 5789768 5847769 5906167 5965049 6024611 6085257 6147010 6208861 6269196 6326999 6382338 6435706
57230 6435706 6487261 6536848 6584398 6630173 6674836 6719358 6764635 6811056 6858620 6907484 6958128
57219F958128N2716N4445N5476N6072N6653N7223N7389N6867N5844N4825N4173
57208G569811N3876N3718N3626N3759N4239N4894N5229N4740N3362N1607N0183
57197H159044M9506M9731N0995N3204N5647N7385N8138N8317N8047N6763N4144
57186H760921N0818M7683M4978M2482M0030L7224L3276K8019K2775J9153J7055
57175I144414J4626J0269L997l036r545j4540j7661j9463k0955k2589k4046k5013
57163I016458k5546k5565k4578k2307j9237j6344j4394j3568j3442j3372j3111
57152H814994j3066j3773j5328j7653k0994k5746l1997l9765m9298o0448p1908
57141H455018q1823q9217r4308r7549r9013r8753r7054r4219r0546q6485q2360
$$ plain form
57219 6958128 7010844 7065289 7120765 7176837 7233490 7290713 7348102 7404969 7460813 7515638 7569811
57208 7569811 7623687 7677405 7731031 7784790 7839029 7893923 7949152 8003892 8057254 8108861 8159044
57197 8159044 8208550 8258281 8309276 8362480 8418127 8475512 8533650 8591967 8650014 8706777 8760921
57186 8760921 8811739 8859422 8904400 8946882 8986912 9024136 9057412 9085431 9108206 9127359 9144414
57175 9144414 9159040 9169309 9173306 9170270 9160725 9146185 9128524 9109061 9088106 9065517 9041471 9016458
57163 9016458 8990912 8965347 8940769 8918462 8899225 8882881 8868487 8854919 8841477 8828105 8814994
57152 8814994 8801928 8788155 8772827 8755174 8734180 8708434 8676437 8636672 8587374 8526926 8455018
57141 8455018 8373195 8283978 8189670 8092121 7993108 7894355 7797301 7703082 7612536 7526051 7443691
57130G443691p8081p3677o9719o6642o3869o0557n6968n4209n2675n1746n0979
57119F764569n0550n0454n0269m9868m9267m7551m2967l4497k2443p259J1264
57108F370708L3307N8612Q7290J20252J58611K03802K58990L29514M21103N37811
57098H580000O81387Q51489J046282J264396J507161J777887K078076K404876
57090B0191554K752228L112677L477228L835416M177231M493212M768946M977290
57082E1785782N075048N006826M715952M162978L348201K324313J184987L2859
57074G7636946j051162k018457k844669l518171m034844m397211m612843m691999
57066E0467590m647322m495703m259047l961871l627467l275741k923374k584130
$$ plain form
57130 7443691 7365610 7291933 7222214 7155572 7091703 7031146 6974178 6919969 6867294 6815548 6764569
57119 6764569 6714019 6663565 6613296 6563428 6514161 6466610 6423643 6389146 6366703 6359444 6370708
57108 6370708 6404015 6462627 6549917 6670169 6828780 7032582 7291572 7621086 8042189 8580000
57098 8580000 9261387 10112876 11159158 12423554 13930715 15708602 17786678 20191554
57090 20191554 22943782 26056459 29533687 33369103 37546334 42039546 46808492 51785782
57082 51785782 56860830 61867656 66583608 70746586 74094787 76419100 77604087 77636946
57074 77636946 76585784 74567327 71722658 68204487 64169643 59772432 55159589 50467590
57066 50467590 45820268 41324565 37065518 33103647 29476180 26200439 23277065 20692935
57058B0692935k268114j981111j725342j500789j305814j137535r92821q69230
57050H912179p64536o75597n98566n30567m70654m18785l74231l35353l00730
57041D443160k69942k43118k20007j99804j81808j65789j51517j38340j25625
57032B747210j13342j01707r0426p8874o6899n4747m2245k8758j4016J941J9535
57021B177672L8718N6038O3687N3663K4109j8310o2162r7462j19548j28896j28564
57010A858945j21829j11393r9593q8287p8329o9746o2622n7287n3471n0016m6065
56999A020307m2017l8838l6701l4899l2743l0070k6970k3559j9878j5797j1010
56988G07825n412O50O581J1838J6026J9000K0811K1141J8979J3620O016j660p938
$$ plain form
57058 20692935 18424821 16443710 14718368 13217579 11911765 10774230 9781409 8912179
57050 8912179 8147643 7472046 6873480 6342913 5872259 5453474 5079243 4743890 4443160
57041 4443160 4173218 3930100 3710093 3510289 3328481 3162692 3011175 2872835 2747210
57032 2747210 2633868 2532161 2441735 2362861 2295962 2241215 2198970 2170212 2156196 2158137 2177672
57021 2177672 2216390 2272428 2336115 2389778 2413887 2395577 2333415 2235953 2116405 1987509 1858945
57010 1858945 1737116 1625723 1526130 1437843 1359514 1289768 1227146 1169859 1116388 1066372 1020307
56999 1020307 978290 939452 902751 867852 835109 805039 778069 754510 734632 718835 707825
56988 707825 702413 703063 709644 721482 737508 756508 777319 798460 817439 831059 837075 835415 827477
56975H27477j2762j6185j7643j7192j6193j5766j5301j3605j0889q446o762n049
56963F71684k559O27M117P744J1440J5094J8446K0722K0562J6786R240j137j2524
56950G80242k2356k8253k9697k8341k6105k3506k0336j6976j3954j0927p308l448
56938E49035q8K930O311J0029J3615J7344K1757K6107K8600K8127K4616J7854
56926G46237P619m666j5947k3980k8833l1537l2412l1394k9072k6400k3760k0958
56914D84897j7911j4925j2442j0747r632q460o866n286m327l732k750j355k65
56901C86199L07J020K317L791M971N949P021Q273R906J2253J5214J8156K0644
56888D96021K2772K4635K6056K6929K7080K5650K1448J4322N656k810r994j5274
$$ plain form
56975 827477 814715 798530 780887 763695 747502 731736 716435 702830 691941 683495 676733 671684
56963 671684 669125 669752 673869 681613 693053 708147 726593 747315 767877 784663 793903 792766 780242
56950 780242 757886 729633 699936 671595 645490 621984 601648 584672 570718 559791 552483 549035
56938 549035 548947 551877 558188 568217 581832 599176 620933 647040 675640 703767 728383 746237
56926 746237 753856 749190 733243 709263 680430 648893 616481 585087 556015 529615 505855 484897
56914 484897 466986 452061 439619 428872 419240 410780 403914 398628 394301 390569 387819 386464 386199
56901 386199 386506 387526 389843 393634 398605 404554 411575 419848 429754 442007 457221 475377 496021
56888 496021 518793 543428 569484 596413 623493 649143 670591 684913 690569 687759 677765 662491
56876F62491j8143j8634j7448j5167j1866p741l489M61M489R138J4369J9894K5690
56863F44044L1692L7469M2666M7369N1358N3241N0808M2351K7772R018j0313k6440
56851A001035l7256m2794m4042m1799l6886l0525k3700j6419q208Q72J0241J9624
56839G50143K9339L9670N0314O0614P0193P9031Q6617R0742Q7491P3323M7915
56828A465392J5125j8789m8037o9189q1455q5818q3878p7244o7758n7463m7605
56817H43281l7873k7357j6159n324M704J4548K4683L4652M3878N2329N9699O4365
56805A055426O3619N4902L7187J2274j5010l8965n6237o6736p1570p1228o6342
56794H37320n8823n0874m3255l5485k7377j9446j2098n315Q83O486J1896J7568
$$ plain form
56876 662491 644348 625714 608266 593099 581233 573492 570003 570464 574953 584091 598460 618354 644044
56863 644044 675736 713205 755871 803240 854598 907839 958647 1000998 1028770 1037788 1027475 1001035
56851 1001035 963779 920985 876943 835144 798258 767733 744033 727614 719406 720278 730519 750143
56839 750143 779482 819152 869466 930080 1000273 1079304 1165921 1256663 1344154 1417477 1465392
56828 1465392 1480517 1461728 1413691 1344502 1263047 1177229 1093351 1016107 948349 890886 843281
56817 843281 805408 778051 761892 756568 761272 775820 800503 835155 879033 931362 991061 1055426
56805 1055426 1119045 1173947 1211134 1223408 1208398 1169433 1113196 1046460 974890 903662 837320
56794 837320 778497 727623 684368 648883 621506 602060 589962 584647 585530 592016 603912 621480
56782F21480K3291K8217L1452L1969K8339J9577O515q258k2031l3125m0672m4258
56770F42496m4315m2188l9226l5895l2140k8199k4573k1376j8294j5304j2902
56759C28084j1363j0204q785p214o125n711n499n147m783m352l404j910p35n82
56745B52270r97j105r22j090j633j930j886k083k658k880k188r05L13J101J284
56730B34691Q10J13j06K97P42P63M94J79q8m7N72J391J612J209J028J368J402
56713B46430N38m87o34m0M03M26N42J008J438J448J182J084J364J749J650Q34
56697B58935j86o94o33m43j64N22J367J557Q57k3n19q00r34m50P32J798K171K299
56679B65392K645K695J910R18P13J121J059P2j293k435l148l233k537j441p13
$$ plain form
56782 621480 644771 672988 704440 736409 764748 784325 790840 782582 760551 727426 686754 642496
56770 642496 598181 555993 516767 480872 448732 420533 395960 374584 356290 340986 328084
56759 328084 316721 306517 297732 290518 284393 278682 273183 268036 263253 258901 255497 253587 252852 252270
56745 252270 251273 250168 249246 248156 246523 244593 242707 240624 237966 235086 232898 231993 232306 233407 234691
56730 234691 235501 235614 235508 235805 236547 237310 237804 237983 237895 237848 238420 239811 241423 242632 243660 245028 246430
56713 246430 246968 246481 245847 245807 246210 246636 247178 248186 249624 251072 252254 253338 254702 256451 258101 258935
56697 258935 258749 258055 257422 256979 256815 257337 258704 260261 261118 261095 260576 259776 258842 258392 259124 260922 263093 265392
56679 265392 268037 270732 272642 273560 274273 275394 276453 276525 275232 272797 269649 266416 263879 262438 261725
56664B61725p28j206j582j427p10N6J45n11j172j241r62p91o97m41j02K06N91
56647B51153R35P32m4n99l97L0Lk09n3J98k6m59l97J23M85N58O25N58O9m74m26
56626B52385M5K16K3MJ02m29j692k689k518j386k34J94k18r53j236p74j15J20
56608B40845M5Q7J22k25p23q09m65o3M40J153J392L60j279j775n36J020J401Q28
56590B41818M97Q69J445J735J698J436R91M80J43K12P21J315J405Q49L11N13J256
56573B57694J760J825K014K611L159L283L288L616M179M730N454O727Q415R908
56559C18663J0825J1421J2157J2874J2536J0048N527O06k816m143m287m485n137
56546C73789n754n701m927m019l544l464l423l406l656l998l965l660l730m131
$$ plain form
56664 261725 260997 259791 258209 256782 256072 256128 256273 255762 254590 253349 252387 251596 250899 250458 250356 250562 251153
56647 251153 252088 252820 252776 252177 251780 251810 251813 251604 251551 251749 251723 251264 250867 250990 251475 252033 252658 253216 253285 252811 252385
56626 252385 252430 252646 252669 252673 252775 252346 250654 247965 245447 244061 243827 244021 243803 242850 241614 240840 240725 240845
56608 240845 240890 240977 241099 240874 240151 239342 238877 238814 239254 240407 241799 242159 240880 239105 238569 239589 240990 241818
56590 241818 242315 243184 244629 246364 248062 249498 250489 250969 251112 251324 252045 253360 254765 255614 255925 256438 257694
56573 257694 259454 261279 263293 265904 269063 272346 275634 279250 283429 288159 293613 300340 308755 318663
56559 318663 329488 340909 353066 365940 378476 388524 394051 394657 391841 387698 383411 378926 373789
56546 373789 368035 362334 357407 353388 349844 346380 342957 339551 335895 331897 327932 324272 320542 316411
56532C16411l829k361q73o98j514j971j709j610k182k783k670j971j283q84o16
56517B89457k68R0L0p75j877k270j564n59j28j58j15j00m66r00p97k92q1l93r26
56498B77908j535k079j987r32K57M32k66o45k77P2j72o12p43o37m67j71J82L48
56480B68676M37P69J141R54J77n35p82p34m59K09J035J392J159Q61P31M39l7j01
56462B75332N26J204J178M94j98l58O9O58Q11L95P1N14J460K033J858J280O90
56445B88017K62K09N34P08L13j99j57J83P4m19n63l34m83j186j673j417p54j74
56427B82941J61J04l78p73n57j67m44j160j155n0J284K061K347K298J791J037
56411B89340N87M43J10l88m62k7M24Q25J436J833J271J84j75L75Q19Q71J299K085
$$ plain form
56532 316411 312582 310221 309348 308650 307136 305165 303456 301846 299664 296881 294211 292240 290957 290073 289457
56517 289457 289189 289279 289309 288534 286657 284387 282823 282264 282136 281978 281863 281763 281297 280397 279600 279308 279227 278834 277908
56498 277908 276373 274294 272307 271375 271632 272064 271798 271153 270876 270948 270776 270164 269421 268784 268317 268146 268328 268676
56480 268676 269113 269882 271023 271977 272154 271619 270837 270103 269644 269853 270888 272280 273439 274300 275031 275470 275433 275332
56462 275332 275858 277062 278240 278734 278536 278178 278247 278905 279716 280111 280182 280696 282156 284189 286047 287327 288017
56445 288017 288279 288488 289022 289730 290043 289844 289687 289870 289944 289525 288962 288628 288145 286959 285286 283869 283115 282941
56427 282941 283102 283206 282828 282055 281498 281331 280887 279727 278572 278522 279806 281867 284214 286512 288303 289340
56411 289340 289927 290370 290480 290092 289630 289603 290027 290852 292288 294121 295392 295576 295401 295776 296595 297466 298765 300850
56393C00850K113J245Q76J606K120J440N67O45J015N44l41m78J57P44J004J074
56377C15181Q28L87N25J460K039J278j19q56q29o87m02L85J248J493J347J497
56361C24775J860J909J718J718J794J689J745K267K713K452J831J504J278P36
56347C49989L73Q17J442J087p5p07k29O35J168J471J888K501L272M015M303M056
56331C76006L931M398M835M427L558L273L631L696L134K669K786K950K475J515
56317D23284Q23Q39J273J373P04k38m35L95J406J756J591J484J537J656K068K877
56301D42393L571L734L780M263M845M803M247M003M458N203N722N875N838N992
56287E08727O690P759Q581Q927R189R565R722R717J0328J1717J2706J2364J1568
$$ plain form
56393 300850 302963 304208 305084 306690 308810 310250 310817 311462 312477 313021 312680 312202 312359 313103 314107 315181
56377 315181 316009 316396 316921 318381 320420 321698 321579 320723 319894 319207 318805 319190 320438 321931 323278 324775
56361 324775 326635 328544 330262 331980 333774 335463 337208 339475 342188 344640 346471 347975 349253 349989
56347 349989 350362 351179 352621 353708 353633 352926 352697 353332 354500 355971 357859 360360 363632 367647 371950 376006
56331 376006 379937 384335 389170 393597 397155 400428 404059 407755 410889 413558 416344 419294 421769 423284
56317 423284 424107 424946 426219 427592 428296 428058 427623 428018 429424 431180 432771 434255 435792 437448 439516 442393
56301 442393 445964 449698 453478 457741 462586 467389 471636 475639 480097 485300 491022 496897 502735 508727
56287 508727 515417 523176 531757 540684 549873 559438 569160 578877 589205 600922 613628 625992 637560
56274F37560J1877J3422J5048J6149J7154J8404J9676K0903K2385K4169K5943
56263H42690K7706K9960L3142L7220M1791M6387N0852N5711O1791O9294P7643
56252A374187Q6453R5962J06226J16686J26873J36895J46686J55480J62551J67686
56242B675685J70551J70358J66696J59792J49539J35219J16698R4833P0194M2726
56232C952291J3434j5037m0669o3770q5283j04628j20515j32767j41928j47945
56222C113183j50655j50773j49107j45536j40017j33620j27251j20361j12332
56213A883531j04170r7199r1025q4452p7587p1270o5252n8852n2763m8290m5207
56202A087464m2129l8555l4934l1264k7440k4359k2750k1484j9011j5980j4240
$$ plain form
56274 637560 649437 662859 677907 694056 711210 729614 749290 770193 792578 816747 842690
56263 842690 870396 900356 933498 970718 1012509 1058896 1109748 1165459 1227250 1296544 1374187
56252 1374187 1460640 1556602 1662828 1779514 1906387 2043282 2189968 2345448 2507999 2675685
56242 2675685 2846236 3016594 3183290 3343082 3492621 3627840 3744538 3839371 3909565 3952291
56232 3952291 3965725 3950688 3910019 3846249 3760966 3656338 3535823 3403056 3261128 3113183
56222 3113183 2962528 2811755 2662648 2517112 2377095 2243475 2116224 1995863 1883531
56213 1883531 1779361 1682162 1591137 1506685 1429098 1357828 1292576 1233724 1180961 1132671 1087464
56202 1087464 1045335 1006780 971846 940582 913142 888783 866033 844549 825538 809558 795318
56191G95318j3696j2518j0295q534p811o857n011l368k807k664k188j717j690
56178G16162j806j752j569j026K22J617K141J916K041K776L292L362L744M758
56164G35878N857O856Q194R776J0954J1757J2822J4064J4860J5563J7257J9849
56152H83687K2049K3409K4869K7111K9936L3472L8301M4118M9906N5803O3130
56141A295791P2136Q1220Q8922R5192J00098J02674J01720R6818Q8271P7252O6075
56130B266169N7000N0430M5277M0842L6918L2340K5418J6176O509k100r573j5966
56118B549440k1216k6504l4086m4987n8111p1721q4392r4453j00404j02257j01045
56107A810264r6946q9570q0026p0537o1799n2746m3317l5249k9443k4682j9726
$$ plain form
56191 795318 781622 769104 758809 750275 742464 735607 730596 727228 724421 721757 719569 717852 716162
56178 716162 714356 712604 711035 710009 710231 711848 713989 715905 717946 720722 724014 727376 731120 735878
56164 735878 741735 748591 756785 766561 777515 789272 802094 816158 831018 846581 863838 883687
56152 883687 905736 929145 954014 981125 1011061 1044533 1082834 1126952 1176858 1232661 1295791
56141 1295791 1367927 1449147 1538069 1633261 1733359 1836033 1937753 2034571 2122842 2200094 2266169
56130 2266169 2323169 2373599 2418876 2459718 2496636 2528976 2554394 2570570 2577079 2574979 2565406 2549440
56118 2549440 2528224 2501720 2467634 2422647 2364536 2292815 2208423 2113970 2013566 1911309 1810264
56107 1810264 1713318 1623748 1543722 1473185 1411386 1358640 1315323 1280074 1250631 1225949 1206223
56096A206223j4942j1008p766n106l382k259o69J511L228M092M904N926O450O431
56082A193633O878Q083R173R783J0531J1513J2072J2270J2870J3716J4001J4058
56070A328581J4927J6210J6730J7093J8918K1552K2522K1572K1124K2148K2792
56059A544169K1984K1223K1508K1511K0284J9028J8727J8557J8091J8469K0018
56048A763569K1151K1111K1364K2914K4672K5865K7514L0066L2065L2741L3577
56037B056609L5794L8506M0672M2557M4090M4317M3773M4774M8038N1548N3914
56026B544592N6045N8354N9413N8894N8836O0485O2760O5160O8960P4044P7977
56015C245520P9983Q2476Q6870R1289R4309R7495J02122J06817J10517J14437
$$ plain form
56096 1206223 1191281 1180273 1172507 1167401 1164019 1161760 1161091 1162602 1165830 1169922 1174826 1180752 1187202 1193633
56082 1193633 1200511 1208594 1217767 1227550 1238081 1249594 1261666 1273936 1286806 1300522 1314523 1328581
56070 1328581 1343508 1359718 1376448 1393541 1412459 1434011 1456533 1478105 1499229 1521377 1544169
56059 1544169 1566153 1587376 1608884 1630395 1650679 1669707 1688434 1706991 1725082 1743551 1763569
56048 1763569 1784720 1805831 1827195 1850109 1874781 1900646 1928160 1958226 1990291 2023032 2056609
56037 2056609 2092403 2130909 2171581 2214138 2258228 2302545 2346318 2391092 2439130 2490678 2544592
56026 2544592 2600637 2658991 2718404 2777298 2836134 2896619 2959379 3024539 3093499 3167543 3245520
56015 3245520 3325503 3407979 3494849 3586138 3680447 3777942 3880064 3986881 4097398 4211835
56005D211835J19124J23137J26533J31931J40059J48137J54767J62330J72412
55996E490265J83156J93376K04832K17916K29898K40199K52548K68976K86643
55987G567809L03586L22508L45594L70853L97037M26754M61263M97870N36080
55978A1229354N80238O32278O88430P47251Q14125Q93262R82481J080877J194036
55969A8842332J326503J477076J647345J846465K081869K354899K672380L052842
55961C5301711L515147M073635M753834N601777O670420Q011533R686784J1756734
55953H9371575J4225796J7002219J9936104K2908021K5886531K8888672L1788806
55946B50007724L3991414L4224971L0883720K2994922J1159142k430947j5043756
$$ plain form
56005 4211835 4330959 4454096 4580629 4712560 4852619 5000756 5155523 5317853 5490265
55996 5490265 5673421 5866797 6071629 6289545 6519443 6759642 7012190 7281166 7567809
55987 7567809 7871395 8193903 8539497 8910350 9307387 9734141 10195404 10693274 11229354
55978 11229354 11809592 12441870 13130300 13877551 14691676 15584938 16567419 17648296 18842332
55969 18842332 20168835 21645911 23293256 25139721 27221590 29576489 32248869 35301711
55961 35301711 38816858 42890493 47644327 53246104 59916524 67928057 77614841 89371575
55953 89371575 103597371 120599590 140535694 163443715 189330246 218218918 250007724
55946 250007724 283999138 318224109 349107829 372102751 383261893 380830946 365787190
55939C65787190k4690271l0681225l3329119l3374209l1623068k8812502k5533581
55932A57743215k2188106j9016664j6155786j3663628j1532818r726101q209354
55925E7250758o949863n904984n033015m307089l706590l205113k778687k416716
55917B2948701k113585j856927j633791j440600j277151j136900j011983r01963
55909A1575801q09253p30586o60398n98142n45348m99595m57592m20274l89075
55900F465538l60929l32421l05213k82314k62452k42925k24562k09138j95187
55891D050397j80812j67563j57291j48184j37887j27601j19251j11593j02830
55882B797385r4226q7411q0999p3416o6306o1687n8498n5432n4317n6980o1232
$$ plain form
55939 365787190 341096919 310415694 277086575 243712366 212089298 183276796 157743215
55932 157743215 135555109 116538445 100382659 86719031 75186213 65460112 57250758
55925 57250758 50300895 44395911 39362896 35055807 31349217 28144104 25365417 22948701
55917 22948701 20835116 18978189 17344398 15903798 14626647 13489747 12477764 11575801
55909 11575801 10766548 10035962 9375564 8777422 8232074 7732479 7274887 6854613 6465538
55900 6465538 6104609 5772188 5466975 5184661 4922209 4679284 4454722 4245584 4050397
55891 4050397 3869585 3702022 3544731 3396547 3258660 3131059 3011808 2900215 2797385
55882 2797385 2703159 2615748 2534749 2461333 2395027 2333340 2274842 2219410 2165093 2108113 2046881
55871B046881o3653o4073o4017o2966n9772n5678n2584m9996m6708m3655m2143
55860A441636m1088l8895l6385l5110l4423l2877l0823k9114k7036k4015k1612
55849A090258k1340k2167k2507k2829k3991k4961k4608k3839k3614k2871k0797
55838H36734j8974j8712j8462j6627j4782j4957j5796j4770j2515j1498j1757
55827F67884j1363j0088r304q964p897o507o316p261q012q408r106r505q529o956
55813E49668o472o947o917o167n602n084l763j961n96O80K649M576N291N485O547
55798E31387P826P477N529L598K012k47k966m660n133n772p122q268q745r033
55784E05883r103q386p354p298q360r430j0007j0540j0969j0570r302p771n927
$$ plain form
55871 2046881 1983228 1919155 1855138 1792172 1732400 1676722 1624138 1574142 1527434 1483779 1441636
55860 1441636 1400548 1361653 1325268 1290158 1255735 1222858 1192035 1162921 1135885 1111870 1090258
55849 1090258 1068918 1046751 1024244 1001415 977424 952463 927855 904016 880402 857531 836734
55838 836734 817760 799048 780586 763959 749177 734220 718424 703654 691139 679641 667884
55827 667884 656521 646433 637129 628165 620268 613761 607445 600184 592172 583764 574658 565153 556624 549668
55813 549668 543196 536249 529332 523165 517563 512479 508716 506755 506159 506839 509488 514064 519355 524840 531387
55798 531387 539213 546690 552219 555817 557829 557582 554616 549956 544823 539051 531929 523661 514916 505883
55784 505883 496780 488394 481040 473742 465382 455952 445945 435405 424436 413866 404564 396793 390866
55771C90866l301l72J918L712N707P257O841M391J463q56k693m161n001n508o243
55756C94020o885o779o394o690p412p654p777q813j0234j0361r038p777p095n904
55742B85207l928k542k528k854k606k350k654k840k294j712j944k554k573j926
55728B49902j289j109j379j917k404k606k727l077l429l357l057k976k805j852
55714B15918l68O74J043J467K283L056L613M302M942M733L494K024R38N4q67j781
55698B45525k900m534o166o731o082n198m722m294l609l056k831k392j293J65
55684A91882J464K434L057L385L765M468N090N051M523M032L359J981M44q8L35
55669B35182M32l02r71j029j126j668j944j463r09r32j013m52M22R39J186J598
$$ plain form
55771 390866 387565 387193 389111 392823 398530 405787 412628 417019 418482 417626 414933 410772 405771 400263 394020
55756 394020 387135 380356 373962 367272 359860 352206 344429 335616 325382 315021 305983 298206 291111 285207
55742 285207 281279 278737 276209 273355 270749 268399 265745 262905 260611 258899 256955 254401 251828 249902
55728 249902 248613 247504 246125 244208 241804 239198 236471 233394 229965 226608 223551 220575 217770 215918
55714 215918 215550 216224 217267 218734 221017 224073 227686 231988 236930 241663 245157 247181 248119 248173 247306 245525
55698 245525 242625 238091 231925 225194 219112 213914 209192 204898 201289 198233 195402 193010 191717 191882
55684 191882 193346 195780 198837 202222 205987 210455 215545 220596 225119 229151 232510 234491 234935 234847 235182
55669 235182 235614 235312 234341 233312 232186 230518 228574 227111 226202 225270 224257 223805 224227 225166 226352 227950
55653B27950K076K276K195J895J193K52k58j00L2m81j377k211l116m194m895m784
55637B16453m384m456m949n350n581n879o073n787n015l983k734j400m77k92m67
55622A59626n02m57n69n70j47L08J31o03j214j522j987k744l101k407r77J34J83
55605A43582o08j375j520j267j202j397j317o87r0l02j237j961j782j003m69n93
55589A26772j051j376j478j441j099k86O28R77P02L92L40J69k15j00R97K390L097
55572A29418L156L247L463L452L466M105N135N524M835L575K139M23j356k464
55558A68118k672k616k819l111l283l500l692l400k608k004j961k023j775j461
55544A31193j225o19N45J524J591J092Q56J069J376J619J776J570Q87K50J83L65
$$ plain form
55653 227950 230026 232302 234497 236392 237585 237837 237579 237479 237511 237030 235653 233442 230326 226132 221237 216453
55637 216453 212069 207613 202664 197314 191733 185854 179781 173994 168979 164996 162262 160862 160385 160093 159626
55622 159626 159124 158667 158098 157528 157381 157689 157820 157217 156003 154481 152494 149750 146649 144242 143265 143399 143582
55605 143582 142974 141599 140079 138812 137610 136213 134896 134209 134119 133817 132580 130619 128837 127834 127365 126772
55589 126772 125721 124345 122867 121426 120327 120041 120669 121646 122348 122740 123080 123249 123034 122934 123931 126321 129418
55572 129418 132574 135821 139284 142736 146202 150307 155442 160966 165801 169376 171515 171938 170582 168118
55558 168118 165446 162830 160011 156900 153617 150117 146425 143025 140417 138413 136452 134429 132654 131193
55544 131193 129968 129349 129894 131418 133009 134101 134957 136026 137402 139021 140797 142367 143254 143504 143687 144052
55528A44052J25m88q46q27j015j738k543k828k528k026j686j670j926k218k309
55513A19529k176k032k124k520k979l077k563j663q26k23K53N51M43M1j20J90
55497A00704N15L67rqL71M47j85j004j144m96J08r5q20j057l59N99R50O61L32
55478I9877K14L0l87p37o26N7J049J804J799J077L13K3p5n26j249j671j573j176
55460I8223o28rK87p0o43n89J95R89J319J435J619J703J479R51J16r50j708j555
55442A02164p34j95l80p80p55k38N45J331J635J072N8m50j96J00j54p61j333j788
55424I9141j953j495n72R2J79J15J97J33j56j14N38J242J415J220J036P77K70
55407A02065k67n62o22m54K7M96L70k72p05p24q85j297j198k82O41R43J057J301
$$ plain form
55528 144052 144177 143689 142843 142016 141001 139263 136720 133892 131364 129338 127652 125982 124056 121838 119529
55513 119529 117353 115321 113197 110677 107698 104621 102058 100395 99569 99346 99599 100150 100593 100634 100514 100704
55497 100704 101219 101586 101577 101569 101940 102387 102202 101198 100054 99558 99666 99571 98751 97694 97335 97934 98884 99545 99877
55478 99877 100091 100121 99734 98997 98371 98428 99477 101281 103080 104157 104470 104493 104418 103892 102643 100972 99399 98223
55460 98223 97595 97586 97873 97803 97160 96571 96766 97755 99074 100509 102128 103831 105310 106261 106377 105427 103719 102164
55442 102164 101430 101235 100855 100075 99320 99082 99627 100958 102593 103665 103723 103273 103077 103177 103023 102262 100929 99141
55424 99141 97188 95693 95121 95213 95392 95507 95704 95837 95681 95567 96105 97347 98762 99982 101018 101795 102065
55407 102065 101798 101236 100614 100160 100187 100683 101053 100781 100076 99352 98467 97170 95972 95690 96331 97274 98331 99632
55389I9632J037m2q48m20M75N55J09K86R72J001K59j24K65M85p0p08o86l61m35
55370A01382q41r77o03l9L11L09J36J33M45Q58J071J002O32r1r17j270q70j34
55352A00537L83N85N04jp64j081o19l9p8m61m86j51M1M8J80L21J35k51n23q25
55332I7455j309j460p89J65N10L73M78P00K62p10j114n65J13K28O3M3Q5J63N60
55313I5251J183J398R48K93j58m37m50Q5Q76J117O22J25R5Q4l11o86n20N6P01
55294A00272J362J847J583M23q51j385j149n89N9O16P22K73k68m95n34n30k41
55277A01115L23M55k93j195j111k7R16Q43J3p25q28l58L15R13J418J790J669P68
55259A06001m45r80n15K44N78O59R56J322J291R34P37Q36Q54M98j63q74j313j184
$$ plain form
55389 99632 100669 100627 99779 99359 99834 100389 100498 100784 101756 102757 103016 102892 103157 103642 103572 102864 102178 101817 101382
55370 101382 100541 99564 98961 98922 99233 99542 99678 99811 100256 101114 102185 103187 103819 103728 102811 101541 100671 100537
55352 100537 100920 101505 102009 102008 101244 100163 99544 99505 99427 98966 98480 98329 98370 98418 98598 98919 99054 98803 98280 97455
55332 97455 96146 94686 93897 94062 94572 94945 95423 96123 96385 95675 94561 93996 94109 94337 94400 94443 94528 94691 95251
55313 95251 96434 97832 98780 99073 98915 98478 98028 98113 98989 100106 100728 100853 100948 101032 100721 100035 99515 99571 100272
55294 100272 101634 103481 105064 105487 104636 103251 102102 101513 101572 102188 102910 103183 102915 102420 101886 101356 101115
55277 101115 101438 101893 101600 100405 99294 99267 100183 101026 101039 100314 99486 99128 99443 100356 101774 103564 105233 106001
55259 106001 105556 104576 104061 104305 104883 105542 106498 107820 109111 110045 110782 111618 112472 112970 112807 111933 110620 109436
55241A09436n42J04L23K18R3q4m32p44p84p64r99j224r14j94J72k03q76j321j542
55222I9723j683j500p17M25J312J611J461J084N74J04m6J63L77K93J48M19J063
55205A04811J426J066L61j4M3N1l01p70r27o08K8O07P38L88K5J39N52N85o6r39
55185A07195j371j126m14L72P81N63j3l34j22K83L97J55j47k07N8M64O29M19K37
55166A07819N79J192J266N92j7J79Q00R15L62r6J38P16Q26J61p62j191r33n12
55148A12034m51o16n03l7L42L60K14N9k88q33j114p53j7M87M73M2m98o60k0J199
55128A09420K033J706M94o60j125q94k94J72K3o38r82l75O86J116O35j0j23J95
55110A11379M64M65L00J95M05R51J391J220N97K46M64O78K63m77o07L19J697K451
$$ plain form
55241 109436 108894 108998 109321 109539 109632 109548 109116 108372 107588 106824 105825 104601 103687 103493 103665 103462 102586 101265 99723
55222 99723 98040 96540 95823 96248 97560 99171 100632 101716 102290 102394 102348 102511 102888 103181 103329 103748 104811
55205 104811 106237 107303 107664 107650 107693 107744 107443 106673 105746 105138 105166 105773 106511 106899 106924 107063 107615 108200 108134 107195
55185 107195 105824 104698 104284 104656 105437 106000 105987 105653 105531 105814 106211 106366 106219 106012 106070 106534 107163 107582 107819
55166 107819 108398 109590 110856 111448 111431 111610 112410 113325 113687 113591 113729 114445 115271 115432 114670 113479 112546 112034
55148 112034 111583 110967 110464 110427 110769 111129 111343 111402 111114 110281 109167 108414 108397 108884 109357 109399 108901 108241 108221 109420
55128 109420 111453 113159 113653 112993 111868 110974 110680 110852 110875 110237 109255 108880 109566 110682 111317 111307 111184 111379
55110 111379 111843 112308 112608 112803 113208 114159 115550 116770 117367 117613 118077 118755 119018 118541 117934 118253 119950 122401
55092A22401K063R80J75J99P11J015R12P97R58J133Q93K04o22j286j512r88K78
55075A28311J579J969J271K65k75m15o07p59m13K55L41n43j483j355l22M01J87
55058A28407l54n00m24o55j056j067o47l23l18j81M43J145J177L84n92j033q22
55041A23584l61oK16M01N31N54N23M02m4r39j890k254j886j240p22j96O03J507
55023A18783K031J938J405P52J67k98o68r65j123j015o36j56K42M79N31M07K38
55006A22112J49M5k31n12l92J58O00N41L01M59J045J542J547J085M00j88k69L57
54988A28749J291J686J073j01q72o68J29N89J92o01r52p18n69q84j040k69J096
54971A28131J881J546P80M93O89P31L03k97o63p08n23j55L06O20O02L67K27K80
$$ plain form
55092 122401 124464 125444 125619 125818 126529 127544 128456 129253 130211 131344 132237 132441 131819 130533 129021 128033 128311
55075 128311 129890 131859 133130 133395 133120 132705 132098 131339 130926 131181 131522 130979 129496 128141 127819 128220 128407
55058 128407 128053 127553 127129 126474 125418 124351 123704 123381 123063 122882 123325 124470 125647 126031 125439 124406 123584
55041 123584 123223 123217 123433 123834 124365 124919 125442 125844 125800 124861 122971 120717 118831 117591 116869 116673 117276 118783
55023 118783 120814 122752 124157 124909 125076 124778 124110 123145 122022 121007 120371 120215 120457 120936 121467 121874 122112
55006 122112 122261 122306 122075 121563 121171 121329 121929 122470 122771 123230 124275 125817 127364 128449 128849 128661 128392 128749
54988 128749 130040 131726 132799 132698 131826 131158 131287 131876 132068 131467 130515 129797 129228 128344 127304 127035 128131
54971 128131 130012 131558 132338 132831 133520 134251 134554 134257 133594 132886 132363 132208 132514 133134 133736 134103 134330 134610
54953A34610L07J15j95m09m84m87l93k16j69l72m61N3R80J482J097L50M3K18K62
54934A36331j15m80k87M16J057J276J328J660K223K524K459K599L277L880L771
54919A61919L550M436O354P737P518O276M917L303J075j152k520l320m365n455
54905A90273n718n257n114n479n300m008k472j715j687j837k050k261j962q88
54891A44525L22R13J028J275J647J672J362J237J483J798K082K566L235L659L683
54876A72487L758M352N318O061O147N510M323K845J331j03j526l027m473n508
54862A97495n861n668n433n509n634n208m046k722k000k088k558k842k693k255
54848A42978j856j712j718j616j395j348j628j950j910j444p88j09N87J245J673
$$ plain form
54953 134610 134917 135032 134837 134428 133944 133457 133064 132848 132679 132307 131846 131899 132879 134361 135458 135808 135851 136069 136331
54934 136331 136216 135736 135449 135865 136922 138198 139526 141186 143409 145933 148392 150991 154268 158148 161919
54919 161919 165469 169905 176259 183996 191514 197790 202707 206010 207085 205933 203413 200093 195728 190273
54905 190273 184555 179298 174184 168705 163405 159397 156925 155210 153523 151686 149636 147375 145413 144525
54891 144525 144847 145760 146788 148063 149710 151382 152744 153981 155464 157262 159344 161910 165145 168804 172487
54876 172487 176245 180597 185915 191976 198123 203633 207956 210801 212132 212029 210503 207476 203003 197495
54862 197495 191634 185966 180533 175024 169390 164182 160136 157414 155414 153326 150768 147926 145233 142978
54848 142978 141122 139410 137692 136076 134681 133333 131705 129755 127845 126401 125613 125504 126091 127336 129009
54833A29009J647J044j1r65j052K1J578K438J966N62p95j332r60k14J63j93r54
54816A31952j429j203m85J39K00k84q11q20j67Q24J715K192J981J031r3m18L55
54799A34679J316J331M11m70p02n65m40k94n2J64M14R06J307Q15o31j833j675
54782A34681m91N60J013J219J341J220J068J346J849J900J560J763K867L967M159
54767A60022L790L733M098M389M544M952N614N973N551M311K456M14j170j957
54753B06720k414l298m653n779o110n647m662l523k783k803l198l144k395j502
54739A54809r82q30q66r92r12k80O39J111J014J085J705K162J797J161J262K088
54723A63971K810L186L825N003O135O539O155N264M052K709J462K57j218k982
$$ plain form
54833 129009 130656 131700 131689 130724 129672 129693 131271 133709 135675 136237 135442 134110 133150 132936 133099 132906 131952
54816 131952 130523 129320 128835 128974 129174 128890 128079 127259 127092 127916 129631 131823 133804 134835 134742 134324 134679
54799 134679 135995 137326 137737 137267 136565 136000 135560 135266 135214 135378 135792 136698 138005 138820 138189 136356 134681
54782 134681 134190 134750 135763 136982 138323 139543 140611 141957 143806 145706 147266 149029 151896 155863 160022
54767 160022 163812 167545 171643 176032 180576 185528 191142 197115 202666 206977 209433 209847 208677 206720
54753 206720 204306 201008 196355 190576 184466 178819 174157 170634 167851 165048 161850 158706 156311 154809
54739 154809 153827 152997 152131 151139 150227 149947 150586 151697 152711 153796 155501 157663 159460 160621 161883 163971
54723 163971 166781 169967 173792 178795 184930 191469 197624 202888 206940 209649 211111 211368 210150 207168
54709B07168m566n559o030o142n803m968m004l371l093k878k616k431k301k039
54695A51367j651j387j320j142o22j5K31Q9n5l3j35n53r09p71l92n00j285k095
54677A38822k258j837j363j100r11o00j21M81J107J602J907K054J972J434M74
54662A41663m02o75m31k23m50r63j301j119m54K44M65J38k83l67j72k7n1j42k43
54643A35207l35k92l8K14J39l17q75j168r54k34O80J341J581J553J294O55k08
54626A38243o84n08k22l66n92k75L49M15k53q78q52l89J13O83J411K029K197J853
54608A42274J102J16p08q71l53K93N38L11j92o99p91k31N00N38j67o52k55L86
54590A41139L36k57m29J28P53Q65O57N40M81J98k93o79p49n92m22l27k29p6N2
$$ plain form
54709 207168 202602 197043 191013 184871 179068 174100 170096 166725 163632 160754 158138 155707 153406 151367
54695 151367 149716 148329 147009 145867 145245 145230 145461 145550 145495 145462 145327 144774 143865 143094 142702 142202 140917 138822
54677 138822 136564 134727 133364 132264 131353 130753 130632 131113 132220 133822 135729 137783 139755 141189 141663
54662 141663 141261 140586 140155 139932 139482 138519 137218 136099 135645 135889 136354 136492 136209 135842 135670 135643 135592 135450 135207
54643 135207 134872 134580 134542 134756 134895 134578 133703 132535 131581 131347 132027 133368 134949 136502 137796 138451 138243
54626 138243 137559 137051 136829 136463 135871 135596 135945 136360 136107 135229 134377 133988 134101 134784 136195 138224 140421 142274
54608 142274 143376 143492 142784 141913 141560 141853 142391 142702 142510 141811 141020 140789 141289 141827 141660 141008 140753 141139
54590 141139 141475 141218 140789 140917 141670 142535 143192 143732 144213 144411 144118 143439 142690 142098 141676 141349 141120 141044 141096
54571A41096N6J2J5r8o22j453k004j787r37P5R35J497J598J207O95N64R08J399
54553A43156J675J575J076L32k18j85K64N34M25M46J067J859J860P97m43p86j48
54536A53286N83O20K1n47m97K60J269J746J108m42j972k590k120j004J69R06R62
54519A51758M73j59p38j346j898j958j351n52q0J80N91J032J180J157J286J357
54503A50932R12J34k82j67l2j61k99l10l62l30J36P09M93n31j100l03J124J848
54485A52411J597J034N23l7n18n76k81l2J05L89Q46J239J477J557J284N77j01
54468A61494k02J29K96K14L86J031J705J975J901J731J550J374J239R37J28j144
54452A74744k200k372j710r61p94j140j305p47K58R15P91J69n59j389k368l133
$$ plain form
54571 141096 141152 141164 141179 141081 140459 139006 137002 135215 134278 134353 135288 136785 138383 139590 140285 140849 141757 143156
54553 143156 144831 146406 147482 147814 147596 147411 147675 148209 148634 149080 150147 152006 153866 154663 154220 153434 153286
54536 153286 153869 154489 154510 153963 153466 153726 154995 156741 157849 157407 155435 152845 150725 149721 149890 150796 151758
54519 151758 152231 152072 151334 149988 148090 146132 144781 144229 144149 144329 144920 145952 147132 148289 149575 150932
54503 150932 151844 151978 151696 151529 151497 151336 151037 150727 150365 150035 150171 150880 151373 150842 149742 149439 150563 152411
54485 152411 154008 155042 155565 155528 155010 154434 154153 154121 154226 154615 155461 156700 158177 159734 161018 161595 161494
54468 161494 161292 161421 161717 161931 162317 163348 165053 167028 168929 170660 172210 173584 174823 175760 175888 174744
54452 174744 172544 170172 168462 167501 166707 165567 164262 163515 163773 164688 165479 165648 165089 163700 161332 158199
54436A58199l201k543j504m07M77Q40O17K24O8O6%R1O34J308J537J418J641K351
54418A61816K772K225J043Q0k41j90k10m52p47q13n50o4M90R54J052N51k52o55
54400A66809m67l52p29q75J37J852K793K412J663J424J326O91j43k85L77J046
54384A77679J049M85j58n56p21q79j176j309o08J183L262M319L877K823K412K862
54368A94544L259K812J839J200J061P77Kp32q16m13j25j74m77j086j897k243j567
54351A95964m59j81j064k111k419k255k346k736k931k753k491k312k024j432p15
54336A67735k99m52r40j215j048p97p95p03P2J393K423K613K189J550P77k6n23
54319A71954m84q0M13P31M33p84k289k696j352P52J997J746O00m40o84m6P97Q32
$$ plain form
54436 158199 154998 152455 150951 150544 151021 151861 152478 152702 152770 152836 152836 152927 153561 154869 156406 157824 159465 161816
54418 161816 164588 166813 167856 167936 167695 167505 167295 166843 166096 165283 164733 164669 165159 166113 167165 167716 167464 166809
54400 166809 166342 165990 165261 164386 164523 166375 169168 171580 173243 174667 175993 176684 176541 176256 176633 177679
54384 177679 178728 179213 179055 178499 177778 176899 175723 174414 173806 174989 178251 182570 186447 189270 191682 194544
54368 194544 197803 200615 202454 203654 204715 205492 205494 204762 203946 203533 203408 203234 202757 201671 199774 197531 195964
54351 195964 195505 195324 194260 192149 189730 187475 185129 182393 179462 176709 174218 171906 169882 168450 167735
54336 167735 167436 166984 166044 164829 163781 162984 162189 161486 161558 162951 165374 167987 170176 171726 172503 172477 171954
54319 171954 171470 171390 171803 172534 172967 172183 169894 167198 165846 166598 168595 170341 170941 170501 169817 169771 170568 171400
54301A71400j04q87l85J076K104J978J227N89J14m06p32m60J97L58n65k013k646
54284A70845j761j40Q46Q64P40R79R76J64q04q51n4M93K75j32j95j51k43o2P68
54265A72557J728J916J201L16q8l5J32K43L59N98J073J670J911J298K2r77r86
54248A82938l36P2q7l52l15j18L0K13M12L06j29l17MJ73l61q38j34J304J707L69
54228A84541j364j920j265k84O32J467J815J287L41k34l75n14o54m84k44m94j058
54211A81193j126m96P7Lm46q11j147j646k045j874j029J65J221J703J449P88K81
54194A76260J21Q1K3J15M14O22N07K20Lq3k0K44N36M98J17q2L21J087J648J769
54174A84401J622J386J145R70Q56O64L41L4k01o09j353k084k292j968j613j539
$$ plain form
54301 171400 171296 170409 170024 171100 173204 175182 176409 176998 177112 176706 175974 175514 175711 176069 175504 173491 170845
54284 170845 169084 168944 169790 170654 171394 172373 173349 173513 172709 171858 171804 172297 172572 172440 172245 172094 171851 171789 172557
54265 172557 174285 176201 177402 177718 177630 177595 177727 177970 178329 178927 180000 181670 183581 184879 184901 183924 182938
54248 182938 182602 182674 182587 182235 181920 181802 181832 182045 182457 182763 182634 182317 182321 182494 182133 181295 181161 182465 184172 184541
54228 184541 183177 181257 179992 179708 180340 181807 183622 184909 185250 185016 184641 184127 183473 182989 182745 182251 181193
54211 181193 180067 179571 179648 179651 179205 178394 177247 175601 173556 171682 170653 170818 172039 173742 175191 175979 176260
54194 176260 176381 176462 176485 176600 177014 177636 178143 178363 178366 178283 178263 178507 179043 179541 179658 179576 179897 180984 182632 184401
54174 184401 186023 187409 188554 189524 190380 191044 191385 191419 191218 190609 189256 187172 184880 182912 181299 179760
54158A79760j563j406j085q01o15m71l11j08J19K24M3l68p01p19m48lN82J172
54140A73301J424J109M61n1k46k46o8M58J226J748J697J291Q83M90P6l4N01J327
54122A85347J592J012K54J05N99J229J700K142K692L206L450L419L401L687M226
54107B18061M580M336L463K170O01j112k590l417l586l428l147k811k678k969
54093B07473l292k895j771q17o12o65l60K9m4l23j35L95M60j10n20j37O54J110
54075A98440J067R41J087J532K102K533K575K139J427Q20O00P31Q13M28m87j575
54059B15173k448k849k521j383M2Q04O20K93O94J641K361K655K889L080K823K164
54043B26038J800K174L012L863M636N343N817N937N876N852N932O116O384O564
$$ plain form
54158 179760 178197 176791 175706 174905 174290 173819 173508 173400 173519 173743 173786 173418 172717 171998 171550 171547 172129 173301
54140 173301 174725 175834 176295 176244 175998 175752 175684 176142 177368 179116 180813 182104 182987 183477 183553 183519 184020 185347
54122 185347 186939 187951 188205 188310 188909 190138 191838 193980 196672 199878 203328 206747 210148 213835 218061
54107 218061 222641 226977 230440 232610 233211 232099 229509 226092 222506 219078 215931 213120 210442 207473
54093 207473 204181 201286 199515 198698 198086 197421 197061 197090 197046 196723 196588 196983 197443 197333 196813 196676 197330 198440
54075 198440 199507 200448 201535 203067 205169 207702 210277 212416 213843 214663 215263 215994 216807 217235 216748 215173
54059 215173 212725 209876 207355 205972 206014 206818 207438 207731 208425 210066 212427 215082 217971 221051 223874 226038
54043 226038 227838 230012 233024 236887 241523 246866 252683 258620 264496 270348 276280 282396 288780 295344
54029B95344O452O027N405M632L781L123K775K396J746J296J615K240J967L86
54015C39185j611l011l670l867l655l101k640k646l018l467l869m132m128m012
54001B92358m133m414m337l796l368l461l760l844l730l429k681j607r82j213
53987B47603j610j343n85qL24P20J008Q52O63J194K347L297L746M211N043O016
53971B73478O894P441O868M251L5l799n643n759n399n092m508l615l001l027l248
53956B55876k968k073j088n24l22k8N33R52Q01L50L57J147K283L184L732M141
53940B66353M520M818M962M853M409L808L457L477L429K862K040J712K088K455
53926C15243K086J290J177K347M162N509N984O018O080O217O370O614O917P041
$$ plain form
54029 295344 301796 307823 313228 317860 321641 324764 327539 329935 331681 332977 334592 336832 338799 339185
54015 339185 337574 334563 330893 327026 323371 320270 317630 314984 311966 308499 304630 300498 296370 292358
54001 292358 288225 283811 279474 275678 272310 268849 265089 261245 257515 254086 251405 249798 248816 247603
53987 247603 245993 244650 244065 244057 244381 245101 246109 246961 247624 248818 251165 254462 258208 262419 267462 273478
53971 273478 280372 287813 294681 298932 298967 295168 289525 283766 278367 273275 268767 265152 262151 259124 255876
53956 255876 252908 250835 249747 249223 248901 248873 249406 250358 251159 251509 251866 253013 255296 258480 262212 266353
53940 266353 270873 275691 280653 285506 289915 293723 297180 300657 304086 306948 308988 310700 312788 315243
53926 315243 317329 318619 319796 322143 326305 331814 337798 343816 349896 356113 362483 369097 376014 383055
53912C83055O954O996P352P677P588P184O684N814M160K011K62n71q08r57j091
53897D42310j042r37j215k239l889n470o210o095o009o667p614p847p339p147
53883C72590p805q438p996o734n762n432n060m164l182k748k885l276l862m642
53869C00604n147m729l512k528k654l629m402m273l441k507j893j755k082k565
53855B55487k678k162j363q76r31j265j477j305p77k76l20r46j469j222m15O2
53839B38067k06p22p78k72L50O90P36P53R69J263J168L80p36j368j102k97M13
53822B39308P06O05K15k43l24L90J753K939L076K114R96P59J484K373K824K998
53806B61973L162L089K629K390L111M551N754O281O393O155N358M455M474N488
$$ plain form
53912 383055 390009 397005 404357 412034 419622 426806 433490 439304 443464 445475 445737 445166 444358 443401 442310
53897 442310 441268 440331 439116 436877 432988 427518 421308 415213 409204 402537 394923 387076 379737 372590
53883 372590 364785 356347 348351 341617 335855 330423 325363 321199 318017 315269 312384 309108 305246 300604
53869 300604 295457 290728 287216 284688 282034 278405 274003 269730 266289 263782 261889 260134 258052 255487
53855 255487 252809 250647 249284 248408 247477 246212 244735 243430 242653 242377 242057 241111 239642 238420 238005 238067
53839 238067 237861 237139 236361 236089 236439 237129 237865 238618 239587 240850 242018 242398 241662 240294 239192 238895 239308
53822 239308 240014 240619 240834 240591 240267 240657 242410 245349 248425 250539 251535 252294 253778 256151 258975 261973
53806 261973 265135 268224 270853 273243 276354 280905 286659 292940 299333 305488 310846 315301 319775 325263
53792C25263O118N261L595K509K270K128J763J559J603J478J032N35p7j201k682
53777C51154l716l945m008m569n408n889n851n578n274m948m639m322l809l071
53763B86127k421k138k075j958j839j914k118k219k177k101k016j978k210k735
53749B56228l021k498j368m38j25j02L9K35K48O1k19m96n47j32N09P14K89r5K14
53730B49496Q75J094P76M92M48K79p0l2O51J383J537J360J499J945K083J664J196
53713B66676J251J739K043J709R15L79P75K076L512M228L969L115K285K000K453
53698B99125L362M198M711N045N192M744L532K170J425J272J094O78L87L39J09
53683C37383o00j463j949j811j116j97L60J52m45o28k67l8k93m34J18R52J228
$$ plain form
53792 325263 331381 336642 340237 342746 345016 347144 348907 350466 352069 353547 354579 355114 355037 353836 351154
53777 351154 347438 343493 339485 334916 329508 323619 317768 312190 306916 301968 297329 293007 289198 286127
53763 286127 283706 281568 279493 277535 275696 273782 271664 269445 267268 265167 263151 261173 258963 256228
53749 256228 253207 250709 249341 248903 248778 248676 248715 248950 249198 249259 249040 248544 247997 247865 248374 249088 249377 249282 249496
53730 249496 250371 251465 252241 252733 253181 253460 253390 253358 254009 255392 256929 258289 259788 261733 263816 265480 266676
53713 266676 267927 269666 271709 273418 274333 274712 275487 277563 281075 285303 289272 292387 294672 296672 299125
53698 299125 302487 306685 311396 316441 321633 326377 329909 332079 333504 334776 335870 336548 336935 337274 337383
53683 337383 336783 335320 333371 331560 330444 330247 330607 330759 330314 329686 329419 329381 329088 328654 328772 329724 330952
53666C30952Q35L03m2k73m03l82m27p59j098r36l16K17L80M00N13P46J101J462
53648C32273J371N46l73l36O98J583J568J278J644K433K672K090J411J325J787
53633C51970K342K653K610K350K132K052J908J666J751K376K900K545J631J297
53619C82183J911K617K747K789L355L978L812L065K770L334M113M502M560M458
53605D30194M084L441K811K291J729J339J720K776L372K626J078o3m58p28j267
53590D54945j838k203k482k715k658k171j475r69j018j777k801l139k422j595
53576D25682j783k606k643j571o70p78j011l04P39P09m65j474j486r70o15m38
53560D10316k14qN6Q1J08N1M7M58J255J825J736J314J183J445J723J805J870K114
$$ plain form
53666 330952 331787 332090 332048 331775 331372 330990 330563 329804 328706 327770 327454 327671 328051 328451 328964 329710 330811 332273
53648 332273 333644 334190 333817 333481 334179 335762 337330 338608 340252 342685 345357 347447 348858 350183 351970
53633 351970 354312 356965 359575 361925 364057 366109 368017 369683 371434 373810 376710 379255 380886 382183
53619 382183 384094 386711 389458 392247 395602 399580 403392 406457 409227 412561 416674 421176 425736 430194
53605 430194 434278 437719 440530 442821 444550 445889 447609 450385 453757 456383 457461 457398 456940 456212 454945
53590 454945 453107 450904 448422 445707 443049 440878 439403 438434 437416 435639 432838 429699 427277 425682
53576 425682 423899 421293 418650 417079 416409 415631 414620 414316 415055 415764 415299 413825 412339 411369 410754 410316
53560 410316 410102 410094 410150 410231 410339 410390 410437 410895 412150 413975 415711 417025 418208 419653 421376 423181 425051 427165
53542D27165K476K871L462M408N408N779N269M599M814O011P139P311O865O808
53528E00385P576Q887J0469J2191J3584J3969J3395J2819J3016J3712J4147J4228
53516F48378J4668J6087J8205J9989K0577K0193K0078K1240K3305K4964K5520
53505H73204K5538K5757K6013K5651K4638K3650K3159K2946K2524K1669K0462
53494A135211J9189J8242J7956J8309J8878J9169J9007J8614J8323J8116J7585
53483A338599J6559J5658J5846J7143J8285J7972J6227J4090J2258J0554Q715
53472A501906O924N295L383P34k353n064p075q841j0812j2689j3800j4002j3935
53459A429671j4260j4950j5469j5603j5771j6497j7770j9084k0038k0696k1252
$$ plain form
53542 427165 429641 432512 435974 440382 445790 451569 456838 461437 466251 472262 479401 486712 493577 500385
53528 500385 507961 516848 527317 539508 553092 567061 580456 593275 606291 620003 634150 648378
53516 648378 663046 679133 697338 717327 737904 758097 778175 799415 822720 847684 873204
53505 873204 898742 924499 950512 976163 1000801 1024451 1047610 1070556 1093080 1114749 1135211
53494 1135211 1154400 1172642 1190598 1208907 1227785 1246954 1265961 1284575 1302898 1321014 1338599
53483 1338599 1355158 1370816 1386662 1403805 1422090 1440062 1456289 1470379 1482637 1493191 1501906
53472 1501906 1508830 1514125 1517508 1518242 1515889 1510825 1503750 1494909 1484097 1471408 1457608 1443606 1429671
53459 1429671 1415411 1400461 1384992 1369389 1353618 1337121 1319351 1300267 1280229 1259533 1238281
53448A238281k1572k1183j9854j8054j6683j6204j6133j5516j3906j1710r596
53437A057870p792o069m190k237n16P00J431J995K695L447L926M249N125P061
53423A067695R545J1509J2592J3455J4784J6366J7555J8269J9118K0584K2564
53412A244036K4716K6864K8859L0405L1350L2078L3217L4909L6634L7888L8906
53401A599862M0407M2685M5150M6964M7934M8668M9806N1304N2596N3303N3606
53390B132285N3951N4529N5109N5209N4402N2667N0510M8592M7019M5189M2550
53379B692012L9330L6154L3083K9505K5032K0056J5133J0314N410N13m218r075
53367B893249j4537k0570k6677l2639l8625m4390m8940n1411n2078n2049n2156
$$ plain form
53448 1238281 1216709 1195526 1175672 1157618 1140935 1124731 1108598 1093082 1079176 1067466 1057870
53437 1057870 1050078 1044009 1039819 1037582 1037066 1037766 1039197 1041192 1043887 1047334 1051260 1055509 1060634 1067695
53423 1067695 1077240 1088749 1101341 1114796 1129580 1145946 1163501 1181770 1200888 1221472 1244036
53412 1244036 1268752 1295616 1324475 1354880 1386230 1418308 1451525 1486434 1523068 1560956 1599862
53401 1599862 1640269 1682954 1728104 1775068 1823002 1871670 1921476 1972780 2025376 2078679 2132285
53390 2132285 2186236 2240765 2295874 2351083 2405485 2458152 2508662 2557254 2604273 2649462 2692012
53379 2692012 2731342 2767496 2800579 2830084 2855116 2875172 2890305 2900619 2906029 2906542 2902324 2893249
53367 2893249 2878712 2858142 2831465 2798826 2760201 2715811 2666871 2615460 2563382 2511333 2459177
53356B459177n2407n2416n2015n1282n0257m8884m7188m5356m3584m1976m0681
53345A933131l9984m0000m0261m0002l8947l7585l6363l4985l2864l0116k7551
53334A534473k5690k4272k2795k1103j9306j7489j5786j4437j3544j2969j2658
53323A334424j2778j3321j3850j3894j3432j2772j2096j1382j0568r580q267o584
53311A195900m797l285k144j134J9J361K706L864M897O125P735R459J0897J2184
53297A243787J3868J6079J8245J9924K1453K3341K5339K6692K7126K7039K6703
53286A489596K5852K4254K2249K0451J9049J7658J5827J3504J0938Q257N285J913
53274A674833j569m680p249r437j1335j2994j4729j6941j9432k1504k2933k4293
$$ plain form
53356 2459177 2406770 2354354 2302339 2251057 2200800 2151916 2104728 2059372 2015788 1973812 1933131
53345 1933131 1893147 1853147 1812886 1772884 1733937 1696352 1659989 1625004 1592140 1562024 1534473
53334 1534473 1508783 1484511 1461716 1440613 1421307 1403818 1388032 1373595 1360051 1347082 1334424
53323 1334424 1321646 1308325 1294475 1280581 1267149 1254377 1242281 1230899 1220331 1210751 1202484 1195900
53311 1195900 1191103 1187818 1185674 1184540 1184559 1185920 1188626 1192490 1197387 1203512 1211247 1220706 1231603 1243787
53297 1243787 1257655 1273734 1291979 1311903 1333356 1356697 1382036 1408728 1435854 1462893 1489596
53286 1489596 1515448 1539702 1561951 1582402 1601451 1619109 1634936 1648440 1659378 1667635 1672920 1674833
53274 1674833 1673264 1668584 1661335 1651898 1640563 1627569 1612840 1595899 1576467 1554963 1532030 1507737
53262A507737k5958k7370k7915k7953k8293k9019k9571k9769k9870k9766k9059
53251A193194k7919k7105k6901k6755k6198k5401k4644k3871k3065k2486k2180
53240I16669k1837k1361k1026k0729j9817j8057j6217j5073j4364j3343j1927
53229G22918j0648r814r329r216r535r995j0174j0167j0418j0991j1544j1948
53217E99139j2419j2934j3172j3106j3099j3153j2630j1135r298q212q222q603
53205D63156q471p696o858o523o702o985p055o947o897p102p584q134q297p734
53191C60171o660n721n203m748m030l422l497m133m609m515m043l406k582j722
53177C01880j296j496j910k090k093k188k310k253k117k148k175j721o89L56P82
$$ plain form
53262 1507737 1481779 1454409 1426494 1398541 1370248 1341229 1311658 1281889 1252019 1222253 1193194
53251 1193194 1165275 1138170 1111269 1084514 1058316 1032915 1008271 984400 961335 938849 916669
53240 916669 894832 873471 852445 831716 811899 793842 777625 762552 748188 734845 722918
53229 722918 712270 702456 693127 683911 674376 664381 654207 644040 633622 622631 611087 599139
53217 599139 586720 573786 560614 547508 534409 521256 508626 497491 488193 479981 471759 463156
53205 463156 454685 446989 440131 433608 426906 419921 412866 405919 399022 391920 384336 376202 367905 360171
53191 360171 353511 347790 342587 337839 333809 330387 326890 322757 318148 313633 309590 306184 303602 301880
53177 301880 300584 299088 297178 295088 292995 290807 288497 286244 284127 281979 279804 278083 277394 277750 278532
53162B78532N41O8k74m70o28o85m90j07J11j27o94j143j173q64m63j60j22m69
53144B71383j008j208p20J16O45P04P31R76J023M17n72j187j104o82l61j68M5
53127B69030K62M52P27J081J190Q22L41M45J336K417K904K605K091K074K616K907
53111B93300K084L32j120j382r12p24r61r14k83L44M17M4n33j348k235k618k283
53094B81208j820j766j782j342p13n59q25q22l15J94K35j84q69j553j739j138
53078B66210k49O8k96o18m83k85l96n20k75J18J66k26p99j276j412j034l73k3
53060B58297k57o69p47n21l23k00M9M59Q65J175J435J722K030K166J774Q11m9
53043B68017m9N73P75J79m08l13r9n84j433j613r72l92m52p69p68m48j82j83l56
$$ plain form
53162 278532 279073 279141 278867 278397 277769 277084 276594 276487 276598 276471 275777 274634 273461 272597 272134 271974 271852 271383
53144 271383 270375 269167 268447 268563 269208 269912 270643 271619 272642 273059 272487 271300 270196 269514 269153 268985 269030
53127 269030 269292 269744 270471 271552 272742 273564 273905 274350 275686 278103 281007 283612 285703 287777 290393 293300
53111 293300 295384 295716 294596 293214 292302 291578 290617 289703 289420 289764 290181 290225 289692 288344 286109 283491 281208
53094 281208 279388 277622 275840 274498 273785 273226 272401 271579 271264 271458 271693 271509 270640 269087 267348 266210
53078 266210 265961 266029 265733 265115 264632 264347 263951 263431 263156 263274 263440 263214 262415 261139 259727 258693 258320 258297
53060 258297 258040 257371 256624 256103 255780 255580 255629 256088 256953 258128 259563 261285 263315 265481 267255 268066 268017
53043 268017 267968 268541 269316 269495 269087 268774 268675 268091 266658 265045 264073 263681 263229 262460 261692 261244 261062 260879 260523
53024B60523l97k6O42J099J105J066J380J726J538Q45K4r08j954k378j364N38
53008B63459J725J521Q81Q34J164J198R41O94K61o08j416j434p58j72k9M8M28
52991B68737R75J382J601J806K157K597K777K339J415O13L88O65J154J627J744
52976B91977J103j29j070j083n38j83j74j69p6m2L2L49P33Q54Q47J103J579J844
52958B96957J737J446R77J45r17j755k123k105j808j463j567k263k700j905k85
52943B82371O26J99n41n11l8o7o83j235j466j687j984j966j344l07O54J133J071
52926B74225P93O41M79m3o91o86J14P38L56n36q70n15j89j79p9K15J86l88q86
52907B72685o46J79Q87J021O81K38%j4n6l01n79o29n20m95n09l66j88k59l53J32
$$ plain form
53024 260523 260126 260100 260742 261841 262946 264012 265392 267118 268656 269501 269525 268617 266663 264285 262921 263459
53008 263459 265184 266705 267586 268420 269584 270782 271723 272417 272678 272070 270654 269220 268462 268290 268261 268309 268737
52991 268737 269712 271094 272695 274501 276658 279255 282032 284371 285786 286399 286787 287452 288606 290233 291977
52976 291977 293080 292951 291881 290798 290260 290077 289903 289734 289658 289616 289648 289997 290730 291584 292431 293534 295113 296957
52958 296957 298694 300140 301117 301262 300345 298590 296467 294362 292554 291091 289524 287261 284561 282656 282371
52943 282371 282997 283196 282655 282144 282106 282039 281356 280121 278655 276968 274984 273018 271674 271367 272021 273154 274225
52926 274225 275018 275659 276138 276095 275404 274718 274832 275570 275926 275390 274520 274005 273816 273637 273558 273773 273959 273571 272685
52907 272685 272039 272218 273105 274126 274807 275045 275045 275031 274975 274674 274095 273466 272946 272451 271942 271576 271388 271129 270776 270908
52887B70908J215K075K036J374O91O4o80j188q61J74J000J020O28N79J065J692
52871B81792K130K317K206J740J214J253K047K945L073K364J533J040N88k06j133
52856C04903j754k102k554l124l446l383l227l248l339l219k771k142j687j735
52842B67172k186k443k037j186m83j56l5r9n42j268j831j893j389k99J181K281
52826B54787K194J090K8l58m20n32m33R8O06O43M56M46M56K52J64N00P88M20k34
52807B60951k84L54R35J079J077R52K50j053k174k462k071j518j152j243j920
52792B51721k674k591j406J35J227J755J883J598J122J028J352J214Q3j114j108
52777B54225r2N47K28j93K6M16J99m63q40p83p69j012j143q53l44oL6l4L5L98
$$ plain form
52887 270908 272123 274198 276234 277608 278299 278363 277683 276495 275634 275808 276808 277828 278456 279035 280100 281792
52871 281792 283922 286239 288445 290185 291399 292652 294699 297644 300717 303081 304614 305654 306242 306036 304903
52856 304903 303149 301047 298493 295369 291923 288540 285313 282065 278726 275507 272736 270594 268907 267172
52842 267172 264986 262543 260506 259320 258837 258681 258646 258547 258005 256737 254906 253013 251624 251325 252506 254787
52826 254787 256981 258071 258099 257741 257321 256789 256356 256454 257060 257703 258159 258605 259061 259313 259477 259977 260765 261185 260951
52807 260951 260667 261021 261956 263035 264112 265064 265314 264261 262087 259625 257554 256036 254884 253641 251721
52792 251721 249047 246456 245050 245185 246412 248167 250050 251648 252770 253798 255150 256364 256447 255333 254225
52777 254225 254133 254680 254908 254715 254741 255157 255356 254893 254053 253270 252501 251489 250346 249493 249149 249143 249179 249145 249180 249578
52757B49578J010J601J875J824J727J778J854J764J535J296J056Q04P30J000J390
52742B70822J506J384J433J708J726J281R16J118J481J244M09l73q17j121j206
52727B81511o57L64R96Q07L39Q4k92j187k070k025j008J13N75K14o88j527j540
52710B74009n82M09L75n21j183j062o21l29j6M96R23J009R32Q50N99J62o5N8K7
52691B75470n31j178j309j070r19o68K20J412J804R95n3l06K6L7m79q30n84k27
52673B71810l99r70j241q67j72M48R54J354J379Q42J70M0N23J021J196J396J909
52656B79393K247J717N29k74K4J144K300K965K994K406J368K12p53j383j655j613
52640B91621j476j480j553j319o16J62N11M21K92L66N16O03P02R74J480K159K752
$$ plain form
52757 249578 250588 252189 254064 255888 257615 259393 261247 263011 264546 265842 266898 267702 268432 269432 270822
52742 270822 272328 273712 275145 276853 278579 279860 280776 281894 283375 284619 285028 284655 283838 282717 281511
52727 281511 280854 281218 282214 283021 283360 283444 283152 281965 279895 277870 276862 276975 277550 277764 277076 275549 274009
52710 274009 273427 273836 274211 273690 272507 271445 270824 270495 270479 270975 271898 272907 273839 274689 275288 275450 275385 275443 275470
52691 275470 274939 273761 272452 271382 270463 269795 270015 271427 273231 274226 274173 273867 273893 273930 273451 272621 272037 271810
52673 271810 271411 270441 269200 268333 268161 268609 269563 270917 272296 273138 273308 273348 273871 274892 276088 277484 279393
52656 279393 281640 283357 283886 283612 283636 284780 287080 290045 293039 295445 296813 297025 296272 294889 293234 291621
52640 291621 290145 288665 287112 285793 285177 285339 285850 286271 286563 286929 287445 288048 288750 289724 291204 293363 296115
52623B96115K752J810K79r37j331j300j457j760j756j451j307j371j117l64K37
52608B87042J12l41l64L7K01j02m88p37j000j108n51M74Q75J14q47p70J80R05
52590B83632J085J364J894J899R94M3M0Q12J416J417J147J018J120J353J475J157
52574C01866L65l53l55L21R60Q71m7j284k099k086j602j356j429j166l29J96m43
52557B92030j622j912j019j32j77p45j083j189j325j174l26P83J244Q79M19N40
52541B85191J170J756J798J109l0r60j154p20j81J39L11M70O56R17J298J685J848
52524B95303J616R03k10j224j402n61N47J109J276J759K613L166L109K908K921
52509C13833K887K654K680L269L837L547K361Q93n22j993l418m336m468l988l192
$$ plain form
52623 296115 298867 300677 300956 300019 298688 297388 295931 294171 292415 290964 289657 288286 287169 286805 287042
52608 287042 287154 286813 286449 286486 286687 286585 286097 285360 284360 283252 282701 283175 284050 284164 283317 282547 282727 283632
52590 283632 284717 286081 287975 289874 290868 290911 290951 291763 293179 294596 295743 296761 297881 299234 300709 301866
52574 301866 302231 301878 301523 301844 302804 303675 303628 302344 300245 298159 296557 295201 293772 292606 292277 292473 292030
52557 292030 290408 288496 287477 287345 287168 286423 285340 284151 282826 281652 281326 282109 283353 284232 284651 285191
52541 285191 286361 288117 289915 291024 290994 290034 288880 288160 287979 288118 288429 288899 289555 290472 291770 293455 295303
52524 295303 296919 297822 297612 296388 294986 294425 294972 296081 297357 299116 301729 304895 308004 310912 313833
52509 313833 316720 319374 322054 325323 329160 332707 335068 335961 335439 333446 330028 325692 321224 317236 314044
52494C14044k246j398r78j083j420j653j684j560j303r45o04l56j40J14L03J92
52478B99283l35j023j302p72L10J153J258R66J010J620K318K573K400K250K530
52463C14239L250M038M427M173L380K301J152J06p13j390k169l021l460l116k369
52448C20828k025k347k835k977k789k421j710n59N09P15n3j042j427j082m71o0
52432C00254jk59o86r65p17R3R41J195Q14L82L47M77K80j62k04M48J262J477J020
52413C05996N51P28J634K860L895M457M676N113O308Q115R612R910R019P672O317
52398C86863M640K250n28k919m581n773o655o922o334n272m366l791l225k420
52384C40967j535q93o48o86p31n39m9O35J464K485L579M345M396L811L172L175
$$ plain form
52494 314044 311798 310400 309422 308339 306919 305266 303582 302022 300719 299774 299170 298814 298674 298788 299091 299283
52478 299283 298948 297925 296623 295851 296161 297314 298572 299538 300548 302168 304486 307059 309459 311709 314239
52463 314239 317489 321527 325954 330127 333507 335808 336960 337066 336353 334963 332794 329773 326313 323197 320828
52448 320828 318803 316456 313621 310644 307855 305434 303724 303165 303674 304389 304336 303294 301867 300785 300314 300254
52432 300254 300253 299994 299308 298343 297626 297719 298660 299855 300669 301051 301398 301875 302155 301993 301789 302237 303499 304976 305996
52413 305996 306547 307275 308909 311769 315664 320121 324797 329910 336218 344333 353945 363855 372874 380546 386863
52398 386863 391503 393753 393225 390306 385725 379952 373297 366375 360041 354769 350403 346612 343387 340967
52384 340967 339432 338539 337891 337205 336474 335935 335886 336521 337985 340470 344049 348394 352790 356601 359773 362948
52368C62948M116N513O251N495L624J923J133P59Rj061j886k338k648k653j935
52353C79250o85L77R63J460K083K517K569K475K321J827J085P91J336K200K727
52338D03296K977L350L884M511N517P040Q499R201R300R533J0160J0871J1540
52325D99679J2419J3543J4621J5570J6572J7539J8044J7853J7119J6020J4771
52314F73750J4026J4568J6347J8230J9133J9024J8680J8758J9308J9931K0143
52303H71898J9775J9138J8601J8056J7112J5825J4748J4100J3374J1982R930P483
52291A052022M672J486j632m034n460o118o279o128n976o152o654p095p158o846
52277I88648o281n362l849j796K70J835K999M392O275Q025Q821Q668Q349Q446
$$ plain form
52368 362948 367064 372577 378828 384323 387947 389870 391003 391762 391771 390710 388824 386486 383838 381185 379250
52353 379250 378565 378942 379905 381365 383448 385965 388534 391009 393330 395157 396242 397033 398369 400569 403296
52338 403296 406273 409623 413507 418018 423535 430575 439074 448275 457575 467108 477268 488139 499679
52325 499679 512098 525641 540262 555832 572404 589943 607987 625840 642959 658979 673750
52314 673750 687776 702344 718691 736921 756054 775078 793758 812516 831824 851755 871898
52303 871898 891673 910811 929412 947468 964580 980405 995153 1009253 1022627 1034609 1044539 1052022
52291 1052022 1056694 1058180 1056548 1052514 1047054 1040936 1034657 1028529 1022553 1016401 1009747 1002652 995494 988648
52277 988648 982367 977005 973156 971360 971630 973465 976464 980856 987131 995156 1003977 1012645 1020994 1029440
52263A029440Q910R536J0300J1128J1907J2837J4212J5620J6069J5362J4689J5158
52251A185168J6292J6687J5785J4154J2250R872O914L827J033j472l706n529p050
52238A264225q657j0318j1411j1640j1577j1869j2382j2671j2783j2987j3051
52227A134879j2547j1730j1280j1202j0675r355q022p594p908q012p345o103m656
52214A018450l165j685k54J164K459L171K973K380K427L351M203M113L511L453
52200A046551M066M496M327M211M761N579N958N988O270O785O846O174N379N084
52186A122475N048M524L183J387l28j740k967m208n542o909q230r408j0188j0155
52172A076942r191p833o903o590o256n252l679k097p43N91K013L263M038M348
$$ plain form
52263 1029440 1038350 1047886 1058186 1069314 1081221 1094058 1108270 1123890 1139959 1155321 1170010 1185168
52251 1185168 1201460 1218147 1233932 1248086 1260336 1270208 1277122 1280949 1281982 1280510 1276804 1271275 1264225
52238 1264225 1255568 1245250 1233839 1222199 1210622 1198753 1186371 1173700 1160917 1147930 1134879
52227 1134879 1122332 1110602 1099322 1088120 1077445 1068090 1060068 1052474 1044566 1036554 1029209 1023106 1018450
52214 1018450 1015285 1013600 1013346 1014510 1016969 1020140 1023113 1025493 1027920 1031271 1035474 1039587 1043098 1046551
52200 1046551 1050617 1055113 1059440 1063651 1068412 1073991 1079949 1085937 1092207 1098992 1105838 1112012 1117391 1122475
52186 1122475 1127523 1132047 1135230 1136617 1136289 1134549 1131582 1127374 1121832 1114923 1106693 1097285 1087097 1076942
52172 1076942 1067751 1059918 1053015 1046425 1040169 1034917 1031238 1029141 1028398 1028989 1031002 1034265 1038303 1042651
52158A042651M400M284L899L145K134J211O85M92K48k51o94o37j02N03R99J561
52142A064528K161K296J630N96n7j38j9J72P73J899L062L823M488N728P733J0090
52126A108765J2370J4429J6246J7915J9730K1834K3781K4981K5632K6534K7757
52115A339974K8200K7024K4941K3324K2458K1485J9908J8227J6956J5844J4443
52104A572784J2789J1202R870Q977Q738Q856Q456P008M987L160J583k33k512n152
52090A650513q219j1769j5319j8105j9857k0813k1058k0471j9299j8071j6836
52079A460696j5115j2821j0555q761p199n579m092k859j456M67K538M248N770
52066A405282P538R351J0660J1521J2515J3700J4440J4419J4117J4010J3921J3472
$$ plain form
52158 1042651 1047051 1051335 1055234 1058379 1060513 1061724 1062409 1062901 1063149 1062898 1062204 1061567 1061465 1061968 1062967 1064528
52142 1064528 1066689 1068985 1070615 1071211 1071154 1071016 1070997 1071169 1071942 1073841 1076903 1080726 1085214 1090942 1098675 1108765
52126 1108765 1121135 1135564 1151810 1169725 1189455 1211289 1235070 1260051 1285683 1312217 1339974
52115 1339974 1368174 1395198 1420139 1443463 1465921 1487406 1507314 1525541 1542497 1558341 1572784
52104 1572784 1585573 1596775 1606645 1615622 1624360 1633216 1641672 1648680 1653667 1656827 1658410 1658177 1655665 1650513
52090 1650513 1642294 1630525 1615206 1597101 1577244 1556431 1535373 1514902 1495603 1477532 1460696
52079 1460696 1445581 1432760 1422205 1413444 1406245 1400666 1396574 1393715 1392259 1392726 1395264 1399512 1405282
52066 1405282 1412820 1422171 1432831 1444352 1456867 1470567 1485007 1499426 1513543 1527553 1541474 1554946
52054A554946J2762J2121J1517J0614R267P646N925M047J781j095m527q077j1251
52041A605676j3906j6170j7914j8734j8594j8168j8197j8705j9057j8680j7543
52030A410008j6081j4834j4083j3683j3339j3068j3103j3377j3442j3149j2938
52019A258911j3113j3218j2713j1932j1740j2246j2576j2108j1312j1022j1328
52008A125603j1681j1815j2075j2881j4220j5758j7163j8210j8778j8911j8767
51997I55344j8395j7621j6346j4866j3673j2876j2074j0956r838r308r555j0275
51985G99561j1155j2008j2507j2325j1775j1774j2849j4419j5446j5505j4908
51974F54890j4023j2978j1837j0643r266p565n656l705j586Q63L349N300O484
$$ plain form
52054 1554946 1567708 1579829 1591346 1601960 1611227 1618873 1624798 1628845 1630626 1629531 1625004 1616927 1605676
52041 1605676 1591770 1575600 1557686 1538952 1520358 1502190 1483993 1465288 1446231 1427551 1410008
52030 1410008 1393927 1379093 1365010 1351327 1337988 1324920 1311817 1298440 1284998 1271849 1258911
52019 1258911 1245798 1232580 1219867 1207935 1196195 1183949 1171373 1159265 1147953 1136931 1125603
52008 1125603 1113922 1102107 1090032 1077151 1062931 1047173 1030010 1011800 993022 974111 955344
51997 955344 936949 919328 902982 888116 874443 861567 849493 838537 828699 819391 809836 799561
51985 799561 788406 776398 763891 751566 739791 728017 715168 700749 685303 669798 654890
51974 654890 640867 627889 616052 605409 596143 588578 582922 579217 577631 578494 581843 587143 593627
51961E93627P090P278P064O648O277N731M376J996q42l274m736m990m112k591
51947F19542j028N27K619N566Q994J2285J5143J7475J9150K0118K0366J9627J7439
51934G77823J3824R429M852K67l991p200r123j0635j2782j5501j7837j9173j9681
51921F90272j9788j9795j9878j9896j9267j7582j5263j3169j1641j0409r240q129
51909E06215o924n394l644j947k99J442L012M050M772N643O424O340N309M097
51895E29096L054J539r94m021o576q260r170r383r031q476p850o823n222l471
51881D54412k002o18J030K713L952M789N620O517P239P728Q016P773O570M603
51867E18342K639J224L11l85j050j772k504l075l447l757l823k953p95J774L330
$$ plain form
51961 593627 600717 607995 615059 621707 627984 633715 638091 640087 639245 635971 631235 626245 622133 619542
51947 619542 618514 619041 621660 627226 636220 648505 663648 681123 700273 720391 740757 760384 777823
51934 777823 791647 801076 805928 806195 802204 795004 785881 775246 762464 746963 729126 709953 690272
51921 690272 670484 650689 630811 610915 591648 574066 558803 545634 533993 523584 514344 506215
51909 506215 499291 493897 490253 488306 488007 489449 492461 496511 501283 506926 513350 519690 524999 529096
51895 529096 532150 533689 532695 528674 522098 513838 504668 495285 486254 477778 469928 463105 457883 454412
51881 454412 452410 451792 452822 455535 459487 464276 469896 476413 483652 491380 499396 507169 513739 518342
51867 518342 520981 522205 522516 522131 521081 519309 516805 513730 510283 506526 502703 499750 498955 500729 504059
51852E04059L404K770K207J669P98m23j822l384n039o410p105p103o681o150n754
51837D65036n614n593n374m752l765k544j274k52L38O25Q02P69L42k81o92q62
51821D36909j060j244j165j001j160j393r16K54R71N08l02k25O86J405J508J501
51805D35276J672J595Q64l06j441k214k387j803o96L85J109J531J680J390O48
51790D37303j86p28q67p36o01p55j172j279n26P20J359Q58j03n97o00o88r72r06
51772D29524j55R14J840K778M268O380Q333R165Q722P823P359P329O922N476L124
51757E09802M32k173m465o153p038p425p954q797r293q710p302o184o003o149
51743D22588n582m164k625j399j57J379K890M112N360O787P726P509O590N962
$$ plain form
51852 504059 507463 510233 512440 514109 514907 514484 512662 509278 504239 497829 490724 483621 476940 470790 465036
51837 465036 459422 453829 448455 443703 439938 437394 436120 435868 436206 436831 437633 438402 438744 438463 437771 436909
51821 436909 435849 434605 433440 432439 431279 429886 428970 429224 430195 430703 430401 430176 430862 432267 433775 435276
51805 435276 436948 438543 439407 439101 437660 435446 433059 431256 430560 430945 432054 433585 435265 436655 437303
51790 437303 437117 436389 435522 434786 434185 433430 432258 430979 430453 431173 432532 433390 433287 432690 432090 431402 430430 429524
51772 429524 429369 430283 432123 434901 439169 445549 453882 463047 471769 479592 486951 494280 501202 506678 509802
51757 509802 510234 508061 503596 497443 490405 482980 475026 466229 456936 448226 440924 434740 428737 422588
51743 422588 417006 412842 410217 408818 408661 410040 412930 417042 422402 429189 436915 444424 451014 456976
51729D56976N670M866L314J821J003O26N35J141K375L037K104J10j684k918l959
51714D75017m574m000k385j003p27j155j529j800k276k855l114k824j933m48J336
51699D45730K732L254L065K554J728M41r69j798j746j179o08k79l15q95j919k820
51683D46976l051k740k478k471k256j479n40k9K48J016K328L270L204K697K738
51668D47433L440M201M770N460O368P146P541P542O862M950J853j485m101n734
51654D96246o442o070m625k715j034M49K235M337N985O309N079K810L67j603l078
51639D98250m392n534o050n877n794o503p539p762o860n718n163m963m376l250
51625D18469k142j543j413j425j363j177r10o86p38j246k067k721k800k381j920
$$ plain form
51729 456976 462646 467512 470826 472647 473650 474276 474811 475952 478327 481364 483468 483578 481894 478976 475017
51714 475017 470443 466443 464058 463055 462328 461173 459644 457844 455568 452713 449599 446775 444842 444394 445730
51699 445730 448462 451716 454781 457335 459063 459504 458535 456737 454991 453812 453204 452925 452610 451715 449796 446976
51683 446976 443925 441185 438707 436236 433980 432501 431961 431932 432180 433196 435524 438794 441998 444695 447433
51668 447433 450873 455074 459844 465304 471672 478818 486359 493901 500763 505713 507566 506081 501980 496246
51654 496246 489804 483734 479109 476394 475360 475809 478044 482381 488366 494675 499754 502564 502931 501328 498250
51639 498250 493858 488324 482274 476397 470603 464100 456561 448799 441939 436221 431058 426095 421719 418469
51625 418469 416327 414784 413371 411946 410583 409406 408496 407810 407072 405826 403759 401038 398238 395857 393937
51610C93937j719j719j803j984k181k006j136K14J463K194K431K488K707L294
51596C96180M201N261O498Q094R847J0970J0736R224P020M463J530j494l868m992
51582D63670m903m011k703j251J92J680L328N038O651Q360J0550J2982J4551J4319
51568E28453J2703J1330J1569J3300J5106J5660J5030J4590J5638J8153K1060
51557F92592K3561K5804K8136L0137L0705K8966K4884J9071J2322N330j322p115
51545I13071j1748j5431j8766k1985k4387k4995k3863k2386k1837k2034k1795
51534F83844k0593j9174j8453j8304j7834j6622j5234j4330j3761j2838j1434
51523E05267j0174r466q894p948o955o564o565n994m476k797j799j436j277j375
$$ plain form
51610 393937 392218 390499 388696 386712 384531 382525 381389 381603 383066 385260 387691 390179 392886 396180
51596 396180 400381 405642 412140 420234 430081 441051 451787 461011 468031 472494 474024 472530 468662 463670
51582 463670 458767 454756 452053 450802 450994 452674 456002 461040 467691 476051 486601 499583 514134 528453
51568 528453 541156 552486 564055 577355 592461 608121 623151 637741 653379 671532 692592
51557 692592 716153 741957 770093 800230 830935 859901 884785 903856 916178 921508 920186 913071
51545 913071 901323 885892 867126 845141 820754 795759 771896 749510 727673 705639 683844
51534 683844 663251 644077 625624 607320 589486 572864 557630 543300 529539 516701 505267
51523 505267 495093 485627 476733 468785 461830 455266 448701 442707 438231 435434 433635 432199 430922 429547
51509D29547j911k416k135j164m59o40j281j614j435j004m74J47O79Q78Q79J168
51493D18765J994K941L323K934K216J721J499J146L44p11j487j632j361j275j781
51478D28636k638l181l035k502k201k432l041l712m220m487m549m461m150l482
51464C80545k616j980j725j475r77n61o00p69n47j32n9l7P41K091K770K400K344
51447C79413L845O254Q024Q804R423J0306J1194J2165J3604J4997J4952J2778
51435E05759R149M999P18l086n250n395m824n122o261p071p186p451q357r120
51421D51502q787p498o159n242m451l396k175j235r00j007r21p4J322K274J979
51406D15232Q12L3M61J688K704L010K891K848L083L556M159M739N127N293N401
$$ plain form
51509 429547 427636 425220 423085 421921 421462 420822 419541 417927 416492 415488 415014 415161 415840 416718 417597 418765
51493 418765 420759 423700 427023 429957 432173 433894 435393 436539 436883 436172 434685 433053 431692 430417 428636
51478 428636 425998 422817 419782 417280 415079 412647 409606 405894 401674 397187 392638 388177 384027 380545
51464 380545 377929 375949 374224 372749 371772 371211 370611 369842 369295 369163 369104 369067 369808 371899 374669 377069 379413
51447 379413 383258 389512 397536 406340 415763 426069 437263 449428 463032 478029 492981 505759
51435 505759 514908 519907 520625 517539 512289 506894 502070 496948 490687 483616 476430 468979 460622 451502
51421 451502 442715 435217 429058 423816 419365 415969 413794 412559 411659 410652 409731 409657 410979 413253 415232
51406 415232 416044 416077 416538 418226 420930 423940 426831 429679 432762 436318 440477 445216 450343 455636 461037
51391D61037N615N996O623P635R032J0558J1922J3157J4709J7175K0862K5443
51379F09764L0086L4031L7097L9548M1555M3047M3886M3762M1882L7193K9324
51368A031175J9058P846k930j2296j9854k5962l1379l6312m0132m2212m2645m1911
51356G62446m0267l7939l5348l2623k9316k5279k1360j8400j5978j3164j0293
51345D82479q658q361p856o160m345l906m592m945m422l809l671l604l198k824
51331D12128k977l429l577l289k951k827k770k600k421k309j972j084Q5P62O27
51316C81396L43O70J337J429Q16M63J045J951K167J619J056Q71P42M05J1l14p52
51299C95255j313j511r13J71Q56N71m26j366j722j571j279r61l81O24J808K719
$$ plain form
51391 461037 466652 472648 479271 486906 495938 506496 518418 531575 546284 563459 584321 609764
51379 609764 639850 673881 710978 750526 792081 835128 879014 922776 964658 1001851 1031175
51368 1031175 1050233 1058079 1055149 1042853 1022999 997037 965658 929346 889214 847002 804357 762446
51356 762446 722179 684240 648892 616269 586953 561674 540314 521914 505936 492772 482479
51345 482479 473821 465460 457604 451444 447099 443193 438601 433656 429234 425425 421754 418150 414952 412128
51331 412128 409151 405722 402145 398856 395905 393078 390308 387708 385287 382978 381006 379922 380007 380769 381396
51316 381396 381739 382409 383746 385175 385991 386454 387499 389450 391617 393236 394292 395163 395905 396310 396321 396007 395255
51299 395255 393942 392431 391518 391689 392545 393116 392690 391324 389602 388031 386752 385791 385410 386034 387842 390561
51283C90561L169L403L776M391M996N194M828M182L718L520L130K104N83q17j650
51268D35088j959j988j782j136J33J849L377L891L011J219m89j439j708j777j964
51253D34326k292k728l221l577l577l278l025l006k960k484j540n20R0kp41j602
51237C99863j850j309p41r69j715j928j271n65m61n65l51j85n61r26l66Q04J263
51220C88167N59k87k78L79R40J177J263J262J251J446J767J733J234R32J401K342
51204D05288L069L447L755L999L914L447K760J901R15P9m13p94j361j969k326
51189D25711k508k679k563j776n80L01O38Q36J125J189P54J14k40k32k01m60r65
51172D18464j354j311j010r95j436j701j070K52J308J540J335J332J647J909J825
$$ plain form
51283 390561 393730 397133 400909 405300 410296 415490 420318 424500 428218 431738 434868 436972 437555 436738 435088
51268 435088 433129 431141 429359 428223 428356 430205 433582 437473 440484 441703 441214 439775 438067 436290 434326
51253 434326 432034 429306 426085 422508 418931 415653 412628 409622 406662 404178 402638 402118 402208 402206 401465 399863
51237 399863 398013 396704 395963 394994 393279 391351 390080 389515 389054 388489 388138 387953 387392 386466 386100 386904 388167
51220 388167 388726 388439 388161 388540 389480 390657 391920 393182 394433 395879 397646 399379 400613 401545 402946 405288
51204 405288 408357 411804 415559 419558 423472 426919 429679 431580 432495 432574 432161 431367 430006 428037 425711
51189 425711 423203 420524 417961 416185 415605 415906 416544 417380 418505 419694 420448 420562 420322 420090 419889 419429 418464
51172 418464 417110 415799 414789 413794 412358 410657 409587 409839 411147 412687 414022 415354 417001 418910 420735
51157D20735J390P62J23l37m15NP39J261J126N21J15J77K99J41k0Q6Lq50k107
51138D23754k752k424j720j177o49J08Q29J084P27j13j087j530q58O82K066K664
51122D19604K883L348L834L588K446J167O11R89J853K567K684K186J521J263J595
51107D52139K073K049J443R27J154J853K134J696J224J335J660J490Q80M36L18
51092D72811J77l8J4L37M84K70o4m27r33j280r16RO56P33Q95J540K111K173K253
51073D80805K858L396L103K434K470L270L918M138M723O273Q427J0662J3012J5594
51059E65083J8053K0047K1659K2839K2840K0838J7085J2880R387O881N277M844
51047G47713N797P279P479N301J648j517l315m615o618r499j2563j4913j5563
$$ plain form
51157 420735 422125 422887 423010 422673 422258 422263 423002 424263 425389 425910 426025 426202 426501 426642 426622 426708 426711 425861 423754
51138 423754 421002 418578 416858 415681 415032 415140 415969 417053 417780 417667 416580 415050 414192 414874 416940 419604
51122 419604 422487 425835 429669 433257 435703 436870 437481 438470 440323 442890 445574 447760 449281 450544 452139
51107 452139 454212 456261 457704 458631 459785 461638 463772 465468 466692 468027 469687 471177 472057 472493 472811
51092 472811 472988 472950 472964 473301 473785 474055 473991 473564 472631 471351 470435 470444 471100 471833 472728 474268 476379 478552 480805
51073 480805 483663 487059 490162 492596 495066 498336 502254 506392 511115 517388 525815 536477 549489 565083
51059 565083 583136 603183 624842 647681 670521 691359 708444 721324 730711 737592 742869 747713
51047 747713 753510 760789 768268 773569 775217 773700 770385 765770 759152 749653 737090 722177 706614
51034G06614j3722r902o266m926o014q078j0031j1707j2775j2441j0644q439o576
51021E85093m537j661J468L647M642N304O352P753R223J0511J1182J0805R545
51008F59327Q051O619N028L340K215J982J920J085m56j755k226k190k200k335
50994F78405k355k103j512n21P60K015L077M144N510P179Q952J0696J2404J4088
50980G40739J5780J7507J9121K0369K1251K2013K2649K2779K2412K2450K3934
50969I71004K6950L0754L4767L8901M2997M6735N0164N3714N7484O1003O3818
50958A478291O5815O6770O6283O4440O1941N9210N5834N1265M5513L8895L1656
50947B085913K4401J8219J3568R559N156P78k120l037l055l541m965p083r507
$$ plain form
51034 706614 692892 682990 676724 671798 665784 657706 647675 635968 623193 610752 600108 591669 585093
51021 585093 580556 578895 580363 584010 588652 593956 600308 608061 617284 627795 638977 649782 659327
51008 659327 667378 673997 679025 682365 684580 686562 688482 689567 689111 687356 685130 682940 680740 678405
50994 678405 676050 673947 672435 671914 672674 674689 677766 681910 687420 694599 703551 714247 726651 740739
50980 740739 756519 774026 793147 813516 834767 856780 879429 902208 924620 947070 971004
50969 971004 997954 1028708 1063475 1102376 1145373 1192108 1242272 1295986 1353470 1414473 1478291
50958 1478291 1544106 1610876 1677159 1741599 1803540 1862750 1918584 1969849 2015362 2054257 2085913
50947 2085913 2110314 2128533 2142101 2151660 2156816 2157594 2155474 2152437 2149382 2145841 2140876 2133793 2124286
50934B124286j1804j3651j5202j6952j9071k1303k3638k6437k9733l3029l6103
50923A877363l9450m3436m7501n0696n2758n4068n4769n4444n2757m9985m6835
50912A330664m3956m1558l9334l6782l3732l0566k7757k5335k2990k0573j8274
50901I89807j6348j4895j3894j3204j2561j1738j0706r463p828n699l504j968
50889H67999j364j251j117r02p21l93K61J027J626K349L773N838P766R045R938
50874I03874J0813J1648J2461J3616J5109J6185J6424J6716J8174K0442K2183
50863A077645K3173K4630K7260L0251L2836L5640L9593M4354M8993N3666N9502
50852A497543O7032P5648Q4545R3307J01659J09529J17309J25407J33395J40307
$$ plain form
50934 2124286 2112482 2098831 2083629 2066677 2047606 2026303 2002665 1976228 1946495 1913466 1877363
50923 1877363 1837913 1794477 1746976 1696280 1643522 1589454 1534685 1480241 1427484 1377499 1330664
50912 1330664 1286708 1245150 1205816 1169034 1135302 1104736 1076979 1051644 1028654 1008081 989807
50901 989807 973459 958564 944670 931466 918905 907167 896461 886998 879170 873471 869967 867999
50889 867999 866635 865384 864267 863365 862644 862251 862512 863539 865165 867514 871287 877125 884891 893936 903874
50874 903874 914687 926335 938796 952412 967521 983706 1000130 1016846 1035020 1055462 1077645
50863 1077645 1100818 1125448 1152708 1182959 1215795 1251435 1291028 1335382 1384375 1438041 1497543
50852 1497543 1564575 1640223 1724768 1818075 1919734 2029263 2146572 2271979 2405374 2545681
50842B545681J45733J49919J52776J53540J51547J46629J38560J26902J11781
50833C823068R4180P5152N5310L5339J6340p33j5518k7708l6695m2234m4910m5331
50821C886260m3245l8155l0638k2464j5570j1317j0534j3527j9886k8740l9353
50810C612831n1319o4213p7435r0388j02627j13672j22935j29816j33778j34446
50800B592202j31867j26704j19924j12231j03849r4830q5333p5714o6416n7860
50790A617474n0228m3294l6576k9758k3074j7218j2809r858p854o391n475n089
50778A369850m820m380m212m957o369p479p937q479r685j1110j2137j2999j4112
50765A261174j5043j5131j4817j5224j6355j6882j6051j4778j4182j3877j2527
$$ plain form
50842 2545681 2691414 2841333 2994109 3147649 3299196 3445825 3584385 3711287 3823068
50833 3823068 3917248 3992400 4047710 4083049 4099389 4098656 4083138 4055430 4018735 3976501 3931591 3886260
50821 3886260 3843015 3804860 3774222 3751758 3736188 3724871 3714337 3700810 3680924 3652184 3612831
50810 3612831 3561512 3497299 3419864 3329476 3226849 3113177 2990242 2860426 2726648 2592202
50800 2592202 2460335 2333631 2213707 2101476 1997627 1902797 1817464 1741750 1675334 1617474
50790 1617474 1567246 1523952 1487376 1457618 1434544 1417326 1404517 1394659 1386805 1380414 1374939 1369850
50778 1369850 1365030 1360650 1356438 1351481 1345112 1337633 1329696 1321217 1311532 1300422 1288285 1275286 1261174
50765 1261174 1246131 1231000 1216183 1200959 1184604 1167722 1151671 1136893 1122711 1108834 1096307
50754A096307r705o280l203o20J696L783N678P735J0444J3986J8096K2179K5592
50741A185688K8112L0234L2820L6335M0551M5026M9546N4009N8205O2023O5658
50730A688207O9290P2673P5378P7325P8730P9560P9407P7959P5277P1513O6624
50719B511943O0511N3113M4273L3796K1825Q964m114j6859k8503l7934m4208m7099
50707B555708m6951m4251l9578l3675k7201k0585j4301q995n132k813k238m009
50695B305979q457j5090k3098l2065m1611n0765n8481o4543o9131p1722p1448
50684A799568o8635o4892o1279n7211n1665m4690l7229k9984k3136j6721j0647
50673A333479m620J467P224J2186J6310J9728K2315K3883K4535K4501K3807K2439
$$ plain form
50754 1096307 1086602 1080322 1077119 1076499 1078195 1081978 1087656 1095391 1105835 1119821 1137917 1160096 1185688
50741 1185688 1213800 1244034 1276854 1313189 1353740 1398766 1448312 1502321 1560526 1622549 1688207
50730 1688207 1757497 1830170 1905548 1982873 2061603 2141163 2220570 2298529 2373806 2445319 2511943
50719 2511943 2572454 2625567 2669840 2703636 2725461 2734425 2730311 2713452 2684949 2647015 2602807 2555708
50707 2555708 2508757 2464506 2424928 2391253 2364052 2343467 2329166 2320171 2315039 2312226 2309988 2305979
50695 2305979 2297522 2282432 2259334 2227269 2185658 2134893 2076412 2011869 1942738 1871016 1799568
50684 1799568 1730933 1666041 1604762 1547551 1495886 1451196 1413967 1383983 1360847 1344126 1333479
50673 1333479 1328859 1330326 1337550 1349736 1366046 1385774 1408089 1431972 1456507 1481008 1504815 1527254
50661A527254K0623J8733J7090J6007J5677J5847J6001J6071J6510J7394J8127
50650A715334J8395J8856K0163K1900K3244K4337K6136K8985L2158L4930L7322
50639B001760L9680M2020M4135M5924M7406M8547M9177M8994M7774M5690M3305
50628B504412M0984L8621L6138L3875L1888K9109K3772J4798K560j1380k4629
50617B720148l4484l9092l8613l4844k9549k3479j6939j0611n398j773L25J084
50605B486775M66j793o028j2370k0577l0111m0229m9971n8376o4979o9944p3441
50593B059422p5263p5321p4220p2728p0851o7944o3723n8601n3179m7900m3207
50582A356485l9406l6219l2921k9122k5062k1147j7605j4577j1979r245n745j648
$$ plain form
50661 1527254 1547877 1566610 1583700 1599707 1615384 1631231 1647232 1663303 1679813 1697207 1715334
50650 1715334 1733729 1752585 1772748 1794648 1817892 1842229 1868365 1897350 1929508 1964438 2001760
50639 2001760 2041440 2083460 2127595 2173519 2220925 2269472 2318649 2367643 2415417 2461107 2504412
50628 2504412 2545396 2584017 2620155 2654030 2685918 2715027 2738799 2753597 2756157 2744777 2720148
50617 2720148 2685664 2646572 2607959 2573115 2543566 2520087 2503148 2492537 2487139 2485366 2485691 2486775
50605 2486775 2487241 2485448 2479420 2467050 2446473 2416362 2376133 2326162 2267786 2202807 2132863 2059422
50593 2059422 1984159 1908838 1834618 1761890 1691039 1623095 1559372 1500771 1447592 1399692 1356485
50582 1356485 1317079 1280860 1247939 1218817 1193755 1172608 1155003 1140426 1128447 1119202 1113457 1111809
50570A111809K109M922P135R350J1550J3298J4472J5501J6995J9233K1860K4045
50558A272279K5235K5756K6349K7177K7723K7688K7455K7554K8133K9149L0505
50547A575003L1797L2329L1839L0898L0372L0636L1551L2943L4902L7675M1369
50536A941314M5650M9892N3976N8662O4657P1423P7608Q2756Q7769R3466R9453
50525B726626J04894J09622J13869J17419J19723J20488J19504J16199J10039
50516C758383J01259R0536P8039O3355M6420K7969Q911j0279k9316m7549o3952
50505D023776p7647q8262r5774j00126j01020r8077r1098q0244o6264n0532l4497
50494C140235j8851l593J0845K2977L1318L5572L6022L2171K3073Q988q432k7713
$$ plain form
50570 1111809 1113918 1118840 1125975 1135325 1146875 1160173 1174645 1190146 1207141 1226374 1248234 1272279
50558 1272279 1297514 1323270 1349619 1376796 1404519 1432207 1459662 1487216 1515349 1544498 1575003
50547 1575003 1606800 1639129 1670968 1701866 1732238 1762874 1794425 1827368 1862270 1899945 1941314
50536 1941314 1986964 2036856 2090832 2149494 2214151 2285574 2363182 2445938 2533707 2627173 2726626
50525 2726626 2831520 2941142 3055011 3172430 3292153 3412641 3532145 3648344 3758383
50516 3758383 3859642 3950178 4028217 4091572 4137992 4165961 4174872 4164593 4135277 4087728 4023776
50505 4023776 3946129 3857867 3762093 3661967 3560947 3462870 3371772 3291528 3225264 3174732 3140235
50494 3140235 3121384 3117791 3128636 3151613 3182931 3218503 3254525 3286696 3309769 3318757 3310325 3282612
50482C282612m8251o9042q7905j02797j13236j19862j23221j23714j22020j18792
50472B253772j14237j08484j01930r4810q6951p8484p0183o2562n5344m8383m2309
50461A390095l7459l2970k7938k2824j8537j4739j0402n671j748J046L688O887
50449A229428J0289J3480J6609J9641K2059K3709K5147K6743K8202K9213K9685
50438A474205K8994K6004K0442J3577P081J749k231m670n624n713n464m707l126
50425A540517r97J112L012M791O450Q138J0436J3830J8094K2608K7084L1587L6047
50412A722709M0256M4251M8266N2293N5996N9041O1308O2749O3153O2109N9287
50401B331418N4863M9576M4033L8062L1018K2633J3130K696q571k0168l1344m1842
$$ plain form
50482 3282612 3234361 3165319 3077414 2974617 2861381 2741519 2618298 2494584 2372564 2253772
50472 2253772 2139535 2031051 1929121 1834311 1747360 1668876 1598693 1536131 1480787 1432404 1390095
50461 1390095 1352636 1319666 1291728 1268904 1250367 1235628 1225226 1219555 1217807 1218853 1222541 1229428
50449 1229428 1239717 1253197 1269806 1289447 1311506 1335215 1360362 1387105 1415307 1444520 1474205
50438 1474205 1503199 1529203 1549645 1563222 1570303 1572052 1569821 1565151 1559527 1553814 1548350 1543643 1540517
50425 1540517 1539520 1540632 1543644 1548435 1554885 1563023 1573459 1587289 1605383 1627991 1655075 1686662 1722709
50412 1722709 1762965 1807216 1855482 1907775 1963771 2022812 2084120 2146869 2210022 2272131 2331418
50401 2331418 2386281 2435857 2479890 2517952 2548970 2571603 2584733 2587429 2578858 2558690 2527346 2485504
50389B485504n1807o0733o7331p0788p1555p0352o7167o1740n4511m6346l7680
50378A825494k8563j9244j0156j605N937J1566J4581J5153J3790J0463M907k404
50366A839919j0356j8270k6092l3531l9666m3683m5568m5808m4765m2523l9211
50355A450446l5419l2360l1370l2866l5881l8948m1220m2416m2140m0022l6434
50344A041370l2332k8196k3779j9030j4574j0946p895m974k334l90J042K658M639
50331I05259O318P057P088P108P228O782N410L911L619M995P192R000R875J0006
50317A000848R832R664R430Q663P096N381M645N097N693N602N348N907P284Q803
50303A099293J0343J2252J4431J6546J9067K2898K7905L2868L7229M1770M7089
$$ plain form
50389 2485504 2433697 2372964 2305633 2234845 2163290 2092938 2025771 1964031 1909520 1863174 1825494
50378 1825494 1796931 1777687 1767531 1765926 1771863 1783429 1798010 1813163 1826953 1837416 1842323 1839919
50366 1839919 1829563 1811293 1785201 1751670 1712004 1668321 1622753 1576945 1532180 1489657 1450446
50355 1450446 1415027 1382667 1351297 1318431 1282550 1243602 1202382 1159966 1117826 1077804 1041370
50344 1041370 1009038 980842 957063 938033 923459 912513 904618 899644 897310 896920 897962 900620 905259
50331 905259 911577 918634 925722 932830 940058 946840 952250 956161 959780 964775 971967 980967 990842 1000848
50317 1000848 1010680 1020344 1029774 1038437 1045533 1050914 1055559 1060656 1066349 1071951 1077299 1083206 1090490 1099293
50303 1099293 1109636 1121888 1136319 1152865 1171932 1194830 1222735 1255603 1292832 1334602 1381691
50292A381691N2431N6569N8716N7548N0313L4668J1739j3513l5328n0304n8011
50281A546519n9650n6827n1165m4273l7463l1334k5683k0084j4579r632n492j981
50269A188356J066L555N563P553R829J2079J3771J4756J5276J5608J5991J6526
50257A319929J6864J6328J4792J3054J1881J1067R956Q493O978N101K078k102
50245A434419o468j0232j3473j6341j8318j8819j8012j6473j4266j1001o892l343
50233A280781k188m317q946j4250j8697k1875k4068k5410k5738k5094k3897k2561
50221A063740k1308k0332j9729j9167j8138j6664j5334j4417j3447j2047j0627
50210H82530r802r450q946q096p243o535n697m596l564k961k842l146l823m570
$$ plain form
50292 1381691 1434122 1490691 1549407 1606955 1657268 1691936 1703675 1690162 1654834 1604530 1546519
50281 1546519 1486869 1430042 1378877 1334604 1297141 1265807 1240124 1220040 1205461 1195829 1190337 1188356
50269 1188356 1189422 1192977 1198540 1206093 1215922 1228001 1241772 1256528 1271804 1287412 1303403 1319929
50257 1319929 1336793 1353121 1367913 1380967 1392848 1403915 1413871 1422364 1429342 1434443 1436521 1434419
50245 1434419 1427951 1417719 1404246 1387905 1369587 1350768 1332756 1316283 1302017 1291016 1284124 1280781
50233 1280781 1278593 1274276 1265330 1251080 1232383 1210508 1186440 1161030 1135292 1110198 1086301 1063740
50221 1063740 1042432 1022100 1002371 983204 965066 948402 933068 918651 905204 893157 882530
50210 882530 872728 863278 854332 846236 838993 832458 826761 822165 818601 815640 812798 809652 805829 801259
50196H01259m862m453l708l118k775k535k499k897l543l829l461k925k923l440
50182G54291l706l143k106j438j445j645j527j201j093j204j068l80N43J115J111
50167G37104Q62Q61J364K311L501M693N616O136O518P269Q582J0117J1653J3688
50153H20275J6878K0983K4898K7948L0589L3540L6706L9386M1098M1776M1508
50142A175585M0596L9529L8363L6448L3471L0489K9018K9154K9377K8350K5949
50131A536329K2340J7025R517L10r482j9023k7755l4986m0235m3740m5949m6649
50119A317702m5199m1692l7275l3219k9966k7162k4377k1636j9421j8086j7275
50108A002394j6154j4329j2260j0581r407q580q137q018p710o786n625m978m979
$$ plain form
50196 801259 796397 791944 788236 785118 782343 779808 777309 774412 770869 767040 763579 760654 757731 754291
50182 754291 750585 747442 745336 743898 742453 740808 739281 738080 736987 735783 734715 734335 734878 735993 737104
50167 737104 737966 738827 740191 742502 746003 750696 756312 762448 768966 776235 784817 794934 806587 820275
50153 820275 837153 858136 883034 910982 941571 975111 1011817 1051203 1092301 1134077 1175585
50142 1175585 1216181 1255710 1294073 1330521 1363992 1394481 1423499 1452653 1482030 1510380 1536329
50131 1536329 1558669 1575694 1585211 1585521 1576039 1557016 1529261 1494275 1454040 1410300 1364351 1317702
50119 1317702 1272503 1230811 1193536 1160317 1130351 1103189 1078812 1057176 1037755 1019669 1002394
50108 1002394 986240 971911 959651 949070 939663 931083 922946 914928 907218 900432 894807 889829 884850
50095H84850n232n606o253o868o827o077n199m319k833n22J732K850K781K351
50081H44828K327K952M034N062N535N538N736O486P277P423O950O396O006N545
50067I22095M841M042L435L148L006K505J212n89j969k330k043j881k147k720
50053I30605l501m257m379l449j986r94p43m83N59K421M690P004Q993J0219J0577
50038I55276J0641J1338J3138J5604J7854J9472K0925K2889K5250K7213K8411
50027A168011K9366L0547L1555L1782L1339L0633K9353K6731K2764J8392J4426
50016A464899J1042Q328O382M597J662l222r607j6594k3789l0963l7438m2357
50004A332940m5389m6640m6195m4179m0954l6839l1887k6322k0952j6560j3153
$$ plain form
50095 884850 879618 874012 867759 860891 854064 847987 842788 838469 835636 835114 836846 839696 842477 844828
50081 844828 847155 850107 854141 859203 864738 870276 876012 882498 889775 897198 904148 910544 916550 922095
50067 922095 926936 930978 934413 937561 940567 943072 944284 943695 941726 939396 937353 935472 933325 930605
50053 930605 927104 922847 918468 915019 913033 912039 911296 910813 911372 913793 918483 925487 934480 944699 955276
50038 955276 965917 977255 990393 1005997 1023851 1043323 1064248 1087137 1112387 1139600 1168011
50027 1168011 1197377 1227924 1259479 1291261 1322600 1353233 1382586 1409317 1432081 1450473 1464899
50016 1464899 1475941 1484269 1490651 1495248 1496910 1493688 1484081 1467487 1443698 1412735 1375297 1332940
50004 1332940 1287551 1240911 1194716 1150537 1109583 1072744 1040857 1014535 993583 977023 963870
49993I63870j0284p949o547o074n923n665n513n881o831q090r383j0584j1729
49980H63417j2897j3902j4239j3640j2525j1600j1049j0582j0148r971r811q839
49968G24214o737m450l300l559m362m807m723m341l794l089k259j343l98M44J109
49953F78605J872L144M845O319P076P411P892Q494Q707Q336P697O859N407L270
49939G65934J322M96N87M86n29k228m133o056p866r269j0187j0944j1670j1923
49925F94020j1227r729p926o077m261k708j620q05l5M41L17K0L90J473K389K599
49909F57261K636L170L999M574M980N709O701P429P910Q802J0241J1356J1295
49896G46063J0275R076P930O547M983L766K986J954O0k422m783o788q675j0460
$$ plain form
49993 963870 953586 945637 939090 933016 927093 921428 915915 910034 903203 895113 885730 875146 863417
49980 863417 850520 836618 822379 808739 796214 784614 773565 762983 752835 742864 733053 724214
49968 724214 717477 713027 709727 706168 701806 696999 692276 687935 684141 681052 678793 677450 677052 677496 678605
49953 678605 680477 683621 688466 694785 701861 709272 717164 725658 734365 742701 750398 757257 762664 765934
49939 765934 767256 767752 768339 768825 768296 766068 761935 755879 748013 738744 728557 717613 705943 694020
49925 694020 682793 673064 665138 659061 654800 652092 650472 649667 649632 650073 650390 650410 650800 652273 654662 657261
49909 657261 659897 663067 667066 671640 676620 682329 689030 696459 704369 713171 723412 734768 746063
49896 746063 756338 765414 773344 779891 784874 788640 791626 793580 793640 791218 786435 779647 770972 760512
49882G60512j1724j2158j1843j0996r784q579p862p629p261o355n374m928m681
$$ plain form
49882 760512 748788 736630 724787 713791 704007 695428 687566 679937 672676 666321 660947 656019 651338
$$ [...]
##END NTUPLES=NMR SPECTRUM
##END=
