##TITLE=AC1656_NARAH14392_8531089_1UiuotEwqt
##JCAMPDX= 6.0         $$ Bruker NMR JCAMP-DX V2.0
##DATA TYPE= NMR SPECTRUM
##DATA CLASS= NTUPLES
##ORIGIN= BRUKER
##OWNER= Administrator
$$ 1.72 TOPSPIN		Version 2.1
$$ 2014-03-14 22:36:28.400 -0800  Administrator@X
$$ Compression mode = diff/dup
##.OBSERVE FREQUENCY= 400.02188249412
##.OBSERVE NUCLEUS= ^1H
##.ACQUISITION MODE= SIMULTANEOUS (DQD)
##.ACQUISITION SCHEME= undefined
##.AVERAGES= 64
##.DIGITISER RES= 22
##SPECTROMETER/DATA SYSTEM= spect
##.PULSE SEQUENCE= noesygpps1d.comp
##.SOLVENT NAME= COFFEE_meoh
##.SHIFT REFERENCE= INTERNAL, COFFEE_meoh, 1, 14.96102
##AUDIT TRAIL= $$ (NUMBER, WHEN, WHO, WHERE, PROCESS, VERSION, WHAT)
$$ ##TITLE= Audit trail, TOPSPIN		Version 2.1
$$ ##JCAMPDX= 5.01
$$ ##ORIGIN= Bruker BioSpin GmbH
$$ ##OWNER= Administrator
$$ $$ E:\/data/COFFEE/nmr/AC1656_NARAH14392_8531089_1UiuotEwqt/22/pdata/1/auditp.txt
$$ ##AUDIT TRAIL=  $$ (NUMBER, WHEN, WHO, WHERE, PROCESS, VERSION, WHAT)
(   1,<2014-03-14 22:36:23.447 -0800>,<Administrator>,<X>,<go>,<TOPSPIN 2.1>,
      <created by zg
	started at 2014-03-14 22:24:53.193 -0800,
	POWCHK enabled, PULCHK disabled,
       configuration hash MD5:
       C8 4E 4E 5D D3 5C D8 9E 9F 52 82 E0 59 8A DE 15
       data hash MD5: 64K
       AD 63 A5 59 B1 F3 C9 44 4B D0 A4 E8 50 21 48 77>)
(   2,<2014-03-14 22:36:26.415 -0800>,<Administrator>,<X>,<proc1d>,<TOPSPIN 2.1>,
      <Start of raw data processing
       efp LB = 0.3 FT_mod = 6 PKNL = 1 PHC0 = 0 PHC1 = 0 SI = 128K 
       data hash MD5: 128K
       84 F0 97 EF 25 9B 8D 1B FD ED 59 94 AC 66 67 DE>)
(   3,<2014-03-14 22:36:27.384 -0800>,<Administrator>,<X>,<proc1d>,<TOPSPIN 2.1>,
      <pk PHC0 = -83.54553 PHC1 = 0 
       data hash MD5: 128K
       B1 82 6E 34 D4 E5 B1 86 A6 03 CF B5 10 25 52 C3>)
(   4,<2014-03-14 22:36:27.822 -0800>,<Administrator>,<X>,<proc1d>,<TOPSPIN 2.1>,
      <abs ABSG = 1 
       data hash MD5: 128K
       79 13 A8 35 C6 5F B9 7C DF 21 B4 75 14 6E 80 20>)
(   5,<2014-03-14 22:36:27.931 -0800>,<Administrator>,<X>,<proc1d>,<TOPSPIN 2.1>,
      <abs ABSG = 2 
       data hash MD5: 128K
       03 0E 8A 0F F8 1E 5C B0 17 7F 40 C8 34 D1 7B 66>)
(   6,<2014-03-14 22:36:28.025 -0800>,<Administrator>,<X>,<proc1d>,<TOPSPIN 2.1>,
      <abs ABSG = 3 
       data hash MD5: 128K
       21 56 CA 41 A2 28 48 8A B8 AE B3 4F AA 20 10 25>)
(   7,<2014-03-14 22:36:28.103 -0800>,<Administrator>,<X>,<proc1d>,<TOPSPIN 2.1>,
      <abs ABSG = 4 
       data hash MD5: 128K
       75 2A 81 7D 4B E0 72 B1 D7 5A BC 91 89 4A 44 36>)
(   8,<2014-03-14 22:36:28.197 -0800>,<Administrator>,<X>,<proc1d>,<TOPSPIN 2.1>,
      <abs ABSG = 5 
       data hash MD5: 128K
       76 46 26 82 64 CC 80 4B 2E E2 C1 F7 E7 BD FC E6>)
$$ ##END=
$$ 
$$ $$ hash MD5
$$ $$ FA 9B 85 40 92 FF 24 9B D5 0D F3 61 B7 F2 57 41
##$RELAX= 
##$RELAX= 
##$RELAX= 
##$RELAX= 
##$RELAX= 
##$RELAX= 
##$RELAX= 
##$RELAX= 
$$ Bruker specific parameters
$$ --------------------------
##$DU= <E:\>
##$EXPNO= 22
$$ [...]
##$TP07= 0
##$TPNAME0= <>
##$TPNAME1= <>
##$TPNAME2= <>
##$TPNAME3= <>
##$TPNAME4= <>
##$TPNAME5= <>
##$TPNAME6= <>
##$TPNAME7= <>
##$TPOAL= (0..7)
0.5 0.5 0.5 0.5 0.5 0.5 0.5 0.5
##$TPOFFS= (0..7)
0 0 0 0 0 0 0 0
##$TUNHIN= 0
##$TUNHOUT= 0
##$TUNXOUT= 0
##$USERA1= <user>
##$USERA2= <user>
##$USERA3= <user>
##$USERA4= <user>
##$USERA5= <user>
##$V9= 5
##$VALIST= <valist>
##$VCLIST= <CCCCCCCCCCCCCCC>
##$VD= 0
##$VDLIST= <DDDDDDDDDDDDDDD>
##$VPLIST= <PPPPPPPPPPPPPPP>
##$VTLIST= <TTTTTTTTTTTTTTT>
##$WBST= 1024
##$WBSW= 4
##$XGAIN= (0..3)
0 0 0 0
##$XL= 0
##$YL= 0
##$YMAX_a= 6370352
##$YMIN_a= -13693993
##$ZGOPTNS= <>
##$ZL1= 120
##$ZL2= 120
##$ZL3= 120
##$ZL4= 120
##$ABSF1= 14.96102
##$ABSF2= -5.597161
##$ABSG= 5
##$ABSL= 3
##$ALPHA= 0
##$AQORDER= 0
##$ASSFAC= 0
##$ASSFACI= 0
##$ASSFACX= 0
##$ASSWID= 0
##$AUNMP= <proc_prof1d_extract.lims>
##$AXLEFT= 0
##$AXNAME= <>
##$AXNUC= <1H>
##$AXRIGHT= 0
##$AXTYPE= 0
##$AXUNIT= <>
##$AZFE= 0.1
##$AZFW= 0.1
##$BCFW= 0
##$BC_mod= 0
##$BYTORDP= 0
##$COROFFS= 0
##$CY= 15
##$DATMOD= 1
##$DC= 0
##$DFILT= <>
##$DTYPP= 0
##$F1P= 0
##$F2P= 0
##$FCOR= 0.5
##$FTSIZE= 131072
##$FT_mod= 6
##$GAMMA= 0
##$GB= 0
##$INTBC= 1
##$INTSCL= 1
##$ISEN= 128
##$LB= 0.3
##$LEV0= 0
##$LPBIN= 0
##$MAXI= 10000
##$MC2= 0
##$MEAN= 0
##$ME_mod= 0
##$MI= 0
##$NCOEF= 0
##$NC_proc= -2
##$NLEV= 6
##$NOISF1= 0
##$NOISF2= 0
##$NSP= 0
##$NTH_PI= 0
##$NZP= 0
##$OFFSET= 14.96102
##$PC= 1
##$PHC0= -83.54553
##$PHC1= 0
##$PH_mod= 1
##$PKNL= yes
##$PPARMOD= 0
##$PPDIAG= 0
##$PPIPTYP= 0
##$PPMPNUM= 2147483647
##$PPRESOL= 1
##$PSCAL= 4
##$PSIGN= 0
##$PYNMP= <proc.py>
##$REVERSE= no
##$SF= 400.020009630362
##$SI= 131072
##$SIGF1= 0
##$SIGF2= 0
##$SINO= 400
##$SIOLD= 131072
##$SPECTYP= <>
##$SREGLST= <1H.CDCl3>
##$SSB= 0
##$STSI= 131072
##$STSR= 0
##$SW_p= 8223.68421052631
##$SYMM= 0
##$S_DEV= 0
##$TDeff= 65536
##$TDoff= 0
##$TI= <>
##$TILT= no
##$TM1= 0
##$TM2= 0
##$TOPLEV= 0
##$USERP1= <user>
##$USERP2= <user>
##$USERP3= <user>
##$USERP4= <user>
##$USERP5= <user>
##$WDW= 1
##$XDIM= 131072
##$YMAX_p= 314353689
##$YMIN_p= -10672
##$CURPLOT= <Network HP LaserJet P1505>
##$CURPRIN= <$Network HP LaserJet P1505>
##$DFORMAT= <normdp>
##$LAYOUT= <+/1D_H.xwp>
##$LFORMAT= <normlp>
##$PFORMAT= <normpl>
##$SURQMSG= 1
$$ End of Bruker specific parameters
$$ ---------------------------------
##NTUPLES= NMR SPECTRUM
##VAR_NAME=  FREQUENCY,     SPECTRUM/REAL,   SPECTRUM/IMAG
##SYMBOL=    X,             R,               I
##VAR_TYPE=  INDEPENDENT,   DEPENDENT,       DEPENDENT
##VAR_FORM=  AFFN,          ASDF,            ASDF
##VAR_DIM=   131072,        131072,          131072
##UNITS=     HZ,            ARBITRARY UNITS, ARBITRARY UNITS
##FACTOR=    0.0627417313425164, 1,          1
##FIRST=     8223.62146879497, 1111,         -66551
##LAST=      0,             3829,            -66403
##MIN=       0,             -10672,          0
##MAX=       8223.62146879497, 314353689,    0
$$ Real data points
##PAGE= N=1
##DATA TABLE= (X++(R..R)), XYDATA
$$ [...]
$$ plain form
63846 1166655 1153688 1137755 1119307 1098380 1074885 1049220 1022262 994517 965571 934822 902583
63835 902583 870010 837916 806125 774133 742030 710517 680315 651883 625486 601178 578758
63824 578758 558007 538868 521192 504476 488208 472448 457743 444434 432410 421565 412051 403817
63812 403817 396303 388977 382033 376094 371240 366708 361764 356585 352094 348946 346884 345076 342862 340113
63798 340113 337053 334004 331298 329053 326858 323901 319763 314965 310468 306712 303517 300797 298794 297476
63784 297476 296262 294713 293055 291639 290276 288631 287004 286055 285836 285696 285185 284493 283827 282938 281538 279862
63768 279862 278467 277668 277363 277266 277161 277100 277375 278094 278794 278829 278164 277344 276538 275196 273013 270762 269618 269911
63750 269911 271010 272254 273476 274696 275860 276999 278230 279551 280879 282322 284050 285904 287506 288874
$$ packed form
63846A166655j2967j5933j8448k0927k3495k5665k6958k7745k8946l0749l2239
63835I02583l2573l2094l1791l1992l2103l1513l0202k8432k6397k4308k2420
63824E78758k0751j9139j7676j6716j6268j5760j4705j3309j2024j0845r514q234
63812D03817p514p326o944n939m854m532m944n179m491l148k062j808k214k749
63798C40113l060l049k706k245k195k957m138m798m497l756l195k720k003j318
63784B97476j214j549j658j416j363j645j627r49k19j40n11o92o66q89j400j676
63768B79862j395p99l05r7j05o1K75P19P00L5o65q20q06j342k183k251j144K93
63750B69911J099J244J222J220J164J139J231J321J328J443J728J854J602J368
$$ plain form
63736 288874 290531 292896 295846 299043 302373 305836 309272 312504 315665 319146 323183 327558 331720 335194
63722 335194 338045 340917 344434 348512 352400 355460 357672 359347 360600 361374 361803 362279 363081 364085 364882
63707 364882 365144 364880 364320 363608 362753 361918 361519 361766 362287 362616 363030 364391 366984 369968 372286 373806 375192
63690 375192 376909 378783 380434 381703 382603 383117 383176 382720 381815 380842 380398 380758 381472 381758 381289 380415 379776 379920
63672 379920 381145 383255 385453 386905 387590 388280 389532 391006 391968 392102 391470 389951 387222 383350 379039
63657 379039 375157 372153 369984 368339 366746 364594 361391 357152 352465 348077 344477 341860 340312 339726
63643 339726 339580 339208 338525 338203 338819 340070 341311 342698 345164 349120 353779 358201 362516 367563 373578
63628 373578 379904 386043 392355 399457 407328 415421 423565 432392 442737 454761 467784 481086 494803
$$ packed form
63736B88874J657K365K950L197L330L463L436L232L161L481M037M375M162L474
63722C35194K851K872L517M078L888L060K212J675J253P74M29M76Q02J004P97
63707C64882K62k64n60p12q55q35l99K47N21L29M14J361K593K984K318J520J386
63690C75192J717J874J651J269R00N14N9m56r05r73m44L60P14K86m69q74o39J44
63672C79920J225K110K198J452O85O90J252J474R62J34o32j519k729l872m311
63657C79039l882l004k169j645j593k152l203m239m687m388l600k617j548n86
63643C39726j46l72o83l22O16J251J241J387K466L956M659M422M315N047O015
63628C73578O326O139O312P102P871Q093Q144Q827J0345J2024J3023J3302J3717
$$ plain form
63615 494803 509887 527148 546490 567188 588687 610862 633605 656559 679397 702167 725210
63604 725210 748754 772472 795261 815568 832264 845332 855480 863079 867777 869187 867504 863152
63592 863152 856224 846757 835422 823356 811166 798434 784420 769061 753013 736780 720097 702341
63580 702341 683487 664480 646602 630612 616585 604333 593625 584129 575575 568176 562511 558804
63568 558804 556626 555539 555748 557786 561729 567033 572947 578837 584407 590059 596823 605496 615944 627663
63554 627663 640791 655935 673115 691662 711290 732560 755988 781321 808010 835786 864286
63543 864286 892659 920142 946666 972240 995913 1015955 1031000 1040592 1044790 1043863 1038440 1029441 1017632
63530 1017632 1003463 987393 970099 952270 934325 916236 897401 876812 853741 828343 801360
$$ packed form
63615D94803J5084J7261J9342K0698K1499K2175K2743K2954K2838K2770K3043
63604G25210K3544K3718K2789K0307J6696J3068J0148P599M698J410j683m352
63592H63152o928r467j1335j2066j2190j2732j4014j5359j6048j6233j6683j7756
63580G02341j8854j9007j7878j5990j4027j2252j0708r496q554p399n665l707
63568E58804k178j087K09K038L943N304N914N890N570N652O764Q673J0448J1719
63554F27663J3128J5144J7180J8547J9628K1270K3428K5333K6689K7776K8500
63543H64286K8373K7483K6524K5574K3673K0042J5045R592M198r27n423q999j1809
63530A017632j4169j6070j7294j7829j7945j8089j8835k0589k3071k5398k6983
$$ plain form
63519 801360 773355 744498 715105 686027 658391 633078 610331 589619 569997 550900 532627
63508 532627 515877 500967 487759 476034 465489 455555 445832 436664 428722 422060 416214 411249 407848
63495 407848 406053 404674 402523 399764 397534 396559 396620 397073 397407 397489 397688 398606 400452 402873 405563 408569
63479 408569 411680 414124 415526 416677 418549 420811 422209 422330 422023 422017 422093 422008 422273 423255 424127 423635 421744
63462 421744 419680 418257 416861 414473 411259 408633 407822 408790 410673 412910 415626 419098 423345 428291 433934
63447 433934 440070 446221 452184 458494 465916 474672 484541 495591 508266 522656 538244 554543 571590
63434 571590 589611 608630 628715 650234 673438 697996 723253 748681 773671 797118 817871
63423 817871 835743 851613 866305 879838 892200 904547 918931 936509 956375 976482 995626
$$ packed form
63519H01360k8005k8857k9393k9078k7636k5313k2747k0712j9622j9097j8273
63508E32627j6750j4910j3208j1725j0545r934r723r168p942o662n846m965l401
63495D07848j795j379k151k759k230r75O1M53L34Q2J99R18J846K421K690L006
63479D08569L111K444J402J151J872K262J398J21l07oP6q5K65R82Q72m92j891
63462D21744k064j423j396k388l214k626q11R68J883K237K716L472M247M946N643
63447D33934O136O151N963O310P422Q756R869J1050J2675J4390J5588J6299J7047
63434E71590J8021J9019K0085K1519K3204K4558K5257K5428K4990K3447K0753
63423H17871J7872J5870J4692J3533J2362J2347J4384J7578J9866K0107J9144
$$ plain form
63412 995626 1014168 1032846 1051350 1068299 1082343 1092924 1100061 1103824 1104139 1100896 1094068 1083852 1070715
63399 1070715 1055210 1037755 1018694 998504 977626 956058 933323 908965 882894 855272 826436
63388 826436 797142 768559 741662 716717 693547 672091 652447 634564 618344 604037 592121
63377 592121 582733 575566 570475 567826 567995 570794 575652 582221 590426 600106 611003 623162 636930 652350
63363 652350 668924 686300 704982 725931 749420 774623 800425 826404 852887 880237 908271
63352 908271 936214 963039 987918 1010486 1030639 1048000 1061729 1071048 1075841 1076561 1073611 1067095 1057164
63339 1057164 1044333 1029353 1012873 995293 976721 956976 935807 913311 890110 866951 844205
63328 844205 821847 799858 778429 757747 737856 718896 701337 685665 671767 658937 646685
$$ packed form
63412I95626J8542J8678J8504J6949J4044J0581P137L763L15l243o828j0216j3137
63399A070715j5505j7455j9061k0190k0878k1568k2735k4358k6071k7622k8836
63388H26436k9294k8583k6897k4945k3170k1456j9644j7883j6220j4307j1916
63377E92121r388p167n091k649J69K799M858O569Q205R680J0897J2159J3768J5420
63363F52350J6574J7376J8682K0949K3489K5203K5802K5979K6483K7350K8034
63352I08271K7943K6825K4879K2568K0153J7361J3729R319M793P20k950o516r931
63339A057164j2831j4980j6480j7580j8572j9745k1169k2496k3201k3159k2746
63328H44205k2358k1989k1429k0682j9891j8960j7559j5672j3898j2830j2252
$$ plain form
63317 646685 635374 625782 618055 611297 604162 595594 585031 572324 557747 541974 525870 510308
63305 510308 496079 483647 472870 463210 454341 446301 439025 432167 425642 419932 415436 411825 408471
63292 408471 405255 402441 399975 397490 394974 392846 391289 389947 388336 386257 383838 381516 379908 379254
63278 379254 379053 378707 378396 378755 379720 380467 380537 380333 380292 380359 380629 381691 383735 385899 387223 387891 388948 391077
63260 391077 394198 398015 402293 406704 410959 415128 419542 424503 430301 437177 444883 452600 459853 467264
63246 467264 475865 485865 496633 507728 519315 531685 545086 560060 577221 596489 617056 638266
63234 638266 660092 682707 706212 731013 757815 786824 817329 848375 879477 910386 940648
63223 940648 969925 998505 1026988 1055530 1083719 1111105 1137494 1162739 1186565 1208731 1229161
$$ packed form
63317F46685j1311r592p727o758p135q568j0563j2707j4577j5773j6104j5562
63305E10308j4229j2432j0777r660q869q040p276o858o525n710m496l611l354
63292D08471l216k814k466k485k516k128j557j342j611k079k419k322j608o54
63278C79254k01l46l11L59R65P47P0k04m1O7K70J062K044K164J324O68J057K129
63260C91077L121L817M278M411M255M169M414M961N798O876P706P717P253P411
63246D67264Q601J0000J0768J1095J1587J2370J3401J4974J7161J9268K0567K1210
63234F38266K1826K2615K3505K4801K6802K9009L0505L1046L1102L0909L0262
63223I40648K9277K8580K8483K8542K8189K7386K6389K5245K3826K2166K0430
$$ plain form
63212 1229161 1247848 1264677 1279306 1291119 1299337 1303264 1302431 1296580 1285687 1270080 1250367 1227155
63200 1227155 1200916 1172226 1141945 1111008 1080131 1049908 1021066 994459 970789 950494 933876
63189 933876 921219 912698 908207 907359 909622 914550 921931 931764 944138 959107 976570 996126 1017011
63176 1017011 1038294 1059249 1079636 1099668 1119737 1140031 1160196 1179349 1196462 1210815 1222116
63165 1222116 1230316 1235423 1237440 1236315 1231908 1223990 1212274 1196503 1176742 1153651 1128275 1101293
63153 1101293 1072593 1041807 1009148 975509 941870 908911 877122 846903 818468 791990 767916
63142 767916 746818 728738 712940 698541 685288 673532 663619 655504 648897 643604 639630 637044 635744
63129 635744 635404 635696 636531 637947 639826 641942 644394 647749 652560 658758 665603 672209 678129 683503 688737
$$ packed form
63212A229161J8687J6829J4629J1813Q218L927q33n851j0893j5607j9713k3212
63200A227155k6239k8690l0281l0937l0877l0223k8842k6607k3670k0295j6618
63189I33876j2657q521m491q48K263M928P381R833J2374J4969J7463J9556K0885
63176A017011K1283K0955K0387K0032K0069K0294K0165J9153J7113J4353J1301
63165A222116Q200N107K017j125m407p918j1716j5771j9761k3091k5376k6982
63153A101293k8700l0786l2659l3639l3639l2959l1789l0219k8435k6478k4074
63142G67916k1098j8080j5798j4399j3253j1756r913q115o607n293l974k586j300
63129F35744l40K92Q35J416J879K116K452L355M811O198O845O606N920N374N234
$$ plain form
63114 688737 694008 699038 703346 706674 709137 711002 712458 713606 714558 715469 716475 717590 718677 719576 720202
63099 720202 720424 719928 718515 716557 714831 713675 712659 711388 710335 710415 711896 714193 716632 719018 721448
63084 721448 724010 726727 729511 732148 734659 737606 741667 746941 753063 759898 767544 775717 783868 792136
63070 792136 801505 812723 825620 839821 855497 872920 891851 912047 934031 958682 986261 1016459
63058 1016459 1049245 1085031 1124018 1165933 1210527 1257855 1308063 1361328 1418055 1478579 1542498
63047 1542498 1608706 1676321 1745246 1815582 1886839 1958086 2028703 2098662 2168119 2236980 2304800
63036 2304800 2370885 2434429 2494816 2551863 2605630 2655823 2701485 2741363 2774497 2800256 2817907
63025 2817907 2826499 2825309 2814189 2793292 2762662 2722301 2672530 2614167 2548518 2477438 2403120 2327443
$$ packed form
63114F88737N271N030M308L328K463J865J456J148R52R11J006J115J087Q99O26
63099G20202K22m96j413j958j726j156j016j271j053Q0J481K297K439K386K430
63084G21448K562K717K784K637K511K947M061N274O122O835P646Q173Q151Q268
63070G92136R369J1218J2897J4201J5676J7423J8931K0196K1984K4651K7579L0198
63058A016459L2786L5786L8987M1915M4594M7328N0208N3265N6727O0524O3919
63047A542498O6208O7615O8925P0336P1257P1247P0617O9959O9457O8861O7820
63036B304800O6085O3544O0387N7047N3767N0193M5662L9878L3134K5759J7651
63025B817907Q592j190j1120k0897l0630m0361m9771n8363o5649p1080p4318p5677
$$ plain form
63013 2327443 2251644 2176949 2105306 2038936 1979227 1926499 1880807 1842386 1811332 1787554 1771290
63002 1771290 1763025 1762583 1768809 1780543 1797439 1819410 1845721 1875206 1907062 1940908 1976246 2012360
62990 2012360 2048674 2084851 2120530 2155152 2187889 2217627 2243300 2264412 2280913 2292466 2298288
62979 2298288 2297944 2291606 2279135 2259521 2231856 2196401 2154057 2105288 2050365 1990287 1926619 1860624
62967 1860624 1793275 1725827 1659452 1594426 1530617 1468690 1409920 1354796 1302775 1253570 1207642
62956 1207642 1165153 1125437 1087982 1053129 1021260 991959 964499 938555 913950 890335 867649
62945 867649 846395 826906 808823 791748 775912 761628 748638 736647 725979 716948 708947 701012
62933 701012 693097 686010 680197 675347 671119 667482 664205 660747 656948 653352 650581 648699 647252 645574
$$ packed form
63013B327443p5799p4695p1643o6370n9709n2728m5692l8421l1054k3778j6264
63002A771290q265m42O226J1734J6896K1971K6311K9485L1856L3846L5338L6114
62990B012360L6314L6177L5679L4622L2737K9738K5673K1112J6501J1553N822
62979B298288l44o338j2471j9614k7665l5455m2344m8769n4923o0078o3668o5995
62967A860624o7349o7448o6375o5026o3809o1927n8770n5124n2021m9205m5928
62956A207642m2489l9716l7455l4853l1869k9301k7460k5944k4605k3615k2686
62945H67649k1254j9489j8083j7075j5836j4284j2990j1991j0668r031q001p935
62933G01012p915p087n813m850m228l637l277l458l799l596k771j882j447j678
$$ plain form
62919 645574 643033 639441 635342 631497 628045 624619 621244 618427 616140 613466 609775 605658 602059 598864
62905 598864 595212 591027 587433 585461 584923 584783 584119 582433 579604 576059 572722 570284 568620 567228 566050
62890 566050 565375 565074 564514 563343 561878 560551 559483 558826 559081 560630 563138 565787 567923 569270 569768 569625
62874 569625 569368 569448 569823 570116 570015 569256 567494 564688 561522 558948 557330 556380 555793 555453 555077 554262 553034
62857 553034 551878 551119 550720 550729 551354 552419 553326 553855 554484 555562 556640 557045 556761 556283 555871 555400 554718 553732
62839 553732 552320 550547 548871 547772 547322 547339 547772 548517 549058 548784 547707 546584 546313 547418 549939 553413
62823 553413 556940 559698 561620 563481 566257 570409 575645 581172 586246 590646 594664 598655 602764 607113
62809 607113 611950 617405 623397 629953 637292 645345 653573 661704 670369 680476 692133 704741 718008
$$ packed form
62919F45574k541l592m099l845l452l426l375k817k287k674l691m117l599l195
62905E98864l652m185l594j972n38j40o64j686k829l545l337k438j664j392j178
62890E66050o75l01n60j171j465j327j068o57K55J549K508K649K136J347M98j43
62874E69625k57Q0L75K93j01p59j762k806l166k574j618r50n87l40l76q15j228
62857E53034j156p59l99RO25J065R07N29O29J078J078M05k84m78m12m71o82r86
62839E53732j412j773j676j099m50J7M33P45N41k74j077j123k71J105K521L474
62823E53413L527K758J922J861K776M152N236N527N074M400M018L991M109M349
62809F07113M837N455N992O556P339Q053Q228Q131Q665J0107J1657J2608J3267
$$ plain form
62796 718008 732257 747772 764507 782628 802792 825611 851237 879680 911135 945725 983343
62785 983343 1024138 1068950 1118903 1174689 1236454 1304094 1377291 1455335 1537322 1622685 1711359
62774 1711359 1803358 1898208 1994714 2091130 2185554 2276275 2361786 2440461 2510326 2569330 2615868
62763 2615868 2648924 2667681 2671285 2659291 2632304 2591784 2538971 2474292 2398245 2312721 2220865
62752 2220865 2125411 2027676 1928452 1829308 1732342 1638866 1549125 1463356 1382481 1307444 1238361
62741 1238361 1174693 1115978 1062080 1012952 968546 928880 893874 863128 836041 812152 791206
62730 791206 772944 757026 743224 731483 721697 713531 706584 700759 696340 693683 692823 693444 695222 698185
62716 698185 702712 709217 717893 728729 741713 756942 774501 794335 816407 841036 868835 900123
$$ packed form
62796G18008J4249J5515J6735J8121K0164K2819K5626K8443L1455L4590L7618
62785I83343M0795M4812M9953N5786O1765O7640P3197P8044Q1987Q5363Q8674
62774A711359R1999R4850R6506R6416R4424R0721Q5511P8675O9865N9004M6538
62763B615868L3056J8757L604j1994k6987m0520n2813o4679p6047q5524r1856
62752B220865r5454r7735r9224r9144r6966r3476q9741q5769q0875p5037o9083
62741A238361o3668n8715n3898m9128m4406l9666l5006l0746k7087k3889k0946
62730G91206j8262j5918j3802j1741r786q166o947n825m419k657q60O21J778K963
62716F98185M527O505Q676J0836J2984J5229J7559J9834K2072K4629K7799L1288
$$ plain form
62704 900123 934580 971828 1012266 1056895 1106276 1160030 1217511 1278418 1342497 1409206 1478210
62693 1478210 1549805 1624036 1699493 1773683 1844728 1912052 1975242 2032869 2082889 2123737 2154544
62682 2154544 2174536 2182797 2178649 2161956 2133027 2092509 2041393 1980960 1912706 1838468 1760483 1680945
62670 1680945 1601300 1522126 1443846 1367439 1294318 1225617 1161746 1102513 1047400 995727 947016
62659 947016 901524 860232 823926 792279 764119 738495 715120 693884 674548 657179 642262
62648 642262 629870 619077 608724 598570 589153 580715 572874 565351 558465 552713 548263 544965 542491
62635 542491 540397 538393 536655 535489 534605 533186 530865 528179 525793 523733 521779 520223 519635 520031 520806
62620 520806 521512 522261 523286 524532 525938 527846 530795 534960 540031 545712 552102 559441 567675 576568 586231
$$ packed form
62704I00123L4457L7248M0438M4629M9381N3754N7481O0907O4079O6709O9004
62693A478210P1595P4231P5457P4190P1045O7324O3190N7627N0020M0848L0807
62682B154544J9992Q261m148j6693k8929m0518n1116o0433o8254p4238p7985p9538
62670A680945p9645p9174p8280p6407p3121o8701o3871n9233n5113n1673m8711
62659I47016m5492m1292l6306l1647k8160k5624k3375k1236j9336j7369j4917
62648F42262j2392j0793j0353j0154r417q438p841p523o886n752m450l298k474
62635E42491k094k004j738j166q84j419k321k686k386k060j954j556n88L96P75
62620E20806P06P49J025J246J406J908K949M165N071N681O390P339Q234Q893R663
$$ plain form
62605 586231 597190 609869 624267 640322 658228 678132 699885 723538 749735 779025 810982
62594 810982 844767 880542 919417 961703 1005999 1050485 1094574 1138641 1182595 1225365 1265569
62583 1265569 1302055 1333875 1360347 1381159 1395993 1403988 1403991 1395447 1378805 1355117 1325528 1291084
62571 1291084 1252614 1210680 1165967 1119777 1073810 1029320 986655 945620 906010 867807 831307
62560 831307 797280 766663 739802 716144 694907 675877 659248 644872 632092 620397 609922
62549 609922 601071 593831 587704 582236 577361 573147 569470 566123 563146 560835 559364 558533 557993 557667 557900
62534 557900 559119 561274 563773 566164 568918 573129 579206 586212 592985 599710 607872 618718 632358 648412
62520 648412 666799 687508 710187 734536 760854 789718 821324 855582 892647 932786 975730
$$ packed form
62605E86231J0959J2679J4398J6055J7906J9904K1753K3653K6197K9290L1957
62594H10982L3785L5775L8875M2286M4296M4486M4089M4067M3954M2770M0204
62583A265569L6486L1820K6472K0812J4834P995Lq544j6642k3688k9589l4444
62571A291084l8470m1934m4713m6190m5967m4490m2665m1035l9610l8203l6500
62560H31307l4027l0617k6861k3658k1237j9030j6629j4376j2780j1695j0475
62549F09922q851p240o127n468m875m214l677l347k977k311j471q31n40l26K33
62534E57900J219K155K499K391K754M211O077P006O773O725Q162J0846J3640J6054
62520F48412J8387K0709K2679K4349K6318K8864L1606L4258L7065M0139M2944
$$ plain form
62509 975730 1020557 1066298 1112412 1158658 1204727 1249924 1293087 1333024 1369327 1402515 1432931
62498 1432931 1459657 1481099 1496639 1507234 1514377 1519056 1521949 1524061 1526559 1530134 1534924 1541084 1549281
62485 1549281 1560528 1575594 1594453 1616273 1639971 1664758 1690123 1715343 1739131 1759651 1774817
62474 1774817 1782888 1783156 1775981 1761826 1740319 1710620 1672554 1626838 1574263 1515391 1451359 1384369
62462 1384369 1316824 1250237 1185278 1122550 1062880 1007056 955702 909255 867736 830724 797957
62451 797957 769767 746516 727719 712270 699489 689426 682070 676880 673391 671777 672328 674597 677558
62438 677558 680512 683411 686269 688729 690405 691365 691927 692061 691260 688974 684964 679275 672168 664131 655641
62423 655641 646649 636557 625055 612867 601319 591162 582136 573662 565527 557785 550428 543503 537253
$$ packed form
62509I75730M4827M5741M6114M6246M6069M5197M3163L9937L6303L3188L0416
62498A432931K6726K1442J5540J0595P143M679K893K112K498L575M790O160Q197
62485A549281J1247J5066J8859K1820K3698K4787K5365K5220K3788K0520J5166
62474A774817Q071K68p175j4155k1507k9699l8066m5716n2575n8872o4032o6990
62462A384369o7545o6587o4959o2728n9670n5824n1354m6447m1519l7012l2767
62451G97957k8190k3251j8797j5449j2781j0063p356n190l489j614N51K269K961
62438F77558K954K899K858K460J676R60N62J34q01k286m010n689p107q037q490
62423F55641q992j0092j1502j2188j1548j0157r026q474q135p742p357o925o250
$$ plain form
62410 537253 531801 526836 521917 517001 512396 508272 504528 501127 498265 496135 494686 493675 492852 492138 491759
62395 491759 492150 493546 495721 498306 501305 505054 509702 514981 520513 526056 531323 535868 539492 542719
62381 542719 546639 552139 559232 567131 575014 582709 590619 599052 607919 617182 627280 638710 651375
62368 651375 664784 678833 693952 710478 728471 748336 771018 797103 826098 857114 890034
62357 890034 925526 964035 1005212 1048319 1092678 1137653 1182540 1226573 1268829 1308139 1343409
62346 1343409 1374080 1399921 1420363 1434462 1441733 1442651 1438097 1428549 1414096 1395013 1372010 1345988
62334 1345988 1317777 1287999 1257003 1225012 1192550 1160612 1130180 1101574 1074407 1048118 1022402
62323 1022402 997199 972519 948340 924599 901233 878252 855686 833457 811456 789799 768839
$$ packed form
62410E37253n452m965m919m916m605m124l744l401k862k130j449j011q23p14l79
62395D91759L91J396K175K585K999L749M648N279N532N543N267M545L624L227
62381E42719L920N500P093P899P883P695P910Q433Q867R263J0098J1430J2665
62368F51375J3409J4049J5119J6526J7993J9865K2682K6085K8995L1016L2920
62357H90034L5492L8509M1177M3107M4359M4975M4887M4033M2256L9310L5270
62346A343409L0671K5841K0442J4099P271R18m554r548j4453j9083k3003k6022
62334A345988k8211k9778l0996l1991l2462l1938l0432k8606k7167k6289k5716
62323A022402k5203k4680k4179k3741k3366k2981k2566k2229k2001k1657k0960
$$ plain form
62312 768839 748793 729586 711236 694143 678711 664840 652195 640876 631355 623700 617252 611294
62300 611294 605771 601136 597701 595342 593729 592667 592222 592570 593674 595142 596579 598091 600205 603244 606935
62285 606935 610723 614198 617182 619722 622229 625319 629161 633165 636677 639899 643717 648610 654253 660354
62271 660354 667443 676325 686974 698577 710862 724950 742468 763975 788634 815442 844386 876243
62259 876243 911631 950554 992704 1037756 1085368 1135250 1187336 1241606 1297509 1353652 1408157
62248 1408157 1459321 1505877 1546815 1581090 1607611 1625556 1634750 1635574 1628391 1613234 1590261 1560316
62236 1560316 1524630 1484020 1438803 1389556 1337491 1283872 1229469 1174905 1121204 1069677 1021437
62225 1021437 977254 937547 902096 869970 840261 812983 788949 768751 752065 737886 725145
$$ packed form
62312G68839k0046j9207j8350j7093j5432j3871j2645j1319r521p655o448n958
62300F11294n523m635l435k359j613j062m45L48J104J468J437J512K114L039L691
62285F06935L788L475K984K540K507L090L842M004L512L222L818M893N643O101
62271F60354P089Q882J0649J1603J2285J4088J7518K1507K4659K6808K8944L1857
62259H76243L5388L8923M2150M5052M7612M9882N2086N4270N5903N6143N4505
62248A408157N1164M6556M0938L4275K6521J7945R194Q24p183j5157k2973k9945
62236A560316l5686m0610m5217m9247n2065n3619n4403n4564n3701n1527m8240
62225A021437m4183l9707l5451l2126k9709k7278k4034k0198j6686j4179j2741
$$ plain form
62214 725145 713142 701773 691446 682618 675349 669429 664792 661504 659363 657927 656980 656662 656991 657640
62200 657640 658457 659932 662704 666696 671132 675501 680185 685902 692786 700344 708224 716654 725972 736046
62186 736046 746401 756695 766774 776477 785771 795008 804548 814144 823173 831605 840169 849333 858662
62173 858662 867644 876679 886741 898421 911914 927662 946243 967602 991074 1016202 1043031 1071480
62161 1071480 1101044 1131301 1162151 1193163 1223074 1250317 1273790 1292892 1307109 1315967 1319305 1317333
62149 1317333 1310476 1299323 1284578 1266871 1246642 1224296 1200280 1174928 1148478 1121497 1095060
62138 1095060 1070268 1047595 1026851 1007720 990176 974441 960741 949116 939412 931380 924808 919504
62126 919504 915238 911820 909222 907525 906741 906801 907621 909016 910626 912212 914082 916964 921404 927367 934284
$$ packed form
62214G25145j2003j1369j0327q828p269n920m637l288k141j436r47l18L29O49
62200F57640Q17J475K772L992M436M369M684N717O884P558P880Q430R318J0074
62186G36046J0355J0294J0079R703R294R237R540R596R029Q432Q564R164R329
62173H58662Q982R035J0062J1680J3493J5748J8581K1359K3472K5128K6829K8449
62161A071480K9564L0257L0850L1012K9911K7243K3473J9102J4217Q858L338j972
62149A317333o857j1153j4745j7707k0229k2346k4016k5352k6450k6981k6437
62138A095060k4792k2673k0744j9131j7544j5735j3700j1625r704q032o572n304
62126I19504m266l418k598j697p84O0Q20J395J610J586J870K882M440N963O917
$$ plain form
62111 934284 941246 947326 952212 956532 961095 965700 969152 970575 970231 968835 966678 963868 960957 958731
62097 958731 957522 957117 957122 957047 956244 954297 951452 948382 945659 943709 942977 943657 945405 947786 950866 954898
62081 954898 959618 964516 969826 976566 985400 995952 1007485 1019817 1033284 1048144 1064325 1081509
62069 1081509 1099192 1116880 1134476 1152351 1170876 1189984 1209227 1228083 1246201 1263576 1280515
62058 1280515 1297124 1312745 1326265 1337057 1345146 1350304 1351536 1348000 1340070 1328949 1315368 1299165
62046 1299165 1279960 1257675 1232356 1204032 1172986 1139883 1105474 1070336 1034908 999499 964283
62035 964283 929598 896220 864936 835794 808258 782264 758617 738016 720152 704279 690278
62024 690278 678462 668481 659192 649825 640669 632335 624790 617540 610420 603720 597671 592239 587403 583243
$$ packed form
62111I34284O962O080M886M320M563M605L452J423l44j396k157k810k911k226
62097I58731j209m05Np5q03j947k845l070k723j950p32O80J748K381L080M032
62081I54898M720M898N310O740Q834J0552J1533J2332J3467J4860J6181J7184
62069A081509J7683J7688J7596J7875J8525J9108J9243J8856J8118J7375J6939
62058A280515J6609J5621J3520J0792Q089N158J232l536p930j1121j3581j6203
62046A299165j9205k2285k5319k8324l1046l3103l4409l5138l5428l5409l5216
62035I64283l4685l3378l1284k9142k7536k5994k3647k0601j7864j5873j4001
62024F90278j1816r981r289r367r156q334p545p250p120o700o049n432m836m160
$$ plain form
62010 583243 579695 576506 573595 571187 569490 568383 567627 567227 567371 568015 568755 569268 569794 571015 573312 576220
61994 576220 578752 580253 580814 580823 580370 579185 576932 573369 568376 562147 555238 548152 540938 533452 525949
61979 525949 519012 512858 507105 501378 495736 490385 485394 481018 477892 476383 475922 475443 474511 473614 473351
61964 473351 473752 474490 475354 476270 477109 477750 478273 478913 479900 481365 483278 485366 487287 489072 491301 494619
61948 494619 499123 504441 510359 517127 525020 533881 543385 553641 565145 577979 591403 604512 617201
61935 617201 630079 643462 656804 669352 681001 692203 703192 713645 723080 731273 738209 743835
61923 743835 748055 750838 752266 752521 751827 750322 747994 744916 741589 738903 737653 738133 740175 743420 747586
61908 747586 752668 758922 766393 774433 782028 788890 795856 803736 811890 818507 822318 823547 823034 821028
$$ packed form
62010E83243l548l189k911k408j697j107p56m00J44O44P40N13N26J221K297K908
61994E76220K532J501N61Rm53j185k253l563m993o229o909p086p214p486p503
61979E25949o937o154n753n727n642n351m991m376l126j509m61m79r32q97k63
61964D73351M01P38Q64R16Q39O41N23O40R87J465J913K088J921J785K229L318
61948D94619M504N318N918O768P893Q861R504J0256J1504J2834J3424J3109J2689
61935F17201J2878J3383J3342J2548J1649J1202J0989J0453R435Q193O936N626
61923G43835M220K783J428K55o94j505k328l078l327k686j250M80K042L245M166
61908G47586N082O254P471Q040P595O862O966P880Q154O617L811J229n13k006
$$ plain form
61894 821028 817318 812125 806163 799870 793145 785864 778199 770227 761754 752857 744271 736822 730582 724850
61880 724850 718814 712011 704376 696220 688056 680095 671979 663324 654497 646464 639882 634641 630392 627103
61866 627103 624966 624033 624158 625105 626696 629109 633134 639760 649300 661120 674356 688617 703881 720090
61852 720090 737217 755456 774993 795663 817070 838879 860691 881809 901447 919136 934753
61841 934753 948352 960229 970833 980133 987153 990644 990384 987531 983692 979912 976479 973286 970196 967364
61827 967364 965314 964493 964711 965375 966271 967762 970059 972716 975007 976382 976205 973484 967443 958301 946962
61812 946962 933923 918882 901554 882424 862439 842228 821991 801970 782622 764296 747122
61801 747122 731419 717859 706776 697436 688441 678995 669467 660531 652208 644069 636115 628867 622613
$$ packed form
61894H21028l710n193n962o293o725p281p665p972q473q897q586p449o240n732
61880G24850o036o803p635q156q164p961q116q655q827q033o582n241m249l289
61866F27103k137r33J25R47J591K413M025O626R540J1820J3236J4261J5264J6209
61852G20090J7127J8239J9537K0670K1407K1809K1812K1118J9638J7689J5617
61841I34753J3599J1877J0604R300P020L491k60k853l839l780l433l193l090k832
61827I67364k050q21K18O64Q96J491K297K657K291J375j77k721o041r142j1339
61812I46962j3039j5041j7328j9130j9985k0211k0237k0021j9348j8326j7174
61801G47122j5703j3560j1083r340q995r446r528q936q323q139p954p248o254
$$ plain form
61788 622613 617038 611794 607057 603268 600529 598485 596676 594787 592645 590220 587699 585401 583526 582007
61774 582007 580602 579154 577793 576851 576544 576768 577312 578209 579720 581914 584499 587211 590220 593882 598079
61759 598079 602101 605349 608044 610962 614401 617627 619576 620072 620085 620603 621394 621062 618418 613685 608325 603709
61743 603709 599989 596289 591868 586904 582047 577511 573031 568697 565305 563529 563027 562791 562273 561786 561791 562223
61727 562223 562793 563705 565636 568839 572475 575166 576357 576870 577870 579511 581089 582458 584483 587697 591104
61712 591104 593043 592987 591809 590361 588518 585758 582097 578097 574318 571057 568331 565840 563075 559689 555691
61697 555691 551227 546399 541378 536485 531948 527688 523490 519315 515327 511658 508198 504718 501237 498191
61683 498191 495959 494144 491714 488106 483832 479637 475494 471069 466794 463599 461607 460000 458378 457348
$$ packed form
61788F22613n575n244m737l789k739k044j809j889k142k425k521k298j875j519
61774E82007j405j448j361r42l07K24N44Q97J511K194K585K712L009L662M197
61759E98079M022L248K695K918L439L226J949M96J3N18P91l32k644m733n360m616
61743F03709l720l700m421m964m857m536m480m334l392j776n02k36n18m87NM32
61727E62223N70R12J931L203L636K691J191N13J000J641J578J369K025L214L407
61712E91104J939n6j178j448j843k760l661m000l779l261k726k491k765l386l998
61697E55691m464m828n021m893m537m260m198m175l988l669l460l480l481l046
61683D98191k232j815k430l608m274m195m143m425m275l195j992j607j622j030
$$ plain form
61669 457348 457418 458096 458670 459180 459965 460782 461086 460863 460464 459935 459223 458848 459574 461384 463459 465297 467261 469805
61651 469805 472664 475119 476769 477795 478642 479658 480979 482631 484639 486905 488948 490054 489926 489024 488028
61636 488028 487138 486150 484967 483624 482003 479972 477809 476019 474770 473822 472960 472052 470737 468597 465781
61621 465781 462999 460710 458664 456462 454208 452349 451076 450081 448777 446652 443650 440295 437230 434565
61607 434565 431912 429018 425989 422819 419154 414798 410067 405414 401041 397173 394263 392434 390962 388887
61593 388887 386064 383182 380754 378591 376315 373921 371594 369320 367003 364812 363097 361992 361274 360654 360096
61578 360096 359808 359958 360370 360522 359958 358754 357501 356757 356606 356789 357152 357736 358510 359257 359825 360311 360929 361810
61560 361810 363042 364668 366476 367981 368952 369830 371252 373139 374690 375352 375360 375189 374928 374566 374458 374999 376000
$$ packed form
61669D57348P0O78N74N10P85Q17L04k23l99n29p12l75P26J810K075J838J964K544
61651D69805K859K455J650J026Q47J016J321J652K008K266K043J106j28r02r96
61636D88028q90r88j183j343j621k031k163j790j249r48q62r08j315k140k816
61621D65781k782k289k046k202k254j859j273r95j304k125l002l355l065k665
61607D34565k653k894l029l170l665m356m731m653m373l868k910j829j472k075
61593C88887k823k882k428k163k276k394k327k274k317k191j715j105p18o20n58
61578C60096k88J50M12J52n64j204j253p44j51J83L63N84P74P47N68M86O18Q81
61560C61810J232J626J808J505R71Q78J422J887J551O62Qj71k61l62j08N41J001
$$ plain form
61543 376000 376866 377351 377736 378344 379313 380773 382795 385109 387237 389015 390656 392314 393955 395641 397442
61528 397442 398990 399651 399344 398679 398048 397084 395387 393310 391528 390173 388923 387666 386527 385438 384215
61513 384215 382983 381977 381033 379839 378694 378308 378654 378653 377415 375434 374129 374363 375770 377346 378359 378738
61497 378738 378879 379206 379863 380766 381843 383047 384172 384958 385470 386105 387025 387901 388455 388977 389917 391180 392308
61480 392308 393236 394381 395931 397556 398990 400373 401730 402591 402631 402406 402901 404399 406256 407760 408675 408928
61464 408928 408380 407255 406314 406066 406017 405208 403481 401815 401298 402108 403596 405082 406361 407598 408975 410478
61448 410478 411939 413260 414514 415806 417103 418328 419562 421006 422776 424849 427118 429291 430904 431817
61434 431817 432687 434467 437248 440005 441803 442882 444145 445852 447402 448345 449028 450062 451546 453062 454170
$$ packed form
61543C76000Q66M85L85O08R69J460K022K314K128J778J641J658J641J686J801
61528C97442J548O61l07o65o31r64j697k077j782j355j250j257j139j089j223
61513C84215j232j006r44j194j145l86L46jj238j981j305K34J407J576J013L79
61497C78738J41L27O57R03J077J204J125P86N12O35R20Q76N54N22R40J263J128
61480C92308R28J145J550J625J434J383J357Q61M0k25M95J498J857J504R15K53
61464D08928n48j125r41k48m9q09j727j666n17Q10J488J486J279J237J377J503
61448D10478J461J321J254J292J297J225J234J444J770K073K269K173J613R13
61434D31817Q70J780K781K757J798J079J263J707J550R43O83J034J484J516J108
$$ plain form
61419 454170 454709 454843 455060 455900 457418 459019 460083 460644 461172 461725 461717 460664 458849 456961 455234 453281 450770
61402 450770 447932 445176 442512 439684 436839 434639 433584 433465 433692 433949 434284 434761 435378 436247 437534 439103
61386 439103 440570 441749 442789 443766 444483 444854 445174 445730 446439 447243 448608 451113 454620 458365 461937 465658
61370 465658 469792 473920 477461 480458 483322 485998 487972 489125 490119 491737 494175 497173 500508 504074
61356 504074 507726 511386 515263 519664 524649 530099 536091 542842 550226 557722 565029 572417 580142 587771
61342 587771 594486 599971 604548 608470 611622 614071 616358 618825 621034 622387 623126 624086 625442 626293 625768
61327 625768 624167 622628 621898 621771 621708 621664 622134 623481 625475 627673 630200 633749 638658 644319 649986 655943
61311 655943 663254 672344 682497 692917 703614 714807 726035 736549 746319 756010 765988 775765 784359
$$ packed form
61419D54170N39J34K17Q40J518J601J064N61N28N53qj053j815j888j727j953k511
61402D50770k838k756k664k828k845k200j055j19K27K57L35M77O17Q69J287J569
61386D39103J467J179J040R77P17L71L20N56P09Q04J365K505L507L745L572L721
61370D65658M134M128L541K997K864K676J974J153R94J618K438K998L335L566
61356E04074L652L660L877M401M985N450N992O751P384P496P307P388P725P629
61342E87771O715N485M577L922L152K449K287K467K209J353P39R60J356Q51n25
61327F25768j601j539p30j27o3m4M70J347J994K198K527L549M909N661N667N957
61311F55943P311R090J0153J0420J0697J1193J1228J0514R770R691R978R777Q594
$$ plain form
61298 784359 790834 794639 795900 795294 793279 789556 783725 776256 768217 760072 751437 742118 732719 723930
61284 723930 715773 707926 700385 693389 687036 681384 676747 673493 671615 670721 670400 670534 671386 673424 676824
61269 676824 681097 685478 689732 694213 699050 703821 708356 713320 719463 726555 733663 740422 747514 755751
61255 755751 764973 773951 781291 786401 789702 791938 793384 793857 793346 792204 790664 788664 786285 783875 781477
61240 781477 778637 775157 771552 768312 765187 761848 758857 757197 757059 757854 759332 761850 765446 769516 773784
61225 773784 778909 785591 793456 801338 808525 815405 822929 831635 841165 850590 859192 866871 873801 879999
61211 879999 885503 890759 896308 902078 907447 912093 916385 920812 925436 930152 935236 941337 949037 958512
61197 958512 969513 981557 994237 1007326 1020491 1033031 1044243 1054055 1063026 1071668 1079920 1087232
$$ packed form
61298G84359O475L805J261o06k015l723n831p469q039q145q635r319r399q789
61284G23930q157p847p541o996o353n652m637l254j878q94l21J34Q52K038L400
61269F76824M273M381M254M481M837M771M535M964O143P092P108O759P092Q237
61255G55751R222Q978P340N110L301K236J446M73n11j142j540k000k379k410k398
61240G81477k840l480l605l240l125l339k991j660j38P95J478K518L596M070M268
61225G73784N125O682P865P882P187O880P524Q706R530R425Q602P679O930O198
61211H79999N504N256N549N770N369M646M292M427M624M716N084O101P700R475
61197I58512J1001J2044J2680J3089J3165J2540J1212R812Q971Q642Q252P312
$$ plain form
61185 1087232 1092854 1096126 1096895 1095683 1093190 1089616 1084720 1078431 1070920 1062162 1051946 1040397 1028014
61172 1028014 1015152 1001998 989049 976876 965131 952506 938253 923203 908757 895288 882171
61161 882171 869053 856309 844274 832739 821448 810732 801320 793637 787411 781989 777013 772735 769564
61148 769564 767417 765802 764489 763687 763380 762881 761388 758762 755530 752295 749302 746383 743167 739597 736355
61133 736355 734497 734533 736258 739591 745042 752971 762942 774316 787089 801593 817745 835286 854511
61120 854511 875948 899355 923749 948555 974095 1000773 1028378 1056439 1084741 1113116 1141059
61109 1141059 1167920 1193280 1216828 1238021 1256129 1270652 1281587 1289392 1294661 1297604 1297631 1293612 1284834
61096 1284834 1271767 1255827 1238293 1219486 1198932 1176160 1151193 1124379 1096159 1067285 1038983
$$ packed form
61185A087232N622L272P69j212k493l574m896o289p511q758j0216j1549j2383
61172A028014j2862j3154j2949j2173j1745j2625j4253j5050j4446j3469j3117
61161H82171j3118j2744j2035j1535j1291j0716r412p683o226n422m976m278l171
61148G69564k147j615j313q02l07m99j493k626l232l235k993k919l216l570l242
61133G36355j858L6J725L333N451P929R971J1374J2773J4504J6152J7541J9225
61120H54511K1437K3407K4394K4806K5540K6678K7605K8061K8302K8375K7943
61109A141059K6861K5360K3548K1193J8108J4523J0935P805N269K943K7m019q778
61096A284834j3067j5940j7534j8807k0554k2772k4967k6814k8220k8874k8302
$$ plain form
61085 1038983 1012351 987551 963989 941366 920136 900805 883276 867145 852160 838105 824797
61074 824797 812707 803021 796379 791859 787979 784472 782275 781838 782418 783212 784397 786632 790194 795069 801337
61059 801337 808893 817091 825267 833618 843206 855065 869410 885589 902624 919971 937963 957534
61047 957534 979404 1003600 1029681 1057102 1085294 1113666 1141853 1169920 1198224 1227187 1257177
61036 1257177 1288317 1320271 1352413 1384444 1416703 1449770 1483878 1518838 1554388 1590447 1627094
61025 1627094 1664458 1702639 1741783 1782360 1825332 1871844 1922637 1977878 2037555 2101882 2171440
61014 2171440 2247334 2331315 2425478 2531750 2652074 2789203 2946891 3128972 3338651 3579142
61004 3579142 3854683 4170442 4531793 4944639 5416883 5959178 6583820 7302472 8123751
$$ packed form
61085A038983k6632k4800k3562k2623k1230j9331j7529j6131j4985j4055j3308
61074H24797j2090r686o642m520l880l507k197m37N80P94J185K235L562M875O268
61059H01337P556Q198Q176Q351R588J1859J4345J6179J7035J7347J7992J9571
61047I57534K1870K4196K6081K7421K8192K8372K8187K8067K8304K8963K9990
61036A257177L1140L1954L2142L2031L2259L3067L4108L4960L5550L6059L6647
61025A627094L7364L8181L9144M0577M2972M6512N0793N5241N9677O4327O9558
61014B171440P5894Q3981R4163J06272J20324J37129J57688J82081K09679K40491
61004C579142K75541L15759L61351M12846M72244N42295O24642P18652Q21279
$$ plain form
60995 8123751 9050935 10080364 11201795 12400850 13661722 14968575 16306508 17662627
60987 17662627 19024005 20368750 21654194 22814594 23776759 24485824 24922736 25103136 25064500
60978 25064500 24853744 24517295 24087890 23569674 22934247 22136430 21141578 19946211 18581381
60969 18581381 17102498 15575071 14062039 12614426 11266612 10036902 8931584 7949404
60961 7949404 7084956 6331022 5679632 5121660 4646164 4241183 3895630 3600110 3346056
60952 3346056 3125141 2930338 2757151 2602996 2465472 2341762 2229475 2127094 2033290 1946473
60942 1946473 1865400 1789611 1718725 1651686 1587286 1525221 1466051 1410202 1357490 1307613 1260592
60931 1260592 1216545 1175398 1136935 1100947 1067253 1035809 1006852 980661 957093 935535 915472
$$ packed form
60995H123751R27184J029429J121431J199055J260872J306853J337933J356119
60987A7662627J361378J344745J285444J160400R62165P09065M36912J80400l8636
60978B5064500k10756l36449m29405n18216o35427p97817r94852j195367j364830
60969A8581381j478883j527427j513032j447613j347814j229710j105318r82180
60961G949404q64448p53934o51390n57972m75496m04981l45553k95520k54054
60952C346056k20915j94803j73187j54155j37524j23710j12287j02381r3804q6817
60942A946473q1073p5789p0886o7039o4400o2065n9170n5849n2712m9877m7021
60931A260592m4047m1147l8463l5988l3694l1444k8957k6191k3568k1558k0063
$$ plain form
60920 915472 896966 880491 866357 854289 843501 833233 823344 814338 806697 800279 794520 789074 783975
60907 783975 779281 774928 770948 767492 764515 761641 758452 754824 750935 747096 743569 740357 737128 733434
60893 733434 729016 723896 718302 712602 707039 701365 695030 688008 681151 675318 670343 665348 659800 653716
60879 653716 647027 639527 631535 623885 617078 610953 605258 599905 594502 588441 581854 575858 571316 567874
60865 567874 564727 561842 559795 558739 558205 557800 557526 557455 557544 557772 558166 558775 559840 561774 564644 567871 570769
60848 570769 573206 575356 577100 578173 578815 579708 581172 582829 584088 584634 584381 583261 581212 578187 574220
60833 574220 569642 565125 561205 557808 554513 551207 548124 545302 542422 539288 536188 533613 531791 530585
60819 530585 529642 528594 527231 525535 523498 521076 518432 515952 513677 510955 507166 502727 498809 495941
$$ packed form
60920I15472j8506j6475j4134j2068j0788j0268r889r006p641o418n759n446n099
60907G83975m694m353l980l456k977k874l189l628l889l839l527l212l229l694
60893G33434m418n120n594n700n563n674o335p022o857n833m975m995n548o084
60879F53716o689p500p992p650o807o125n695n353n403o061o587n996m542l442
60865E67874l147k885k047j056n34m05k74p1Q9K28L94O09J065J934K870L227K898
60848E70769K437K150J744J073O42Q93J464J657J259N46k53j120k049l025l967
60833E74220m578m517l920l397l295l306l083k822k880l134l100k575j822j206
60819E30585r43j048j363j696k037k422k644k480k275k722l789m439l918k868
$$ plain form
60805 495941 493384 490127 486039 481737 477702 474007 470727 468046 465879 463701 460972 457661 454250 451302
60791 451302 449062 447426 446184 445196 444291 443150 441486 439408 437440 436038 435153 434464 433954 434066 435105 436699
60775 436699 438063 438788 439111 439437 439963 440892 442623 445252 448120 450376 452020 453942 456846 460569 464505
60760 464505 468165 471131 473002 473824 474259 474904 475737 476446 476985 477394 477469 477088 476548 476066 475195 473357 470776
60743 470776 468258 466145 464125 461985 459820 457403 454146 449950 445500 441345 437222 432651 427726 422956
60729 422956 418720 415263 412765 410969 409113 406798 404650 403540 403330 403046 402194 401273 400845 400759 400595 400408
60713 400408 400553 401061 401663 402319 403308 404697 406081 406984 407361 407523 407767 408285 409342 411241 414027 417337 420623
60696 420623 423461 425724 427694 429968 432941 436218 438820 440206 440909 441924 443721 446157 449120 452728
$$ packed form
60805D95941k557l257m088m302m035l695l280k681k167k178k729l311l411k948
60791D51302k240j636j242r88r05j141j664k078j968j402q85o89n10J12J039J594
60775D36699J364P25L23L26N26R29J731K629K868K256J644J922K904L723L936
60760D64505L660K966J871Q22M35O45Q33P09N39M09P5l81n40m82q71j838k581
60743D70776k518k113k020k140k165k417l257m196m450m155m123m571m925m770
60729D22956m236l457k498j796j856k315k148j110k10k84q52r21m28q6j64j87
60713D00408J45N08O02O56R89J389J384R03L77J62K44N18J057J899K786L310L286
60696D20623K838K263J970K274K973L277K602J386P03J015J797K436K963L608
$$ plain form
60682 452728 456846 460888 464277 466823 468624 469937 471232 472966 475033 476733 477486 477347 476634 475453 473934
60667 473934 472567 471696 470817 469010 466137 463099 460669 458543 455956 452921 450325 448844 448188 447577 446657
60652 446657 445742 445330 445613 446356 447135 447680 448128 448842 449858 450611 450402 449117 447308 445591 444200 443118 442304
60635 442304 441578 440535 438841 436553 434020 431568 429478 428126 427853 428637 429989 431230 431800 431468 430511 429734
60619 429734 430054 431821 434484 436972 438488 438980 438885 438508 437826 436933 436351 436554 437317 437961 438256 438645 439500 440579
60601 440579 441469 442149 442878 443840 445160 446841 448350 448734 447739 446497 446591 448547 451703 455184 458422 461020
60585 461020 462974 464998 467846 471188 473854 475332 476335 477704 479438 481187 483039 485413 488595 492779
60571 492779 498109 504302 510686 517021 523902 531950 541049 550821 561363 572822 584551 595465 605175
$$ packed form
60682D52728M118M042L389K546J801J313J295J734K067J700P53j39p13j181j519
60667D73934j367q71q79j807k873l038k430k126k587l035k596j481o56o11r20
60652D46657r15m12K83P43P79N45M48P14J016P53k09j285j809j717j391j082q14
60635D42304p26j043j694k288k533k452k090j352k73P84J352J241N70l32r57p77
60619D29734L20J767K663K488J516M92r5l77o82q93n82K03P63O44K95L89Q55J079
60601D40579Q90O80P29R62J320J681J509L84r95j242R4J956L156L481L238K598
60585D61020J954K024K848L342K666J478J003J369J734J749J852K374L182M184
60571D92779N330O193O384O335O881Q048R099R772J0542J1459J1729J0914R710
$$ plain form
60558 605175 614122 622544 629936 635723 639934 642884 644529 644480 642584 639243 635219 631255 627949 625859 625520
60543 625520 627150 630429 634829 640206 646825 654794 663845 673840 685131 698108 712638 728240 744494
60530 744494 760973 776974 791797 805134 816839 826481 833621 838406 841387 842664 841688 838064 832178
60517 832178 824935 817212 809689 802745 796217 789551 782591 776118 771352 768972 768799 770288 773136 777496
60503 777496 783909 793110 805660 821685 841004 863512 889296 918386 950591 985687 1023579 1064004
60491 1064004 1106178 1149000 1191641 1233674 1274558 1313255 1348504 1379183 1404287 1422909 1434651
60480 1434651 1439778 1438476 1430139 1413950 1390119 1359913 1324401 1283859 1238684 1190238 1140304 1090075
60468 1090075 1040196 991404 944518 899960 857815 818436 782554 750725 722860 698267 676007
$$ packed form
60558F05175Q947Q422P392N787M211K950J645m9j896l341m024l964l306k090l39
60543F25520J630L279M400N377O619P969R051R995J1291J2977J4530J5602J6254
60530G44494J6479J6001J4823J3337J1705R642P140M785K981J277r76l624n886
60517H32178p243p723p523o944o528o666o960o473m766k380j73J489K848M360
60503G77496O413R201J2550J6025J9319K2508K5784K9090L2205L5096L7892M0425
60491A064004M2174M2822M2641M2033M0884L8697L5249L0679K5104J8622J1742
60480A434651N127j302q337j6189k3831l0206l5512m0542m5175m8446m9934n0229
60468A090075m9879m8792m6886m4558m2145l9379l5882l1829k7865k4593k2260
$$ plain form
60457 676007 655438 636662 620321 606706 595223 584953 575464 566754 558730 551236 544415 538526 533475
60444 533475 528981 525124 522196 520031 517979 515626 513080 510493 507765 504847 501931 499269 497132 495958
60430 495958 496025 496848 497384 497017 495996 494785 493541 492427 491895 492198 492961 493560 493767 493792 494019 494911 496817 499512
60412 499512 502188 504160 505361 506021 506326 506624 507482 509024 510623 511692 512433 513333 514355 515307 516659 519134
60396 519134 522544 525831 528339 530383 532426 534421 536231 538100 540331 542907 545741 548893 552283 555596
60382 555596 558712 561847 564966 567563 569463 571448 574501 578591 582677 585867 588147 590088 592202 594626
60368 594626 597081 599135 600707 602249 604251 606677 609141 611430 613497 615205 616594 618289 621003 624549
60354 624549 627946 630776 633888 638386 644305 650759 657095 663407 670017 676904 683699 689924 695165 699191
$$ packed form
60457F76007k0569j8776j6341j3615j1483j0270r489q710q024p494o821n889n051
60444E33475m494l857k928k165k052k353k546k587k728k918k916k662k137j174
60430D95958O7Q23N36l67j021j211j244j114n32L03P63N99K07K5K27Q92J906K695
60412D99512K676J972J201O60L05K98Q58J542J599J069P41R00J022R52J352K475
60396E19134L410L287K508K044K043J995J810J869K231K576K834L152L390L313
60382E55596L116L135L119K597J900J985L053M090M086L190K280J941K114K424
60368E94626K455K054J572J542K002K426K464K289K067J708J389J695K714L546
60354F24549L397K830L112M498N919O454O336O312O610O887O795O225N241M026
$$ plain form
60340 699191 701971 703461 703468 701870 698874 694823 689761 683480 676092 668311 660983 654377 648053 641446 634541
60325 634541 628006 622694 618980 616533 614612 612575 610257 608071 606745 606723 607753 609215 610954 613603 617976
60310 617976 624310 632195 641039 650465 660516 671753 684946 700308 717109 734284 751314 768180
60298 768180 784593 799674 812440 822252 828746 831689 831023 826795 818902 807236 792223 775082 757320
60285 757320 740023 723635 708189 693625 680032 667676 656752 647122 638489 630708 623691 617016
60273 617016 610076 602806 595924 590189 585584 581471 577360 573321 569712 566764 564434 562479 560647 558809
60259 558809 556958 555155 553574 552500 552032 551870 551580 551086 550608 550238 549979 550165 551303 553273 555141 556134
60243 556134 556520 557214 558722 560757 562647 563800 564005 563625 563452 564103 565604 567665 570103 572863 575865 579111
$$ packed form
60340F99191K780J490Pj598k996m051n062o281p388p781p328o606o324o607o905
60325F34541o535n312l714k447j921k037k318k186j326k2J030J462J739K649M373
60310F17976O334P885Q844R426J0051J1237J3193J5362J6801J7175J7030J6866
60298G68180J6413J5081J2766R812O494K943o66m228p893j1666j5013j7141j7762
60285G57320j7297j6388j5446j4564j3593j2356j0924r630q633p781p017o675
60273F17016o940p270o882n735m605m113m111m039l609k948k330j955j832j838
60259E58809j851j803j581j074m68j62k90m94m78l70k59J86J138J970J868R93
60243E56134L86O94J508K035J890J153K05l80j73O51J501K061K438K760L002L246
$$ plain form
60227 579111 582721 586677 590865 595549 601366 608445 615911 622812 629218 635888 643082 650421 657759 665450
60213 665450 673647 682003 690297 698828 707938 717521 727231 736840 746213 755233 763927 772379 780352 787304
60199 787304 792944 797541 801477 804741 807030 808192 808437 808182 807699 806763 804729 801210 796636 791786 786833
60184 786833 781335 775167 768926 763180 757796 752292 746426 740172 733586 727136 721801 718288 716284 714839
60170 714839 713293 711424 709034 706055 703054 700953 700016 699549 698802 697822 697156 697084 697516 698413 699832 701554
60154 701554 703088 704297 705759 708179 711503 714954 718011 721064 724870 729628 734972 740707 747076 754204
60140 754204 761818 769811 778749 789317 801390 814010 826314 838183 849966 861825 873458 884225
60128 884225 893446 900734 906242 910465 913768 916131 917414 917696 917211 916049 914166 911692 909033 906526 904100
$$ packed form
60227E79111L610L956M188M684N817P079P466O901O406O670P194P339P338P691
60213F65450Q197Q356Q294Q531R110R583R710R609R373R020Q694Q452P973O952
60199G87304N640M597L936L264K289J162K45k55m83r36k034l519m574m850m953
60184G86833n498o168o241n746n384n504n866o254o586o450n335l513k004j445
60170G14839j546j869k390k979l001k101r37m67p47r80o66p2M32Q97J419J722
60154G01554J534J209J462K420L324L451L057L053L806M758N344N735O369P128
60140G54204P614P993Q938J0568J2073J2620J2304J1869J1783J1859J1633J0767
60128H84225R221P288N508M223L303K363J283K82m85j162j883k474k659k507k426
$$ plain form
60113 904100 901423 898310 894837 891123 887242 883404 879927 876773 873266 868620 862768 856461 850429 844719
60099 844719 838995 833303 828217 824211 821137 818514 816212 814704 814611 816142 819000 822630 826415 829800 832565
60084 832565 835096 838120 841995 846362 850609 854547 858431 862334 865709 867530 866824 863173 856886 848683
60070 848683 839133 828398 816528 803811 790679 777379 763964 750600 737729 725853 715242 705802
60058 705802 697210 689255 682092 676028 671100 667109 664123 662517 662282 662701 663127 663869 665800 669300 674028
60043 674028 679532 685482 691358 696585 701188 705756 710553 715058 718581 720875 721939 721742 720488 718704
60029 718704 716590 713547 708839 702565 695550 688402 681121 673622 666170 659110 652449 645903 639249 632458
60015 632458 625537 618414 611104 603922 597381 591832 587285 583618 580729 578456 576581 575165 574574 574864 575425
$$ packed form
60113I04100k677l113l473l714l881l838l477l154l507m646n852o307o032n710
60099H44719n724n692n086m006l074k623k302j508r3J531K858L630L785L385K765
60084H32565K531L024L875M367M247L938L884L903L375J821p06l651o287q203
60070H48683r550j0735j1870j2717j3132j3300j3415j3364j2871j1876j0611r440
60058G05802q592p955p163o064m928l991k986j606k35M19M26P42J931L500M728
60043F74028N504N950N876N227M603M568M797M505L523K294J064j97j254j784
60029G18704k114l043m708o274p015p148p281p499p452p060o661o546o654o791
60015F32458o921p123p310p182o541n549m547l667k889k273j875j416n91K90N61
$$ plain form
60000 575425 575696 576048 577365 579810 582614 585159 587614 590363 593478 597051 601478 606919 612842 618497 623534
59985 623534 627877 631427 634266 636766 639065 640800 641734 642225 642598 642482 641443 639915 638811 638338 638015 637812
59969 637812 638521 640775 644321 648524 653185 658602 665101 672720 681124 689722 698036 706015 713763 721049
59955 721049 727359 732372 735990 737961 737909 735829 732172 727286 721135 713722 705461 696954 688705 681230 675074
59940 675074 670368 666557 662832 658833 654808 651260 648661 647320 647229 647970 648981 650097 651800 654828 659458
59925 659458 665293 671929 679691 689308 700714 712696 724147 735344 747398 760581 773893 786296
59913 786296 797674 808296 818000 826536 834361 842424 851083 859639 867001 872599 876543 879131 880397 880207
59899 880207 878745 876695 874644 872346 868904 863843 857780 851795 846420 841537 837116 833611 831622 831450
$$ packed form
60000E75425K71L52J317K445K804K545K455K749L115L573M427N441N923N655N037
59985F23534M343L550K839K500K299J735R34M91L73j16j039j528j104m73l23k03
59969F37812P09K254L546M203M661N417O499P619Q404Q598Q314P979P748P286
59955G21049O310N013L618J971n2k080l657m886o151p413q261q507q249p475o156
59940F75074m706l811l725l999m025l548k599j341r1P41J011J116J703L028M630
59925F59458N835O636P762R617J1406J1982J1451J1197J2054J3183J3312J2403
59913G86296J1378J0622R704Q536P825Q063Q659Q556P362N598L944K588J266j90
59899H80207j462k050k051k298l442n061o063n985n375m883m421l505j989j72
$$ plain form
59885 831450 833056 836231 840669 846086 852394 859642 867629 875767 883521 890985 898770 907221 915823 923536
59871 923536 929684 934397 938211 941350 943495 944120 942940 940056 935750 930220 923531 915800 907315 898280
59857 898280 888463 877370 864974 852119 839990 829223 819691 811058 803245 796365 790495 785668 781941
59844 781941 779356 777987 778079 779955 783554 788109 792494 796052 799043 802258 806141 810267 813663 815675 816535
59829 816535 817112 818114 819501 820609 820761 819761 817860 815264 811756 806865 800435 792918 785047 777337 769988
59814 769988 763180 757259 752489 748687 745194 741244 736439 730901 725061 719362 714169 709763 706221 703274
59800 703274 700481 697575 694529 691289 687656 683525 679102 674773 670864 667554 664818 662371 659828 657071
59786 657071 654353 651971 649997 648414 647324 646871 647039 647576 648047 648034 647663 647981 650326 655001 660841 666341
$$ packed form
59885H31450J606L175M438N417O308P248P987Q138P754P464P785Q451Q602P713
59871I23536O148M713L814L139K145O25j180k884m306n530o689p731q485r035
59857H98280r817j1093j2396j2855j2129j0767r532q633p813o880n870m827l727
59844G81941k585j369R2J876L599M555M385L558K991L215L883M126L396K012Q60
59829H16535N77J002J387J108J52j000j901k596l508m891o430p517p871p710p349
59814G69988o808n921m770l802l493l950m805n538n840n699n193m406l542k947
59800G03274k793k906l046l240l633m131m423m329l909l310k736k447k543k757
59786F57071k718k382j974j583j090m53J68N37M71j3l71L18K345M675N840N500
$$ plain form
59770 666341 671018 675470 680531 686747 694360 703251 712999 723339 734426 746339 758596 770712 783017
59757 783017 796338 810892 826095 841437 856971 872834 888886 905035 921479 938282 954991
59746 954991 970889 985404 998219 1009209 1018381 1025638 1030632 1033137 1033418 1031875 1028401 1022659 1014953
59733 1014953 1006132 996573 986006 974628 963591 953776 944694 935262 925263 915363 905992 896982 888216
59720 888216 879910 872173 864817 857790 851379 845813 840953 836518 832455 828986 826380 824632 823266 821668
59706 821668 819847 818690 819091 820955 823432 826043 829039 832638 836512 840326 844300 848797 853581 857996
59692 857996 861765 865151 868251 870629 871927 872498 872921 872911 871294 867379 862035 856914 852708 848669 843892
59677 843892 838474 833016 827453 821061 813557 805609 798078 791257 785103 779824 775727 772610 769834 767095
$$ packed form
59770F66341M677M452N061O216P613Q891R748J0340J1087J1913J2257J2116J2305
59757G83017J3321J4554J5203J5342J5534J5863J6052J6149J6444J6803J6709
59746I54991J5898J4515J2815J0990R172P257M994K505K81j543l474n742p706
59733A014953q821r559j0567j1378j1037r815r082r432r999r900r371r010q766
59720H88216q306p737p356p027o411n566m860m435m063l469k606j748j366j598
59706H21668j821j157M01J864K477K611K996L599L874L814L974M497M784M415
59692H57996L769L386L100K378J298N71M23j0j617l915n344n121m206m039m777
59677H43892n418n458n563o392p504p948p531o821o154n279m097l117k776k739
$$ plain form
59663 767095 764782 763355 762679 762300 762238 763059 765070 767764 770281 772268 774068 776131 778431 780448 781616
59648 781616 781786 781288 780504 779370 777410 774253 769960 764789 758916 752553 746036 739517 732765 725613 718430
59633 718430 711780 705731 699923 694288 689287 685278 682010 678844 675216 670871 665932 660817 655832 650866
59619 650866 645763 640911 637013 634215 631962 629822 627896 626187 624146 621369 618435 616561 616549 618265 620924
59604 620924 623560 625504 626789 627939 629084 629591 628930 627636 626827 626900 627210 627070 626608 626475 627002 627808 628047
59587 628047 627072 625012 622714 620988 620000 619511 619370 619350 618802 617095 614486 611979 610153 608579 606635 604450
59571 604450 602695 601680 601010 599996 598186 595678 593181 591640 591513 592421 593552 594290 594338 593613 592393 591457
59555 591457 591574 592792 594494 596153 597752 599447 601295 603501 606534 610651 615532 620727 626295 632658
$$ packed form
59663G67095k313j427o76l79o2Q21K011K694K517J987J800K063K300K017J168
59648G81616J70m98p84j134j960l157m293n171n873o363o517o519o752p152p183
59633G18430o650o049n808n635n001m009l268l166l628m345m939n115m985m966
59619F50866n103m852l898k798k253k140j926j709k041k777k934j874j2J716K659
59604F20924K636J944J285J150J145N07o61j294q09P3L10j40m62j33N27Q06K39
59587F28047r75k060k298j726r88m89j41k0n48j707k609k507j826j574j944k185
59571F04450j755j015o70j014j810k508k497j541j27R08J131P38M8p25j220r36
59555E91457J17J218J702J659J599J695J848K206L033M117M881N195N568O363
$$ plain form
59541 632658 639976 648088 656953 666657 676936 687208 697240 707382 717905 728485 738518 747547
59529 747547 755078 760410 763169 763807 763193 761921 760333 758890 757919 757115 755825 753794 751145 747758 743288
59514 743288 737807 731812 725452 718321 710252 701833 693812 686368 679249 672348 665836 659923 654671 649939
59500 649939 645497 641446 638381 636714 635876 634762 633107 631823 631736 632557 633458 634204 635318 637474 641100 646189
59484 646189 652114 657876 662906 667434 671934 676633 681778 687806 694742 701833 708282 714053 719514 724642
59470 724642 729091 732748 735747 738174 740256 742563 745446 748514 751158 753392 755710 758439 761842 766609
59456 766609 773424 782046 791398 800618 809553 818321 826960 835497 843826 851454 857788 862621 865926 867340
59442 867340 866494 863774 860106 855899 850785 844427 837017 828887 820274 811659 803849 797474 792738 789659
$$ packed form
59541F32658P318Q112Q865R704J0279J0272J0032J0142J0523J0580J0033R029
59529G47547P531N332K759O38o14j272j588j443r71q04j290k031k649l387m470
59514G43288n481n995o360p131q069q419q021p444p119o901o512n913n252m732
59500F49939m442m051l065j667q38j114j655j284q7Q21R01P46J114K156L626N089
59484F46189N925N762N030M528M500M699N145O028O936P091O449N771N461N128
59470G24642M449L657K999K427K082K307K883L068K644K234K318K729L403M767
59456G66609O815Q622R352R220Q935Q768Q639Q537Q329P628O334M833L305J414
59442H67340q46k720l668m207n114o358p410q130q613q615p810o375m736l079
$$ plain form
59428 789659 788134 787757 788130 789465 792425 797330 803984 812252 822205 833693 846467 860801 877228 895472
59414 895472 914346 932931 951071 968476 984320 998234 1010825 1022407 1031930 1038014 1040539 1040324
59402 1040324 1037753 1032804 1026307 1020045 1015296 1011969 1009375 1007213 1005387 1003284 999650 993083 982690 968603
59388 968603 952114 935113 919104 904757 892215 881584 872973 866210 860750 855933 851420 847356 844103
59375 844103 841844 840577 840362 841209 842735 844334 845933 848153 851332 854752 857384 859268 861608 865448 870723
59360 870723 876759 883175 890044 897514 905736 915109 926179 939145 953603 968873 984514 1000457 1016714
59347 1016714 1033167 1049704 1066430 1083520 1100832 1117754 1133445 1147177 1158524 1167407 1173974 1178255
59335 1178255 1179863 1178160 1172821 1164151 1152859 1139611 1124806 1108604 1091094 1072587 1053814 1035720
$$ packed form
59428G89659j525l77L73J335K960M905O654Q268R953J1488J2774J4334J6427J8244
59414H95472J8874J8585J8140J7405J5844J3914J2591J1582R523O084K525k15
59402A040324k571m949o497o262m749l327k594k162j826k103l634o567j0393j4087
59388I68603j6489j7001j6009j4347j2542j0631q611o763n460m817m513m064l253
59375H44103k259j267k15Q47J526J599J599K220L179L420K632J884K340L840N275
59360H70723O036O416O869P470Q222R373J1070J2966J4458J5270J5641J5943J6257
59347A016714J6453J6537J6726J7090J7312J6922J5691J3732J1347Q883O567M281
59335A178255J608j703n339q670j1292j3248j4805j6202j7510j8507j8773j8094
$$ plain form
59323 1035720 1018914 1003352 988551 974096 959945 946373 933690 922007 911335 901848 893808 887076
59311 887076 880985 874997 869318 864473 860468 856826 853383 850422 847968 845578 843092 841081 840139 840163 840686
59296 840686 841591 843086 845285 848313 852605 858531 865730 873176 879979 885863 890888 894987 897856 899130
59282 899130 898651 896684 893864 890913 888544 887682 889377 894090 901183 909483 918330 927801 937983 948489
59268 948489 958859 969118 979587 990180 1000088 1008216 1013868 1016942 1017571 1015806 1011768 1005952 999088
59255 999088 991718 984156 976820 970242 964560 959346 954168 949173 944860 941482 938944 937179 936303 936361 937104
59240 937104 938096 939010 939901 941195 943257 945878 948338 949994 950598 950054 948207 945143 941313 937084 932342
59225 932342 926823 920564 913718 906207 898059 889829 882117 874653 866502 857273 847584 838087 828622 818825
$$ packed form
59323A035720j6806j5562j4801j4455j4151j3572j2683j1683j0672r487q040o732
59311H87076o091n988n679m845m005l642l443k961k454k390k486k011r42K4N23
59296H40686R05J495K199L028M292N926P199P446O803N884N025M099K869J274
59282H99130m79j967k820k951k369q62J695M713P093Q300Q847R471J0182J0506
59268I48489J0370J0259J0469J0593R908Q128N652L074O29j765m038n816o864
59255I99088p370p562p336o578n682n214n178m995m313l378k538j765q76N8P43
59240I37104R92R14Q91J294K062K621K460J656O04n44j847l064l830m229m742
59225I32342n519o259o846p511q148q230p712p464q151r229r689r497r465r797
$$ plain form
59211 818825 809131 800520 793271 786647 779977 773592 768358 764587 761884 759920 758791 758467 758392 758046 757693
59196 757693 758135 759808 762476 765787 769727 774455 780050 786512 793689 801080 808101 814741 821621 829087
59182 829087 836555 843091 848536 853734 859691 866684 874133 881120 887124 892378 897449 902431 906787 910136
59168 910136 912880 915693 918561 920768 921794 921877 921578 921068 919980 917804 914220 909100 902358 893915 883848
59153 883848 872458 860107 847034 833493 820006 807267 795738 785410 775960 766982 758166 749508
59141 749508 741336 733909 727126 720936 715895 712730 711294 710607 710124 710362 711958 714737 718176 722199 726883
59126 726883 731806 736483 741239 746952 753976 761923 770378 779169 787970 796362 804483 813007 822225 831614
59112 831614 840528 848843 856644 863761 870078 875941 881780 887412 892169 895698 898229 899946 900506 899500
$$ packed form
59211H18825r694q611p249o624o670o385n234l771k703j964j129l24p5l46l53
59196G57693M42J673K668L311L940M728N595O462P177P391P021O640O880P466
59182H29087P468O536N445N198N957O993P449O987O004N254N071M982M356L349
59168I10136K744K813K868K207J026Q3k99n10j088k176l584n120o742q443j0067
59153H83848j1390j2351j3073j3541j3487j2739j1529j0328r450q978q816q658
59141G49508q172p427o783o190n041l165j436o87m83K38J596K779L439M023M684
59126G26883M923M677M756N713P024P947Q455Q791Q801Q392Q121Q524R218R389
59112H31614Q914Q315P801P117O317N863N839N632M757L529K531J717N60j006
$$ plain form
59098 899500 897220 894550 892095 889747 887201 884520 881872 879120 876142 873330 871083 868850 865424 860436
59084 860436 854884 849845 845253 840411 835128 829662 823899 817360 809920 801967 793832 785586 777410 769749
59070 769749 762976 757034 751397 745364 738705 732142 726717 722476 718365 713828 709794 707326 705861 703830
59056 703830 700709 697447 694988 693395 692479 692198 692138 691533 690270 689199 689064 689693 690519 691298 692032 692833 694194
59039 694194 696803 700684 705108 709768 715442 722980 732217 742429 753471 765789 779628 794852 811374
59026 811374 829220 848175 867710 887176 905860 923134 938929 953772 967863 980161 988846 992725
59014 992725 992006 987798 981207 972867 963047 952024 940365 928834 918005 908118 899319 891862 885988
59001 885988 881759 879041 877454 876454 875810 875955 877429 879910 882327 884067 885488 887005 888258 888653 888230
$$ packed form
59098H99500k280k670k455k348k546k681k648k752k978k812k247k233l426m988
59084H60436n552n039m592m842n283n466n763o539p440p953q135q246q176p661
59070G69749o773n942n637o033o659o563n425m241m111m537m034k468j465k031
59056G03830l121l262k459j593r16k81o0o05j263j071j35O29Q26P79P34Q01J361
59039F94194K609L881M424M660N674P538R237J0212J1042J2318J3839J5224J6522
59026H11374J7846J8955J9535J9466J8684J7274J5795J4843J4091J2298Q685L879
59014I92725p19m208o591q340r820j1023j1659j1531j0829r887q799p457n874
59001H85988m229k718j587j000o44J45J474K481K417J740J421J517J253L95m23
$$ plain form
58986 888230 887563 887154 887317 888203 889448 890294 890653 891690 894656 899520 905448 912311 920722 930750 941630
58971 941630 952923 965005 978006 991087 1003327 1014781 1026066 1037281 1047877 1057306 1065254 1071423
58959 1071423 1075589 1077838 1078360 1076993 1073310 1067151 1058830 1048789 1037330 1024686 1011085 996648 981440
58946 981440 965746 950161 935375 921969 910473 901303 894432 889262 885102 881800 879708 879105 879869
58933 879869 881737 884519 887876 891109 893541 895074 896137 897054 897622 897287 895564 892208 887224 880855 873559
58918 873559 865924 858546 851896 846207 841532 837969 835770 835134 836022 838268 841741 846290 851751 858276 866479
58903 866479 876908 889406 903231 917731 932644 947942 963833 980807 999121 1018207 1037117
58892 1037117 1055595 1074125 1092819 1110957 1128035 1144553 1161195 1177672 1193063 1206937 1219422
$$ packed form
58986H88230o67m09J63Q86J245Q46L59J037K966M864N928O863Q411J0028J0880
58971I41630J1293J2082J3001J3081J2240J1454J1285J1215J0596R429P948O169
58959A071423M166K249N22j367l683o159q321j0041j1459j2644j3601j4437j5208
58946I81440j5694j5585j4786j3406j1496r170o871n170m160l302k092o03P64
58933H79869J868K782L357L233K432J533J063R17N68l35j723l356m984o369p296
58918H73559p635p378o650n689m675l563k199o36Q88K246L473M549N461O525Q203
58903H66479J0429J2498J3825J4500J4913J5298J5891J6974J8314J9086J8910
58892A037117J8478J8530J8694J8138J7078J6518J6642J6477J5391J3874J2485
$$ plain form
58881 1219422 1230352 1239085 1245197 1248759 1249834 1248300 1244313 1238441 1231101 1222276 1211994 1200696 1188837
58868 1188837 1176467 1163562 1150613 1138516 1127940 1118944 1111091 1103700 1096174 1088359 1080624 1073445 1066946
58855 1066946 1060995 1055548 1050578 1045736 1040502 1034717 1028619 1022160 1014764 1006010 996225 985882 974657
58842 974657 961654 946576 930097 913035 895753 878666 862659 848366 835355 822679 810197
58831 810197 798869 789708 782862 777813 774064 771415 769807 769140 769260 770099 771748 774191 776947 779335 781291
58816 781291 783583 786819 790538 793754 796070 797717 798726 798817 798076 797011 795761 793932 791369 788403 785078
58801 785078 780867 775588 769997 764889 760100 754993 749559 744335 739455 734530 729529 725206 722414 721321
58787 721321 721418 722055 722827 723657 724748 726476 729253 733305 738464 744169 749814 755056 759656 763175 765150
$$ packed form
58881A219422J0930Q733O112L562J075j534l987n872p340q825j0282j1298j1859
58868A188837j2370j2905j2949j2097j0576q996p853p391p526p815p735p179o499
58855A066946n951n447m970m842n234n785o098o459p396q754r785j0343j1225
58842I74657j3003j5078j6479j7062j7282j7087j6007j4293j3011j2676j2482
58831H10197j1328r161o846n049l749k649j608o67J20Q39J649K443K756K388J956
58816G81291K292L236L719L216K316J647J009R1p41j065j250j829k563k966l325
58801G85078m211n279n591n108m789n107n434n224m880m925n001m323k792j093
58787G21321R7O37P72Q30J091J728K777M052N159N705N645N242M600L519J975
$$ plain form
58772 765150 765589 764981 763733 761847 759237 756076 752768 749801 747631 746444 746046 746222 747092 748692 750408
58757 750408 751489 752129 753319 755422 757641 759164 760067 760606 760401 759030 756925 755015 753796 753347 753793 755109
58741 755109 756796 758567 761089 765286 770939 776742 781713 785937 789963 794165 798815 804170 810172 816434
58727 816434 822658 828726 834327 839018 842851 846554 850744 855193 859142 862250 864986 868033 871486 874827
58713 874827 877645 880011 881909 882622 881341 878269 874331 869589 862740 852742 840242 826736 812898 798524
58699 798524 783689 768914 754271 739257 723746 708349 693625 679509 665808 652834 641225
58688 641225 631329 622883 615228 607889 601085 595444 591009 586908 582388 577848 574296 572049 570556 569330
58674 569330 568413 568053 568512 570111 572836 576029 579174 582875 588272 595458 603291 610874 618293 625634 632189
$$ packed form
58772G65150M39o08j248j886k610l161l308k967k170j187l98J76Q70J600J716
58757G50408J081O40J190K103K219J523R03N39k05j371k105j910j219m49M46J316
58741G55109J687J771K522M197N653N803M971M224M026M202M650N355O002O262
58727H16434O224O068N601M691L833L703M190M449L949L108K736L047L453L341
58713H74827K818K366J898P13j281l072l938m742o849r998j2500j3506j3838j4374
58699G98524j4835j4775j4643j5014j5511j5397j4724j4116j3701j2974j1609
58688F41225r896q446p655p339o804n641m435m101m520m540l552k247j493j226
58674E69330r17l60M59J599K725L193L145L701N397P186P833P583P419P341O555
$$ plain form
58659 632189 637263 641067 644116 646093 645935 642974 637619 631066 624523 618533 612805 606835 600708 595073
58645 595073 590364 586476 583218 580584 578408 576299 574203 572576 571731 571425 571458 572194 574030 576586 578913
58630 578913 580433 581377 582385 583889 585748 587271 587699 586912 585632 584917 585559 587867 591642 596211 600830
58615 600830 605342 610236 615874 621859 627408 632226 636764 641654 646956 651985 655889 658436 660085 661190
58601 661190 661490 660788 659839 659828 660981 662349 663188 663917 665404 667908 671199 675275 680372 686516 693560 701592
58585 701592 710885 721452 732968 745091 757651 770514 783472 796248 808558 820272 831615 843060
58573 843060 854865 866851 878796 890994 904259 919368 936546 955459 975704 997345 1020848
58562 1020848 1046370 1073136 1099665 1124479 1146491 1164992 1179799 1191406 1200516 1207247 1211042 1211402
$$ packed form
58659F32189N074L804L049J977j58k961n355o553o543n990n728n970o127n635
58645E95073m709l888l258k634k176k109k096j627q45l06L3P36J836K556K327
58630E78913J520R44J008J504J859J523M28p87j280p15O42K308L775M569M619
58615F00830M512M894N638N985N549M818M538M890N302N029L904K547J649J105
58601F61190L00p02r49j1J153J368Q39P29J487K504L291M076N097O144P044Q032
58585G01592R293J0567J1516J2123J2560J2863J2958J2776J2310J1714J1343J1445
58573H43060J1805J1986J1945J2198J3265J5109J7178J8913K0245K1641K3503
58562A020848K5522K6766K6529K4814K2012J8501J4807J1607R110O731L795L60
$$ plain form
58550 1211402 1208431 1202653 1194718 1185390 1175371 1164850 1153425 1140638 1126393 1110806 1093959 1075954
58538 1075954 1056933 1036895 1015683 993291 970042 946476 923308 901464 881755 864380 848977
58527 848977 835234 823139 812607 803289 794914 787533 781267 776059 771734 768072 764760 761605 758836
58514 758836 756877 755681 754602 752974 750626 747891 745444 743976 743516 743088 741656 739456 737777 737323 737433
58499 737433 737206 736691 736580 737282 738826 741213 744332 747786 751248 754847 758939 763793 769772 777445 787099
58484 787099 798344 810566 823621 837734 852930 868868 885182 901679 918177 934196 948744
58473 948744 960523 968692 973508 975901 976352 974531 970066 963235 954766 945441 936168 928038 921919 918139
58459 918139 916705 917593 920756 926058 933231 941616 950071 957664 964397 970687 976130 979502 980064 978059 973775
$$ packed form
58550A211402k971n778p935r328j0019j0521j1425j2787j4245j5587j6847j8005
58538A075954j9021k0038k1212k2392k3249k3566k3168k1844j9709j7375j5403
58527H48977j3743j2095j0532r318q375p381o266n208m325l662l312l155k769
58514G58836j959j196j079j628k348k735k447j468m60m28j432k200j679m54J10
58499G37433k27n15j11P02J544K387L119L454L462L599M092M854N979P673R654
58484G87099J1245J2222J3055J4113J5196J5938J6314J6497J6498J6019J4548
58473I48744J1779Q169M816K393M51j821m465o831q469r325r273q130o119l780
58459I18139j434Q88L163N302P173Q385Q455P593O733O290N443L372N62k005m284
$$ plain form
58444 973775 967010 957914 947508 936773 925879 914901 904656 896096 889371 884210 880826 879720 880819
58431 880819 883465 887114 891541 896573 902129 908380 915443 923056 930830 938508 945603 951192 954585 955945
58417 955945 955765 953949 949946 943582 935322 925845 915754 905573 895589 885706 875724 865667 855774 846401
58403 846401 838057 831178 825693 821087 817058 813683 810853 808146 805480 803298 801730 800105 797640 794121
58389 794121 789600 784051 777775 771513 765625 759737 753706 748419 745069 744125 745538 749420 756016 765502
58375 765502 778245 794561 813566 833057 851317 868517 885577 902397 918218 933169 948210
58364 948210 963715 979200 994448 1009995 1026282 1042938 1058967 1073284 1085276 1095230 1103988 1111777
58352 1111777 1117845 1121595 1123530 1124493 1124721 1124463 1124917 1127504 1132466 1138979 1146331 1154224 1162319 1170488 1179318
$$ packed form
58444I73775o765r096j0406j0735j0894j0978j0245q560o725n161l384j106J099
58431H80819K646L649M427N032N556O251P063P613P774P678P095N589L393J360
58417I55945j80j816m003o364q260r477j0091j0181r984r883r982j0057r893r373
58403H46401q344o879n485m606m029l375k830k707k666k182j568j625k465l519
58389G94121m521n549o276o262n888n888o031n287l350r44J413L882O596R486
58375G65502J2743J6316J9005J9491J8260J7200J7060J6820J5821J4951J5041
58364I48210J5505J5485J5248J5547J6287J6656J6029J4317J1992R954Q758P789
58352A111777O068L750J935R63K28k58M54K587M962O513P352P893Q095Q169Q830
$$ plain form
58337 1179318 1189564 1201267 1214035 1227783 1242453 1257439 1272119 1286541 1300723 1313821 1325034
58326 1325034 1334868 1344294 1352976 1359593 1363797 1366642 1369106 1371331 1373436 1375957 1379243 1383245 1388095 1394174
58312 1394174 1401542 1409973 1419511 1430281 1441933 1454025 1466872 1481225 1497183 1514105 1531414 1548826
58300 1548826 1566071 1583197 1600894 1619687 1639037 1658055 1676835 1696238 1716671 1737923 1759940
58289 1759940 1782877 1806639 1831150 1856774 1883732 1911644 1940384 1970681 2002900 2036044 2069156
58278 2069156 2102916 2138583 2176103 2214788 2255065 2297842 2342687 2388490 2435467 2484632 2535609
58267 2535609 2586989 2638761 2692442 2748735 2806913 2866616 2928426 2992463 3058160 3125629 3195509
58256 3195509 3267237 3339152 3410672 3482826 3556518 3631828 3709209 3789779 3874232 3962916 4056991
$$ packed form
58337A179318J0246J1703J2768J3748J4670J4986J4680J4422J4182J3098J1213
58326A325034R834R426Q682O617M204K845K464K225K105K521L286M002M850O079
58312A394174P368Q431R538J0770J1652J2092J2847J4353J5958J6922J7309J7412
58300A548826J7245J7126J7697J8793J9350J9018J8780J9403K0433K1252K2017
58289A759940K2937K3762K4511K5624K6958K7912K8740L0297L2219L3144L3112
58278B069156L3760L5667L7520L8685M0277M2777M4845M5803M6977M9165N0977
58267B535609N1380N1772N3681N6293N8178N9703O1810O4037O5697O7469O9880
58256C195509P1728P1915P1520P2154P3692P5310P7381Q0570Q4453Q8684R4075
$$ plain form
58245 4056991 4157903 4265771 4379911 4500797 4629777 4767092 4912184 5065812 5229792
58236 5229792 5404761 5590311 5787231 5997400 6221541 6459479 6712616 6983737 7274358
58227 7274358 7584824 7917086 8274824 8660766 9076609 9525662 10012853 10542118 11116857
58218 11116857 11743247 12430323 13186959 14022130 14948512 15983071 17144812 18456308 19948418
58209 19948418 21661221 23641811 25945387 28636872 31784937 35453152 39701088 44594104
58201 44594104 50209405 56638085 63993138 72420315 82099072 93232168 106022101 120613356
58193 120613356 136998954 154954876 174071175 193847494 213754697 233251907 251843557
58186 251843557 269160676 284886404 298450422 308760769 314353689 313974720 307161611
$$ packed form
58245D056991J00912J07868J14140J20886J28980J37315J45092J53628J63980
58236E229792J74969J85550J96920K10169K24141K37938K53137K71121K90621
58227G274358L10466L32262L57738L85942M15843M49053M87191N29265N74739
58218A1116857O26390O87076P56636Q35171R26382J034559J161741J311496J492110
58209A9948418J712803J980590K303576K691485L148065L668215M247936M893016
58201D4594104N615301O428680P355053Q427177R678757J1133096J2789933J4591255
58193A20613356J6385598J7955922J9116299J9776319J9907203J9497210J8591650
58186B51843557J7317119J5725728J3564018J0310347N592920l78969o813109
$$ plain form
58179 307161611 294416781 276968641 256400654 234337315 212194820 191000641 171352410
58172 171352410 153523944 137603043 123552253 111208085 100300882 90524140 81612831
58165 81612831 73388377 65762924 58716142 52261367 46416484 41186555 36555458 32484481
58157 32484481 28919992 25806464 23094149 20737903 18694744 16924955 15392523 14062982
58149 14062982 12903554 11886808 10991696 10200069 9494807 8862188 8292855 7778650 7310775
58140 7310775 6882211 6489311 6129274 5797983 5491758 5209159 4949399 4710425 4489834
58131 4489834 4286216 4098328 3924139 3761630 3609363 3465607 3328292 3196534 3070867
58122 3070867 2951311 2836634 2726197 2621115 2522739 2431165 2345827 2266262 2191623 2120664
$$ packed form
58179C07161611j2744830j7448140k0567987k2063339k2142495k1194179j9648231
58172A71352410j7828466j5920901j4050790j2344168j0907203r776742q911309
58165H1612831q224454p625453p046782o454775n844883n229929m631097m070977
58157C2484481l564489l113528k712315k356246k043159j769789j532432j329541
58149A4062982j159428j016746q95112p91627p05262o32619n69333n14205m67875
58140G310775m28564l92900l60037l31291l06225k82599k59760k38974k20591
58131D489834k03618j87888j74189j62509j52267j43756j37315j31758j25667
58122C070867j19556j14677j10437j05082r8376r1574q5338p9565p4639p0959
$$ plain form
58112 2120664 2052877 1988670 1928042 1870275 1815204 1763369 1714471 1667093 1620411 1574815 1530428
58101 1530428 1486623 1443624 1402893 1365021 1328758 1293131 1259121 1228091 1199763 1172988 1147551
58090 1147551 1123985 1102362 1082372 1064023 1047306 1031608 1016242 1001072 986083 970975 955745
58079 955745 940908 926485 911522 895350 878680 862674 847497 832492 817322 802245 787592
58068 787592 773581 760354 747845 735941 724998 715619 707607 699799 691334 682536 674190 666554 659480
58055 659480 652866 646488 639944 633185 626627 620365 613845 606681 599185 591733 584239 576701 569651 563564
58041 563564 558312 553601 549417 545603 541527 536652 531070 525117 518947 512732 506745 500841 494396 487058
58027 487058 479151 471156 463371 456244 450259 445151 440004 434544 429558 425644 422350 419126 416281 414309
$$ packed form
58112B120664o7787o4207o0628n7767n5071n1835m8898m7378m6682m5596m4387
58101A530428m3805m2999m0731l7872l6263l5627l4010l1030k8328k6775k5437
58090A147551k3566k1623j9990j8349j6717j5698j5366j5170j4989j5108j5230
58079I55745j4837j4423j4963j6172j6670j6006j5177j5005j5170j5077j4653
58068G87592j4011j3227j2509j1904j0943r379q012p808q465q798q346p636p074
58055F59480o614o378o544o759o558o262o520p164p496p452p494p538p050o087
58041E63564n252m711m184l814m076m875n582n953o170o215n987n904o445p338
58027D87058p907p995p785p127n985n108n147n460m986l914l294l224k845j972
$$ plain form
58013 414309 412968 411835 411194 411536 412599 413637 414337 414897 415561 416713 419048 423037 428420 434650 441424
57998 441424 448299 454369 458998 462474 465270 467001 466866 464815 461572 457617 452817 447032 440547 433882
57984 433882 427476 421497 415763 410124 405040 401230 398411 395032 389916 383693 378032 373864 371007 368996
57970 368996 367379 365452 362742 359770 357644 356745 356399 355853 354980 354009 353086 352269 351558 350849 350107 349506 349099
57953 349099 348537 347522 346337 345443 344702 343547 341915 340517 340174 341338 344230 348903 354996 361800 368797
57938 368797 376015 383855 392634 402115 411316 419030 424866 429592 434161 438683 442680 445911 448273 449148
57924 449148 447676 443845 438694 433298 427990 422655 417266 411833 406251 400527 394988 390084 386099 383097
57910 383097 380984 379563 378704 378448 378765 379285 379462 379035 378101 376859 375545 374572 374302 374620 374947 374841 374387
$$ packed form
58013D14309j341j133o41L42J063J038P00N60O64J152K335L989N383O230O774
57998D41424O875O070M629L476K796J731j35k051l243l955m800n785o485o665
57984D33882o406n979n734n639n084l810k819l379n116o223n661m168k857k011
57970C68996j617j927k710k972k126q99l46n46q73r71r23q17p11p09p42o01m07
57953C49099n62j015j185q94p41j155j632j398l43J164K892M673O093O804O997
57938C68797P218P840Q779R481R201P714N836M726M569M522L997L231K362Q75
57924D49148j472l831n151n396n308n335n389n433n582n724n539m904l985l002
57910C83097k113j421q59k56L17N20J77m27r34j242j314r73k70L18L27j06m54
$$ plain form
57893 374387 373949 373662 373266 372376 370894 369130 367453 365856 364117 362377 361158 360589 359963 358502 356315 354228
57877 354228 352790 351815 350705 348863 345959 342285 338831 336568 335678 335746 336523 337989 339827 341558 343385
57862 343385 346290 350931 356860 363158 369493 376127 383078 389781 395602 400391 404426 407997 411158 413743
57848 413743 415446 415924 415047 413164 410947 408764 406287 402951 398745 394205 389654 384849 379562 374089 368908
57833 368908 364203 360013 356544 353871 351584 349206 346890 345246 344543 344433 344402 344079 343141 341361 338886 336205
57817 336205 333707 331432 329219 326847 324020 320586 316857 313516 311049 309348 307861 306008 303548 300722
57803 300722 298021 295667 293384 290792 287971 285452 283732 282892 282581 282232 281528 280879 281235 283173 286326 289966
57787 289966 293890 298405 303641 309360 315382 321770 328586 335826 343549 351705 359813 367134 373249 378234
$$ packed form
57893C74387m38k87l96q90j482j764j677j597j739j740j219n69o26j461k187k087
57877C54228j438r75j110j842k904l674l454k263q90O8P77J466J838J731J827
57862C43385K905M641N929O298O335O634O951O703N821M789M035L571L161K585
57848D13743J703M78q77j883k217k183k477l336m206m540m551m805n287n473n181
57833C68908m705m190l469k673k287k378k316j644p03j10l1l23r38j780k475k681
57817C36205k498k275k213k372k827l434l729l341k467j701j487j853k460k826
57803C00722k701k354k283k592k821k519j720q40l11l49p04o49L56J938L153L640
57787B89966L924M515N236N719O022O388O816P240P723Q156Q108P321O115M985
$$ plain form
57773 378234 382300 385493 387714 388791 388593 387282 385306 382882 379702 375498 370672 365836 360878 355095
57759 355095 348278 341109 334398 328434 323241 318887 315316 312305 309859 308324 307849 308054 308432 308831 309383
57744 309383 310252 311673 313897 316823 319836 322275 324002 325381 326850 328611 330537 332284 333597 334581 335572
57729 335572 336735 337991 339284 340688 342140 343326 343926 343930 343646 343527 343844 344351 344337 343175 340721 337090 332392
57712 332392 327026 321928 317899 314751 311627 308072 304262 300293 295948 291297 286870 283027 279600 276361
57698 276361 273363 270709 268442 266763 265803 265080 263840 262132 260845 260415 260262 259959 260152 261689 264480 268035
57682 268035 272621 279010 287356 297274 309050 323991 343371 367511 395949 428050 463292 501347
57670 501347 542059 585094 629526 673948 716978 757453 794066 824900 847233 857857 854102 835182
$$ packed form
57773C78234M066L193K221J077j98j311j976k424l180m204m826m836m958n783
57759C55095o817p169o711n964n193m354l571l011k446j535m75K05L78L99N52
57744C09383Q69J421K224K926L013K439J727J379J469J761J926J747J313R84R91
57729C35572J163J256J293J404J452J186O00Mk84j19L17N07j4j162k454l631m698
57712C32392n366n098m029l148l124l555l810l969m345m651m427l843l427l239
57698B76361k998k654k267j679r60p23j240j708j287m30j53l03J93J537K791L555
57682B68035M586O389Q346R918J1776J4941J9380K4140K8438L2101L5242L8055
57670E01347M0712M3035M4432M4422M3030M0475L6613L0834K2333J0624l755j8920
$$ plain form
57658 835182 802752 760156 711243 659721 608840 560818 516497 475912 439189 406712 378700
57647 378700 355044 335460 319447 306260 295361 286776 280534 275870 271568 267203 263560 261570 261155
57634 261155 261231 260601 258687 255741 252615 250213 248917 248443 248158 247502 246250 244613 243056 241790 240448 238382
57618 238382 235302 231537 227789 224760 222823 221763 220891 219647 218053 216470 215126 214107 213567 213518 213551 213205
57602 213205 212546 211954 211405 210473 209135 208004 207514 207259 206500 204990 202970 200614 197887 194837 191671 188481
57586 188481 185180 181814 178760 176476 175058 174066 172770 170606 167527 163955 160371 156904 153366 149752
57572 149752 146575 144454 143320 142326 140772 138874 137251 135916 134316 132326 130567 129513 128889 128287 127863
57557 127863 127975 128546 129280 130167 131234 132146 132713 133547 135450 138251 140981 143223 145462 147959 150074 151146
$$ packed form
57658H35182l2430m2596m8913n1522n0881m8022m4321m0585l6723l2477k8012
57647C78700k3656j9584j6013j3187j0899q585o242m664m302m365l643j990m15
57634B61155P6o30j914k946l126k402j296m74k85o56j252j637j557j266j342k066
57618B38382l080l765l748l029j937j060q72j244j594j583j344j019n40m9L3l46
57602B13205o59n92n49r32j338j131m90k55p59j510k020k356k727l050l166l190
57586A88481l301l366l054k284j418r92j296k164l079l572l584l467l538l614
57572A49752l177k121j134r94j554j898j623j335j600j990j759j054o24o02m24
57557A27863J12N71P34Q87J067R12N67Q34J903K801K730K242K239K497K115J072
$$ plain form
57541 151146 151429 151625 151916 151994 151763 151463 151212 150876 150407 149997 149817 149836 149890 149770 149262 148291 147095 146137 145744
57522 145744 145864 146237 146779 147715 149241 151096 152677 153651 154300 155142 156367 157770 159037 159970 160657 161584 163288
57505 163288 165605 167544 168302 168133 167797 167449 166646 165260 163626 161842 159667 157274 155337 154108 152986
57490 152986 151351 149287 147206 145345 143960 143412 143583 143676 143147 142418 142157 142278 142226 141870 141423 140773 139650
57473 139650 138262 137099 136124 134889 133429 132344 131846 131403 130540 129441 128503 127805 127349 127340 127898 128826 129969
57456 129969 131394 132818 133352 132395 130596 129309 129101 129370 129502 129800 130917 132794 134621 135712 136039 135993
57440 135993 136014 136492 137647 139295 140934 142289 143607 145239 147080 148632 149505 149616 149061 148216 147904 148892
57424 148892 150955 152805 153359 152911 152637 153071 153550 153255 152324 151636 151721 152313 152926 153492 154254 155339 156739 158557
$$ packed form
57541A51146K83J96K91P8k31l00k51l36m69m10j80J9N4j20n08r71j196r58l93
57522A45744J20L73N42R36J526J855J581R74O49Q42J225J403J267R33O87R27J704
57505A63288K317J939P58j69l36l48q03j386j634j784k175k393j937j229j122
57490A52986j635k064k081j861j385n48J71R3n29p29k61J21n2l56m47o50j123
57473A39650j388j163r75j235j460j085m98m43q63j099r38o98m56rN58R28J143
57456A29969J425J424N34r57j799j287k08K69J32K98J117J877J827J091L27m6
57440A35993K1M78J155J648J639J355J318J632J841J552Q73J11n55q45l12R88
57424A48892K063J850N54m48k74M34M79k95r31o88Q5N92O13N66P62J085J400J818
$$ plain form
57406 158557 160896 163412 165377 166400 166824 167163 167430 167389 167306 167907 169489 171523 173318 174790 176358 178310
57390 178310 180503 182574 184337 186096 188541 192042 195987 199239 201444 203495 206323 209560 211971 213035
57376 213035 213539 214492 216022 217597 218922 220126 221196 221721 221394 220509 219689 219206 218863 218581 218719 219616 221107
57359 221107 222855 224923 227533 230372 232752 234613 236770 239895 243697 247443 250892 254277 257760 261377
57345 261377 265314 269675 274050 277748 280403 282038 282788 283034 283667 285498 288336 291215 293668 296242 299543
57330 299543 303362 307085 310577 314122 317732 320977 323517 325477 327319 329537 332473 336234 340713 345728
57316 345728 351110 356661 362179 367598 372968 378231 383206 387937 392844 398332 404364 410605 416863 423138
57302 423138 429374 435522 441808 448572 455750 462833 469512 476082 482988 490203 497389 504509 511880 519662
$$ packed form
57406A58557K339K516J965J023M24L39K67m1q3O01J582K034J795J472J568J952
57390A78310K193K071J763J759K445L501L945L252K205K051K828L237K411J064
57376B13035N04R53J530J575J325J204J070N25l27q85q20m83l43k82J38Q97J491
57359B21107J748K068K610K839K380J861K157L125L802L746L449L385L483L617
57345B61377L937M361M375L698K655J635P50K46O33J831K838K879K453K574L301
57330B99543L819L723L492L545L610L245K540J960J842K218K936L761M479N015
57316C45728N382N551N518N419N370N263M975M731M907N488O032O241O258O275
57302D23138O236O148O286O764P178P083O679O570O906P215P186P120P371P782
$$ plain form
57288 519662 527682 535824 544229 552927 561663 570343 579431 589626 601327 614578 629242 644832 660563
57275 660563 676037 691734 708217 725054 741238 756659 772293 788709 805236 821124 836755
57264 836755 852956 869627 885957 901767 917741 934275 950880 966925 982393 997622 1012839
57253 1012839 1028273 1044422 1061709 1079987 1098636 1117182 1135739 1154934 1175468 1197636 1221078
57242 1221078 1244965 1268522 1291517 1314416 1337957 1362434 1387351 1412007 1436363 1461013 1486234
57231 1486234 1511535 1536382 1560988 1586018 1611918 1639003 1667875 1699160 1732925 1768845 1806810
57220 1806810 1846868 1888757 1932098 1977028 2023985 2072805 2122547 2172345 2221867 2270852 2318811
57209 2318811 2365491 2411209 2456462 2501655 2547411 2594625 2643762 2694433 2745989 2798323 2851807
$$ packed form
57288E19662Q020Q142Q405Q698Q736Q680R088J0195J1701J3251J4664J5590J5731
57275F60563J5474J5697J6483J6837J6184J5421J5634J6416J6527J5888J5631
57264H36755J6201J6671J6330J5810J5974J6534J6605J6045J5468J5229J5217
57253A012839J5434J6149J7287J8278J8649J8546J8557J9195K0534K2168K3442
57242A221078K3887K3557K2995K2899K3541K4477K4917K4656K4356K4650K5221
57231A486234K5301K4847K4606K5030K5900K7085K8872L1285L3765L5920L7965
57220A806810M0058M1889M3341M4930M6957M8820M9742M9798M9522M8985M7959
57209B318811M6680M5718M5253M5193M5756M7214M9137N0671N1556N2334N3484
$$ plain form
57198 2851807 2906714 2962987 3020468 3079267 3140252 3205348 3276844 3355897 3441771 3532689 3627185
57187 3627185 3724361 3823138 3921798 4018348 4111196 4199559 4283331 4362502 4436687 4505431 4568963
57176 4568963 4628283 4684338 4737443 4787720 4835766 4882570 4928958 4975399 5022108 5068964 5115411
57165 5115411 5160674 5204006 5244579 5281386 5313643 5341313 5365053 5385690 5403853 5420055 5434935
57154 5434935 5449311 5463836 5478367 5491714 5502343 5509534 5513812 5516362 5518252 5520036 5521591 5522241 5521550
57141 5521550 5520228 5519872 5521670 5525719 5531702 5539663 5549751 5561725 5575120 5589506 5604041 5616895 5625434
57128 5625434 5626868 5618716 5599239 5568135 5526834 5477978 5424758 5370646 5318935 5271739 5229296 5190267
57116 5190267 5152411 5113096 5070228 5023628 4975477 4929147 4887723 4853526 4827970 4811027 4801243
$$ packed form
57198B851807N4907N6273N7481N8799O0985O5096P1496P9053Q5874R0918R4496
57187C627185R7176R8777R8660R6550R2848Q8363Q3772P9171P4185O8744O3532
57176D568963N9320N6055N3105N0277M8046M6804M6388M6441M6709M6856M6447
57165E115411M5263M3332M0573L6807L2257K7670K3740K0637J8163J6202J4880
57154E434935J4376J4525J4531J3347J0629P191M278K550J890J784J555O50o91
57141E521550j322l56J798M049N983P961J0088J1974J3395J4386J4535J2854Q539
57128E625434J434q152j9477l1104m1301m8856n3220n4112n1711m7196m2443l9029
57116E190267l7856l9315m2868m6600m8151m6330m1424l4197k5556j6943r784
$$ plain form
57105 4801243 4797088 4798546 4807741 4829158 4870240 4941625 5056426 5229432 5476580 5813602 6253687
57094 6253687 6805021 7466260 8216467 9002960 9739704 10326146 10682570 10789076 10716118 10634580
57084 10634580 10791636 11450747 12819527 14999116 17966760 21577538 25575850 29628818
57076 29628818 33391110 36580107 39023392 40661741 41523111 41690925 41275854 40390461 39128758
57067 39128758 37556061 35711292 33619435 31309052 28827215 26243915 23643870 21111693
57059 21111693 18718593 16514678 14527126 12763323 11217042 9874317 8716849 7723795
57051 7723795 6873601 6145684 5521092 4982623 4515321 4106926 3747385 3427982 3141334
57042 3141334 2882203 2647742 2436548 2247327 2078356 1927867 1794594 1677664 1575924
$$ packed form
57105D801243m155J458R195K1417M1082P1385J14801J73006K47148L37022M40085
57094F253687N51334O61239P50207P86493P36744N86442L56424J06506p2958q1538
57084A0634580J57056O59111J368780K179589K967644L610778L998312M052968
57076B9628818L762292L188997K443285J638349Q61370J67814m15071q85393j261703
57067C9128758j572697j844769k091857k310383k481837k583300k600045k532177
57059B1111693k393100k203915j987552j763803j546281j342725j157468r93054
57051G723795q50194p27917o24592n38469m67302m08395l59541l19403k86648
57042C141334k59131k34461k11194j89221j68971j50489j33273j16930j01740
$$ plain form
57033 1575924 1487623 1410952 1344789 1288692 1242217 1204554 1174902 1153042 1139515 1135282 1141057 1156748
57021 1156748 1181478 1214088 1253232 1296806 1341915 1386153 1428598 1468411 1502072 1522700 1522988 1499082
57009 1499082 1452058 1386571 1308665 1224238 1138312 1054800 976510 905126 841219 784590 734865
56998 734865 691754 654798 623249 596445 574097 556015 541738 530651 522346 516615 513134 511324
56986 511324 510520 510281 510718 512547 516477 522216 528188 532382 533390 530610 523979 514042 502158 489997
56972 489997 478573 468018 458388 450355 444869 442452 443108 446743 453295 462473 473705 486428 500140
56959 500140 514084 527224 538912 549398 559222 567993 574071 575644 571920 563224 550378 534422 516786
56946 516786 499163 482944 468828 457004 447561 440735 436951 436660 439970 446394 455127 465648 477944
$$ packed form
57033A575924q8301p6671o6163n6097m6475l7663k9652k1860j3527m233N775J5691
57021A156748K4730L2610L9144M3574M5109M4238M2445L9813L3661K0628K88k3906
57009A499082m7024o5487p7906q4427q5926q3512p8290p1384o3907n6629m9725
56998G34865m3111l6956l1549k6804k2348j8082j4277j1087q305n731l481j810
56986E11324q04k39M37J829L930N739N972M194J008k780o631r937j1884j2161
56972D89997j1424j0555r630q033n486k417O56L635O552R178J1232J2723J3712
56959E00140J3944J3140J1688J0486R824Q771O078J573l724q696j2846j5956j7636
56946E16786j7623j6219j4116j1824r443o826l784k91L310O424Q733J0521J2296
$$ plain form
56933 477944 492114 507865 524459 540985 556597 570486 581548 588103 588166 580520 565711 545852
56921 545852 523315 499626 475493 451431 428042 405889 385436 367183 351605 338842 328496
56910 328496 319821 312159 305198 298911 293394 288905 285950 284992 285932 288109 290993 294700 299568 305476 312024
56895 312024 319257 327758 337955 349789 363074 377690 393232 408953 424375 439631 454924 469944
56883 469944 483987 496274 505829 511464 512399 508849 501802 492589 482982 475090 470313 468503 468774 471164
56869 471164 476918 487280 502639 522876 547642 576007 606610 638671 672398 707873 743958 778692
56857 778692 810294 837076 856796 867046 866616 856122 837415 812966 785847 759481 736633 718738
56845 718738 706498 700982 703736 715857 737364 767635 806117 852196 904378 960030 1016347 1071597
$$ packed form
56933D77944J4170J5751J6594J6526J5612J3889J1062O555O3p646j4809j9859
56921E45852k2537k3689k4133k4062k3389k2153k0453j8253j5578j2763j0346
56910C28496q675p662o961o287n517m489k955r58R40K177K884L707M868N908O548
56895C12024P233Q501J0197J1834J3285J4616J5542J5721J5422J5256J5293J5020
56883D69944J4043J2287R555N635R35l550p047r213r607p892m777j810K71K390
56869D71164N754J0362J5359K0237K4766K8365L0603L2061L3727L5475L6085L4734
56857G78692L1602K6782J9720J0250m30j0494j8707k4449k7119k6366k2848j7895
56845G18738j2240n516K754J2121K1507L0271L8482M6079N2182N5652N6317N5250
$$ plain form
56833 1071597 1125160 1176171 1222192 1259258 1283118 1290540 1279985 1251807 1208281 1153326 1091766
56822 1091766 1028370 967093 910863 861781 821374 790597 769756 758707 757205 764933 781156 804528
56810 804528 833367 865989 900685 935655 969135 999348 1023986 1039915 1043912 1033964 1009910 973232
56798 973232 926760 874445 820563 768487 720215 677060 640287 610779 588524 572955 563657 560315
56786 560315 562207 568329 578037 590978 606247 622133 637011 650035 660518 666849 666640 658136 641361
56773 641361 617910 589890 559111 526917 494449 462806 432896 405174 379649 356275 335191
56762 335191 316481 299881 285049 272051 261231 252516 245210 238666 232811 227774 223325 219155 215520
56749 215520 213033 211768 211032 210144 208955 207449 205396 202809 200355 198746 197885 197098 196140 195499 195691 196711
$$ packed form
56833A071597N3563N1011M6021L7066K3860P422j0555k8178m3526n4955o1560
56822A091766o3396o1277n6230m9082m0407l0777k0841j1049j502P728J6223K3372
56810H04528K8839L2622L4696L4970L3480L0213K4638J5929L997r948k4054l6678
56798I73232m6472n2315n3882n2076m8272m3155l6773k9508k2255j5569r298l342
56786E60315J892O122R708J2941J5269J5886J4878J3024J0483O331k09q504j6775
56773F41361k3451k8020l0779l2194l2468l1643k9910k7722k5525k3374k1084
56762C35191j8710j6600j4832j2998j0820q715p306o544n855n037m449m170l635
56749B15520k487j265p36q88j189j506k053k587k454j609q61p87r58o41J92J020
$$ plain form
56733 196711 198241 200004 201689 202848 203104 202451 201261 200161 199816 200570 202188 204099 205889 207405 208569
56718 208569 209507 210779 212958 215851 218619 220789 222650 224485 225999 226924 227660 228742 230036 231050 231807
56703 231807 232756 233937 234841 235149 235083 235015 235182 235804 236947 238143 238630 238225 237636 237657 238362 239275 240034 240538 240622
56684 240622 239968 238494 236648 235145 234321 233849 233290 232835 233185 234516 236029 236852 237052 237254 237565 237556 237201 237107
56666 237107 237622 238370 238929 239459 240228 240953 241067 240474 239749 239614 240340 241551 242562 243121 243766 245151 247094
56649 247094 248746 249728 250519 251546 252545 253130 253463 253827 253953 253381 252191 250880 249727 248760 248139 247949 247714
56632 247714 246682 244685 242349 240407 239175 238598 238334 237752 236352 234386 232670 231588 230639 229238 227616
56617 227616 226581 226451 226616 226206 224971 223346 221823 220509 219362 218617 218688 219634 220926 221855 222131 222011 221927
$$ packed form
56733A96711J530J763J685J159K56o53j190j100l45P54J618J911J790J516J164
56718B08569R38J272K179K893K768K170J861J835J514R25P36J082J294J014P57
56703B31807R49J181R04L08o6o8J67O22J143J196M87m05n89K1P05R13P59N04Q4
56684B40622o54j474j846j503q24m72n59m55L50J331J513Q23K00K02L11rl55r4
56666B37107N15P48N59N30P69P25J14n93p25j35P26J211J011N59O45J385J943
56649B47094J652R82P91J027R99N85L33L64J26n72j190j311j153r67o21j90k35
56632B47714j032j997k336j942j232n77k64n82j400j966j716j082r49j401j622
56617B27616j035j30J65m10j235j625j523j314j147p45P1R46J292R29K76j20q4
$$ plain form
56600 221927 222019 222021 221682 221292 221533 222622 223888 224550 224699 224949 225378 225532 225541 226300 228205 230472 232247 233727
56582 233727 235557 237674 239507 240935 242286 243622 244736 245738 246954 248425 250139 252544 256092 260398
56568 260398 264666 268900 273835 279677 285874 292285 299581 307999 316611 324478 331827 339401 347166 354410
56554 354410 360733 366155 370425 372995 373755 373237 372009 370236 367869 364926 361523 357937 354615 351846 349351
56539 349351 346526 343140 339558 336206 333097 330016 326921 323863 320671 317019 312957 309132 306290 304559
56525 304559 303383 302071 300253 297867 295062 292238 289830 287786 285539 282850 280444 279312 279410 279546 278614
56510 278614 276584 274178 272059 270429 269029 267280 264771 261914 259818 259184 259493 259621 259075 258256 257647 257178
56494 257178 256528 255692 254972 254519 254133 253610 253101 252955 253246 253743 254354 255310 256660 257885 258428 258442 258595 259195
$$ packed form
56600B21927R2Kl39l90K41J089J266O62J49K50M29J54RP59J905K267J775J480
56582B33727J830K117J833J428J351J336J114J002J216J471J714K405L548M306
56568B60398M268M234M935N842O197O411P296Q418Q612P867P349P574P765P244
56554C54410O323N422M270K570P60n18j228j773k367k943l403l586l322k769k495
56539C49351k825l386l582l352l109l081l095l058l192l652m062l825k842j731
56525C04559j176j312j818k386k805k824k408k044k247k689k406j132R8J36r32
56510B78614k030k406k119j630j400j749k509k857k096o34L09J28n46q19o09m69
56494B57178o50q36p20m53l86n23n09j46K91M97O11R56J350J225N43J4J53O00
$$ plain form
56476 259195 259977 260778 261828 263192 264390 264920 264847 264587 264406 264448 264905 265745 266424 266342 265577 264791 264441 264416 264531
56457 264531 264992 266119 267789 269395 270385 270727 270853 271210 271961 273043 274323 275590 276550 277048 277269 277463 277500
56440 277500 276971 275819 274587 273828 273465 272980 272141 271308 271025 271506 272604 274025 275366 276034 275521 274039 272709
56423 272709 272647 273800 275036 275519 275545 275753 276044 275925 275587 275824 276867 278042 278779 279294 280001 280827 281556 282347
56405 282347 283356 284152 284099 283220 282253 281871 282159 282812 283520 284094 284503 284889 285442 286264 287326 288498 289585 290505
56387 290505 291505 293005 295078 297307 299302 301124 302960 304607 305663 306153 306603 307417 308438 309284 309946
56372 309946 310809 312083 313398 314139 314193 314139 314578 315421 316070 316184 316040 316186 317014 318640 320851 323112 324882
56355 324882 326063 326981 327976 329226 330876 332905 334806 335872 336013 335993 336653 338228 340493 343142 345726 347676
$$ packed form
56476B59195P82Q01J050J364J198N30p3k60j81M2M57Q40O79q2p65p86l50k5J15
56457B64531M61J127J670J606R90L42J26L57P51J082J280J267R60M98K21J94L7
56440B77500n29j152j232p59l63m85q39q33k83M81J098J421J341O68n13j482j330
56423B72709o2J153J236M83K6K08K91j19l38K37J043J175P37N15P07Q26P29P91
56405B82347J009P96n3q79r67l82K88O53P08N74M09L86N53Q22J062J172J087R20
56387B90505J000J500K073K229J995J822J836J647J056M90M50Q14J021Q46O62
56372C09946Q63J274J315P41N4n4M39Q43O49J14j44J46Q28J626K211K261J770
56355C24882J181R18R95J250J650K029J901J066J41k0O60J575K265K649K584J950
$$ plain form
56339 347676 348840 349833 351490 354116 357510 361446 365737 369993 373809 377256 380861 384943 389111 392502
56325 392502 394548 395576 396613 398471 400943 403112 404421 405193 406069 407308 408832 410552 412290 413672 414563
56310 414563 415537 417520 420874 425035 429125 432800 436520 441038 446654 452922 459125 464952 470636 476525
56296 476525 482755 489272 495856 502094 507632 512577 517451 522785 528982 536416 545163 554501 563289 571186
56282 571186 579213 588854 600781 614567 629281 644219 659346 675306 692765 711666 731484 752226
56270 752226 774679 799391 825962 853799 883231 915478 951715 992490 1037875 1087887 1142914
56259 1142914 1203840 1271532 1346136 1427309 1515327 1611497 1717190 1832841 1958141 2092714
56249 2092714 2236146 2387653 2546133 2710325 2878611 3048939 3219132 3386980 3549762
$$ packed form
56339C47676J164R93J657K626L394L936M291M256L816L447L605M082M168L391
56325C92502K046J028J037J858K472K169J309P72Q76J239J524J720J738J382Q91
56310D14563R74J983L354M161M090L675L720M518N616O268O203N827N684N889
56296D76525O230O517O584O238N538M945M874N334O197P434Q747R338Q788P897
56282E71186Q027R641J1927J3786J4714J4938J5127J5960J7459J8901J9818K0742
56270G52226K2453K4712K6571K7837K9432L2247L6237M0775M5385N0012N5027
56259A142914O0926O7692P4604Q1173Q8018R6170J05693J15651J25300J34573
56249B092714J43432J51507J58480J64192J68286J70328J70193J67848J62782
$$ plain form
56240 3549762 3704081 3846459 3973818 4083319 4172356 4239071 4282375 4301157 4294152 4261091 4203485
56229 4203485 4123708 4023826 3905919 3773005 3628802 3476734 3319657 3160208 3000721 2842923
56219 2842923 2688216 2538053 2393618 2255470 2124045 2000288 1885175 1778756 1680130 1588245
56209 1588245 1502514 1423002 1350306 1284810 1225708 1171262 1120386 1073425 1030982 992793 958327
56198 958327 927648 900700 876416 853570 832120 812802 795843 780988 768322 757905 748936 740349
56186 740349 732080 724780 718563 713031 708261 704581 701518 698166 694519 691345 688806 686435 684448 683786
56172 683786 684664 686261 688114 690659 694068 697701 701246 705408 710940 717762 725451 733812 742583 751427
56158 751427 760699 771494 784481 799336 815671 833812 854190 876673 901066 927830 957848 991795
$$ packed form
56240C549762J54319J42378J27359J09501Q9037O6715M3304J8782p005l3061n7606
56229D203485p9777r9882j17907j32914j44203j52068j57077j59449j59487j57798
56219B842923j54707j50163j44435j38148j31425j23757j15113j06419r8626r1885
56209A588245q5731p9512p2696o5496n9102n4446n0876m6961m2443l8189l4466
56198I58327l0679k6948k4284k2846k1450j9318j6959j4855j2666j0417q969q587
56186G40349q269p300o217n532m770l680l063l352l647l174k539k371j987o62
56172F83786Q78J597J853K545L409L633L545M162N532O822P689Q361Q771Q844
56158G51427R272J0795J2987J4855J6335J8141K0378K2483K4393K6764L0018L3947
$$ plain form
56146 991795 1030078 1073078 1121362 1175991 1238489 1309867 1389653 1476595 1570280 1671140 1778636
56135 1778636 1890335 2003049 2114083 2221018 2321218 2412317 2492831 2561995 2619579 2666232
56125 2666232 2703319 2731771 2751278 2760889 2760072 2748989 2728163 2698134 2659225 2611552 2555495 2491962
56113 2491962 2421714 2344622 2260261 2169188 2073078 1973892 1873742 1775389 1681700 1594371 1513921
56102 1513921 1440963 1376476 1320678 1272652 1231478 1196927 1168700 1145768 1126932 1111500 1099179
56091 1099179 1089853 1083588 1080188 1078735 1078220 1078604 1080479 1083740 1087542 1091546 1096190 1101667 1107746 1114735
56077 1114735 1123526 1134317 1146274 1158674 1171472 1184620 1197950 1211930 1227372 1244017 1260537
56066 1260537 1276260 1291813 1307712 1323485 1338718 1353875 1369545 1385703 1402075 1418363 1433935
$$ packed form
56146I91795L8283M3000M8284N4629O2498P1378P9786Q6942R3685J00860J07496
56135A778636J11699J12714J11034J06935J00200R1099Q0514O9164N7584M6653
56125B666232L7087K8452J9507R611q17j1083k0826l0029l8909m7673n6057o3533
56113B491962p0248p7092q4361r1073r6110r9186j00150r8353r3689q7329q0450
56102A513921p2958o4487n5798m8026m1174l4551k8227k2932j8836j5432j2321
56091A099179r326o265l400j453n15L84J875L261L802M004M644N477O079O989
56077A114735Q791J0791J1957J2400J2798J3148J3330J3980J5442J6645J6520
56066A260537J5723J5553J5899J5773J5233J5157J5670J6158J6372J6288J5572
$$ plain form
56055 1433935 1448311 1462199 1477003 1493116 1509825 1526977 1545382 1565325 1586139 1607603 1630313
56044 1630313 1654260 1678526 1702921 1728458 1755730 1784232 1813854 1845458 1879377 1914840 1951575
56033 1951575 1990451 2031763 2074337 2117092 2160085 2203399 2246521 2289519 2333357 2378403 2424253
56022 2424253 2471590 2522339 2577178 2634744 2694133 2756214 2821505 2888910 2957919 3030102 3106976
56011 3106976 3188069 3272458 3360554 3453072 3549871 3651096 3757755 3870052 3986995 4108838
56001 4108838 4237928 4375865 4521877 4675288 4837356 5009175 5190082 5379977 5581117
55992 5581117 5795863 6024660 6267871 6527418 6804969 7100907 7416908 7757154 8125181
55983 8125181 8522002 8949211 9411369 9913535 10459433 11054300 11706778 12425895 13219344
$$ packed form
56055A433935J4376J3888J4804J6113J6709J7152J8405J9943K0814K1464K2710
56044A630313K3947K4266K4395K5537K7272K8502K9622L1604L3919L5463L6735
56033A951575L8876M1312M2574M2755M2993M3314M3122M2998M3838M5046M5850
56022B424253M7337N0749N4839N7566N9389O2081O5291O7405O9009P2183P6874
56011C106976Q1093Q4389Q8096R2518R6799J01225J06659J12297J16943J21843
56001D108838J29090J37937J46012J53411J62068J71819J80907J89895K01140
55992E581117K14746K28797K43211K59547K77551K95938L16001L40246L68027
55983H125181L96821M27209M62158N02166N45898N94867O52478P19117P93449
$$ plain form
55974 13219344 14097291 15075268 16171819 17407640 18810494 20418613 22278058 24441074
55966 24441074 26968414 29926671 33378748 37381357 41995983 47299847 53387836 60375601
55958 60375601 68409486 77669363 88354019 100652592 114696965 130490013 147850808
55951 147850808 166440240 185850173 205653713 225382335 244532370 262652555 279350186
55944 279350186 294046563 305653099 312597513 313367245 307202737 294418033 276210526
55937 276210526 254234865 230227737 205746081 181987395 159718343 139335775 120994656
55930 120994656 104711791 90423753 78023395 67379254 58332780 50694644 44262647
55923 44262647 38847648 34282910 30421147 27136771 24330134 21921714 19842752 18035166
$$ packed form
55974A3219344Q77947R77977J096551J235821J402854J608119J859445K163016
55966B4441074K527340K958257L452077M002609M614626N303864O087989O987765
55958F0375601Q033885R259877J0684656J2298573J4044373J5793048J7360795
55951A47850808J8589432J9409933J9803540J9728622J9150035J8120185J6697631
55944B79350186J4696377J1606536O944414P69732o164508j2784704j8207507
55937B76210526k1975661k4007128k4481656k3758686k2269052k0382568j8341119
55930A20994656j6282865j4288038j2400358j0644141r046474p638136o431997
55923D4262647n414999m564738l861763l284376k806637k408420k078962j807586
$$ plain form
55915 18035166 16455277 15069536 13847231 12761256 11792377 10926652 10149871 9448518 8813729
55906 8813729 8239508 7718434 7242821 6808194 6411709 6048766 5714669 5407795 5127416
55897 5127416 4869823 4630060 4406173 4198487 4005956 3826430 3659290 3504646 3360751
55888 3360751 3225148 3097568 2979032 2868916 2765447 2668276 2577971 2493711 2413907 2338511
55878 2338511 2268423 2203194 2141582 2083748 2030718 1982038 1935985 1891625 1848743 1806154 1762031
55867 1762031 1715704 1667604 1617898 1566752 1515462 1465691 1417890 1371827 1328085 1287597 1250188
55856 1250188 1215033 1182019 1151340 1122307 1094049 1066813 1041280 1017133 993665 971127 950041
55845 950041 929779 909295 888751 868973 849882 830924 812561 795774 780430 765584 751076
$$ packed form
55915A8035166j579889j385741j222305j085975r68879q65725p76781p01353o34789
55906H813729n74221n21074m75613m34627l96485l62943l34097l06874k80379
55897E127416k57593k39763k23887k07686j92531j79526j67140j54644j43895
55888C360751j35603j27580j18536j10116j03469r7171r0305q4260p9804p5396
55878B338511p0088o5229o1612n7834n3030m8680m6053m4360m2882m2589m4123
55867A762031m6327m8100m9706n1146n1290m9771m7801m6063m3742m0488l7409
55856A250188l5155l3014l0679k9033k8258k7236k5533k4147k3468k2538k1086
55845I50041k0262k0484k0544j9778j9091j8958j8363j6787j5344j4846j4508
$$ plain form
55834 751076 737407 724390 711414 698773 687323 677017 667137 657773 649614 642434 635234 627931 621502
55821 621502 616230 611029 604839 597793 590805 584799 580375 577470 575315 573362 572057 572054 573011 574017 574865
55806 574865 576001 577521 579263 581681 585563 590815 596396 601438 605674 608836 610447 610219 608066 603853
55792 603853 597705 590287 582163 573187 563192 552870 543174 534242 525757 518006 511641 506674 502627 499479
55778 499479 497535 496615 496338 497035 499445 503547 508603 514241 520623 527651 534906 542351 550102 557423 562759
55763 562759 564922 563666 559199 551922 542646 532304 521370 510085 499025 488667 478485 467395
55751 467395 455141 442503 430113 417883 405717 393991 383077 373013 363867 355873 348990 342724
55739 342724 336574 330429 324529 319333 315236 312079 309150 306015 303045 300679 298550 295903 292525 288608
$$ packed form
55834G51076j3669j3017j2976j2641j1450j0306r880r364q159p180p200p303o429
55821F21502n272n201o190p046o988o006m424k905k155j953j305lR57J006Q48
55806E74865J136J520J742K418L882N252N581N042M236L162J611k28k153m213
55792F03853o148p418q124q976r995j0322r696q932q485p751o365m967m047l148
55778D99479j944r20k77O97K410M102N056N638O382P028P255P445P751P321N336
55763E62759K163j256m467p277r276j0342j0934j1285j1060j0358j0182j1090
55751D67395j2254j2638j2390j2230j2166j1726j0914j0064r146p994o883o266
55739C42724o150o145n900n196m097l157k929l135k970k366k129k647l378l917
$$ plain form
55725 288608 284127 279133 274330 270441 267191 263796 260384 258069 257554 258418 259876 261543 263425 265751 268840
55710 268840 272610 276357 279504 282300 285099 287283 287872 287001 285768 284553 282497 278858 273978 268685 263542
55695 263542 258969 255346 252586 250190 248006 246431 245682 245477 245641 246460 248131 250330 252611 254869 257233
55680 257233 259827 262736 265820 268560 270471 271722 272923 274281 275364 275660 274962 273310 271119 269305 268669
55665 268669 269063 269612 269768 269669 269577 269536 269615 269915 270334 270772 271539 272983 274751 275963 276115 275358 273974 272146
55647 272146 270081 267734 264546 260158 255226 250762 246731 242166 236655 230819 225293 220134 215332 211018
55633 211018 206959 202745 198668 195536 193362 191263 188988 187504 187446 187918 187605 186373 184942 183531 181661
55618 181661 179070 176105 173288 170935 169069 167430 165733 164079 162826 161938 160898 159416 157726 155946
$$ packed form
55725B88608m481m994m803l889l250l395l412k315n15Q64J458J667J882K326L089
55710B68840L770L747L147K796K799K184N89q71j233j215k056l639m880n293n143
55695B63542m573l623k760k396k184j575p49k05J64Q19J671K199K281K258K364
55680B57233K594K909L084K740J911J251J201J358J083K96o98j652k191j814o36
55665B68669L94N49J56r9r2m1P9L00M19M38P67J444J768J212J52p57j384j828
55647B72146k065k347l188m388m932m464m031m565n511n836n526n159m802m314
55633B11018m059m214m077l132k174k099k275j484n8M72l13j232j431j411j870
55618A81661k591k965k817k353j866j639j697j654j253q88j040j482j690j780
$$ plain form
55604 155946 153738 150974 148257 146303 145166 144441 143886 143459 143061 142643 142341 142257 142302 142427 142628 142656 142208 141617
55586 141617 141786 143081 144808 146186 147336 148739 150147 150729 150226 149446 149541 151010 153379 155732 157597 159351
55570 159351 161582 164159 166359 167890 169212 170703 172105 173061 173708 174351 175011 175608 176156 176441 175963 174601
55554 174601 172943 171558 170341 169014 167802 167071 166669 166268 166122 166803 168243 169600 170140 169862 169225 168688
55538 168688 168564 169024 170067 171501 172907 173653 173227 171737 169812 167784 165253 161807 157878 154435 151890
55523 151890 149726 147277 144537 142087 140433 139570 139108 138650 137920 136625 134491 131657 128822 126704 125444
55508 125444 124813 124746 125166 125438 124764 123281 122067 121776 121859 121585 121261 121759 123076 124114 123952 122909 122071 122031
55490 122031 122304 122065 121234 120494 120165 119556 117988 116134 115537 116774 118831 120458 121406 122005 122285 122090 121591
$$ packed form
55604A55946k208k764k717j954j137p25n55m27l98m18l02q4M5J25K01K8m48n91
55586A41617J69J295J727J378J150J403J408N82n03p80R5J469K369K353J865J754
55570A59351K231K577K200J531J322J491J402R56O47O43O60N97N48K85m78j362
55554A74601j658j385j217j327j212p31m02m01j46O81J440J357N40k78o37n37
55538A68688j24M60J043J434J406P46m26j490j925k028k531l446l929l443k545
55523A51890k164k449k740k450j654q63m62m58p30j295k134k834k835k118j260
55508A25444o31o7M20K72o74j483j214k91Q3k74l24M98J317J038j62j043q38m0
55490A22031K73k39q31p40l29o09j568j854n97J237K057J627R48N99K80j95m99
$$ plain form
55473 121591 121079 120545 119934 119520 119567 119861 119992 119892 119690 119314 118650 117959 117667 117868 118358 119016 119721 120023 119411
55454 119411 118051 116896 116810 117625 118279 117965 117064 116637 116969 117048 115915 114117 113116 113347 113673 112897 111091
55437 111091 109238 108241 108586 110231 112374 113890 114455 114772 115399 115997 116166 116309 116981 117898 118354 118301 118342 118878
55419 118878 119796 120816 121638 121995 121992 122128 122593 122893 122593 122029 121760 121786 121885 122240 123054 123896 124214 124205 124383 124555
55399 124555 124006 122636 121078 119753 118537 117381 116566 116204 116063 115955 115831 115540 115005 114544 114465 114501 114233 113909
55381 113909 114150 114901 115472 115593 115645 115797 115782 115738 116340 117677 118750 118620 117524 116420 115859 115800 116089 116563 116912
55362 116912 116953 116940 117281 117992 118660 118869 118568 118121 118068 118597 119177 119022 118049 117108 117062 117827 118560 118619 118139 117724
55342 117724 117768 118098 118242 118051 117948 118484 119702 121029 121691 121154 119469 117420 116102 115969 116398 116493 116166 116076
$$ packed form
55473A21591n12n34o11m14M7K94J31j00k02l76o64o91k92K01M90O58P05L02o12
55454A19411j360j155q6Q15O54l14r01m27L32P9j133j798j001K31L26p76j806
55437A11091j853r97L45J645K143J516N65L17O27N98J69J43O72R17M56n3M1N36
55419A18878R18J020Q22L57lJ36M65L00l00n64k69K6R9L55Q14Q42L18rJ78J72
55399A24555n49j370j558j325j216j156q15l62j41j08j24k91n35m61p9L6k68l24
55381A13909K41P51N71J21N2J52j5m4O02J337J073j30j096j104n61n9K89M74L49
55362A16912M1j3L41P11O68K09l01m47n3N29N80j55r73r41m6P65P33N9m80m15
55342A17724M4L30J44j91j03N36J218J327O62n37j685k049j318j33M29R5l27r0
$$ plain form
55324 116076 116636 117569 118373 118766 118654 118074 117285 116568 115948 115363 114998 114989 114914 114179 113041 112628 113656 115537 117016
55305 117016 117330 116504 114943 113180 111853 111488 112204 113705 115530 117285 118786 120026 120980 121512 121597 121514 121611
55288 121611 121958 122430 122927 123237 122908 121717 120166 119018 118383 117748 116888 116173 115873 115779 115714 115888 116449 117118
55270 117118 117576 117811 117779 117138 115743 114084 112826 112140 111866 112089 113086 114768 116653 118440 120213 121937
55254 121937 123081 123076 122055 120856 120199 120057 119930 119559 119096 118680 118275 117978 118066 118495 118763 118626 118598 119270 120370
55235 120370 121022 120801 120054 119290 118752 118574 118798 119142 119190 118910 118645 118596 118701 118944 119322 119510 119078 118143 117313
55216 117313 116900 116688 116549 116796 117721 119188 120826 122199 122788 122293 121110 120000 119150 118182 117166 116912 117830
55199 117830 119179 119959 120075 120121 120403 120701 120758 120489 119909 119226 118812 118741 118572 117909 117012 116530 116858 118009 119805
$$ packed form
55324A16076N60R33Q04L93j12n80p89p17o20n85l65rp5p35j138m13J028J881J479
55305A17016L14q26j561j763j327l65P16J501J825J755J501J240R54N32Q5q3R7
55288A21611L47M72M97L10l29j191j551j148o35o35q60p15l00r4o5J74N61O69
55270A17118M58K35l2o41j395j659j258o86k74K23R97J682J885J787J773J724
55254A21937J144nj021j199o57j42j27l71m63m16m05k97Q8M29K68j37k8O72J100
55235A20370O52k21p47p64n38j78K24L44M8k80k65m9J05K43L78J88m32r35q30
55216A17313m13k12j39K47R25J467J638J373N89m95j183j110q50r68j016k54R18
55199A17830J349P80J16M6K82K98N7k69n80o83m14p1j69o63q97m82L28J151J796
$$ plain form
55180 119805 121808 123277 123699 123321 122894 122918 123372 124021 124698 125285 125614 125479 124800 123864 123297 123552 124437 125420
55162 125420 126253 126957 127326 127070 126465 126176 126268 126089 125400 124942 125432 126563 127444 127542 126809 125464 124116 123573
55144 123573 123988 124648 125021 125413 126009 126068 124928 123245 122213 121902 121427 120582 120175 120721 121773 122741 123547 124239
55126 124239 124689 124954 125351 125978 126692 127620 129061 130730 131801 131920 131590 131330 131137 131074 131677 133195 134931
55109 134931 135929 136092 136146 136663 137506 138144 138208 137741 137109 136697 136695 137207 138382 140037 141338 141407 140397 139470 139517
55090 139517 140369 141460 142652 143942 144847 144771 143835 142819 142332 142464 143146 144325 145687 146676 147035 147071 147173
55073 147173 147261 146929 146045 144981 144234 143980 144081 144350 144712 145212 146010 147231 148544 149004 147823 145386 143074
55056 143074 141790 141135 140318 139314 138455 137432 135736 133903 133190 133770 134303 133763 132724 132160 131856 131057 130092
$$ packed form
55180A19805K003J469M22l78m27K4M54O49O77N87L29j35o79r36n67K55Q85R83
55162A25420Q33P04L69k56o05k89R2j79o89m58M90J131Q81R8p33j345j348n43
55144A23573M15O60L73L92N96N9j140j683j032l11m75q45m07N46J052R68Q06O92
55126A24239M50K65L97O27P14R28J441J669J071J19l30k60j93o3O03J518J736
55109A34931R98J63N4N17Q43O38O4m67o32m12kN12J175J655J301O9j010r27M7
55090A39517Q52J091J192J290R05p6r36j016m87J32O82J179J362R89L59L6J02
55073A47173Q8l32q84j064p47k54J01K69L62N00P98J221J313M60j181k437k312
55056A43074j284o55q17j004q59j023j696j833p13N80N33n40j039n64l04p99r65
$$ plain form
55039 130092 130081 131157 132146 132226 131957 132296 133360 134680 136021 137384 138573 139350 139801 140042 139810 138860 137629
55022 137629 136950 137096 137609 138101 138671 139320 139493 138659 137047 135447 134395 133891 133771 133961 134375 134872 135439 136217
55004 136217 137362 139001 141116 143199 144228 143543 141845 140753 141117 142201 142817 142777 142721 142893 142883 142545 142477
54987 142477 143298 144858 146421 147388 147655 147487 147286 147324 147508 147513 147278 147181 147604 148487 149553 150770 152238 153653
54969 153653 154294 153805 152763 152178 152417 152882 152822 152303 152173 153073 154660 155886 155987 155149 154268 154157 154987 156361
54951 156361 157709 158523 158435 157405 155900 154571 153579 152479 151015 149679 149073 148947 148533 147858 148010 149800
54935 149800 152699 155545 157877 160060 162478 165235 168503 172489 176922 181114 184777 188471 193006 198594
54921 198594 204706 210573 215752 220327 224666 228856 232404 234603 235148 234197 231968 228555 224156 219151 213879
$$ packed form
55039A30092j1J076R89Q0k69L39J064J320J341J363J189P77M51K41k32r50j231
55022A37629o79J46N13M92N70O49J73q34j612j600j052n04j20J90M14M97N67P78
55004A36217J145J639K115K083J029o85j698j092L64J084O16m0n6J72j0l38o8
54987A42477Q21J560J563R67K67j68k01L8J84Nk35r7M23Q83J066J217J468J415
54969A53653O41m89j042n85K39M65o0n19j30R00J587J226J01q38q81j11Q30J374
54951A56361J348Q14q8j030j505j329r92j100j464j336o06j26m14o75J52J790
54935A49800K899K846K332K183K418K757L268L986M433M192L663L694M535N588
54921A98594O112N867N179M575M339M190L548K199N45r51k229l413m399n005n272
$$ plain form
54906 213879 208572 203505 198886 194514 189929 185117 180830 177891 176369 175601 174864 173809 172458 171155 170457
54891 170457 170699 171597 172542 173385 174649 176819 179703 182794 186089 190162 195353 201253 207127 212540 217317
54876 217317 221218 224127 226462 228849 231248 232804 232778 231292 228916 225865 221956 217137 211659 205798 199783
54861 199783 193966 188766 184393 180807 177889 175435 173039 170275 167048 163629 160388 157663 155750 154694
54847 154694 154093 153406 152508 151703 151194 150790 150206 149411 148575 147860 147343 146997 146637 146043 145191 144270 143462 142840 142445
54828 142445 142358 142644 143322 144340 145412 146037 145954 145560 145584 146321 147355 148122 148500 148802 149351 150086 150453 149764 147922
54809 147922 145795 144576 144686 145544 146437 147304 148507 150097 151608 152486 152573 152220 152006 152358 153359 154850 156600
54792 156600 158371 160030 161710 163625 165593 167015 167600 167801 168159 168541 168579 168609 169406 171005 172554 173544 174570
$$ packed form
54906B13879n307n067m619m372m585m812m287k939j522p68p37j055j351j303o98
54891A70457K42Q98R45Q43J264K170K884L091L295M073N191N900N874N413M777
54876B17317L901K909K335K387K399J556k6j486k376l051l909m819n478n861o015
54861A99783n817n200m373l586k918k454k396k764l227l419l241k725j913j056
54847A54694o01o87q98q05n09m04n84p95q36p15n17l46l60n94q52r21q08o22l95
54828A42445q7K86O78J018J072O25q3l94K4P37J034P67L78L02N49P35L67o89j842
54809A47922k127j219J10Q58Q93Q67J203J590J511Q78Q7l53k14L52J001J491J750
54792A56600J771J659J680J915J968J422N85K01L58L82L8L0P97J599J549R90J026
$$ plain form
54775 174570 176551 179771 183976 188851 193969 198759 203096 207625 213049 219258 225508 231195 236045 239789
54761 239789 242177 243267 243327 242461 240600 237792 234269 230285 226078 221839 217521 212894 207967 203175 198906
54746 198906 195077 191447 188062 185071 182411 180126 178657 178294 178508 178530 178503 179357 181381 183648 185216 186383
54730 186383 188221 191180 194683 198021 201235 204944 209529 214646 219526 223643 227018 229908 232362 234230
54716 234230 235459 236056 235779 234141 230884 226295 220958 215298 209528 203889 198767 194430 190705 187043 183052
54701 183052 178977 175540 173220 171846 170971 170434 170263 170178 169610 168358 166942 166067 165907 166105 166343 166609 166893
54684 166893 166932 166510 165854 165444 165350 165022 163896 162084 160244 158880 157972 157208 156300 155125 153835 152835 152374
54667 152374 152124 151529 150632 150110 150367 151040 151657 152303 153156 153787 153582 152717 152064 152133 152620 153065 153436 153856 154176
$$ packed form
54775A74570J981L220M205M875N118M790M337M529N424O209O250N687M850L744
54761B39789K388J090O0q66j861k808l523l984m207m239m318m627m927m792m269
54746A98906l829l630l385k991k660k285j469l63K14K2k7Q54K024K267J568J167
54730A86383J838K959L503L338L214L709M585N117M880M117L375K890K454J868
54716B34230J229N97k77j638l257m589n337n660n770n639n122m337l725l662l991
54701A83052m075l437k320j374q75n37j71q5n68j252j416q75j60J98K38K66K84
54684A66893L9m22o56m10r4l28j126j812j840j364r08p64r08j175j290j000m61
54667A52374k50n95q97n22K57O73O17O46Q53O31k05q65o53O9M87M45L71M20L20
$$ plain form
54648 154176 154091 153479 152462 151375 150745 151012 152039 153153 153789 153954 153924 153790 153524 153269 153292 153716 154515 155649
54630 155649 156943 157871 157805 156621 154995 153928 153972 154862 155853 156348 156210 155583 154626 153552 152771 152720 153431 154467
54612 154467 155381 156079 156617 156811 156363 155378 154488 154270 154624 154964 154921 154688 154634 154867 155321 155988 156706 156946 156283
54593 156283 155095 154280 154140 154043 153506 153056 153422 154265 154445 153570 152587 152636 153835 155445 156753 157432 157420 156915
54575 156915 156390 156198 156188 155944 155407 155023 155205 155873 156576 156958 157056 157204 157767 158910 160579 162585 164614 166221
54557 166221 167017 166964 166432 165861 165426 165074 164803 164790 165260 166324 167876 169585 170994 171760 171900 171808 171979 172678
54539 172678 173787 174996 176107 177102 177884 178139 177654 176762 176196 176354 176857 176984 176378 175180 173638 171929 170365
54522 170365 169345 168873 168382 167337 165896 164677 163991 163655 163540 163794 164419 165106 165773 166831 168454 169981
$$ packed form
54648A54176q5o12j017j087o30K67J027J114O36J65l0j34k66k55K3M24P99J134
54630A55649J294R28o6j184j626j067M4Q90R91M95j38o27r57j074p81n1P11J036
54612A54467R14O98N38J94m48r85q90k18L54L40m3k33n4K33M54O67P18K40o63
54593A56283j188q15j40r7n37m50L66Q43J80q75r83M9J199J610J308O79j2n05
54575A56915n25j92j0k44n37l84J82O68P03L82R8J48N63J143J669K006K029J607
54557A66221P96n3n32n71m35l52k71j3M70J064J552J709J409P66J40r2J71O99
54539A72678J109J209J111R95P82K55m85q92n66J58N03J27o06j198j542j709j564
54522A70365j020m72m91j045j441j219o86l36j15K54O25O87O67J058J623J527
$$ plain form
54506 169981 170630 170547 170412 170192 169168 167368 165947 165672 165839 165442 164770 164871 165795 166406 165947 164898 164104 163886
54488 163886 164272 165363 166934 168190 168533 168375 168719 170046 171908 173496 174295 174281 173808 173344 173146 173206 173555
54471 173555 174447 176026 177945 179557 180505 180963 181331 181917 182971 184748 187220 189689 191004 190474 188622 186763
54455 186763 185727 185174 184298 182899 181465 180473 179993 179913 180063 180133 179915 179677 179840 180206 180002 178991 177993 177895
54437 177895 178472 178708 178125 177304 177101 177722 178613 179002 178520 177541 176938 177317 178439 179511 180022 180118 180199 180401 180571
54418 180571 180635 180813 181373 182247 182991 183269 183257 183388 183747 184018 184056 184147 184522 184968 185163 185133 185104 185139 185292 185884 187138
54397 187138 188641 189608 189708 189304 188881 188705 189063 190332 192488 194883 196833 198205 199138 199442 198746 197270
54381 197270 196009 195845 196639 197434 197511 197034 196664 196820 197511 198614 199947 201189 202117 203004 204386 206314 208280
$$ packed form
54506A69981O49q3j35k20j024j800j421k75J67l97o72J01R24O11m59j049p94k18
54488A63886L86J091J571J256L43j58L44J327J862J588P99j4m73m64j98O0L49
54471A73555Q92J579J919J612R48M58L68N86J054J777K472K469J315n30j852j859
54455A86763j036n53q76j399j434r92m80q0J50P0k18k38J63L66k04j011r98r8
54437A77895N77K36n83q21k03O21Q91L89m82r79o03L79J122J072N11R6Q1K02J70
54418A80571O4J78N60Q74P44K78j2J31L59K71L8R1L75M46J95l0k9L5J53N92J254
54397A87138J503R67J00m04m23j76L58J269K156K395J950J372R33L04o96j476
54381A97270j261j64P94P95P7m77l70J56O91J103J333J242R28Q87J382J928J966
$$ plain form
54364 208280 210055 212106 214774 217488 219436 220727 222225 224302 226509 228492 230439 232282 233148 232213 229768
54349 229768 226979 224800 223401 222382 221110 219076 216338 213548 211204 209078 206745 204472 203028 202661
54335 202661 202788 202776 202519 202048 201118 199603 197967 196857 196327 195879 195315 195131 195892 197415 198854 199528 199467 199107
54317 199107 198713 198252 197743 197371 197189 196886 196097 194815 193369 192004 190684 189268 187770 186378 185280 184446
54301 184446 183612 182617 181788 181778 182815 184304 185430 185992 186363 186767 187061 187195 187408 187840 188323 188746 189237 189847
54283 189847 190428 191063 192191 193966 195809 196993 197408 197354 196844 195668 194006 192488 191657 191732 192744 194375
54267 194375 195757 196098 195650 195498 196205 197196 197775 198108 198790 199871 200888 201651 202408 203274 203993 204345 204470 204655
54249 204655 205043 205605 206244 206883 207518 208166 208681 208630 207512 205132 201862 198599 196390 195726 196090 196400 196082
$$ packed form
54364B08280J775K051K668K714J948J291J498K077K207J983J947J843Q66r35k445
54349B29768k789k179j399j019j272k034k738k790k344k126k333k273j444l67
54335B02661J27j2k57m71r30j515j636j110n30m48n64j84P61J523J439O74o1l60
54317A99107l94m61n09l72j82l03p89j282j446j365j320j416j498j392j098q34
54301A84446q34r95q29j0J037J489J126N62L71M04K94J34K13M32M83M23M91O10
54283A89847N81O35J128J775J843J184M15n4n10j176j662j518q31P5J012J631
54267A94375J382L41m48j52P07R91N79L33O82J081J017P63P57Q66P19L52J25J85
54249B04655L88N62O39O39O35O48N15n1j118k380l270l263k209o64L64L10l18
$$ plain form
54232 196082 195493 195221 195324 195506 195713 196102 196595 196901 196953 196992 197290 198070 199535 201541 203272 203761 202924 201706
54214 201706 201064 201155 201663 202504 203789 205301 206438 206745 206264 205314 204123 202800 201539 200644 200187 199811 199081
54197 199081 198060 197317 197235 197604 198074 198714 199702 200684 200931 200242 199269 198784 198911 199252 199514 199782 200274 201008 201699
54178 201699 201980 201763 201311 200860 200268 199283 198119 197473 197825 198897 199889 200178 199806 199370 199416 199900 200304 200283 199920
54159 199920 199253 198043 196440 195380 195641 196689 197235 196850 196230 195867 195412 194696 194475 195448 197166 198617 199512
54142 199512 200313 201279 202202 202934 203551 203978 203985 203606 203147 202733 202218 201610 201243 201445 202235 203386 204601 205595 206218
54123 206218 206566 206909 207526 208590 210043 211565 212849 213950 215131 216296 217028 217309 217749 218780 220045 220965
54107 220965 221505 221885 221944 221433 220737 220659 221549 223136 225102 227223 229040 230059 230427 230883 231970 233682 235894
$$ packed form
54232A96082n89k72J03J82K07L89M93L06N2L9K98P80J465K006J731M89q37j218
54214B01706o42R1N08Q41J285J512J137L07m81r50j191j323j261q95m57l76p30
54197A99081j021p43q2L69M70O40R88R82K47o89r73m85J27L41K62K68M92P34O91
54178B01699K81k17m52m51n92r85j164o46L52J072R92K89l72m36M6M84M04k1l63
54159A99920o67j210j603j060K61J048N46l85o20l63m55p16k21R73J718J451Q95
54142A99512Q01R66R23P32O17M27Pl79m59m14n15o08l67K02P90J151J215R94O23
54123B06218L48L43O17J064J453J522J284J101J181J165P32K81M40J031J265R20
54107B20965N40L80N9n11o96p8Q90J587J966K121J817J019L68M56J087J712K212
$$ plain form
54090 235894 238573 241495 244255 246724 249091 251388 253464 255474 257780 260163 261717 261857 260918 259456 257479
54075 257479 254828 251853 249121 246712 244396 242364 241233 241256 241932 242468 242423 241893 241347 241288 241849 242608 242968
54058 242968 242784 242533 242829 243839 245234 246632 248018 249678 251784 254223 256844 259673 262725 265864 269107
54043 269107 272869 277500 282734 288028 293369 299226 305694 312283 318721 325308 332173 338752 344510 349758
54029 349758 355176 360811 366113 370754 374812 378278 380974 383032 384893 386694 388087 388825 389114 389191 388888
54014 388888 387928 386347 384290 381548 377739 372984 368061 363680 359786 355769 351246 346385 341391 336068
54000 336068 330214 324260 319102 315219 312261 309619 307073 304694 302434 300123 297712 295216 292581 289839
53986 289839 287240 284872 282355 279333 276183 273697 271972 270221 268007 266144 265778 266842 268057 268479 268394
$$ packed form
54090B35894K679K922K760K469K367K297K076K010K306K383J554J40r39j462j977
54075B57479k651k975k732k409k316k032j131K3O76N36m5n30n46n9N61P59L60
54058B42968j84k51K96J010J395J398J386J660K106K439K621K829L052L139L243
54043B69107L762M631N234N294N341N857O468O589O438O587O865O579N758N248
54029C49758N418N635N302M641M058L466K696K058J861J801J393P38K89P7l03
54014C88888r60j581k057k742l809m755m923m381l894m017m523m861m994n323
54000C36068n854n954n158l883k958k642k546k379k260k311k411k496k635k742
53986B89839k599k368k517l022l150k486j725j751k214j863l66J064J215M22q5
$$ plain form
53971 268394 268466 268618 268340 267722 267433 267658 267760 267270 266675 266774 267640 268755 269945 271540 273594 275590 277159
53954 277159 278661 280747 283588 286845 290268 294078 298785 304708 311639 318977 326351 334036 342537 351824
53940 351824 361352 370803 380349 390059 399575 408641 417458 426061 433669 439167 442085 442739 441655 439306
53926 439306 436278 433099 429892 426625 423777 422315 422843 425054 428225 432046 436773 442690 449601 456881
53912 456881 464055 471271 479042 487470 495973 503906 511169 517910 523888 528578 531817 533962 535431 536372
53898 536372 536706 536127 534110 530343 525151 519130 512387 504617 495966 487271 479189 471461 463394 454804 446241
53883 446241 438403 431480 424918 417735 409294 399916 390626 382293 375175 369176 364059 359303 354212 348579
53869 348579 343001 338242 334402 330883 327032 322698 318309 314468 311257 307956 303812 299155 295265 292901
$$ packed form
53971B68394P2J52k78o18k89K25J02m90n95R9Q66J115J190J595K054J996J569
53954B77159J502K086K841L257L423L810M707N923O931P338P374P685Q501R287
53940C51824R528R451R546R710R516R066Q817Q603P608N498K918O54j084k349
53926D39306l028l179l207l267k848j462N28K211L171L821M727N917O911P280
53912D56881P174P216P771Q428Q503P933P263O741N978M690L239K145J469R41
53898E36372L34n79k017l767n192o021o743p770q651q695q082p728q067q590q563
53883D46241p838o923o562p183q441r378r290q333p118n999n117m756n091n633
53869C48579n578m759l840l519l851m334m389l841l211l301m144m657l890k364
$$ plain form
53855 292901 291449 289781 287476 284770 281869 278969 276638 275392 274938 274459 273636 272809 272148 271264 269830 268020
53839 268020 266185 264548 263410 263138 263669 264398 264803 264895 264845 264620 264294 264281 264784 265342 265426 265314 265857 267401 269454
53820 269454 271402 273120 274788 276511 278356 280409 282591 284634 286408 288153 290214 292761 295863 299560
53806 299560 303587 307295 310279 313083 316847 322096 328180 334082 339527 344973 350717 356474 361968 367537
53792 367537 373796 380743 387490 393030 397102 400201 402822 404909 406047 406020 405060 403658 402224 400830 399050
53777 399050 396103 391419 385271 378693 372637 367303 362383 357762 353622 349889 345937 341070 335206 328980
53763 328980 323267 318676 315296 312734 310405 307921 305271 302636 300098 297535 294731 291565 288255 285375
53749 285375 283467 282485 281805 280915 279927 279223 278784 278123 276840 274963 272810 270794 269369 268842 269093 269669 270259
$$ packed form
53855B92901j452j668k305k706k901k900k331j246m54m79q23q27o61q84j434j810
53839B68020j835j637j138k72N31P29M05R2n0k25l26j3N03N58Q4j12N43J544K053
53820B69454J948J718J668J723J845K053K182K043J774J745K061K547L102L697
53806B99560M027L708K984K804L764N249O084N902N445N446N744N757N494N569
53792C67537O259O947O747N540M072L099K621K087J138k7r60j402j434j394j780
53777C99050k947m684o148o578o056n334m920m621m140l733l952m867n864o226
53763C28980n713m591l380k562k329k484k650k635k538k563k804l166l310k880
53749B85375j908r82o80q90r88p04m39o61j283j877k153k016j425n27K51N76N90
$$ plain form
53732 270259 270909 271750 272755 273889 275206 276612 277745 278399 278875 279627 280591 281256 281408 281520 282208 283567 285268
53715 285268 287160 289409 291966 294221 295545 296163 297196 299623 303346 307457 311279 314836 318318 321526
53701 321526 324125 326200 328239 330615 333333 336241 339260 342328 345322 348140 350780 353327 355886 358443
53687 358443 360630 361791 361570 360511 359747 359929 360622 360922 360473 359736 359317 359326 359378 359032 358140 356841 355366 353921
53669 353921 352753 352201 352467 353297 354027 354087 353454 352592 352020 351951 352186 352291 351996 351489 351211 351278 351345 351135 350848 350772
53649 350772 350778 350578 350368 350712 351810 353331 355028 356976 359010 360443 360841 360783 361315 362821 364872 367032 369232
53632 369232 371308 372822 373732 374792 376834 379818 382934 385585 387913 390417 393378 396750 400339 403933
53618 403933 407383 410700 414022 417490 421241 425558 430817 437120 444033 450843 457099 462825 468243 473408
$$ packed form
53732B70259O50Q41J005J134J317J406J133O54M76P52R64O65J52J12O88J359J701
53715B85268J892K249K557K255J324O18J033K427L723M111L822L557L482L208
53701C21526K599K075K039K376K718K908L019L068K994K818K640K547K559K557
53687C58443K187J161k21j059p64J82O93L00m49p37m19RN2l46q92j299j475j445
53669C53921j168n52K66Q30P30O0o33q62n72o9K35J05k95n07k78O7O7k10k87p6
53649C50772Ok00k10L44J098J521J697J948K034J433L98n8N32J506K051K160K200
53632C69232K076J514R10J060K042K984L116K651K328K504K961L372L589L594
53618D03933L450L317L322L468L751M317N259O303O913O810O256N726N418N165
$$ plain form
53604 473408 478204 482573 486604 490344 493640 496308 498410 500209 501807 503024 503739 504171 504578 504743 504108
53589 504108 502482 500363 498386 496695 495089 493575 492426 491704 491031 489975 488471 486790 485226 483875 482558
53574 482558 480882 478532 475612 472582 469720 466819 463644 460608 458644 458211 458598 458559 457695 456973 457650 459767
53558 459767 462055 463329 463614 463681 463880 463982 464035 464668 466215 467988 468924 468842 468722 469735 472237 475644 479007
53541 479007 481672 483607 485296 487367 490314 494470 499953 506455 513268 519813 526161 532860 540276 548282
53527 548282 556584 565173 574394 584661 596079 608260 620611 632927 645639 659375 674364 690378
53515 690378 707102 724345 742060 760415 779739 800136 821296 843042 865868 890407 916362
53504 916362 942507 967865 992422 1016545 1040325 1063825 1087407 1111230 1134693 1156945 1177804
$$ packed form
53604D73408M796M369M031L740L296K668K102J799J598J217P15M32M07J65o35
53589E04108j626k119j977j691j606j514j149p22o73j056j504j681j564j351j317
53574D82558j676k350k920l030k862k901l175l036j964m33L87l9q64p22O77K117
53558D59767K288J274K85O7J99J02N3O33J547J773R36q2j20J013K502L407L363
53541D79007K665J935J689K071K947M156N483O502O813O545O348O699P416Q006
53527E48282Q302Q589R221J0267J1418J2181J2351J2316J2712J3736J4989J6014
53515F90378J6724J7243J7715J8355J9324K0397K1160K1746K2826K4539K5955
53504I16362K6145K5358K4557K4123K3780K3500K3582K3823K3463K2252K0859
$$ plain form
53493 1177804 1197758 1217192 1236170 1254910 1273916 1293455 1313268 1332944 1352326 1371392 1390047
53482 1390047 1408171 1425754 1442839 1459415 1475425 1490683 1504773 1517312 1528460 1538958 1549355
53471 1549355 1559273 1567660 1573726 1577431 1579051 1578563 1575709 1570503 1563340 1554527 1544033 1531896 1518648
53458 1518648 1504973 1490978 1476200 1460468 1444383 1428697 1413395 1397683 1380863 1362986 1344691
53447 1344691 1326582 1308807 1291151 1273458 1256040 1239631 1224916 1212095 1200817 1190478 1180645
53436 1180645 1171380 1163163 1156388 1151000 1146819 1144018 1142838 1142898 1143425 1144358 1146628 1150967 1156975 1163904 1171894
53421 1171894 1181685 1193360 1206148 1219488 1233590 1248875 1265481 1283497 1303095 1324211 1346523
53410 1346523 1370036 1395326 1422919 1452709 1484205 1517068 1551261 1586864 1623915 1662269 1701625
$$ packed form
53493A177804J9954J9434J8978J8740J9006J9539J9813J9676J9382J9066J8655
53482A390047J8124J7583J7085J6576J6010J5258J4090J2539J1148J0498J0397
53471A549355R918Q387O066L705J620m88k854n206p163q813j0494j2137j3248
53458A518648j3675j3995j4778j5732j6085j5686j5302j5712j6820j7877j8295
53447A344691j8109j7775j7656j7693j7418j6409j4715j2821j1278j0339r833
53436A180645r265q217o775n388m181k801j180O0N27R33K270M339O008O929P990
53421A171894R791J1675J2788J3340J4102J5285J6606J8016J9598K1116K2312
53410A346523K3513K5290K7593K9790L1496L2863L4193L5603L7051L8354L9356
$$ plain form
53399 1701625 1742007 1784107 1828701 1875668 1924095 1973435 2023953 2075807 2128395 2181077 2233948
53388 2233948 2287287 2340679 2393372 2445204 2496446 2546843 2595511 2641812 2685729 2727244 2765922
53377 2765922 2801316 2833357 2862087 2887289 2908613 2925895 2939170 2948458 2953585 2954080 2949332 2939072
53365 2939072 2923674 2903747 2879468 2850665 2817503 2780708 2740993 2698664 2654024 2607843 2561110
53354 2561110 2514419 2467838 2421337 2375171 2329868 2285897 2243304 2201640 2160331 2119174 2078378
53343 2078378 2038210 1998833 1960500 1923583 1888200 1854007 1820614 1788165 1757312 1728637 1702221
53332 1702221 1677716 1654732 1633117 1612913 1594095 1576372 1559331 1542736 1526560 1510742 1495098
53321 1495098 1479507 1464004 1448614 1433285 1418158 1403690 1390240 1377629 1365381 1353456 1342460
$$ packed form
53399A701625M0382M2100M4594M6967M8427M9340N0518N1854N2588N2682N2871
53388B233948N3339N3392N2693N1832N1242N0397M8668M6301M3917M1515L8678
53377B765922L5394L2041K8730K5202K1324J7282J3275R288N127M95m748j0260
53365B939072j5398j9927k4279k8803l3162l6795l9715m2329m4640m6181m6733
53354B561110m6691m6581m6501m6166m5303m3971m2593m1664m1309m1157m0796
53343B078378m0168l9377l8333l6917l5383l4193l3393l2449l0853k8675k6416
53332A702221k4505k2984k1615k0204j8818j7723j7041j6595j6176j5818j5644
53321A495098j5591j5503j5390j5329j5127j4468j3450j2611j2248j1925j0996
$$ plain form
53310 1342460 1333057 1325355 1319087 1314250 1311297 1310613 1311976 1314742 1318497 1323318 1329371 1336546 1344754 1354459
53296 1354459 1366534 1381453 1398748 1417357 1436431 1455796 1475820 1496960 1519281 1542281 1565160
53285 1565160 1587320 1608570 1628882 1648157 1666260 1683043 1698128 1710818 1720468 1726961 1730743 1732448
53273 1732448 1732508 1730923 1727233 1720859 1711691 1700274 1687208 1672479 1655675 1636720 1616032 1593947 1570385
53260 1570385 1545317 1519241 1492985 1467111 1441610 1416050 1389920 1363046 1335807 1308809 1282277
53249 1282277 1256032 1230137 1205214 1181776 1159479 1137395 1114913 1092067 1069178 1046600 1024764
53238 1024764 1003950 983879 963921 943890 924339 905916 888754 872710 857869 844445 832306
53227 832306 820887 809599 798185 786760 775583 764646 753379 740980 727235 712821 698544
$$ packed form
53310A342460r403p702o268m837k953o84J363K766L755M821O053P175Q208R705
53296A354459J2075J4919J7295J8609J9074J9365K0024K1140K2321K3000K2879
53285A565160K2160K1250K0312J9275J8103J6783J5085J2690R650O493L782J705
53273A732448O0j585l690o374r168j1417j3066j4729j6804j8955k0688k2085k3562
53260A570385k5068k6076k6256k5874k5501k5560k6130k6874k7239k6998k6532
53249A282277k6245k5895k4923k3438k2297k2084k2482k2846k2889k2578k1836
53238A024764k0814k0071j9958k0031j9551j8423j7162j6044j4841j3424j2139
53227H32306j1419j1288j1414j1425j1177j0937j1267j2399j3745j4414j4277
$$ plain form
53216 698544 684453 670006 654951 639633 624464 609565 595096 581541 569290 558035 546918
53205 546918 535388 523776 512946 503393 494752 486199 477256 468071 459028 450298 441877 433797 426091
53192 426091 418670 411426 404424 397871 391881 386402 381259 376213 371123 366170 361743 358005 354771 352016
53178 352016 350090 349079 348244 346651 344238 341733 339617 337741 336041 334927 334670 334853 334774 334111 332980 331633
53162 331633 330360 329336 328339 326885 324895 322888 321281 319796 317868 315390 312725 310246 308150 306580
53148 306580 305538 304783 304031 303207 302364 301572 301063 301158 301845 302690 303417 304239 305332 306296 306594 306241 305692 305319
53130 305319 305385 306224 307860 309648 310812 311270 311465 311668 311900 312308 312950 313404 313333 313340 314430 316586 318701 320014
53112 320014 320807 321442 321643 321203 320626 320411 320254 319588 318474 317361 316310 315114 313909 313003 312240 311117 309576
$$ packed form
53216F98544j4091j4447j5055j5318j5169j4899j4469j3555j2251j1255j1117
53205E46918j1530j1612j0830r553q641q553q943r185r043q730q421q080p706
53192D26091p421p244p002o553n990n479n143n046n090m953m427l738l234k755
53178C52016j926j011q35j593k413k505k116j876j700j114k57J83p9o63j131j347
53162C31633j273j024r97j454j990k007j607j485j928k478k665k479k096j570
53148C06580j042p55p52q24q43p92n09R5O87Q45P27Q22J093R64K98l53n49l73
53130C05319O6Q39J636J788J164M58J95K03K32M08O42M54p1PJ090K156K115J313
53112C20014P93O35K01m40n77k15j57o66j114j113j051j196j205r06p63j123j541
$$ plain form
53095 309576 308203 307616 307887 308538 308802 308032 306265 304373 303339 303338 303685 303556 302588 300946 299166 297869 297366
53078 297366 297516 298073 298942 299881 300263 299613 298293 297230 296962 297259 297621 297763 297593 297110 296485 295989 295749 295728
53060 295728 295908 296245 296528 296594 296642 297030 297769 298580 299406 300379 301229 301295 300403 299285 298754 298814 298971 299087 299411 299961
53040 299961 300511 301193 302516 304524 306374 307159 306911 306369 305914 305182 303816 302214 301208 301199 301826 302438 302656
53023 302656 302505 302228 302034 301940 301814 301681 301899 302860 304493 306260 307678 308711 309620 310614 311628 312259 311975
53006 311975 310717 309342 309045 310192 312006 313519 314447 314921 314942 314571 314312 314718 315737 316911 318035 319166
52990 319166 320182 320942 321823 323430 325651 327611 328785 329644 330936 332795 334824 336676 338181 339203 339728
52975 339728 339940 339951 339686 339230 339059 339648 340972 342612 344181 345464 346398 347163 348125 349457 350921 352191 353142
$$ packed form
53095C09576j373n87K71O51K64p70j767j892j034jL47j29r68j642j780j297n03
53078B97366J50N57Q69R39L82o50j320j063k68K97L62J42j70m83o25m96k40k1
53060B95728J80L37K83O6M8L88P39Q11Q26R73Q50O6q92j118n31O0J57J16L24N50
53040B99961N50O82J323K008J850P85k48n42m55p32j366j602j006rO27O12K18
53023C02656j51k77j94r4j26j33K18R61J633J767J418J033R09R94J014O31k84
53006C11975j258j375k97J147J814J513R28M74K1l71k59M06J019J174J124J131
52990C19166J016P60Q81J607K221J960J174Q59J292J859K029J852J505J022N25
52975C39728K12J1k65m56j71N89J324J640J569J283R34P65R62J332J464J270R51
$$ plain form
52958 353142 353674 353548 352780 351937 351567 351462 350917 349701 348292 347142 346086 344651 342623 340133 337407 334692
52942 334692 332262 330318 328935 328125 327869 328021 328295 328477 328588 328772 329057 329253 329091 328500 327736 327154 326778 326238
52924 326238 325239 324020 323132 322839 322949 323204 323573 324034 324334 324170 323596 323039 322845 322872 322654 322042 321555 321899 323052
52905 323052 324035 323769 322079 319748 317737 316525 316060 315974 315859 315632 315709 316572 318072 319390 319847 319559 319152
52888 319152 318985 318860 318432 317680 316922 316494 316481 316757 317217 317887 318801 319868 320974 322155 323498 324897 326049
52871 326049 326760 327191 327790 328997 330888 333009 334662 335527 335935 336387 336977 337553 338206 339134 340059 340286 339498
52854 339498 338011 336077 333468 330037 326262 322797 319808 317158 314941 313291 311932 310480 309060 308007
52840 308007 307025 305337 302812 300328 298756 298017 297379 296230 294282 291523 288477 286172 285351 285765 286596 287463
$$ packed form
52958C53142N32j26p68q43l70j05n45j216j409j150j056j435k028k490k726k715
52942C34692k430j944j383q10k56J52K74J82J11J84K85J96j62n91p64n82l76n40
52924C26238r99j219q88k93J10K55L69M61L00j64n74n57j94K7k18o12m87L44J153
52905C23052R83k66j690k331k011j212m65q6j15k27P7Q63J500J318M57k88m07
52888C19152j67j25m28p52p58m28j3K76M60O70R14J067J106J181J343J399J152
52871C26049P11M31N99J207J891K121J653Q65M08M52N90N76O53R28R25K27p88
52854C39498j487j934k609l431l775l465k989k650k217j650j359j452j420j053
52840C08007r82j688k525k484j572p39o38j149j948k759l046k305q21M14Q31Q67
$$ plain form
52824 287463 288621 290254 291963 293048 293025 291931 290335 289090 288786 289347 290232 291033 291756 292619 293823 295439
52808 295439 297285 298904 299989 300776 301724 302732 303066 302235 300596 298841 297174 295433 293762 292647 292214
52793 292214 291978 291539 291134 291161 291363 290958 289624 287966 286833 286418 286286 286110 286049 286406 287185 288105 288866 289346
52775 289346 289620 289887 290211 290392 290248 290069 290438 291419 292260 292225 291455 290618 289918 289021 287970 287537 288356 290079
52757 290079 291746 292789 293339 293791 294411 295321 296551 298017 299612 301277 302908 304242 305082 305608 306298 307485
52741 307485 309075 310708 312101 313217 314225 315330 316586 317839 318828 319356 319416 319257 319272 319642 320114 320367 320598
52724 320598 321339 322587 323591 323851 323873 324369 325022 324819 323583 322307 321731 321365 320417 319075 318173 317987 318126
52707 318126 318422 319111 320059 320565 320246 319630 319473 319928 320698 321594 322443 322754 322191 321320 321215 322151 323228 323599
$$ packed form
52824B87463J158J633J709J085k3j094j596j245l04N61Q85Q01P23Q63J204J616
52808B95439J846J619J085P87R48J008L34q31j639j755j667j741j671j115m33
52793B92214k36m39m05K7K02m05j334j658j133m15j32j76o1L57P79R20P61M80
52775B89346K74K67L24J81j44j79L69R81Q41l5p70q37p00q97j051m33Q19J723
52757B90079J667J043N50M52O20R10J230J466J595J665J631J334Q40N26O90J187
52741C07485J590J633J393J116J008J105J256J253R89N28O0j59J5L70M72K53K31
52724C20598P41J248J004K60K2M96O53k03j236j276n76l66r48j342r02j86J39
52707C18126K96O89R48N06l19o16j57M55P70Q96Q49L11n63q71j05R36J077L71
$$ plain form
52689 323599 323575 324009 324944 325550 325339 324761 324371 323985 323108 321859 320929 320665 320678 320471 320073 319869 320011 320273 320397
52670 320397 320391 320412 320478 320389 319969 319369 319020 319243 319939 320696 321142 321186 321064 321235 322036 323255 324194 324456 324570 325506
52650 325506 327582 330207 332726 335031 337123 338546 338737 337746 336158 334401 332547 330850 329973 330349 331565
52635 331565 332682 333158 333208 333304 333583 333911 334323 335060 336120 337105 337763 338528 340101 342443 344529 345245 344368 342541
52617 342541 340494 338536 336602 334543 332396 330525 329389 329036 328881 328252 327119 326167 326127 327154 328793 330434
52601 330434 331786 332938 333955 334592 334674 334613 335045 335787 335816 334768 333859 334541 336523 338058 338229 338029 338878 340889
52583 340889 343097 344757 345756 346131 345949 345609 345729 346631 348139 349753 350800 350643 349196 347110 345163 343554
52567 343554 342122 341014 340623 340929 341387 341596 341621 341604 341428 340938 340093 338795 336944 334921 333572 333333 333578
$$ packed form
52689C23599k4M34R35O06k11n78l90l86q77j249r30k64J3k07l98k04J42K62J24
52670C20397oK1O6q9m20o00l49K23O96P57M46M4j22J71Q01J219R39K62J14R36
52650C25506K076K625K519K305K092J423J91r91j588j757j854j697q77L76J216
52635C31565J117M76N0R6K79L28M12P37J060R85O58P65J573K342K086P16q77j827
52617C42541k047j958j934k059k147j871j136l53j55o29j133r52m0J027J639J641
52601C30434J352J152J017O37Q2o1M32P42K9j048r09O82J982J535J71k00Q49K011
52583C40889K208J660R99L75j82l40J20R02J508J614J047j57j447k086j947j609
52567C43554j432j108l91L06M58K09K5j7j76m90q45j298j851k023j349k39K45
$$ plain form
52550 333578 333260 332078 330682 329782 329493 329584 329932 330505 331096 331427 331436 331224 330802 330174 329710 330052 331387 333071
52532 333071 334346 335254 336385 337821 338891 339179 339164 339550 340398 341411 342686 344559 346900 349230 351440 353792
52516 353792 356220 358343 360269 362620 365411 367590 368300 368150 368581 370158 372076 373257 373380 372738 371574
52501 371574 369868 367646 365259 363193 361528 359694 357065 353854 351041 349267 348163 347035 345793 344764
52487 344764 343907 342826 341484 340364 339911 340208 341188 342697 344332 345673 346750 347930 349359 350966 352961
52472 352961 355685 358774 361152 362247 362738 363671 365278 367102 368871 370678 372563 374491 376526 378468 379487
52457 379487 378773 376556 373851 371171 368108 364317 360236 356512 353297 350525 348419 347149 346330 345420 344430
52442 344430 343679 342948 341555 339315 336912 335135 334241 334168 334859 335942 336588 336243 335337 334818 335098 335835 336587
$$ packed form
52550C33578l18j182j396r00k89R1L48N73N91L31Rk12m22o28m64L42J335J684
52532C33071J275R08J131J436J070K88j5L86Q48J013J275J873K341K330K210K352
52516C53792K428K123J926K351K791K179P10j50M31J577J918J181J23o42j164
52501C71574j706k222k387k066j665j834k629l211k813j774j104j128j242j029
52487C44764q57j081j342j120m53K97R80J509J635J341J077J180J429J607J995
52472C52961K724L089K378J095M91R33J607J824J769J807J885J928K035J942J019
52457C79487p14k217k705k680l063l791m081l724l215k772k106j270q19r10r90
52442C44430p51p31j393k240k403j777q94p3O91J083O46l45r06n19K80P37P52
$$ plain form
52425 336587 337184 337476 337294 336849 336766 337457 338801 340526 342563 344807 346948 348868 350856 353119 355381 357443
52409 357443 359850 363452 368422 374241 380544 387396 394750 402213 409547 416788 423695 429577 433986 437128
52395 437128 439219 439886 438659 435708 431647 426848 421451 415832 410504 405606 400971 396680 393133 390542
52381 390542 388822 387956 388029 388821 389891 391271 393625 397386 402073 406807 411167 415169 418647 421248 423026
52366 423026 424530 426096 427364 427797 427484 427106 427125 427239 426785 425582 424265 423773 424600 426532 428955 431317
52350 431317 433403 435372 437592 440302 443310 446065 448159 449788 451645 454287 457656 461354 465328 470029
52336 470029 475738 481958 487916 493642 500131 508186 517467 527060 536738 547135 558711 571109 583761
52323 583761 596736 610600 625611 641343 657109 672508 687549 702485 717698 733674 750914
$$ packed form
52425C36587N97K92j82m45q3O91J344J725K037K244K141J920J988K263K262K062
52409C57443K407L602M970N819O303O852P354P463P334P241O907N882M409L142
52395D37128K091O67j227k951m061m799n397n619n328m898m635m291l547k591
52381C90542j720q66P3P92J070J380K354L761M687M734M360M002L478K601J778
52366D23026J504J566J268M33l13l78J9J14m54j203j317m92Q27J932K423K362
52350D31317K086J969K220K710L008K755K094J629J857K642L369L698L974M701
52336D70029N709O220N958N726O489Q055R281R593R678J0397J1576J2398J2652
52323E83761J2975J3864J5011J5732J5766J5399J5041J4936J5213J5976J7240
$$ plain form
52312 750914 769675 789799 810876 832633 855079 878248 902006 926276 951239 976994 1003046
52301 1003046 1028503 1052842 1076172 1098687 1120220 1140530 1159686 1177816 1194684 1209776 1222687
52290 1222687 1233154 1240965 1246265 1249892 1252901 1255576 1257156 1256706 1254070 1249935 1245293 1240969 1237307 1233955
52276 1233955 1230136 1225565 1221098 1218139 1217275 1217688 1218071 1217921 1217849 1218839 1221481 1225812 1231522 1238169 1245461 1253595
52260 1253595 1263221 1274828 1288078 1301983 1315883 1330130 1345614 1362679 1380711 1398823 1416677
52249 1416677 1434380 1451725 1467922 1482192 1494433 1505055 1514340 1522182 1528312 1532479 1534492 1534393 1532674
52236 1532674 1529964 1526378 1521465 1514924 1507001 1497987 1487764 1476255 1463997 1451682 1439307 1426385
52224 1426385 1412984 1399895 1387628 1375852 1364108 1352580 1341754 1331768 1322543 1314281 1307318 1301625
$$ packed form
52312G50914J8761K0124K1077K1757K2446K3169K3758K4270K4963K5755K6052
52301A003046K5457K4339K3330K2515K1533K0310J9156J8130J6868J5092J2911
52290A222687J0467P811N300L627L009K675J580m50k636m135m642m324l662l352
52276A233955l819m571m467k959q64M13L83j50p2R90K642M331N710O647P292Q134
52260A253595R626J1607J3250J3905J3900J4247J5484J7065J8032J8112J7854
52249A416677J7703J7345J6197J4270J2241J0622R285P842O130M167K013r9j719
52236A532674k710l586m913o541p923r014j0223j1509j2258j2315j2375j2922
52224A426385j3401j3089j2267j1776j1744j1528j0826r986r225q262o963n693
$$ plain form
52212 1301625 1296892 1293009 1290072 1287945 1286251 1284865 1284136 1284544 1286366 1289682 1294393 1300072 1305997 1311507
52198 1311507 1316362 1320800 1325320 1330310 1335717 1341190 1346692 1352761 1359819 1367344 1374141 1379489 1383579 1386697
52184 1386697 1388447 1388122 1385587 1381393 1376134 1370024 1363125 1355622 1347770 1339722 1331550 1323388 1315488 1308131
52170 1308131 1301519 1295766 1290937 1287010 1283783 1280970 1278556 1276932 1276455 1276895 1277642 1278523 1280074 1282793 1286319
52155 1286319 1289666 1292139 1293783 1295009 1296109 1297197 1298324 1299435 1300317 1300784 1300956 1301323 1302420 1304319 1306335
52140 1306335 1307418 1307078 1305930 1305174 1305582 1307173 1309805 1313594 1318554 1324249 1330348 1337354 1346208 1357134
52126 1357134 1369389 1382340 1396258 1411729 1428747 1446971 1466481 1487553 1509805 1532330 1554803
52115 1554803 1577685 1601119 1624353 1646741 1668676 1690921 1713481 1735857 1757985 1780070 1801713
$$ packed form
52212A301625m733l883k937k127j694j386p29M08J822L316M711N679N925N510
52198A311507M855M438M520M990N407N473N502O069P058P525O797N348M090L118
52184A386697J750l25k535m194n259o110o899p503p852q048q172q162p900p357
52170A308131o612n753m829l927l227k813k414j624m77M40P47Q81J551K719L526
52155A286319L347K473J644J226J100J088J127J111Q82M67J72L67J097J899K016
52140A306335J083l40j148p56M08J591K632L789M960N695O099P006Q854J0926
52126A357134J2255J2951J3918J5471J7018J8224J9510K1072K2252K2525K2473
52115A554803K2882K3434K3234K2388K1935K2245K2560K2376K2128K2085K1643
$$ plain form
52104 1801713 1822234 1841969 1862242 1883660 1905196 1925442 1944130 1961765 1978237 1992562 2003871
$$ packed form
52104A801713K0521J9735K0273K1418K1536K0246J8688J7635J6472J4325J1309
$$ [...]
##END NTUPLES=NMR SPECTRUM
##END=
