##TITLE=AC1657_NARAH14393_8531823_6hxqYJvxse
##JCAMPDX= 6.0         $$ Bruker NMR JCAMP-DX V2.0
##DATA TYPE= NMR SPECTRUM
##DATA CLASS= NTUPLES
##ORIGIN= BRUKER
##OWNER= Administrator
$$ 1.72 TOPSPIN		Version 2.1
$$ 2014-03-14 15:50:12.525 -0800  Administrator@X
$$ Compression mode = diff/dup
##.OBSERVE FREQUENCY= 400.02188249412
##.OBSERVE NUCLEUS= ^1H
##.ACQUISITION MODE= SIMULTANEOUS (DQD)
##.ACQUISITION SCHEME= undefined
##.AVERAGES= 8
##.DIGITISER RES= 22
##SPECTROMETER/DATA SYSTEM= spect
##.PULSE SEQUENCE= zg30
##.SOLVENT NAME= COFFEE_meoh
##.SHIFT REFERENCE= INTERNAL, COFFEE_meoh, 1, 14.98509
##AUDIT TRAIL= $$ (NUMBER, WHEN, WHO, WHERE, PROCESS, VERSION, WHAT)
$$ ##TITLE= Audit trail, TOPSPIN		Version 2.1
$$ ##JCAMPDX= 5.01
$$ ##ORIGIN= Bruker BioSpin GmbH
$$ ##OWNER= Administrator
$$ $$ E:\/data/COFFEE/nmr/AC1657_NARAH14393_8531823_6hxqYJvxse/10/pdata/1/auditp.txt
$$ ##AUDIT TRAIL=  $$ (NUMBER, WHEN, WHO, WHERE, PROCESS, VERSION, WHAT)
(   1,<2014-03-14 15:50:00.114 -0800>,<Administrator>,<X>,<go>,<TOPSPIN 2.1>,
      <created by zg
	started at 2014-03-14 15:48:47.736 -0800,
	POWCHK enabled, PULCHK disabled,
       configuration hash MD5:
       C8 4E 4E 5D D3 5C D8 9E 9F 52 82 E0 59 8A DE 15
       data hash MD5: 64K
       78 BB A7 6A 12 2A 66 ED 8C AC 06 EA 61 15 8C CB>)
(   2,<2014-03-14 15:50:04.919 -0800>,<Administrator>,<X>,<proc1d>,<TOPSPIN 2.1>,
      <Start of raw data processing
       efp LB = 0 FT_mod = 6 PKNL = 1 PHC0 = 0 PHC1 = 0 SI = 32K 
       data hash MD5: 32K
       1A AC C2 F9 ED EF D2 A7 6B 14 D1 3B B1 B9 41 4C>)
(   3,<2014-03-14 15:50:05.772 -0800>,<Administrator>,<X>,<proc1d>,<TOPSPIN 2.1>,
      <pk PHC0 = 95.14709 PHC1 = 0 
       data hash MD5: 32K
       2C BE 16 76 04 38 24 6E 17 12 4A FA E1 9B 2B 58>)
(   4,<2014-03-14 15:50:06.256 -0800>,<Administrator>,<X>,<proc1d>,<TOPSPIN 2.1>,
      <abs ABSG = 1 
       data hash MD5: 32K
       A1 B9 47 50 82 E5 62 D0 E4 C9 E6 45 C1 04 A7 A1>)
(   5,<2014-03-14 15:50:06.508 -0800>,<Administrator>,<X>,<proc1d>,<TOPSPIN 2.1>,
      <abs ABSG = 2 
       data hash MD5: 32K
       C4 BE E0 C7 6E 8B 12 3B AA 6A 6B 9B F2 F3 B5 82>)
(   6,<2014-03-14 15:50:06.760 -0800>,<Administrator>,<X>,<proc1d>,<TOPSPIN 2.1>,
      <abs ABSG = 3 
       data hash MD5: 32K
       27 EA 14 5D 48 85 34 FA 17 2E 43 67 ED 8F 9E 84>)
(   7,<2014-03-14 15:50:06.896 -0800>,<Administrator>,<X>,<proc1d>,<TOPSPIN 2.1>,
      <abs ABSG = 4 
       data hash MD5: 32K
       52 A2 38 85 4C 26 47 03 E3 3B 8B 6F C9 73 71 1D>)
(   8,<2014-03-14 15:50:07.012 -0800>,<Administrator>,<X>,<proc1d>,<TOPSPIN 2.1>,
      <abs ABSG = 5 
       data hash MD5: 32K
       D9 2F 39 03 09 1A B6 02 F0 3B 5A 95 E0 1F F5 9D>)
$$ ##END=
$$ 
$$ $$ hash MD5
$$ $$ 79 51 4F 0C C2 2D 53 62 F7 CD 97 DB 9F 88 4A 24
##$RELAX= 
##$RELAX= 
##$RELAX= 
##$RELAX= 
##$RELAX= 
##$RELAX= 
##$RELAX= 
$$ Bruker specific parameters
$$ --------------------------
##$DU= <E:\>
##$EXPNO= 10
##$NAME= <AC1657_NARAH14393_8531823_6hxqYJvxse>
$$ [...]
150 150 150 150 150 150 150 150
##$TP07= 0
##$TPNAME0= <>
##$TPNAME1= <>
##$TPNAME2= <>
##$TPNAME3= <>
##$TPNAME4= <>
##$TPNAME5= <>
##$TPNAME6= <>
##$TPNAME7= <>
##$TPOAL= (0..7)
0.5 0.5 0.5 0.5 0.5 0.5 0.5 0.5
##$TPOFFS= (0..7)
0 0 0 0 0 0 0 0
##$TUNHIN= 0
##$TUNHOUT= 0
##$TUNXOUT= 0
##$USERA1= <user>
##$USERA2= <user>
##$USERA3= <user>
##$USERA4= <user>
##$USERA5= <user>
##$V9= 5
##$VALIST= <valist>
##$VCLIST= <CCCCCCCCCCCCCCC>
##$VD= 0
##$VDLIST= <DDDDDDDDDDDDDDD>
##$VPLIST= <PPPPPPPPPPPPPPP>
##$VTLIST= <TTTTTTTTTTTTTTT>
##$WBST= 1024
##$WBSW= 4
##$XGAIN= (0..3)
0 0 0 0
##$XL= 0
##$YL= 0
##$YMAX_a= 575970
##$YMIN_a= -489905
##$ZGOPTNS= <>
##$ZL1= 120
##$ZL2= 120
##$ZL3= 120
##$ZL4= 120
##$ABSF1= 14.98509
##$ABSF2= -5.573092
##$ABSG= 5
##$ABSL= 3
##$ALPHA= 0
##$AQORDER= 0
##$ASSFAC= 0
##$ASSFACI= 0
##$ASSFACX= 0
##$ASSWID= 0
##$AUNMP= <proc_prof1d_extract_pilot.lims>
##$AXLEFT= 0
##$AXNAME= <>
##$AXNUC= <1H>
##$AXRIGHT= 0
##$AXTYPE= 0
##$AXUNIT= <>
##$AZFE= 0.1
##$AZFW= 0.1
##$BCFW= 0
##$BC_mod= 0
##$BYTORDP= 0
##$COROFFS= 0
##$CY= 15
##$DATMOD= 1
##$DC= 0
##$DFILT= <>
##$DTYPP= 0
##$F1P= 0
##$F2P= 0
##$FCOR= 0.5
##$FTSIZE= 32768
##$FT_mod= 6
##$GAMMA= 0
##$GB= 0
##$INTBC= 1
##$INTSCL= 1
##$ISEN= 128
##$LB= 0
##$LEV0= 0
##$LPBIN= 0
##$MAXI= 10000
##$MC2= 0
##$MEAN= 0
##$ME_mod= 0
##$MI= 0
##$NCOEF= 0
##$NC_proc= -8
##$NLEV= 6
##$NOISF1= 0
##$NOISF2= 0
##$NSP= 0
##$NTH_PI= 0
##$NZP= 0
##$OFFSET= 14.98509
##$PC= 1
##$PHC0= 95.14709
##$PHC1= 0
##$PH_mod= 1
##$PKNL= yes
##$PPARMOD= 0
##$PPDIAG= 0
##$PPIPTYP= 0
##$PPMPNUM= 2147483647
##$PPRESOL= 1
##$PSCAL= 4
##$PSIGN= 0
##$PYNMP= <proc.py>
##$REVERSE= no
##$SF= 400.02
##$SI= 32768
##$SIGF1= 0
##$SIGF2= 0
##$SINO= 400
##$SIOLD= 32768
##$SPECTYP= <>
##$SREGLST= <1H.CDCl3>
##$SSB= 0
##$STSI= 32768
##$STSR= 0
##$SW_p= 8223.68421052631
##$SYMM= 0
##$S_DEV= 0
##$TDeff= 65536
##$TDoff= 0
##$TI= <>
##$TILT= no
##$TM1= 0
##$TM2= 0
##$TOPLEV= 0
##$USERP1= <user>
##$USERP2= <user>
##$USERP3= <user>
##$USERP4= <user>
##$USERP5= <user>
##$WDW= 1
##$XDIM= 32768
##$YMAX_p= 449022657
##$YMIN_p= -697090
##$CURPLOT= <Network HP LaserJet P1505>
##$CURPRIN= <$Network HP LaserJet P1505>
##$DFORMAT= <normdp>
##$LAYOUT= <+/1D_H.xwp>
##$LFORMAT= <normlp>
##$PFORMAT= <normpl>
##$SURQMSG= 1
$$ End of Bruker specific parameters
$$ ---------------------------------
##NTUPLES= NMR SPECTRUM
##VAR_NAME=  FREQUENCY,     SPECTRUM/REAL,   SPECTRUM/IMAG
##SYMBOL=    X,             R,               I
##VAR_TYPE=  INDEPENDENT,   DEPENDENT,       DEPENDENT
##VAR_FORM=  AFFN,          ASDF,            ASDF
##VAR_DIM=   32768,         32768,           32768
##UNITS=     HZ,            ARBITRARY UNITS, ARBITRARY UNITS
##FACTOR=    0.250966925370066, 1,           1
##FIRST=     8223.43324360094, -41407,       -97737
##LAST=      0,             -27740,          -152802
##MIN=       0,             -697090,         0
##MAX=       8223.43324360094, 449022657,    0
$$ Real data points
##PAGE= N=1
##DATA TABLE= (X++(R..R)), XYDATA
$$ [...]
19588A10007i6342l1396r3044B5105M6367Q8571l3877g197G3312Q1423c01624
19576a82961F4855d4464j5033B70424J0027H015f9646b9228j58333O7425E5425
19564a01399j96557B7716a3528k58439A97975b18722B72841k9823f7748k43051
19554c10799J22770d6676k29091a34243A60417n6633b98587k6104n4174f2978
19543h1575j30480K8862M122B85662c25023A04556l8678i3082r976A5631b41801
19531b41644i6084p477C6033b19790A86373b51659e5798B61565a04965E115K41500
19520B46615a19031F061J0765a78862A81119c1833o8961A18277d88731a41321
19509d8446I9414k5786b2716j61794B43429A6701K49073b94642K7943m5546B8789
$$ y = [110007, -96342, -127738, -220782, 25105, 71472, 160043, 126166, -7197, 73312, 154735, -301624, -182961, 64855, -44464, -59497, 270424, 280451, 8015, -69646, -29228, -187561, -120136, 55425, -101399, -297956, 27716, -13528, -271967, 197975, -218722, 272841, 243018, -67748, -310799, -188029, -46676, -275767, -134243, 160417, 103784, -298587, -324691, -378865, -62978, -81575, -212055, -183193, -179071, 285662, -325023, 104556, 65878, -93082, -103058, 15631, -241801, -241644, -96084, -103561, 36033, -219790, 186373, -251659, -55798, 261565, -104965, 5115, 246615, -119031, 6061, 16826, -178862, 181119, -31833, -100794, 118277, -488731, -141321, -48446, 99414, 73628, -22716, -184510, 243429, 16701, 265774, -294642, -266699, -312245, 28789]
19497d1480a4484G1294b53717a20485o0361L1822j62271A68405d32519i727k2796
19486c2523j49448D311K03616G3910j3064i1569b245B92491A30207c82728B47228
19474a09702D3574b57730k3891f5967J2752C50164a29562M2394m1626e9693Q031
19463e1662l3324M2303l30238B64467A1733a62530A59450a61718j01631C3532
19452a4775l2913J4507I2023N2314i9815L5650j14266m1441j83266e9058F7691
19440A9021a14112B63365a05659H8237J08904H4762g5960h503A06522d4558k64958
19429c09516B2505J39463a51786A62411n8801b80871A18954i3327A03090B9380
19418b6251q3779r8309b2795j9713E9012a6108E1323a6267b297l1039k78573a37650
$$ y = [-41480, -14484, 71294, -253717, -120485, -180846, -149024, -311295, 168405, -432519, -9727, -32523, -181971, 4311, 207927, 73910, 60846, -91569, -2245, 292491, 130207, -382728, 247228, -109702, 43574, -257730, -281621, -65967, -53215, 350164, -129562, -87168, -128794, -59693, -51662, -84986, -42683, -372921, 264467, 11733, -162530, 159450, -161718, -263349, 33532, -14775, -47688, -33181, 92023, 144337, -99815, -64165, -178431, -219872, -403138, -59058, 67691, 19021, -114112, 263365, -105659, 88237, 197141, 84762, -75960, -8503, 106522, -44558, -309516, 22505, 161968, -151786, 162411, 103610, -280871, 118954, -93327, 103090, 29380, -26251, -110030, -208339, -22795, -42508, 59012, -16108, 51323, -16267, -2297, -33336, -311909, -137650]
19405a1374j61936f5421b2353J332B99606a85043A49092J17725b35233q1959A15824
19393G3090a73101A21277b47417D2237a7583A71721a15290q2425A01450b23800
19382b10571H2756b91853d922j14673b237D0720d9116G1294b1411j79334B33973
19370b1266L94j68741G2667C0459h8556j6691F4015a16394L8310k24693G8117
19358B75472F7558P5111i4255A03858j5977E582c8212k5535j01698B13351C5631
19346C2283b2780A77647E1841L9166R0183A4413e8377j2307A9363d6426j592p1424
19334a19442p9019A63499K3874j6262c34014g769H9671N69c571B88092A9334J06262
19322A25596a99313L8643A75454N878F7700O8428a225D4618e3991r7000J2859
$$ y = [-11374, -173310, -65421, -22353, -21021, 299606, -185043, 149092, 266817, -235233, -317192, 115824, 73090, -173101, 121277, -247417, 42237, -17583, 171721, -115290, -197715, 101450, -223800, -210571, 82756, -291853, -4922, -119595, -2237, 40720, -49116, 71294, -21411, -200745, 233973, -21266, -20872, -189613, 72667, 30459, -88556, -105247, 64015, -116394, -78084, -302777, 78117, 275472, 67558, 142669, -94255, 103858, 87881, 5582, -38212, -63747, -165445, 213351, 35631, 32283, -22780, 177647, 51841, 91007, 181190, 14413, -58377, -70684, 19363, -46426, -48018, -119442, -198461, 163499, 187373, 171111, -334014, -7769, 89671, 90240, -3571, 288092, 19334, 125596, -199313, -160670, 175454, 181332, 67700, 136128, -1225, 44618, -53991, -150991, -138132]
19311a38132A648b48073j75439K5346A05164a24329J354B35793H1025P577e4863
19299d5466k6851R521C31211E2282Q2548b1046p9802b6414q2345j06005e6340
19287B5648a90763M0929N7012C28277b3603k2973m42522a42189b4235j91112A46555
19275b37286a05118d3530n3668L1761k40384D1197q725b3197A3469c01531a25653
19263f0328C6584a8063j93157C5600J27835a21986F2646b91041j5070a2247A97713
19251f1574j43131I9142N5085a14014I5309j7303a18738C681d90645J48994a48336
19239b88723C1315a57903E9399j0712a11045H4110g1081I6632a01071B24488r9143
19228A25345a98844d7452J0502F1320i3265I1386J75986p7900a08998p7405L6757
$$ y = [-138132, 1648, -248073, -423512, -398166, 105164, -124329, -122975, 235793, 81025, 88602, -54863, -45466, -72317, -62796, 331211, 52282, 134830, -21046, -100848, -26414, -108759, -214764, -56340, 25648, -190763, -149834, -92822, 328277, -23603, -46576, -489098, -142189, -24235, -215347, 146555, -237286, -105118, -43530, -97198, -65437, -305821, 41197, 32472, -23197, 13469, -301531, -125653, -60328, 36584, -18063, -211220, 35600, 163435, -121986, 62646, -291041, -306111, -12247, 197713, -61574, -204705, 99142, 154227, -114014, 95309, 78006, -118738, 3681, -490645, -341651, -148336, -288723, 31315, -157903, 59399, 48687, -111045, 84110, -71081, 96632, -101071, 224488, 125345, -198844, -47452, -36950, 61320, -93265, 91386, 267372, 189472, -108998, -186403, -149646]
19217a49646A77403f7032k5700E1171a55398d681A2520b0613B36777a22223e4816
19205C1379a77801j05694J37174M5857i459j27277b178m16524j6013c9350n2573
19194i1923J6740j98045e2526a025l61267I4170c991n6563A18370a22805A6658
19182F823b11097g6552A53774b80559a26212L0111K3541p4683O5236k72830J71532
19171a83305g0666j15024b5558p999j47191k09745B97396c32710J14334A98257
19160i7261j01257A14098b51561B13878c82972a31850q9651A68849a03418F5657
19149I4087f9480J2051n31036A73110d28260C5729b9871N376C25935C7079a78943
19137A12882a64548d2116A57233e1911P303G7867i45A21626a41053B4559a11640
$$ y = [-149646, 177403, -67032, -92732, 51171, -155398, -4681, 12520, -20613, 236777, -122223, -54816, 31379, -177801, -283495, -146321, -100464, -9459, -136736, -2178, -418702, -434715, -39350, -91923, -75183, -273228, -52526, -1025, -362292, 94170, -3991, -60554, 118370, -122805, 16658, 6823, -211097, -76552, 153774, -280559, -126212, -96101, -72560, -147243, -82007, -354837, -183305, -70666, -185690, -25558, -33557, -180748, -390493, 297396, -332710, -218376, 198257, -97261, -198518, 114098, -251561, 213878, -382972, -131850, -221501, 168849, -103418, 65657, 94087, -69480, -57429, -588465, 173110, -428260, 35729, -29871, -24495, 325935, 37079, -178943, 112882, -164548, -42116, 157233, -51911, -44608, 77867, -945, 121626, -141053, 24559, -111640]
19125d10238B21940f4846H0978b8109l80854E967K107C215b38815Q1845A51R2068
19113I2219J96240i9700j53338a12387j67462d6667k33524R8183A07706f2892
19102h2177B46236a61219j07968A15217a02574A50696n1406l0700h2399k78423
19092c60822a65375B3723K21390C9676K20880a12180B7147J20797M6749a03131
19081G2974a45418M9603r8649h4933K9390j99637e4283a1545A75093C5769i9131
19069A69029C0131a42225e0294E0701h3343o0171D248J62257a48578j48728J15550
19058a81756C55520g1837j1188c1072I5137J41176c97l20618R1693k9307N0473
19047b08156e2580A73805d99338A27623j9750m5445K43056b15598B16073a43422
$$ y = [-410238, 221940, -64846, 80978, -28109, -408963, 5967, 8074, 3215, -238815, -156970, 151, 92219, 288459, -99700, -253038, -112387, -279849, -46667, -280191, -182008, 107706, -62892, -82177, 246236, -161219, -269187, 115217, -102574, 150696, 99290, 68590, -82399, -360822, -165375, 23723, 245113, 39676, 260556, -112180, 27147, 147944, 194693, -103131, 72974, -145418, -95815, -194464, -84933, -55543, -255180, -54283, -11545, 175093, 35769, -99131, 169029, 30131, -142225, -50294, 50701, -83343, -143514, 4248, 166505, -148578, -297306, -181756, 355520, -71837, -83025, -31072, 95137, 236313, -397, -321015, -229322, -258629, -208156, -52580, 173805, -499338, 127623, 107873, 62428, 305484, -215598, 216073, -143422]
19036B06909m7571a03078q1349F3123K07273c01015c7832B79171A22777c5634
19025H4644J05445O3954a39676c5535j43964a1644B00125o8188D9956b36265J08128
19014a28137M6851C44410F077c4371a2652k71654i4376i57o7770A85716a20199
19002d10968a19117A12407a57826j4620q7202B97179A07525L9988a73849N4034
18992a19815d1604H3890b01823b5987k03667B24428b71588a7520A13899d8172
18981a03549O459A04224j3100a74380B7894i6332A88102f9910K018E1538M1928
18970I3466b61825J0628C1657c38272n801C4854b54443B65875l4811p6088k3314
18959A31662B8188K84836A54162M1704B3135b33674A10249a915A62298i6943A32396
$$ y = [206909, 159338, -103078, -184427, 63123, 270396, -301015, -37832, 279171, 122777, -35634, 84644, 190089, 254043, -139676, -35535, -179499, -11644, 200125, 131937, 49956, -236265, -128137, -81286, 344410, 6077, -34371, -12652, -284306, -94376, -957, -68727, 185716, -120199, -410968, -119117, 112407, -157826, -172446, -259648, 297179, 107525, 147513, -173849, -119815, -41604, 83890, -201823, -25987, -229654, 224428, -271588, -17520, 113899, -48172, -103549, -97090, 104224, 91124, -174380, 27894, -96332, 188102, -69910, -67892, 51538, 93466, -261825, -251197, 31657, -338272, -344073, 34854, -254443, 265875, 231064, 154976, 131662, 28188, 313024, 154162, 195866, 23135, -233674, 110249, -1915, 162298, -96943, 132396]
18947a11271r100H5032f9116k3349K2579j50659d7330B96329e2271o4760d1326
18935A6010L7093b49235B10333E1938J13412N1143b05870A39080a02683g023r1896
18924i8919p9836B56912d46815J33625i9879C17583C8912c4330H2953b61463h4014
18912e0621j46369A8671f2345A50628A3475a57151c0030n6539D7369J0100a51423
18900F4273K4046K8695a24818H8305J00846a03836K6655A0548i8654C2274d7812
18888B97621j32680G0547d01612a79345c4311k09573f3692A01139b41644A58359
18877A95677d9758B7312a62915A06606b25822g2873k03948R9940j83121f1004
18866A35723b0963G0367c18116A45203n9377g5608k73383a23785D2579f9705A81668
$$ y = [-111271, -120371, 85032, -69116, -92465, -69886, -220545, -47330, 296329, -52271, -117031, -41326, 16010, 53103, -249235, 210333, 51938, 165350, 216493, -205870, 139080, -102683, -7023, -98919, -178755, 256912, -446815, -313190, -99879, 317583, 38912, -34330, 82953, -261463, -84014, -50621, -196990, 18671, -62345, 150628, 13475, -157151, -30030, -86569, 47369, 57469, -151423, 64273, 88319, 117014, -124818, 88305, 189151, -103836, -77181, 10548, -98654, 32274, -47812, 297621, 164941, 70547, -401612, -179345, -34311, -243884, -63692, 101139, -241644, 158359, 195677, -49758, 27312, -162915, 106606, -225822, -72873, -276821, -176881, -360002, -61004, 135723, -20963, 70367, -318116, 145203, 85826, -75608, -348991, -123785, 42579, -69705, 181668]
18854B3513a05833G5669a93508c5473J1376j6922j78004f1113E9906N5703c26427
18842d1607j36881r7130J30638B8135L07252B3618c34546J38667Q9335k63681
18832c70225a68891A37482e2499j80650K5541C14247I0177a13696r9110q9957
18822c02763P4178p6865A18174O6280F8011b5650E7874b4106A05246b5386p9426
18811a04812D2872f3643B32758p1078o4900Q5103A6985b94519g6293q630h228
18799B28095A6998Q2376b11838e8613q6851r5982J13810B9601a7588k00509N1776
18788a66321a2025A78461q33B3630g1860q5447j55316B31127r8304c5173A07076
18776A00201b77041A2444P5796B759a26002N6783A16566E0833a36082A20156b93555
$$ y = [23513, -105833, 75669, -193508, -35473, -24097, -41019, -219023, -61113, 59906, 115609, -326427, -41607, -178488, -275618, -144980, 28135, 335387, 23618, -334546, -195879, -106544, -370225, -168891, 137482, -52499, -233149, -207608, 314247, 90177, -113696, -212806, -302763, -228585, -305450, 118174, 184454, 68011, -25650, 57874, -24106, 105246, -25386, -104812, 42872, -63643, 232758, 161680, 96780, 181883, 16985, -294519, -76293, -84923, -8228, 228095, 16998, 99374, -211838, -58613, -145464, -241446, -127636, 29601, -17588, -218097, -166321, -12025, 178461, 177628, 23630, -71860, -157307, -312623, 231127, 132823, -35173, 107076, 100201, -277041, 12444, 88240, 2759, -126002, -69219, 116566, 50833, -136082, 120156, -293555]
18764a21551A19350C9458a92196I1793a17643j7627E4779K766b97044i5094k67575
18753c62669b8946C2035a71058L2770D7281b57943A28584D2366A1493K5036a1237
18741D9145a51721j15439J20082B352J47890c09434A58989b90227A61160f4315
18730i9184j93708A50245c3856k34141A06143D7348f7568K4495n865r3243c7269
18718E2020c1810j41778P7282A70425e2607F2013c30054N8278M3686K8041k5029
18707b25078H5328N1595L225i6835D0443e0100j85890d8415A64444I348Q8965
18696I8313Q2637p6624J46574d2089j57513L3026A75303b08636A00104a02182
18685E0907M469h3407k06629J41629j23118C8151b49447C12484a67B9437J4218
$$ y = [-121551, 119350, 39458, -192196, 91793, -117643, -135270, 54779, 57545, -297044, -95094, -362669, -28946, 32035, -171058, -138288, 47281, -257943, 128584, 42366, 11493, 36529, -11237, 49145, -151721, -267160, -147078, 2352, 150242, -309434, 158989, -290227, 161160, -64315, -99184, -292892, 150245, -33856, -267997, 106143, 47348, -67568, -43073, -48938, -142181, -37269, 52020, -31810, -173588, -96306, 170425, -52607, 62013, -330054, -271776, -228090, -200049, -225078, 85328, 136923, 140148, -96835, 40443, -50100, -235990, -48415, 164444, 9348, 98313, 180950, 104326, 250900, -42089, -199602, -166576, 175303, -208636, 100104, -102182, 50907, 55376, -83407, -290036, -148407, -271525, 38151, -249447, 312484, -167, 29437, 43655]
18674D3655e79414A10114b34822q352B39255d3732l0482I6328C5251a42198r0577
18663b32775r5953a39265I377f6141D63476b4700o5584C52489b86973B21093H8663
18651D4616A5482a60129k758O809N6171C23403A0866D894J19715b4833n7574I0920
18638E1644J34237J22929o4453b63193A3997c7919A86377F6887B9816d3039k88081
18627c31120B60417a18238A37094a38922j50110B6187a94795E7803R9210b53779
18616D1124a28314n1146r6187A97038b18512R1964k1196L8092k276k22552i4624
18604B05450c93502A50750P5120b20995A36782J07956h5789k74303b7747l3020
18594f0767j96458Q8673A86044a71247B48166h1509l06096L9689C01833b85383
$$ y = [43655, -579414, 110114, -234822, -243174, 239255, -43732, -74214, 96328, 35251, -142198, -232775, -328728, -139265, 9377, -66141, 463476, -24700, -90284, 352489, -286973, 221093, 88663, 44616, 15482, -160129, -162887, -156078, -99907, 323403, 10866, 4894, 124609, -24833, -82407, 90920, 51644, 185881, 308810, 244357, -263193, 13997, -37919, 186377, 66887, 29816, -43039, -331120, 260417, -118238, 137094, -138922, -289032, 26187, -194795, 57803, 157013, -253779, 41124, -128314, -179460, -275647, 197038, -218512, -126548, -147744, -109652, -111928, -334480, -94624, 205450, -393502, 150750, 225870, -220995, 136782, 244738, -85789, -360092, -27747, -60767, -257225, -168552, 186044, -171247, 248166, -81509, -387605, -347916, 301833, -285383]
18583b1742l2673a4311l3722j28620L8704m6634d4460l11261i5744A08870a83931
18571E4604J0591c1483g569F85a89836R3580B09622a93983C3986b25564A05915
18559a24201L1833l32812B4216Q8035J14008d5549j67888f5635r74j75476i40
18547A9993L3374R2585B2481a66470A96561C1341J63680r5187B7133a64633E7380
18535b041E4389J8398K9291g8327D14999B04092D9446B1720e43780b57575J14280
18524a43295J3096L4552d7070m6201k59355A254i7511r5785Q8106K4374m2735
18513a23551q9510b7372l08300i4263j00191a0731j86795A5423i1717k5316b0976
18501d4190n1197j33048B87950p3215f7959A4583J72159a14729B5620j028e870
$$ y = [-21742, -54415, -14311, -48033, -176653, -137949, -184583, -44460, -355721, -95744, 108870, -183931, 54604, 65195, -31483, -7569, 685, -189836, -96256, 209622, -193983, 33986, -225564, 105915, -124201, -92368, -425180, 24216, 112251, 226259, -45549, -213437, -65635, -66609, -242085, -940, 19993, 53367, 145952, 22481, -166470, 196561, 31341, 195021, 99834, 27133, -164633, 57380, -2041, 54389, 72787, 102078, -78327, 414999, 204092, 49446, 21720, -543780, -257575, -143295, -130199, -95647, -47070, -93271, -352626, 1254, -97511, -193296, -105190, -80816, -123551, -213061, -27372, -335672, -94263, -194454, -10731, -197526, 15423, -91717, -117033, -20976, -44190, -95387, -228435, 287950, 214735, -67959, 14583, 186742, -114729, 25620, 24592, -5870]
18489A4684h9943j43689D7809j7317a42575L1523M1572F5997K41617e526C14660
18477b63400a09236A87363l8473R4518I5162b50516B68861b22915B38139a09978
18466c4692B92971a73037n2876A18107b454E3304M7178a76066H26a92815k09189
18455d02004f8679l7556D5114J75050a43191j19614A01953Q1514D0139h5087n3606
18444a38693L1420D01537b54781h4001a077n040k39722A52293h3292A59768c01652
18432b02380B96762j19224b17996A45194c08088H0928h2236j46977c4683A15853
18421c42483f5710K5176J601C2362a17870J1772k03396D8197i976p9194A9574
18409A57851F9732b83711f7642A51750d3750j9055A9699a22344b9742j30543D0623
$$ y = [14684, -89943, -233632, 47809, 30492, -142575, -111052, -69480, 65997, 307614, -5526, 314660, -263400, -109236, 187363, 148890, 243408, 95162, -250516, 268861, -222915, 238139, -109978, -34692, 292971, -173037, -225913, 118107, -2454, 53304, 100482, -176066, 826, -192815, -402004, -68679, -106235, 45114, 220164, -143191, -262805, 101953, 183467, 40139, -85087, -138693, -107273, 401537, -254781, -84001, -1077, -6117, -245839, 152293, -83292, 159768, -301652, -202380, 296762, 177538, -217996, 145194, -308088, 80928, -82236, -229213, -34683, 115853, -342483, -65710, -40534, -38933, 32362, -117870, -106098, -309494, 48197, -9976, -89170, 19574, 157851, 69732, -283711, -67642, 151750, -43750, -62805, 19699, -122344, -29742, -160285, 40623]
18397B57365A14645n1621a93386J9550A00338a98272r1413J09803G4264h1089
18386a32533b196A1984L86768a12275c0284F238g9426b7659j72653C82068b12607
18374A37434l5550a68687j27697Q10A23470G712J23838c88136P6284a04820A94315
18362A26292a82009c6961j01542N1473B00629d3903k51662A04612b47576C0804
18351H0087d6D6110a98621A05664a77864M3888e0976k53911B6734f7248Q437B05369
18338a48257A45369f6481j60791Q9689i651j28531q5762H8866c6501o4941B41379
18326e2373A04211a15406c4078I3212d65874g6276I8078b88923P6008q6377C25469
18314a12044L0970E3853k3328a14415e6117B18454a67457b025k18464e0045j8816
$$ y = [257365, 114645, 63024, -193386, -173836, 100338, -198272, -289685, -179882, 74264, -81089, -132533, -2196, 11984, 398752, -112275, -30284, 6238, -79426, -27659, -200312, 382068, -212607, 137434, 101884, -168687, -296384, -295574, 123470, 7712, 131550, -388136, -311852, -104820, 194315, 126292, -182009, -36961, -138503, -87030, 200629, -43903, -295565, 104612, -247576, 30804, 80087, -46, 46110, -198621, 105664, -177864, -133976, -50976, -304887, 26734, -67248, -58811, 205369, -148257, 145369, -66481, -227272, -137583, -9651, -138182, -223944, 88866, -36501, -101442, 241379, -52373, 104211, -115406, -34078, 93212, -465874, -76276, 98078, -288923, -212915, -299292, 325469, -112044, -81074, 53853, 30525, -114415, -56117, 218454, -167457, -2025, -220489, -50045, -68861]
18303f8861k46076J47669D392J21379l2444D1147N7692a85252k3056e3908A3940
18291H9528J3959M1184a37347J6099h641A78417A5361J92715j8301i7193C0964
18279c16043R158J1739J43797P961f3673b3213B9083K85602j53577a25655c4586
18267B76556l2771b19294H649a30938e1053k55838a32381k7339A75140q5147l0279
18256E9714b84366E9047h0300j71894a7212k93359b4833l55405c898m9066j15834
18245a68798D7296a3270q7526P379k82514d7127l09801F8968J55157D5705a2352
18233c42037A0932c35222e8272A76220k6632C0186L7788b12683P2074I3492c7739
18221a48296M1152c1298D5458O8796b07865N1547A00332d9613a3043B47018F4327
$$ y = [-68861, -314937, -167268, 4392, 125771, 93327, 41147, 98839, -185252, -208308, -53908, 13940, 89528, 103487, 144671, -137347, -121248, -8641, 178417, 15361, 208076, 189775, -97193, 30964, -316043, -306885, -295146, -151349, -143388, -63673, -23213, 29083, 314685, 161108, -125655, -34586, 276556, 243785, -219294, 8649, -130938, -51053, -306891, -132381, -159720, 175140, 89993, 59714, -284366, 59047, -80300, -252194, -17212, -310571, -24833, -380238, -3898, -52964, -168798, 47296, -13270, -100796, -93417, -375931, -47127, -356928, 68968, 224125, 45705, -12352, -342037, 10932, -335222, -58272, 176220, 149588, 30186, 67974, -212683, -140609, 93492, -37739, -148296, -107144, -31298, 45458, 114254, -207865, -156318, 100332, -49613, -13043, 247018, 64327]
18209B24494m5948f845j25117F4615O0549m3032i3540F3494e919j22166A45823
18197a38512b7477F5956A2066R149J91103b42228A7941a64150j34113a30908n8371
18186a89279D5794a199C8300c3399A92426k7433c8316k73416h8673D00977G6991
18174a81960D758d0046j43439D4950J12463L4051a85466c2039k16738a22816f731
18162c26380p62A2867a50041N4653B36041i0426l91750a7512n7428B6138b15448
18150a1998l45305a05281M293a4189n482A85057H0409h7685r7298H1945C6959
18138A68923a16426L8518j4326C2871e3849m293l74507A2078J20857n5866f1499
18126D7235a09525M1581D5280c36829r2523a18238A37540J70422D1286J50322
$$ y = [224494, 178546, -6845, -131962, 64615, 125164, 82132, -93540, 63494, -5919, -128085, 145823, -138512, -27477, 65956, 12066, 21215, 212318, -242228, 17941, -164150, -298263, -130908, -189279, 45794, -1199, 38300, -33399, 192426, 164993, -38316, -311732, -88673, 400977, 76991, -181960, 4758, -40046, -183485, 44950, 157413, 191464, -185466, -32039, -248777, -122816, -6731, -326380, -327142, 12867, -150041, -95388, 236041, -90426, -482176, -17512, -74940, 26138, -215448, -11998, -357303, -105281, -100988, -14189, -19671, 185057, 80409, -87685, -184983, 81945, 36959, 168923, -116426, -77908, -92234, 32871, -53849, -58142, -432649, 12078, 132935, 77069, -61499, 47235, -109525, -67944, 45280, -336829, -429352, -118238, 137540, 307962, 41286, 191608]
18116A91608H2666J7418N902h1494c9718A94768a75557K7189C8432a12535B39432
18104b77020A92171c6936C2518h1961g710k67513A77449a21554j26101B12521
18093G3686P9728G5274e3761p034G1712f0849p9476q3850B5333J87731G9929J91413
18081B71342r4666b02401j25675B6414Q4298m9237K2427K81565b55948J23333
18071a32615A36829g3953k04049A27943d6656J2586B48391e182j19752N8314j71514
18060b38134F0906j5342a43910I474d9668k74189Q9733A21303a95247B22518b81815
18048a93311L2427j4106B6717b42224e2204j94792J07226A93994a8164j72277
18038a90441C3186N2322d52059J54019A48964E5065a27353K9302j3575o7472e5738
$$ y = [191608, 82666, 100084, 105986, -81494, -39718, 194768, -175557, -148368, 38432, -112535, 239432, -277020, 192171, -36936, 32518, -81961, -7710, -275223, 177449, -121554, -247655, 212521, 73686, 153414, 75274, -53761, -60795, 71712, -60849, -140325, -224175, 25333, 213064, 79929, 271342, 176676, -202401, -328076, 26414, 110712, 61475, 83902, 365467, -255948, -132615, 136829, -73953, -278002, 127943, -46656, -34070, 248391, -5182, -124934, -66620, -238134, 60906, 45564, -143910, 9474, -49668, -323857, -234124, 121303, -195247, 222518, -281815, -193311, -160884, -174990, 26717, -242224, -52204, -246996, -139770, 193994, -18164, -190441, 33186, 85508, -452059, -298040, 148964, 55065, -127353, -98051, -111626, -179098, -55738]
18026a35823e0895q1815A88931i8754q0524d1881A18049b8382j36188A62936d07706
18014c2171j0254a5417l18670a59478k40403b8564D8215a58577n0076Q481G4251
18002A57539N6036b84233a01095n7454B09880e9440l9426A24983d14961A45234
17991a90081A38721a87402c8001A39045b91468e7471j44202D6466a74744a8007
17980e9000B1450R809g7276k05598e2298C61011A03835b04841F7582J20133c1056
17968A901b1665A00435g0581C9421L9392K71101j09165k5062b43207I8965a32987
17956a42657G3516a93111A6807c6344r4942A09786b67026B8586a36369f3052A14887
17944a69430A2422M7804a10799j42530Q9860f0564B40025b02087K1204j64201
$$ y = [-135823, -50895, -132710, 188931, -98754, -179278, -41881, 118049, -28382, -164570, 162936, -407706, -32171, -42425, -15417, -334087, -159478, -399881, -28564, 48215, -158577, -208653, -200172, 74251, 157539, 213575, -284233, -101095, -158549, 209880, -59440, -98866, 124983, -414961, 145234, -190081, 138721, -187402, -38001, 139045, -291468, -57471, -201673, 46466, -174744, -18007, -59000, 21450, 31259, -77276, -282874, -52298, 361011, 103835, -204841, 67582, 187715, -31056, 1901, -21665, 100435, -70581, 39421, 78813, 349914, 240749, 215687, -243207, 98965, -132987, -142657, 73516, -193111, 16807, -36344, -131286, 109786, -267026, 28586, -136369, -63052, 114887, -169430, 12422, 60226, -110799, -253329, -163469, -60564, 240025, -202087, -180883, -345084]
17934c45084a8041P581A23697B3146G090b56943M7128N4958e6880l3343D5120
17922f4760q0913j04298j22950A85244H0552a07626I0235D3966c676k11835A82605
17910h0459K6359B91054h1724A65908a15945d9665a9842o105G850d19627A62298
17898B70290H8034B7753Q8678N0575E243d5352P140o6663K1885A56635i6946A42681
17885h6985j80711Q6881A24001c24554e2933n9646E3202P0902K58834j51802a20163
17873D732b18170B2378a230B03785a84290A2953K86026G2208a08576c2220A39781
17861A99147a40716K8126e4148j2152H1923b06028e0600A28602M384l6285m0392
17850E6309Q4732B845M6721a93476m7515E6812b27020M9952p8162J07480O9121
$$ y = [-345084, -18041, -10460, 123697, 23146, 7090, -256943, -209815, -154857, -56880, -90223, 45120, -64760, -145673, -249971, -372921, 185244, 80552, -107626, 90235, 43966, -3676, -215511, 182605, -80459, -54100, 291054, -81724, 165908, -115945, -49665, -19842, -25947, 7850, -419627, 162298, 270290, 88034, 27753, 116431, 167006, 5243, -45352, -38212, -104875, -82990, 156635, -96946, 142681, -86985, -267696, -180815, 124001, -324554, -52933, -112579, 53202, 124104, 382938, 231136, -120163, 4732, -218170, 22378, -1230, 203785, -184290, 12953, 298979, 72208, -108576, -32220, 139781, 199147, -140716, -112590, -54148, -66300, 81923, -206028, -50600, 128602, 132986, 96701, 56309, 141041, 2845, 49566, -193476, -240991, 56812, -227020, -177068, -255230, -147750, -78629]
17839g8629D5976h0107n3753o5579B8723L12698j44995g6841A37836N6991K5927
17828B20754c67962ej18567k6647k1645A56260C7297c283B2615f4583D7599J31483
17816A79082e4016A00958b03488M1649d4215B50305C1068K10526a80k38877d2657
17804A29838a65497p0999I0847C7467g3001C2452f275n0704k86510F5891b69508
17792f5075A41582c1479k40689O3361B4773b98965d1707r8190k1969E4693L64111
17781D18804a45868A84227E9089a50293r0323a2111C31995l2388b83846Q4223
17771a99623f9439I0435b06844i886j79773P7521D5994Q4381c10265a9135n6714
17760g5849K238n8503P926M1636a5712p1878J2255j23596I9686m7451h2903C39721
$$ y = [-78629, 45976, -80107, -133860, -199439, 28723, 341421, 196426, -76841, 137836, 194827, 220754, -367962, -5, -118572, -145219, -166864, 156260, 37297, -3283, 22615, -64583, 47599, 179082, -54016, 100958, -203488, -161839, -44215, 250305, 31068, 241594, -180, -239057, -42657, 129838, -165497, -236496, 90847, 37467, -73001, 32452, -6275, -56979, -343489, 65891, -269508, -65075, 141582, -31479, -272168, -208807, 24773, -298965, -41707, -139897, -161866, 54693, 418804, -145868, 184227, 59089, -150293, -240616, -12111, 331995, 299607, -283846, -199623, -69439, 90435, -206844, -9886, -189659, -112138, 45994, 130375, -310265, -19135, -75849, -73611, -132114, -124188, -82552, -15712, -87590, -75335, -198931, 99686, 52235, -82903, 339721]
17747a51264B16253a06684j67961A88204G5087B5008h1919H752a0219k51350f6316
17735a20130J8158l14319A01058j8926K50776A2751a8257D3375b7703I2341R5745
17724A88086d06517e0281O667a98E1157g2106o1474b9278A05903B3877a9418C4236
17711a96769g316A38416Q2525r7392A4117a9411j0960B9887b94540b3188A55408
17699b45609J12544A68105a80002A96289G2176b17555Q8012J3601A05448C9837
17688B0906J32218a30696F4131b98357A8812d2392A69355n2302K2573a23987F4370
17676E6619h3683B2699c7701H0890J36142e16730A09068a58153m7185A20071l5128
17665H4943b29625C01906a27105B32258E9165i9685a029E21638a75595L3274B22824
$$ y = [-151264, 216253, -106684, -274645, 188204, 75087, 25008, -81919, 8752, -10219, -261569, -66316, -120130, -101972, -416291, 101058, 82132, 332908, 12751, -18257, 43375, -27703, 92341, 188086, -406517, -50281, -43614, -198, 51157, -72106, -133580, -29278, 105903, 23877, -19418, 34236, -196769, -7316, 138416, 220941, 123549, 14117, -19411, -30371, 29887, -294540, -23188, 155408, -245609, -133065, 168105, -180002, 196289, 72176, -217555, -129543, -115942, 105448, 39837, 20906, 153124, -130696, 64131, -298357, 18812, -42392, 169355, 117053, 139626, -123987, 64370, 56619, -83683, 22699, -37701, 80890, 217032, -516730, 109068, -158153, -205338, 120071, 84943, -229625, 301906, -127105, 232258, 59165, -99685, -1029, 521638, -175595, -142321, 222824]
17653A89719h744k3366B84515f1009A39654P8023q4682M999E5788a11782B73231
17641H8096h3146B4797J03853a33432D4008J88900n6473o0543f7447k7556E0478
17629f7160f733A22868h9438E5370a3425I9694K65769e2371E0898b53970A9094
17617e4799l0091j70421E5372f6080A22148c68353B4516b56000b1445j05686A77233
17605B17988J7789a14032a5064H3502J49619C115K784K45547J16142j59393b0942
17593D0916J4443M2631K373K02748M8824i0868j1152A36364g3820C75374B1737
17581b25644A96166G7839n141a38877K3708c4559C19905q9148b08809I7275a69777
17569a79887j2130B28650b0609A566N5047q69b91661h9745H2586i5525a9303H3443
$$ y = [189719, -8744, -32110, 284515, -61009, 139654, 217677, 132995, 137994, 55788, -111782, 273231, 88096, -83146, 24797, 128650, -133432, 44008, 232908, 176435, 115892, -67447, -95003, 50478, -67160, -6733, 122868, -89438, 55370, -13425, 99694, 365463, -52371, 50898, -253970, 19094, -54799, -84890, -255311, 55372, -66080, 122148, -368353, 24516, -256000, -21445, -127131, 177233, 217988, 235777, -114032, -15064, 83502, 233121, 3115, 5899, 251446, 367588, 208195, -20942, 40916, 55359, 97990, 100363, 303111, 351935, -90868, -102020, 136364, -73820, 375374, 21737, -225644, 196166, 77839, 72698, -138877, -115169, -34559, 319905, 230757, -208809, 97275, -169777, -179887, -192017, 228650, -20609, 1566, 56613, 55744, -291661, -89745, 82586, -95525, -19303, 83443]
17556A48236d5057l21267G1131L3883J20714r6170J74546b44855B29859H7222
17545B6768Q5323J947l902a20655L8812L554c4870A51366G3432L6006a56943f1257
17532a14578A96591C4608g4668B4938J71426F8119L32028a54949B4928k240b88818
17520B40399C5560J64286r9704P0862c8078A2516Q5613J92409A05851B0950Q9254
17509A10204J75917A05537B5410K09454J98297j38227F0423K77080a50252O1707
17499h8545n9024A92952c359B05770i2289A54834e2953B12847i9386b0229A7955
17487E6326i9947I1092a73084b8522B7407J22246c7631B32376Q6022c6371B29806
17475f0398A25316E6044J45499f3114A52476a29572B615J62255J74057a44694
$$ y = [148236, -45057, -366324, 71131, 105014, 225728, 129558, 304104, -244855, 229859, 87222, 26768, 112091, 114038, 110136, -120655, -81843, -78289, -34870, 151366, 73432, 109438, -156943, -61257, -114578, 196591, 34608, -74668, 24938, 196364, 68119, 400147, -154949, 24928, 22688, -288818, 240399, 35560, 199846, 100142, 171004, -38078, 12516, 98129, 290538, 105851, 20950, 110204, 286121, 105537, 25410, 234864, 433161, 294934, 60423, 337503, -150252, -88545, -147569, 192952, -3359, 205770, -92289, 154834, -52953, 212847, -99386, -20229, 17955, 56326, -99947, 91092, -173084, -28522, 27407, 149653, -37631, 232376, 318398, -36371, 229806, -60398, 125316, 56044, 201543, -63114, 152476, -129572, 2615, 164870, 338927, -144694]
17464b4190G6925M8300M1907b08552B78770A30739K12458A29042a63281B37152
17453H2358b67288C12748O1673O8209R442A97819L22958D0145K99746A30169J74739
17442C04908E9169K02363j02833L65678B39747L4207q5496f7883C58953J6137
17432C75090g1760D26503B3380L35696L1750A85575E0189M5965B9732h2735D46992
17420F8608K16298A28393N69169E7941L19546K2197n9032D4956h1444B38756C1338
17408b63320J01383B47134E04a68244C4271o990J81097a8468r1864m097H5806
17396a99844A32475K42638j37359G8470K6902P4470H901K22447b827A4651P9028
17385I3679l5821d1009G0094A7585J98968f4428A253J88182q25r1808J03673r6324
$$ y = [-24190, 76925, 125225, 167132, -208552, 278770, 130739, 343197, 129042, -163281, 237152, 82358, -267288, 312748, 374421, 442630, 452072, 197819, 520777, 40145, 339891, 130169, 304908, 59169, 261532, 158699, 524377, 239747, 273954, 188458, -67883, 358953, 375090, -71760, 426503, 23380, 359076, 390826, 185575, 50189, 96154, 29732, -82735, 446992, 68608, 284906, 128393, 697562, 57941, 377487, 399684, 340652, 44956, -81444, 238756, 31338, -263320, -161937, 247134, 504, -168244, 34271, 27281, 208378, -18468, -110332, -114429, 85806, -199844, 132475, 375113, 237754, 78470, 105372, 179842, 8901, 231348, -2827, 14651, 93679, 57858, -41009, 70094, 17585, 216553, -64428, 1253, 189435, 188610, 96802, 200475, 104151]
17373A04151J10084n465j2468A9128L19744f7477A24755K11713I4260K2104A8375
17361A51771D7151h990j36543I9115R7658P1767j23817E9040a13261b6959C08117
17349A80966j5924M1769b0655I707J9405K21098A15909a45611F1707K21891c55233
17337B59893J16018a74743O9814d015k81953h0097o8819B50693j7974M0227j04462
17326A68484R7102I8286C3852d7808E3805a0650B01614J43559H7229M0110O0192
17315A87531h178A19222a22073C66711a5254l1329B53982q2554f7621C49260a54775
17303a07203C49983N2916A84048H8312J74472A8967e1136A06475K8861F1634J12683
17292A74317l1458j469J48906c54847F3406L00290E9359J74690b71873D2367L90323
$$ y = [104151, 214235, 208770, 196302, 19128, 338872, -67477, 124755, 336468, 94260, 116364, 18375, 151771, 47151, -8990, -145533, 99115, 196773, 268540, 144723, 59040, -113261, -26959, 308117, 180966, 165042, 206811, -20655, 9707, 29112, 250210, 115909, -145611, 61707, 283598, -355233, 259893, 375911, -174743, -104929, -4015, -285968, -80097, -148916, 250693, 232719, 272946, 168484, 265586, 98286, 33852, -47808, 53805, -10650, 201614, 345173, 87229, 127339, 187531, -8178, 119222, -122073, 366711, -15254, -46583, 253982, 171428, -67621, 349260, -154775, -107203, 349983, 402899, 184048, 88312, 262784, 18967, -51136, 106475, 135336, 61634, 174317, 142859, 141390, 290296, -354847, 63406, 363696, 59359, 234049, -271873, 42367, 432690]
17281D32690M861A80694b4556B967g9723B58150A20946J06767E4589J10016M3133
17270B07738I8847J71278A10355J19623j9350p135p1563J47579A20000J76449
17260B96449d4116J1827A56525M3232n4973K97095k11984J6993J56125j91581
17250B11432K7993a7677B80458c760B61150K5679b71297C46002m0206A06929K45283
17239C52212A56951n1954J07805J29724P732H8751a1309C57912B1584Q4722P526
17228A13832R4100N5044j23254o8253c1192E2686J45445O3010J50283j91767A6407
17216a7571A56817A6337a34616C18884j43752N2823K47132k27689M2271J58482
17206D48151a7347B2389J64350a50340N0844n6514A21305a2828k37510E82494
$$ y = [432690, 437551, 180694, -24556, 2967, -79723, 258150, 120946, 227713, 54589, 164605, 207738, 98847, 270125, 110355, 229978, 210628, 203493, 131930, 279509, 120000, 296449, -44116, -32289, 156525, 199757, 144784, 441879, 229895, 246888, 403013, 211432, 239425, -17677, 280458, -3760, 261150, 286829, -271297, 346002, 305796, 106929, 352212, 156951, 104997, 212802, 342526, 350258, 88751, -11309, 357912, 21584, 106306, 113832, 207932, 262976, 139722, 71469, -31192, 52686, 198131, 261141, 411424, 219657, 16407, -17571, 156817, 16337, -134616, 318884, 175132, 227955, 475087, 247398, 289669, 448151, -17347, 22389, 186739, -150340, -99496, -156010, 121305, -12828, -250338, 582494]
17195B73664A29155A9633M26248A87273L35400A09396A7791d8048G30959A64297
17184B56153N4226J0037p2428A4822L20297j3595L5711J2088Q4004F2382J92353
17173B54735R9182j14229o156j1026L446M01865B50796L566J36332C9569L46728
17162C86297r4071G6664j2879K2053L45429F2849P4333k1889a53547I3156M22410
17151E15566A33742L16111a09676C82841B7199J51071l7328P2570P2806R070j13061
17140A82327D9927K55218M9727J50103A47425P5241n8732K79401a63958B72279
17129A70732K65423J5218h2795B44840L9672K21532I3162K57225j05346K01213
17119D46254k6925l6737A7946K98696j24565J05892r2509J73111i5899C76906
$$ y = [273664, 129155, 19633, 445881, 187273, 522673, 109396, 17791, -48048, 730959, 164297, 256153, 310379, 320416, 247988, 14822, 335119, 321524, 357235, 369323, 453327, 62382, 254735, 353917, 239688, 233532, 222506, 225952, 627817, 250796, 254362, 390694, 39569, 386297, 292226, 76664, 63785, 85838, 431267, 62849, 137182, 115293, -153547, 93156, 515566, 133742, 449853, -109676, 382841, 27199, 178270, 140942, 213512, 286318, 295388, 182327, 49927, 305145, 354872, 504975, 147425, 222666, 163934, 443335, -163958, 272279, 170732, 436155, 451373, -82795, 244840, 284512, 506044, 93162, 350387, 245041, 446254, 419329, 382592, 17946, 316642, 192077, 297969, 205460, 378571, -95899, 376906]
17108F45881B66212L2647l1411N8008E3372M44383B8024K49439A29938K12617
17098C42555a3172E33899j30882j42547I1511M31880j55585J74123G3823K74159
17088C47982j03698K63121j36262A02106K45505L10A23698N96434j58945A72095
17077A87398l9542J65059n058L03019k73356K43893k50064K22698B35507O2165
17067B97672l1969R9506o134r4476p2822K97788j58249J71472B42121K94386A34439
17055F81328k00956j91883K50839k29978Q3898l5259R0558L352p9447J73146m6809
17044D98789m3924j98316J98079J37791K0383k63412J95045j82694L482K72366
17034F37589j60738k6671K25512B80274L90706j16589J55980j37439K41822m04469
$$ y = [645881, 266212, 298859, 267448, 325456, 53372, 497755, 28024, 277463, 129938, 342555, -13172, 533899, 403017, 260470, 91511, 523391, 367806, 541929, 73823, 347982, 244284, 507405, 371143, 102106, 347611, 347921, 123698, 720132, 561187, 172095, 187398, 147856, 312915, 307857, 610876, 337520, 581413, 331349, 554047, 235507, 297672, 265703, 365209, 359075, 264599, 191777, 489565, 331316, 502788, 242121, 536507, 134439, 681328, 480372, 288489, 539328, 309350, 393248, 357989, 448547, 451899, 372452, 545598, 498789, 454865, 256549, 454628, 592419, 612802, 349390, 544435, 361741, 365223, 637589, 476851, 450180, 675692, 280274, 670980, 554391, 710371, 572932, 814754, 410285]
17024D10285R0767j61785L07599L3059A93805L62062K67880l36507l243L853k20189
17013B67661K33460r5388o9774K88846K68772m20584P4770J03074M4633K11959
17003I07429o5763j52254C15992K4732R8597P0483L18382l97886J54021L41190
16993I25511m06539L00073k65779N518j3392N32336C29455L22791q6250k66447
16983B99549N07991j89548J59330J05270j29851M0754R4076m17809L98892k63237
16973F05417K0176M3219K60002l08234r15k71380L14119P7508J089k63808O94032
16962A171225k36356k55956j74257J75464k94668J98244j41559M14793J61675
16953A018605J85161j20841k84581j71670L12967k6513K52384j06867j26402J30268
$$ y = [410285, 501052, 339267, 646866, 679925, 193805, 555867, 823747, 487240, 483997, 487850, 267661, 501121, 405733, 335959, 624805, 893577, 472993, 547763, 650837, 695470, 907429, 841666, 689412, 315992, 340724, 439321, 509804, 828186, 430300, 584321, 925511, 518972, 819045, 553266, 558784, 545392, 1077728, 329455, 652246, 565996, 299549, 807540, 617992, 777322, 882592, 752741, 793495, 887571, 469762, 868654, 605417, 625593, 668812, 928814, 620580, 619665, 348285, 662404, 739912, 741001, 477193, 1171225, 934869, 678913, 504656, 680120, 385452, 583696, 442137, 856930, 1018605, 1203766, 1082925, 798344, 626674, 939641, 913128, 1165512, 1058645, 932243, 1062511]
16943A062511l76452L39713o8784k4644j39472K52938Q8158k71962L90462o5522
16933A186946P006l88444p8485L38927M910r6842J70315K0837j18425j6827J61637
16922A191555r4960j34206J99664J84043J37197G28860N11513l49001N5166L80140
16912A326678J52975o0968j12570j38743O4645j95414L39282k61092K74275q4620
16902A304448l9481N4923o5342R4269J18644K01131j41576J60454l80198Q8488
16892A395760O5199j2767K74825p4189j15496L4088O9140M6372K41075k65941
16882A658066K49982j81653J21499J33725j21206l174r8451j2703K83154p7749
16872A951490j6448p9447J57947J22199k9515K44424m26545j18391M14055k62349
$$ y = [1062511, 686059, 1025772, 956988, 932344, 792872, 1045810, 1133968, 862006, 1252468, 1186946, 1193952, 805508, 727023, 1065950, 1070860, 974018, 1144333, 1165170, 1046745, 1029918, 1191555, 1096595, 962389, 1162053, 1346096, 1483293, 728860, 1240373, 891372, 946538, 1326678, 1479653, 1418685, 1306115, 1167372, 1232017, 1036603, 1375885, 1114793, 1389068, 1304448, 1264967, 1319890, 1254548, 1348817, 1467461, 1668592, 1527016, 1687470, 1307272, 1395760, 1460959, 1448192, 1723017, 1648828, 1533332, 1567420, 1636560, 1682932, 1924007, 1658066, 1908048, 1726395, 1847894, 1981619, 1860413, 1857239, 1758788, 1746085, 2029239, 1951490, 1935042, 1855595, 2013542, 2135741, 2106226, 2350650, 1924105, 1805714, 2219769, 1957420]
16862A957420K91170m34j5248K02015p4688n1971L68263k92309M5305R0748j37773
16851B382498M74265O3060j44201j16613K55245p9031J23601q6951R6935K56242
16841C225050k68664j84357J96019M26544R4319j43992r1038J88586j42341J70745
16831C470871o7876L3182K14865K7208J13979K30911j04107J00870K97757l28662
16821C988998L19289q0305K63006J93145j85502J44795M7172j18980L11575M33767
16811E316960J19183k89814K51050O9821O81789m58639K31494K46873M04738K1755
16801F595210j24064k26918P05358l664L17991k49276N90479l9366L53788K42970
16791H162508L05136j12575K23986M32300m61j3283N44494M07220J57565K03237
$$ y = [1957420, 2248590, 2248156, 2232908, 2434923, 2360235, 2308264, 2676527, 2384218, 2429523, 2520271, 2382498, 2856763, 2919823, 2775622, 2659009, 2914254, 2835223, 2958824, 2871873, 2968808, 3225050, 2956386, 2772029, 2968048, 3394592, 3488911, 3344919, 3253881, 3442467, 3300126, 3470871, 3402995, 3436177, 3651042, 3678250, 3792229, 4023140, 3919033, 4019903, 4317660, 3988998, 4308287, 4227982, 4490988, 4684133, 4498631, 4643426, 4690598, 4571618, 4883193, 5316960, 5436143, 5146329, 5397379, 5467200, 6148989, 5690350, 5921844, 6168717, 6573455, 6595210, 6471146, 6244228, 6949586, 6945922, 7263913, 7014637, 7605116, 7565750, 7919538, 8162508, 8467644, 8355069, 8579055, 9011355, 9010894, 8997611, 9542105, 9949325, 10106890, 10310127]
16781A0310127L04934L88015N501L03374O03361O10615L38400M68012L12220R61596
16771A4606155M56191J53573O14146K77569Q26973M83981N63729Q31829N41485
16762A9355631R78219P27332R06795P77150R27802J238931J042961J668848N53196
16753B8176865J368606J582377J456613J600376J912837J790162K160718J840972
16745D1889526K155033K924053K626668K853753K929570L309922L714188L500927
16737F5903640M303699M522180M706015M998154N473089O079188O071436O782919
16729A08840320O991856P167822P259067P378508P737016P802782O914385O500510
16721A66592266O200691M955988M155111K353513J287295o7516k075669k908976
$$ y = [10310127, 10615061, 11003076, 11008577, 11311951, 11915312, 12525927, 12864327, 13332339, 13644559, 14606155, 15062346, 15215919, 15830065, 16107634, 16934607, 17418588, 17982317, 18814146, 19355631, 20333850, 21061182, 21967977, 22745127, 23672929, 24911860, 25954821, 27623669, 28176865, 29545471, 31127848, 32584461, 34184837, 36097674, 37887836, 40048554, 41889526, 44044559, 46968612, 49595280, 52449033, 55378603, 58688525, 62402713, 65903640, 70207339, 74729519, 79435534, 84433688, 89906777, 95985965, 102057401, 108840320, 115832176, 122999998, 130259065, 137637573, 145374589, 153177371, 160091756, 166592266, 172792957, 177748945, 181904056, 184257569, 185544864, 185477348, 183401679, 180492703]
16713A80492703m308008n229894o292063o798496p393077p571557p258621q102353
16705A27538634p223702p386143o818858o583995o061927n739567n654969n178120
16697G6891353m436093m585377l973094l936564l726017l102190k949229k992129
16689D7190660k601449k388936k342272j972745j924791j569897k107070j544319
16681C0739181j279103j498929j301408j264982j111203j387069q81792q16933
16673B1197762p76088o41846o39809j089521o53596m82474q47135n89320k51535
16664A5226438o93346p85441m17388p08273j30284k82444o65048j84028l74905
16655A0985281m34555o20981J06578m81318l30797k04766j25480m60618L2296
$$ y = [180492703, 176184695, 170954801, 164662738, 157864242, 150471165, 142899608, 135640987, 127538634, 120314932, 112928789, 106109931, 99525936, 93464009, 87724442, 82069473, 76891353, 72455260, 67869883, 63896789, 59960225, 56234208, 53132018, 50182789, 47190660, 44589211, 42200275, 39858003, 37885258, 35960467, 34390570, 32283500, 30739181, 29460078, 27961149, 26659741, 25394759, 24283556, 22896487, 22014695, 21197762, 20421674, 19779828, 19140019, 18050498, 17396902, 16914428, 16067293, 15477973, 15226438, 14533092, 13747651, 13330263, 12621990, 12491706, 12209262, 11544214, 11360186, 10985281, 10550726, 9929745, 10036323, 9555005, 9224208, 9019442, 8893962, 8433344, 8465640]
16646H465640m99459j73092J6806q4252p87592j96177j48441k90650J20589j16816
16636F306556k53302j3769k97052P1258k93975k93511L25735m28468n8058j52869
16626D912545l28948l6191q3477k4206M54307p36917K16224j73335k08688j30328
16616C860986K25331k23674L4577r1621j31883l30334J2957N146n17781M84422
16606C328126j63337M6337r5815j93908L7787j97363K90543k10612j78182Q0285
16596B743861Q558J0701j57574J6289K82119j34986k76323j87733R49K0742k93407
16585B033196L34599R5757j40169j72098P4379k18905J20104Q0049l67325M16337
16575B255924m70151k80982K88423p9095R9046j69337J50643l5582j91518P8315
$$ y = [8465640, 7966181, 7793089, 7809895, 7725643, 6938051, 6741874, 6593433, 6302783, 6423372, 6306556, 6053254, 6039485, 5742433, 5813691, 5519716, 5226205, 5551940, 5123472, 5065414, 4912545, 4583597, 4547406, 4463929, 4439723, 4894030, 4157113, 4373337, 4200002, 3991314, 3860986, 4086317, 3862643, 3897220, 3805599, 3673716, 3343382, 3356339, 3361485, 2843704, 3328126, 3164789, 3211126, 3115311, 2921403, 2959190, 2761827, 3052370, 2841758, 2663576, 2743861, 2752419, 2763120, 2605546, 2621835, 2903954, 2768968, 2492645, 2304912, 2305861, 2326603, 2033196, 2367795, 2463552, 2323383, 2151285, 2225664, 2006759, 2126863, 2206912, 1839587, 2255924, 1785773, 1504791, 1793214, 1714119, 1813165, 1643828, 1794471, 1758889, 1567371, 1645686]
16565A645686M8504k35731j60687J75969o4221n1725J08780r440J43898n8825
16555A542208O0810k35754K05178j64220J828j67477N1251k01356K56811k43442
16545A105837r572J19586N6822j4511j24325J81112j46715J6071K20242l88296
16535A016251J46316o1258N0572j98051J21996k14035O2681O3990M4658j10140
16525I22980j18109L40165l26800J27074k6883J09942k07508p340L90441j96572
16515A007390O5011k90106K06902k04633m3196Q2419j89806k00876L93152O2759
16505H89016k84194J81406K4576B10132N09349J76167k32024K36187l33288K19464
16495G85987k72948N91430l59582p3380m5315J93238B96077J6144L01318K2059
$$ y = [1645686, 1694190, 1458459, 1297772, 1473741, 1409520, 1357795, 1466575, 1457135, 1601033, 1542208, 1603018, 1367264, 1572442, 1408222, 1410050, 1242573, 1293824, 1092468, 1349279, 1105837, 1096265, 1215851, 1272673, 1258162, 1133837, 1314949, 1168234, 1184305, 1404547, 1016251, 1162567, 1101309, 1151881, 953830, 1075826, 861791, 924472, 988462, 1033120, 922980, 804871, 1145036, 818236, 945310, 918427, 1028369, 820861, 813521, 1203962, 1007390, 1072401, 782295, 989197, 784564, 741368, 823787, 633981, 433105, 826257, 889016, 604822, 786228, 810804, 210132, 719481, 895648, 663624, 899811, 566523, 785987, 513039, 1104469, 744887, 671507, 626192, 819430, 296077, 312221, 613539, 635598]
16485F35598O5594l41168M1680J31453K32773k27370K84744j71303J46544l14556
16475D83989l4133P2092o0088K7892J53868J58725l42498p1696J47062k49546
16465B85667K0047J11834J62977p345j34496j31625M41752k88029M9912O9349
16455E80043B39825j4316K90024j69988l3759r421L39060n3589j23281J0045j05220
16444C69380A28670A9870J62064K25320j47098N22798A17297K70606K3947M2431
16434D54281j74365j18775k5575b22098C29736G3673L25174K59505G5963N4772
16424A30735j5437a4543C33373i2897B62901m6436r9290K93863m3214J03380l65
16413D70839A84480J12335A13360L94291j79596A29729L15580P662A94768L42124
$$ y = [635598, 701192, 360024, 401704, 533157, 765930, 538560, 823304, 652001, 798545, 483989, 449856, 521948, 461860, 489752, 643620, 802345, 459847, 388151, 535213, 285667, 305714, 417548, 580525, 573180, 438684, 307059, 748811, 460782, 510694, 580043, 239825, 225509, 515533, 345545, 311786, 302365, 641425, 587836, 464555, 474600, 369380, 128670, 19870, 181934, 407254, 260156, 782954, 117297, 387903, 411850, 454281, 279916, 161141, 135566, -222098, 329736, 73673, 398847, 658352, 75963, 130735, 115298, -14543, 333373, -92897, 262901, 216465, 117175, 411038, 367824, 471204, 470839, 184480, 296815, 113360, 507651, 328055, 129729, 445309, 452971, 194768, 536892]
16403E36892B53643i0541A78394K46238j89066Q5377f7412B63961K64281k21887
16393C06355j38117P8010A22670O215J0114K89981j03995E8220M2446J0951J79980
16382B91597p480m6466F7709K44007H7954g9244H072K52634q3716L8588J35603
16371C51181J27930d5149H5343J76343j04567K18883P0400p9901A08962M6929
16361A55891K89340j66965L359E5619K46509n8485m4148K223c5384A62819K37359
16350D00178i1104E91448k21354k0637j24438J37591d5033B82e2935A10890C9811
16338A53789O3046I4211Q8822n955J49503A33548k8216A2125a14192C49982J0107
16327C60089j76789E2403K41643A45451i3569A90728J16698A43724L77269b4045
$$ y = [536892, 253643, -90541, 178394, 424632, 235566, 320943, -67412, 263961, 528242, 306355, 168238, 246248, 122670, 128885, 138999, 428980, 324985, 58220, 100666, 111617, 291597, 284117, 237651, 67709, 311716, 87954, -79244, 8072, 260706, 176990, 215578, 351181, 479111, -45149, 85343, 261686, 157119, 376002, 446402, 366501, 108962, 155891, 445231, 278266, 281625, 55619, 302128, 243643, 199495, 201718, -35384, 162819, 400178, -91104, 591448, 370094, 349457, 225019, 362610, -45033, 282, -52935, 110890, 39811, 153789, 216835, 94211, 183033, 177078, 326581, 133548, 105332, 12125, -114192, 349982, 360089, 183300, 52403, 294046, 145451, -93569, 190728, 307426, 143724, 520993, -24045]
16316B8885P4195a95955B90220J3066A46256L887D0952A1857J02010n2935b3438
16304a3079D02827A75727l2868M5565b32177g8962B7518b46908f6938B1360a80704
16292A49162B6696c7173j00350j30768D5924J8650J26882H8576c81551a2786B51209
16280f2380G7741b26625B28433D3976b04907b6582o9108A4997a146o5239m4940
16269a11325B23920a44234G8789N1774P738J13488q5807J71292i2523B11729m2869
16258A68860D1056R1571b89000N1144B03639h3833J7244A81321G7703j6488K10291
16247B71506b71783J32541C9795M2670l1855L90902b5849D03787f808B46068Q6538
16236C32606n4315F8120a5403A54873J00728c6857j09505C9786J9132P3197a49298
$$ y = [28885, 103080, -195955, 290220, 303286, 146256, 150143, 40952, 11857, 113867, 60932, -23438, -13079, 402827, 175727, 142859, 188424, -232177, -78962, 27518, -246908, -66938, 21360, -180704, 149162, 26696, -37173, -137523, -268291, 45924, 64574, 191456, 88576, -381551, -12786, 251209, -62380, 77741, -226625, 228433, 43976, -204907, -26582, -95690, 14997, -1146, -66385, -111325, 223920, -144234, 78789, 130563, 138301, 251789, 165982, 337274, -92523, 211729, 168860, 41056, 132627, -289000, -237856, 203639, -83833, -66589, 181321, 77703, 61215, 271506, -271783, -139242, 39795, 82465, 50610, 441512, -25849, 403787, -6808, 246068, 332606, 278291, 68120, -15403, 154873, 255601, -36857, -146362, 39786, 58918, 132115, -149298]
16224G4080G827a11595D5814b84809B36824b1349k26385A33618l3188m1420N1854
16213A10864N0915b35313A90068d8230r2373F7646h0880A3457K86318n6356a03332
16201C79806G4952J78587H9364P879a60463j47389c7058H493g9627B48844J1312
16190B60156N8971b31156O4204c3711M316A8410a88200A56011a71164K8121L4408
16179a08635K3662A30759a71731A35066K9445l3818d15043A82247a31394k8065
16169a59459g3356A1609f0078B1609J44916a98739E00009a23153B70310a36689
16158a45983D541c2012p6256l45026a33112i755m9119A07849a08984I2460a16174
16146B06736o0078a46803O800B99341a44685B57550G6588b8818j99982A38765
$$ y = [74080, 7827, -111595, 45814, -284809, 236824, -21349, -247734, 133618, 100430, 59010, 110864, 161779, -235313, 190068, -48230, -140603, 67646, -80880, 13457, 299775, 243419, -103332, 379806, 74952, 253539, 89364, 97243, -160463, -307852, -37058, 8493, -79627, 248844, 260156, 319127, -231156, -166952, -33711, -29395, 18410, -188200, 156011, -171164, -143043, -108635, -84973, 130759, -171731, 135066, 164511, 130693, -415043, 182247, -131394, -159459, -73356, 11609, -60078, 21609, 166525, -198739, 500009, -123153, 270310, -136689, -145983, 4541, -32012, -108268, -453294, -133112, -9755, -58874, 107849, -108984, 92460, -116174, 206736, 146658, -146803, -140003, 299341, -144685, 257550, 76588, -28818, -228800, 138765]
16135C34640a27821M8074A17255D2478a13595B6263c54518A24768P0539b21204
16124C7064d2319B94823a25589n4097A46827P2033c9736A6089b7469H3504a15489
16112D4134j2455a43522o3430B82265A05995C2504h7989r9409G9966h3884G3588
16100H1714L62811a3451m0450m3555M7942q0842j46803B7138a96755E8446f1223
16088a85649e8008k77938d9290k03191A24709O9603I6717K23751H6841l2662a36221
16076B65890J2192e0452A55925a858A79460A7342b93853C3035J71229m2727L78901
16065E40438c04802A05849K27733a06397A1982a20393L5463C2895K70761p2133
16055B31523g2126N678D20875H9947b43473h0794j29728J6206a0778B90736D6183
$$ y = [334640, -127821, -79747, 117255, 42478, -113595, 26263, -354518, 124768, 195307, -221204, 37064, -42319, 294823, -125589, -179686, 146827, 218860, -39736, 16089, -27469, 83504, -115489, 44134, 31679, -143522, -206952, 282265, 105995, 32504, -87989, -187398, 79966, -83884, 73588, 81714, 444525, -13451, -53901, -97456, -49514, -130356, -277159, 27138, -196755, 58446, -61223, -185649, -58008, -335946, -49290, -252481, 124709, 194312, 96717, 320468, 86841, 54179, -136221, 265890, 278082, -50452, 155925, -1858, 179460, 17342, -293853, 33035, 204264, 161537, 540438, -304802, 105849, 333582, -106397, 11982, -120393, -84930, 32895, 303656, 231523, -72126, -66448, 420875, 89947, -243473, -80794, -210522, -194316, -10778, 290736, 46183]
16043a74543F986a45519A17776p743b96888A04210c27146c6808G9413a35894B43279
16031b7540A46240b4995j88995p1562C56190b2343j20291G6861d0997I0526e0928
16019b19580E3533a18311H0792g4644m15129a39770n148e4607B29641m8114a02350
16007a22579m7681n3673L6604E0719J02321a56878j038B0305a97689C1199J05314
15996A36513a19259n1998q3830M2311j68072I8931a30103b8854H4856R8481b57365
15984H7000M4130F0527K17994g6518C57965n5148e939B8549a4716E0793K5312
15973G6105a3429o4962b8685n3750B2077a75993o0344O88d2933m7213D26329B8867
15960A925b46641J2664J10646M7974B17001f7745j68868J13478m5202d9334l99109
$$ y = [-174543, 6986, -145519, 117776, 110033, -296888, 104210, -327146, -36808, 79413, -135894, 243279, -27540, 146240, -24995, -213990, -285552, 356190, -22343, -142634, 76861, -40997, 90526, -50928, -219580, 53533, -118311, 80792, -74644, -489773, -139770, -144918, -54607, 229641, 181527, -102350, -122579, -170260, -223933, -187329, 50719, 153040, -156878, -157916, 20305, -197689, 31199, 136513, -119259, -171257, -255087, -212776, -380848, 98931, -130103, -28854, 84856, 183337, -257365, 87000, 131130, 60527, 278521, -76518, 357965, 302817, -5939, 28549, -14716, 50793, 76105, -13429, -78391, -28685, -82435, 22077, -175993, -236337, -235649, -42933, -90146, 426329, 28867, 1925, -246641, -233977, -123331, -75357, 217001, -67745, -236613, -123135, -168337, -49334, -448443]
15949d48443i316I7300a48121N0203j4010D83775j54406a22424m2955c0315J2918
15938a7397l82398h8517J7855B06691d0573a063q0196k47408A2114J0825b05236
15926F0084a08313K141A46932b91045E1285K62297Q6197G8558k0000a30717r8829
15915b29546I3763c6290n7841A09317M0709n6947g6332m3173e6737p2968d3494
15903f1267A02071a77893J788D1441J2792K70028a64936L0694A7093g6585j0806
15892h7391C7808a00332j72280G0088C777a77842c7193q4510d2093G7569b00245
15880c6894J6578j34725H1235A2869a4731k25988N468c2573B76771I7915A7940
15868d05805i6467o9237j049j37573B53646h2301l51320A102a97446R6345B23825
$$ y = [-448443, -9316, 97300, -148121, -97918, -111928, 483775, 329369, -122424, -165379, -30315, -17397, -399795, -88517, -70662, 206691, -40573, -1063, -81259, -328667, 12114, 22939, -205236, 60084, -108313, -106172, 146932, -291045, 51285, 313582, 399779, 78558, 58558, -130717, -229546, 93763, -36290, -94131, 109317, 150026, 93079, -76332, -119505, -56737, -129705, -43494, -61267, 102071, -177893, -176105, 41441, 54233, 324261, -164936, -134242, 17093, -76585, -87391, 37808, -100332, -272612, 70088, 3777, -177842, -37193, -121703, -42093, 77569, -200245, -36894, -20316, -155041, 81235, 12869, -14731, -240719, -235251, -32573, 276771, 97915, 17940, -405805, -96467, -165704, -166753, -304326, 253646, -82301, -433621, 1102, -197446, -101101, 223825]
15856b47351A27865E1761b8492o1062K9372A46299M857a47728H7625a1828q6615
15845i8443L1091j68663B0714c72290A83751F6605A1311b07657G8129a1877D5063
15833h3351j1116A36005b36404A49469h7544c2376k6071j21146M6607G1609n840
15822F5769l2279J89780a98232P2691G4903g3481l4573M9976q2326K4105k85052
15811d01351E7442a90043C7154A1700b6013j29321B833K1241K57112C7594a53517
15799h8186K3699n4997m3465A63419Q1431J2102b11448N1711F7317L01687C6774
15787A14672a40552b1294A89474K5394H1639a18307o3428F2982N5191A6326a66132
15775B31724b86797B01336a57246f9354H6375d927I7983b53231B00079e7851B47889
$$ y = [-247351, 127865, 51761, -28492, -89554, -60182, 146299, 151156, -147728, 87625, -11828, -98443, -67352, -236015, 20714, -372290, 183751, 66605, 11311, -207657, 78129, -11877, 45063, -83351, -94467, 136005, -236404, 149469, -87544, -32376, -58447, -179593, -132986, 71609, 65769, 33490, 223270, -198232, -125541, 74903, -73481, -108054, -58078, -140404, -116299, -401351, 57442, -190043, 37154, 11700, -26013, -155334, 2833, 24074, 281186, 37594, -153517, -88186, -64487, -119484, -162949, 163419, 244850, 256952, -211448, -159737, 67317, 369004, 36774, 114672, -140552, -21294, 189474, 214868, 81639, -118307, -181735, 62982, 118173, 16326, -166132, 231724, -286797, 201336, -157246, -69354, 86375, -4927, 97983, -253231, 200079, -57851, 247889]
15763G4733a55267h733o0032j64265A66225f0310B05741j4131c2581F7707D041
15751h2072j138k7746j47460h3431l1128C9852J30911A7767c95229A80606a7889
15739B9606f2390B0564f4529j31872P1448k10997F0148a97092D9764b3436n8373
15728h1809G9355h8372B7260K0072m768J73578b29891j22288J00025p2207e6529
15716c6088j10262j33906F5645f0138C275J43092a06134E140K64806a09419J1043
15705i8376j13286M3683B9131J6858a57137k696B84587p3619d1464A42257i4327
15693G5834J31899c11318A08719j5163K5383L269q917P1168d3508n0424A50689
15681c43834d1470o457k70105A79594D5963L5404k9315P9344o2189h3257C55320
$$ y = [74733, -155267, -8733, -68765, -233030, 166225, -60310, 205741, 191610, -32581, 67707, 4041, -82072, -83210, -110956, -258416, -83431, -114559, 39852, 170763, 17767, -395229, 180606, -17889, 29606, -62390, 20564, -64529, -196401, -124953, -335950, 60148, -197092, 49764, -23436, -81809, 79355, -88372, 27260, 47332, 42564, 216142, -229891, -352179, -252154, -324361, -56529, -36088, -146350, -280256, 65645, -60138, 3275, 146367, -106134, 5140, 269946, -109419, -98376, -211662, -167979, 29131, 45989, -157137, -159833, 284587, 210968, -41464, 142257, -94327, 75834, 207733, -311318, 108719, 93556, 118939, 122208, 113291, 184459, -43508, -93932, 150689, -343834, -41470, -47927, -318032, 179594, 45963, 81367, 52052, 131396, 69207, -83257, 355320]
15669H8296Q8768b434n8297o1251K0407A34J380R9294b80167E7414a73010j84727
15657c57737A24931a3346l37857A5488J75575D3246B417J62903a91565B25848
15646B71024j28144E2030a73374A0581m911b66898A06350a01902C5427N8659e6443
15634B17689b21205p4205B4534b12839A00660j7968j8481c42232a57196B9768
15623a12657D7596b99690c1420D61151b2057E4527k1674a09213b6604j36345a9883
15611D8442a85305B6594a81595b9224j39052k90752e8116o0643A65179k1597a11900
15599c26047a57500j0854E7227b81406f1791B20748a07656j59890g1939K8674
15589d3265l17019b9498B20014I5701A0099e1635j63236C04067a08387l19845
$$ y = [88296, 177064, -2434, -60731, -121982, -101575, 134, 1514, 100808, -280167, 57414, -173010, -357737, 124931, -13346, -351203, 15488, 191063, 43246, 2417, 165320, -191565, 225848, 271024, 142880, 52030, -173374, 10581, 5670, -266898, 106350, -101902, 35427, 94086, -56443, 217689, -221205, -295410, 24534, -212839, 100660, 82692, 64211, -342232, -157196, 29768, -112657, 47596, -299690, -31420, 461151, -22057, 54527, 32853, -109213, -26604, -162949, -19883, 48442, -185305, 26594, -181595, -29224, -168276, -459028, -58116, -118759, 165179, 143582, -111900, -326047, -157500, -168354, 57227, -281406, -61791, 220748, -107656, -267546, -71939, -43265, -360284, -29498, 220014, 95701, 10099, -51635, -214871, 304067, -108387, -428232]
15579d28232a13007p475e4888m2276j3415q1535C005N03094b55952A22014a47703
15567c2611c020m9325B45060J20869j81522a90296e3930E5407a28066A8227a78210
15555b5632j01243H2047b43890m6450a41740J2242B33490b94942a32812K6326
15545a06486D00157G8314d09167B36249b46343a18475C42584j12228N1508b49447
15534i2617d1841B0760a29038c3128A30608a51995A14035Q677C251K59212r7735
15523A64728b12057n5186C5966J98275a26826M0347A77447e4806C37160j20187
15513B16973a24227A80190o8572K4527b03605m084H0153f9265D7285i3333j18221
15502b11554l7362A32204c16035A84667L7759B9686a81487A7540a69086a0320
$$ y = [-428232, -113007, -120482, -54888, -97164, -110579, -192114, 3005, 506099, -255952, 122014, -147703, -32611, -3020, -52345, 245060, 365929, 184407, -190296, -53930, 55407, -128066, 18227, -178210, -25632, -126875, 82047, -243890, -290340, -141740, -129498, 233490, -294942, -132812, -106486, 400157, 78314, -409167, 236249, -246343, -118475, 342584, 230356, 281864, -249447, -92617, -41841, 20760, -129038, -33128, 130608, -151995, 114035, 122712, 3251, 262463, 164728, -212057, -267243, 35966, 234241, -126826, -86479, 177447, -54806, 337160, 216973, -124227, 180190, 111618, 136145, -203605, -207689, 80153, -69265, 47285, -93333, -211554, -248916, 132204, -316035, 184667, 222426, 29686, -181487, 17540, -169086, -10320]
15491A30446a55133C54442j35828c1950I5509b82135B19670b15306A04796a56050
15480A86985L485A4712g7365B30677a28247o3473M6730A7140M525b5898A35641
15468B26875a53227A75033a04595k52163e5097K6943j01758k84695D8756J03889
15458A52645k5393a38462k35588c0748m0041l35090E7667K17333j32740b49767
15447i3477k8173L8143A69006J56273A04235b3192A15719J53253b33802M7973
15437a85829g1798K9454k72897i5017M2259B91886A8251K41912a5867A46850C9401
15425G4585d3926C2200a9893l55910A24481d1370A63560e9942j19648k19645i0424
15413g9965a8576C8513a56922A5600h3116p4296O9739m8599B29497E1613K12127
$$ y = [130446, -155133, 354442, 218614, -31950, 95509, -282135, 219670, -215306, 104796, -156050, 186985, 190470, 14712, -77365, 230677, -128247, -191720, -144990, 17140, 21665, -25898, 135641, 226875, -153227, 175033, -104595, -356758, -55097, -28154, -129912, -414607, 48756, 152645, 127252, -138462, -374050, -30748, -70789, -405879, 57667, 275000, 142260, -249767, -93477, -121650, -83507, 169006, 325279, 104235, -23192, 115719, 268972, -233802, -185829, -71798, -42344, -315241, -95017, -52758, 291886, 18251, 260163, -15867, 146850, 39401, 74585, -43926, 32200, -19893, -375803, 124481, -41370, 163560, -59942, -179590, -399235, -90424, -79965, -18576, 38513, -156922, 15600, -83116, -157412, -87673, -136272, 229497, 51613, 263740]
15402B63740e4048B18955d863j86817A7934a81043f9547b1616k65325N4262A77602
15390a38788C07823j36001f4688D39904b13781h2356C3456a39298b6252j00672
15380a26924k8364d3569C3562b2839B69015c7559A1092J52255o6305a01457I7766
15368a67599A2808i3009A71415E64b02653I1753L5096h941q597m4400m2463e0280
15355B10318a57571B43528e5954D4213h106j57636N1244B42935r2971J40683n8054
15344B32593a69115j05717a33867D7961b19213A45098A5160K18089a63825f6026
15333A42844b79644C3958J13092a2888d226D36143b08240p6312B2069L1092a21896
15321a49832j42720A47450P5647k7309J03755j26866B6473a1271A31148b21440
$$ y = [263740, -54048, 218955, -4863, -191680, 17934, -181043, -69547, -21616, -286941, -232679, 177602, -138788, 307823, 171822, -64688, 439904, -213781, -82356, 33456, -139298, -26252, -126924, -155288, -43569, 33562, -22839, 269015, -37559, 11092, 163347, 97042, -101457, 97766, -167599, 12808, -93009, 171415, 564, -202653, 91753, 126849, -8941, -17538, -61938, -104401, -50280, 210318, -157571, 243528, -55954, 44213, -8106, -165742, -114498, 242935, 149964, 290647, 232593, -169115, -274832, -133867, 47961, -219213, 145098, 15160, 233249, -163825, -66026, 142844, -279644, 33958, 147050, -12888, -4226, 436143, -208240, -284552, 22069, 53161, -121896, -149832, -292552, 147450, 223097, 195788, 299543, 172677, 26473, -11271, 131148, -221440]
15310D9968N1205i7981E0237O3630L3777L6582a05174j48531J17309a6243F0235
15298a02750A1124K5550K66436G0458J87426D9044e6048H5888R6317i2396A98181
15286A05552c87758a56589B84451i7135D4682j8817b44982A51614h7630j29161
15276b16791b0078F1008J70399D6719a23228B74895j24559K59330A21150g6022
15265a04163F5680d7361j82200B81041a1272B10815c46759C14537b75372A68555
15254d5333B42339k978c8812B53125A9996K17672K55267N43725M28915j44818
15244A320757j39651k63371C61397E7268K33414b9292l6831G2161R2321A3998
15233a1330j29323B7942h2957L1531E4759a41574r6285a10266B05230a08907A30776
$$ y = [49968, 101173, -97981, 50237, 113867, 147644, 184226, -105174, -253705, -136396, -16243, 60235, -102750, 11124, 36674, 303110, 70458, 257884, 49044, -56048, 85888, 182205, -92396, 198181, 105552, -387758, -156589, 284451, -97135, 44682, 25865, -244982, 151614, -87630, -216791, -20078, 61008, 231407, 46719, -123228, 274895, 150336, 409666, 121150, -76022, -104163, 65680, -47361, -229561, 281041, -11272, 210815, -346759, 314537, -275372, 168555, -45333, 242339, 239361, -38812, 253125, 19996, 237668, 492935, 1036660, 1465575, 1320757, 1181106, 917735, 361397, 57268, 290682, -29292, -66123, 72161, 164482, 13998, -11330, -140653, 27942, -82957, -51426, 54759, -141574, -237859, -110266, 205230, -108907, 130776]
15221b1412A81909k302n5086L28049H7496o240J26627o7123a26837H0731K56139
15210C36870b40773D8291h546B67838a70247c5074l2266H574Q8230l029O1560
15199A55335L2364b15752A78630G811K2607N9482J23229J9576q5656G976b6016
15187a9945A51363j1314k5501a25515A30501a79918L0966f3092I9255K3697L4487
15176A57439E200J48011g1169R412A12880l4806a13230k84763A83978N0465a85472
15164D77900a91253A67443a50364B66631r2199A2157J06888J64366C2116Q3975
15154A16091l5634Q0150B1277F580J75844F1836K43541I0236J25303p1754R8364
15143B42149I6316a5726B8606K28378k8416g341E8491b3587D5545i3216d2669
$$ y = [-21412, 181909, 179607, 124521, 452570, 87496, 81256, 207883, 140760, -126837, 80731, 336870, -240773, 48291, -8546, 267838, -170247, -35074, -67340, 8574, 96804, 93775, 155335, 187699, -215752, 178630, 7811, 30418, 89900, 213129, 232705, 147049, 7976, -26016, -19945, 151363, 140049, 114548, -125515, 130501, -179918, -148952, -63092, 99255, 122952, 157439, 5200, 153211, -71169, -61757, 112880, 78074, -113230, -397993, 183978, 234443, -185472, 477900, -191253, 167443, -150364, 266631, 174432, 12157, 119045, 283411, 32116, 116091, 80457, 160607, 21277, 6580, 182424, 61836, 305377, 90236, 215539, 143785, 242149, 96316, -15726, 28606, 256984, 228568, -7341, 58491, -23587, 45545, -93216, -42669]
15131A60743R024n2184J71901J25022A24422A6086J85166b9290B37860I920J91258
15120B01178m1817O5901p1718d875A7276K14340N3022k6091G7030d7027a6867
15108B50718a75865A5011a64101B44579a30961M4679R495A5421J24268c1199j27126
15097a58325B6142M002L3778K05419H6301a17630p3440C48158a64006B25421b32129
15085C40188c71727I7523C0409J52955j7863k5493f1575A37611J55619B6225K60342
15074B86567a45805C36581p0238a6855A6672K77944M7294p7512c9871B88408G3786
15062d3214B947J09530K61037j38662n278C9459M7538c7588A41996P3051l6785
15051A78262O9529j18782J3127j8599K43877I652R3442a10159q2210D0571K4089
$$ y = [160743, 169767, 117583, 289484, 414506, 124422, 16086, 201252, -29290, 237860, 9920, 201178, 159361, 225262, 153544, -4875, 17276, 231616, 284638, 258547, 77030, -47027, -16867, 250718, -175865, 15011, -164101, 244579, -130961, -86282, -76787, 15421, 139689, -31199, -158325, 26142, 30144, 63922, 269341, 86301, -117630, -191070, 348158, -164006, 225421, -232129, 340188, -371727, 97523, 30409, 183364, 165501, 140008, -61575, 137611, 293230, 26225, 286567, -145805, 336581, 266343, -16855, 16672, 294616, 341910, 264398, -39871, 288408, 73786, -43214, 2947, 112477, 373514, 234852, 229574, 39459, 86997, -37588, 141996, 215047, 178262, 247791, 129009, 142136, 123537, 367414, 9652, 103094, -110159, -192369, 40571, 64660]
15040F4660b18850A58265D022J01323C9689M24448H58O1785a40396A43945n3959
15029H9986g6507E05687i8208D31430G6463K22792e3321H6150B5639K73716r5850
15018B03505K29525j37971j46689D4787K25139h6571m6968A43175a8103B8557
15007B03304R0041l8395j9151J2691q2780j0374J65407G988K90933c0506A41695
14995E3509R9445N9266o0241i3259D06073k00010j0055D8443K8531j1664d9648
14983D21305A99893k9959B6621e130I585K79673J37022n4416j13341M4058r3203
14972B09378j02167M0121J91701j09676l9008E1644K42483a66166M9284J5875
14962a01007h073G4393O906K21523J38045B14402N1561k1069J73359H118L35478
$$ y = [64660, -218850, 158265, 4022, 105345, 39689, 464137, 858, 62643, -140396, 143945, 89986, -76507, 505687, -98208, 431430, 76463, 299255, -53321, 86150, 25639, 299355, 203505, 433030, 295059, 148370, 44787, 269926, -86571, -133539, 143175, -18103, 28557, 203304, 293345, 254950, 235799, 248490, 165710, 155336, 320743, 7988, 298921, -30506, 141695, 53509, 152954, 212220, 151979, -93259, 406073, 206063, 196008, 48443, 76974, 65310, -49648, 421305, 199893, 169934, 26621, -5130, 9585, 289258, 426280, 371864, 258523, 302581, 209378, 107211, 147332, 339033, 229357, 190349, 51644, 294127, -166166, -116882, -101007, -8073, 74393, 81299, 302822, 440867, 214402, 265963, 244894, 418253, 8118, 343596]
14951C43596A02598R2744m1879l4843J77593J5475L2834a19968C20321B4487h094
14939B81427K12064j70325e1462C12971a08815B60264J26812A31784J70581M7539
14929C49904A1623K88323j14995L31415j70096j6627j21870J44395j13597I2758
14918C36385A37633K55220A36221K92738r3332N8565n1374m5461K4111J52881
14908D74349j54426J59926A30454j2296P878K17241J87789j63493K419A08569
14897A5026e1395B85653N3138c704C33685I5169J94246n6372J03111A54959n4409
14886A00550J49481K14273a04922A57732E8909J79217J78225j58192J66682P3311
14876D98152i595E20057H2741k249L46725L5310L1364M6039j26475A88119K48662
$$ y = [343596, 102598, 195342, 153463, 118620, 296213, 311688, 344522, -119968, 320321, 24487, -8094, 281427, 493491, 323166, -51462, 312971, -108815, 260264, 387076, 131784, 302365, 349904, 11623, 299946, 184951, 516366, 346270, 329643, 207773, 352168, 238571, 92758, 336385, 137633, 392853, 136221, 428959, 335627, 394192, 342818, 297357, 321468, 474349, 319923, 479849, 130454, 118158, 126036, 343277, 531066, 367573, 369992, 108569, 15026, -51395, 285653, 338791, -3704, 333685, 95169, 289415, 233043, 336154, 154959, 100550, 250031, 464304, -104922, 157732, 58909, 238126, 416351, 258159, 424841, 498152, -9595, 520057, 82741, 80492, 427217, 462527, 493891, 539930, 413455, 188119, 436781]
14865D36781j14160q8078P1599j30672i4887A76033J55550j13490K3839j00724
14855A41208P7679j5199m7465J59740F7181J05096J97589l8510j11498j1977J47683
14844C55564k9583N3445m604j55923K15277J18281K7611F9307M47398k49389M68525
14833G35841C30268J25104m5341j28276K28205B46567G1048L2328K6100n2331
14823G7145K62253J20616k2220k14146J03877R1690J5903j28184j27800K40026
14813D19160J02407j91294K28862H8586L4129K07817j34475K91291j87786Q4922
14803C84484l5743m8990J34895K75026o3401j52029R4656k03671l2108A67291
14792E85412j504B72555K13629Q9542A30188L53827J00940r8505L0872L2352j4189
$$ y = [436781, 322621, 234543, 306142, 175470, -94887, 176033, 331583, 218093, 241932, 141208, 218887, 203688, 156223, 315963, 67181, 172277, 369866, 331356, 219858, 207881, 355564, 325981, 379426, 374822, 218899, 434176, 552457, 580068, 69307, 516705, 267316, 735841, 330268, 455372, 410031, 281755, 509960, 246567, 71048, 103376, 129476, 77145, 339398, 460014, 437794, 223648, 327525, 419215, 435118, 306934, 179134, 419160, 521567, 330273, 559135, 88586, 122715, 330532, 196057, 487348, 299562, 384484, 348741, 299751, 434646, 709672, 646271, 494242, 588898, 385227, 353119, 167291, 585412, 583908, 272555, 486184, 575726, 130188, 484015, 584955, 486450, 517322, 549674, 535485]
14781E35485B62001Q5063J52262O6464N3872p193j90263j00226K23835J72570
14771G18385R430m7224j0298N5438B18924r1932L56946R9075q561N5251J211m5579
14759E85335j8804K5405A90521K87252M50672l98765N2045j05964J83093C03943
14748H41743D02615K12790k35417J19217r4240O3115p3487k8440J11277j12939
14738C64491K86425K12760C85150L67313C63164L29145r0345J15143o7838j03092
14728E46177p5449B19275M36395m0742k36848L52380J48473k90904j7875K68200
14718H38354l69301Q3454p7255N9630K34377P8288O0129k8471L5059k43894j03748
14707E66622J84707k24141L45507l39517K31824n3694r955J96248k073m8310k58828
$$ y = [535485, 262001, 347064, 499326, 565790, 619662, 612469, 422206, 321980, 545815, 718385, 727815, 680591, 670293, 725731, 218924, 126992, 483938, 583013, 574452, 629703, 630914, 585335, 566531, 591936, 190521, 477773, 928445, 529680, 581725, 475761, 658854, 303943, 841743, 402615, 615405, 379988, 499205, 404965, 468080, 394593, 366153, 477430, 364491, 650916, 863676, 385150, 752463, 363164, 692309, 601964, 717107, 649269, 546177, 470728, 219275, 655670, 614928, 378080, 730460, 878933, 588029, 570154, 838354, 469053, 552507, 475252, 534882, 769259, 847547, 907676, 879205, 914264, 670370, 566622, 751329, 527188, 872695, 533178, 765002, 711308, 701353, 897601, 895528, 847218, 588390]
14696E88390J87847j57986K55578k95619L8321q6494j15982J22621N01723j91555
14686H46844j79521l7431J33612k90849P81418m46937L00938m87020j90037M18672
14676H49689k42580K59606p1783J42996D29421M57491m30952J53994O4504J33693
14666H08151R0878N2914q2788O8280m26898L07563J90670j79128P7362q8789j18981
14655F99234k4368K54670J19219l37063J96241J60924o5926k85813J27528l13098
14645E31548N08898K18576l54973O7718j52930K8879j01608M90846k43591j04181
14635H89182K48311j66262K15249n22572K56693K41184k38269J08411l4585K10700
14625A208042O704k6700l55153L01972j20885J67348l01839K19766J34404l93757
$$ y = [588390, 776237, 618251, 873829, 578210, 616531, 530037, 414055, 536676, 1038399, 846844, 667323, 629892, 763504, 472655, 1254073, 807136, 1108074, 621054, 431017, 849689, 607109, 866715, 794932, 937928, 429421, 886912, 455960, 609954, 674458, 808151, 899029, 951943, 869155, 937435, 510537, 818100, 1008770, 829642, 907004, 818215, 699234, 674866, 929536, 1048755, 711692, 907933, 1068857, 1002931, 717118, 844646, 531548, 1040446, 1259022, 904049, 971767, 818837, 847716, 746108, 1236954, 993363, 889182, 1137493, 971231, 1186480, 663908, 920601, 1161785, 923516, 1031927, 997342, 1208042, 1214746, 1188046, 832893, 1134865, 1013980, 1181328, 879489, 1099255, 1233659, 839902]
14615H39902K70072J80975J1453o5371J74390n9015k8964m642k19623J16088r8812
14604A116453J79704j57177M7148O3966N68451o32359L60219j87765m55656M53840
14594A356824N5034K1605N5243O1861R182k74709n9231J70420j33197L05158K08525
14583A776715r7017l91800N93760J72550m75503J52523l2573N6514J21076j79162
14573A697083L37513j02443k14680M21652n31550J82750k19125p1730L74269j1646
14563A862093K78895j65626o295K15K55853j07972M42451m250K37258j41815l0518
14552B620289P46474K79632P23070J606282N104817J0334128J3297181K847883
14544C7559756A8501701H542834k954101k424832j234449Q3707l40752R805k8946
$$ y = [839902, 1109974, 1290949, 1302402, 1237031, 1411421, 1352406, 1323442, 1318800, 1099177, 1215265, 1116453, 1296157, 1138980, 1186128, 1250094, 1818545, 1186186, 1546405, 1358640, 902984, 1356824, 1411858, 1433463, 1488706, 1550567, 1559749, 1285040, 1225809, 1396229, 1263032, 1568190, 1776715, 1679698, 1287898, 1881658, 2054208, 1578705, 1731228, 1698655, 1755169, 1876245, 1697083, 2034596, 1932153, 1717473, 2139125, 1607575, 1790325, 1571200, 1499470, 1873739, 1862093, 2140988, 1975362, 1969067, 1969282, 2225135, 2117163, 2559614, 2555364, 2792622, 2650807, 2620289, 3366763, 3646395, 4369465, 5975747, 11080564, 21414692, 34711873, 37559756, 18501701, 8542834, 5588733, 3163901, 1929452, 2013159, 1672407, 1682212, 1653266]
14535A653266k33821L38675k336l9039J84034k87080J84812j71564J68639n0226
14525A745360N52873m74545M21594m96931K31962j53082M61953j89122j45821
14516A954241Q5879P0832K20737n1842L5011l75677K72741k6036Q7623j14224
14506B159285L56064k62429L63625l75044M37164k16095l1312j12863J13283J26901
14496B558579p0317J89942J24941l9374L148O0069j9622j99898M12032o5758q9104
14485B864638l5115p8053j43538L5429O36768k49883L46867j9190m38605M75223
14475C394541j48322j45854K15666k15247K13101j433K09221N6643O8190n7454
14465C589052m4820L63420L88190n06834l4999J69427K3727q9832J50985J19430
$$ y = [1653266, 1419445, 1758120, 1755784, 1716745, 1900779, 1613699, 1798511, 1626947, 1795586, 1745360, 2298233, 1823688, 2245282, 1748351, 1980313, 1827231, 2289184, 2100062, 1954241, 2040120, 2110952, 2331689, 2279847, 2314858, 1939181, 2211922, 2185886, 2273509, 2159285, 2515349, 2252920, 2616545, 2241501, 2678665, 2462570, 2431258, 2318395, 2431678, 2558579, 2488262, 2678204, 2803145, 2763771, 2766919, 2826988, 2807366, 2607468, 3019500, 2953742, 2864638, 2829523, 2751470, 2607932, 2643361, 3280129, 3030246, 3377113, 3357923, 2919318, 3394541, 3246219, 3100365, 3316031, 3100784, 3313885, 3312452, 3521673, 3578316, 3646506, 3589052, 3544232, 3907652, 4295842, 3789008, 3754009, 3923436, 3947163, 3857331, 4008316, 4127746]
14455D127746K73740l10576J72000J31085j90629K77392l1821K9666J1585M0512
14445D530700J96580K285k01680M19877k96731L46232J38390n0512M4205r8796
14435E030550j25389K18916Q7310M0478N32913m5114o7337J95037p7189J141K18047
14424F009363J65299M903K44265l87873K81514j9030L30505J3062K69119J1777
14414F922904Q7258K48175K28926l98973J77767J14393J52500K94432r7498K31668
14404G961552N5380L75338j1015L1394J31799M42780j71350J93674M24550k59379
14394I174723N5953N2388K89213J62414K35769M27337k01110M11396J48751J95558
14384A0952392K91496N48666m00195J19206L42102L22260L07526K01335K81137
$$ y = [4127746, 4401486, 4090910, 4262910, 4393995, 4203366, 4480758, 4448937, 4478603, 4490188, 4530700, 4727280, 4729565, 4527885, 4947762, 4651031, 4997263, 5135653, 5085141, 5129346, 5030550, 4905161, 5124077, 5211387, 5251865, 5784778, 5739664, 5672327, 5867364, 5790175, 5791316, 6009363, 6174662, 6179565, 6423830, 6035957, 6317471, 6298441, 6628946, 6642008, 6911127, 6922904, 7010162, 7258337, 7487263, 7088290, 7266057, 7380450, 7532950, 7827382, 7729884, 7961552, 8016932, 8392270, 8381255, 8412649, 8544448, 8987228, 8815878, 9009552, 9434102, 9174723, 9230676, 9283064, 9572277, 9734691, 9970460, 10397797, 10196687, 10608083, 10756834, 10952392, 11243888, 11792554, 11392359, 11511565, 11853667, 12175927, 12483453, 12684788, 12965925]
14375A2965925K05779J90548L20009L87203R9337l403Q43950N16841l41917M04927
14365A5589199M52747R9523M22923K31683O45482M04645J34437Q46984J50887
14356A8978510N27516N40938P57573L68269M57755M55309N57251Q23464K26067
14347B3692652M64676M35057R27010N00701O02107P68194R28757N49203J189446
14338C0057803P57289N73590J043597J108217J039724P92848J082325J196604
14330C7651997J232318J289035P40072J645420J746037J217212J710882J716151
14322D8949124J781019J782217J856738K048997J990842K003416K631421K295152
14314F5338926K355096L091885K900966L307125L185359L159824L821403L890922
$$ y = [12965925, 13171704, 13362252, 13682261, 14069464, 14168801, 14165398, 15009348, 15526189, 15184272, 15589199, 16041946, 16141469, 16564392, 16796075, 17441557, 17846202, 17980639, 18827623, 18978510, 19506026, 20046964, 20804537, 21172806, 21630561, 22085870, 22643121, 23466585, 23692652, 24157328, 24592385, 25519395, 26020096, 26622203, 27390397, 28319154, 28868357, 30057803, 30815092, 31388682, 32432279, 33540496, 34580220, 35373068, 36455393, 37651997, 38884315, 40173350, 40913422, 42558842, 44304879, 45522091, 47232973, 48949124, 50730143, 52512360, 54369098, 56418095, 58408937, 60412353, 63043774, 65338926, 67694022, 70785907, 73686873, 76993998, 80179357, 83339181, 87160584, 91051506]
14306I1051506M327615M395660M593134M919049N498548N687267N743163O725882
14298A32941824P313139O942102Q122087P927200R254572Q831338J0158699J0618984
14290B02109945J1146364J1929963J2353497J3438432J3810660J4715552J4892418
14283B94396831J5447954J6128919J6081707J5825404J6187684J5450302J4859950
14276D04378751J3674639J2113980J0310495O919832J624960k320647j475770
14269D45226240j045787j614623k568348p838318j1696317j3164778j4116467
14262C93181602j5093368j4577840j5584057j6050893j6050348j5743600j5155973
14255B84925523j4941786j3919754j3197164j2541696j2228341j1714912j1061930
$$ y = [91051506, 95379121, 99774781, 104367915, 109286964, 114785512, 120472779, 126215942, 132941824, 140254963, 147197065, 155319152, 163246352, 172500924, 181332262, 191490961, 202109945, 213256309, 225186272, 237539769, 250978201, 264788861, 279504413, 294396831, 309844785, 325973704, 342055411, 357880815, 374068499, 389518801, 404378751, 418053390, 430167370, 440477865, 447397697, 449022657, 446702010, 445226240, 444180453, 442565830, 439997482, 432159164, 420462847, 407298069, 393181602, 378088234, 363510394, 347926337, 331875444, 315825096, 300081496, 284925523, 269983737, 256063983, 242866819, 230325123, 218096782, 206381870, 195319940]
14248A95319940j0486188r432979q870589q631454p565767p492643p285272o847720
14240A28707328n700211n877181n236601n260047m710586m738648m442144l676637
14232H9065273l817107l145541l605496l112416l215241k907981k662514k827308
14224F3771669k047443k123026k431712k177524j427507j795321k242815j720923
14216D7805398j442832j395533j121151j222828j455557j731583j086180j232236
14208C7117498q45998p11618r52072j041456j135593j324199n87306k52289r84870
14199B9282097q95019o66643j218167m10306o68829n96855m67241q39743m04619
14190B3114675o34325o35132n02594o78032l68332k79119n41987m08424m76840
$$ y = [195319940, 184833752, 175400773, 166530184, 157898730, 150332963, 142840320, 135555048, 128707328, 123007117, 117129936, 111893335, 106633288, 101922702, 97184054, 92741910, 89065273, 85248166, 82102625, 78497129, 75384713, 72169472, 69261491, 66598977, 63771669, 61724226, 59601200, 57169488, 54991964, 53564457, 51769136, 49526321, 47805398, 46362566, 44967033, 43845882, 42623054, 41167497, 39435914, 38349734, 37117498, 36271500, 35559882, 34607810, 33566354, 32430761, 31106562, 30519256, 30266967, 29282097, 28387078, 27720435, 26502268, 26091962, 25423133, 24826278, 24359037, 23519294, 23114675, 22480350, 21845218, 21342624, 20664592, 20296260, 20017141, 19475154, 19066730, 18589890]
14181A8589890l07251q45257k98948K12653o74308j13417n92193l65593N7327
14172A5662903n07672k18644o09822J1124m12370J23781n72106j70462o08621
14163A2698111l660l09652l93958L44055n12241M6173l57939j92423k03248n4935
14153A1060283k50459k80939m65045j18118n1762L64353p10507j65319J49761
14144I532248j94707m21951K5139j55484l98941O1544O2445j41721k02084j47939
14134H018549l0166K123j74082l5612j30317k46279j72753j36475J2606J70940
14124G278534n32499J14306k61277k8241k1337J33484m24335k8612p6677N2220
14114F205566l10828P9540Q6663k96671j46178J79826j20203R3681k67767j96232
$$ y = [18589890, 18282639, 17437382, 17138434, 17351087, 16676779, 16563362, 15971169, 15605576, 15662903, 15155231, 14936587, 14326765, 14337889, 13925519, 14049300, 13477194, 13306732, 12698111, 12694451, 12384799, 11990841, 12334896, 11822655, 11868828, 11510889, 11318466, 11115218, 11060283, 10809824, 10528885, 10063840, 9945722, 9893960, 10258313, 9547806, 9382487, 9532248, 9337541, 8915590, 8940729, 8785245, 8386304, 8447848, 8510293, 8368572, 8166488, 8018549, 7988383, 7990506, 7816424, 7780812, 7650495, 7404216, 7231463, 7094988, 7107594, 7278534, 6746035, 6860341, 6599064, 6570823, 6549486, 6682970, 6258635, 6230023, 6153346, 6205566, 5894738, 5974278, 6060941, 5764270, 5618092, 5797918, 5677715, 5771396, 5503629, 5307397]
14104E307397j39447K9134J73522k47619l25936L86859l94434M61548m00009k41783
14094D609232L6935R8698J22810Q2410l18234k05460q8569J05437m47231K79222
14084D275250J11599j71917k32129J51864j15384P0571m27648K3643M54774k67265
14074C873358l61170L43090j03236p8205Q0436o1349k56502K07464m81747N27066
14064C689205j88200N9843k26893N8034K6087j3727k65888L86030k16583n68740
14054B739168K18259J29316J8804M900l00198K21506l30626K00659J70353l81316
14044B690825J56832Q7387k94324O0291r7424J69037l84004K80809L15945l99713
14034B585661k4015K5538R6027k98715J16125Q4994m03551J63813J26333J09223
$$ y = [5307397, 5167950, 5197084, 5370606, 5122987, 4797051, 5183910, 4789476, 5251024, 4851015, 4609232, 4646167, 4744865, 4867675, 4950085, 4631851, 4426391, 4337822, 4443259, 3996028, 4275250, 4386849, 4214932, 3982803, 4134667, 4019283, 4089854, 3662206, 3685849, 4140623, 3873358, 3512188, 3855278, 3752042, 3673837, 3754273, 3692924, 3436422, 3643886, 3162139, 3689205, 3501005, 3560848, 3333955, 3391989, 3418076, 3404349, 3138461, 3524491, 3307908, 2739168, 2957427, 3086743, 3105547, 3110447, 2810249, 3031755, 2701129, 2901788, 3072141, 2690825, 2847657, 2935044, 2640720, 2701011, 2603587, 2772624, 2388620, 2669429, 2985374, 2585661, 2561646, 2587184, 2683211, 2384496, 2500621, 2585615, 2182064, 2345877, 2472210, 2581433]
14024B581433k69581P8066L805j25210K34002j69553k19945J3265Q3395k20359
14014A989318k03437L33429j80113K89490m6180j12943r4464j05843k65107K82301
14004A886451j51307O5802j87135q2831L67721l280M2999l86459L96260k99185
13994A649036J1361P6199m59943N42631M38423O31494L178191R733221J5034923
13985C0835536Q648532j6134636A0903893m720206j975204k90438n09723o6222
13977C342100l06339m80854J4004N999j98513k86528L90493m52455k57581J22035
13967A892361k14150K6602L43246k15408p0562J04651k38712J35706J86946o09989
13957A340691L29305J57188p4497k682p0297j35505L2897M4316m3978J74336k45956
$$ y = [2581433, 2311852, 2389918, 2393723, 2268513, 2502515, 2332962, 2113017, 2126282, 2209677, 1989318, 1785881, 2119310, 1939197, 2228687, 2182507, 2069564, 1975100, 1869257, 1604150, 1886451, 1735144, 1800946, 1613811, 1530980, 1898701, 1895421, 1938420, 1551961, 1948221, 1649036, 1660397, 1736596, 1276653, 1819284, 2257707, 2889201, 6067392, 15800613, 30835536, 39484068, 23349432, 10903893, 6183687, 4208483, 3918045, 3408322, 3342100, 3035761, 2554907, 2568911, 2574910, 2376397, 2089869, 2480362, 2027907, 1770326, 1892361, 1678211, 1704813, 2048059, 1832651, 1762089, 1866740, 1628028, 1763734, 1950680, 1340691, 1669996, 1827184, 1752687, 1750005, 1679708, 1544203, 1577100, 1621416, 1577438, 1751774, 1505818]
13946A505818J10598K30046m08268j06285J55944k9438J54293j00039j77595k2164
13936A312910Q4052P5574r0534j15451J31522L6498J16688k89029N1083J5462
13926A328775k19217J83242L0366N7795m20633K59565R5075n6054j30609K66305
13916A394610j45082J96170q3554j46153k64905N60122r2635m78001L02656m5971
13906A197257J72426N7112m68310N7932J54590k58389p1769J30288o6150J25691
13896A030678J03893k17535K98328m01179L15760m6532m0070J77754j49941Q8878
13886A160034K03275k5353j66705j48942j75822L12761E14566O42683k45675j91363
13876G20211K80069j25389q3519L20617k48513O6948k76189L29014J21680l40669
$$ y = [1505818, 1616416, 1846462, 1438194, 1331909, 1487853, 1458415, 1612708, 1512669, 1335074, 1312910, 1396962, 1472536, 1382002, 1266551, 1398073, 1434571, 1551259, 1262230, 1313313, 1328775, 1109558, 1292800, 1323166, 1380961, 960328, 1219893, 1314968, 1258914, 1128305, 1394610, 1249528, 1445698, 1362144, 1215991, 951086, 1511208, 1418573, 940572, 1243228, 1197257, 1369683, 1426795, 958485, 1016417, 1171007, 912618, 840849, 971137, 904987, 1030678, 1134571, 917036, 1215364, 814185, 1129945, 1083413, 1043343, 1221097, 1071156, 1160034, 1363309, 1337956, 1171251, 1022309, 846487, 1159248, 514566, 1157249, 911574, 720211, 1000280, 874891, 791372, 1111989, 863476, 930424, 654235, 983249, 1104929, 764260]
13866G64260J13767M6826k67623L80514o2885k72970L43113l64396J92204J93981
13856A066791P0509j48127l13425l9319M03195j15021L53344m92363k59695M44176
13846I70065l57779J49504L3599J34069j00199l09104K04213k55353L6425N44848
13836A050288l89111J33817j92587L39310l4296j57749j32607J54532o9239j35363
13826E66995Q876J90819m0739J06043k15298Q1633j19255J90614M9609L0008k79978
13815E69327L86007l05425k0267k9717M00320m27562J69143J7167j49754B91012
13804F33514L76702C64131J79555L7521O5940B33272O02996k66080J17346L0608
13794G18142j10775J09530J71882j64989K3065l23699K13287j2811L3490L03115
$$ y = [764260, 878027, 924853, 657230, 1037744, 974859, 701889, 1045002, 680606, 872810, 1066791, 1137300, 989173, 675748, 636429, 1039624, 924603, 1277947, 785584, 525889, 970065, 612286, 761790, 795389, 929458, 829259, 520155, 724368, 469015, 505440, 1050288, 661177, 794994, 602407, 941717, 907421, 749672, 617065, 771597, 702358, 566995, 575871, 766690, 725951, 831994, 616696, 698329, 579074, 769688, 819297, 849305, 569327, 955334, 649909, 629642, 599925, 1000245, 572683, 741826, 758993, 609239, 291012, 633514, 1010216, 364131, 543686, 581207, 647147, 233272, 836268, 570188, 687534, 718142, 607367, 716897, 888779, 723790, 746855, 423156, 636443, 623632, 657122, 960237]
13784I60237l0258m28764J01929M1068j51407K28677C21042L44293N687j17515
13774E53507L93567k73669m0793k54619l240N74787l30950j96470J82497N8322
13764F62939O4794j48829L0472j46162O7601j24589M62661C37700M27691C80934
13753F99244K23406k76042j11230j58486M59844k98654p0153m2446o7462K28117
13743E86138k05408K41456O37o0248Q4007l20401K69914J2401j14002J28483j80268
13732D42709M7262l1272B17219O6065M8774Q4508N04065B30055M13337j39105
13722E04287j46900j30122M22404j54360A47877L93494m8769J37956j95576p3624
13712C61358n4371K47144n2093P7601j89103R0880M4167A96207L87791k43001
$$ y = [960237, 929979, 501215, 603144, 644212, 492805, 721482, 321042, 665335, 671022, 553507, 947074, 673405, 632612, 377993, 374753, 949540, 618590, 422120, 604617, 662939, 727733, 578904, 609376, 463214, 530815, 406226, 868887, 337700, 765391, 380934, 699244, 922650, 646608, 535378, 376892, 836736, 538082, 467929, 425483, 358021, 586138, 380730, 622186, 622823, 562575, 646582, 326181, 596095, 608496, 494494, 622977, 442709, 489971, 458699, 217219, 283284, 332058, 416566, 920631, 230055, 643392, 504287, 357387, 227265, 649669, 495309, 147877, 541371, 492602, 630558, 434982, 361358, 306987, 554131, 502038, 579639, 390536, 481416, 525583, 196207, 583998, 340997]
13702C40997J80151A35698J53031j2109K77373A59063n9403J86687L13093j37441
13692D61999o6709A84616K50692K72879C41979n8100K7642J54659J99835J19246
13682G85261C50230R58j62353J33923J09272j8707j60071J09753K77597k46385
13672C94217j25040M02612A18593O47162l62362j71657M61254B16926J21437j12018
13662B26345L6619O4252l092K74948p0239j74018K73763B93639j7400O2814j41072
13651A97981L57609k77652M1862J83899j41782m3594J67261k07729j01862L27499
13641E03492K43518l52756j81412J05581M8902J8216r1309A35926l1169K44142
13631C48899A9685J72866m502M03133B14127K63873m3908a479E42016B42640o4100
$$ y = [340997, 521148, 135698, 288729, 276620, 553993, 159063, 99660, 286347, 599440, 461999, 395290, 184616, 435308, 708187, 341979, 283879, 311521, 466180, 666015, 785261, 350230, 351188, 188835, 322758, 432030, 413323, 253252, 363005, 640602, 394217, 269177, 671789, 118593, 765755, 403393, 231736, 692990, 216926, 338363, 226345, 262964, 327216, 324124, 599072, 528833, 354815, 628578, 293639, 276239, 339053, 197981, 555590, 277938, 319800, 503699, 361917, 318323, 485584, 277855, 175993, 503492, 747010, 394254, 212842, 318423, 367325, 385541, 294232, 135926, 104757, 348899, 19685, 192551, 188049, 591182, 214127, 478000, 434092, -1479, 542016, 242640, 178540]
13620A78540K10665A20926j5878J38136J83404r5093M6633P3073j03111j34883
13610B13207J21498j42362f9064F02657b5202C11571O9294A78881C5229N81606
13600F16835A95986o952J0849e3192C86688j57995K18182j44364A32138M48368
13590E80506k57968l4075o5980o3222J11337K47799B58632P5143j56383L6465
13580B13857K47654B08120k182J82062A83400m5215K55561M02p8083j05823J11301
13569C21543K40534j0938k40195C1424P514K00842J19842j19518j12762d327B53335
13557A1889N19055A17958J81917A00589L93379r2443K0239r5436A13834J91764
13547C05598K78314k55511j7691J43932E2294J51854l4789K29413F3143J40837
$$ y = [178540, 389205, 120926, 105048, 243184, 426588, 331495, 378128, 451201, 348090, 213207, 334705, 192343, -69064, 602657, -25202, 311571, 380865, 178881, 35229, 616835, 195986, 189034, 199883, -53192, 386688, 228693, 446875, 302511, 132138, 580506, 322538, 288463, 222483, 159261, 270598, 518397, 258632, 333775, 177392, 213857, 461511, 208120, 205938, 388000, 183400, 138185, 393746, 394148, 316065, 210242, 321543, 562077, 551139, 310944, 31424, 38938, 239780, 359622, 240104, 127342, -4327, 253335, 11889, 530944, 117958, 299875, 100589, 493968, 401525, 421764, 326328, 113834, 305598, 583912, 328401, 310710, 454642, 52294, 204148, 169359, 398772, 63143, 203980]
13537B03980J09310m1065l9450k6837J8453k3072J56022n2066J56570o4904j66828
13526B30113R5879R3193E6196L74839A52288K48332k0221d1297F15953k06159
13516D09794q5242A27251n6581g9238B11651j05787L41670J93125A33622J46429
13506B80051j9009j23563L58349j68965j56801J91901b644D44404j19883q7773
13496B36748a2302B75945k5682d3807A75591A6541J82660h7310A89397K37053
13486D26450j20831B5786J33272K63662c8167B3518f9505C33971H2135C2012J14242
13475A46254M14129N4851A04757K69333A15872M860a8837A32754g7468C09141
13464a1259B02078d3829l5600D3845N1961M43744b52870C47264j07811L7119a21576
$$ y = [203980, 313290, 272225, 232775, 205938, 224391, 201319, 357341, 305275, 461845, 396941, 230113, 325992, 419185, 56196, 431035, 152288, 400620, 380399, -41297, 615953, 409794, 324552, 127251, 70670, -79238, 211651, 105864, 447534, 640659, 133622, 280051, 261042, 137479, 495828, 326863, 170062, 361963, -2644, 444404, 324521, 236748, -12302, 275945, 250263, -43807, 175591, 16541, 199201, -87310, 189397, 426450, 305619, 25786, 159058, 422720, -38167, 23518, -69505, 333971, 82135, 32012, 146254, 560383, 615234, 104757, 374090, 115872, 120732, -18837, 132754, -77468, 309141, -11259, 202078, -43829, -79429, 43845, 95806, 539550, -252870, 347264, 239453, 276572, -121576]
13452A3958R0326f4534A13359D9478K38800I1554K34364j13771m7825K56874G1784
13440F0182L54181D3344L51730G2062M0852L44366b71648B36634J15607L8205
13430C90446A35195o028E2384O0392j4350J32482J92759A59001e4072D29731G3937
13418A2038O3126K7490L12426a6234G10582A51926o6786K90722A53483c6847C90541
13406A70503H1730L5659P2426H8681J0168J14707j1919P5772o2136J17965j38369
13395A94869K7771a06439d691A67831p238F8581L57399A18905J70202d242C7093
13383H1966b4177j06609D66241A40369A680a25935A27778E1343O3122K07676A54129
13371C07080d6369A82823c5946J7904G236J36216D6596K38104M17612A91439K85486
$$ y = [13958, 104284, -64534, 113359, 49478, 288278, 91554, 325918, 212147, 164322, 421196, 71784, 60182, 414363, 43344, 395074, 72062, 112914, 457280, -271648, 236634, 352241, 390446, 135195, 129167, 52384, 112776, 98426, 230908, 423667, 159001, -54072, 429731, 73937, 12038, 75164, 102654, 415080, -16234, 710582, 151926, 85140, 375862, 153483, -36847, 390541, 170503, 81730, 117389, 189815, 88681, 98849, 213556, 201637, 277409, 215273, 333238, 194869, 222640, -106439, -4691, 167831, 160593, 68581, 425980, 118905, 289107, -4242, 37093, 81966, -24177, -130786, 466241, 140369, 1680, -125935, 127778, 51343, 114465, 322141, 154129, 307080, -46369, 182823, -35946, -18042, 7236, 143452, 46596, 284700, 702312, 191439, 476925]
13360D76925j70984K34182A83777F6204B8326M79424k07603E1123d451B45397
13349C36875k6101F6051g900I6765a8713m2928A96897J30404G0693J23005J03470
13338B97168B1023J78105d1002A67645j9098n8811a391D5014a00860A85052h8338
13326d4248B96152R5629D6426R6856R8282J34723A05788K00151l283A8736K07415
13315B26151i6744p2278A07803O2304J5170a15107I9808l9680K44831j8205p4799
13304B11955J73013i4530E6306K321G566J86529a42513A23093Q728h1253F5706
13292h2237A71016a26801C16419A53517C6082Q8698E1231b5305r95l3309B31457
13280C45737Q1555A42871n8212H637J45280B8068J5494j9928R274B885M74525
$$ y = [476925, 305941, 540123, 183777, 66204, 28326, 507750, 300147, 51123, -4451, 245397, 336875, 310774, 66051, -7900, 96765, -18713, -61641, 196897, 327301, 70693, 193698, 297168, 21023, 199128, -41002, 167645, 148547, 89736, -1391, 45014, -100860, 185052, -88338, -44248, 296152, 391781, 46426, 143282, 241564, 376287, 105788, 305939, 302656, 18736, 226151, -96744, -169022, 107803, 170107, 185277, -115107, 99808, 60128, 304959, 286754, 211955, 384968, -94530, 56306, 58627, 7566, 194095, -142513, 123093, 131821, -81253, 65706, -82237, 171016, -126801, 316419, 153517, 36082, 124780, 51231, -25305, -26300, -59609, 231457, 345737, 427292, 142871, 84659, 8637, 153917, 28068, 43562, 23634, 32908, 2885, 477410]
13269D77410k05798D1827c68643e7560A56263J27841c5968I7913J31403Q0669
13259C09985r247B6463J0349d6536A88658a43010l07717B89120a41905C2655K85156
13248C17811A5408c4967C37663G6675j6086P4827C6270P2199g3080A57305a13452
13236f0088A66768A4611a90798j27185a23563B71975J07436G0433e2529H4104
13225h3102E40136G83K8498J95171A00294b00565C5834p949K6435J9678P7602
13214A51600G1861h981B22933r8737K7120b1983A17499L57436H1242a01656C33148
13202C48999A45727h5670c2393B82089O9454e0184A91045J14978I1909a55562
13191B14837C3731J43191d1900A93170p3938b08047A56829F026K13306E7656d0156
$$ y = [477410, 271612, 41827, -368643, -57560, 156263, 284104, -35968, 97913, 229316, 309985, 300738, 26463, 36812, -46536, 188658, -143010, -450727, 289120, -141905, 32655, 317811, 15408, -34967, 337663, 76675, 60589, 135416, 36270, 108469, -73080, 157305, -113452, -60088, 166768, 14611, -190798, -317983, -123563, 271975, 379411, 70433, -52529, 84104, -83102, 540136, 783, 29281, 224452, 100294, -200565, 35834, 27885, 54320, 73998, 151600, 71861, -8981, 222933, 124196, 151316, -21983, 117499, 474935, 81242, -101656, 333148, 348999, 145727, -85670, -32393, 282089, 351543, -50184, 191045, 306023, 91909, -155562, 214837, 33731, 176922, -41900, 193170, 119232, -208047, 156829, 6026, 219332, 57656, -40156]
13179b4889m1237p8155b2528C1308R6045R3119a17371H5811a0047A42220a09800
13167C02789D3217L5595J70907J2001h4171A57769n8068P5664Q8979I1938B3536
13155A42214J76336b4220B80313d61013H2735J43637E9569n20a45023l5971A843
13143e6381B23708E1592Q2539P2983E3076K66403J02308A19255N8352A9198J08527
13132A27725B1723K16183H191M2515J00270P613B7646K09888o2969a10569E8501
13120A16124I044e8795A53106P9795a51268H7555O7063a45918p5359a9318a370
13108a00351B014a3216A29758a68457B68165E5027D48L04618A44344a24286B8944
13096e4058k7057E1092a2050k22590M6531B66818p4387j4371F7990g3881E8305
$$ y = [-24889, -66126, -144281, -22528, 31308, 127353, 220472, -117371, 85811, -10047, 142220, -109800, 302789, 43217, 78812, 249719, 261720, -84171, 157769, 99701, 175365, 264344, 91938, 23536, 142214, 318550, -24220, 280313, -461013, 82735, 226372, 59569, 59049, -145023, -180994, 1843, -56381, 223708, 51592, 134131, 207114, 53076, 319479, 421787, 119255, 177607, 19198, 127725, 21723, 237906, 8191, 50706, 150976, 158589, 27646, 237534, 174565, -110569, 58501, 116124, 9044, -58795, 153106, 232901, -151268, 87555, 154618, -145918, -221277, -19318, -1370, -100351, 2014, -13216, 129758, -168457, 268165, 55027, 448, 305066, 144344, -124286, 28944, -54058, -81115, 51092, -12050, -234640, -188109, 266818, 192431, 178060, 67990, -73881, 58305]
13084F0605j2527K33108o4714K29987a7401n0547A33398d009A18994M6387a63044
13072B10111H6985a64360A46574R7322e9397A62229o3623c10920A90428A3102
13061e6669H1116b1131l33583B82386F3417Q5232C0578a59083E711a78180A56115
13049d9707G1726f048j20335A22975K77176a57692b4976B7304a01668H7319J9875
13038A07194J92309Q7075H7091K96237K5557a86826A40180K00065a73320e5752
13027A73254N8658e7988A45315K67156c5843B84039b2262A66753b18082B28223
13016B11710k8610D1621i2891B08093Q8947j37934a16303C19832D8328a10597
13005i7059q8865F5005i2024A38734a25020M0506K7737A2706b81324E02857f6899
$$ y = [60605, 48078, 281186, 216472, 446459, -17401, -67948, 133398, -4009, 118994, 165381, -163044, 210111, 86985, -164360, 146574, 243896, -59397, 162229, 98606, -310920, 190428, 13102, -56669, 81116, -21131, -354714, 282386, 63417, 148649, 30578, -159083, 5711, -178180, 156115, -49707, 71726, -6048, -126383, 122975, 400151, -157692, -24976, 27304, -101668, 87319, 107194, 299503, 386578, 87091, 383328, 408885, -186826, 140180, 340245, -173320, -55752, 173254, 231912, -57988, 145315, 412471, -35843, 284039, -22262, 166753, -218082, 228223, 211710, 183100, 41621, -92891, 208093, 297040, 159106, -116303, 319832, 48328, -110597, -97059, -185924, 65005, -92024, 138734, -125020, -84514, -56777, 12706, -281324, 502857, -66899]
12993a27069B48319D2518K01913J86484D1394R92K02759a06669D6756J56642i3291
12981D2952a45634d8207A75454o0885a96237K5679B1044f0141A44483D3043K88099
12970C31142c33976a61312j09144E3890k6684J06917g3433A18063a5295D87874
12959I3168A899Q4713P9657Q1061d5486l9596C72977I0651J16087J12498F7349
12947E1488a72957l3315l8948A72961a50837B98452f765C79657j73241i006H1411
12935i8050j47015h2937A07398j6261b12912H5638K52597a34036D45898d2631
12924a7994A10901R072b37141A45118c331A05402R5204b04767c0558A67558A3367
12912f9469A05280M855b84775B87540C0682K1828a1046k52862G3640a37718j3073
$$ y = [-127069, 248319, 42518, 244431, 430915, 41394, 42386, 245145, -106669, 46756, 203398, -93291, 42952, -145634, -48207, 175454, 114569, -196237, -170558, 21044, -60141, 144483, 43043, 331142, -333976, -161312, -270456, 53890, 27206, 134123, -73433, 118063, -15295, 487874, 93168, 1899, 86612, 166269, 247330, -45486, -85082, 372977, 90651, 206738, 319236, 67349, 51488, -172957, -206272, -245220, 172961, -150837, 298452, -6765, 379657, 206416, -9006, 81411, -98050, -245065, -82937, 107398, 91137, -212912, 85638, 338235, -134036, 445898, -42631, -17994, 110901, 119973, -237141, 145118, -3331, 105402, 200606, -204767, -30558, 167558, 13367, -69469, 105280, 110135, -284775, 287540, 30682, 52510, -11046, -263908, 73640, -137718, -150791]
12901a50791k1663A43301J9974K79094f9185o621L1266H0820J20892c19325I1136
12889G437M4300i6479r3325J3195g3541A626K22765A0543J90011p6603i2346r394
12877a01740K4529A06153J45987j23030a19079B54782a67507D94671i0882A18382
12866C77517D8725a21319D8271i2024j203L7147A01440m4352A7158Q2326d22628
12854a1615p4501H409Q6421l6532h3789A19303Q2953J10701a76921B04124f8934
12842A05458J65456A9934a3814k52504b3188j70477i2323N821m4906a0003B59461
12830c3519F4194h865C5631i3700m4622o529G7376a20870b7399A01154a34460
12818a8663F4615L8533f1514H5967K66990a36875L575C6985i0509k26773H1941
$$ y = [-150791, -172454, 143301, 163275, 442369, -69185, -75806, -44540, 80820, 201712, -319325, 91136, 7437, 51737, -96479, -189804, -176609, -73541, 1626, 224391, 10543, 200554, 123951, -92346, -101740, -77211, 106153, 252140, 129110, -119079, 254782, -167507, 494671, -90882, 118382, 377517, 48725, -121319, 48271, -92024, -93227, -56080, 101440, 57088, 17158, 99484, -422628, -11615, -86116, 8409, 94830, 58298, -83789, 119303, 202256, 312957, -176921, 204124, -68934, 105458, 270914, 19934, -13814, -266318, -23188, -193665, -92323, -86502, -131408, -10003, 259461, -33519, 64194, -8865, 35631, -93700, -138322, -144851, 77376, -120870, -27399, 101154, -134460, -18663, 64615, 103148, -61514, 85967, 352957, -136875, -133300, 36985, -90509, -317282, 81941]
12806a1918A51686a31728e9155A04529f021A37538e239B1227f2676A53584b32411
12794a60519B09457B0742J16165a44136o702O3301A56536G8192g3212I1120K2273
12783A13393l5623K14255a23456A78672L6861H4048J23298i4898G3148l3899g8395
12771A7167Q9246c56244J65404d7201j2975B370a44701j24989A84615Q1343a14422
12759a60834A49772M1717b44892j19657A97931e4076B41687J3657F609K40535
12749B47144I805J01106b03228J6900E1339O3639m9233C1412O0624a74932K9828
12738a45104j97697A88504B8259a05789g656C32961D5501a78670f0558A8906J34314
12727A53220e4837k2152j67998d5594H5236K6789b27467c9331D2823a05342B83982
$$ y = [-11918, 151686, -131728, -59155, 104529, -6021, 137538, -5239, 21227, -62676, 153584, -232411, -160519, 209457, 20742, 136907, -144136, -150838, -87537, 156536, 78192, -73212, 91120, 113393, 77770, 292025, -123456, 178672, 215533, 84048, 207346, -94898, 73148, 39249, -78395, 17167, 106413, -356244, -190840, -47201, -60176, 2370, -144701, -269690, 184615, 265958, -114422, -160834, 149772, 191489, -244892, -364549, 197931, -54076, 241687, 255344, 6609, 247144, 9805, 110911, -203228, -186328, 51339, 114978, 65745, 31412, 92036, -174932, -145104, -342801, 188504, 28259, -105789, -7656, 332961, 45501, -178670, -60558, 18906, 153220, -54837, -76989, -244987, -45594, 85236, 112025, -227467, -39331, 42823, -105342, 283982]
12715A69423e2964l5777G4926J01204l9424a1605C40200k0004j10845C9608m765
12704C4843K90232j27389M9354o3382O0911H00J51588a03020B35336c4050n9877
12693i3927j25731A68771a52787a4575j36703B32205a19051j24195A0865J76659
12683A87524b5151o984A87979a40027H9280O6013c7359p0538M4836a9792G2877
12671B05078a5801C41335G3711K3650K46405A67121d0675B83964H6281O8489a8725
12659c3228m3867B40317j11159K0788o8699J42496o9011j6308k8961j9481b45447
12647A78296F408i95j0172A53723K36l0910a58398M5896C0455a08022B365a38745
12634C58471f3307G6746e8821n9221F9403K17081a02993B7626J31933K62000j68933
$$ y = [169423, -52964, -88741, 74926, 176130, 136706, -11605, 340200, 320196, 209351, 39608, 34843, 325075, 197686, 247040, 183658, 244569, 800, 152388, -103020, 235336, -34050, -93927, -219658, 168771, -152787, -14575, -151278, 232205, -119051, -243246, 10865, 187524, -25151, -32135, 187979, -140027, 89280, 155293, -37359, -107897, -63061, -19792, 72877, 205078, -15801, 341335, 73711, 97361, 343766, 167121, -40675, 283964, 86281, 154770, -18725, -33228, -77095, 240317, 129158, 149946, 81247, 223743, 154732, 138424, 109463, 89982, -245447, 178296, 6408, -995, -11167, 153723, 153959, 123049, -158398, -112502, 30455, -108022, 2365, -138745, 358471, -63307, 76746, -58821, -118042, 69403, 286484, -102993, 27626, 159559, 421559, 252626]
12623B52626h9379N175A83740a77637n5007A462d7014C06545a59518c2009A66026
12611g24I4439J80946j32305B5630i3874o7182c3474A6375P2521J16483J08701
12600C14080A3255K82691e5454F1757c7874j93918B67419G7967L016M15165A13319
12588C35176a56573A40823d9774B32028J84088A38922m6407g9282B61129C9945
12577A9210a73093F2228b0200k2559A28475a22085j60114e5554m1571j61212B27710
12565c05645J33045J5794I2482c1417j30081b3004A03207b4939A13088d7673A79613
12553a54383N3907A02810a20301E22017k37829B3737d9482A04642b11542Q9599
12543a21943B36157j02100a74040B38481Q6577A25459h8724A58613E7788c2261
$$ y = [252626, -89379, -84204, 183740, -177637, -232644, 1462, -47014, 306545, -159518, -32009, 166026, -724, 94439, 275385, 143080, 25630, -93874, -161056, -33474, 16375, 88896, 205379, 314080, 13255, 295946, -55454, 61757, -37874, -231792, 267419, 77967, 80983, 496148, 113319, 335176, -156573, 140823, -49774, 232028, 416116, 138922, 92515, -79282, 261129, 39945, 19210, -173093, 62228, -20200, -42759, 128475, -122085, -282199, -55554, -97125, -258337, 227710, -305645, -172600, -156806, 92482, -31417, -161498, -23004, 103207, -24939, 113088, -47673, 179613, -154383, -100476, 102810, -120301, 522017, 284188, 23737, -49482, 104642, -211542, -121943, 236157, 134057, -174040, 238481, 325058, 125459, -88724, 158613, 57788, -32261]
12532I4422i3900F6554Q414M0813A2641a41303A43537E1912K06580d7465R7R391
12520c7977m1402K7581a4422B2325a35108b8288l22935G4344C698b19790B8859
12508B25269D4630b0098o3062B8706J80013a8585C3757R5093P6409r8819k6336
12497H0104C0351J43564A0575O5063e8253A16828a18047C67360E4346e0956A99338
12485a7813n7368J3606m7612C33957a71922O6336a6093j0057k30761B12711k2974
12474A89737i2236I7880J21547e2649F2831a48845E6287J23997m1825M6785a83261
12462a54920r2188c8402F8785a26860E2407A6044L0340j101B0177b15266R766
12451b05500A11277a39990C7885J03300a13931B9054d3766B6699L7687b76183
$$ y = [94422, -93900, 66554, 74968, 115781, 12641, -141303, 143537, 51912, 258492, -47465, -47368, -37977, -79379, -51798, -14422, 22325, -135108, -28288, -351223, 74344, 3698, -219790, 28859, 225269, 44630, -20098, -83160, 28706, 208719, -18585, 33757, 128850, 205259, 106440, 80104, 30351, 173915, 10575, 75638, -58253, 116828, -118047, 367360, 54346, -50956, 199338, -17813, -75181, -61575, -109187, 333957, -171922, -105586, -16093, -26150, -256911, 212711, 189737, -92236, 97880, 219427, -52649, 62831, -148845, 56287, 180284, 138459, 185244, -183261, -154920, -247108, -38402, 68785, -126860, 52407, 16044, 46384, 45283, 20177, -215266, -205500, 111277, -139990, 37885, 141185, -113931, 29054, -43766, 26699, 64386, -276183]
12440B76858a55166k4459k233o2368l742A27637D1790c17458e139D0810a54616
12428b41940e1003p1440G1829c9125k10247H5147a70623C0458P393J13506B7213
12416g1729A78350b1281r7040L3494a7394C3937f6363p3428r1074P4797n2512
12405b08580b4548D40646d42540b06040A06066L6022O0745O1104M6421g0519D7155
12393a51318A94833a35103M0874c8448C0572P7685c8801H906N3364J51582G9168
12381B00271i6787F0099j6053a00815b7116l02166C2141g2703o5304A41529a45149
12369G7439C7788i0404A58478J40969b17553d5692j12649c9106j17721q4347H7249
12357B42026a19086A94824d4371B92071j18509c5571j51306A48949a6567p6563
$$ y = [276858, -155166, -179625, -181858, -244226, -247968, 127637, 41790, -317458, -5139, 40810, -154616, -241940, -51003, -122443, 71829, -39125, -249372, 85147, -170623, 30458, 37851, 151357, 27213, -71729, 178350, -21281, -118321, -84827, -17394, 33937, -66363, -139791, -230865, -156068, -208580, -24548, 440646, -442540, -206040, 106066, 142088, 202833, 263937, 310358, -70519, 47155, -151318, 194833, -135103, -94229, -38448, 30572, 108257, -38801, 8906, 62270, 213852, 79168, 200271, -96787, 60099, 44046, -100815, -27116, -329282, 32141, -72703, -138007, 141529, -145149, 77439, 37788, -90404, 158478, 299447, -217553, -45692, -158341, -39106, -156827, -241174, 87249, 242026, -119086, 194824, -44371, 292071, 173562, -35571, -186877, 148949, -16567, -93130]
12347i3130b110p0944A42596F3524a2862B03110r8061J5760J77655q2284D4387
12335E4533a8233k11657O1500B23886c21638C4985J29540b83222h2665D7083J82573
12324B29656e0857o791C42192J49018B04409G6240l8023J87424a32647m82925
12314f15572F7631B1937c2355m5327l6914E0745O0929b41885B2639O5459H960
12302A9487K348L21975h2071B56562O0245B5519a01874A35331g8717D76153A11737
12290I5179f0554q9470N895O4719I2068L9990a09716A25056K35212b41794R0748
12279a51046c3478A17940J64203i4935A7310L73229j93881d3047A36234J66110
12269C02344G6659M1151K51025a70358E02321H5461L1670b2739A97913b37070
$$ y = [-93130, -2110, -73054, 142596, 63524, -12862, 203110, 105049, 120809, 298464, 216180, 44387, 54533, -18233, -229890, -168390, 223886, -321638, 34985, 164525, -283222, -82665, 47083, 229656, -50857, -57648, 342192, 491210, 204409, 76240, 38217, 225641, -132647, -615572, 67631, 21937, -32355, -77682, -114596, 50745, 111674, -241885, 22639, 88098, 8960, 19487, 21835, 343810, -82071, 256562, 316807, 25519, -101874, 135331, -78717, 476153, 111737, 95179, -60554, -150024, -144129, -79410, 92068, 132058, -109716, 125056, 360268, -241794, -151046, -33478, 117940, 282143, -94935, 17310, 390539, 196658, -43047, 136234, 302344, 76659, 117810, 368835, -170358, 502321, 85461, 117131, -22739, 197913, -237070]
12258G5804f492A53598B1136a93396h1446A27888i446A58181a31189B68586j27333
12247A41253o2514O8522L8517c25081a0244j12954C46738k8309a0636A56335J36452
12236B92787A27699R1570K00401G029L2535J52523L06037B21414p4678K02732
12226C49468G6020q724J07343C0353J9989J66448a72007H0473k6108K35428A02243
12214A06974B6742P5236K28517a60805C443a62085A37372R9462N8365I5152J31356
12203B26508J78998A86104P4502A0906O3582A0349J6072L04008g8456A63637J90825
12192C54462C6886J65764J60385m5723A34589L0661k0832b57537C9608A8309K00155
12181B18464G7956j3271b30964B55276n4502c7602e527C57864A13920J55089J30925
$$ y = [75804, -6492, 153598, 21136, -193396, -81446, 127888, -9446, 158181, -131189, 268586, 141253, 78739, 147261, 185778, -325081, -10244, -123198, 346738, 318429, -10636, 156335, 292787, 127699, 219269, 419670, 7029, 39564, 192087, 498124, 221414, 146736, 349468, 76020, 67296, 174639, 30353, 50342, 216790, -172007, 80473, 54365, 289793, 102243, 106974, 26742, 101978, 330495, -160805, 3443, -162085, 137372, 236834, 295199, 95152, 226508, 405506, 186104, 260606, 10906, 74488, 10349, 26421, 330429, -78456, 163637, 354462, 36886, 202650, 363035, 317312, 134589, 165250, 144418, -257537, 39608, 18309, 218464, 77956, 64685, -230964, 255276, 200774, -37602, -5527, 357864, 113920, 269009, 399934]
12170C99934A2395J8885a05537L0635A48099A1744K57242q3279j4641f3546p2480
12159a36026n3950a6144A40162a01628D04423A8241h301A01505J33992C8627N1750
12148I0377K47985A31388Q6033q11b84686c5324q9328A34125b08530B40792B1956
12136a70414B29758D6066P5818g2918j1207A29d5923j04975C0021a65073k00266
12125c65339A38337n4776i8129k66295J29717a0347E0133i9585K3456B91192f5405
12113b31491J9911B83864o5603M6526A1938a220j0789m7500B63117B7740L3849
12102F1589K03272d06281A5902Q9361k879a87787b3966A79929a3461n3573C9580
12090A81695q0464b87534b4715j43720l5965R7728L933A7501a12390B94748c76706
$$ y = [399934, 12395, 31280, -105537, -74902, 148099, 11744, 268986, 185707, 171066, -63546, -136026, -189976, -16144, 140162, -101628, 404423, 18241, -8301, 101505, 235497, 38627, 90377, 338362, 131388, 217421, 216610, -284686, -35324, -124652, 134125, -208530, 240792, 21956, -170414, 229758, 46066, 121884, -72918, -84125, 129, -45923, -150898, 30021, -165073, -365339, 138337, 83561, -98129, -364424, -234707, -10347, 50133, -99585, -76129, 291192, -65405, -231491, -211580, 283864, 218261, 264787, 11938, -1220, -12009, -59509, 263117, 27740, 61589, 264861, -406281, 15902, 105263, 102384, -187787, -23966, 179929, -13461, -67034, 39580, 181695, 101231, -287534, -24715, -168435, -204400, -106672, -102739, 17501, -112390, 294748, -376706]
12078D8882R6508m8578J64137a3543C75192j47002n8504N14856P17273K31176
12068A632991F13131A46303D4316K39904A8896a41768B28902o7471E7719L3472
12058I1191B6854J18667b35255A34867b742H2934Q4348D0747b24992Q9508G5118
12046a38468G3495P7002a18912H9691k9898d2779C17275m7553a02657k00822a17137
12034b47208a20515A85018m9097a49187D7626A8748g7300I6776K3485b66580L5382
12023b31198f4195g607j52087P8199D3527P2355J07081g8073j50257C69252b38460
12011B52566F3573K11193b37327A1448i7525j43057i5036K7982C70324A57354
12000f6339r2148B89579b24837M8507A34556k7096k0216c64457a5508B05082G7339
$$ y = [48882, 145390, 96812, 260949, -13543, 375192, 228190, 169686, 684542, 1401815, 1632991, 613131, 146303, 44316, 284220, 18896, -141768, 228902, 161431, 57719, 91191, 26854, 145521, -235255, 134867, -2742, 82934, 167282, 40747, -224992, -135484, 75118, -138468, 73495, 150497, -118912, 89691, 59793, -42779, 317275, 269722, -102657, -303479, -117137, -247208, -120515, 185018, 135921, -149187, 47626, 18748, -77300, 96776, 120261, -266580, -231198, -64195, -7607, -159694, -81495, 43527, 115882, 222963, -78073, -228330, 369252, -238460, 252566, 63573, 274766, -237327, 11448, -97525, -240582, -95036, -67054, 370324, 157354, -66339, -158487, 289579, -224837, -176330, 134556, 107460, 87244, -364457, -15508, 205082, 77339]
11988c77994C7339i7439B14807n4840i0017k33310b8751e524E0713J92615a24924
11976b52252I9381a80213B33266a3694j08300c2428l28383J69010Q6855C65745
11965a55478I1457C3684b10645J04215j39848A50828d1636j57262A01746K29970
11955C31716A39496E4016c252l2288A65502K39811A11577a95720A6633b53963
11944E055a07048A01633M5540c67306E3470O3153O2327G8456a450A41507a66150
11932b29785E5448b33530A1125b25902i0253B47147b6805F7020a00170B87519
11921D5979d8038L175j39415E445f5114l18832H9293o878b48613f481q1029B6922
11908H4252f9848n9396m7989B64623A09794O2256K21404a79478k86075D4890b2991
$$ y = [-377994, 37339, -97439, 214807, 159967, -90017, -323327, -28751, -5524, 50713, 243328, -124924, -252252, 99381, -180213, 233266, -13694, -121994, -32428, -360811, -191801, -104946, 365745, -155478, 91457, 33684, -210645, -106430, -246278, 150828, -41636, -198898, 101746, 331716, 139496, 54016, -3252, -35540, 165502, 405313, 111577, -195720, 16633, -253963, 5055, -107048, 101633, 147173, -367306, 53470, 116623, 178950, 78456, -1450, 141507, -166150, -229785, 55448, -233530, 11125, -225902, -90253, 247147, -26805, 67020, -100170, 287519, 45979, -48038, -44863, -184278, 5445, -65114, -383946, 89293, 82415, -248613, -6481, -87510, 26922, 84252, -69848, -129244, -177233, 264623, 109794, 172050, 393454, -179478, -465553, 44890, -22991]
11896B49165n8222E8093H705J27627c73417A50576A0566a76863A44908G0545a44965
11884h9591A48445K44079C6668H991a73629J0596d9311B6855c2013j2931A7452
11872b25471c5025C1355J64788m9561M0206q1241D7976c74395a10581k8137p3174
11861b11892B22066a31904A57269G1970b03171j45414F8554a39197l4826o1346
11851b35369A5995J8291a53906A18354a25111b3195p3123j42848G0608j7037k2755
11840C0816a78985B54913b83284a07774A76882a85714a287j21889o6919B2820
11829b03012A59087b42064M818G6454a49896A55559b03440A19315d8798l3316
11819h2114n3869j88227B50986a47452n5090C8561b08986a01410M5396l021n4220
$$ y = [249165, 190943, 58093, 8705, 136332, -373417, 150576, 10566, -176863, 144908, 70545, -144965, -89591, 148445, 392524, 36668, 8991, -173629, -163033, -49311, 26855, -32013, -44944, 17452, -225471, -35025, 31355, 196143, 146582, 186788, 105547, 47976, -374395, -110581, -138718, -211892, 222066, -131904, 157269, 71970, -203171, -348585, 68554, -139197, -174023, -235369, 15995, 34286, -153906, 118354, -125111, -23195, -96318, -239166, 70608, 53571, 30816, -178985, 254913, -283284, -107774, 176882, -185714, -1287, -123176, -190095, 22820, -203012, 159087, -242064, -237246, 76454, -149896, 155559, -203440, 119315, -48798, -82114, -135983, -324210, 250986, -147452, -202542, 38561, -208986, -101410, -56014, -59035, -113255]
11808a13255c5710A94701a61505O5701F7561L00006a52151A3447J08442g2817
11797e3411B6832a25515A34087a19161D595L04197p3677K019a4739D7924e44356
11785A77386J72474h2224A6558M1218a28565q955C12036H9646c31893a36133q2192
11774b18325c2547A84864m1759c0407m2276B8009K8446R9347K63731D2850b38620
11762B05994b0497B44416o5147o8986A3045c02368J08172L9107B12606b56298
11751e6886B9952K7871a17372k61954E5156J35895J95569a49999c2894A26167
11740i4279C7221K88721F4252a19477H9067b40352M0513R7633b6809C78594j33804
11729B44790b6381Q324B8424b3583k84522e7285j63934C33167c2247E8162a06004
$$ y = [-113255, -35710, 194701, -161505, -95804, 67561, 367567, -152151, 13447, 121889, -72817, -53411, 26832, -125515, 134087, -119161, 4595, 308792, 235115, 237134, -14739, 47924, -544356, 177386, 349860, -82224, 16558, 57776, -128565, -137520, 312036, 89646, -331893, -136133, -218325, -32547, 184864, 143105, -30407, -72683, 28009, 56455, 155802, 419533, 42850, -238620, 205994, -20497, 244416, 179269, 110283, 13045, -302368, -194196, -155089, 212606, -256298, -56886, 29952, 57823, -117372, -379326, 55156, 191051, 386620, -149999, -32894, 126167, -94279, 37221, 325942, 64252, -119477, 89067, -240352, -199839, -102206, -26809, 378594, 244790, -26381, -18057, 28424, -23583, -308105, -57285, -221219, 333167, -32247, 58162, -106004]
11717C0978r825a39950M4162L8203b821k78455c225A19535J24459b06918H0282
11705c10298I9604b2633B71122j32219b43691B8615e7069p8232a636k51472P4932
11694a78176Q7241n7638j34079A83261N9530c8474l27641A22003h2009B5206J60285
11683A85491a1563H4329D1277K46859A31877L15744j94296C7906K98449C7318
11672e8741b0522c849A79344p7742J42763g4839A4292J01323J6448a11305L5791
11661g5514A79064A1993L6376J27736h4750A86402B3004b05131B71516k1361b14687
11649A81502b0893B22406r1491k8252a25521H274b28880Q3559A07487M8224F9419
11637b74523B75220a07718E8366b0909B46215f5746I4280M9975K4795a9122O508
$$ y = [30978, 21153, -139950, -95788, -57585, -2821, -281276, -3225, 119535, 243994, -206918, 80282, -310298, 99604, -22633, 271122, 138903, -243691, 28615, -57069, -135301, -1636, -253108, -178176, -90935, -148573, -282652, 183261, 242791, -38474, -366115, 122003, -82009, 25206, 185491, -11563, 84329, 41277, 288136, 131877, 447621, 253325, 37906, 336355, 37318, -58741, -20522, -3849, 179344, 101602, 244365, -74839, 14292, 115615, 132063, -111305, -75514, 179064, 11993, 48369, 176105, -84750, 186402, 23004, -205131, 271516, 250155, -214687, 181502, -20893, 222406, 130915, 102663, -125521, 8274, -228880, -145321, 107487, 155711, 69419, -274523, 275220, -107718, 58366, -20909, 246215, -65746, 94280, 144255, 169050, -19122, -12614]
11626a2614B40742N4603A37204D6321c6077l0765A59228L0466J51392b79124A9312
11614I9463b1366E2443k0758J9944N1508b42068J05336j11867c9778o0432A05061
11602c21926a12465A78025a15277j33849h8352A65234f4903A79480d3287b226
11591a49624a7945D1897K4711L0289J39298C8184O3220N5995M3898i3428a2133
11579i9329H5080L1541k1902k8532J96316l6559p6635b6523B55130I2076D1557
11567D33522k00029M9447f8798B64524D955f8597A14246l0957J13144B6798a46301
11555D07253c4677C96068e2566B1019b9979j41218A21093M8835e384p8291A96749
11543B15988j8743j9660n2535i573j3063o9151A00208J3018a47677H7021q421
$$ y = [-12614, 240742, 295345, 137204, 46321, -36077, -66842, 159228, 189694, 341086, -279124, 19312, 99463, -21366, 52443, 31685, 51629, 103137, -242068, -136732, -248599, -39778, -100210, 105061, -321926, -112465, 178025, -115277, -249126, -88352, 165234, -64903, 179480, -43287, -2226, -149624, -17945, 41897, 66608, 96897, 236195, 38184, 101404, 157399, 201297, -93428, -12133, -99329, 85080, 116621, 94719, 66187, 262503, 225944, 149309, -26523, 255130, 92076, 41557, 433522, 233493, 282940, -68798, 264524, 4955, -68597, 114246, 83289, 196433, 26798, -146301, 407253, -34677, 396068, -52566, 21019, -29979, -171197, 121093, 169928, -5384, -83675, 196749, 215988, 197245, 177585, 125050, -9573, -22636, -91787, 100208, 113226, -147677, 87021, 78600]
11532G8600l1185J08537m4908d7100A44462F3791J32263N6270J9e7614m7137j02120
11520b06871B74783A34034g0067C97063F1108j376M6155i3878A09217b0590M782
11509a5808E1625J75105b61669B10199M1804f7381k2898F4366a8990B70327K48985
11498E19312B01198p0068k2509q669J58728J22164H9833H056N9606N1346c30168
11486E3591L37762I1629L9187P9001B4972J79657F0362N12089A90766L539a17548
11474i192D2110M6809J78067e7575C19345k1208m5312q3467K04755k178A03678
11462B24223O6701b680D7936M31174k31117l2466I2352C8374L4883J14091b36480
11450D37870A76341F8218Q6557L70934j87728I7833m5451L26361a6750B9812K78496
$$ y = [78600, 47415, 155952, 111044, -47100, 144462, 63791, 196054, 252324, 252343, -57614, -104751, -206871, 274783, 134034, -70067, 397063, 61108, 59732, 105887, -93878, 109217, -20590, -15808, 51625, 226730, -261669, 210199, 252003, -67381, -90279, 64366, -18990, 270327, 519312, 201198, 131130, 108621, 99952, 258680, 380844, 89833, 8056, 67662, 119008, -330168, 53591, 391353, 91629, 130816, 209817, 24972, 204629, 60362, 572451, 190766, 194305, -117548, -9192, 42110, 88919, 266986, -57575, 319345, 298137, 252825, 169358, 374113, 371935, 103678, 224223, 290924, -2680, 47936, 479110, 247993, 215527, 92352, 38374, 73257, 187348, -236480, 437870, 176341, 68218, 154775, 525709, 337981, 97833, 52382, 378743, -16750, 29812, 308308]
11439C08308j27118E0637c14945a11653C94888a76695A01872b30475A4197K86786
11429C00983G0509L8335h8943q2750f6988A00935J43816D3131a03556B51288b01628
11417B08535Q094E578L1249a34669A11326b26826k1113B70019a56801j5111F262
11405I8867Q6697n5675b00110A62763n7401h2274D99479D8310g417k11257h2616
11393i9836D08882b86504L6227i1402D4868d3129A10420R4351a01622B12918a19345
11381A68681c14012D1737b14387D750a33323K4938q9663M3273C51029r2682a19055
11369A72819K964K1761f2049q0213J67l6243A09774C6748e5142K7262B36786b08977
11356A41694c5998L000j53363c282B9706J04208D7557Q1802c13009M8272B07609
$$ y = [308308, 181190, 50637, -314945, -111653, 394888, -176695, 101872, -230475, 14197, 300983, 70509, 108844, -88943, -171693, -66988, 100935, 244751, 43131, -103556, 251288, -201628, 208535, 216629, 5578, 36827, -134669, 111326, -226826, -247939, 270019, -156801, -171912, 6262, 98867, 185564, 129889, -200110, 162763, 105362, -82274, 499479, 48310, -7417, -218674, -82616, -99836, 408882, -286504, -250277, -91402, 44868, -43129, 110420, 204771, -101622, 212918, -119345, 168681, -314012, 41737, -214387, 4750, -133323, -108385, -198048, -154775, 351029, 258347, -119055, 172819, 175783, 197544, -62049, -142262, -142095, -178338, 109774, 36748, -55142, -27880, 236786, -208977, 141694, -35998, -32998, -186361, -3282, 29706, 133914, 47557, 129359, -313009, -264737, 207609]
11344a46793I9402k3589a15443B8854f4472B4367J613N7786K14489f7838B58947
11332F1701B0137J78264b27675f1698p7454b0164A57869e1718D4713a08670A9411
11320H8563j9443n066a45416M5802o8373f8987A18072a03489B74819H7388j4522
11309G2866C5065J92308a24278d4505B61946K46156D0336a38182D9844A0555a8446
11297E048B37O3644Q6230o8915N8840i9007d7730G2886J5316J72156a19080k8034
11285a47114E9753a96146A73047c8424k81191A0891a0919A61916b66852f0479
11274a48084A90519a87166A48716E6367K2399b1785k40642O3621K0571j86936
11264c65171A90153H3801a00598A68108m4803h9667m6800q2647A47849H254e0376
$$ y = [-146793, 99402, 75813, -115443, 28854, -64472, 24367, 25980, 83766, 298255, -67838, 258947, 61701, 20137, 198401, -227675, -61698, -139152, -20164, 157869, -51718, 44713, -108670, 19411, 88563, 69120, 64054, -145416, -99614, -167987, -68987, 118072, -103489, 274819, 87388, 72866, 35065, 227373, -124278, -44505, 261946, 508102, 40336, -138182, 49844, 10555, -18446, 5048, 237, 63881, 150111, 81196, 140036, -99007, -47730, 72886, 88202, 260358, -119080, -147114, 59753, -196146, 173047, -38424, -319615, 10891, -10919, 161916, -266852, -60479, -148084, 190519, -187166, 148716, 56367, 78766, -21785, -262427, -198806, -178235, -365171, 190153, 83801, -100598, 168108, 123305, -89667, -136467, -219114, 147849, 8254, -50376]
11252F5008o154J6733A4836J47680i731D02126i3361D010a03302J6062b4224E8278
11239A28090a87557A17973C5878a3036A66679D9348g3320C24381d5774p7814C0110
11227A94572e4872j11454N0020a4974A76861f9890k33147f9407o2370j77815C90616
11215I11L00132j8280b30697I7922m1797c77689I3038a16826d1650I3963b99609
11203A97071a88834j35273o4828l497A33391l2208J336b1033A43659b00121c8518
11191c54212h4601p4743B17248a98605A3909J79488C2159b04212h8788k6450b560
11179b16770j17194E0533N2143m8493b80495A93653b48052a01329D0860J38404
11169A79264a99335A97083E4938b3061C28661M9425G2939a96526R4198J1184j35840
$$ y = [65008, 58854, 75587, 14836, 162516, -9731, 402126, -93361, 4010, -103302, -87240, -24224, 58278, 128090, -187557, 117973, 35878, -13036, 166679, 49348, -73320, 324381, -45774, -123588, 30110, 194572, -54872, -166326, -116306, -14974, 176861, -69890, -303037, -69407, -131777, -309592, 390616, 911, 301043, 282763, -230697, 97922, 56125, -377689, 93038, -116826, -41650, 93963, -299609, 197071, -188834, -324107, -388935, -392432, 133391, 101183, 102519, -21033, 143659, -200121, -38518, -354212, -84601, -159344, 217248, -198605, 13909, 193397, 32159, -204212, -88788, -115238, -2560, -216770, -333964, 50533, 102676, 54183, -280495, 193653, -248052, -101329, 40860, 179264, -199335, 197083, 54938, -23061, 328661, 378086, 72939, -196526, -102328, -91144, -226984]
11158b26984A9798J2352J60651o6444b89522i299D2654a64587h008A45885a58664
11146a51549c9975k28043A63430J29092A06679a75289A43915a6596C0345D378
11135e000A58184e3528A08051P4555c4965j89552g4591A75283K4663b53277r9302
11124c52579B03622F9857a08258c5715G7716d0189k85961I7445a039A21283B5853
11112a16453A44269H318L61080j42275N0743J55386f5112f699j71044f7316D4859
11100B46642a63628G8277L26831H9888L49330j35760A15041J07132j10490f9816
11089I5998R0736F5593J14679P1924n9747p8658J10804n4856M5559r7712M19269
11078E36855A15392R8790E2812E202K54128e3949D0685L91034p6659A40346J96088
$$ y = [-226984, 19798, 32150, 192801, 126357, -289522, -9299, 42654, -164587, -8008, 145885, -158664, -151549, -39975, -268018, 163430, 292522, 106679, -175289, 143915, -16596, 30345, 4378, -5000, 158184, -53528, 108051, 182606, -34965, -224517, -74591, 175283, 199946, -253277, -352579, 203622, 69857, -108258, -35715, 77716, -40189, -326150, 97445, -1039, 121283, 25853, -116453, 144269, 8318, 369398, 227123, 277866, 433252, -65112, -6699, -177743, -67316, 44859, 246642, -163628, 78277, 405108, 89888, 439218, 303458, 115041, 222173, 111683, -69816, 95998, 186734, 65593, 180272, 252196, 192449, 113791, 224595, 169739, 215298, 117586, 536855, 115392, 214182, 52812, 5202, 259330, -53949, 40685, 431719, 355060, 140346, 336434]
11067C36434K67359B42774Q9868n0419J27082j49441J24899K57311j71812K24593
11057F94855l16534K80113j15342j27414N09514k86843n4591J36588j78026N9521
11047F01841K43051k2685o5222n064l343k04946J70282J67947C87493k6760J66993
11036E27726J02726L44162j62705k40604p9402K19476k14223J67732K71736k52206
11026F84418n420J34489R6552j76076j59824M3579k66J35445j25882J11421j25465
11015F12971A69685L79250J05592j67471B15314M30501P3381K1150k41358K23053
11005G22041k72377N13088l42441j46394L33153K67738m36108J83671o5206j89986
10995E67179L63775l66256K82237J95918k62267r0225P7157J9364P0752M0566
$$ y = [336434, 603793, 242774, 332642, 282223, 409305, 259864, 384763, 642074, 470262, 694855, 378321, 658434, 543092, 415678, 925192, 638349, 583758, 720346, 542320, 601841, 844892, 822207, 756985, 751921, 748578, 543632, 713914, 881861, 387493, 360733, 527726, 630452, 974614, 811909, 571305, 491903, 711379, 497156, 664888, 936624, 684418, 678998, 813487, 910039, 733963, 574139, 617718, 617452, 752897, 627015, 738436, 612971, 169685, 548935, 654527, 487056, 215314, 645815, 719196, 740346, 498988, 722041, 449664, 962752, 620311, 473917, 807070, 1074808, 638700, 822371, 757165, 567179, 930954, 564698, 846935, 1042853, 780586, 690361, 767518, 786882, 857634, 898200]
10985H98200J70175j9129J45812j84659K26307k34659M3046J62709J82661K69037
10975A659500L03496K18045L08152M1518K02826j74927M1813j24047k91882q9352
10965B095142j70914q2894q8108q2409J09180l71087L73156J59053m6161k68759
10955A626199K4275N4001j2875m83272p3149R1431n22950p597k73746J49128o0611
10944E10834k00385J0502L11944A52766J15696m1591J49991q2753a97612B30406
10933A05290a3243C07154A17171b0740j8774p4937A29757J05839J49022i0798
10922G3423B6479k646a9822n8242B0046J8967c9230B74621j6118I0740a7357l26548
10910c43905h062I3505d3314Q267j64938A70464c42100A19349c59380a20038C32161
$$ y = [898200, 1068375, 1049246, 1195058, 1010399, 1236706, 1002047, 1045093, 1207802, 1390463, 1659500, 1962996, 2181041, 2489193, 2530711, 2733537, 2558610, 2600423, 2476376, 2184494, 2095142, 1924228, 1841334, 1753226, 1670817, 1779997, 1408910, 1782066, 1941119, 1894958, 1626199, 1650474, 1704475, 1691600, 1208328, 1135179, 1226610, 703660, 696063, 422317, 571445, 510834, 310449, 320951, 632895, 152766, 268462, 226871, 376862, 294109, -197612, 230406, 105290, -13243, 307154, 117171, -20740, -39514, -114451, 129757, 235596, 384618, -90798, 73423, 26479, 23833, -19822, -78064, 20046, 39013, -39230, 274621, 258503, 90740, -17357, -343905, -8062, 93505, -43314, -35047, -199985, 170464, -342100, 119349, -359380, -120038, 332161]
10898G711L166O9014B439P9587a03256B39384a8219o690A53608b19945Q6286N948
10886a27711F7984a68857d8256k75914G640J73915c09975D5168j2881a01448B31641
10874a12658b545q2427j16348B42138D8483b39655J18326A5693K7261a75712E8016
10862B67341m0285a8340r3215B74518d06924H0156d970A58639p9253e9912p2449
10851a32361j06000B0925J25075e3452F9378J9709L1007D2548g9517A8788R1374
10840A10162O8926a15521H3143b7200j32981G3036B6592J13855g8426j6765C2525
10828B33523J65493A35921b14593H632a47012A35609E286a81856f4441d352o9061
10817g3413j22958A09194D1657b83608a16281k2404A51941h3992r1408G4649i403
$$ y = [7711, 10877, 79891, 2439, 82026, -103256, 239384, -18219, -24909, 153608, -219945, -133659, -127711, 67984, -168857, -48256, -324170, 7640, 181555, -309975, 45168, 32287, -101448, 231641, -112658, -2545, -84972, -201320, 242138, 48483, -239655, -121329, 15693, 42954, -175712, 58016, 267341, 227056, -18340, -111555, 274518, -406924, 80156, -4970, 158639, 79386, -59912, -132361, -238361, 20925, 146000, -53452, 69378, 89087, 120094, 42548, -79517, 18788, 110162, 179088, -115521, 83143, -27200, -160181, 73036, 26592, 140447, -78426, -95191, 32525, 233523, 399016, 135921, -214593, 8632, -147012, 135609, 5286, -181856, -64441, -4352, -73413, -196371, 109194, 41657, -283608, -116281, -138685, 151941, -83992, -175400, 74649, -9403]
10805b1359q850F9757a43160q1803B20208a78693r5064A55519c1283l0545l2659
10794i4487A63428a17478A70170a99701l3289F4980B506J01485a33623d69G7947
10782i4342m4073p4176D90974b97034h5347K7703A22591j3081b56256A22978O67
10771A23645c369j30071L6297B9162J08808a23010A52996n0645f8834k15584k9861
10760c14279B55312A14514Q5847b60771B0783L12441b72607C38785A4728M3659
10750E8387J69310D5364A0002b1993A9154R6262c7041j32534l4815d1899A77320
10738F8929c7434j19768N7198n0948j612D6908Q3826K95209a4902p3765B8671
10726B5925K22834g5468C2136K26242a03903F7594J2013b39021a10503m16766
$$ y = [-21359, -30209, 69757, -143160, -224963, 220208, -178693, -273757, 155519, -31283, -61828, -94487, 163428, -117478, 170170, -199701, -232990, 64980, 2506, 103991, -133623, -469, 77947, -94342, -138415, -212591, 490974, -297034, -85347, -57644, 122591, 109510, -256256, 122978, 123645, -3369, -133440, -97143, 29162, 137970, -123010, 152996, 102351, -68834, -284418, -314279, 255312, 114514, 200361, -260771, 20783, 333224, -272607, 338785, 14728, 58387, 227697, 45364, 10002, -21993, 19154, 115416, -37041, -169575, -204390, -41899, 177320, 68929, -37434, -157202, -100004, -150952, -152564, 46908, 130734, 425943, -14902, -88667, 28671, 25925, 248759, -75468, 32136, 258378, -103903, 67594, 79607, -239021, -110503, -527269]
10716e27269b29250A9563c07255B1217a29068r7801N8475k88953a9602B060a49949
10704A26226h7399n1148j59130K5619A63567F4827R2204a27352j12876I942J71960
10693A81902a5154l647C29551h7977b7302j75811B32658b7550A500c62739J32576
10682b30163D1516J00062c10698a20722c7447j86432J11634j52014H5362C1694
10671a22344F4948d64924G6383R8380c6178B44789a18699b8200j00191A08554
10660i535q1245A09639K1810l3535O6804a98220j06712G4960d82F3603b3075A56373
10647A5750c2557Q523C2579e7187I4305l9720f9237m4985I3406J63549b8882C5038
10634A79258a10333e1165A07592a82415A95030a4861j95178K0741a6867A11861
$$ y = [-527269, -229250, 19563, -307255, 21217, -129068, -226869, -168394, -457347, -19602, 2060, -149949, 126226, -87399, -138547, -297677, -272058, 163567, 64827, 157031, -127352, -240228, 9942, 181902, -15154, -18801, 329551, -87977, -27302, -203113, 232658, -27550, 1500, -362739, -230163, 41516, 141578, -310698, -120722, -37447, -223879, -112245, -264259, 85362, 31694, -122344, 64948, -464924, 76383, 174763, -36178, 244789, -118699, -28200, -128391, 108554, -9535, -90780, 109639, 131449, 97914, 164718, -198220, -304932, 74960, -482, 63603, -23075, 156373, 15750, -32557, -24034, 32579, -57187, 94305, 54585, -69237, -114222, 93406, 256955, -28882, 35038, 179258, -110333, -51165, 107592, -182415, 195030, -14861, -210039, -189298, -16867, 111861]
10623a39887j27730B49243e3166J6870l576A37400D7665o77K8107a02510d9457
10611a29934h115j37020k32336i5896r8940C21710c892C78965c7089A30835d71013
10599B17495a11141k5763N5755f485q9667K1062k14960a41320N633B12361A04357
10587f4340k03730G9770d052A26612h0265B25312a97043K1181b1890A56116h9001
10575b68834a01732A4830b30718A99451a43694O5194A18951c28691a59022o4788
10565b23810B6159J18582b84308a2065A77258G6624d7530G647J87465E5384R5502
10554A50886J75985i5120J4461m7429C49351j4393E9169J68712h3797G1655j512
10543G0143M0900R2647b6121j15232M1297j68154h1059k16174m8096J26997g7917
$$ y = [-139887, -267617, 249243, -53166, -36296, -39872, 137400, 47665, 46988, 75095, -102510, -49457, -129934, -8115, -145135, -377471, -95896, -194836, 321710, -3892, 378965, -37089, 130835, -471013, 217495, -111141, -136904, -81149, -6485, -96152, -75090, -290050, -141320, -135687, 212361, 104357, -64340, -268070, 79770, -4052, 126612, -80265, 225312, -197043, -175862, -21890, 156116, -89001, -268834, -101732, 14830, -230718, 199451, -143694, -78500, 118951, -328691, -159022, -223810, 26159, 144741, -284308, -12065, 177258, 76624, -47530, 7647, 195112, 55384, 150886, 326871, -95120, -80659, -128088, 349351, 334958, 59169, 227881, -83797, 71655, 70143, 111043, 203690, -26121, -141353, -100056, -268210, -81059, -297233, -345329, -218332, -77917]
10531E2528d8191A58538a95228A86184a58929E8720c6746H275b48642A93236d3572
10519b42670j12918G3228J00942E5611a55134R92e6252j3923k28958d553A35h8291
10506G7786A15M0138j9250b8057A02717l7151L3615a55961l0597d4198k00900
10495b45098a4400B2926i1782j68852G4105c87404A11866j3303f0716C62702i8365
10483B74179J6088k4292L0098J01650k5414j37236r99l3779l4739d8007A15307
10471a70224D9850f0409C3191J7595e434n33696a59854N3914n6061e6033j49582
10460b05615j90977H3576c00423B67016B5959J219a37844K2084K7718B74501l4992
10449B39509A0845a24070A81764e7250A15130h8682j02105n802A11366a69843
$$ y = [52528, -48191, 158538, -195228, 186184, -158929, 58720, -36746, 8275, -248642, 193236, -43572, -242670, -355588, 73228, 174170, 55611, -155134, -154142, -56252, -70175, -299133, -4553, 135, -88291, 77786, 115, 40253, 21003, -28057, 102717, 65566, 99181, -155961, -186558, -44198, -245098, -14400, 22926, -91782, -260634, 74105, -387404, 111866, 98563, -60716, 362702, -98365, 274179, 290267, 265975, 296073, 397723, 372309, 235073, 234074, 200295, 165556, -48007, 115307, -170224, 49850, -60409, 33191, 50786, -5434, -539130, -159854, -105940, -162001, -56033, -205615, -396592, 83576, -300423, 267016, 25959, 27178, -137844, -115760, -88042, 274501, 239509, 10845, -124070, 181764, -57250, 115130, -88682, -190787, -196589, 111366, -169843]
10438i2647d2043m6630H4782H856K0324a62100A57744C5183L52356I1812a68613
10426e1323A16310g9709G2576M0962h0774j93246k49045C23828a4517A90014o8882
10415A21132C6321P1224a06946B03758a93319B23123b99237A51758d8594j930
10405e0524k28519o81E5425b49663m7073R1538g1269I350J33631D7088M7334a41593
10392B44096a66660I8045J2620a4260A12011J70348B4663a02227A69098E1424
10381i798A11151J93225F4905P5079C6283J37976d6388D15125m5704j55394q5153
10370A28874L21930B15035J10796O4455R3199j87379F8734N20200A98753J74682
10360C73435A37587E5410K83215l257M1997j62347a62360A44276M05981j66652
$$ y = [-92647, -42043, -88673, 84782, 8856, 29180, -162100, 157744, 35183, 387539, 91812, -168613, -51323, 116310, -79709, 72576, 113538, -80774, -274020, -523065, 323828, -14517, 190014, 121132, 36321, 107545, -106946, 203758, -193319, 223123, -299237, 151758, -48594, -50524, -279043, -279724, 55425, -249663, -296736, -205198, -71269, 9350, 142981, 47088, 94422, -141593, 244096, -166660, 98045, 110665, -14260, 112011, 282359, 24663, -102227, 169098, 51424, -9798, 111151, 304376, 64905, 139984, 36283, 174259, -46388, 415125, 369421, 214027, 128874, 450804, 215035, 325831, 390286, 483485, 296106, 68734, 588934, 198753, 373435, 137587, 55410, 338625, 335368, 377365, 215018, -162360, 144276, 550257, 383605]
10350C83605R5808j78456n0846R1785j31776J59687j35136K10991o4613b51824
10339A26502P3715J75594q8685J8887f3876B8093N0772J73842J83011C4101J27496
10328A61597d6081D4785L08198Q8892A80902J91660j21816M2861j27718a69187
10317G2909a21047A15748k2121b3774o4937A35560b04837B33290k0030A05089
10306A32722F1275c671A59636J31996g1015l39896a385C28968p9930p3329C4128
10294g8702A90204a00647r5510K8271B09680D834f1471l21552a49741a0285k79857
10283b90142a30221j5168d1648A3976f0662B77547A28804A5179J45082d5004m439
10272d9443k2005A35334l1563e7435k5828e938B04640n9404c17325A32304B3716
$$ y = [383605, 479413, 300957, 250111, 341896, 210120, 369807, 234671, 445662, 381049, -251824, 126502, 200217, 375811, 287126, 306013, -63876, 28093, 78865, 252707, 435718, 34101, 161597, -46081, 44785, 352983, 441875, 180902, 372562, 250746, 293607, 165889, -169187, 72909, -121047, 115748, 93627, -23774, -88711, 135560, -204837, 233290, 213260, 105089, 132722, 61275, -3671, 159636, 291632, -71015, -410911, -1385, 328968, 249038, 175709, 34128, -78702, 190204, -100647, -196157, -167886, 209680, 4834, -61471, -383023, -149741, -10285, -290142, -130221, -145389, -41648, 13976, -60662, 277547, 128804, 15179, 160261, -45004, -49443, -71448, 135334, 103771, -57435, -83263, -5938, 204640, 145236, -317325, 132304, 23716]
10260A74683J08985r4957O9531j9391J10102O299G6991K09269f3083K1623B54799
10248c4205k19446g9486A2789K93605E7107J36272J1848d1152j37423A09176b01264
10236H8901a8246A46237K31941c96615a40123f9409j44174e2429p524o220A83165
10224f4946h533r3564B39302a06546A54546c05708A89075J4855B340a07883n1151
10213a59034d9940n0423F2474h4756r5324A79980a51989D8287b68117B9125c38220
10201i586k22006R4495D7470a37408A35931k9591b0356A7441K48087b4601H1766
10189d7679k53749G7213K30167b9047j05363e7828k29056B79773H9693g1227A06786
10177c99148a04397j12054c9942A26617b68395Q8078f2396E5284b11079j73074
$$ y = [174683, 283668, 188711, 258242, 238851, 348953, 355252, 76991, 286260, -63083, -41460, 254799, -34205, -253651, -79486, 12789, 306394, 57107, 193379, 205227, -41152, -178575, 109176, -201264, 88901, -18246, 146237, 378178, -396615, -140123, -69409, -213583, -52429, -59953, -66173, 183165, -64946, -8533, -102097, 239302, -106546, 154546, -305708, 189075, 203930, 2340, -107883, -159034, -49940, -100363, 62474, -84756, -180080, 179980, -151989, 48287, -268117, 29125, -338220, -9586, -231592, -137097, 47470, -137408, 135931, 106340, -20356, 17441, 265528, -24601, 81766, -47679, -301428, 77213, 307380, -29047, -134410, -57828, -286884, 279773, 89693, -71227, 106786, -399148, -104397, -216451, -39942, 126617, -268395, -180317, -62396, 55284, -211079, -384153]
10167c84153d3149l5872j64950j22883J65776Q4133k4091G3417h8107A12900a44264
10155b10091d7540p1631j8564e6107j135o6929G0222a12095A20412i6239a6631
10143a99213R3626k58583B56797F3299b53402j52265A20445a91574j19035H8870
10132B04475a87089j57672A88711m5131d7562A8022a54811k0149j170r29G7516
10120e8398F6718a03889k9055k4299j6085H4747l4454k2493a26367g711C8776
10108a57334k01116f5837k1068H891Q4066E916e0526A57448b16825B16868a31649
10096a66280M8114C1625a80156K2091k4760G4609a11012A61903b74966A32598
10085A96319E888a59395b3709G3991C165c01427B89521A35579a27016j55336g3788
$$ y = [-384153, -43149, -79021, -243971, -366854, -201078, -116945, -141036, 73417, -88107, 112900, -144264, -210091, -47540, -119171, -137735, -56107, -57242, -124171, 70222, -112095, 120412, -96239, -16631, -199213, -105587, -364170, 256797, 63299, -253402, -405667, 120445, -191574, -310609, 88870, 204475, -187089, -344761, 188711, 143580, -47562, 18022, -154811, -174960, -176130, -177059, 77516, -58398, 66718, -103889, -132944, -157243, -173328, 84747, 50293, 27800, -126367, -7711, 38776, -157334, -358450, -65837, -86905, 8891, 92957, 5916, -50526, 157448, -216825, 216868, -131649, -166280, -118166, 31625, -180156, -158065, -182825, 74609, -111012, 161903, -274966, 132598, 196319, 5888, -159395, -23709, 73991, 3165, -301427, 289521, 135579, -127016, -282352, -73788]
10073g4436j57295b7054L012A43616K5346M7926a77251P8832l03438a07913l0865
10062a38778I9745R669a45355f1432A0466c17571J8194k8847C34365a57494o0740
10051b18234j51504N4298F367J38890a11935A57103E979h2062A27797c43829F1412
10039A27193i8424a9623j26130j34786a14969a640n41A14172B2055a01764c3973
10027A11276c0935A21530b33905h4682A27803M9529c34245F2528a46739f4777
10016c47780a36722F4172a52630j5525j170A4857b70975e3150B23001a13537B1451
10004a84121H0579g9391k35715G0445g6406j571M302F8053a07796A37607b27222
9992c66448a01222j72928d0403C1293a40074a1692j31288n8990B19577b26342
$$ y = [-74436, -231731, -27054, -24042, 143616, 168962, 216888, -177251, -98419, -401857, -107913, -138778, 99745, 109414, -145355, -61432, 10466, -317571, -299377, -328224, 334365, -157494, -218234, -369738, -315440, 6367, 145257, -111935, 157103, 5979, -82062, 127797, -343829, 61412, 127193, -98424, -19623, -145753, -280539, -114969, -1640, -2181, 114172, 22055, -101764, -33973, 111276, -30935, 121530, -233905, -84682, 127803, 177332, -334245, 62528, -146739, -64777, -347780, -136722, 64172, -152630, -168155, -169325, 14857, -270975, -53150, 223001, -113537, 21451, -184121, 80579, -79391, -315106, 70445, -76406, -77977, -73675, 68053, -107796, 137607, -227222, -366448, -101222, -274150, -40403, 31293, -140074, -11692, -142980, -201970, 219577, -226342]
9981c39589d7672r8197e9752Q365o6947L6125k6750K3188j03716h5354k9685j60235
9969b75274l9087a07445H225K7753i8551A21404d11614A9582b54043h0754J8785
9958f1969n9189M1523A33721J00945O59e4504A20151d2522A65733o5803a61778
9946f4262k4378j27740F4636i8240D8254a31859r5590n1198J23137j33250j22636
9935d11396A66441h395j22100A87340a40216b9817j87485Q7824L1765B58769d21164
9923b01595E7752b59804a5217p7383j10830L0968e9582l5086q8803H3947b05892
9911c31683J8784a50787C20111F558e3142A08385O8342c21718J12759G0776k0118
9900E0658R4310k402G781c64598C0821d1385A0867O8379J66702c65137B0691J69143
$$ y = [-339589, -47672, -145869, -59752, -51387, -118334, -82209, -108959, -85771, -189487, -85354, -115039, -275274, -314361, -107445, 8225, 35978, -98551, 121404, -411614, 19582, -254043, -80754, -61969, -121158, -79635, 133721, 234666, 235325, -54504, 120151, -42522, 165733, 99930, -161778, -64262, -88640, -216380, 64636, -98240, 48254, -131859, -227449, -278647, -155510, -288760, -411396, 166441, -8395, -130495, 187340, -140216, -29817, -217302, -129478, -97713, 258769, -421164, -201595, 57752, -259804, -15217, -92600, -203430, -172462, -59582, -94668, -183471, 83947, -205892, -331683, -312899, -150787, 320111, 6558, -53142, 108385, 176727, -321718, -208959, 70776, 50658, 144968, 142566, 7781, -364598, 30821, -41385, 10867, 79246, 245948, -365137, 20691, 189834]
9888A89834c02972B61620h6924j85798P8938h971l45993A73877i4700k03164a10440
9876f9129p5184A89167b25226Q6202A9004g5702A06539b32818A68711a84642m7
9865a84689F4940N7476l5438a12681j17762A18752b5009D6507c9991j09182j55711
9854c04884O0461f8540B43271c4735j78795F5254b68466B23155g8998e718r6103
9843a01821d6328F9476P0994c41577J44845j5320e1208r5749F9741i3842A9299
9831a77559e6033k58529c378p5231b1667B84272H9122b22996C19134A6243a36069
9819A07812B2455a96148g0856r2844B30310A02425a91214K3980k7851M8002A7514
9807A99298a49666c5674k35657Q484L7313O4045q9174A70963F1806c31312C0350
$$ y = [189834, -302972, 261620, -86924, -272722, -193784, -8971, -354964, 173877, -94700, -297864, -110440, -69129, -144313, 189167, -225226, -139024, 19004, -75702, 106539, -232818, 168711, -184642, -184689, 64940, 122416, 86978, -112681, -230443, 118752, -25009, 46507, -39991, -149173, -304884, -244423, -68540, 243271, -34735, -213530, 65254, -268466, 223155, -78998, -5718, -101821, -46328, 69476, 140470, -341577, -196732, -212052, -51208, -146957, 69741, -93842, 19299, -177559, -56033, -314562, -3378, -78609, -21667, 284272, 89122, -222996, 319134, 16243, -136069, 107812, 22455, -196148, -70856, -163700, 230310, 102425, -191214, -167234, -195085, -147083, 17514, 199298, -149666, -35674, -271331, -262847, -225534, -161489, -250663, 170963, 61806, -331312, 30350]
9795B44157n8849a41373A06444e2732A97574d1909C14147j39074a75513H7926
9784a97879L7533C6920a51821K9577H3101J87880C8753K72200c5949K888D0311
9772h6372L8574m15735a90502l9001O2880d3174q1258A22012f8723Q566B33597
9760b4511k39074E6505i059B57785b1650j36676k7969j3495O1836K163C3998b23465
9747a90563G6197a49753q0134g2110a9141j28807J5429B56828H3533a41923N8488
9736h3435E8985b17990j276h6387A33280D7530b69342J06035f2300A1283J92033
9725B03316a82013D6527N334A8202K9755a58380P0890l08905f6904B5222i7221
9713A06641O6906b83616h6100B92130D0724g8492J4472n8651b0429A22396J44200
$$ y = [244157, 185308, -141373, 106444, -52732, 197574, -41909, 314147, 175073, -175513, 87926, -197879, -160346, 36920, -151821, -122244, 83101, 270981, 38753, 310953, -35949, -33061, 40311, -86372, -47798, -463533, -190502, -229503, -166623, -43174, -124432, 122012, -68723, -60157, 233597, -24511, -263585, 56505, -9059, 257785, -21650, -158326, -186295, -199790, -137954, -135791, 33998, -223465, -190563, 76197, -149753, -229887, -72110, -19141, -147948, -132519, 256828, 83533, -141923, -83435, 58985, -217990, -219266, -86387, 133280, 47530, -269342, -163307, -62300, 11283, 203316, -182013, 46527, 51861, 18202, 47957, -158380, -87490, -396395, -66904, 25222, -97221, 106641, 173547, -283616, -86100, 292130, 40724, -78492, -64020, -122671, -20429, 122396, 266596]
9702B66596j09370h3401a8516B26593J902a90900o747a7681k55852A75757d02812
9690a23708l31237C42050a32865A04268b40191N288H2359a5770j83306B15101
9679A21417n7556J56996b24395B2979b10049A09707a02997L9737k28661L8974
9669b52947e7064J6180k3625j21671o9074k4246a30804o2974O235c8974B3962
9657F5755d3638l98362i6613B26467H1144b49837P2693B03420H398b29775j3433
9646b43208I8362J07732i1844B38525h1336A46147b4947G2885R9a86389E3009
9634a55618A64859b28979i8110d348A37989f7157j11124l9572L1278l14292J4243
9623d86624B0457a39856r9668d0981M773A53576a94953C1025c08959J40330f6985
$$ y = [266596, 157226, -83401, -18516, 226593, 228495, -190900, -197647, -17681, -273533, 175757, -402812, -123708, -454945, 342050, -132865, 104268, -240191, -234903, 82359, -15770, -199076, 215101, 121417, 63861, 220857, -224395, 22979, -210049, 109707, -102997, -63260, -291921, -252947, -57064, -40884, -64509, -186180, -255254, -279500, -130804, -193778, -187543, -38974, 23962, 65755, -43638, -442000, -96613, 226467, 81144, -249837, -177144, 203420, 8398, -229775, -243208, 98362, 206094, -91844, 238525, -81336, 146147, -24947, 72885, 72984, -186389, 53009, -155618, 164859, -228979, -98110, -4348, 137989, -67157, -178281, -217853, -186575, -500867, -486624, 20457, -139856, -239524, -40981, -36208, 153576, -194953, 31025, -308959, -168629, -66985]
9611g6204j39022g8941A56514K4015a25120A98573e0186A45335a26466A45633
9600c1451l85147A40450a45596M0397p2287P0928b0698j04931m350C13683i4763
9588a06675A24970D5116g434j51018J0483A5334b02189b2325B7026O7369j9561
9577G4834j1968e2502j12061m9969E4649c30850a7459l27170D5664f7859m5163
9566a13022j37164c5341E2719c28639A97434N5447e7264j20531l2419J3953a40
9554h3767A18207m4887a7057j84529P3414f0634C4827L49125G7095i4515d3081
9542a94487F7976a73331Q4438L5735A24137k2286h4915r2572r414A56612o5510
9531I1102R8861j8884H3827K51M5700b7239n1388m0395j57893G2212B5643J50597
$$ y = [-76204, -215226, -78941, 156514, 180529, -125120, 198573, -50186, 145335, -126466, 145633, -31451, -416598, 140450, -145596, -105199, -177486, -106558, -20698, -125629, -129979, 313683, -94763, -106675, 124970, 45116, -7434, -158452, -147969, 15334, -202189, -22325, 27026, 94395, 74834, 62866, -52502, -164563, -214532, 54649, -330850, -17459, -344629, 45664, -67859, -113022, -250186, -35341, 52719, -328639, 197434, 252881, -57264, -177795, -210214, -196261, -140, -83767, 118207, 73320, -17057, -201586, -128172, -60634, 34827, 383952, 77095, -94515, -43081, -194487, 67976, -173331, -88893, -53158, 124137, 101851, -84915, -177487, -186901, 156612, 91102, 189963, 171079, 83827, 84078, 129778, -27239, -78627, -119022, -276915, 72212, 25643, 176240]
9519A76240H2433d8793j71538a4974l56851G9756c1810k45501f224j4428j92147
9508b12799B57725j6432A458a05715e1143N140j5855k67997J56194F6245a8213
9496e1178J7649l12625J17682j1786J08427c4839l1889A02904A973c19969B855
9484a54797j31113b6055B8153d08492B38168a83370H6819a74353d1444n5910G6757
9472a82763d4303A13613a8054j18235A69244A4885O3750J11594q8120m8613N2102
9461A05598E2136K12496g6619B23221o3685n7154a38384A97703B1972m046J25221
9450A43147R002b1229A11530J87488H5878B1406i0486B25368h4258A64097D648
9438C0783b0341n2520A15304B1851a64082o9588H9149f5659e359A52847i7996
$$ y = [176240, 82433, -48793, -220331, -14974, -371825, 79756, -31810, -277311, -6224, -20652, -212799, 257725, 241293, 1458, -105715, -51143, -46003, -61858, -329855, -173661, 66245, -18213, -51178, -33529, -346154, -228472, -240258, -131831, -34839, -66728, 102904, 1973, -319969, 2855, -154797, -285910, -26055, 28153, -408492, 238168, -183370, 86819, -174353, -41444, -97354, 76757, -182763, -44303, 113613, -18054, -136289, 169244, 14885, 78635, 190229, 102109, 53496, 105598, 52136, 264632, -76619, 223221, 159536, 102382, -138384, 197703, 21972, 17926, 143147, 152149, -21229, 111530, 299018, 85878, 21406, -90486, 225368, -84258, 164097, 4648, 30783, -20341, -72861, 115304, 21851, -164082, -233670, 89149, -65659, -5359, 152847, -97996]
9426A09903d6371B424a86260j46082m2072f1415F9914b99656J38434c6084j3410
9415d9494C71273a27527m5644e7099J5046j03523n4722g1765j01646k0241e9392
9403i6653J4241D5417a97680c1508o9460M1539a3642H2266k6355k2719g027l64807
9391c71834a02834d6301B4121K9871B1965a81525p8358I0952c6586G6102l7225
9380C8877J46478h372C532J4643a53586j23841f471F024i6653a9372B18272G0231
9367B5370a15915r954A62112g7181A08334n2078J5429J10378C6205c81890a32861
9355a98936A06753N7799a31704j9152p3261A13152A1586O076b35589n7512J1639
9344b81462I8880b81121A0039a1055C1539i526j1055D4868c38294Q7532C4670
$$ y = [109903, -46371, 2424, -186260, -332342, -374414, -61415, 69914, -299656, -161222, -36084, -49494, 371273, -127527, -173171, -57099, -42053, -145576, -200298, -71765, -173411, -193652, -59392, -96653, -82412, 45417, -197680, -31508, -100968, -59429, -13642, 82266, 55911, 33192, -7027, -371834, -102834, -46301, 24121, 53992, 21965, -181525, -259883, 90952, -36586, 76102, 38877, 185355, -8372, 3532, 18175, -153586, -277427, -6471, 6024, -96653, -19372, 218272, 70231, 25370, -115915, -125869, 162112, -77181, 108334, 56256, 71685, 182063, 36205, -381890, -132861, -198936, 106753, 164552, -131704, -150856, -224117, 113152, 11586, 17662, -235589, -293101, -281462, 98880, -281121, 10039, -11055, 31539, -9526, -20581, 44868, -338294, -250762, 34670]
9332A80236r558G0950b76289J19516j07741A06224A799K8345c24356J17954A61900
9320A04940K15014b91933g1863k03760f5615r1196B52581h5919J9592D2855d7067
9308F0536Q3293g6729J2208K584k4353h16m8944l3138A16196H400a67313N6506
9296a10807K5821k49957d6999A40304a42777O1717F1120b55635A9800a29541j35811
9285b65352j8833A31986c95786A43713b00660B36370i0712B51551a77570C4077
9274c7309n7871B55334A18945k6153a32769A98576a76553Q5762l3997G5778K2795
9263I8573D8021J21175A3623a19787d6921A99589b50045a22386E1293e7918n4104
9252a12022E845J56390C8032b75081A89464d7646k92328G8120a19007A54203g4227
$$ y = [180236, 170678, 70950, -276289, -156773, -264514, 106224, 1799, 30144, -324356, -206402, 161900, 104940, 319954, -291933, -71863, -275623, -65615, -156811, 252581, -85919, -66327, 42855, -47067, 60536, 143829, -76729, -64521, -61937, -86290, -816, -49760, -82898, 116196, 8400, -167313, -110807, -84986, -334943, -46999, 140304, -142777, -81060, 61120, -255635, 19800, -129541, -265352, -284185, 131986, -395786, 143713, -200660, 236370, -90712, 251551, -177570, 34077, -37309, -95180, 255334, 118945, 92792, -132769, 198576, -176553, -90791, -124788, 75778, 98573, 48021, 169196, 13623, -119787, -46921, 199589, -250045, -122386, 51293, -57918, -112022, 5845, 162235, 38032, -275081, 189464, -47646, -339974, 78120, -119007, 154203, -74227]
9240c3570q9266C392K1534c47287J21971M8632Q082E1019a66530B46632G138e6988
9227A5333L4972j9603a60364A97607a79344M2010L4982G8907c11151d9517A47002
9215a3200C0431o945a23885j07721A6674b23142h763A51634c0336j12171c1157
9203F0915d92455b0667B44033a09460j20756A46490b08237A46974h9270n4462
9193a43732L1906q5052b4152a0652k68200A22517D4230a00516k04634G3002i112
9181a29517a4198j82768i5766j40418A47164j0210N701J8714d3029k2696m9767
9170a15492m7725j92618a8601r8680N0277I3646h3890A765a2393m21184i2087
9158b2676A60335h4579C3281i6771B25904K9291r3523a34436G9692l9424b20155
$$ y = [-33570, -122836, 3392, 24926, -347287, -225316, -176684, -168602, 51019, -166530, 246632, 7138, -56988, 15333, 50305, 30702, -160364, 197607, -179344, -137334, -102352, 78907, -311151, -49517, 147002, -13200, 30431, 23486, -123885, -231606, 16674, -223142, -8763, 151634, -30336, -142507, -31157, 60915, -492455, -20667, 244033, -109460, -230216, 146490, -208237, 146974, -89270, -143732, -111826, -196878, -24152, -10652, -278852, 122517, 44230, -100516, -305150, 73002, -9112, -129517, -14198, -196966, -95766, -236184, 147164, 136954, 142655, 161369, -43029, -65725, -115492, -163217, -355835, -18601, -117281, -67004, 93646, -83890, 1765, -12393, -433577, -92087, -22676, 160335, -84579, 33281, -96771, 225904, 255195, 161672, -134436, 79692, 40268, -220155]
9146a58261E5294a08748f326n0014B11599a47893N4060k32423d9460M135k73044
9135c18369G6694b26887J1329B8298N7188e9980r4760B1856J1913a14351l1525
9124a45876B48022F3609b25735M2034C2684g8734D13695A01250k8340a84283B1645
9112a79833D6298a64904B2768Q9775f1828j14496p0087J975A7914K89693a88040
9100e8634C98817b28046K413A2725m68c6901A12847A0701J26827J19869a60854
9088g9A40127d1907j10392L318n6081r3992l7480A24917b57437a18462E9683a67347
9075h9615q4551J611J7951j78721A30724e2830d590A51203c1080B0715d4428k21879
9063b66307A35462a56636j01264A5193c4280A32531c51189c2599A13241a8883
$$ y = [-158261, 55294, -108748, -6326, -56340, 211599, -147893, -93833, -326256, -49460, -45325, -318369, 76694, -226887, -215558, 28298, 85486, -59980, -154740, 21856, 33769, -114351, -145876, 248022, 63609, -225735, -183701, 32684, -78734, 413695, 101250, 72910, -184283, 21645, -179833, 46298, -164904, 22768, 112543, -61828, -176324, -246411, -244436, 17914, 307607, -188040, -58634, 398817, -228046, -225633, 12725, 12257, -36901, 112847, 10701, 137528, 257397, -160854, -79, 140127, -41907, -152299, -148981, -205062, -299054, -336534, 124917, -257437, -118462, 59683, -167347, -89615, -174166, -172555, -154604, -333325, 130724, -52830, -4590, 151203, -31080, 20715, -44428, -266307, 135462, -156636, -257900, 15193, -34280, 132531, -351189, -32599, 113241, -18883]
9052b43461f2453k76431a30088q83b370C7K69559a87357B47155a30604B61384
9040E6842M2436i7268j14746m0710r4245J13753I3944b97091R5161k02507h8396
9028c06736B30417A12984A505K38109a11260l66413H2566L3140a12661F6325b83798
9016h2563n2675A19992C5967J80625b66314O8091M5312l0147d457p5263l5469
9005a15189j02047h9696K7353A4340b3836G4536c8488k48882A3260e52008K23109
8994c28899A09468a77884h3746K9487k4667D5522c67384d5790A35670a47717J3646
8983a34071q6695A35318J7742C5263d0285j02578A1607b23890d6522I7527a81148
8971a84748E7013M40367B9640c5818A49375b38219L3293P9632M3936m260q4711
$$ y = [-243461, -62453, -338884, -130088, -130971, -2370, 37, 269596, -187357, 247155, -130604, 261384, 56842, 99278, -97268, -212014, -252724, -346969, -233216, 93944, -297091, -201930, -404437, -88396, -306736, 230417, 112984, 1505, 239614, -111260, -477673, 82566, 115706, -112661, 66325, -283798, -82563, -135238, 119992, 35967, 216592, -266314, -198223, -152911, -183058, -4457, -79720, -115189, -217236, -89696, -62343, 14340, -23836, 74536, -38488, -287370, 13260, -552008, -328899, 109468, -177884, -83746, -54259, -78926, 45522, -367384, -45790, 135670, -147717, -134071, -220766, 135318, 153060, 35263, -40285, -142863, 11607, -223890, -46522, 97527, -181148, -184748, 57013, 497380, 29640, -35818, 149375, -238219, -204926, -125294, -81358, -85618, -170329]
8960a70329c0727A10917a57218j074j0165B28844a8124p5214j98059J45093B22952
8948E9065e3575E3634a70106n0895j71359c5785j23391a643j1967j97319e684
8936A92495c8580B90415j32443O9047c31316a1026I3262b87097A39213J66828
8926C06041A17076J74534J70221K302562L131230P33229A817763E18239H4481
8916E6643K34472j23930d8298C54214g5812l1269J7398A02674M9303e3778B0261
8904e5984n9208j73709i8685k9042N8098J4532j59814c0782A41735l331C3555
8892h9801j47187a10650d355A26859c6565j58410A78198o7912i7396L0359k32827
8881b99864b1980j16041H2726a23575m8220A6365a09627F0545a30134A35020M386
$$ y = [-170329, -30727, 110917, -157218, -158292, -168457, 228844, -18124, -93338, -291397, -146304, 222952, 59065, -53575, 53634, -170106, -221001, -392360, -35785, -159176, -1643, -13610, -210929, -5684, 192495, -38580, 290415, 157972, 227019, -331316, -11026, 93262, -287097, 139213, 306041, 117076, 291610, 461831, 2764393, 5895623, 6628852, 1817763, 518239, 84481, 56643, 291115, 167185, -48298, 354214, -75812, -107081, -89683, 102674, 151977, -53778, 20261, -55984, -115192, -288901, -98685, -127727, -69629, -55097, -214911, -30782, 141735, 138404, 33555, -89801, -236988, -110650, -4355, 126859, -36565, -194975, 178198, 110286, -97396, -67037, -299864, -21980, -138021, 82726, -123575, -171795, 16365, -109627, 60545, -130134, 135020, 139406]
8870A39406a43418A24999k9960b33748a1050C29748A30552C7496b38587f2250
8859A07134c393j11055j82371A44100b21394a00770k31420B60038J43478j78514
8849B25002a76289B3536a79152A79951a61876J905l3188d6540j13405B20011b42557
$$ y = [139406, -143418, 124999, 95039, -233748, -11050, 329748, 130552, 37496, -238587, -62250, 107134, -3393, -114448, -296819, 144100, -221394, -100770, -332190, 260038, 403516, 225002, -176289, 23536, -179152, 179951, -161876, -159971, -193159, -46540, -159945, 220011, -242557]
$$ [...]
##END NTUPLES=NMR SPECTRUM
##END=
