##TITLE=AC1657_NARAH14393_8531823_6hxqYJvxse
##JCAMPDX= 6.0         $$ Bruker NMR JCAMP-DX V2.0
##DATA TYPE= NMR SPECTRUM
##DATA CLASS= NTUPLES
##ORIGIN= BRUKER
##OWNER= Administrator
$$ 1.72 TOPSPIN		Version 2.1
$$ 2014-03-14 16:03:16.672 -0800  Administrator@X
$$ Compression mode = diff/dup
##.OBSERVE FREQUENCY= 400.02188249412
##.OBSERVE NUCLEUS= ^1H
##.ACQUISITION MODE= SIMULTANEOUS (DQD)
##.ACQUISITION SCHEME= undefined
##.AVERAGES= 64
##.DIGITISER RES= 22
##SPECTROMETER/DATA SYSTEM= spect
##.PULSE SEQUENCE= noesygpps1d.comp
##.SOLVENT NAME= COFFEE_meoh
##.SHIFT REFERENCE= INTERNAL, COFFEE_meoh, 1, 14.96089
##AUDIT TRAIL= $$ (NUMBER, WHEN, WHO, WHERE, PROCESS, VERSION, WHAT)
$$ ##TITLE= Audit trail, TOPSPIN		Version 2.1
$$ ##JCAMPDX= 5.01
$$ ##ORIGIN= Bruker BioSpin GmbH
$$ ##OWNER= Administrator
$$ $$ E:\/data/COFFEE/nmr/AC1657_NARAH14393_8531823_6hxqYJvxse/12/pdata/1/auditp.txt
$$ ##AUDIT TRAIL=  $$ (NUMBER, WHEN, WHO, WHERE, PROCESS, VERSION, WHAT)
(   1,<2014-03-14 16:03:11.029 -0800>,<Administrator>,<X>,<go>,<TOPSPIN 2.1>,
      <created by zg
	started at 2014-03-14 15:51:37.846 -0800,
	POWCHK enabled, PULCHK disabled,
       configuration hash MD5:
       C8 4E 4E 5D D3 5C D8 9E 9F 52 82 E0 59 8A DE 15
       data hash MD5: 64K
       31 C7 8A 71 EF 94 2C 53 44 03 3C 6D 15 72 A4 C6>)
(   2,<2014-03-14 16:03:14.347 -0800>,<Administrator>,<X>,<proc1d>,<TOPSPIN 2.1>,
      <Start of raw data processing
       efp LB = 0.3 FT_mod = 6 PKNL = 1 PHC0 = 0 PHC1 = 0 SI = 128K 
       data hash MD5: 128K
       7B 44 3D 3C 5B 37 75 DC F3 6E 1E C6 E5 23 C8 8C>)
(   3,<2014-03-14 16:03:15.493 -0800>,<Administrator>,<X>,<proc1d>,<TOPSPIN 2.1>,
      <pk PHC0 = -82.88086 PHC1 = 0 
       data hash MD5: 128K
       72 F6 47 FC DE 7A 37 CE 56 F9 0F 51 C2 25 9D 17>)
(   4,<2014-03-14 16:03:15.998 -0800>,<Administrator>,<X>,<proc1d>,<TOPSPIN 2.1>,
      <abs ABSG = 1 
       data hash MD5: 128K
       81 ED 41 AD 0B 0F 47 F3 BB 68 F9 FD A5 33 E3 70>)
(   5,<2014-03-14 16:03:16.133 -0800>,<Administrator>,<X>,<proc1d>,<TOPSPIN 2.1>,
      <abs ABSG = 2 
       data hash MD5: 128K
       B8 56 8A 5E 6C D2 DA 47 F1 AA 7E F8 E8 44 A5 9A>)
(   6,<2014-03-14 16:03:16.217 -0800>,<Administrator>,<X>,<proc1d>,<TOPSPIN 2.1>,
      <abs ABSG = 3 
       data hash MD5: 128K
       08 4E A5 E9 00 97 3F 23 C4 AE CB 7A 9B 4A A9 2E>)
(   7,<2014-03-14 16:03:16.352 -0800>,<Administrator>,<X>,<proc1d>,<TOPSPIN 2.1>,
      <abs ABSG = 4 
       data hash MD5: 128K
       9C 98 79 16 19 9B 55 26 E9 B1 C5 21 C3 D3 1E 78>)
(   8,<2014-03-14 16:03:16.453 -0800>,<Administrator>,<X>,<proc1d>,<TOPSPIN 2.1>,
      <abs ABSG = 5 
       data hash MD5: 128K
       F4 C3 49 AB CC 8F 4B 59 44 FF 4F 75 E3 5B BA D1>)
$$ ##END=
$$ 
$$ $$ hash MD5
$$ $$ 29 0F C0 CE 07 33 3D DD A6 5A 3D EB 62 76 CC 7E
##$RELAX= 
##$RELAX= 
##$RELAX= 
##$RELAX= 
##$RELAX= 
##$RELAX= 
##$RELAX= 
##$RELAX= 
$$ Bruker specific parameters
$$ --------------------------
##$DU= <E:\>
##$EXPNO= 12
$$ [...]
##$TP07= 0
##$TPNAME0= <>
##$TPNAME1= <>
##$TPNAME2= <>
##$TPNAME3= <>
##$TPNAME4= <>
##$TPNAME5= <>
##$TPNAME6= <>
##$TPNAME7= <>
##$TPOAL= (0..7)
0.5 0.5 0.5 0.5 0.5 0.5 0.5 0.5
##$TPOFFS= (0..7)
0 0 0 0 0 0 0 0
##$TUNHIN= 0
##$TUNHOUT= 0
##$TUNXOUT= 0
##$USERA1= <user>
##$USERA2= <user>
##$USERA3= <user>
##$USERA4= <user>
##$USERA5= <user>
##$V9= 5
##$VALIST= <valist>
##$VCLIST= <CCCCCCCCCCCCCCC>
##$VD= 0
##$VDLIST= <DDDDDDDDDDDDDDD>
##$VPLIST= <PPPPPPPPPPPPPPP>
##$VTLIST= <TTTTTTTTTTTTTTT>
##$WBST= 1024
##$WBSW= 4
##$XGAIN= (0..3)
0 0 0 0
##$XL= 0
##$YL= 0
##$YMAX_a= 5718815
##$YMIN_a= -12483156
##$ZGOPTNS= <>
##$ZL1= 120
##$ZL2= 120
##$ZL3= 120
##$ZL4= 120
##$ABSF1= 14.96089
##$ABSF2= -5.597292
##$ABSG= 5
##$ABSL= 3
##$ALPHA= 0
##$AQORDER= 0
##$ASSFAC= 0
##$ASSFACI= 0
##$ASSFACX= 0
##$ASSWID= 0
##$AUNMP= <proc_prof1d_extract.lims>
##$AXLEFT= 0
##$AXNAME= <>
##$AXNUC= <1H>
##$AXRIGHT= 0
##$AXTYPE= 0
##$AXUNIT= <>
##$AZFE= 0.1
##$AZFW= 0.1
##$BCFW= 0
##$BC_mod= 0
##$BYTORDP= 0
##$COROFFS= 0
##$CY= 15
##$DATMOD= 1
##$DC= 0
##$DFILT= <>
##$DTYPP= 0
##$F1P= 0
##$F2P= 0
##$FCOR= 0.5
##$FTSIZE= 131072
##$FT_mod= 6
##$GAMMA= 0
##$GB= 0
##$INTBC= 1
##$INTSCL= 1
##$ISEN= 128
##$LB= 0.3
##$LEV0= 0
##$LPBIN= 0
##$MAXI= 10000
##$MC2= 0
##$MEAN= 0
##$ME_mod= 0
##$MI= 0
##$NCOEF= 0
##$NC_proc= -2
##$NLEV= 6
##$NOISF1= 0
##$NOISF2= 0
##$NSP= 0
##$NTH_PI= 0
##$NZP= 0
##$OFFSET= 14.96089
##$PC= 1
##$PHC0= -82.88086
##$PHC1= 0
##$PH_mod= 1
##$PKNL= yes
##$PPARMOD= 0
##$PPDIAG= 0
##$PPIPTYP= 0
##$PPMPNUM= 2147483647
##$PPRESOL= 1
##$PSCAL= 4
##$PSIGN= 0
##$PYNMP= <proc.py>
##$REVERSE= no
##$SF= 400.020009680849
##$SI= 131072
##$SIGF1= 0
##$SIGF2= 0
##$SINO= 400
##$SIOLD= 131072
##$SPECTYP= <>
##$SREGLST= <1H.CDCl3>
##$SSB= 0
##$STSI= 131072
##$STSR= 0
##$SW_p= 8223.68421052631
##$SYMM= 0
##$S_DEV= 0
##$TDeff= 65536
##$TDoff= 0
##$TI= <>
##$TILT= no
##$TM1= 0
##$TM2= 0
##$TOPLEV= 0
##$USERP1= <user>
##$USERP2= <user>
##$USERP3= <user>
##$USERP4= <user>
##$USERP5= <user>
##$WDW= 1
##$XDIM= 131072
##$YMAX_p= 380852105
##$YMIN_p= -11270
##$CURPLOT= <Network HP LaserJet P1505>
##$CURPRIN= <$Network HP LaserJet P1505>
##$DFORMAT= <normdp>
##$LAYOUT= <+/1D_H.xwp>
##$LFORMAT= <normlp>
##$PFORMAT= <normpl>
##$SURQMSG= 1
$$ End of Bruker specific parameters
$$ ---------------------------------
##NTUPLES= NMR SPECTRUM
##VAR_NAME=  FREQUENCY,     SPECTRUM/REAL,   SPECTRUM/IMAG
##SYMBOL=    X,             R,               I
##VAR_TYPE=  INDEPENDENT,   DEPENDENT,       DEPENDENT
##VAR_FORM=  AFFN,          ASDF,            ASDF
##VAR_DIM=   131072,        131072,          131072
##UNITS=     HZ,            ARBITRARY UNITS, ARBITRARY UNITS
##FACTOR=    0.0627417313425164, 1,          1
##FIRST=     8223.62146879497, 2213,         -58081
##LAST=      0,             2918,            -58797
##MIN=       0,             -11270,          0
##MAX=       8223.62146879497, 380852105,    0
$$ Real data points
##PAGE= N=1
##DATA TABLE= (X++(R..R)), XYDATA
$$ [...]
63852A257314J8509J3868R504M833o16o346j1281j5171j8955k3437k8218l2429
63840A167575l5803l8451m0162m0786m0920m1297m1656m1132l9695l8269l7294
63829G32110l6069l3985l1519k9523k7979k6160k3746k1159j8929j7147j5580
63818D50314j4059j2635j1545j0924j0584j0116r366q566p903p179o118m870l927
63805C32522l563l577l550l227k670k142j903j988k257k608l077l661m183m387
63791B89729m199l785l446l343l267k818j948j245j318j981k415k199j673j237
63777B54855q00k89j40o96j426j435o68J0Ll75o12p97j303k021k407k138j445
63760B38316p39k39P1L00N35P53P54L17m60j057r37j09Q50J409J596J708J714
$$ plain form
63852 1257314 1275823 1289691 1299195 1304028 1303412 1297066 1285785 1270614 1251659 1228222 1200004 1167575
63840 1167575 1131772 1093321 1053159 1012373 971453 930156 888500 847368 807673 769404 732110
63829 732110 696041 662056 630537 601014 573035 546875 523129 501970 483041 465894 450314
63818 450314 436255 423620 412075 401151 390567 380451 371085 362519 354616 347437 341319 336449 332522
63805 332522 328959 325382 321832 318605 315935 313793 311890 309902 307645 305037 301960 298299 294116 289729
63791 289729 285530 281745 278299 274956 271689 268871 266923 265678 264360 262379 259964 257765 256092 254855
63777 254855 254055 253766 253626 252930 251504 250069 249401 249411 249414 249039 248427 247630 246327 244306 241899 239761 238316
63760 238316 237577 237338 237409 237709 238244 238997 239751 240068 239608 238551 237614 237505 238355 239764 241360 243068 244782
63743B44782J263L60l47j94P67J882K615K912L015L149L403L705L917L995M042
63728B79266M111M103M029M103M447M826M936M817M715M661M501M195L822L343
63714C39875K711K106J723J319L99j082k566l478l722l473k887k123j430r94q63
63699C25515r86j098o82N04J812K153J307L40L96J450K580L120L083K705K125
63684C44324J487R50M93j2m91o83m60k6K91L10J27K8K60P97J427K037K653L121
63666C56633L050K325J421Q76O68L60k61j061j988l111m232m880m903m745m811
63651C35341m877m457l604l016l185l763l934l321k294j413p71n8R15K009K986
63636C06558L740M222M334M010L350K638K319K784L935M991N157M594M387N271
$$ plain form
63743 244782 246045 246405 246058 245864 246631 248513 251128 254040 257055 260204 263607 267312 271229 275224 279266
63728 279266 283377 287480 291509 295612 300059 304885 309821 314638 319353 324014 328515 332710 336532 339875
63714 339875 342586 344692 346415 347734 348133 347051 344485 341007 337285 333812 330925 328802 327372 326378 325515
63699 325515 324529 323431 322749 323253 325065 327218 328525 328865 329261 330711 333291 336411 339494 342199 344324
63684 344324 345811 346761 347254 347242 346751 346068 345608 345582 345873 346183 346310 346338 346598 347395 348822 350859 353512 356633
63666 356633 359683 362008 363429 364305 364973 365333 365072 364011 362023 358912 354680 349800 344897 340152 335341
63651 335341 330464 326007 322403 319387 316202 312439 308505 305184 302890 301477 300706 300648 301563 303572 306558
63636 306558 310298 314520 318854 322864 326214 328852 331171 333955 337890 342881 348038 352632 357019 362290
63622C62290O750P788Q097Q278Q867R737J0521J1179J1984J3201J4978J7306J9895
63609E10871K2225K3906K5072K6195K7512K8656K9031K8506K7476K6044K3470
63598G98964J8918J2783O679J857j862n226q078r502r301q634q934j0572j2783
63585G64309j4661j5974j7133j8547k0067k1138k1481k1338k0947k0050j8304
63574E54669j5958j3662j1667r711p633n632l833k033q5J917L811N401O218N821
63560E07623M581L664L826M652N311N704O422P878R997J2585J5462J8396K1355
63547F27456K4722K8766L3019L6642L9437M1817M3673M3855M1132L5198K6563
63536A022280J6021M773n299j2336j5692j6116j4853j2953j1367j0937j1901j3698
$$ plain form
63622 362290 369040 376828 384925 393203 402070 411807 422328 433507 445491 458692 473670 490976 510871
63609 510871 533096 557002 582074 608269 635781 664437 693468 721974 749450 775494 798964
63598 798964 817882 830665 837344 839201 837339 832113 824035 814533 805232 796598 787664 777092 764309
63585 764309 749648 733674 716541 697994 677927 656789 635308 613970 593023 572973 554669
63574 554669 538711 525049 513382 503671 496038 490406 486573 484540 484455 486372 490183 495584 501802 507623
63560 507623 512204 515868 519694 524346 529657 535361 541783 549661 559658 572243 587705 606101 627456
63547 627456 652178 680944 713963 750605 790042 831859 875532 919387 960519 995717 1022280
63536 1022280 1038301 1043074 1037775 1025439 1009747 993631 978778 965825 954458 943521 931620 917922
63524I17922j5722j8051k1114k4773k8173l0528l1711l2084l2013l1660l0952
63513F21141k9568k7285k4384k1569j9240j7146j4890j2587j0688r386q534q039
63501D17825p960q155q145p511o258m789l575k864k551k327k022j703j378q14
63487C57773Q4R41J351J489J880K575L103L271L430L756L810L220K445K294K908
63472C94330L614L706L015J794L38j119k405l355l762l482k720k020j818k048
63458C84068k292k185j606p25K8K78K14M80J328K211K606K803L398M239M669M715
63442D04229N263O828Q793J0218J0912J1390J2278J4093J7178K1260K5369K8736
63430E76547L1490L3971L5470L4426L0062K3344J6124R720M606J037n91l1K483
$$ plain form
63524 917922 902200 884149 863035 838262 810089 779561 747850 715766 683753 652093 621141
63513 621141 591573 564288 539904 518335 499095 481949 467059 454472 443784 434398 425864 417825
63501 417825 409865 401710 393565 386054 379796 375007 371432 368568 366017 363690 361668 359965 358587 357773
63487 357773 357857 358798 360149 361638 363518 366093 369196 372467 375897 379653 383463 386683 389128 391422 394330
63472 394330 397944 401650 404665 406459 406797 405678 403273 399918 396156 392674 389954 387934 386116 384068
63458 384068 381776 379591 377985 377260 377288 377566 377780 378260 379588 381799 384405 387208 390606 394845 399514 404229
63442 404229 409492 416320 425113 435331 446243 457633 469911 484004 501182 522442 547811 576547
63430 576547 608037 642008 677478 711904 741966 765310 781434 791154 795760 796797 796206 796175 798658
63417G98658O302J0695J5112J9332K3344K7012K9772L0803K9589K6315K1575J5811
63405A054320R210K223m121q759j1455j2861j3685j4137j4335j4814j6201j8456
63393I36929k0949k3267k5579k8077l0405l1939l2346l1696l0208k8226k6182
63382F28055k4292k2318j9936j7250j4619j2046r206o151l547j897r04J12J382
63369D97383K703M097N880Q047J0066J1584J2967J4796J7060J9243K1155K3169
63357F48150K5574K8077L0292L2360L4617L6746L7747L6981L4801L1830K8010
63346A005185K2800J6262R329K962k558p230j0692j2486j2832j2714j3051j4064
63334I70911j5440j6916j8597k0773k3532k6457k8789k9949k9893k8869k6930
$$ plain form
63417 798658 804960 815655 830767 850099 873443 900455 930227 961030 990619 1016934 1038509 1054320
63405 1054320 1063530 1065753 1061632 1052873 1041418 1028557 1014872 1000735 986400 971586 955385 936929
63393 936929 915980 892713 867134 839057 808652 776713 744367 712671 682463 654237 628055
63382 628055 603763 581445 561509 544259 529640 517594 508388 502237 498690 496793 495889 496001 497383
63369 497383 500086 504183 510063 518110 528176 539760 552727 567523 584583 603826 624981 648150
63357 648150 673724 701801 732093 764453 799070 835816 873563 910544 945345 977175 1005185
63346 1005185 1027985 1044247 1053576 1056538 1053980 1046750 1036058 1023572 1010740 998026 984975 970911
63334 970911 955471 938555 919958 899185 875653 849196 820407 790458 760565 731696 704766
63323G04766k4011k0352j6523j2930r555o299l307q36Q89J375j81m139r657j5126
63309E84114j9433k2451k4265k4457k2661j9474j6246j3855j2074j0211q066n971
63297C84950m236k923k093j844k032k298k488k879l652m421m582m033l234k576
63283C41659k034j512j183j244j547j746j658j310p90l32k98p37j015l60J109
63268C27002K330K519K027J749J952K180K114J997K157K492K673K604K574L024
63254C59394M183N690O716O674N885N152M782M484M335N032O800Q692R663R907
63240D47389J0383J1352J2328J3306J5017J7619K0119K1560K2190K2918K4148
63229F38329K5595K6834K7495K7320K6560K6039K6270K6800K6896K6530K6158
$$ plain form
63323 704766 680755 660403 643880 630950 621395 615096 611789 610953 611842 613217 613036 608897 599240 584114
63309 584114 564681 542230 517965 493508 470847 451373 435127 421272 409198 398987 390921 384950
63297 384950 380714 377791 375698 373854 371822 369524 367036 364157 360505 356084 351502 347469 344235 341659
63283 341659 339625 338113 336930 335686 334139 332393 330735 329425 328635 328303 328005 327268 326253 325893 327002
63268 327002 329332 331851 333878 335627 337579 339759 341873 343870 346027 348519 351192 353796 356370 359394
63254 359394 363577 369267 375983 382657 388542 393694 398476 402960 407295 412327 419127 427819 437482 447389
63240 447389 457772 469124 481452 494758 509775 527394 547513 569073 591263 614181 638329
63229 638329 663924 690758 718253 745573 772133 798172 824442 851242 878138 904668 930826
63218I30826K5929K5731K5751K6198K6540K5857K3968K1531J8950J5825J1651
63207A178757O455N50n769j2105j8063k3623k8847l3089l5279l5310l4485l4007
63195I25185l3552l1902k8623k4485k0419j6654j2861q745m435m38K863N691Q620
63182G60245J1750J4528J6570J8118J9513K0646K1365K1850K2134K1771K0613
63171I69103J9441J9032J8966J8106J6159J3861J1694R335O474L373J76l677q863
63158A093180j5285k1966k7601l1208l2761l3343l4164l5278l5637l4555l2522
63147G58860l0361k8261k5982k3531k1003j8164j4869j1702r636q970q973q674
63135E48734p670o248m899l866l015k095j094j81N98J324J848J884J627J831K894
$$ plain form
63218 930826 956755 982486 1008237 1034435 1060975 1086832 1110800 1132331 1151281 1167106 1178757
63207 1178757 1185212 1185762 1179993 1167888 1149825 1126202 1097355 1064266 1028987 993677 959192 925185
63195 925185 891633 859731 831108 806623 786204 769550 756689 747944 743509 743071 745934 751625 760245
63182 760245 771995 786523 803093 821211 840724 861370 882735 904585 926719 948490 969103
63171 969103 988544 1007576 1026542 1044648 1060807 1074668 1086362 1095697 1102171 1105544 1105720 1102043 1093180
63158 1093180 1077895 1055929 1028328 997120 964359 931016 896852 861574 825937 791382 758860
63147 758860 728499 700238 674256 650725 629722 611558 596689 584987 575351 566381 557408 548734
63135 548734 541064 534816 529917 526051 523036 520941 519847 519666 520264 521588 523436 525320 526947 528778 531672
63120E31672M259N132N440N612N647N130M147L471L591M074M156L632K911K465
63106E91339K430K620K702K466J982J432P96Kp16r76q31p46q86p85j02P68J238
63089F02733J389J760K390K678K233J428Q66P18P65Q04P69O85P14J166K197L596
63073F26891M959N974O515O694O985P993R776J1572J2573J2858J3246J4299J5900
63060G56235J7848K0285K3338K6691K9943L3136L6560M0183M3669M6924N0214
63049A125026N3645N6888N9596O1844O3868O5549O6439O6366O5731O5138O4837
63038A814927O4610O4147O3329O2236O1026N9863N8844N7776N6089N3026M8067
63027B463940M1125L2366K1954J0039l039j6643l0083m2952n5122o6329p5820
$$ plain form
63120 531672 535931 541063 546503 552115 557762 562892 567039 570510 574101 578175 582331 585963 588874 591339
63106 591339 593769 596389 599091 601557 603539 604971 605767 605769 605053 604077 603246 602500 601614 600829 600727 601495 602733
63089 602733 604122 605882 608272 610950 613183 614611 615477 616195 616960 617764 618533 619218 619932 621098 623295 626891
63073 626891 631850 637824 644339 651033 658018 666011 675787 687359 699932 712790 726036 740335 756235
63060 756235 774083 794368 817706 844397 874340 907476 944036 984219 1027888 1074812 1125026
63049 1125026 1178671 1235559 1295155 1356999 1420867 1486416 1552855 1619221 1684952 1750090 1814927
63038 1814927 1879537 1943684 2007013 2069249 2130275 2190138 2248982 2306758 2362847 2415873 2463940
63027 2463940 2505065 2537431 2559385 2569424 2566385 2549742 2519659 2476707 2421585 2355256 2279436
63016B279436q2659q6410q7348q5980q2600p7428p0856o3288n4941m6087l7257
63005A504582k8819k0484j1825l207M369J0439J5531K0239K4463K7930L0850L3460
62993A607528L5349L5998L5783L5732L6266L6782L6517L5313L3401L0963K8161
62982A987793K5083K1299J5834Q000j691j1786k1000k9046l6468m3858n1240n8028
62970A804892o3479o7086o8665o8357o6663o4280o1531n8118n3734m8836m4430
62959A139713m1075l8468l6020l3468l0836k8279k6176k4936k4407k3775k2426
62948H09847k0714j9426j8793j8350j7731j7038j6378j5468j4029j2329j1003
62937F28588j0384j0132r613q511p006n527m427l865l719l584l069k210j503j304
$$ plain form
63016 2279436 2196777 2110367 2023019 1937039 1854439 1777011 1706155 1642867 1587926 1541839 1504582
63005 1504582 1475763 1455279 1443454 1440247 1444616 1455055 1470586 1490825 1515288 1543218 1574068 1607528
62993 1607528 1642877 1678875 1714658 1750390 1786656 1823438 1859955 1895268 1928669 1959632 1987793
62982 1987793 2012876 2034175 2050009 2058009 2056318 2044532 2023532 1994486 1958018 1914160 1862920 1804892
62970 1804892 1741413 1674327 1605662 1537305 1470642 1406362 1344831 1286713 1232979 1184143 1139713
62959 1139713 1098638 1060170 1024150 990682 959846 931567 905391 880455 856048 832273 809847
62948 809847 789133 769707 750914 732564 714833 697795 681417 665949 651920 639591 628588
62937 628588 618204 608072 598459 589948 582942 577415 572988 569123 565404 561820 558751 556541 555038 553734
62923E53734j438j557j691k017k332k228j810j643j911k153k080k086k505k898
62909E25385k636j959j742k290k967l132k894k719k695k533k059j450r68o61l24
62894D94356K89J113J689J525O56l26q57r18q48p52l72M24J193J284O78J75N11
62877D99820J437J980J607P28j8n68j225j959k401k388k100j704j267j028j328
62862D89586k075k647k581k073j581j116l75O07J347J588J674K034K507K559K048
62847D91502J414J006O06r1q04r26m71j96n97j188j164n85l09q06j505j549q79
62830D83458j97k6j74j34K87R31J593K106K255J951J587J825K800L780L974L503
62814E09519L216L552M083M327M471M930N585N961N957N871N792N517N177N370
$$ plain form
62923 553734 552296 550739 549048 547031 544699 542471 540661 539018 537107 534954 532874 530788 528283 525385
62909 525385 522749 520790 519048 516758 513791 510659 507765 505046 502351 499818 497759 496309 495341 494680 494356
62894 494356 494645 495758 497447 498972 499628 499302 498445 497527 496679 495927 495555 495979 497172 498456 499134 499309 499820
62877 499820 501257 503237 504844 505572 505554 504986 503761 501802 499401 497013 494913 493209 491942 490914 489586
62862 489586 487511 484864 482283 480210 478629 477513 477138 477745 479092 480680 482354 484388 486895 489454 491502
62847 491502 492916 493922 494528 494437 493633 492707 492236 492040 491443 490255 489091 488506 488197 487391 485886 484337 483458
62830 483458 483261 483235 483061 482927 483214 484145 485738 487844 490099 492050 493637 495462 498262 502042 506016 509519
62814 509519 512735 516287 520370 524697 529168 534098 539683 545644 551601 557472 563264 568781 573958 579328
62800E79328O372P685Q708R467J0267J0941J1106J1128J2007J4142J6760J9002
62788G16913K1081K3751K7056L0420L3851L8195M3920N0370N6684O2840O9243
62777A174324P5762Q1884Q7544R3011R8083J02108J04765J05981J05074J00938
62767B129474R3436Q3728P2719N9852M4196K6172P374j0984k8555m4983n9496
62756B372933p1592q1500q9629r5933j00036j01725j01205r9085r6060r2355q7484
62745A356329q1035p3606o6584o0893n6297n1969m7334m2320l7280l2871k9612
62734G76528k7253k4916k2014j8787j5791j3248j1146r570q560p835p063o208
62722F04137n379m481l304j855l50J057K355L578M853O353Q017R471J0529J1616
$$ plain form
62800 579328 585700 593385 602093 611560 621827 632768 643874 655002 667009 681151 697911 716913
62788 716913 737994 761745 788801 819221 853072 891267 935187 985557 1042241 1105081 1174324
62777 1174324 1250086 1331970 1419514 1512525 1610608 1712716 1817481 1923462 2028536 2129474
62767 2129474 2222910 2306638 2379357 2439209 2483405 2509577 2516951 2505967 2477412 2432429 2372933
62756 2372933 2301341 2219841 2130212 2034279 1934243 1832518 1731313 1632228 1536168 1443813 1356329
62745 1356329 1275294 1201688 1135104 1074211 1017914 965945 918611 876291 839011 806140 776528
62734 776528 749275 724359 702345 683558 667767 654519 643373 633803 625243 617408 610345 604137
62722 604137 598758 594277 590973 589118 588768 589825 592180 595758 600611 606964 614981 624452 634981 646597
62708F46597J3422J6181J9520K2938K6169K9213L2326L5943M0302M5118M9890
62697I77619N4515N9288O4290O9036P2965P6029P8521Q0385Q0888P9157P4925
62686A767618O8695O1001N1776M0636K7721J3819m78j5192l0145m4194n5895o4841
62674A820521p1743p7183q0914q2517q2125q0142p6830p2556o8057o3860n9665
62663A004929n4845m9488m4425m0245l6768l3531l0346k7216k4080k0957j8127
62652F24901j5849j4044j2505j1263j0467r988r474q840q408q372q358p761o494
62639D93078n106m110l380k420j047L45J189J229O08l12j129j627j922k316k847
62624D70233l129k786j955j191q97r80j051p59j4R85J893K586L327M414N677O612
$$ plain form
62708 646597 660019 676200 695720 718658 744827 774040 806366 842309 882611 927729 977619
62697 977619 1032134 1091422 1155712 1224748 1297713 1373742 1452263 1532648 1613536 1692693 1767618
62686 1767618 1836313 1897314 1949090 1989726 2017447 2031266 2030788 2015596 1985451 1941257 1885362 1820521
62674 1820521 1748778 1671595 1590681 1508164 1426039 1345897 1269067 1196511 1128454 1064594 1004929
62663 1004929 950084 900596 856171 815926 779158 745627 715281 688065 663985 643028 624901
62652 624901 609052 595008 582503 571240 560773 550785 541311 532471 524063 515691 507333 499572 493078
62639 493078 487972 483862 480482 478062 477015 477360 478549 479778 480386 480074 478945 477318 475396 473080 470233
62624 470233 467104 464318 462363 461172 460275 459295 458244 457485 457471 458456 460349 462935 466262 470676 476353 482965
62608D82965P037P279P643Q051Q418R046J0250J1744J2970J3964J5539J8388K2298
62595F35592K6436L0243L3780L7294M0761M3970M6820M9345N1360N2301N1564
62584A099466M9008M4905L9503L2840K5088J6780Q379j44r066j8199k6734l3830
62572A227996l9133m2768m5020m6168m6415m5904m4786m3348m1854m0246l8099
62561G54255l4978l0915k6486k2537j9613j7585j5881j4137j2508j1249j0207
62550E38159r092p995p214o692o034n079m037l010j957j139j025j451j531p53
62536D81150L06Q69J023J330J746J737J303J125J630K526L354M007M572N197O303
62521E18178Q370J1246J4079J6230J7981K0055K2835K6312L0331L4435L7809M0033
$$ plain form
62608 482965 490002 497281 504924 512975 521393 530439 540689 552433 565403 579367 594906 613294 635592
62595 635592 662028 692271 726051 763345 804106 848076 894896 944241 995601 1047902 1099466
62584 1099466 1148474 1193379 1232882 1265722 1290810 1307590 1315969 1315825 1306759 1288560 1261826 1227996
62572 1227996 1188863 1146095 1101075 1054907 1008492 962588 917802 874454 832600 792354 754255
62561 754255 719277 688362 661876 639339 619726 602141 586260 572123 559615 548366 538159
62550 538159 529067 521072 513858 507166 501132 496053 492016 489006 487049 485910 484885 483434 481903 481150
62536 481150 481456 482325 483348 484678 486424 488161 489464 490589 492219 494745 498099 502106 506678 511875 518178
62521 518178 526548 537794 551873 568103 586084 606139 628974 655286 685617 720052 757861 797894
62509G97894M1730M3870M6404M8211M8537M7791M6545M4305M0051L3785K6755
62498A265878K0026J3501O676j75o126j0587j3581j5167j5188j3596j0578o171
62486A214912l39O419J3032J8772K3906K9071L4305L9041M2739M5020M5261M2593
62474A554732L6505K7445J6797O296l002j1514k0677l1345m2787n3387o1976o8087
62462A349000p1468p2245p1386p0032o8271o5176o0272n4229m7926m1624l5439
62451F90932k9887k5314k1286j7264j3454j0403q015n775l668k123j069J49J679
62438E54502K795K977K744K909L432L601L112K262J249j40j888l463m552n638
62424E63902p269r023r792r215q182p767q049q347q208p640o737n622m702m417
$$ plain form
62509 797894 839624 883494 929898 978109 1026646 1074437 1120982 1165287 1205338 1239123 1265878
62498 1265878 1285904 1299405 1306081 1305906 1299780 1289193 1275612 1260445 1245257 1231661 1221083 1214912
62486 1214912 1214573 1220992 1234024 1252796 1276702 1305773 1340078 1379119 1421858 1466878 1512139 1554732
62474 1554732 1591237 1618682 1635479 1641775 1638773 1627259 1606582 1575237 1532450 1479063 1417087 1349000
62462 1349000 1277532 1205287 1133901 1063869 995598 930422 870150 815921 767995 726371 690932
62451 690932 661045 635731 614445 597181 583727 573324 565309 559534 555866 553743 552674 552823 554502
62438 554502 557297 560274 563018 565927 569359 572960 576072 578334 579583 579443 577555 574092 569540 563902
62424 563902 556633 547610 537818 528603 520421 512654 504605 496258 488050 480410 473673 468051 463349 458932
62410D58932m633m724m373l877l542l203k624j963j574j550j726j933j942j466
62396D19802m96N21J181J641K348L338M168M467M224L591K780K183K193K738L303
62381D57982L581L872M567N444N884N636N155N073N628O679P971R173R895R984
62367E46524R835J0045J0780J1750J2839J4370J6591J9297K2276K5807L0230L5187
62355G65531L9887M4046M7994N1702N4326N5027N3824N1239M7418M2053L5008
62344A288055K6678J7822R333J904m454j0414j6460k2085k6313k8995l1017l3078
62332A170976l4850l5650l5494l4874l3784l1701k8636k5552k3378k2019k0832
62321H44206j9791j9501k0119k0853k0880k0306j9815j9680j9540j9006j8060
$$ plain form
62410 458932 454299 449575 445202 441325 437783 434580 431956 429993 428419 426869 425143 423210 421268 419802
62396 419802 419306 419827 421008 422649 424997 428335 432503 436970 441194 444785 447565 449748 451941 454679 457982
62381 457982 461563 465435 470002 475446 481330 486966 492121 497194 502822 509501 517472 526645 536540 546524
62367 546524 556359 566404 577184 588934 601773 616143 632734 652031 674307 700114 730344 765531
62355 765531 805418 849464 897458 949160 1003486 1058513 1112337 1163576 1210994 1253047 1288055
62344 1288055 1314733 1332555 1341888 1343792 1339338 1328924 1312464 1290379 1264066 1235071 1204054 1170976
62332 1170976 1136126 1100476 1064982 1030108 996324 964623 935987 910435 887057 865038 844206
62321 844206 824415 804914 784795 763942 743062 722756 702941 683261 663721 644715 626655
62310F26655j6819j5358j3866j2613j1649j0658r258p394n346l515k212j527j325
62297E15115j361j358j040l31M23P55Q07J336K627L768L706K721K112K392K723
62282E34395K324J576J215J159Q46L17J75O64J378J906K207K376K454K613L171
62267E58776M300N890P692R509J1315J3299J5742J8726K2065K5730K9991L4961
62255G57996M0143M4812M8724N2108N4962N6750N6952N5594N3025M9243M3754
62244A314063L6153K6828J6847P161j890j0254j7704k4174l0174l6290m2251m7076
62232A191239n0230n1960n2360n0907m7456m3059l9081l5775l2327k8110k3369
62221G36605j8767j4839j1797r475p433n362l339j541O2J458K363K558K217J578
$$ plain form
62310 626655 609836 594478 580612 567999 556350 545692 536434 529040 523694 520179 517967 516440 515115
62297 515115 513754 512396 511356 511025 511448 512203 513010 514346 516973 520741 524447 527168 529280 531672 534395
62282 534395 536719 538295 539510 540669 541515 541832 542007 542671 544049 545955 548162 550538 552992 555605 558776
62267 558776 563076 568966 576658 586167 597482 610781 626523 645249 667314 693044 723035 757996
62255 757996 798139 842951 891675 943783 998745 1055495 1112447 1168041 1221066 1270309 1314063
62244 1314063 1350216 1377044 1393891 1401052 1399162 1388908 1371204 1347030 1316856 1280566 1238315 1191239
62232 1191239 1141009 1089049 1036689 985782 938326 895267 856186 820411 788084 759974 736605
62221 736605 717838 702999 691202 681727 674294 668932 665593 664052 664114 665572 667935 670493 672710 674288
62207F74288O80k93p64m73n7m06j584k962m061m790n063m899m630m408l688j978
62191F34912J39J513J925K214K960L921M850N919P054P708P672P403P148O544
62177G01882N459M521M145L756K701J534J575L325N994Q610J1078J4052J8052
62164G86684K2832K7554L1616L5232L8899M2290M4051M2996L9187L3712K7588
62153A172641K1149J4288P071J05n758j0297j4264j8515k2880k6512k9209l1610
62141A056209l3853l4908l3837l1086k7940k5064k2190j8928j5306j1694q611
62130G92792o453n065l790k248q03J00O28J137J523J577J794K973N075P101Q231
62115H04572Q572Q637Q649Q564Q384Q117P526O246M095J260j759m325n881o115
$$ plain form
62207 674288 674968 674675 673911 673438 673381 672975 671391 668429 664368 659578 654515 649616 644986 640578 636890 634912
62191 634912 635051 636564 638489 640703 643663 647584 652434 658353 665407 673115 680787 688190 695338 701882
62177 701882 707341 711862 716007 719763 722464 723998 725573 728898 734892 743502 754580 768632 786684
62164 786684 809516 837070 868686 903918 942817 985107 1029158 1072154 1111341 1145053 1172641
62153 1172641 1193790 1208078 1215149 1215254 1209496 1199199 1184935 1166420 1143540 1117028 1087819 1056209
62141 1056209 1022356 987448 953611 922525 894585 869521 847331 828403 813097 801403 792792
62130 792792 786339 781274 777484 775236 774433 774533 775161 776298 777821 779398 781192 784165 789240 796341 804572
62115 804572 813144 821781 830430 838994 847378 855495 863021 869267 873362 874622 872863 868538 862657 856542
62101H56542n064l206j308j3N29N12M5p69j479j463o39M81J554K667L699M104
62085H56192L819L779M824O519P726Q091Q226Q723R751J1496J3993J6494J7889
62072I77522J8103J8278J9183K0100J9883J8632J7601J7646J8399J9054J9431
62061A183832J9953K0890K1932K2587K2640K2073K0655J8006J4136R612M945Q9
62049A381350n144j0392j4922j8542k1901k5742l0074l4272l7752m0371m2210
62038A100028m3211m3220m2374m1258m0374l9503l7871l5066l1473k7758k4227
62027F93693k0940j8080j5830j4096j2723j1787j1332j1028j0535j0027r903j0039
62015E37373r798q851p602o702o424o487o271n219l310j176N08J642K530L278
$$ plain form
62101 856542 851478 848272 846964 846951 847480 847992 848037 847268 845789 844326 843687 844168 845722 848389 852088 856192
62085 856192 860011 863790 868614 875133 882859 890950 899176 907899 917650 929146 943139 959633 977522
62072 977522 995625 1013903 1033086 1053186 1073069 1091701 1109302 1126948 1145347 1164401 1183832
62061 1183832 1203785 1224675 1246607 1269194 1291834 1313907 1334562 1352568 1366704 1376316 1381261 1381350
62049 1381350 1376206 1365814 1350892 1332350 1310449 1284707 1254633 1220361 1182609 1142238 1100028
62038 1100028 1056817 1013597 971223 929965 889591 850088 812217 777151 745678 717920 693693
62027 693693 672753 654673 638843 624747 612024 600237 588905 577877 567342 557315 547412 537373
62015 537373 527575 518724 511122 504420 497996 491509 485238 480019 476709 475533 476041 477683 480213 483491
62001D83491L820M345N141N952O082N339M407M008M001L666K661J432O15K86j31
61986E35115j186k776m311n414o153o571o479n909n303m868m220l208k513k759
61972D73445l385l284k297j237n27J35P31P10P3l50k08k69j115k003j870q70j04
61955D57575j87p98j369j480p75P90K627L981M667N064N489O047O872Q014R202
61940E05719J0166J1081J2245J3450J4239J4690J5334J6243J6802J6606J6031
61929F62606J5605J5158J4128J2434J0618R032P308M888J936p06k519l953n652
61916G40883p310p884o952n334m024l007j511Q81L799O579Q738J0143J1013J1727
61902G57741J2289J2173J0932Q743O037K914o48m173o921q723j0087j1484j2876
$$ plain form
62001 483491 487311 491656 496797 502749 508831 514170 518577 522585 526586 530252 532913 534345 534960 535246 535115
61986 535115 533929 531153 526842 521428 515275 508704 502225 496316 491013 486145 481925 478717 476204 473445
61972 473445 470060 466776 464479 463242 462715 462850 463581 464291 464364 464014 463806 463537 462422 460419 458549 457679 457575
61955 457575 457388 456590 455221 453741 452966 453756 456383 460364 465031 470095 475584 481631 488503 496517 505719
61940 505719 515885 526966 539211 552661 566900 581590 596924 613167 629969 646575 662606
61929 662606 678211 693369 707497 719931 730549 739581 746889 751777 753713 753007 750488 746535 740883
61916 740883 733573 725689 718737 713403 709379 706372 704861 705742 709541 716120 724858 735001 746014 757741
61902 757741 770030 782203 793135 801878 807915 810829 810181 806008 799087 790364 780277 768793 755917
61889G55917j3967j4492j4217j3119j1628j0335r437q762q318q339q778r303r826
61876F15396j0559j1336j1511j0772r583q448p180n403l356j736q74m73k5Q38
61862E34978K192L702M835N574O706Q935J1905J4565J6407J7844J9386K1104K2963
61849F91096K5057K7190K8709K9234K9199K9215K9128K8194K6038K2952J9293
61838I85305J5117J0552N955J528k868p071j0184j1317j0700r515q520p254m845
61825I46183j202K850O421R080J0701J1179J0494Q754O002K137k789q256j3454
61812I88100j7832k1398k4422k6936k8636k9231k8783k7613k6007k4172k2305
61801G10765k0456j8381j5895j3484j2132j2145j2492j1750r675p351n854n271
$$ plain form
61889 755917 741950 727458 713241 700122 688494 678159 668722 659960 651642 643303 634525 625222 615396
61876 615396 604837 593501 581990 571218 561635 553187 546007 540604 537248 535512 534638 534165 534140 534978
61862 534978 537170 540872 545707 551281 557987 566922 578827 593392 609799 627643 647029 668133 691096
61849 691096 716153 743343 772052 801286 830485 859700 888828 917022 943060 966012 985305
61838 985305 1000422 1010974 1016929 1018457 1015589 1008518 998334 987017 976317 966802 958282 951028 946183
61825 946183 944981 947831 954252 963332 974033 985212 995706 1004460 1010462 1012599 1009810 1001554 988100
61812 988100 970268 948870 924448 897512 868876 839645 810862 783249 757242 733070 710765
61801 710765 690309 671928 656033 642549 630417 618272 605780 594030 584355 577004 571150 565879
61789E65879n096m991m770m150l091k191k107k666k993k604j905j468j289j115
61775E25443j029j296j793k126k233k367k431j864n16P61R31N8o85l65P50J786
61759E13024K379K792L148L175K881K887L585M221L569J580l25j009j060j884
61745E38963l644n010m984m075l282k702j893j096j130k094l002k921j952q01
61731E00377J11P99J335J684J802J712J593J788K454L129L114K417J881K083K605
61716E28884K788K723K909L227L001K001P51k29r30j514k061k703l524m161m109
61701E27053l526l212l494l755l484l168l515m257m491m006l492l462l648l607
61687D75936l322k990k681k431k352k409k364k091j678j176o43m90j222k582l513
$$ plain form
61789 565879 560783 555792 551022 546872 543781 541590 539483 536817 533824 531220 529315 527847 526558 525443
61775 525443 524414 523118 521325 519199 516966 514599 512168 510304 509788 510549 511480 511538 510853 510488 511238 513024
61759 513024 515403 518195 521343 524518 527399 530286 533871 538092 541661 543241 542916 541907 540847 538963
61745 538963 535319 530309 525325 521250 517968 515266 513373 512277 511147 509053 506051 503130 501178 500377
61731 500377 500488 501287 502622 504306 506108 507820 509413 511201 513655 516784 519898 522315 524196 526279 528884
61716 528884 531672 534395 537304 540531 543532 545533 546284 546055 545125 543611 541550 538847 535323 531162 527053
61701 527053 523527 520315 516821 513066 509582 506414 502899 498642 494151 490145 486653 483191 479543 475936
61687 475936 472614 469624 466943 464512 462160 459751 457387 455296 453618 452442 451799 451309 450087 447505 443992
61672D43992l333k575k167k237k253k041j842j607r81j18L07P3k36j30J30J55
61656D25137J27L31N28L92K58P51J768K483K408J940J699J806K017K096J908J399
61640D47048P57L94N44R90J312J290J018O76K90k97j177k029k262j718j045j004
61624D44787j551k041k213k423k823l040k935l006l517l796l063j676q51j246
61610D10606k418l621m500m983n072m979n004n118m947m307l432k579j799j223
61596C56624j154j630k220k533k631k696k675k505k412k561k668k339j687j200
61582C25713j130j315j551j753j845j819j855k056k151j873j465j336j314q06
61568C03444J60P70N38o7m38n93o92l83N70J514J573R15M57M08J15n06m75Q42
$$ plain form
61672 443992 440659 438084 435917 433680 431427 429386 427544 425937 424956 424838 425145 425218 424982 424852 424982 425137
61656 425137 425264 425595 426123 426515 426773 427524 429292 431775 434183 436123 437822 439628 441645 443741 445649 447048
61640 447048 447805 448199 448743 449733 451045 452335 453353 454029 454319 454022 452845 450816 448554 446836 445791 444787
61624 444787 443236 441195 438982 436559 433736 430696 427761 424755 421238 417442 414379 412703 411852 410606
61610 410606 408188 404567 400067 395084 390012 385033 380029 374911 369964 365657 362225 359646 357847 356624
61596 356624 355470 353840 351620 349087 346456 343760 341085 338580 336168 333607 330939 328600 326913 325713
61582 325713 324583 323268 321717 319964 318119 316300 314445 312389 310238 308365 306900 305564 304250 303444
61568 303444 303604 304374 304912 304845 304407 303814 303122 302739 303309 304823 306396 307311 307768 308176 308291 307785 307310 308152
61550C08152K596L458L166K401J605P31J0n0N34J033R36N99P39J601K782L644
61534C33937L769L252K659K410K245J563L51p05j148j358j888k570k789k392j885
61519C35451j686j651j455j097q23p00n32j72K78N42M39L2m52q26j083j316j539
61502C23410j616j426j015n63j83J38L56L04o6m53m59m2N07R84J393J620J384
61485C24273P53L40N84J109J180O29j05o24p69k69J091K839L946L888L167K574
61469C44606K289J963J287K21r98j812j724r74m56n89p12r8Q99J277Q03K38K51
61452C46471O88J029J030P37K89r8k11o1J92N10R33J344J600J893K509L169L106
61435C65130K047P46J82N29J213J756K115K332K265J818J216Q23P64Q38Q69R90
$$ plain form
61550 308152 310748 314206 317372 319773 321378 322109 322119 322069 322603 323636 324572 325171 325910 327511 330293 333937
61534 333937 337706 340958 343617 346027 348272 349835 350186 349481 348333 346975 345087 342517 339728 337336 335451
61519 335451 333765 332114 330659 329562 328739 328039 327507 327335 327613 328155 328594 328626 328174 327348 326265 324949 323410
61502 323410 321794 320368 319353 318790 318607 318745 319101 319405 319339 318886 318427 318385 318892 319876 321269 322889 324273
61485 324273 325026 325366 325950 327059 328239 328868 328763 328139 327370 327101 328192 331031 334977 338865 342032 344606
61469 344606 346895 348858 350145 350366 349368 347556 345832 344858 344402 343813 343101 343003 343902 345179 345982 346220 346471
61452 346471 347159 348188 349218 349955 350244 350146 349935 349874 350066 350576 351509 352853 354453 356346 358855 362024 365130
61435 365130 367177 367923 368105 368634 369847 371603 373718 376050 378315 380133 381349 382172 382936 383774 384643 385633
61419C85633J480K268K855K831K336J815J452J128Q46P72Q23N75k14j191j752
61404D01657j648j154p94r68j633k243k168j369m71j07l02o77r31r80q09n55n15
61387C84333q08j087r45m38R7O30J352K073K219J638R14O38P69J002J330J784
61371C95501J965J485P12M53Q27J058O04q6k61J90Q55J509K186K801L209L528
61355D16536L948M314M368M362M924O242P800R022R755J0023R780R113Q300P376
61341E15863O047M295K719J917J835K076K557L341M057M053L152J827N55o17j772
61326E51905k719l162l098k854k789k959l064k771k070j220l33Q08K329L951N316
61311E37270O431P489Q400Q919R202R861J1331J3296J4927J5504J4967J3914J3012
$$ plain form
61419 385633 387113 389381 392236 395067 397403 399218 400670 401798 402644 403416 404239 404814 404600 403409 401657
61404 401657 400009 398855 398061 397093 395460 393217 391049 389680 389209 389102 388800 388123 387192 386212 385403 384848 384333
61387 384333 383525 382438 381493 381055 381152 381782 383134 385207 387426 389064 389978 390616 391385 392387 393717 395501
61371 395501 397466 398951 399663 400116 400943 402001 402605 402519 402258 402448 403303 404812 406998 409799 413008 416536
61355 416536 420484 424798 429166 433528 438452 444694 452494 461516 471271 481294 491074 500187 508487 515863
61341 515863 521910 526205 528924 530841 532676 534752 537309 540650 544707 548760 551912 553739 554294 553677 551905
61326 551905 549186 546024 542926 540072 537283 534324 531260 528489 526419 525199 524866 525674 528003 531954 537270
61311 537270 543701 551190 559590 568509 577711 587572 598903 612199 627126 642630 657597 671511 684523
61298F84523J2241J0787P909L807n52m320p238r374j0819j1631j1849j1562j1117
61285F40805j1095j1658j2058j1260r138o686m956m120l667l153k495j764r33
61272E57822J77J617L006L682L499L222L658M549M863M282L720M135N381O651
61258F10264P676Q875J0464J1868J2165J0978Q839O757N351M398L275J687q9j578
61244G00930k464k708k584k560k851l209l411l726m337m581l546j501J02L71k
61229F63923J71J133K343L522M827O199P206P482P048O300N841O032O524O589
61215G35140O144N874O084O104N359M425M176M393M124L184K281J724J021L1m16
61200G89648M72K368M317N955P810J0459J3710J6652J8412J8894J8713J8420J7982
$$ plain form
61298 684523 696764 707551 715460 719267 718715 714395 707157 697783 686964 675333 663484 651922 640805
61285 640805 629710 618052 605994 594734 585596 578910 573954 569834 566167 563014 560519 558755 557822
61272 557822 557999 559616 562622 566304 569803 573025 576683 581232 586095 590377 594097 598232 603613 610264
61258 610264 617940 626815 637279 649147 661312 672290 681129 687886 693237 697635 700910 702597 702508 700930
61244 700930 698466 695758 693174 690614 687763 684554 681143 677417 673080 668499 664953 663452 663554 663925 663923
61229 663923 664094 665227 667570 671092 675919 682118 689324 696806 703854 710154 715995 722027 728551 735140
61215 735140 741284 747158 753242 759346 764705 769130 773306 777699 781823 785007 787288 789012 790033 790064 789648
61200 789648 790120 792488 796805 802760 810570 821029 834739 851391 869803 888697 907410 925830 943812
61187I43812J7042J5345J2753R254N436K452R68L27n72j835k719l089l743n191
61173I90240o953q405r641j0981j2239j2956j3129j3202j3532j4139j4774j5157
61161H45132j5262j5402j5810j6158j5919j5135j4304j3509j2307j0566q684o810
61149F85266m572j969K75J653K471K932K398L77k373m603o027p130p944q013p367
61134F45374o490n343l416q77J291K596L689N350P555R837J1989J3944J5523J6752
61120G17774J8058J9724K1528K3199K4858K6630K8196K9154K9573K9753K9740
61109I98187K9440K8991K8550K7847K6392K4023K1057J7895J4752J1674Q528N083
61097A242419J260k808p052j1637j6588k1464k5650k8841l1031l2218l2470l2115
$$ plain form
61187 943812 960854 976199 988952 998206 1003642 1006094 1007062 1007389 1006817 1004982 1002263 999174 995431 990240
61173 990240 983287 974882 965241 954260 942021 929065 915936 902734 889202 875063 860289 845132
61161 845132 829870 814468 798658 782500 766581 751446 737142 723633 711326 700760 692076 685266
61149 685266 680694 678725 679000 680653 683124 686056 688454 688831 686458 681855 675828 668698 660754 652741 645374
61134 645374 638884 633541 630125 629248 630539 633135 636824 642174 649729 659566 671555 685499 701022 717774
61120 717774 735832 755556 777084 800283 825141 851771 879967 909121 938694 968447 998187
61109 998187 1027627 1056618 1085168 1113015 1139407 1163430 1184487 1202382 1217134 1228808 1237336 1242419
61097 1242419 1243679 1240871 1233819 1222182 1205594 1184130 1158480 1129639 1098608 1066390 1033920 1001805
61085A001805l1553l0908l0022k8729k6979k4910k2955k1549k0577j9382j7629
61074G26612j5719j4035j2229r893p497n895n071m217k980j818j042l61M17R23
61060F47195Q84O40P24J317K377L842N443O857Q140R617J1124J2123J2708J3745
61046G36736J5620J7583J8878J9794K0946K2275K3438K4666K6257K7735K8361
61035I82289K8279K8287K8691K9148K9402K9389K8887K7939K7399K8134K9794
61024A297638L1307L2443L3837L5498L6518L6519L6298L6719L7910L9946M3388
61013A698021M8599N5285O3167P2338Q2645R3612J05425J19184J35935J56644
61003B630855J83765K21421K72956L39322M21364N22752O48623Q00483R72522
$$ plain form
61085 1001805 970252 939344 909322 880593 853614 828704 805749 784200 763623 744241 726612
61074 726612 710893 696858 684629 674736 667239 661344 656273 652056 649076 647258 646216 645855 646272 647195
61060 647195 648079 648719 649443 650760 653137 656979 662422 669279 677419 687036 698160 710283 722991 736736
61046 736736 752356 769939 788817 808611 829557 851832 875270 899936 926193 953928 982289
61035 982289 1010568 1038855 1067546 1096694 1126096 1155485 1184372 1212311 1239710 1267844 1297638
61024 1297638 1328945 1361388 1395225 1430723 1467241 1503760 1540058 1576777 1614687 1654633 1698021
61013 1698021 1746620 1801905 1865072 1937410 2020055 2113667 2219092 2338276 2474211 2630855
61003 2630855 2814620 3036041 3308997 3648319 4069683 4592435 5241058 6041541 7014063
60994G014063J152608J327456J489491J639619J777997J884505J908206J787392
60986A9981337J494469J068723O04737K05011o3072j79176j61660o3086L0212
60977B2917495J6949j74133n41046j004740j450454j782058j953478j968326j862004
60968A2198205j681542j469625j255606j055233q76062p21800n92852m86355l98415
60959C660715l26403k68785k23769j89087j62590j42193j25654j11216r8307q7062
60949A925649p7349o8685o0789n3730m7616m2575l8848l6496l5114l4138l3332
60938A396977l2714l2225l1640l0654k8901k6208k3066k0379j8403j6335j3433
60927A123019j0146p506n696l943j747M29J904K556K764L031L809N237O770P521
$$ plain form
60994 7014063 8166671 9494127 10983618 12623237 14401234 16285739 18193945 19981337
60986 19981337 21475806 22544529 23149266 23354277 23291205 23112029 22950369 22887283 22917495
60977 22917495 22934444 22760311 22219265 21214525 19764071 17982013 16028535 14060209 12198205
60968 12198205 10516663 9047038 7791432 6736199 5860137 5138337 4545485 4059130 3660715
60959 3660715 3334312 3065527 2841758 2652671 2490081 2347888 2222234 2111018 2012711 1925649
60949 1925649 1848300 1779615 1718826 1665096 1617480 1574905 1536057 1499561 1464447 1430309 1396977
60938 1396977 1364263 1332038 1300398 1269744 1240843 1214635 1191569 1171190 1152787 1136452 1123019
60927 1123019 1112873 1105367 1099671 1095728 1093981 1094410 1096314 1098870 1101634 1104665 1108474 1113711 1120481 1128002
60913A128002P283O871P098P724P873P248O339N475M326K640R21j66q60k108m285
60898A184381o667q407r596j0956j2812j4808j6440j7448j7747j7522j7292j7472
60886A017214j7807j7715j7173j6742j6645j6497j6166j6192j6867j7469j7032
60875H30909j5550j3812j2416j1542j1409j2054j2728j2351j0825r193q283p798
60863F92948p103o272n775n626n474n329n457n674n370m424l567l523m117m559
60849F20678m417m022l939m301m715m722m275l710l339l155l068l343m417o246
60835E63009q048q980q892q228p379o468n618n031m628m040l128k226j660j264
60821D87419o24L13J119J272N15r33k267k454j131Q61K185K293J743J249Q77K98
$$ plain form
60913 1128002 1135285 1142156 1149254 1156978 1164851 1172099 1178438 1183913 1188239 1190879 1191800 1191634 1190774 1188666 1184381
60898 1184381 1177714 1169307 1159711 1148755 1135943 1121135 1104695 1087247 1069500 1051978 1034686 1017214
60886 1017214 999407 981692 964519 947777 931132 914635 898469 882277 865410 847941 830909
60875 830909 815359 801547 789131 777589 766180 754126 741398 729047 718222 709029 700746 692948
60863 692948 685845 679573 673798 668172 662698 657369 651912 646238 640868 636444 632877 629354 625237 620678
60849 620678 616261 612239 608300 603999 599284 594562 590287 586577 583238 580083 577015 573672 569255 563009
60835 563009 554961 545981 537089 528861 521482 515014 509396 504365 499737 495697 492569 490343 488683 487419
60821 487419 486795 487108 488227 489499 490014 489081 486814 484360 483229 484090 486275 488568 490311 491560 492437 492735
60805D92735n23j230j475j197o16j12j9l21o26n78l04k63p18j462k117k551k927
60788D75696l362l679l617l211k845k820l049l273l372l298k908k244j827k184
60774D34007l107l785l786l423k999k269j083m3J97RM49J757K899K919K103J459
60758D25304J410J557J513J426J621K137K713K970K615J728R35Q96J488J881J575
60743D51769R81O91O04K61l42r16j615k788m055m546m234m163m867n457m899l544
60727D12880k580k430k617k876l342l788l689l180k962l060k598j237L4J43o77
60712C78021j372j469j317j308j478j739j863j475n55J72j5q37j296r87n41o12
60696C61329j010j071n17M23J406K224K771L131L538M027M232L787K931K392K609
$$ plain form
60805 492735 492212 490982 489507 488310 487694 487582 487563 487242 486616 486038 485734 485471 484753 483291 481174 478623 475696
60788 475696 472334 468655 465038 461827 458982 456162 453113 449840 446468 443170 440262 438018 436191 434007
60774 434007 430900 427115 423329 419906 416907 414638 413555 413512 413709 413718 414167 415924 418823 421742 423845 425304
60758 425304 426714 428271 429784 431210 432831 434968 437681 440651 443266 444994 445929 446825 448313 450194 451769
60743 451769 452750 453441 454045 454306 453964 453048 451433 448645 444590 440044 435810 431647 426780 421323 416424 412880
60727 412880 410300 407870 405253 402377 399035 395247 391558 388378 385416 382356 379758 378521 378555 378698 378021
60712 378021 376649 375180 373863 372555 371077 369338 367475 366000 365445 365617 365602 364765 363469 362482 361941 361329
60696 361329 360319 359248 358731 359154 360560 362784 365555 368686 372224 376251 380483 384270 387201 389593 392202
60681C92202L307L981M466M866N142N204N266N591N863N351L985K775K741L646
60667D54386M294L863K505Q32o27j536j871k095k722l598m040l726l018k306j568
60652D38773q29m89p63j181j060k72O93J238R94m1j406k431k867l103l504l875
60636D19877l843l474l159l057l003k878k675k302j587n22O02J313J203L17o15
60621C96197o93K10J209J370O12m35j088q97K41J758K564K099J048N51Q68J293
60605D06907J218O54j58j067j795j991j660j142n62L41J580K494K317J088k94
60590D07930q66l63P89K006K967L541L573L019K157J391P52k0q22j080m69N83
60574D25088J395J754J901K169K913M443O618Q728J0218J1251J2231J3082J3449
$$ plain form
60681 392202 395509 399490 403956 408822 413964 419168 424434 430025 435888 441239 445224 447999 450740 454386
60667 454386 458680 462543 465048 465880 465253 463717 461846 459751 457029 453431 449391 445665 442647 440341 438773
60652 438773 437944 437455 436692 435511 434451 434179 434872 436110 437104 437063 435657 433226 430359 427256 423752 419877
60636 419877 416034 412560 409401 406344 403341 400463 397788 395486 393899 393377 393979 395292 396495 396812 396197
60621 396197 395504 395714 396923 398293 398905 398470 397382 396485 396726 398484 401048 403147 404195 404746 405614 406907
60605 406907 408125 408779 408621 407554 405759 403768 402108 400966 400404 400745 402325 404819 407136 408224 407930
60590 407930 407064 406701 407490 409496 412463 416004 419577 422596 424753 426144 426896 426876 426054 424974 424505 425088
60574 425088 426483 428237 430138 432307 435220 439663 446281 455009 465227 476478 488709 501791 515240
60561E15240J3383J3206J2896J2101J0652Q587N811K299j396m402o323p394p892
60548E66768p837p232o144m589k715r66M02J808L769O023P840R163J0703J2859
60534E89852J5190J7116J8433J8966J8358J6510J3794J0626P233L899Q93j891
60522G28979m654o989q186q361q479q965r125q320o936n645m476l319k619k694
60508F40211k839k044l28J432K827M266O100Q253J0763J3947J7801K1825K5680
60495G47894K9667L4265L9492M4821M9481N2756N4213N3841N1798M8093M2655
60484A248976L5600K7157J7434O486n258j7005k7990l7698m5707n1636n5309n6836
60472A038214n6475n4498n1243m7129m2602l8123l4029l0283k6504k2525j8822
$$ plain form
60561 515240 528623 541829 554725 566826 577478 586065 591876 594175 592779 588377 582054 574660 566768
60548 566768 558931 551699 545555 540966 538251 537285 537687 539495 543264 549287 557127 566290 576993 589852
60534 589852 605042 622158 640591 659557 677915 694425 708219 718845 726078 729977 730870 728979
60522 728979 724325 717336 709150 700789 692310 683345 674220 665900 658964 653319 648843 645524 642905 640211
60508 640211 637372 635328 635000 636432 639259 643525 649625 657878 668641 682588 700389 722214 747894
60495 747894 777561 811826 851318 896139 945620 998376 1052589 1106430 1158228 1206321 1248976
60484 1248976 1284576 1311733 1329167 1335653 1330395 1313390 1285400 1247702 1201995 1150359 1095050 1038214
60472 1038214 981739 927241 875998 828869 786267 748144 714115 683832 657328 634803 615981
60461F15981j6141j4653j3753j2729j1425j0231r513r201q827q001o838n827n260
60448D83582m899m379l709l165k810k452k045j821j936k195k243j897j271o67
60434D48093l88n41r30j220j246j151j206j464j585j068J23J238J372N34k29k9
60418D40303Q11J237Q41K19R0M83R74J239J208Q72K93k95n36j74Q37K179L242
60401D53823L547L210K737K364J878J219P54P26Q17P19Q01J552K568K796J967
60386D81478J084J146J930K487K421K109J929J899K007K305K589K452J851J235
60372E08922J002J116J408J861K422K782K639K048J390J067J226J565J460O07
60358E31515m15o62Q6J177K057K802L581M292N070O381Q059Q977Q472P549P679
$$ plain form
60461 615981 599840 585187 571434 558705 547280 537049 527536 518335 509508 501507 494669 488842 483582
60448 483582 478683 474304 470595 467430 464620 462168 460123 458302 456366 454171 451928 450031 448760 448093
60434 448093 447705 447164 446234 445014 443768 442617 441411 439947 438362 437294 437417 438655 440027 440561 440332 440303
60418 440303 441114 442351 443192 443411 443501 443984 444958 446197 447405 448277 448570 448275 447739 447565 448402 450581 453823
60401 453823 457370 460580 463317 465681 467559 468778 469532 470258 471075 471794 472595 474147 476715 479511 481478
60386 481478 482562 483708 485638 488125 490546 492655 494584 496483 498490 500795 503384 505836 507687 508922
60372 508922 509924 511040 512448 514309 516731 519513 522152 524200 525590 526657 527883 529448 530908 531515
60358 531515 531100 530438 530524 531701 533758 536560 540141 544433 549503 555884 563943 572920 581392 588941 596620
60343E96620Q778R335Q416O512M392K167k82k738m951o868q270q768q417p877
60329E88049p619p489p218o866o517o004n235m355l428k418j646j600k046k043
60315E23565j169j33L70P68J932L871N833P406Q833J0394J2108J3958J5975J8091
60301F21802K0310K2807K5389K7056K6552K3478J8484J2491O027p02p477j3857
60289G82360j9124k2531k3825k3435k1953j9647j6721j3751j1435r920q772p621
60277E83625o549n893n759n802n424m419l449l515m717n930n997m964l742k912
60263E14553k344j849j587j731k092k265j975j276n33q4J13L15N00L72k4j46K86
60246E00233Q54J133J306J647J783J213K39k94j36J45O8k09k87l1M51R30J172
$$ plain form
60343 596620 605398 614733 623149 629661 634053 636220 635938 633200 628249 621381 613111 604343 595926 588049
60329 588049 580430 572941 565723 558857 552340 546336 541101 536746 533318 530900 529254 527654 525608 523565
60315 523565 522396 522263 522633 523401 525333 529204 535037 542443 551276 561670 573778 587736 603711 621802
60301 621802 642112 664919 690308 717364 743916 767394 785878 798369 804396 803694 796217 782360
60289 782360 763236 740705 716880 693445 671492 651845 635124 621373 609938 600018 591246 583625
60277 583625 577076 571183 565424 559622 554198 549779 546330 542815 538098 532168 526171 521207 517465 514553
60263 514553 512209 510360 508773 507042 504950 502685 500710 499434 498901 498817 498930 499245 499745 500117 500093 499947 500233
60246 500233 501087 502220 503526 505173 506956 508169 508408 508114 507978 508123 508191 507982 507695 507664 508115 509045 510217
60229E10217J196J420K210L366M328M794M836M633M439M539M833M738M008L343
60215E62900L555M401N059N523O547Q209R512R732R346R131R107Q912Q667Q773
60201F69374R136R115Q204O450M344K522J433J042R50Q26O39M30J34l42j102k284
60185G10871l840n295o100o254o255o404o557o506o157n337m004k786k608l510
60171F39258m353m169l279k645k516k327j726j039p03p12p25m91l3M14N63L68
60155F15885J08J40N28R91J200J148J181J657K552L460M016M195M214M343M958
60140F50576O366Q344J0109J1149J1788J2626J3704J4756J5838J6966J7374J6114
60128H05710J3432J0641Q413O078K933n64l468n456o654o974o345n236m293l599
$$ plain form
60229 510217 511413 512833 515043 518409 522737 527531 532367 537000 541439 545978 550811 555549 559557 562900
60215 562900 566455 570856 575915 581438 587985 596194 605706 615438 624784 633915 643022 651934 660601 669374
60201 669374 678510 687625 695829 702279 706623 709145 710578 711620 712570 713396 714035 714465 714599 714257 713155 710871
60185 710871 707031 701736 695636 689382 683127 676723 670166 663660 657503 652166 648162 645376 642768 639258
60171 639258 634905 630736 627457 624812 622296 619969 618243 617204 616501 615789 615064 614573 614540 614954 615517 615885
60155 615885 615993 616133 616661 617652 618852 620000 621181 622838 625390 628850 632866 637061 641275 645618 650576
60140 650576 656942 665286 675395 686544 698332 710958 724662 739418 755256 772222 789596 805710
60128 805710 819142 829783 838196 844274 847207 846643 843175 837719 831065 824091 817746 812510 808217 804618
60114H04618k900k262j987k009j937j699j695k239l108l721l738l516l918n394
60100G64495p212q035p389o067n011m356l796l208k473j286K28J290J570J946
60086G20696L395N484O918P346P649Q480R510J0303J0947J1441J1245R882P502
60073H30798M371L53m596r702j3735j6025j6887j7128j7378j7776j7927j7276
60061F87092j5718j3833j2342j1300j0076q212o095m616m186m293m153l487k473
60048E86308j197K91J605K317K794L968N945P545P840P479P694Q447Q578P538
60034F57152N922M264K457N99o22r73j321k618m727o797q279r069r144q740q525
60019F09579q919r521r668r265q513p229n251l252k294k543l131l336l164k758
$$ plain form
60114 804618 801718 799456 797469 795460 793523 791824 790129 787890 784782 781061 777323 773807 769889 764495
60100 764495 757283 749248 741859 735792 730781 726425 722629 719421 716948 715662 715890 717180 718750 720696
60086 720696 724091 729575 736493 743839 751488 759968 769478 779781 790728 802169 813414 823296 830798
60073 830798 835169 835522 830926 821224 807489 791464 774577 757449 740071 722295 704368 687092
60061 687092 671374 657541 645199 633899 623823 615611 609516 604900 600714 596421 592268 588781 586308
60048 586308 585111 585402 587007 589324 592118 596086 602031 609576 617416 624895 632589 641036 649614 657152
60034 657152 663074 667338 669795 670394 669772 668799 667478 664860 660133 653336 645057 635988 626844 618104 609579
60019 609579 600660 591139 581471 572206 563693 556464 551213 547961 545667 543124 539993 536657 533493 530735
60005E30735k001j102o67q79j104p88j82K48O17J260K029K572K966L420L668L346
59989E44138K839K974L851M673M880M789M903N138N046M352L026J237m81j416
59975E89949j402j058j029j342j725k093k284j701Q9K593M776O185P192Q238R353
59960F15741J0453J1583J2640J3243J3082J2128J0374P717M273N54k886n697p608
59947F95597q411q306p928p625o989n535l717k700l022m008m704m941n057m997
59933F17657m370l342k733k932l270k881j771n42N62J692K725L292L525M025M949
59918F16586N779O271O954Q277R801J0800J1261J1762J2591J3446J3853J3533
59906G40914J2557J1421J0613R875Q294N568K656O43o23k107m151o187p625q275
$$ plain form
60005 530735 528734 527632 526965 526086 524982 524194 524012 524260 524877 526137 528166 530738 533704 537124 540792 544138
59989 544138 546977 549951 553802 558475 563355 568144 573047 578185 583231 587583 590609 591846 591365 589949
59975 589949 588547 587489 586460 585118 583393 581300 579016 577315 577404 579997 584773 590958 598150 606388 615741
59960 615741 626194 637777 650417 663660 676742 688870 699244 706961 711234 711788 708902 703205 695597
59947 695597 687186 678880 670952 663327 656338 650803 647086 644386 641364 637356 632652 627711 622654 617657
59933 617657 613287 609945 607212 604280 601010 598129 596358 595816 596378 598070 600795 604087 607612 611637 616586
59918 616586 622365 628636 635590 643867 653668 664468 675729 687491 700082 713528 727381 740914
59906 740914 753471 764892 775505 785380 793674 799242 801898 802541 801918 799811 795660 789473 781848 773573
59892G73573q030o923n429m071k731j019P94J954K356K723L565M625N576O517
59878G73480P512Q170Q108P426O594O085O148O495O307N024L119J516M19p21k118
59863H43564l437m678o363q535j0359j1139j1110j0945j0984j1201j1417j1266
59851G32130j0508r411q381p195n344l027r66P98K794M756N673N535N697O781
59837G19332P517O566M407K471J325Q11J000J858K607K522J808P63j150m220p293
59822G40324r030r809j0885j2108j2104j0605q930p994p303o280n257m624m077
59809F31318l330k735k665k884l016l052l054k906k573k235j946j658j520j621
59795E96123j577j053n95j083k260k780j888k90R22J335R52j97j660k520k343
$$ plain form
59892 773573 765543 758620 753191 749120 746389 745370 746164 748118 750474 753197 756762 761387 766963 773480
59878 773480 780992 789162 797270 804696 811290 817375 823523 830018 836325 841349 844468 845984 846403 845682 843564
59863 843564 840127 835449 829086 820551 810192 799053 787943 776998 766014 754813 743396 732130
59851 732130 721622 712211 703830 696635 691291 688264 687298 688096 690890 695646 701319 706854 712551 719332
59837 719332 726849 733415 737822 740293 741618 742429 743429 745287 747894 750416 752224 752987 751837 747617 740324
59822 740324 731294 721485 710600 698492 686388 675783 666853 658859 651556 645276 640019 635395 631318
59809 631318 627988 625253 622588 619704 616688 613636 610582 607676 605103 602868 600922 599264 597744 596123
59795 596123 594546 593493 592898 591815 589555 586775 584887 584597 585519 586854 587806 587609 585949 583429 581086
59780E81086j660j133p98n19n29r77j398j246o36r6J39K30L83P94J634K790L865
59763E81929M607N155N653O056O494P377Q886J0644J2172J3357J4305J5156J6137
59750G07928J7392J8546J9029J9007J9357K0286K0696J9489J6989J4387J2116
59739I05222R612O437K920m52l558o386q701j0211j0877j1005j1067j1347j1576
59726H39011j1140r881q527p943q073q124p704p302p484q118q650q757q422p618
59712G21268o403n241m691m647m336l232j738o15j14jj74o48j082r49l03K72O01
59695F87967J158K089K689K391J687J385J388R53r5j126j644j726j594j330j111
59680F93081j235j730k346k809k880k414j796k010l603n772p107p157o596o070
$$ plain form
59780 581086 579426 578293 577495 576976 576447 575470 574072 572826 572190 572094 572233 572463 572846 573640 575274 578064 581929
59763 581929 586536 591691 597344 603400 609894 617271 626157 636801 648973 662330 676635 691791 707928
59750 707928 725320 743866 762895 781902 801259 821545 842241 861730 878719 893106 905222
59739 905222 914834 921271 924191 923739 920181 913795 905094 894883 884006 873001 861934 850587 839011
59726 839011 827871 817990 809463 801520 793447 785323 777619 770317 762833 754715 746065 737308 728886 721268
59712 721268 714865 709624 704933 700286 695950 692718 690980 690365 690251 690250 690076 689428 688346 687397 687094 687366 687967
59695 687967 689125 691214 693903 696294 697981 699366 700754 701707 701612 700486 698842 697116 695522 694192 693081
59680 693081 691846 690116 687770 684961 682081 679667 677871 675861 672258 666486 659379 652222 645626 639556
59666F39556n611n170m788m239l239k101j387r07k4J046J297O65M34J415K732
59651F19679L267L318L819M598M588L457J943O64n35j915l251m170m592m722m815
59636F21333n044n299n157m278k823j379m87l42p52j296j693k128l005m233n102
59621E78315n036m178l153k449k213k310k399k187j768j474j347j130p69m35K3
59606E47490J035K439L300L063K316J938J898J528O58k40q67j420j979k129j457
59591E57573k22P23O56l21j355j630j071k27L82N25O9r53k061k585k366j926j752
59574E43459j804j799j657j531j627k024k460k438j843j184p66r5J164K119J682
59559E29196M08o9N03O67k16p93L2J181J077J04j69M97R27O49O21J659L395N043
$$ plain form
59666 639556 633945 628775 623987 619748 616509 614408 613021 612114 612090 613136 614433 615098 615532 616947 619679
59651 619679 622946 626264 630083 634681 639269 642726 644669 645333 644798 642883 639632 635462 630870 626148 621333
59636 621333 616289 610990 605833 601555 598732 597353 596866 596524 595772 594476 592783 590655 587650 583417 578315
59621 578315 573279 569101 565948 563499 561286 558976 556577 554390 552622 551148 549801 548671 547902 547467 547490
59606 547490 548525 550964 554264 557327 559643 561581 563479 565007 565665 565425 564558 563138 561159 559030 557573
59591 557573 557351 558074 558730 558409 557054 555424 554353 554126 554508 555033 555102 554149 552088 549503 547137 545211 543459
59574 543459 541655 539856 538199 536668 535041 533017 530557 528119 526276 525092 524326 524231 525395 527514 529196
59559 529196 529604 529535 530038 530705 530489 529696 529728 530909 531986 532090 531921 532418 533345 533994 534615 536274 539669 544712
59541E44712O346P501Q766J0347J2203J3855J4839J5225J5340J5080J3887J1318
59529F89419P332K455k060m729n049l935k485q84R44K362K614K001J389Q01n19
59514F89656k732n003o559p368p783q175q882r878j0565j0437r864r503r204q300
59500E75403o813n469m572l703k600j549p74k18K6k28o75p50m62k49j8Q00K139
59483E50288L070L091K776K889L484M271N143N952O314O073N575N210N051N085
59469F14272N296N374M902M003L253K774K032Q52j4K09J276K279K815L388M777
59454F57488P120R611J1147J1463J1377J1575J1547J0405Q411O718N593L934R06
59441G67295k836o047q272r818j0917j1528j1628j1239j0369r168p877o494m903
$$ plain form
59541 544712 551058 558559 567325 577672 589875 603730 618569 633794 649134 664214 678101 689419
59529 689419 696751 699206 697146 692417 687368 683433 680948 680064 681008 683370 685984 687985 689374 690175 689656
59514 689656 686924 681921 675362 667994 660211 652036 643154 633276 622711 612274 602410 592907 583703 575403
59500 575403 568590 563121 558549 554846 552246 550697 549923 549705 549731 549503 548828 548078 547616 547367 547349 548149 550288
59483 550288 553358 556449 559225 562114 565598 569869 575012 580964 587278 593351 598926 604136 609187 614272
59469 614272 619568 624942 629844 633847 637100 639874 641906 642758 642744 642953 644229 646508 649323 652711 657488
59454 657488 664608 674219 685366 696829 708206 719781 731328 741733 750144 756862 762455 766389 767295
59441 767295 764459 758412 750140 740322 729405 717877 706249 695010 684641 675473 667596 661102 656199
59428F56199l343k285j656q10O36K544M893P853J0943J3122J4217J5493J8003
59415G35809K1080K3204K3823K3507K2847K2044K1252K0268J7944J2931N286l181
59403I46814j0293j4808j6411j5239j1871p341k648J652N122O857N594P53o638
59390H81543j4234j9805k2517k2896k1879k0065j7719j5007j2138r465p430o149
59378F92239n114l729k073p84j09M13J221K157K824L153L407L878M741N915O966
59363G15105P421P281O931O591O254O179O850Q259R704J0629J1191J1755J2340
59350H26490J2895J3722J5152J7024J8785J9957K0350J9998J9115J7879J6208
59339A017575J3975J1431R005O589L524n11n026r255j2714j5182j6681j7705j8797
$$ plain form
59428 656199 652856 650571 648915 648105 648741 651285 656178 664031 674974 688096 702313 717806 735809
59415 735809 756889 780093 803916 827423 850270 872314 893566 913834 931778 944709 949995 946814
59403 946814 936521 921713 905302 890063 878192 870851 868203 869855 874977 881834 887428 888181 881543
59390 881543 867309 847504 824987 802091 780212 760147 742428 727421 715283 705818 698388 692239
59378 692239 687125 683396 681323 680539 680430 680843 682064 684221 687045 690198 693605 697483 702224 708139 715105
59363 715105 722526 729807 736738 743329 749583 755762 762612 770871 780575 791204 802395 814150 826490
59350 826490 839385 853107 868259 885283 904068 924025 944375 964373 983488 1001367 1017575
59339 1017575 1031550 1042981 1051986 1058575 1062099 1061588 1056562 1047307 1034593 1019411 1002730 985025 966228
59326I66228j9762j9823j8853j7680j6831j5762j3864j1553r611q070o481m852
59314H03086l541k548j664j033q20n58L56J611K203J739Q35K14M5K50P78J375
59298H02328J673J788K355L650N071N816N844N755N782N315L475L8m424r087j3275
59283H22104j6302j7454j6484j3988j0816p271l246R75M653P377R383J1074J2697
59270G82702J4488J6442J7854J7820J6403J4610J2986J1015Q230N031J913j236
59258I18258m456p122q840j0194j1736j2839j2621j1420j0284r385q038o105m183
59245H01035k501p60Q51J558J259R13J289K022K340K130J902K100K722L291L086
59230H23237J747k59k072l300m089m569m825n263o275p475q000p649p072o730
$$ plain form
59326 966228 946466 926643 907790 890110 873279 857517 843653 832100 822489 814419 807938 803086
59314 803086 799545 796997 795333 794300 793480 792922 793278 794889 797092 798831 799666 799880 799925 800175 800953 802328
59298 802328 804001 805789 808144 811794 816865 822681 828525 834280 840062 845377 848852 848890 844466 835379 822104
59283 822104 805802 788348 771864 757876 747060 739789 736543 737518 742171 749548 758931 770005 782702
59270 782702 797190 813632 831486 849306 865709 880319 893305 904320 912550 917581 919494 918258
59258 918258 913802 906680 897840 887646 875910 863071 850450 839030 828746 819361 811323 805218 801035
59245 801035 798534 797774 798625 800183 801442 802355 803644 805666 808006 810136 812038 814138 816860 820151 823237
59230 823237 824984 824725 822653 819353 815264 810695 805870 800607 794332 786857 778857 771208 764136 757406
59216G57406o417n935n458m946m000k748k089k465l033k834k232k407l612m775
59202G04455m863l981k959k405k401k733l059k930k047o44N17P41J45l89o1J077
59186F78463K363L290L847M248M668N268O110O954P381P197O613N997N591N464
59172G53454N538N691N970O588P563Q536R222R765J0317J0501R769Q207O425M737
59158H62283L017J239m83k387m874p632r703j0767j1584j2741j3596j3195j1818
59145G67759j0789j0928j1763j2270j1857j0647r264q363q055p685o517m625k810
59132F52186j630q62nR93J762K090K266K805L897N159N986O165O102O328O963
59117G00205P706Q249Q487Q435Q216Q097Q285Q615Q642Q138P330O536N787N008
$$ plain form
59216 757406 750989 745054 739596 734650 730650 727902 725813 723348 720315 717481 715249 712842 709230 704455
59202 704455 699592 695611 692652 690247 687846 685113 682054 679124 677077 676433 676950 677691 677836 677447 677386 678463
59186 678463 680826 684116 687963 692211 696879 702147 708257 715211 722592 729789 736402 742399 747990 753454
59172 753454 758992 764683 770653 777241 784804 793340 802562 812327 822644 833145 842914 851121 857546 862283
59158 862283 865300 866539 866056 863669 858795 851163 841460 830693 819109 806368 792772 779577 767759
59145 767759 756970 746042 734279 722009 710152 699505 690241 681878 673823 666138 659621 654996 652186
59132 652186 650556 649694 649689 650682 652444 654534 656800 659605 663502 668661 674647 680812 686914 693242 700205
59117 700205 707911 716160 724647 733082 741298 749395 757680 766295 774937 783075 790405 796941 802728 807736
59103H07736M365M113M128L855K896J425j29j574k910l941m286l894l250k882
59089H05652k731k325j501p96r11j883l042l842m562n814p542q883r257r139r429
59074G33995j0213j0629r938q333o628n481n018m968m947m737m397m044l644l187
59060F47831k904k953l011k581j795j360j619k080k096j623j066p55q29j235j526
59045F20398j076J02J033P88l48j150q53J72J106J681K343L573N215O603P340
59030F46927P854Q946J0922J3485J6370J9496K2509K4787K6174K7157K7918K7779
59018H80324K5982K2556J7963J2376N918p35o653j1387j4950j7307j8416j8501
59006H77170j7764j6061j3404j0465p948n684l101l63J715K867L584M100M026
$$ plain form
59103 807736 812101 816214 820342 824197 827093 828518 828389 826815 823905 819964 815678 811784 808534 805652
59089 805652 802921 800596 799095 798299 797388 795505 792463 788621 784059 778245 770703 761820 752563 743424 733995
59074 733995 723782 713153 703215 694882 688254 682773 677755 672787 667840 663103 658706 654662 651018 647831
59060 647831 644927 641974 638963 636382 634587 633227 631608 629528 627432 625809 624743 623988 623159 621924 620398
59045 620398 619322 619424 620457 621245 620897 619747 618894 619066 620172 621853 624196 627769 632984 639587 646927
59030 646927 654781 663727 674649 688134 704504 724000 746509 771296 797470 824627 852545 880324
59018 880324 906306 928862 946825 959201 965119 964384 957731 946344 931394 914087 895671 877170
59006 877170 859406 843345 829941 819476 811528 805844 802743 802380 804095 806962 810546 814646 818672
58993H18672L250K443K181K199J918J290O11j43j232k571l668m193m352m542m816
58978H07047m698l667j757M35K408M253O288Q440J0276J1610J2678J3717J4591
58965H81621J4963J4649J3820J2883J2171J1617J0832R487P509M906J741j671
58953I94528m900p934j1136j4432j7053j8437j8941j9168j9045j8190j6787j5430
58941H13075j4238j2797j0887q654o203l540r20J332L239M945O165O480O064N472
58927G89533M804L673K088O06n23j792l652n804p464q142p974p527p292p180o584
58912G36770n182l492k293j674j073l8J448L244N125O779Q166R688J1558J3262
58898G82288J4271J4943J5941J7033J7410J7087J7044J7840J9013K0065K1230
$$ plain form
58993 818672 821922 824365 826546 828745 830663 831953 832564 832421 831189 828618 824950 820757 816405 811863 807047
58978 807047 802349 798682 796925 797360 799768 804021 810309 818749 829025 840635 853313 867030 881621
58965 881621 896584 911233 925053 937936 950107 961724 972556 982043 989552 994458 996199 994528
58953 994528 989628 981694 970558 956126 939073 920636 901695 882527 863482 845292 828505 813075
58941 813075 798837 786040 775153 766499 760296 756756 755836 757168 760407 765352 771517 777997 784061 789533
58927 789533 794337 798010 800098 800704 800181 798389 794737 788933 781469 773327 765353 757826 750534 743354 736770
58912 736770 731588 728096 725803 724129 723056 723018 724466 727710 732835 739614 747780 757468 769026 782288
58898 782288 796559 811502 827443 844476 861886 878973 896017 913857 932870 952935 974165
58887I74165K2790K4325K5091K4819K3867K2728K1431J9276J5423J0132M954J065
58875A190066k154o037j0571j4493j7178j9114k0516k0855k0062j8938j7877j6328
58863A005943j4066j1916j0526r424q083p043p015p521p391o193m501k997j957
58850I07310j302o82K47J227J384J31k324n510r123j2613j5094j6253j6808j7477
58836H13113j8050j7959j7284j6526j5775j4698j3088j0987q539o110m216k998
58824F66883k081j207n07P8J005K352L461L858L932M194M424M209L767L499L217
58809G01084K525J597Q90L83j90o67p48p23j146j943k546k826l295m271n453o369
58793F76302o848o958o773o311n549m538l479k496j328L21K093L228L689M295
$$ plain form
58887 974165 996955 1021280 1046371 1071190 1095057 1117785 1139216 1158492 1173915 1184047 1189001 1190066
58875 1190066 1187912 1181875 1171304 1156811 1139633 1120519 1100003 1079148 1059086 1040148 1022271 1005943
58863 1005943 991877 979961 969435 960011 951928 944885 937870 930349 922958 916765 912264 909267 907310
58850 907310 906008 905326 905573 906800 908184 908315 905991 900481 891358 878745 863651 847398 830590 813113
58836 813113 795063 777104 759820 743294 727519 712821 699733 688746 680207 674097 669881 666883
58824 666883 664802 663595 663088 663166 664171 666523 669984 673842 677774 681968 686392 690601 694368 697867 701084
58809 701084 703609 705206 706096 706479 706289 705622 704874 704151 703005 701062 698516 695690 692395 688124 682671 676302
58793 676302 669454 662496 655723 649412 643863 639325 635846 633350 632022 632343 634436 637664 641353 645648
58779F45648N396O181N889M985M354L932L056J775P63O7r71k529l860m362m329
58764F65995m304m225l607k261n56R75K033K734L443M444N634O595O876O224M720
58749F94720K776Q82p01j929k674k710k010p75Q27K640M247N117N183M937M829
58734G15359M822M692M408M156M157M494M916M905M324L745L708L885L615L066
58720G74252L076L889M902N723O524P252P382O799O172O029O101N821M843K978
58706H51743K92k589n051p402j0307j3403j5564j6688j7895j9664k1077k1398
58694G00997k1001k0166j8347j5485j2751j1077j0019q895p869p053n856m315
58682E58163l779m978o562o857o014n030l877k194q49q50j297l47K107M446N788
$$ plain form
58779 645648 651044 657225 663114 668099 672453 676385 679441 681216 681979 682046 681075 678546 674686 670324 665995
58764 665995 661691 657466 653859 651598 651042 652017 654050 656784 660227 664671 670305 676900 683776 690000 694720
58749 694720 697496 698378 697677 695748 693074 690364 688354 687579 688406 691046 695293 700410 705593 710530 715359
58734 715359 720181 724873 729281 733437 737594 742088 747004 751909 756233 759978 763686 767571 771186 774252
58720 774252 777328 781217 786119 791842 798366 805618 813000 819799 825971 832000 838101 843922 848765 851743
58706 851743 852035 849446 844395 836993 826686 813283 797719 781031 763136 743472 722395 700997
58694 700997 679996 659830 641483 625998 613247 602170 592151 583256 575387 568334 562478 558163
58682 558163 554384 549406 542844 535987 529973 524943 521066 518872 518023 517173 515876 515529 517636 522082 527870
58667E27870O758P884Q869R574J0329J1051J1199J0681R738Q029N037J374j575
58654F26818l361m770o303p504p927p763p252o379n420n011n406o179o709o529
58640E40305n398l582j822m68R95K949M736N493N351M972M423L397K096R07k56
58625E64098j392j791j067j58p2k61M90K090L526M632N933P124P415P169P507
58610F05243Q347Q434P312N799M405K878J325L05l59j381k541k914k692l076m169
58595F26916m618l842k983l015l231k461o21J557L495N013O386Q299J0875J2861
58581F54631J2969J1896J1533J2197J2310J0998R264Q127P385O849P127Q351R641
58568G83278J0748J2785J6313K0084K2795K4911K7536L0430L2408L2951L2299
$$ plain form
58667 527870 534628 542512 551381 560955 571284 582335 593534 604215 613953 621982 627019 628393 626818
58654 626818 623457 618687 612384 604880 596953 589190 581938 575559 570139 565128 559722 553543 546834 540305
58640 540305 534907 531325 529503 529035 530030 532979 537715 543208 548559 553531 557954 561351 563447 564354 564098
58625 564098 562706 560915 559848 559690 559618 559357 559847 561937 565463 570095 576028 583152 590567 597736 605243
58610 605243 613590 622024 629336 635135 639540 642418 643743 644048 643689 642308 639767 636853 634161 631085 626916
58595 626916 622298 618456 615473 612458 609227 606766 606145 607702 611197 616210 622596 630895 641770 654631
58581 654631 667600 679496 691029 703226 715536 726534 735798 743925 751310 758159 765286 773637 783278
58568 783278 794026 806811 823124 843208 866003 890914 918450 948880 981288 1014239 1046538
58557A046538L0462K7210K2707J7383J1513N451j06m559p789r823j0594j0361
58545A118032r796r401r238r302r697j0500j2089j5211j9858k4388k6920k7479
58533I34153k7501k7493k6630k4561k1859j8609j4338r817o999o373o039m359
58521G39575k036n99k02r5r6l77o89q05j061j699k325k593k658k541j986j325
58505G18488j400k167k546k114j732j952k194k136k478l489m108l562k605k230
58491F83775k193j759q20N78K658M981O340O554P203R423J2242J4259J5744J7727
58477G76712K0028K1686K2467K2501K1116J7526J2286O706J252m256r265j2592
58465H96167j3877j3906j3491j2726j1320r046n957k487Q26L866O843R655J1877
$$ plain form
58557 1046538 1077000 1104210 1126917 1144300 1155813 1161264 1161158 1156599 1148810 1138987 1128393 1118032
58545 1118032 1108236 1098835 1089597 1080295 1070598 1060098 1048009 1032798 1012940 988552 961632 934153
58533 934153 906652 879159 852529 827968 806109 787500 773162 763345 756346 749973 743934 739575
58521 739575 737539 736940 736738 736643 736547 736170 735481 734676 733615 731916 729591 726998 724340 721799 719813 718488
58505 718488 717088 714921 712375 710261 708529 706577 704383 702247 699769 696280 692172 688610 686005 683775
58491 683775 681582 679823 679003 679581 682239 687220 693560 700114 707317 716740 728982 743241 758985 776712
58477 776712 796740 818426 840893 863394 884510 902036 914322 921028 922280 918024 908759 896167
58465 896167 882290 868384 854893 842167 830847 821801 815844 813357 814183 818049 824892 834547 846424
58452H46424J3395J4292J4173J2508R621O317K567k170p301j1279j3576j4992
58440H69979j5799j5295j3596j1938j0580q345n007k227j005l3K100M720O530
58427G99504P703R102J0600J1669J2489J3281J3458J2487J0632Q048M387J20l265
58414I10215n322p268r663j1249j1268j1059j1828j2620j2162j1050j0411r850
58402G86465q555p046o070n034l274j525n74K96J803L050L086K707K902K950J927
58387G73108P11M83N83r6q19k60J120K006K502L418M369M587M629N292N938N790
58371H13361N744O878Q396R088R558J0840J2145J2333J2306J3468J4967J5056
58359I44140J4149J3912J4251J3838J2664J1478R604O110K305K14o89k382m546
$$ plain form
58452 846424 859819 874111 888284 900792 910413 916730 919297 917127 909826 898547 884971 869979
58440 869979 854180 838885 825289 813351 802771 794426 789419 787192 786187 786154 788254 792974 799504
58427 799504 807207 816309 826909 838578 851067 864348 877806 890293 900925 908973 913360 913480 910215
58414 910215 904893 897625 887962 876713 865445 854386 842558 829938 817776 806726 796315 786465
58402 786465 777910 770864 764794 759760 756486 754961 754387 754683 756486 759536 762622 765329 768231 771181 773108
58387 773108 773819 774302 774885 774789 773970 773710 774830 776836 779338 782756 787125 791712 796341 801633 807571 813361
58371 813361 819105 825983 834379 843467 853025 863865 876010 888343 900649 914117 929084 944140
58359 944140 958289 972201 986452 1000290 1012954 1024432 1034036 1040146 1042451 1042665 1041976 1039594 1035048
58346A035048n013l518j957r90O58L423O091Q012R730J1288J2076J2433J3291
58333A100572J4324J4452J3989J4240J5178J5521J4735J3184J0785P533M604K948
58321A242065J585o13k479k275p63M3K98J612L767N035N286N958P379Q700R961
58306A285559J1665J2978J2979J2862J4234J6114J6441J5584J5414J5886J5657
58295A445373J5066J5296J5516J4212J2432J2260J3049J2774J1991J2737J4473
58284A595179J5160J5394J7192J9549J9749J8519J9166K1966K4135K5256K7833
58273A819098L2233L5811L7703M0003M3578M6854M9326N2269N5531N7573N8839
58262B328818O1214O4186O5511O5409O5838O6217O4356O1154N9475N9011N7312
$$ plain form
58346 1035048 1030035 1026517 1024560 1023570 1024228 1027651 1033742 1041754 1051484 1062772 1074848 1087281 1100572
58333 1100572 1114896 1129348 1143337 1157577 1172755 1188276 1203011 1216195 1226980 1234513 1239117 1242065
58321 1242065 1243650 1243037 1240558 1238283 1237520 1237563 1237861 1239473 1243240 1248275 1253561 1259519 1266898 1275598 1285559
58306 1285559 1297224 1310202 1323181 1336043 1350277 1366391 1382832 1398416 1413830 1429716 1445373
58295 1445373 1460439 1475735 1491251 1505463 1517895 1530155 1543204 1555978 1567969 1580706 1595179
58284 1595179 1610339 1625733 1642925 1662474 1682223 1700742 1719908 1741874 1766009 1791265 1819098
58273 1819098 1851331 1887142 1924845 1964848 2008426 2055280 2104606 2156875 2212406 2269979 2328818
58262 2328818 2390032 2454218 2519729 2585138 2650976 2717193 2781549 2842703 2902178 2961189 3018501
58251C018501N5248N6016N9282O2025O4609O9957P7206Q2668Q6807R3455J02200
58240C827974J08732J12882J18921J27403J34389J39503J46906J57187J66300
58231E040197J73876J84505J99160K13426K25940K40545K58428K76545K95383
58222G108005L19487L48600L77451M05997M40318M81685N25111N70696O25319
58213A1202669O90848P62318Q40493R33976J045993J172384J316209J490550J703372
58204B1158812J955071K255988K630982L103069L691772M434241N388277O607693
58196E1225905Q138038J0045403J2414978J5283188J8564037K2041859K5431855
58189A63145263K8474910L1013950L2929168L3850676L2873412K8744840K0668797
$$ plain form
58251 3018501 3073749 3129765 3189047 3251072 3315681 3385638 3462844 3545512 3632319 3725774 3827974
58240 3827974 3936706 4049588 4168509 4295912 4430301 4569804 4716710 4873897 5040197
58231 5040197 5214073 5398578 5597738 5811164 6037104 6277649 6536077 6812622 7108005
58222 7108005 7427492 7776092 8153543 8559540 8999858 9481543 10006654 10577350 11202669
58213 11202669 11893517 12655835 13496328 14430304 15476297 16648681 17964890 19455440 21158812
58204 21158812 23113883 25369871 28000853 31103922 34795694 39229935 44618212 51225905
58196 51225905 59363943 69409346 81824324 97107512 115671549 137713408 163145263
58189 163145263 191620173 222634123 255563291 289413967 322287379 351032219 371701016
58182C71701016R151089l917718j6087658k5411227l1006990l2990440l2101186
58175B39336886k9324876k5613987k1739863j8263925j5533807j3638818j2401507
58168A02820103j1501667j0665382r761099q768650p721798o683898n723446m876571
58160C7117592m140577l506013k974412k541125k185148j887106j641219j442178
58152A6799814j276139j132780j012622r14942q30514p52863o85281o30278n82170
58143H982225n35921m93816m57765m23787l89251l57457l30308l04142k77081
58134E412697k52949k33841k16143j98017j83579j75481j69984j63375j56980
58125C662348j51904j45197j35283j25531j18478j11758j03347r5619r0612q6189
$$ plain form
58182 371701016 380852105 376934387 360846729 335435502 304428512 271438072 239336886
58175 239336886 210012010 184398023 162658160 144394235 128860428 115221610 102820103
58168 102820103 91318436 80653054 70891955 62123305 54401507 47717609 41994163 37117592
58160 37117592 32977015 29471002 26496590 23955465 21770317 19883211 18241992 16799814
58152 16799814 15523675 14390895 13378273 12463331 11632817 10879954 10194673 9564395 8982225
58143 8982225 8446304 7952488 7494723 7070936 6681685 6324228 5993920 5689778 5412697
58134 5412697 5159748 4925907 4709764 4511747 4328168 4152687 3982703 3819328 3662348
58125 3662348 3510444 3365247 3229964 3104433 2985955 2874197 2770850 2675231 2584619 2498430
58115B498430q0390p5001p1482o7772o2362n7295n4113n0898m6189m1905l9692
58104A851331l8155l6165l5028l5092l4174l1643l0094l0719l0973k9233k7718
58093A492337k8280k9205k8723k8021k8164k7666k5688k4151k4182k3986k2594
58082A201677k2231k4317k6592k6915k6541k6941k6691k4489k2180k1704k1698
58071I31378k0167j7996j6958j6475j5166j3601j2871j2369j1263j0342j0279
58060G73891r928q372o751o258o246n985o160p027p341o687o568p548p908o747
58046F74365n713n880n741m381l679m941o183n451m250m837o397o853o453o615
58032E96991o975o535o148p146q764r464r544j0023j0331r452q082p391o926n870
$$ plain form
58115 2498430 2418040 2343039 2271557 2203785 2141423 2084128 2030015 1979117 1932928 1891023 1851331
58104 1851331 1813176 1777011 1741983 1706891 1672717 1641074 1610980 1580261 1549288 1520055 1492337
58093 1492337 1464057 1434852 1406129 1378108 1349944 1322278 1296590 1272439 1248257 1224271 1201677
58082 1201677 1179446 1155129 1128537 1101622 1075081 1048140 1021449 996960 974780 953076 931378
58071 931378 911211 893215 876257 859782 844616 831015 818144 805775 794512 784170 773891
58060 773891 763963 755591 748840 742582 736336 730351 724191 717164 709823 703136 696568 689020 681112 674365
58046 674365 668652 662772 657031 652650 648971 644030 637847 632396 628146 623309 616912 610059 603606 596991
58032 596991 590016 583481 577333 570187 561423 551959 542415 532392 522061 512609 504527 497136 490210 484340
58018D84340m956m995m951l835k941l795n267n272m029l116k462j014O33R46K04
58003D39490L8P97J560K193L102L577K633J099O89J363J591Q37j10r06j827k505
57987D53621k330j908k411l663m447m374m037l638k986k440k496k752k547k164
57973D11428k207k388k206k060k420k632j942r66o71o99j83N13N31K47N85J248
57957C96178J259Q01P70R64M24p73j644j993k387k690k111o01J033K321L268L699
57941C98518L559L642M824O857Q868J0532J1831J2368J2052J1781J2217J2610
57929E09659J1981J0670R354P478M259O14j768k788l771n271o630p431p933q221
57915E10202q222q319q745q828p998o991o685o495n385l888l385l910m329m342
$$ plain form
58018 484340 479384 474389 469438 465603 462662 458867 453600 448328 444299 441183 438721 437707 438340 439286 439490
58003 439490 439528 440325 441885 444078 447180 450757 453390 454489 455178 456541 458132 458969 458859 457953 456126 453621
57987 453621 451291 449383 446972 443309 438862 434488 430451 426813 423827 421387 418891 416139 413592 411428
57973 411428 409221 406833 404627 402567 400147 397515 395573 394607 393936 393237 393054 393567 394098 394345 394930 396178
57957 396178 397437 398238 399008 399972 400396 399623 397979 395986 393599 390909 388798 388197 389230 391551 394819 398518
57941 398518 402077 405719 410543 417400 426268 436800 448631 460999 473051 484832 497049 509659
57929 509659 521640 532310 541664 549142 553401 554015 552247 549459 545688 540417 533787 526356 518423 510202
57915 510202 501980 493661 484916 476088 468090 461099 454414 447919 442534 438646 435261 431351 427022 422680
57901D22680m546m845m600m120m271m692m147k619j346o64L64K005L200L293K951
57886C98643K900L001K956K881K769K391J918J781J815J407M70n60j482k214k324
57871D16352j705j308k001l105l335k801k554k605k090j214j175j990k197j023
57857C87249O27J795K504K849K447J466R12J301K013K418K603K620K046P99m75
57842D13174j336k069k990l915m620n144n477n544n487n399m907l798k735k443
57828C57310k448j713k59R91J715K266K423J649N54N67J823K754K297J175N37
57813C71641M77M97M38L37J08j62k49l85j064k176l045l383l515l612l568l492
57797C48847l420k747j039P56J238O54O44J748K646K278J316R13J168J531J772
$$ plain form
57901 422680 418134 413289 408689 404569 400298 395606 391459 388840 387494 386830 387194 389199 392399 395692 398643
57886 398643 401543 404544 407500 410381 413150 415541 417459 419240 421055 422462 422932 422372 420890 418676 416352
57871 416352 414647 413339 411338 408233 404898 402097 399543 396938 394848 393634 392459 390469 388272 387249
57857 387249 387876 389671 392175 395024 397471 398937 399849 401150 403163 405581 408184 410804 412850 413649 413174
57842 413174 411838 409769 406779 402864 398244 393100 387623 382079 376592 371193 366286 362488 359753 357310
57828 357310 354862 353149 352890 353881 355596 357862 360285 361934 362488 363055 364878 367632 369929 371104 371641
57813 371641 372118 372615 373053 373390 373498 373336 373087 372702 371638 369462 366417 363034 359519 355907 352339 348847
57797 348847 345427 342680 341641 342397 343635 344289 344933 346681 349327 351605 352921 353834 355002 356533 358305
57782C58305J911J885J823K020K426K758L115L750M245L950L198K964L287L168
57768C98805K159Q29m78k085l871n009n212n121n154n060m862n009n251m667l165
57753C46849j724q21R1J123J494J063R31J732K591K584K017J534J097O34N79Q88
57737C62662O39n93j915k499k696k983k927k152j336j166j164n97K34O35O48O18
57721C45408K62q05k190l232l875m278m174l392k442j866j530j216j228j719k154
57706C11569k157k245k931l771m029l675l050k164j110m40l58j95O03J576J997
57691B89620J827J203j56k106l492l374k276j334p74j50O47J595L152N544Q102
57676B98028J0334J3135J7738K3893L0256L6358M2897N0170N7323O3286O7428
$$ plain form
57782 358305 360216 362101 363924 365944 368370 371128 374243 377993 382238 386188 389386 392350 395637 398805
57768 398805 400964 401793 401315 399230 395359 390350 385138 380017 374863 369803 364941 359932 354681 350014 346849
57753 346849 345125 344304 344395 345518 347012 348075 349006 350738 353329 355913 357930 359464 360561 361195 361774 362662
57737 362662 363301 362708 360793 358294 355598 352615 349688 347536 346200 345034 343870 343273 343507 344142 344790 345408
57721 345408 345670 344865 342675 339443 335568 331290 327116 323724 321282 319416 317886 316670 315442 313723 311569
57706 311569 309412 307167 304236 300465 296436 292761 289711 287547 286437 285997 285639 285444 286047 287623 289620
57691 289620 291447 292650 292494 290388 286896 283522 281246 279912 279138 278988 279635 281230 284382 289926 298028
57676 298028 308362 321497 339235 363128 393384 429742 472639 522809 580132 643418 710846
57665G10846O8995O6443N7774M1630J8686p652l2444n1883o4677p0909p0721o4993
57653F01095n6304m7698m0509l4244k8271k2711j7909j4022j1139r125p416n593
57641C06154l949k955k434j897j333j077j102j113j005p92l92K0l6n69q95p24
57625B85901o98j162j303n16K16m02j956k917k846k641k809k909k669k401k178
57610B58710j743j306j426j899j817r08Q0M95L85j53j174k213k344j412m71m99
57594B42305j244j817j937k125k791l522l414k165p10l87j311k187k048j480j551
57579B13616k167k402j953j335r57q84j268k035k365j553k43J97n34j403j631
57564A93083j474j404j443j569j833j824q88P91K066K116J331O52N69R75J468
$$ plain form
57665 710846 779841 846284 904058 945688 964374 956722 924278 872395 807718 736809 666088 601095
57653 601095 544791 497093 456584 422340 394069 371358 353449 339427 328288 319163 311747 306154
57641 306154 302205 299250 296816 294919 293586 292509 291407 290294 289289 288497 288105 288125 288089 287520 286625 285901
57625 285901 285203 284041 282738 282222 282438 282036 280080 277163 274317 271676 268867 265958 263289 260888 258710
57610 258710 256967 255661 254235 252336 250519 249611 249691 250186 250571 250418 249244 247031 244687 243275 242804 242305
57594 242305 241061 239244 237307 235182 232391 228869 225455 223290 222580 222193 220882 218695 216647 215167 213616
57579 213616 211449 209047 207094 205759 204802 203918 202650 200615 198250 196697 196454 196651 196117 194714 193083
57564 193083 191609 190205 188762 187193 185360 183536 182648 183439 185505 187621 188952 189604 190173 191148 192616
57549A92616J599J241Q22Q08R93Q00J67l88n32l69NN09P50L77k57m69k85l62q77
57530A97148j262j140p74m12O3O32Q88O28K13J19N24J368K380L019K886K191J481
57513B09952R88P22Q81J505J897J269r6j047r51k29M48P75O36M4o17r79j202j611
57495B12385k054k269k557l149l323k317q49m41j258j968j833j504j512j430j001
57480A84920p37p56l64N51R26J91o86p62o60j388k590l177l076l052l203k894
57464A63243k002j148o64k18M34R78J042O84L44M04P80Q67K04p29q54J95J594
57447A65154K395K428J932J003p5o47m50k1K18O19J434J985J571P17N07R66J117
57430A80853N32j57l91m17n81o78m35j68l67q83r93l67L47J83r17j882j649l62
$$ plain form
57549 192616 194215 195456 196278 197086 198079 198879 199046 198658 198126 197757 197762 198271 199021 199398 199141 198672 198387 198025 197148
57530 197148 195886 194746 193972 193560 193623 194255 195143 195771 195984 196103 196627 197995 200375 203394 206280 208471 209952
57513 209952 210940 211662 212543 214048 215945 217214 217118 216071 215120 214891 215339 216114 216750 216794 216177 215198 213996 212385
57495 212385 210331 208062 205505 202356 199033 196716 195867 195426 194168 192200 190367 188863 187351 185921 184920
57480 184920 184183 183427 183063 183614 184540 184731 184045 183283 182623 181235 178645 175468 172392 169340 166137 163243
57464 163243 161241 160093 159429 159211 159645 160623 161665 162349 162693 163097 163877 164744 164948 164219 163365 163560 165154
57447 165154 167549 169977 171909 172912 172837 172190 171740 171719 171937 172556 173990 175975 177546 178263 178770 179736 180853
57430 180853 181385 181228 180837 180420 179839 179161 178726 178558 178191 177308 176315 175948 176295 176478 175561 173679 172030 171668
57412A71668R22J531J663J686J565J157O22K47J80M32P96P37j41j349j828j173
57396A78715r9N74P76Q33Q56Q47Q75Q32N25K95Q93K325L523L661L213L086L251
57379B04981K979K048R33O7n23r60j370j822k097j810j089p09j115j789k016j763
57363A93945j378r33n16n98j320j917j641q92n63o38l99J98M16J0l88l01K2K38
57345A83345M03O09P16O74O11N18L70M40Q30Q06m40k287k973j785n0P17O46P30
57327A83880R84N74n58j470j667j624j601r65O29K131K174Q79k49k16M68Q00N32
57310A84701Q8j60o7M26J156J680J744J507J080K50r18j690j424l73Q44K093L307
57293A94244L738K793J359J041K000K803K599K197K485L081L323L514M135M652
$$ plain form
57412 171668 172590 174121 175784 177470 179035 180192 180814 181061 181241 181673 182469 183206 183065 181716 179888 178715
57396 178715 178616 179190 179966 180799 181655 182502 183377 184209 184734 185029 185922 188247 191770 195431 198644 201730 204981
57379 204981 207960 210008 210941 211008 210485 209525 208155 206333 204236 202426 201337 200628 199513 197724 195708 193945
57363 193945 192567 191634 191118 190520 189200 187283 185642 184750 184187 183549 183150 183348 183764 183774 183386 183085 183107 183345
57345 183345 183748 184357 185073 185747 186358 186876 187246 187686 188516 189322 188882 186595 183622 181837 181787 182504 183150 183880
57327 183880 184864 185438 184880 183410 181743 180119 178518 177553 178182 180313 182487 183366 183117 182901 183369 184169 184701
57310 184701 184789 184629 184562 184988 186144 187824 189568 191075 192155 192405 191487 189797 188373 188000 188844 190937 194244
57293 194244 197982 200775 202134 203175 205175 207978 210577 212774 215259 218340 221663 225177 229312 233964
57279B33964M165K842J706J376J723K418L035K927J873O49K02M29M56o2o05o70
57263B56428l55l2j3m82j305j943j909j259l98L77Q28P10J60k26j59n9j80O0J126
57244B51369K214K065P13m51m33M09J188J495J413J113P09J88n51j281j357m72
57228B58331O95J158Q07L08K4j87k86J20J113K315L517M794N982O711P171Q141
57212C00714R966J2087J3896J5594J7790K0605K3598K6422K9189L2137L5101L7573
57200E74672L9290M0628M2097M3545M4328M4314M4109M4174M4354M4609M5420
57189A051540M6922M8422M9389N0272N1521N2567N2676N2204N1896N1506N0375
57178A609290M8895M8027M7610M6632M5094M4146M4172M4187M3446M2249M0766
$$ plain form
57279 233964 238129 240971 242677 244053 245776 248194 251229 254156 256029 256678 256880 257309 257765 257703 257098 256428
57263 256428 256073 256041 256028 255546 254241 252298 250389 249130 248732 249109 249937 250647 250807 250581 250422 250363 250183 250243 251369
57244 251369 253583 255648 256361 255910 255477 255886 257074 258569 259982 261095 261804 261992 261441 260160 258803 258331
57228 258331 259026 260184 260991 261299 261323 261136 260850 260970 262083 264398 267915 272709 278691 285402 292573 300714
57212 300714 310680 322767 336663 352257 370047 390652 414250 440672 469861 501998 537099 574672
57200 574672 613962 654590 696687 740232 784560 828874 872983 917157 961511 1006120 1051540
57189 1051540 1098462 1146884 1196273 1246545 1298066 1350633 1403309 1455513 1507409 1558915 1609290
57178 1609290 1658185 1706212 1753822 1800454 1845548 1889694 1933866 1978053 2021499 2063748 2104514
57167B104514L8303L4540L0354K6730K3729K1086J9034J7906J7606J7938J8742
57156B370482J9406J9203J8527J8816K0630K2845K4385K5705K7634K9697L0745
57145B628075L0705L0607L1243L2710L4906L7570L9969M1410M2011M2446M3149
57134C034801M4191M5605M7284M8845N0157N1704N3949N6676N9387O1940O4289
57123C618828O6060O6897O6933O6489O5908O6091O8517P3966Q1798R1148J02255
57112D434890J15749J31295J47870J65032J83032K02251K23612K49201K81396
57103F134328L21586L70683M30646N04578N95698P07362Q43829J009687J208210
57094A2126607J440419J704369J993466K295879K597494K886027L152196L389321
$$ plain form
57167 2104514 2142817 2177357 2207711 2234441 2258170 2279256 2298290 2316196 2333802 2351740 2370482
57156 2370482 2389888 2409091 2427618 2446434 2467064 2489909 2514294 2539999 2567633 2597330 2628075
57145 2628075 2658780 2689387 2720630 2753340 2788246 2825816 2865785 2907195 2949206 2991652 3034801
57134 3034801 3078992 3124597 3171881 3220726 3270883 3322587 3376536 3433212 3492599 3554539 3618828
57123 3618828 3684888 3751785 3818718 3885207 3951115 4017206 4085723 4159689 4241487 4332635 4434890
57112 4434890 4550639 4681934 4829804 4994836 5177868 5380119 5603731 5852932 6134328
57103 6134328 6455914 6826597 7257243 7761821 8357519 9064881 9908710 10918397 12126607
57094 12126607 13567026 15271395 17264861 19560740 22158234 25044261 28196457 31585778
57086C1585778L595539L776400L941224M093056M218228M277440M198609L884465
57078F3570739L252670K296744J117531j14746j244386k191033k946719l533840
57070F0206960l972971m277086m455004m510854m445322m264169l986004l640193
57062B6655357l258093k866663k486876k133583j815352j535536j294266j089577
57054A0175411r17669p73869o54042n55023m73982m08058l54847l12741k80587
57045E444593k56978k39812k26352k13860k00498j85782j70294j55024j40817
57036C655176j27948j16149j05190r5352q6956p9590p2417o5255n8557n2170m4904
57025B750688l5792k5061j3349p31J2701K5751L6382M2652M2734L4614J7009r026
$$ plain form
57086 31585778 35181317 38957717 42898941 46991997 51210225 55487665 59686274 63570739
57078 63570739 66823409 69120153 70237684 70122938 68878552 66687519 63740800 60206960
57070 60206960 56233989 51956903 47501899 42991045 38545723 34281554 30295550 26655357
57062 26655357 23397264 20530601 18043725 15910142 14094790 12559254 11264988 10175411
57054 10175411 9257742 8483873 7829831 7274808 6800826 6392768 6037921 5725180 5444593
57045 5444593 5187615 4947803 4721451 4507591 4307093 4121311 3951017 3795993 3655176
57036 3655176 3527228 3411079 3305889 3210537 3123581 3043991 2971574 2906319 2847762 2795592 2750688
57025 2750688 2714896 2689835 2676486 2675755 2688456 2714207 2750589 2793241 2835975 2870589 2887598 2878572
57013B878572l9771p0055r4814j10554j16717j15666j10536j03055r3801q3861
57003A939742p4773o7008n9770n2603m6118m0777l6103l1626k7699k4732k2421
56992A456112k0414j9056j8628j8399j7333j5485j3918j3295j3165j2822j2458
56981A281139j3270j6449k1989k8463l4138l8250m1018m2544m2424m0520l7497
56970I24577l4177l0752k7001k2916j8732j4641j0756p114l484N05M752Q591J1514
56957G80366J3642J5101J5300J3296Q772K348m887j1854j7634k1608k3571k3754
56945G45517k2811k1632k0744j9840j8311j6191j4104j2130r457n458n92M213
56933E88460Q652J2945J6942J9768K0239J7391J0947J662q836j8774k6797l2050
$$ plain form
57013 2878572 2838801 2768746 2673932 2563378 2446661 2330995 2220459 2117404 2023603 1939742
57003 1939742 1864969 1797961 1738191 1685588 1639470 1598693 1562590 1530964 1503265 1478533 1456112
56992 1456112 1435698 1416642 1398014 1379615 1362282 1346797 1332879 1319584 1306419 1293597 1281139
56981 1281139 1267869 1251420 1229431 1200968 1166830 1128580 1087562 1045018 1002594 962074 924577
56970 924577 890400 859648 832647 809731 790999 776358 765602 758488 755004 755509 760261 768852 780366
56957 780366 794008 809109 824409 837705 846477 848825 843938 832084 814450 792842 769271 745517
56945 745517 722706 701074 680330 660490 642179 625988 611884 599754 590297 584839 584247 588460
56933 588460 597112 610057 626999 646767 667006 684397 695344 697006 688170 669396 642599 610549
56921F10549l4325l4309l3136l1345k8733k5396k2181j9714j7635j5405j3252
56910C35118j1674j0443q989p360o067n137m158l180k710k796k790k242j376n49
56896B65647K92J375K705M161N690P219Q596R708J0633J1497J2329J2865J2436
56883C65153J0166N594q16p871j4336j9338k2407k3392k2412j9794j6050j1837
56871B22660p686l670N33N257J0634J6641K3004K9121L4543L9496M4453M9046
56859D64032N1932N1709M7427L8244K3799N612j2633k7175l6438m0923m1553l8909
56847D85124l3690k6960j9748j2690n903J218R671J9798L0684M1090N0649N9754
56835E98997O8475P6125Q1526Q2964P8002O4324M1440J1798j9663m7276o6919
$$ plain form
56921 610549 576224 541915 508779 477434 448701 423305 401124 381410 363775 348370 335118
56910 335118 323444 313001 304012 296652 290585 285448 281290 278110 275400 272604 269814 267572 266196 265647
56896 265647 265939 267314 270019 274180 279870 287089 295685 305393 316026 327523 339852 352717 365153
56883 365153 375319 380913 380097 372226 357890 338552 316145 292753 270341 250547 234497 222660
56871 222660 214974 211304 211837 217094 227728 244369 267373 296494 331037 370533 414986 464032
56859 464032 515964 567673 615100 653344 677143 682755 670122 642947 606509 565586 524033 485124
56847 485124 451434 424474 404726 392036 386133 387351 397022 416820 447504 488594 539243 598997
56835 598997 667472 743597 825123 908087 986089 1050413 1091853 1103651 1083988 1036712 969793
56824I69793p7530q0620p8272p1861o2561n2011m1600l1583k1594j1663k048P511
56812D45961J7466K7491L6663M4535N1332N6881N9780N7785M8919L2740J1084
56801H90637j2432l4055n1124o2055o6249o4641n9513n2901m5473l7439k9576
56790C75179k2458j5474p917m12N951J1404J6978K2512K6729K9225L0623L0562
56778E02902K7133J9049P240o131j9113l0001l7285m0608m1079l9868l7144l2878
56766B72217k7940k3523k0004j6999j4191j1584r244p323o087n560n376n145m739
56753A14502m122l314k585k233k134j947j770j969k336k232j569r59p12n01k27
56738H5892l33q57j092o72k55n08j067j110n08J97N85O71P51J187J984K488J982
$$ plain form
56824 969793 892263 811643 733371 661510 598949 546938 505338 473755 452161 440498 438450 445961
56812 445961 463427 490918 527581 572116 623448 680329 740109 797894 846813 879553 890637
56801 890637 878205 844150 793026 730971 664722 600081 540568 487667 442194 404755 375179
56790 375179 352721 337247 329330 328918 334869 346273 363251 385763 412492 441717 472340 502902
56778 502902 530035 549084 556324 550193 531080 501079 463794 423186 382107 342239 305095 272217
56766 272217 244277 220754 200750 183751 169560 157976 148732 141409 135322 129762 124386 119241 114502
56753 114502 110380 107066 104481 102248 100114 98167 96397 94428 92092 89860 88291 87332 86620 86119 85892
56738 85892 85559 84702 83610 82938 82683 82175 81108 79998 79490 79687 80272 80943 81694 82881 84865 87353 89335
56721H9335P93R9M22J054J276J249J253R83K98q7M53J364J704J519J548J879J805
56704A06947R89pm43j22N91J101R91M57J96N17Q25L92n83j184r35k70J04m4l73
56685A09149m09m4L53M30L77O06J003R55L22k19o1N80J067J088O71k6o34o92k05
56666A14311L07O07J049J745K098J697J148J254J848K137J945J826K045K175J848
56651A38040J344J235J653K148K135J550R03N81K93l52r01n14N80J057L50m46
56635A49656k46L96K85m29n75M8L21m15j382j546j000n27m50n33p13j251k104
56618A39535k651k370j580j153j371j485p60M17J032Q09L96J77k14r45j359q49
56602A27629K19J026J263J116P04J41k42k85l40o99r62n37M62J319J594J428J123
$$ plain form
56721 89335 90128 90227 90649 91703 92979 94228 95481 96464 96762 96675 97128 98492 100196 101715 103263 105142 106947
56704 106947 107936 107929 107486 107364 107955 109056 110047 110504 110700 111217 112042 112434 111851 110667 109732 109462 109566 109522 109149
56685 109149 108740 108696 109049 109479 109856 110462 111465 112420 112742 112523 112462 113042 114109 115197 115868 115842 115208 114516 114311
56666 114311 114618 115225 116274 118019 120117 121814 122962 124216 126064 128201 130146 131972 134017 136192 138040
56651 138040 139384 140619 142272 144420 146555 148105 149008 149589 149882 149530 148629 148115 148695 149752 150102 149656
56635 149656 149410 149806 150091 149662 149087 149135 149456 149041 147659 146113 145113 144586 144136 143603 142890 141639 139535
56618 139535 136884 134514 132934 131781 130410 128925 128165 128582 129614 130423 130819 130996 130782 129837 128478 127629
56602 127629 127848 128874 130137 131253 131957 132098 131856 131571 131231 130532 129570 129033 129495 130814 132408 133836 134959
56585A34959Q38O24M15J00k11k21J18N21Q65J298J677J557J064J066J900K649
56569A49219K461J934K267L462M475M897N403O506P821Q893R947J1321J2690J3210
56555B44506J2251R753O170K252j246l788n137n399n071m710m456m070l580l443
56541B34032l867m417m616m502m204l473k194r72n72r46j394j531j594j868k272
56526A95610k477k181j384o26o09j338j965j818j213q85r96j187j229j168j067
56511A75467j030j201j460j461j187r93r04n37n2k50j169j581p25L18R4j064j637
56494A60628j187o32m74j41O82J307J091L95nJ43M72N02Q2m32m67N0N24M84K45
56475A63267L11O12Q50J124J583J864J634J270J300J534J490J196Q38J45q89j288
$$ plain form
56585 134959 135797 136421 136836 136936 136725 136504 136622 137143 138008 139306 140983 142540 143604 144670 146570 149219
56569 149219 151680 153614 155881 159343 163818 168715 174118 180624 188445 197338 207285 218606 231296 244506
56555 244506 256757 266510 272680 274932 273686 269898 264761 259362 254291 249581 245125 241055 237475 234032
56541 234032 230165 225748 221132 216630 212426 208953 206759 205787 205215 204269 202875 201344 199750 197882 195610
56526 195610 193133 190952 189568 188942 188333 186995 185030 183212 181999 181114 180118 178931 177702 176534 175467
56511 175467 174437 173236 171776 170315 169128 168135 167231 166694 166642 166392 165223 163642 162917 163235 163329 162265 160628
56494 160628 159441 158809 158335 158194 158876 160183 161274 161669 161664 161807 162279 162781 162863 162431 161964 162014 162538 163022 163267
56475 163267 163578 164190 165040 166164 167747 169611 171245 172515 173815 175349 176839 178035 178873 179018 178129 176841
56459A76841k60J290J655N48q03j542j858j850j159JP14O76O64J274K029K182
56443A80402J712J200J196J762K218J531m33k294k595j519l59K82O33N54l26j376
56427A82588j386l65M33M30K78L38R8m31l32O45J443J327Q96P53M80k52p32m05
56409A85806K9j86m69K01J549K321J892P79j52k29P53K120K617J767N72K41O90
56392B00301J018R40R16J119J162Q64N85O66R56J055P93L93J89K02J40l6J21Q11
56374B12195J364J054L08K60J093J809J716J242R89Q90P17O41P81Q63P51P43R57
56357B28373J022P10L73M10P92J308J733J651P43m74r86n52Q1L86O77J183J467
56340B38897J213Q44Q61J214J713K442L335L995M227M251M163L864L618L844M206
$$ plain form
56459 176841 176581 177871 179526 180074 179271 177729 175871 174021 172862 172863 173577 174253 174917 176191 178220 180402
56443 180402 182114 183314 184510 186272 188490 190021 189588 187294 184699 183180 182821 183103 183736 184290 183964 182588
56427 182588 181202 180837 181270 181700 181978 182316 182414 181983 181651 182296 183739 185066 185962 186715 187195 186943 186211 185806
56409 185806 185835 185649 185180 185381 186930 189251 191143 191922 191770 191541 192294 194414 197031 198798 199370 199611 200301
56392 200301 201319 202259 203175 204294 205456 206320 206905 207571 208527 209582 210375 210768 210957 211159 211299 211263 211384 212195
56374 212195 213559 214613 214921 215181 216274 218083 219799 221041 222030 222920 223637 224278 225059 225922 226673 227416 228373
56357 228373 229395 230105 230478 230888 231680 232988 234721 236372 237115 236641 235655 235103 235184 235570 236247 237430 238897
56340 238897 240110 240954 241815 243029 244742 247184 250519 254514 258741 262992 267155 271019 274637 278481 282687
56325B82687L859K852K209K281K152J193J35j39J24K05j6l56q94j503j547p56
56309B92486K55R12J396J953K329K487L017M089M904M843M416M252M082L568L256
56294C38245L701M314M152L384K976L295L911M384M577M454M246M481N358O416
56280C97894P214P749P933P442O574O387P349Q672R617J0563J2033J3532J4374
56267E17333J4911J5994J7712J9531K1165K2647K4014K5640K8245L1956L6070
56256G75218M0313M5545N2391O0097O7591P4927Q2763R1160R9867J09028J18606
56245A617506J27763J35698J42422J47835J50890J50662J47411J41505J32168
56236B893860J18559J01346Q1801O0054L5693R623j6120m0213o2340q1976r8221
$$ plain form
56325 282687 286546 289398 291607 293888 296040 297233 297368 297229 297353 297558 297542 297186 296292 294789 293242 292486
56309 292486 292741 293653 295049 297002 299331 301818 304835 308924 313828 318671 323087 327339 331421 334989 338245
56294 338245 341946 346260 350412 353796 356772 360067 363978 368362 372939 377393 381639 386120 391478 397894
56280 397894 405108 412857 420790 428232 434806 441193 448542 457214 466831 477394 489427 502959 517333
56267 517333 532244 548238 565950 585481 606646 629293 653307 678947 707192 739148 775218
56256 775218 815531 861076 913467 973564 1041155 1116082 1198845 1290005 1389872 1498900 1617506
56245 1617506 1745269 1880967 2023389 2171224 2322114 2472776 2620187 2761692 2893860
56236 2893860 3012419 3113765 3195566 3255620 3291313 3300936 3284816 3244603 3182263 3100287 3002066
56225C002066j10894j20573j27509j31439j32430j31122j28125j23925j19072
56216A876977j13821j07759j00536r2630q4886p7717p1340o6056o1633n7090n1994
56205I91515m7215m3586m0577l7210l3525l0092k6860k3625k0888j9039j7435
56194F51463j5394j3428j2247j1363r986q484p532o662n261m189m531n362m799
56181E42225l004k076k886l969l889k894j811q00J48O92P34P31R95J367J706K075
56165E29344K482L023M038N467O518O744O910P786Q754Q844Q577R305J1098J2778
56151F31668J3938J5407J7659K0170K2608K5491K9432L4574M0934M8493N6914
56140I57288O5777P5032Q4633R4052J02627J09878J14866J16074J12766J05824
$$ plain form
56225 3002066 2891172 2770599 2643090 2511651 2379221 2248099 2119974 1996049 1876977
56216 1876977 1763156 1655397 1554861 1462231 1377345 1299628 1228288 1162232 1100599 1043509 991515
56205 991515 944300 900714 860137 822927 789402 759310 732450 708825 687937 668898 651463
56194 651463 636069 622641 610394 599031 589045 580561 573029 566367 561106 556917 552386 547024 542225
56181 542225 539221 537145 534259 530290 526401 523507 521696 520896 521044 521736 522470 523201 524196 525563 527269 529344
56165 529344 531826 534849 538887 544354 550872 557616 564526 572312 581066 589910 598487 607792 618890 631668
56151 631668 645606 661013 678672 698842 721450 746941 776373 810947 851881 900374 957288
56140 957288 1023065 1098097 1182730 1276782 1379409 1489287 1604153 1720227 1832993 1938817
56130A938817R6477Q5127P2525O0938N2606M7523M3829L9740L3968K5426J4209
56119B511185K214q630j8259k7457l6081m3885n2219o2959p6134r0020j02783
56108A994972j12686j17709j16925j11698j03963r4165q2347p0008n8952m9194
56098A077325m0032l2130k6453k2176j7923j4170j2013j0567q120n079l191k483
56086H82988j578l33M86J429L503N676O123N362N296N754N195M289N297Q019R764
56071I47270R615R430J0329J1334J1925J2905J4199J4669J4536J5182J6335J6334
56059A104063J5396J5521J6810J6998J5176J2960J1421R796P841O555O031N276
56047A243844M545N097O478O997P031Q622J1644J3723J4221J4949J6664J8330
$$ plain form
56130 1938817 2035294 2120421 2192946 2253884 2306490 2354013 2397842 2437582 2471550 2496976 2511185
56119 2511185 2513399 2504769 2486510 2459053 2422972 2379087 2326868 2263909 2187775 2097755 1994972
56108 1994972 1882286 1764577 1647652 1535954 1431991 1337826 1255479 1185471 1126519 1077325
56098 1077325 1037293 1005163 978710 956534 938611 924441 912428 901861 893741 888662 885471 882988
56086 882988 881410 881077 881563 882992 886495 892171 898294 903656 908952 914706 919901 924190 929487 937506 947270
56071 947270 956885 966315 976644 987978 999903 1012808 1027007 1041676 1056212 1071394 1087729 1104063
56059 1104063 1119459 1134980 1151790 1168788 1183964 1196924 1208345 1218141 1225982 1232537 1238568 1243844
56047 1243844 1248389 1253486 1259964 1266961 1273992 1282614 1294258 1307981 1322202 1337151 1353815 1372145
56035A372145K0101K3434K7872L1288L3650L6882M0852M3404M4568M6524M9124
56024A769844M9944M9156M9628N1494N1634M9538M8640N0412N2163N2267N2740
56013B327460N4804N6723N7911O0525O5057O8859P0974P3876P8706Q3361Q6989
56002C085245R1618R7682J02817J06686J11955J19006J25063J29937J36902J46293
55992D253204J54433J60647J68977J80958J93397K05296K19960K38018K55728
55983F030618K72610K93194L18644L44709L70582M01186M37908M76345N16512
55974I462308N65238O24833O89890P59607Q42128R42041J055709J184469J339999
55965A7466222J530755J756992K026344K360564K780824L304024L963173M813428
$$ plain form
56035 1372145 1392246 1415680 1443552 1474840 1508490 1545372 1586224 1629628 1674196 1720720 1769844
56024 1769844 1819788 1868944 1918572 1970066 2021700 2071238 2119878 2170290 2222453 2274720 2327460
56013 2327460 2382264 2438987 2496898 2557423 2622480 2691339 2762313 2836189 2914895 2998256 3085245
56002 3085245 3176863 3274545 3377362 3484048 3596003 3715009 3840072 3970009 4106911 4253204
55992 4253204 4407637 4568284 4737261 4918219 5111616 5316912 5536872 5774890 6030618
55983 6030618 6303228 6596422 6915066 7259775 7630357 8031543 8469451 8945796 9462308
55974 9462308 10027546 10652379 11342269 12101876 12944004 13886045 14941754 16126223 17466222
55965 17466222 18996977 20753969 22780313 25140877 27921701 31225725 35188898 40002326
55957D0002326N907844P288318R013808J1168684J3805994J6873656K0193923
55950A24254553K3504074K6539887K9132855L1199389L2480479L2182371K9017690
55943C28311298K1939826J1102689j843932j4458713k4617584l1201030l4119097
55936B55113457l3987364l1761117k8406522k4656979k0949032j7517628j4496806
55929H3338009j1940380r824971q092656o690946n569269m668243l936035l342443
55921B9273066k864621k473576k145509j872004j647458j458051j292413j151187
55913A4368247j036131r39555q52999p76784p12606o55306n99861n48732n04995
55904G741278m65306m26302l91008l62366l36856l10689k86246k66547k48990
$$ plain form
55957 40002326 45910170 53198488 62212296 73380980 87186974 104060630 124254553
55950 124254553 147758627 174298514 203431369 234630758 267111237 299293608 328311298
55943 328311298 350251124 361353813 359509881 345051168 320433584 289232554 255113457
55936 255113457 221126093 189364976 160958454 136301475 115352443 97834815 83338009
55929 83338009 71397629 61572658 53480002 46789056 41219787 36551544 32615509 29273066
55921 29273066 26408445 23934869 21789360 19917356 18269898 16811847 15519434 14368247
55913 14368247 13332116 12392561 11539562 10762778 10050172 9394866 8795005 8246273 7741278
55904 7741278 7275972 6849670 6458662 6096296 5759440 5448751 5162505 4895958 4646968
55895D646968k30301k12386j97977j85340j72247j60379j51149j41845j30479
55886C064865j19836j12368j05561r6692q7847q1798p6954p0748o4278n9488n5277
55875B134018n0346m6615m6119m7496m8840n0749n3551n4993n3776n2074n1474
55864A577985m9984m6057m1947l9783l7855l4197l0479k8777k7693k5320k3061
55853A192832k2879k3515k3013k2380k3328k4795k5062k5022k6004k6718k5643
55842I24473k4235k4476k5314k4721k3308k2709k2285k0599j8429j7221j6154
55831F85022j3755j0943r579r333q687p744p467p480p061o962p901q735q355p865
55817E63155q565r422q856p503o783o298m967l299k186j012Q47K205K119K057
$$ plain form
55895 4646968 4416667 4204281 4006304 3820964 3648717 3488338 3337189 3195344 3064865
55886 3064865 2945029 2832661 2727100 2630408 2542561 2460763 2383809 2313061 2248783 2189295 2134018
55875 2134018 2083672 2037057 1990938 1943442 1894602 1843853 1790302 1735309 1681533 1629459 1577985
55864 1577985 1528001 1481944 1439997 1400214 1362359 1328162 1297683 1268906 1241213 1215893 1192832
55853 1192832 1169953 1146438 1123425 1101045 1077717 1052922 1027860 1002838 976834 950116 924473
55842 924473 900238 875762 850448 825727 802419 779710 757425 736826 718397 701176 685022
55831 685022 671267 660324 650745 641412 632725 624981 617514 610034 602973 596011 588110 579375 571020 563155
55817 563155 554590 545168 536312 528809 522026 515728 510761 507462 505276 504264 505111 507316 509435 511492
55803E11492L646N817O727O834P475P986O991N121L718K214m79l296m675n527
55789E54044p618j0108j0892j0428j0875j1999j1314q304n411m542n139o109p271
55776D44034q502r271r452r132p818n253k539p80P26L195N858O693N213K564n47
55761D14989m009o840p806p414p288p739p734p112o819o990o741n970n652o179
55747C20696o880p297p567p609p203o739o617o207m770k988k115j915j148K62
55733B51903J083P39j36j026j959k650k631k253k271k593k559k312k570l273l662
55718B23830l534l210k551j262J08P05O96R34J549K084K634L608M626M826M061
55703B39104K773J134o83j972k381k749l833m926m971m334l994l746k801j523
$$ plain form
55803 511492 515138 520955 527682 534516 541991 549977 556968 562089 565807 568021 567542 564246 559571 554044
55789 554044 546426 536318 525426 514998 504123 492124 480810 472506 467095 462553 457414 451305 444034
55776 444034 435532 426261 416809 407677 399859 394606 392067 391287 392013 395208 401066 407759 412972 415536 414989
55761 414989 410980 404140 396334 388920 381632 373893 366159 359047 352228 345238 338497 332527 326875 320696
55747 320696 313816 306519 298952 291343 284140 277401 270784 264577 259807 256819 254704 252789 251641 251903
55733 251903 252986 253725 253589 252563 250604 247954 245323 243070 240799 238206 235647 233335 230765 227492 223830
55718 223830 220296 217086 214535 213273 213381 214086 214782 215716 217265 219349 221983 225591 230217 235043 239104
55703 239104 241877 243011 242328 240356 237975 235226 231393 226467 221496 217162 213168 209422 206621 205098
55689B05098r01p86l10M28P74J054J987L026L136K739L030L792L879L467L623
55674B34036L869K539k49k309k534k215k621l225l119k516j932j266n37k32l52
55659B17337p3J015K358L378L990M008L200K152J900K396K512J707N70m35j518
55644B44497k631l261l528m209n405o245o276o026n933n733n227m636m084l582
55630A77721l520m124m454l276j005N41M37m65j075j222j037n84l39q51j707j946
55614A53094j621j644k057j914j080o26r98j355j177j112j629k093j897j401j109
55599A31381r53q32r20j027p00j80j40l35J18R41P15p78j859j315K0P84Q62P73
55581A26555N76L74P40J703K298J974J481J576J831J679J566K112K967L479L791
$$ plain form
55689 205098 204197 203411 203101 203529 204303 205357 207344 210370 213506 216245 219275 223067 226946 230413 234036
55674 234036 237905 240444 240195 237886 235352 233137 230516 227291 224172 221656 219724 218458 217921 217689 217337
55659 217337 217264 218279 220637 224015 228005 232013 235213 237365 239265 241661 244173 245880 246450 246015 244497
55644 244497 241866 238605 235077 230868 225463 219218 212942 206916 200983 195250 190023 185387 181303 177721
55630 177721 174201 170077 165623 162347 161342 161883 162320 161855 160780 159558 158521 157937 157598 156747 155040 153094
55614 153094 151473 149829 147772 145858 144778 144152 143154 141799 140622 139510 137881 135788 133891 132490 131381
55599 131381 130428 129596 128676 127649 126949 126769 126629 126294 126412 127353 128068 127290 125431 124116 124136 124920 125782 126555
55581 126555 127131 127505 128245 129948 132246 134220 135701 137277 139108 140787 142353 144465 147432 150911 154702
55566A54702M322M831M799M212L246J855K86p51j045j383k365l497m044m072l970
55551A57126l659k948k107j410p65k22j63n08o06l35l60p60n79N29J379R74J39
55534A45725J94R33J180P33L57K35k18j070j539j183n53n14j359k628l541l636
55518A33116l203k812k507j973j477j714k511k688j769p47n17n61j59J55n01j621
55502A08511j869j001l7L33M33O48P97O14J53m37j061j505j576j378j126q12l52
55485A00335P6J70j77q24j411j352k76J276K134J793R53M91M83N97Q26J195J343
55468A07632R78L95j1l54q86j411j638j755k057k320k023j006M10J679K192J638
55452A01463N59M6M57R04M72n90j335j340r22n34l74l49o8O86J330R58k81j073
$$ plain form
55566 154702 159024 163855 168654 172866 176112 177967 178253 177502 176457 175074 172709 169212 165168 161096 157126
55551 157126 153467 150519 148412 147002 146237 146015 145852 145344 144738 144403 144043 143283 142704 143233 144612 145586 145725
55534 145725 145919 146852 148032 148765 149122 149357 149139 148069 146530 145347 144794 144280 142921 140293 136752 133116
55518 133116 129913 127101 124594 122621 121144 119430 116919 114231 112462 111715 111198 110637 110478 110633 110132 108511
55502 108511 106642 105641 105604 105937 106370 107018 107815 108429 108582 108145 107084 105579 104003 102625 101499 100687 100335
55485 100335 100411 100581 100404 99580 98169 96817 96541 97817 99951 101744 102697 103188 103671 104268 105094 106289 107632
55468 107632 108610 109005 108994 108640 107754 106343 104705 102950 100893 98573 96550 95544 95954 97633 99825 101463
55452 101463 102022 102068 102525 103429 103901 103311 101976 100636 99714 99180 98806 98457 98389 99075 100405 101363 101082 100009
55434A00009o37K19L44k26o81p83q28q08m46J61O43R59J276J434J110L53l86o20
55416A01093p9R99J741J378L70RN66Q12j06j310j565j098r91j371j418q15n2M73
55398I8636P52O74J42m33m48L3M22M30K66J48J74M56Q32P84J62l47n8O85J027
55379A04337P90N13N00M84J38n96j494k026j701p79j99l22m14J41P59O42J24P1
55361A00968M11L62j79n36m29k65k72k26j06k27o03q11o09j86J73K73o8p89j388
55342I5493j376q04l2P43J382J650J558J455J381Q53j72q43n53L5n7o73q99m72
55324I8669J10N10P11N74Q5k59j09O2k55o31l62K29K55k96o10k94L09Q55J157
55305A00710Q73J4o19l88J31P0l02j92J50j16p37p09p8J15k68k35M87R67P20M59
$$ plain form
55434 100009 99372 99591 99935 99709 99028 98245 97417 96609 96163 96324 96967 97926 99202 100636 101746 102099 101713 101093
55416 101093 101014 102013 103754 105132 105502 105511 106077 106889 106783 105473 103908 102810 101819 100448 99030 98215 98163 98636
55398 98636 99388 100062 100204 99771 99323 99356 99778 100208 100474 100622 100796 101252 102084 102868 103030 102683 102625 103310 104337
55379 104337 105127 105640 106140 106624 106762 106166 104672 102646 100945 100166 99967 99645 99231 99372 100131 100773 100897 100968
55361 100968 101379 101741 101562 101026 100597 100332 100060 99834 99728 99501 98898 98087 97478 97292 97465 97738 97670 96881 95493
55342 95493 94117 93313 93281 94024 95406 97056 98614 100069 101450 102303 102131 101288 100735 100770 100713 100040 99141 98669
55324 98669 98779 99289 100000 100574 100659 100400 100291 100353 100098 99467 99105 99334 99589 99293 98683 98389 98698 99553 100710
55305 100710 101583 101597 100978 100590 100721 100791 100489 100297 100447 100331 99594 98885 98807 98922 98654 98419 98906 99873 100593 101052
55285A01052O44P72N43M84P32N28m36j282j311j043j099j037k37Q41J176N30m57
55268A00400j037q17P7R20J001O16P46J553K003J376K40n57r53j162r85m01o2
55251A02958l42n38R6J074J337Q12L47K92J35m13p89l23P76J558J299J78r76j587
55233A05894j763j853j808j371n75L25J239K027K131J163k67j041q64l53K9L17
55217A03230L68p9n80l03O04R93M23k45m03o39j422j899j083N51J643J694J296
55200A04149J038R72R74R08O06J08k98n66j014j628j814j246l91K24O86J131J239
55183A05078Q62N23N46L96l39r63o16L03P10M63K99L73P5o38q65j52P72J020P31
55164A08578N97P40O35K1o68q17l31L29O63N89L00j5j68Q8P23J145Q14R2p7N11
$$ plain form
55285 101052 101696 102468 103011 103495 104227 104755 104319 103037 101726 100683 99584 98547 98310 99151 100327 100857 100400
55268 100400 99363 98546 98623 99543 100544 101160 101906 103459 105462 106838 107078 106521 105568 104406 103421 103020 102958
55251 102958 102616 102078 102174 103248 104585 105397 105744 106036 106171 105758 104969 104646 105422 106980 108279 108457 107481 105894
55233 105894 104131 102278 100470 99099 98524 98849 100088 102115 104246 105409 105142 104101 103237 102884 102913 103230
55217 103230 103598 103519 102939 102636 103240 104233 104656 104411 104008 103369 101947 100048 98965 99516 101159 102853 104149
55200 104149 105187 106159 107133 108041 108647 108755 108457 107891 106877 105249 103435 102189 101798 102022 102708 103839 105078
55183 105078 105940 106463 107009 107405 107066 106103 105487 105790 106500 106963 107262 107635 107710 107072 106207 106055 106827 107847 108578
55164 108578 109175 109915 110550 110571 109903 109086 108755 109084 109747 110336 110636 110621 110453 110541 111264 112409 113223 113315 113238 113749
55144A13749J015P97K52kj31o19j312j637j508j338j299j099n15L13J055J432
55128A09153J373J152J155J361J358J022P39O89M61k41r92j268j228j279j291
55113A12164r18m12l43o49o64j57L17K69nK24J163K151K228J203O5n3P44J228
55095A18555P40j0j76J0l9n5N13J129O18r66k048j482M4J014R16N25O66J243J499
55076A22696R47n1o72n39j04M5q9p5K15M70M69L59L33L07K9o16j367j696j283
55057A19378m64Q4J25M1R4nn11j091j261j039p08l00K25N57M01j2k77m30p17r42
55037A13148p22k00J52L28O77J030P84om42j3O20N51j31o28o33o15r24j210r46
55018A10820k70J44k8l58l50j44j33j02N49J711K350J813O92mp3N6K95Q89J709
$$ plain form
55144 113749 114764 115561 115813 115811 115680 115061 113749 112112 110604 109266 107967 106868 106353 106666 107721 109153
55128 109153 110526 111678 112833 114194 115552 116574 117313 118002 118463 118222 117230 115962 114734 113455 112164
55113 112164 111246 110834 110491 109842 109178 109021 109338 109607 109602 109826 110989 113140 115368 116571 116636 116583 117327 118555
55095 118555 119295 119285 119109 119119 119080 119025 119538 120667 121285 120319 118271 116789 116833 117847 118763 119288 119954 121197 122696
55076 122696 123643 123592 122920 122381 122277 122322 122233 122158 122373 122843 123312 123671 124004 124311 124340 123724 122357 120661 119378
55057 119378 118914 118998 119123 119164 119258 119253 118742 117651 116390 115351 114643 114343 114568 115125 115526 115514 115237 114807 114090 113148
55037 113148 112426 112226 112378 112706 113383 114413 115197 115191 114749 114736 115356 115907 115776 115148 114515 113900 112976 111766 110820
55018 110820 110550 110694 110666 110308 109958 109814 109681 109579 110128 111839 114189 116002 116694 116690 116617 116673 116968 117857 119566
54999A19566K205K065J414M59m78p79q3R55J180L59n68p95n19k81p2L10N99L53
54981A25890k36m16K30J283J955J815J018Q5n16o25m02o2L21P58J100J046M83
54964A33727j85l15K63R30Q86Rj071j623j340m43M31N60j62q57n40O16J414J121
54946A33421L01j01J24N24O66L78k43o98m45K57M53j84o90j24J080J746J523J043
54928A39031Q90J167J892K956L848M133M117M426N102N694O065O357O403N958
54914A98039N304M810L981J948j040l661n164o098p087p858p906p323o429n253
54900A56263l882k785k228j826j176n28l27m82n40l61j39O9L92Q49J269J504J519
54883A47591J438J553K148L170M269N201N950O504O777O819O685O121M801L000
$$ plain form
54999 119566 121771 123836 125250 125709 125231 124452 124369 125324 126504 126863 126295 125500 124981 124700 124628 124938 125537 125890
54981 125890 125654 125238 125468 126751 128706 130521 131539 131624 131108 130483 130081 130019 130340 131098 132198 133244 133727
54964 133727 133542 133227 133490 134420 135306 135315 134244 132621 131281 130838 131269 131829 131667 130810 130270 130886 132300 133421
54946 133421 133722 133621 133745 134269 134935 135313 135070 134372 133927 134184 134637 134453 133763 133639 134719 136465 137988 139031
54928 139031 139921 141088 142980 145936 149784 153917 158034 162460 167562 173256 179321 185678 192081 198039
54914 198039 203343 208153 212134 214082 213042 209381 204217 198119 191032 183174 175268 167945 161516 156263
54900 156263 152381 149596 147368 145542 144366 143838 143511 143029 142489 142128 141989 142058 142450 143299 144568 146072 147591
54883 147591 149029 150582 152730 155900 160169 165370 171320 177824 184601 191420 198105 204226 209027 212027
54869B12027J457M04p73k606m762o515p524p776p209n996m871m501m635m415l515
54854A48790k467j815j452j038o42o42j159j879k448k700k563j939r05J33P28
54839A28002P56L93j91p79r47m28K87L29l53p80l21L73L86l7J2N59P25J83l87
54820A27782m72m08n11m21J67P65O95L5n90q22p16l44K20P21R66J086J253J306
54802A30712J053P21O66P74N72J7k92J29R34J249O82k22o05k13M38P82P33M88
54784A38618J79n8ML10L87K5k11K59R94J045M66M16J540L038L819L911M172N040
54766A63954O184P093P444P105O247N436N101M946M242K650N40j541l375m958
54752B11068o109o457n907m975m452m579m827m658m250m074l994l392k182j073
$$ plain form
54869 212027 213484 213888 213115 210509 205747 199232 191708 183932 176723 170727 165856 161355 156720 152305 148790
54854 148790 146323 144508 143056 142018 141376 140734 139575 137696 135248 132548 129985 128046 127141 127274 128002
54839 128002 128758 129151 128960 128181 127234 126806 127093 127422 127069 126289 125968 126341 126727 126690 126702 127261 127986 128169 127782
54820 127782 127310 126902 126391 125970 126137 126902 127597 127632 127042 126220 125504 125160 125380 126101 127067 128153 129406 130712
54802 130712 131765 132486 133152 133926 134498 134515 134223 134352 135286 136535 137217 136995 136390 136177 136615 137397 138130 138618
54784 138618 138797 138739 138743 139053 139440 139465 139254 139513 140507 141552 142018 142434 143974 147012 150831 154742 158914 163954
54766 163954 170138 177231 184675 191780 198027 203463 208564 213510 217752 220402 220942 219401 216026 211068
54752 211068 204959 198502 192595 187620 183168 178589 173762 169104 164854 160780 156786 153394 151212 150139
54738A50139o11n29k68K37O86R15R15P10M78N81J142J809K280K730L409M141M586
54721A73350M798N111N545N764N514M774L569J992L71r28j999l372n246o968p537
54706A84738o663n137l974l369k785k010j612k046k755k754j902r76n30l64j89
54691A47672j92n78j103j429j556j579j375q81l99k22k49k62l65p33j163j256
54675A34330r81o44l92o4M23P80O06j47r68j170o05P1Q6n11r71q57n19l76k88
54656A27803K5L47K73r1j52L70J065J372J180Q49P32Q20Q49O82N04N64Q55J133
54638A39180J197R88N24n2m85o23n23l03p1j07o79j431j453n19L13K0q59j027
54620A34090m07j13n52q20k89M21N90M52M55L83Kk73r8M5l72r32q45j21N83Q92
$$ plain form
54738 150139 149528 148999 148731 148968 149654 150569 151484 152194 152672 153253 154395 156204 158484 161214 164623 168764 173350
54721 173350 178148 183259 188804 194568 200082 204856 208425 210417 210788 209860 207861 204489 199243 192275 184738
54706 184738 178075 172938 168964 165595 162810 160800 159188 157142 154387 151633 149731 148755 148225 147861 147672
54691 147672 147480 146902 145799 144370 142814 141235 139860 138979 138580 138358 138109 137847 137482 136749 135586 134330
54675 134330 133349 132705 132313 132249 132672 133452 134058 133911 132943 131773 131168 131239 131325 130814 129843 128986 128467 128091 127803
54656 127803 127828 128175 128448 128357 128205 128575 129640 131012 132192 133041 133773 134593 135442 136124 136628 137192 138047 139180
54638 139180 140377 141365 141889 141837 141352 140729 140206 139903 139832 139725 139046 137615 136162 135643 135956 135976 135117 134090
54620 134090 133683 133570 133018 132198 131909 132330 132920 133372 133827 134210 134212 133939 133841 133886 133514 132582 131737 131616 132199 133091
54600A33091Q62N60J51K5L19N92N21M08N54O94O42Q53J558J957J245q2r16j115
54582A41919j369j775j735j112m65j37qj40o88j169q32J74Q58P52L39O5j07m0
54564A34530O01J419J391L40n67m60K3j58q18r05n0J011J451J158M93j81o53p87
54546A37838m28M51J484J980J670J197J383K038K169J402M97K43N20Q29J022J055
54530A55350O06l17r15n22K71K62o91j380q60L04Q12K26o69r14l90K96N99N18
54512A52586L14J07j45m02m93l39j02n3l17p38r64p76l21M6K28L78M85K37l96
54493A49335q69p16k39q2k30o1O45J247J046J31p73j078p40n4O80J277J538J236
54475A52293M37k13k1P97J161M69n54q66m87j75p4L72J190J575J094M48M84J055
$$ plain form
54600 133091 133953 134513 134664 134689 135008 135600 136121 136529 137083 137777 138419 139272 140830 142787 144032 143950 143034 141919
54582 141919 140550 138775 137040 135928 135463 135326 135318 135178 134490 133321 132489 132663 133521 134273 134612 134677 134570 134530
54564 134530 135131 136550 137941 138281 137714 137254 137277 137119 136301 135396 135346 136357 137808 138966 139459 139278 138625 137838
54546 137838 137410 137861 139345 141325 142995 144192 145575 147613 149782 151184 151681 151924 152444 153273 154295 155350
54530 155350 155956 155639 154724 154202 154473 154735 154044 152664 151804 152108 152920 153146 152477 151563 151173 151469 152068 152586
54512 152586 152900 153007 152862 152460 151967 151628 151526 151473 151156 150418 149454 148678 148357 148403 148631 149009 149494 149731 149335
54493 149335 148466 147750 147511 147429 147199 147138 147783 149030 150076 150207 149434 148356 147616 147562 148242 149519 151057 152293
54475 152293 152730 152517 152496 153293 154454 154923 154369 153503 153016 152841 152767 153139 154329 155904 156998 157446 157930 158985
54457A58985J335R37K61q7R0M36L58l69j240j491r78l05l5j71m72q17j107j138
54439A54192q85n61k81R7N80Q54P38M72L62M03N05P68J187J325P40l68j232j316
54421A57580p40N4P85J367J644J389O50n0j92J54M39L51P0k62q00j425j479n45
54403A58990P96J632J823J835J752J262N14Q7Q4M9q4J66Q04J057N46j4J61P76
54385A72236R93O00M6l82p87j236j595j671j271l20Q36J503J333O97J38k18m38
54368A70464m00m7L05L43J91J06R1J64O25J549K247K001J094N68Q98J589K109
54351A83897K550L077L318K855K054J781K255K666K166R77N6j95l76j127k231
54336B03723l012l289l428l649l769l570k970j947p34M5pl74k47K89M05r8m56
$$ plain form
54457 158985 160320 161257 161518 161431 161521 161957 162315 161946 160706 159215 158237 157932 157897 157726 157254 156437 155330 154192
54439 154192 153307 152746 152465 152562 153142 153996 154734 155206 155568 155971 156476 157244 158431 159756 160496 160128 158896 157580
54421 157580 156840 156894 157679 159046 160690 162079 162729 162679 162487 162641 163080 163431 163501 163239 162439 161014 159535 158990
54403 158990 159786 161418 163241 165076 166828 168090 168604 168691 168775 168824 168740 168906 169710 170767 171313 171299 171460 172236
54385 172236 173229 173829 173875 173493 172706 171470 169875 168204 166933 166613 167449 168952 170285 170982 171120 170902 170464
54368 170464 170064 170017 170322 170665 170856 170962 171053 171217 171842 173391 175638 177639 178733 179301 180199 181788 183897
54351 183897 186447 189524 192842 195697 197751 199532 201787 204453 206619 207596 207652 207457 207081 205954 203723
54336 203723 200711 197422 193994 190345 186576 183006 180036 178089 177355 177400 177393 177019 176772 177061 177466 177368 176912
54319A76912j41M05N57K68k70r71j465j188l21J26k67p01n43m17j014j703j489
54302A67778p10m78p97o70J17N96J51p47j456j749j325Q3J706K089R70j44K7R16
54284A66357J232Q74O54P24N45J20Q2M88N57m3n82l76J70K71K8J92Q70J285R67
54265A74415M19K44J90l29j055j037j3J058J195O18L21P43J377J583J313R38P26
54248A82706O73O18M09j3n67j061j278j096o04j89k61q55j547j860j648j070l88
54231A71969J48L58K41p3m48p00n55M3O11N74P5q7M34J058J117O75J38l81q40
54212A74357q97l76K54N28P28J268J667J100j37p36j93M50J22p87j101n20J49
54195A75876K05j48l42k50k24m67p16o22l23l27p62j070p11O9N95O85P17Q86R34
$$ plain form
54319 176912 176771 177176 177733 178001 177731 176760 175295 174107 173786 173912 173645 172944 172401 171984 170970 169267 167778
54302 167778 167068 166590 165793 165123 165240 165836 165987 165240 163784 162035 160710 160793 162499 164588 165558 165414 165441 166357
54284 166357 167589 168463 169117 169841 170386 170506 170588 171076 171633 171590 171008 170632 170802 171073 171101 171293 172163 173448 174415
54265 174415 174834 175078 175268 174939 173884 172847 172834 173892 175087 175705 176026 176769 178146 179729 181042 181980 182706
54248 182706 183379 183997 184406 184393 183826 182765 181487 180391 179787 179598 179337 178482 176935 175075 173427 172357 171969
54231 171969 172117 172475 172716 172643 172195 171495 170940 170983 171594 172168 172243 172156 172590 173648 174765 175440 175578 175197 174357
54212 174357 173460 173084 173338 173866 174594 175862 177529 178629 178492 177756 177563 178013 178135 177348 176247 175727 175876
54195 175876 176081 175933 175591 175341 175117 174650 173934 173312 172989 172662 171900 170830 170119 170188 170783 171468 172185 173071 174005
54176A74005P02M40L50K29j47o18r00r39p75l74J73M69K28l11o79p98r86j359
54158A68710j578j253l90O62J492J794J423N16m38q71n98LL60K92J20J90M62O48
54140A71544O03M58L55K91J67rr8L4L20N16M68L02K06M7m66j182j408o66O02J431
54120A73515J367R05Q71J521K310K434J642N29m3J47N40N16L9m35m27K85J443
54103A87159K228J827M31p37p79j77Lm41q47r12j066j537j776j233j81N98O93
54086A83253L40J7J01P04J610K374K605K206J337L72j41K78J578L087M063M329
54070B08113M332M557N014N320N218M961N056N717O600P035O387M346J193k174
54056B71675m778o220o712o560n939n138m430l621k277n82O01Q57P72R65J269
$$ plain form
54176 174005 174707 175147 175497 175726 175579 174961 174061 173122 172347 171973 172146 172615 172843 172532 171853 171055 170069 168710
54158 168710 167132 165879 165489 166151 167643 169437 170860 171376 170938 170067 169469 169472 169832 170124 170244 170434 170896 171544
54140 171544 172147 172605 172960 173251 173418 173409 173311 173345 173665 174181 174649 174951 175157 175204 174738 173556 172148 171482 172084 173515
54120 173515 174882 175787 176658 178179 180489 182923 184565 185094 185051 185198 185738 186254 186293 185858 185431 185716 187159
54103 187159 189387 191214 191645 190908 190129 189952 189955 189514 188667 187755 186689 185152 183376 182143 181962 182560 183253
54086 183253 183593 183610 183711 184415 186025 188399 191004 193210 194547 194919 194778 195056 196634 199721 203784 208113
54070 208113 212445 217002 222016 227336 232554 237515 242571 248288 254888 261923 268310 272656 273849 271675
54056 271675 266897 260677 253965 247405 241466 236328 231898 228277 226000 225418 226019 226876 227648 228613 229882
54041B29882J361J566K242K957L258L699N021O616P079O285N592N806O168N870
54027B93402N381N484N893N804N095M189L155J966J202J466K155J945O11n40n94
54012C36614m73j625l774n072m595l608l769m863n298m526l736l992m788n052
53998B81443m638m025l276k249j368j152j264j026o28p36j090o99M94J430J670
53983B62886K043L048L792L382K295J497R18j52j702l042l888m493m917m958m706
53968B52003m457m151l526k720k129j754j244n64p3M9j7j01j43K6N48J196J530
53951B34473J491J450J698K236K987L861M568M779M502M102L910M055M506M987
53937B83605M983M236L231K761L030L517L724L634L474L365L416L730M183M448
$$ plain form
54041 229882 231243 232809 235051 238008 241266 244965 249986 256602 263681 269966 275558 281364 287532 293402
54027 293402 298783 304267 310160 315964 321059 325248 328403 330369 331571 333037 335192 337137 337748 337208 336614
54012 336614 336141 334516 330742 325670 321075 317467 313698 308835 303537 299011 295275 291283 286495 281443
53998 281443 276805 272780 269504 267255 265887 264735 263471 262445 261817 261081 259991 259292 259786 261216 262886
53983 262886 264929 267977 271769 275151 277446 278943 279861 279709 278007 274965 271077 266584 261667 256709 252003
53968 252003 247546 243395 239869 237149 235020 233266 232022 231458 231385 231434 231417 231316 231173 231199 231747 232943 234473
53951 234473 235964 237414 239112 241348 244335 248196 252764 257543 262045 266147 270057 274112 278618 283605
53937 283605 288588 292824 296055 298816 301846 305363 309087 312721 316195 319560 322976 326706 330889 335337
53923C35337M420M446M974O143P758R517J1164J2596J3933J5348J6828J8195J9362
53910D80021K0395K1140K0973J9045J4880Q796J863m548r376j2241j3444j3628
53898E33876j3431j3188j2874j2325j1507j0531r512q637q247q528r072r147q537
53885C98340p804p494p523p552p608p866q050p622o509n257m457m217m222m030
53871C08129l422k727k639l407m345m543l986l498l580l833l692l268l125l486
53857B58578l962l988l302k163j168p84r20j078r89q65r34j055j010r53j121j296
53841B32990j007l43kl22p06m50K58O60N69N19Q11J076J013Q89Q96O38j97j042
53823B36250j040j94P46J343J701J742J114j8q24p63j90L08N76O76O12O77J444
$$ plain form
53923 335337 339757 344203 349177 355320 363078 372595 383759 396355 410288 425636 442464 460659 480021
53910 480021 500416 521556 542529 561574 576454 585250 587113 582565 573189 560948 547504 533876
53898 533876 520445 507257 494383 482058 470551 460020 450508 441871 433624 425096 416024 406877 398340
53885 398340 390536 383042 375519 367967 360359 352493 344443 336821 330312 325055 320598 316381 312159 308129
53871 308129 304707 301980 299341 295934 291589 287046 283060 279562 275982 272149 268457 265189 262064 258578
53857 258578 254616 250628 247326 245163 243995 243211 242291 241213 240224 239359 238425 237370 236360 235407 234286 232990
53841 232990 231983 231640 231638 231316 230610 230160 230418 231078 231647 232166 232977 234053 235066 235955 236851 237489 237292 236250
53823 236250 235210 235016 235762 237105 238806 240548 241662 241644 240820 240057 239867 240175 240751 241427 242039 242716 244160
53806B44160K972M419M971M811M718N042N622O340P073P373O898O076N725N909
53792C22109N836M996L859L174K989K733K042J110K99k49n44n28k23l5o02k112
53776C44854l912n151n648n830n880n481m562l694l480l853m310m570m631m435
53762B79417l893l183k699k669k942l172l124k888k721k588k093j190o04j007
53748B44644j905k177j672j316j490j396n39K24mp21q48l87j33k20o2M62Q06P79
53730B34045Q02J089J347J415J464J541J459J198Q85M83M9M7P17J404J344Q91
53714B50180J046J828K253J934J561J595J622J414J520K173K570K058J273J301
53700B74328K190L127L649L931M155M248M256M370M590M655M296L461K417J635
$$ plain form
53806 244160 247132 251551 256522 261333 266051 271093 276715 283055 290128 297501 304399 310475 316200 322109
53792 322109 327945 332941 336800 339974 342963 345696 347738 348848 349147 348898 348354 347826 347603 347568 346966 344854
53776 344854 340942 335791 330143 324313 318433 312952 308390 304696 301216 297363 293053 288483 283852 279417
53762 279417 275524 272341 269642 266973 264031 260859 257735 254847 252126 249538 247445 246255 245651 244644
53748 244644 242739 240562 238890 237574 236084 234688 234149 234373 234369 233648 232800 232413 232280 232060 231998 232460 233266 234045
53730 234045 234847 235936 237283 238698 240162 241703 243162 244360 245245 245728 245777 245824 246541 247945 249289 250180
53714 250180 251226 253054 255307 257241 258802 260397 262019 263433 264953 267126 269696 271754 273027 274328
53700 274328 276518 279645 283294 287225 291380 295628 299884 304254 308844 313499 317795 321256 323673 325308
53686C25308J247O49p86k537l259k518j466j253j560j424q70p41j213j522j159
53671C06896m77qJ32K3k86n86n97m13m16o11n09N2N05K84m26j059j447j707j572
53652B97778n30J207K523K550J680R32N81K8r82j739j493m70M90R82J213J429
53636C06179J639J840K040K092J877J595J472J381J133J001J344J876K006J829
53622C29304K047K805L431L508L418L468L315K772K478L041M078M756M915M936
53608C78272M868M470L910L669L763L708L314K936K871L020L228L490L724L750
53594D28993L608L589L783L953L907L656L129K089N48r79j972k481l016l957n187
53579D39663o226o549n890m488l048k272k254k404k110j422r35r77j218j183q56
$$ plain form
53686 325308 326555 327204 326418 323881 320622 318104 316638 315385 313825 312401 311531 310790 309577 308055 306896
53671 306896 306419 306411 306543 306566 306280 305694 305097 304684 304268 303657 303148 303200 303705 303989 303563 302504 301057 299350 297778
53652 297778 297248 298455 300978 303528 305208 306140 306721 306749 305767 304028 302535 302065 302555 303537 304750 306179
53636 306179 307818 309658 311698 313790 315667 317262 318734 320115 321248 322249 323593 325469 327475 329304
53622 329304 331351 334156 337587 341095 344513 347981 351296 354068 356546 359587 363665 368421 373336 378272
53608 378272 383140 387610 391520 395189 398952 402660 405974 408910 411781 414801 418029 421519 425243 428993
53594 428993 432601 436190 439973 443926 447833 451489 454618 456707 457255 456276 454304 451823 448807 444850 439663
53579 439663 433437 426888 420998 416510 413462 411190 408936 406532 404422 403000 402065 401088 399870 398687 397831
53564C97831n22k36J55N12M85J04q7K33O87O99K12l01l80R4R04J577J671J182
53546D04820O70O95J233J752J862J741J920K663L544L780L172K555L005M564O181
53531D44157O950P054P219P751Q372Q810R145R638J0377J1138J1531J1477J1433
53518E65052J1885J2673J3225J3507J4138J5428J6845J7759J8291J8986K0016
53507G37805K1137K2145K2898K3204K3076K2901K2956K2905K2289K1256K0413
53496I82985K0058J9941J9699J9131J8226J7249J6676J6688J6801J6492J5956
53485A179902J5805J6153J6492J6493J6388J6496J6793J7037J7014J6519J5388
53474A360480J3667J1554R188O708M386K372L65k078m879p378r058r997j0572
$$ plain form
53564 397831 397309 397073 397228 397740 398225 398329 398242 398475 399162 399861 400073 399772 399392 399486 400390 401967 403638 404820
53546 404820 405490 406185 407418 409170 411032 412773 414693 417356 420900 424680 427852 430407 433412 437976 444157
53531 444157 451107 458161 465380 473131 481503 490313 499458 509096 519473 530611 542142 553619 565052
53518 565052 576937 589610 602835 616342 630480 645908 662753 680512 698803 717789 737805
53507 737805 758942 781087 803985 827189 850265 873166 896122 919027 941316 962572 982985
53496 982985 1003043 1022984 1042683 1061814 1080040 1097289 1113965 1130653 1147454 1163946 1179902
53485 1179902 1195707 1211860 1228352 1244845 1261233 1277729 1294522 1311559 1328573 1345092 1360480
53474 1360480 1374147 1385701 1394889 1401597 1405983 1408355 1408720 1406642 1401763 1394385 1385327 1375330 1364758
53461A364758j1064j1602j2233j2821j3163j3276j3466j4008j4879j5901j6965
53450A215380j8054j9128j9997k0339j9885j8727j7317j6056j4961j3894j2890
53439A024132j2014j1015r442p170m612k436j158q28r29p27O5J009J567J839K382
53424I80663L494M955O423P754Q936J0020J1165J2539J4160J5913J7601J8923
53412A112546J9685K0218K1232K2942K4693K5886K6905K8465L0406L1921L2911
53401A397810L4231L6400L8884M0919M2487M4003M5588M7109M8536M9857N0847
53390A876671N1339N1545N1731N1761N1233M9996M8295M6504M4875M3405M1759
53379B409114L9484L6491L3192L0040K7032K3855K0339J6535J2476Q079L263j999
$$ plain form
53461 1364758 1353694 1342092 1329859 1317038 1303875 1290599 1277133 1263125 1248246 1232345 1215380
53450 1215380 1197326 1178198 1158201 1137862 1117977 1099250 1081933 1065877 1050916 1037022 1024132
53439 1024132 1012118 1001103 991661 984491 979879 977443 976285 975457 974528 973801 973866 974875 976442 978281 980663
53424 980663 984157 989112 995535 1003289 1012225 1022245 1033410 1045949 1060109 1076022 1093623 1112546
53412 1112546 1132231 1152449 1173681 1196623 1221316 1247202 1274107 1302572 1332978 1364899 1397810
53401 1397810 1432041 1468441 1507325 1548244 1590731 1634734 1680322 1727431 1775967 1825824 1876671
53390 1876671 1928010 1979555 2031286 2083047 2134280 2184276 2232571 2279075 2323950 2367355 2409114
53379 2409114 2448598 2485089 2518281 2548321 2575353 2599208 2619547 2636082 2648558 2656637 2659900 2657901
53367B657901p674j3563j9316k4672k9721l4672l9347m3071m5219m5877m5887
53356B308882m6111m6738m7306m7325m6657m5313m3310m0864l8553l6914l6024
53345A833767l5599l5398l5299l5195l5053l4950l4729l3871l2058k9680k7381
53334A464554k5249k2942k0441j8129j6154j4357j2921j2358j2625j2855j2468
53323A284055j1968j2206j3235j4412j5281j5755j5617j4505j2534j0452q941
53312A139149q014p181o018m457k766j351m20K35J065K278L653M948O332Q187
53298A135640J0459J2576J4143J5560J7496J9876K1794K2661K2963K3533K4408
53287A341109K4891K4559K3685K2692K1654K0517J9319J7976J6156J3638J0593
$$ plain form
53367 2657901 2650227 2636664 2617348 2592676 2562955 2528283 2488936 2445865 2400646 2354769 2308882
53356 2308882 2262771 2216033 2168727 2121402 2074745 2029432 1986122 1945258 1906705 1869791 1833767
53345 1833767 1798168 1762770 1727471 1692276 1657223 1622273 1587544 1553673 1521615 1491935 1464554
53334 1464554 1439305 1416363 1395922 1377793 1361639 1347282 1334361 1322003 1309378 1296523 1284055
53323 1284055 1272087 1259881 1246646 1232234 1216953 1201198 1185581 1171076 1158542 1148090 1139149
53312 1139149 1131135 1123954 1117936 1113479 1110713 1109362 1108942 1109177 1110242 1112520 1116173 1121121 1127453 1135640
53298 1135640 1146099 1158675 1172818 1188378 1205874 1225750 1247544 1270205 1293168 1316701 1341109
53287 1341109 1366000 1390559 1414244 1436936 1458590 1479107 1498426 1516402 1532558 1546196 1556789
53276A556789P393M292J419j133l423n650p902j0017j1808j3345j4911j6748j8833
53263A466123k0861k2400k3239k3614k3988k4653k5599k6649k7415k7388k6470
53252A193847k5363k4927k5066k4754k3384k1642k0666k0738k1188k1387k1335
53241I43397k1370k1633k1948k1952k1251j9675j7531j5507j4170j3473j2829
53230G42058j1712j0156q636p532o930o877p478q549r543j0103j0501j1171j2083
53217F20787j2971j3895j5010j5909j5862j4820j3536j2604j1881j1044j0134
53206D73121r282q437p687p407p685p960p675p016o537o365o187n928n931o460
53192C72564p257p719p374o303n148m557m544m546m183l667l341l119k639j773
$$ plain form
53276 1556789 1564182 1568474 1569893 1568760 1565337 1559687 1551785 1541768 1529960 1516615 1501704 1484956 1466123
53263 1466123 1445262 1422862 1399623 1376009 1352021 1327368 1301769 1275120 1247705 1220317 1193847
53252 1193847 1168484 1143557 1118491 1093737 1070353 1048711 1028045 1007307 986119 964732 943397
53241 943397 922027 900394 878446 856494 835243 815568 798037 782530 768360 754887 742058
53230 742058 730346 720190 711554 704022 697092 690215 682737 674188 664645 654542 644041 632870 620787
53217 620787 607816 593921 578911 563002 547140 532320 518784 506180 494299 483255 473121
53206 473121 463839 455402 447715 440308 432623 424663 416988 409972 403435 397070 390883 384955 379024 372564
53192 372564 365307 357588 350214 343911 338763 334206 329662 325116 320933 317266 313925 310806 308167 306394
53178C06394p28J60N46K36n97j423j784j623j161p04n62q37j148r55k85K44K89
53161B96062K13L67M65O1o71j156j206j153j320j720k109k127j567p99n74j166
53145B81600j973k325k249k054j657r13k57k60p24r10n94k48j81j99q9J18N03
53128B67588J182J746J498M81l02p6Q06J477J620J474J202Q30O05Q64J535K085
53112B84615K077J535Q64N18O63Q98M75q92k401k791j797o42o89j796k533k051
53096B76053j141j046j761k156j640q47n33n63m17j28j57n89j014j058o43J34
53080B62494R65J343J089O65N89O99N17J30N5L34M30J67K8K71L80j66j010j317
53062B67663q24j00J57k51r70j481j532j316j108q10r0R57J637J375L90n40q16
$$ plain form
53178 306394 305666 305826 306372 306608 306011 304588 302804 301181 300020 299316 298754 297917 296769 295814 295529 295773 296062
53161 296062 296275 296642 297107 297168 296497 295341 294135 292982 291662 289942 287833 285706 284139 283340 282766 281600
53145 281600 279627 277302 275053 272999 271342 270429 270172 269912 269188 268278 267684 267436 267255 267056 266967 267085 267588
53128 267588 268770 270516 272014 272495 272193 272117 272923 274400 276020 277494 278696 279526 280131 280995 282530 284615
53112 284615 286692 288227 289091 289609 290272 291170 291645 290753 288352 285561 283764 283122 282433 280637 278104 276053
53096 276053 274912 273866 272105 269949 268309 267462 266929 266366 265949 265821 265664 265075 264061 263003 262360 262494
53080 262494 263459 264802 265891 266556 267145 267844 268361 268491 268546 268880 269310 269477 269505 269776 270156 269990 268980 267663
53062 267663 266839 266739 266896 266645 265675 264194 262662 261346 260238 259428 259338 260295 261932 263307 263697 263157 262341
53045B62341l69M46J089J180Q24M58K71Qm72q35q15p83j226j841j706n36P91J239
53027B60064Q05L95O78J372J635R76k36j081r59j82L98L42N2J28N98J003J095
53010B67083J062J084J081R99J017J232J417J317R98O69L22q4l11l6O25J168J326
52993B80969J299J350J402J209O73r1q19j183j000m11L04J060J860K479K588K306
52977B93995K106K126J959J326N46P6k1J44N73J115J286Q89N35R49J907K395J896
52960C13802R95N83Q51J231J121M02o07j533k200k569k558k140j606j448j872
52945C02452k575l041k936k234j272o78p99j153r30j81J81k67q58r56r41j345
52929B82467j772j565j024r36j214j044l19K10J73j2r4l85r00j011m24K72M16
$$ plain form
53045 262341 261972 262418 263507 264687 265511 265969 266240 266248 265776 264941 264126 263343 262117 260276 258570 258034 258825 260064
53027 260064 260869 261264 261942 263314 264949 265925 265689 264608 263649 263467 263865 264207 264259 264387 264985 265988 267083
53010 267083 268145 269229 270310 271309 272326 273558 274975 276292 277290 277959 278281 278197 277886 277850 278475 279643 280969
52993 280969 282268 283618 285020 286229 286902 286811 285992 284809 283809 283398 283702 284762 286622 289101 291689 293995
52977 293995 296101 298227 300186 301512 302058 302134 302113 302257 302830 303945 305231 306120 306655 307604 309511 311906 313802
52960 313802 314797 315380 316231 317462 318583 318985 318378 316845 314645 312076 309518 307378 305772 304324 302452
52945 302452 299877 296836 293900 291666 290394 289716 288917 287764 286834 286653 286834 286567 285709 284753 283812 282467
52929 282467 280695 279130 278106 277170 275956 274912 274593 274803 274976 274964 274870 274485 273585 272574 272150 272422 272838
52912B72838J14j65k46j60Q0K97J90j76l90l77m55n41m9J040J762J406N26N6J1
52893B75761k40p98j163j090p60k85L18P78Q27O96P63Q41M28l10n53N1P87P89
52875B76840P9n39m66J49O95P86O26P43J351K133K666K910L095L322L461L329
52859C01180K742J632L21n22n44j89k06q33j790k831l819m406m201l438k908l037
52843B77151l385l287k677j998j524j096n21lj2p03j558j807j256m80n1J52N28
52826B57473R87J068P64N62O42N85R6n34r35j162j328j215o87j20J15K72P61J327
52808B58671J418J195J391K050K294J608O60K55J37m80j565k253k091j541j204
52793B60545j145j134j109j063q89n65k99l03o01j052j374j213n06K20L98J98
$$ plain form
52912 272838 272952 272787 272541 272381 272461 272758 272948 272772 272382 272005 271550 271009 270960 272000 273762 275168 275694 275750 275761
52893 275761 275521 274723 273560 272470 271710 271425 271743 272521 273348 274044 274807 275648 276076 275766 275213 275264 276051 276840
52875 276840 276919 276380 275914 276063 276758 277544 278170 278913 280264 282397 285063 287973 291068 294390 297851 301180
52859 301180 303922 305554 305875 305353 304809 304620 304414 303581 301791 298960 295141 290735 286534 283096 280188 277151
52843 277151 273766 270479 267802 265804 264280 263184 262663 262660 262648 261945 260387 258580 257324 256844 256793 256945 257473
52826 257473 258460 259528 260292 260854 261496 262081 262177 261643 260708 259546 258218 257003 256316 256196 256311 256583 257344 258671
52808 258671 260089 261284 262675 264725 267019 268627 269287 269542 269679 269199 267634 265381 263290 261749 260545
52793 260545 259400 258266 257157 256094 255205 254640 254341 254038 253437 252385 251011 249798 249292 249512 249910 250108
52777B50108L11Q51J192J047J026J589K136J814Q19J49K80P54J003Q90N05kl68
52760B64104m53n19q35j120r07l81j66l42k99K55Q17Q47M63R5q8o2L00J002J728
52741B64439K133K159J902J486J151J215J708K272K532K378J917J420J287J618
52727B89617J884J466N78L0J00K46J06k5pl94j538k734k926j968o79R9N8o38j469
52708B81806j869j843j969k491k762k123r40j35J4l0K0k7k13j72L26J021J494
52691B70107J548J169M51l59q94q74k10R58K156K739K442J635Q52K58j68k93j06
52674B81411l6m69j054j048l68K36J13n54j085j067o49l02l50o12n66j6O28R57
52656B75169J187J708K229K052J212P16J286K356K770K184J309Q31N49j73j367
$$ plain form
52777 250108 250419 251270 252462 253509 254535 256124 258260 260074 260893 261042 261322 262076 263079 263969 264474 264472 264104
52760 264104 263651 263132 262297 261177 260270 259889 259723 259381 259082 259337 260154 261001 261464 261559 261471 261409 261709 262711 264439
52741 264439 266572 268731 270633 272119 273270 274485 276193 278465 280997 283375 285292 286712 287999 289617
52727 289617 291501 292967 293545 293575 293675 293921 294027 294002 293995 293601 292063 289329 286403 284435 283756 283855 283913 283275 281806
52708 281806 279937 278094 276125 273634 270872 268749 267809 267674 267688 267658 267678 267651 267438 267266 267592 268613 270107
52691 270107 271655 272824 273275 272916 272022 271148 270938 271896 274052 276791 279233 280868 281720 281978 281810 281517 281411
52674 281411 281375 280906 279852 278804 278436 278672 278785 278231 277146 276079 275430 275128 274778 274166 273600 273584 274212 275169
52656 275169 276356 278064 280293 282345 283557 284273 285559 287915 290685 292869 294178 295009 295558 295385 294018
52641B94018k302k382j826j227o81Q4Q94J091N12p2J40J033J959K594K938K867
52625B99640K295J640J459J628J423M29j025k362l262l690l815l908l967l509
52611B82976k158l83Q07R91P13O57Q89J091J185J378J790K255K519K437K019J284
52595C00450K40r03j620j505q65m29m08l12N5J38l77p68k17Q75J481J490J765
52578B99090K575L053K460J239L59J49K08M4m86j175j647j682j404j043o36k66
52562C00838l07r01j407j080j88K45j07m63j79L80N49L09J09J82M49P60R14P35
52544C00838L10j26n83j170j541j121r6N21J36p02j187j244j184r61l84K56M61
52527B92223K67J85N45J217J837K036J622Q35J96j8L4K69Q64J766K516K905L379
$$ plain form
52641 294018 291716 289334 287508 286281 285600 285684 286578 287669 288181 288109 288249 289282 291241 293835 296773 299640
52625 299640 301935 303575 305034 306662 308085 308514 307489 305127 301865 298175 294360 290452 286485 282976
52611 282976 280818 280435 281242 282233 282946 283603 284492 285583 286768 288146 289936 292191 294710 297147 299166 300450
52595 300450 300690 299787 298167 296662 295797 295368 294960 294648 294703 294841 294464 293696 293479 294354 295835 297325 299090
52578 299090 301665 304718 307178 308417 308776 308925 309133 309177 308691 307516 305869 304187 302783 301740 301104 300838
52562 300838 300531 299630 298223 297143 296955 297200 297093 296630 296451 296831 297380 297689 297798 297980 298429 299189 300103 300838
52544 300838 301148 301022 300439 299269 297728 296607 296511 297032 297168 296466 295279 294035 292851 291890 291506 291762 292223
52527 292223 292490 292675 293220 294437 296274 298310 299932 300767 300963 300945 300979 301248 302112 303878 306394 309299 312678
52510C12678M225M886M690L899L338L126K565J230m82k061l493m878n834n786
52496C18103m765l570k979k883k472j313j3M84K7p42j322j669j553n02J241K402
52480B98474K026O84k39j53M41R45J211J224R31N99P49J571K631L297L301K844
52464C20536K362K160K216K333K501K764K794K012M35j109j999k614l545m489
52450C26357m665m080l533l359l040k208j346j123j500j883j773j032J18J083
52436B98016J169K85q07j225q37k08J22N0k55o22q61p98m26L9L46M05K98J80K41
52417B95112O42J289J720J527R93R45J779K936L650L960M484N436O500P603R051
52402C47627J0779J2122J2640J2488J1617R312N144m0m709q019j0028j0919j0682
$$ plain form
52510 312678 316903 321789 326479 330378 333716 336842 339407 340637 340155 338094 334601 329723 323889 318103
52496 318103 313338 309768 306789 303906 301434 300121 300108 300592 300619 299877 298555 296886 295333 294831 296072 298474
52480 298474 300500 301184 300945 300792 301233 302178 303389 304613 305544 306143 306892 308463 311094 314391 317692 320536
52464 320536 322898 325058 327274 329607 332108 334872 337666 339678 340113 339004 337005 334391 330846 326357
52450 326357 321692 317612 314079 310720 307680 305472 304126 303003 301503 299620 297847 296815 296933 298016
52436 298016 299185 299470 298663 297438 296601 296393 296515 296565 296310 295688 294827 294029 293603 293642 293988 294393 294691 294871 295112
52417 295112 295754 297043 298763 300290 301283 302228 304007 306943 310593 314553 319037 324473 330973 338576 347627
52402 347627 358406 370528 383168 395656 407273 416585 421729 421689 416980 408961 398933 388014 377332
52389C77332r502p866o226m784l607k677j948j510j461j435p34P36K063K367J900
52374C42648J608J970K816L902M952N460N185M674M526M334L199J242m18j227
52360C84871j785k602l161k776j633l98O55J542K025J829J239R27J213J752K030
52345C85728J871J527J364J520J831K103K336K576K829L245M089N220N918N824
52331D27981N709O605Q376R942J0874J1814J3161J4348J4836J5062J5662J6465
52319E70835J6885J6897J6955J7194J7324J7164J6849J6656J6899J7812J9219
52308G60689K0540K1412K2006K2542K2876K2896K2855K2883K2608K1794K0881
52297A003982K0278J9506J7800J5285J2715J0246P343M000J028j112k953m993
$$ plain form
52389 377332 367830 359964 353738 348954 345347 342670 340722 339212 337751 336316 335582 336318 338381 340748 342648
52374 342648 344256 346226 349042 352944 357896 363356 368541 373215 377741 382075 385274 386516 386098 384871
52360 384871 383086 380484 377323 374547 372914 372516 373171 374713 376738 378567 379806 380733 381946 383698 385728
52345 385728 387599 389126 390490 392010 393841 395944 398280 400856 403685 406930 411019 416239 422157 427981
52331 427981 433690 440295 448671 458613 469487 481301 494462 508810 523646 538708 554370 570835
52319 570835 587720 604617 621572 638766 656090 673254 690103 706759 723658 741470 760689
52308 760689 781229 802641 824647 847189 870065 892961 915816 938699 961307 983101 1003982
52297 1003982 1024260 1043766 1061566 1076851 1089566 1099812 1107155 1111155 1112183 1111071 1108118 1103125
52285A103125o732p382p078o733o912p434p913q177q127p622o666n364l738j819
52271A011428L1J331K107K987M497O500Q510J0240J1545J2194J2152J1934J2133
52258A107589J2635J2908J3072J4047J6269J8797K0218K0090J9019J7661J6155
52247A288460J4411J2323R735O641L483Q00j359l304n056o330p102p679q176q456
52233A288391q656r220j0220j1199j1851j2347j2780j2871j2548j2226j2111j1744
52221A150618j0737r505q680q129p182n697m292l443k928k255j311l81L76J231
52207A087685K583M258N420N486M982M965N574N902N470M995N232N793N878N596
52193A159819N665O174O521O489O450O584O591O261N619M542K946J300J11j109
$$ plain form
52285 1103125 1096393 1089011 1081933 1075200 1068288 1060854 1052941 1044764 1036637 1029015 1022349 1016985 1013247 1011428
52271 1011428 1011459 1012790 1014897 1017884 1022381 1028881 1037391 1047631 1059176 1071370 1083522 1095456 1107589
52258 1107589 1120224 1133132 1146204 1160251 1176520 1195317 1215535 1235625 1254644 1272305 1288460
52247 1288460 1302871 1315194 1324929 1331570 1335053 1335853 1334494 1331190 1326134 1319804 1312702 1305023 1296847 1288391
52233 1288391 1279735 1270515 1260295 1249096 1237245 1224898 1212118 1199247 1186699 1174473 1162362 1150618
52221 1150618 1139881 1130376 1121696 1113567 1106385 1100688 1096396 1092953 1090025 1087770 1086459 1086078 1086454 1087685
52207 1087685 1090268 1094526 1099946 1105432 1110414 1115379 1120953 1126855 1132325 1137320 1142552 1148345 1154223 1159819
52193 1159819 1165484 1171658 1178179 1184668 1191118 1197702 1204293 1210554 1216173 1220715 1223661 1224961 1225072 1223963
52179A223963l412o718r490j0615j0657j0712j0835j0436r564q770q021o779n119
52166A112835l800l102k359r66P60K099K888L513M236M829M845L960K236K22j288
52151A130908j820j528r12k36N48J431K113K239J835J372J325J664J843J394M84
52136A142660k32l72j96j23n8N22J868L651N409P019Q593J0252J2239J4969J8450
52121A224651K1770K3760K4286K4465K5373K6860K7943K7978K7072K5672K4231
52110A504061K3158K2489K1651J9993J7734J5914J5271J5531J6024J6561J7234
52099A705621J7726J7385J6044J4255J2584J0924Q691N445J236l538q352j2704
52087A785317j6310j9178k1436k3024k3639k3040k1379j9177j6962j4981j3291
$$ plain form
52179 1223963 1220551 1213833 1204343 1193728 1183071 1172359 1161524 1151088 1141524 1132754 1124733 1117954 1112835
52166 1112835 1109035 1105933 1103574 1102608 1103368 1105467 1108355 1111868 1116104 1120933 1125778 1129738 1131974 1132196 1130908
52151 1130908 1129088 1127560 1126648 1126412 1126960 1128391 1130504 1132743 1134578 1135950 1137275 1138939 1140782 1142176 1142660
52136 1142660 1142428 1142056 1141860 1141737 1141679 1142201 1144069 1147720 1153129 1160148 1168741 1178993 1191232 1206201 1224651
52121 1224651 1246421 1270181 1294467 1318932 1344305 1371165 1399108 1427086 1454158 1479830 1504061
52110 1504061 1527219 1549708 1571359 1591352 1609086 1625000 1640271 1655802 1671826 1688387 1705621
52099 1705621 1723347 1740732 1756776 1771031 1783615 1794539 1803230 1808675 1809911 1806373 1798021 1785317
52087 1785317 1769007 1749829 1728393 1705369 1681730 1658690 1637311 1618134 1601172 1586191 1572900
52076A572900j1951j0991j0152q916o931m350j617J048L747O467Q800J0271J0919
52063A559244J1367J2262J3682J5086J5862J5952J5928J6384J7261J7956J8070
$$ plain form
52076 1572900 1560949 1549958 1539806 1530890 1523959 1519609 1517992 1519040 1522787 1529254 1538054 1548325 1559244
52063 1559244 1570611 1582873 1596555 1611641 1627503 1643455 1659383 1675767 1693028 1710984 1729054
$$ [...]
##END NTUPLES=NMR SPECTRUM
##END=
