##TITLE=AC1661_NTAAH14397_8531551_JirI67dpmB
##JCAMPDX= 6.0         $$ Bruker NMR JCAMP-DX V2.0
##DATA TYPE= NMR SPECTRUM
##DATA CLASS= NTUPLES
##ORIGIN= BRUKER
##OWNER= Administrator
$$ 1.72 TOPSPIN		Version 2.1
$$ 2014-03-14 18:33:36.076 -0800  Administrator@X
$$ Compression mode = diff/dup
##.OBSERVE FREQUENCY= 400.02188249412
##.OBSERVE NUCLEUS= ^1H
##.ACQUISITION MODE= SIMULTANEOUS (DQD)
##.ACQUISITION SCHEME= undefined
##.AVERAGES= 8
##.DIGITISER RES= 22
##SPECTROMETER/DATA SYSTEM= spect
##.PULSE SEQUENCE= zg30
##.SOLVENT NAME= COFFEE_meoh
##.SHIFT REFERENCE= INTERNAL, COFFEE_meoh, 1, 14.98509
##AUDIT TRAIL= $$ (NUMBER, WHEN, WHO, WHERE, PROCESS, VERSION, WHAT)
$$ ##TITLE= Audit trail, TOPSPIN		Version 2.1
$$ ##JCAMPDX= 5.01
$$ ##ORIGIN= Bruker BioSpin GmbH
$$ ##OWNER= Administrator
$$ $$ E:\/data/COFFEE/nmr/AC1661_NTAAH14397_8531551_JirI67dpmB/10/pdata/1/auditp.txt
$$ ##AUDIT TRAIL=  $$ (NUMBER, WHEN, WHO, WHERE, PROCESS, VERSION, WHAT)
(   1,<2014-03-14 18:33:29.420 -0800>,<Administrator>,<X>,<go>,<TOPSPIN 2.1>,
      <created by zg
	started at 2014-03-14 18:32:22.935 -0800,
	POWCHK enabled, PULCHK disabled,
       configuration hash MD5:
       C8 4E 4E 5D D3 5C D8 9E 9F 52 82 E0 59 8A DE 15
       data hash MD5: 64K
       F5 C3 43 1A 65 3F 04 5F C1 70 EB 49 78 85 9B 0D>)
(   2,<2014-03-14 18:33:32.357 -0800>,<Administrator>,<X>,<proc1d>,<TOPSPIN 2.1>,
      <Start of raw data processing
       efp LB = 0 FT_mod = 6 PKNL = 1 PHC0 = 0 PHC1 = 0 SI = 32K 
       data hash MD5: 32K
       46 0C 74 55 6B 7A BC 49 AB 1A 89 9D 6A 56 91 ED>)
(   3,<2014-03-14 18:33:32.654 -0800>,<Administrator>,<X>,<proc1d>,<TOPSPIN 2.1>,
      <pk PHC0 = 94.87793 PHC1 = 0 
       data hash MD5: 32K
       36 53 D7 44 A0 5E 29 9C 65 2C 39 C2 D7 11 16 35>)
(   4,<2014-03-14 18:33:32.748 -0800>,<Administrator>,<X>,<proc1d>,<TOPSPIN 2.1>,
      <abs ABSG = 1 
       data hash MD5: 32K
       33 D5 40 10 C8 9E DC 30 CB A5 9B 7B 06 24 DE F4>)
(   5,<2014-03-14 18:33:32.826 -0800>,<Administrator>,<X>,<proc1d>,<TOPSPIN 2.1>,
      <abs ABSG = 2 
       data hash MD5: 32K
       E9 74 BA 71 68 CF BD 9D C9 0B A5 AD BC 5F 18 43>)
(   6,<2014-03-14 18:33:32.873 -0800>,<Administrator>,<X>,<proc1d>,<TOPSPIN 2.1>,
      <abs ABSG = 3 
       data hash MD5: 32K
       77 4D CB B8 B2 E3 46 5D 09 EE EF 9F AF 87 88 A4>)
(   7,<2014-03-14 18:33:32.935 -0800>,<Administrator>,<X>,<proc1d>,<TOPSPIN 2.1>,
      <abs ABSG = 4 
       data hash MD5: 32K
       E7 39 84 75 70 BD 3A 4C 3E 1A B4 F5 67 AD 8A A9>)
(   8,<2014-03-14 18:33:32.998 -0800>,<Administrator>,<X>,<proc1d>,<TOPSPIN 2.1>,
      <abs ABSG = 5 
       data hash MD5: 32K
       C3 0F D3 1E 15 31 2D D0 D7 78 74 89 34 F1 ED DA>)
$$ ##END=
$$ 
$$ $$ hash MD5
$$ $$ B2 67 A7 51 53 37 B5 BC C0 17 92 B9 3B 5C 3D D2
##$RELAX= 
##$RELAX= 
##$RELAX= 
##$RELAX= 
##$RELAX= 
##$RELAX= 
##$RELAX= 
$$ Bruker specific parameters
$$ --------------------------
##$DU= <E:\>
##$EXPNO= 10
##$NAME= <AC1661_NTAAH14397_8531551_JirI67dpmB>
$$ [...]
150 150 150 150 150 150 150 150
##$TP07= 0
##$TPNAME0= <>
##$TPNAME1= <>
##$TPNAME2= <>
##$TPNAME3= <>
##$TPNAME4= <>
##$TPNAME5= <>
##$TPNAME6= <>
##$TPNAME7= <>
##$TPOAL= (0..7)
0.5 0.5 0.5 0.5 0.5 0.5 0.5 0.5
##$TPOFFS= (0..7)
0 0 0 0 0 0 0 0
##$TUNHIN= 0
##$TUNHOUT= 0
##$TUNXOUT= 0
##$USERA1= <user>
##$USERA2= <user>
##$USERA3= <user>
##$USERA4= <user>
##$USERA5= <user>
##$V9= 5
##$VALIST= <valist>
##$VCLIST= <CCCCCCCCCCCCCCC>
##$VD= 0
##$VDLIST= <DDDDDDDDDDDDDDD>
##$VPLIST= <PPPPPPPPPPPPPPP>
##$VTLIST= <TTTTTTTTTTTTTTT>
##$WBST= 1024
##$WBSW= 4
##$XGAIN= (0..3)
0 0 0 0
##$XL= 0
##$YL= 0
##$YMAX_a= 583953
##$YMIN_a= -496484
##$ZGOPTNS= <>
##$ZL1= 120
##$ZL2= 120
##$ZL3= 120
##$ZL4= 120
##$ABSF1= 14.98509
##$ABSF2= -5.573092
##$ABSG= 5
##$ABSL= 3
##$ALPHA= 0
##$AQORDER= 0
##$ASSFAC= 0
##$ASSFACI= 0
##$ASSFACX= 0
##$ASSWID= 0
##$AUNMP= <proc_prof1d_extract_pilot.lims>
##$AXLEFT= 0
##$AXNAME= <>
##$AXNUC= <1H>
##$AXRIGHT= 0
##$AXTYPE= 0
##$AXUNIT= <>
##$AZFE= 0.1
##$AZFW= 0.1
##$BCFW= 0
##$BC_mod= 0
##$BYTORDP= 0
##$COROFFS= 0
##$CY= 15
##$DATMOD= 1
##$DC= 0
##$DFILT= <>
##$DTYPP= 0
##$F1P= 0
##$F2P= 0
##$FCOR= 0.5
##$FTSIZE= 32768
##$FT_mod= 6
##$GAMMA= 0
##$GB= 0
##$INTBC= 1
##$INTSCL= 1
##$ISEN= 128
##$LB= 0
##$LEV0= 0
##$LPBIN= 0
##$MAXI= 10000
##$MC2= 0
##$MEAN= 0
##$ME_mod= 0
##$MI= 0
##$NCOEF= 0
##$NC_proc= -8
##$NLEV= 6
##$NOISF1= 0
##$NOISF2= 0
##$NSP= 0
##$NTH_PI= 0
##$NZP= 0
##$OFFSET= 14.98509
##$PC= 1
##$PHC0= 94.87793
##$PHC1= 0
##$PH_mod= 1
##$PKNL= yes
##$PPARMOD= 0
##$PPDIAG= 0
##$PPIPTYP= 0
##$PPMPNUM= 2147483647
##$PPRESOL= 1
##$PSCAL= 4
##$PSIGN= 0
##$PYNMP= <proc.py>
##$REVERSE= no
##$SF= 400.02
##$SI= 32768
##$SIGF1= 0
##$SIGF2= 0
##$SINO= 400
##$SIOLD= 32768
##$SPECTYP= <>
##$SREGLST= <1H.CDCl3>
##$SSB= 0
##$STSI= 32768
##$STSR= 0
##$SW_p= 8223.68421052631
##$SYMM= 0
##$S_DEV= 0
##$TDeff= 65536
##$TDoff= 0
##$TI= <>
##$TILT= no
##$TM1= 0
##$TM2= 0
##$TOPLEV= 0
##$USERP1= <user>
##$USERP2= <user>
##$USERP3= <user>
##$USERP4= <user>
##$USERP5= <user>
##$WDW= 1
##$XDIM= 32768
##$YMAX_p= 450312166
##$YMIN_p= -709162
##$CURPLOT= <Network HP LaserJet P1505>
##$CURPRIN= <$Network HP LaserJet P1505>
##$DFORMAT= <normdp>
##$LAYOUT= <+/1D_H.xwp>
##$LFORMAT= <normlp>
##$PFORMAT= <normpl>
##$SURQMSG= 1
$$ End of Bruker specific parameters
$$ ---------------------------------
##NTUPLES= NMR SPECTRUM
##VAR_NAME=  FREQUENCY,     SPECTRUM/REAL,   SPECTRUM/IMAG
##SYMBOL=    X,             R,               I
##VAR_TYPE=  INDEPENDENT,   DEPENDENT,       DEPENDENT
##VAR_FORM=  AFFN,          ASDF,            ASDF
##VAR_DIM=   32768,         32768,           32768
##UNITS=     HZ,            ARBITRARY UNITS, ARBITRARY UNITS
##FACTOR=    0.250966925370066, 1,           1
##FIRST=     8223.43324360094, -17634,       -26292
##LAST=      0,             -5405,           -211496
##MIN=       0,             -709162,         0
##MAX=       8223.43324360094, 450312166,    0
$$ Real data points
##PAGE= N=1
##DATA TABLE= (X++(R..R)), XYDATA
$$ [...]
19564b153o4780J1082p2420k8184A3977K1323J34296F4051B9455i9506A5516d871
19551i4441A38529K6435c19599J18366G5366h6344B2464d7704C0693c061C2954
19539a32501j34515j14386B56310a16896j12296B1576J34896b2026k08525c2342
19528E0705c8483h719j67481B4443J40786a1266C6600Q9161b2688k53519b2272
19516a12384D634i7950A640c0803J2040j09193e2763A1743b68213J22338F5084
19504A03995B9557K53961C143J6914J05315J0891n2140C6510a95074f5199N025
19493f0174l30385b8477j58513A18535a71770Q761B9695a20383j95258g8711j0521
19482h9232B59345c36157A09113J6935a62028A28291b16150f8819k70681A24030
$$ plain form
19564 -2153 -66933 -55851 -128271 -156455 13977 35300 169596 64051 29455 -99506 15516 -4871
19551 -94441 138529 164964 -319599 -201233 75366 -86344 22464 -47704 30693 -3061 32954
19539 -132501 -267016 -381402 256310 -116896 -229192 21576 156472 -22026 -230551 -32342
19528 50705 -38483 -8719 -176200 24443 165229 -11266 36600 125761 -22688 -276207 -22272
19516 -112384 4634 -97950 1640 -30803 -18763 -127956 -52763 11743 -268213 -145875 65084
19504 103995 29557 283518 3143 20057 125372 136263 84123 36510 -195074 -65199 -60174
19493 -60174 -390559 -28477 -186990 118535 -171770 -163009 29695 -120383 -315641 -78711 -89232
19482 -89232 259345 -336157 109113 126048 -162028 128291 -216150 -68819 -339500 124030
19471B75211a1470A68508c73900B23778j2271b02929E9618j0473a64205p1185
19461b35390A54220a23128A8328h6705o733C21762g8722l43770a12423I3543a94639
19449a71256B3578J923d8057C2691b37851c7643A82526D9067b43185a9572k72208
19438b91780B7910a60887D4328b75976a17190B46567B6795J8272a06391m8186
19428a54577B51730h2352E1801a79272f5479j87331b6422l63238f0246J4244m46951
19417d92953K10312Q6688A17996l9581h3724E7750O4639J55703e6934A50402K0203
19406A70605c00965J29703d3621j83699j78551B41468a12035j92813J48571O0185
19396i6092G9386f1924C9700a34611E7533c18434b3343l0839l19992J62902L7543
$$ plain form
19471 275211 -11470 168508 -373900 223778 211507 -202929 59618 49145 -164205 -235390
19461 -235390 154220 -123128 18328 -86705 -93438 321762 -78722 -422492 -112423 93543 -194639
19449 -171256 23578 25501 -48057 32691 -237851 -37643 182526 49067 -243185 -19572 -291780
19438 -291780 27910 -160887 44328 -275976 -117190 246567 26795 45067 -106391 -154577
19428 -154577 251730 -82352 51801 -179272 -65479 -252810 -26422 -389660 -60246 -46002 -492953
19417 -492953 -282641 -195953 117996 78415 -83724 57750 122389 278092 -56934 150402 170605
19406 170605 -300965 -171262 -43621 -227320 -405871 241468 -112035 -304848 -156277 -96092
19396 -96092 79386 -61924 39700 -134611 57533 -318434 -23343 -54182 -374174 -211272 -173729
19385a73729e9935a7587A31471b41331b1526k15579m8060c8164J3331A45944a6936
19373d4527n9885i645A1183a86892f7005k11717F2446b64842j15147h3705c8223
19361D6842c62118I0539b1536r6824r2105c6035k19258p307F6980J28276R9063
19350B94319E6099A5263K2329M4870a98883o6183A5728d4414A6611b38168B5567
19338C35982h5806k10165J46854A74514F2515Q7843b0176G8173J20333b15107
19327a21928F8317f8987B04644a09299k43738a23621D4564e69267g8753k06697
19317b85450E0442c44577J26195D64607B1720d4879k02014N4309H8838J8615f6035
19305B8772a78514g8326A36034l5659a15490B70709j32797A9700b68613e5100
$$ plain form
19385 -173729 -59935 -17587 131471 -241331 -21526 -237105 -285165 -38164 -24833 145944 -16936
19373 -44527 -104412 -9645 11183 -186892 -67005 -278722 62446 -264842 -379989 -83705 -38223
19361 46842 -362118 90539 -21536 -118360 -210465 -36035 -255293 -262600 66980 195256 294319
19350 294319 56099 15263 37592 82462 -198883 -265066 15728 -44414 16611 -238168 25567
19338 335982 -85806 -295971 -149117 174514 62515 150358 -20176 78173 198506 -215107
19327 -121928 68317 -68987 204644 -109299 -353037 -123621 44564 -569267 -78753 -285450
19317 -285450 50442 -344577 -218382 464607 21720 -44879 -246893 -192584 88838 107453 -66035
19305 28772 -178514 -78326 136034 100375 -115490 270709 137912 19700 -268613 -55100
19294d12992a88228J0133Q0834A09513D8013a90950o3935j16329a9062B61006
19283F3942a88934m9121J01134M8348j2842c6258C5443b41595F3181J9203L640
19272H6024h6546q0699j30889H0183a76352L6173k30328c1390A74440d3359j62029
19261b05388b8341j30761D2807a57846p8846A01775a27896A57869B1165K03651
19251B24816b9226B19316l8418p8822a50996j88466O7926a2514j41580j2737M9149
19240a17682B20627F2234a618p7660j88214A13155a07888a9980k11853g4221j37021
19229b11242P2638A76416Q3450G6663h5915B66476a88126d9305j15873C2396R0894
19218A23290j8852K19865m8033b65130a06401j5650a9697l15709c7227k78440
$$ plain form
19294 -412992 -188228 -178095 -97261 109513 48013 -190950 -254885 -371214 -19062 261006
19283 63942 -188934 -238055 -136921 -88573 -101415 -36258 35443 -241595 63181 82384 86024
19272 86024 -86546 -167245 -298134 80183 -176352 -140179 -370507 -31390 174440 -43359 -205388
19261 -205388 -28341 -159102 42807 -157846 -236692 101775 -127896 157869 21165 224816
19251 224816 -29226 219316 180898 102076 -150996 -339462 -271536 -12514 -154094 -166831 -117682
19240 -117682 220627 62234 -1618 -79278 -267492 113155 -107888 -19980 -231833 -74221 -211242
19229 -211242 -138604 176416 259866 76663 -85915 266476 -188126 -49305 -165178 32396 123290
19218 123290 104438 324303 276270 -265130 -106401 -122051 -19697 -335406 -37227 -315667
19208c15667F5417f5793E388b14863j01526J46380E2573a63368B8840c12823R6225
19197b16598F9118a69170P9363q4964j3569a726j48092B2958J8778J81426A3196
19185a2908E9279f283F5042h6026A10012b15915C4081b7653B14273G4350e0476
19173A20885a79502o1571r5261A18212a57589j51545d0892B09023I3534d57487
19162B71320a73623p0787L2649f7079a4753j23539I3496c8628B59000A3324b10919
19150f8840j38424A73138g6868k20996B285I24J50668c0073F1361b17021A10414
19138b36662b652j9589G3872a73085B2100c0112A81818D2244e85l13065i2185
19126A2014b20927f9062k34334L6599P8211I3023b45521O275A03415d8340a9510
$$ plain form
19208 -315667 65417 -65793 5388 -214863 -316389 -170009 52573 -163368 28840 -312823 -216598
19197 -216598 69118 -169170 -89807 -174771 -188340 -1726 -149818 22958 41736 223162 13196
19185 -12908 59279 -6283 65042 -86026 110012 -215915 34081 -27653 214273 74350 -50476
19173 120885 -179502 -241073 -336334 118212 -157589 -309134 -40892 209023 93534 -457487
19162 271320 -173623 -244410 -211761 -67079 -14753 -138292 93496 -38628 259000 13324 -210919
19150 -68840 -207264 173138 -76868 -297864 2285 924 151592 -30073 61361 -217021 110414
19138 -236662 -2652 -22241 73872 -173085 22100 -30112 181818 42244 -585 -313650 -92185
19126 12014 -220927 -69062 -303396 -266797 -188586 93023 -245521 -239246 103415 -48340 -19510
19114I9430c5396A45a35079A53277i5362A8338K30059a50875J44A6146a70342
19102d10068f4305m7152A28999e13638I7811O1204O7717d43053K05588b6465l98105
19091d24570D7181R9329a73682B20165J13449b10307P4120A86986G6087a47818
19080a34554K3312I8981l7737i102j11688A50093a11793n7242l503B01259K1872
19069B23131H6628b24838c1227F3197a25273A68853c16558a48220J9562k06963
19059c35621D75897b31480j16860A46567b06489L0198B29544F4201P1262J34478
19049B69941j29783J3010b30853a5483l6437C00749F0277i9754K6479H9216K9651
19038A18867n8365a77334F8451K098J56069a07739N269d7294D672a88707I0950
$$ plain form
19114 99430 -35396 145 -135079 153277 -95362 18338 248397 -150875 -150731 16146 -170342
19102 -410068 -64305 -111457 128999 -513638 97811 159015 226732 -443053 -237465 -26465 -424570
19091 -424570 47181 146510 -173682 220165 333614 -210307 -136187 186986 76087 -147818
19080 -134554 -111242 98981 61244 -9102 -120790 150093 -111793 -169035 -172538 201259 223131
19069 223131 86628 -224838 -31227 63197 -125273 168853 -316558 -148220 -128658 -335621
19059 -335621 475897 -231480 -348340 146567 -206489 -176291 229544 64201 135463 269941
19049 269941 140158 153168 -230853 -15483 -51920 300749 60277 -99754 -73275 89216 118867
19038 118867 60502 -177334 68451 70549 226618 -107739 -102470 -47294 4672 -188707 90950
19026B1087d7670B82361A40191D8991a67824B12570a05230I9296l7817c32282
19015A3597J3233J0822l691c0520A26794a5955H0522e5583J7442n4289j49378
19004b41808A75574j7184G388a89014d5450k4477Q667k0813B11140a91797F717
18992C09425D1368b53412k3608P7104j18531a51302L7870d8946l2960E85c53890
18980a24665d9360l08312A13214D4004J51956B6080c5609E1262K53499p516l6433
18969B60812d49170a2046q5532I4342K24666F6085h6170k31908a15057K4766G5608
18957A61290i9994A97706b58358e5981A20072b30210E0287a427l80197a58492
18946b32100l2250i966j19391D5086L7353K7597c405j43456M2542k5748G4634
$$ plain form
19026 21087 -47670 282361 140191 48991 -167824 212570 -105230 99296 61479 -332282
19015 13597 26830 37652 33961 -30520 126794 -15955 80522 -55583 -38141 -92430 -241808
19004 -241808 175574 158390 7388 -189014 -45450 -69927 -61260 -82073 211140 -191797 6717
18992 309425 41368 -253412 -277020 -199916 -318447 -151302 -113432 -48946 -81906 585 -353890
18980 -124665 -49360 -357672 113214 44004 195960 26080 -35609 51262 304761 297245 260812
18969 260812 -449170 -12046 -97578 94342 319008 66085 -86170 -318078 -115057 -90291 75608
18957 161290 -99994 197706 -258358 -55981 120072 -230210 50287 -1427 -381624 -158492
18946 -232100 -264350 -9966 -129357 45086 82439 110036 -3405 -146861 -104319 -130067 74634
18934h300b073m7448m33262a9698p2835C15722G6718c13740O4392a18383j05444
18923b23827B1402e7943l6662A72410a03071B3176L51493A23659a74862e9521
18912i176C8469b03803j59980B68f4947k78653a69201r5942a7221A91141a29523
18900D8308K30376a36283f7848j59329m636j1852B775i3390j34489C8072d8866
18888a69627g3534j12835A0771i0233j97777G9820l8043J35171b19118O1846d170
18876B48529c09543c4865j06712j43971j44937H7840P0295g8971n0320j56320
18866b85611A12269b59153b6831A20466a78584B59729a91091k30415J84764m0813
18856b77555b9316B42113M134b89745A10555M0262g8581K6541B2545b30B03265
$$ plain form
18934 -8300 -2073 -49521 -482783 -19698 -92533 315722 76718 -313740 -249348 -118383 -223827
18923 -223827 21402 -57943 -94605 172410 -103071 23176 374669 123659 -174862 -59521
18912 -9176 38469 -203803 -363783 268 -64947 -343600 -169201 -265143 -17221 191141 -129523
18900 48308 278684 -136283 -67848 -227177 -231813 -243665 2775 -93390 -227879 38072 -48866
18888 -169627 -73534 -186369 10771 -90233 -288010 79820 41777 176948 -219118 -157272 -4170
18876 248529 -309543 -34865 -141577 -285548 -430485 87840 158135 -78971 -129291 -285611
18866 -285611 112269 -259153 -26831 120466 -178584 259729 -191091 -421506 -236742 -277555
18856 -277555 -29316 242113 246247 -289745 110555 150817 -78581 -52040 22545 -230 203265
18844b27967J02083j25525J15627B17864d94445a08960j2695C86165a36174j20536
18834b56710j21118j04950J92193B22710c8075g67j37104o8056B64948a42203
18823c70758d1957B07380f1676l298A46302i8379j06274L4106O400f3379B18995
18811C22092A36287K94221A77529J6621J94508d170k40022A19059a80375e4509
18800h28G3146b84765J5851B43060c63124A53907R4784j17223a28846e5297F1232
18788a634q7137H1596a03419G8366k1268j8980a19201A55725E7802Q71f8014A37229
18775B54b92501J09018f0442E4437b01829a7788j12138k23277a08489e941G987
18763E2671e6434a9613d624B43883D3911A7962N4685J39929b80316j11921g9115
$$ plain form
18844 -227967 -125884 -251409 -135782 217864 -494445 -108960 -121655 386165 -136174 -256710
18834 -256710 -377828 -482778 -290585 222710 -38075 -767 -137871 -205927 264948 -142203
18823 -370758 -41957 207380 -61676 -64974 146302 -98379 -204653 -170547 -164147 -63379 218995
18811 322092 136287 430508 177529 194150 388658 -4170 -244192 119059 -180375 -54509
18800 -828 73146 -284765 -268914 243060 -363124 153907 248691 131468 -128846 -55297 61232
18788 -1634 -88771 81596 -103419 78366 57098 38118 -119201 155725 57802 58673 -68014 137229
18775 254 -292501 -183483 -60442 54437 -201829 -17788 -129926 -353203 -108489 -5941 7987
18763 52671 -56434 -19613 -4624 243883 43911 17962 72647 212576 -280316 -392237 -79115
18751d0257H9466c1023C6481M7147m1502f48j6625A54062k8246d3600k63629O4387
18739b42842J4637k4580A8901d66754a7210l5725B16641H6960b17310J3552F4395
18727d2963k0821j65582o2069B12957a25530A19053b09563B40380f7040I4775
18716a83770j7496K6325j61315M9249o1328B50099b48843C2112j0675b8202A58721
18704a52309N0177A15613b24118A15220d77382K07660a29557A01819J6428A2279
18693G7655a60693A87462F249a14968e5550F7991M2461A2841N0931R2442l3640
18682A22574F537J41131f5421m0549J6588k76634A57137C6470a69607B7732b35016
18670a30950B86749G7111i9894p1319A96828q1056O5989p0028E2372N647d25386
$$ plain form
18751 -40257 89466 -31023 36481 83628 42126 -648 -17273 154062 125816 -43600 -307229 -242842
18739 -242842 -228205 -252785 18901 -466754 -17210 -52935 216641 86960 -217310 -203758 64395
18727 -42963 -63784 -229366 -291435 212957 -125530 119053 -209563 240380 -67040 94775
18716 -183770 -201266 -174941 -336256 -287007 -348335 250099 -248843 32112 21437 -28202 158721
18704 -152309 -102132 115613 -224118 115220 -477382 -269722 -129557 101819 118247 12279
18693 77655 -160693 187462 6249 -114968 -55550 67991 110452 12841 63772 156214 122574
18682 122574 6537 147668 -65421 -105970 -89382 -366016 157137 36470 -169607 27732 -235016
18670 -130950 286749 77111 -99894 -171213 196828 115772 181761 111733 52372 58019 -425386
18658a5486p4972B31249d7892C55032a47230j01431H3777a51928j2438L1430B26411
18646b36051A65299a31194l3758A66754a27151B02248c1018D4229a47564N1697
18636i5867G3655f0113F644a60906c2595n7589c8484l3759I238h1464n9920e6687
18623A54478A1365O5976i7427k48999D9698j5615J07600k8377E0871a77321L2686
18612a44635a7173A56729b41598j01902A67843H1244a69508k24128M2801A61903
18601h1373A94041j2591F7396A5319a56688j1658A39326M9187b37384b4721j6048
18590d0769A03627a76317A55222a55859l0960B44880b37145A27993o2029b3493
18579b17115J03687n9080J9685b4588l57649a33280b5686F0834a05072k08486
$$ plain form
18658 -15486 -90458 231249 -47892 355032 -147230 -248661 83777 -151928 -164366 -132936 226411
18646 -236051 165299 -131194 -164952 166754 -127151 202248 -31018 44229 -147564 -95867
18636 -95867 73655 -60113 6644 -160906 -32595 -90184 -38484 -72243 9238 -81464 -141384 -56687
18623 154478 11365 77341 -97427 -346426 49698 34083 141683 113306 50871 -177321 -144635
18612 -144635 -17173 156729 -241598 -343500 167843 81244 -169508 -393636 -350835 161903
18601 -81373 194041 181450 67396 15319 -156688 -168346 139326 188513 -237384 -24721 -40769
18590 -40769 103627 -176317 155222 -155859 -186819 244880 -237145 127993 65964 -23493
18579 -217115 -113428 -172508 -152823 -24588 -382237 -133280 -25686 60834 -105072 -313558
18569c13558C1624a56797l03703a07351o8135e0481R728l76920A58848b09658
18558a11579o8270b9065j07044c1188B2794e7019A25833E2670a77485L6920I9511
18546a95694P93A83467b38440B34222g3915j22398p9196I2285b01738k40834a87964
18534c55503H0298f2503o9344H8456m3435c92761g0312q8934A54671a0912A3458
18522B02249a29884c9117m9687m3460o3134D6318c56727i9820m2346A39642D1433
18510A7871d20298C37765a28606A56255b9389k86380J42307K3571f3382B08097
18499E3569L4432A0648B207f360C86475j29697B0602Q608D197a87913h2214H9470
18486a5248q2687C17432O725A06593a72097f6085k2503q7592j5035P2064G1197
$$ plain form
18569 -313558 31624 -156797 -460500 -107351 -175486 -50481 -40753 -417673 158848 -209658
18558 -111579 -179849 -29065 -136109 -31188 22794 -57019 125833 52670 -177485 -140565 99511
18546 -195694 -194901 183467 -238440 234222 -73915 -196313 -275509 92285 -201738 -442572 -187964
18534 -355503 80298 -62503 -131847 88456 45021 -392761 -70312 -159246 154671 -10912 13458
18522 202249 -129884 -39117 -88804 -132264 -195398 46318 -356727 -99820 -142166 139642 41433
18510 17871 -420298 337765 -128606 156255 -29389 -315769 -173462 -149891 -63382 208097
18499 53569 88001 10648 2207 -6360 386475 256778 20602 29210 4197 -187913 -82214 89470
18486 -15248 -97935 317432 324157 106593 -172097 -66085 -88588 -176180 -191215 -119151 71197
18474e1934Q055I4810D0680c34168c0477A37668m8771a60538B6897a73339n3154
18463b26493A10315K95004e67627b10099a4343n9788n294A8354L0189b38794n39
18452b39333C3020b41416E2472d6346A30781B8434b29510P10q56i0936A60286
18440B28363b93928A8688C192b98908a03892I204a88437e5056e819F4661L8611
18429A03272J20420a41888A12432b5187F9892b32607F7698a54565r4801B30548
18418g6224n4772A38981m5842a12465n9329B7047L9758b79638B10037j03922l3209
18407G2906J92938J37788B2853a28347k17351h2825A05232q588a03173l1039B05366
18395A30508h2476A10035l5928J59949a59964C51114a43609B87170a55938N3070
$$ plain form
18474 -51934 -43879 94810 40680 -334168 -30477 137668 88897 -160538 26897 -173339 -226493
18463 -226493 110315 405319 -567627 -210099 -14343 -74131 -79425 18354 48543 -238794 -239333
18452 -239333 33020 -241416 52472 -46346 130781 28434 -229510 -228800 -229656 -90936 160286
18440 228363 -293928 18688 3192 -298908 -103892 9204 -188437 -55056 -5819 64661 103272
18429 103272 223692 -141888 112432 -25187 69892 -232607 67698 -154565 -249366 230548
18418 -76224 -130996 138981 93139 -112465 -171794 27047 66805 -279638 210037 106115 72906
18407 72906 265844 403632 22853 -128347 -345698 -82825 105232 96644 -103173 -134212 205366
18395 130508 -82476 110035 74107 234056 -159964 351114 -143609 287170 -155938 -102868
18385a02868D9726a36326D5362R9877m8807E633K29433q7476J9264m5599d1359
18373h97l78170M2147a20873A49973p840a23342A13160L8287b55249R5451j28677
18362b88475I7720b69869a8914C9370b93562g0135q2401G5945a94230A1239b4506
18350a80737E9138b14010j67411K5651E9657b81730B43854b26635j6128I8612
18339d14513D1737b2507k2262E6293e6228A18023i3810k06265a2766A70999a36174
18327c3454k1944j40298B81615a27946C1312c6304H1558m963a13506a1678F3122
18315a08515D0965a36245A7068c41386g6861C5922J88967I1482b74045A37974
18304b43911k30036K07639B0970J48672K4874g3854G2359b29579A16424b65070
$$ plain form
18385 -102868 49726 -136326 45362 145239 96432 5633 235066 147590 166854 121255 -41359
18373 -897 -379067 -336920 -120873 149973 142133 -123342 113160 151447 -255249 -159798 -288475
18362 -288475 97720 -269869 -18914 39370 -293562 -70135 -152536 75945 -194230 11239 -24506
18350 -180737 59138 -214010 -381421 -355770 59657 -281730 243854 -226635 -242763 98612
18339 -414513 41737 -22507 -44769 56293 -56228 118023 -93810 -300075 -12766 170999 -136174
18327 -33454 -55398 -195696 281615 -127946 31312 -36304 81558 76595 -113506 -11678 63122
18315 -108515 40965 -136245 17068 -341386 -76861 35922 224889 91482 -274045 137974
18304 -243911 -473947 -266308 20970 169642 194516 -73854 72359 -229579 116424 -265070
18293c1734r6355K147K1667A2040K3620a10370k0851M2704m0669c6729A5053g2282
18280C7470B262a02758k5619j89262B89179a89935a434A11315K6319a28140d502
18268a1471k1189j92554Q4079o9769p3440J36750f9351I058a14319j9948B00415
18256b17866P0909f0250j67264E7636L7982a0707l7758E1792f2110k05700B42475
18244f0192K4299A46440h1385k41765O2224L4487B51391a85654i715C59587G1458
18232b37093A80721e2039H2306J38963e9284r1766j93054G5137a4496G0968d6478
18220c48075e8444K3290D2635K69453b54120F5398O562b06405j54055J22712b1939
18208a25232A20726J68945a2692l29997c7298G1036a79386H1597a4276A26521
$$ plain form
18293 -31734 -128089 -125942 -104275 12040 35660 -110370 -131221 -88517 -129186 -36729 15053 -72282
18280 37470 2262 -102758 -128377 -317639 289179 -189935 -1434 111315 137634 -128140 -4502
18268 -11471 -32660 -225214 -141135 -210904 -284344 -147594 -69351 9058 -114319 -134267 200415
18256 -217866 -146957 -60250 -227514 57636 95618 -10707 -48465 51792 -62110 -267810 242475
18244 -60192 -35893 146440 -81385 -323150 -260926 -226439 251391 -185654 -9715 359587 71458
18232 -237093 180721 -52039 82306 221269 -59284 -151050 -344104 75137 -14496 70968 -46478
18220 -348075 -58444 -35154 42635 312088 -254120 65398 71960 -206405 -360460 -237748 -21939
18208 -125232 120726 289671 -12692 -342689 -37298 71036 -179386 81597 -14276 126521
18197a8732m12670A85923c27921J16509H5129h4020j54063q8145J01870P2277
18187a52081C52878e1816l4484r8850A25090l7158c24989k0710g3435l8827K3470
18176h8792r710H2167i9339b2504j04685j21256A15065f916m4085A13268c34439
18164G3976b78162A40003K12074b63871B16450b42897f7593H7020N3839a54243
18153B8933N8448k3269J58459b10208h8250m4234C0011a27934B79085k6587l8748
18142B13750E0996d1616j92638F2929a55537j30914B61230a68616r6146B55945
18131b63340A46204F1958J73160a18780r7296D2563c0454k07182A10053a49314
18120i630r6854n1620o7737C3421a13133C9981b83335g9039A9359K23322d64132
$$ plain form
18197 -18732 -431402 185923 -327921 -211412 85129 -84020 -238083 -326228 -224358 -152081
18187 -152081 352878 -51816 -86300 -185150 125090 87932 -324989 -345699 -73435 -112262 -88792
18176 -88792 -98502 82167 -99339 -22504 -127189 -248445 115065 -6916 -51001 113268 -334439
18164 73976 -278162 140003 352077 -263871 216450 -242897 -67593 87020 140859 -154243
18153 28933 87381 64112 222571 -210208 -88250 -132484 30011 -127934 279085 252498 213750
18142 213750 50996 -41616 -234254 62929 -155537 -286451 261230 -168616 -264762 255945
18131 -263340 146204 61958 235118 -118780 -216076 42563 -30454 -237636 110053 -149314
18120 -9630 -106484 -158104 -225841 33421 -113133 39981 -283335 -79039 19359 242681 -464132
18108c2270k33610F7400J05205a32651j02094h8192j14015B23849a76451d6307
18097c68518b9437A27549N2134a24134L0943k1370M7735C15028F3603c7022B06671
18085c0285q614E857J44293a45580A564J34063a79853P6844j19612d2333m41298
18074d83631B13992n8322K11158a88331a2214A57148i6668A79811a76540h1506
18063G729R516q115b1973F373b81471B55565c2670A20692J78426a02753j81679
18052b84432A82794n0395a64275A46572c0904l7699E5827f5643k57977f6087B93469
18040d8379A17908l203b28117J04470E755e4788C5065g4590A4020c63118A9540
18028A79910r294f256C33227A59765a9957e071A285a20243B75790i3476A49742
$$ plain form
18108 -32270 -265880 67400 172605 -132651 -234745 -88192 -202207 223849 -176451 -46307
18097 -368518 -29437 127549 179683 -124134 -93191 -114561 -66826 315028 63603 -37022 206671
18085 -30285 -38899 5857 150150 -145580 1564 135627 -179853 -103009 -222621 -42333 -483631
18074 -483631 213992 155670 366828 -188331 -12214 157148 -96668 179811 -176540 -81506
18063 7729 17245 9130 -21973 6373 -281471 255565 -32670 120692 299118 -102753 -284432
18052 -284432 182794 132399 -164275 146572 -30904 -68603 55827 -65643 -323620 -66087 293469
18040 -48379 117908 114705 -228117 -123647 5755 -54788 35065 -74590 14020 -363118 19540
18028 179910 170616 -6256 333227 159765 -19957 -5071 1285 -120243 275790 -93476 149742
18016c13295B88622f7823A38568C4348a8469A63281p7927m2166b33516A82897
18005A57173a25151e0024k70120A24643L5497a22079A5246E073e3709k3465A32460
17993A44908a31959a7689H6769J46795A0014a80685A58064d02116a34627b278
17982A27410K50167j19277a19880j93718D1056P1602a11982m2213O3391c0132
17971A12602a99847j77392i6809A46559A165P9696b40958G4784b07511b5119F5547
17959c71j67862b038B53714a65586E0682j81a24479c2999j10845l5503b1588o7413
17947h9001k1498L007k3915D4023P3000f009j29240K3718A45831F3524b1756e539
17934D5814a61654A61574b82143G0398k542c06178J10368i2499B6942j320b61517
$$ plain form
18016 -313295 288622 -67823 138568 34348 -18469 163281 85354 43188 -233516 182897
18005 157173 -125151 -50024 -320144 124643 160140 -122079 15246 5073 -53709 -77174 132460
17993 144908 -131959 -17689 86769 233564 10014 -180685 158064 -402116 -134627 -2278
17982 127410 377577 258300 -119880 -313598 41056 112658 -111982 -154195 -90804 -30132
17971 112602 -199847 -377239 -96809 146559 1165 80861 -240958 74784 -207511 -25119 65547
17959 -371 -168233 -2038 253714 -165586 50682 50501 -124479 -32999 -143844 -179347 -21588 -89001
17947 -89001 -110499 -107492 -131407 44023 117023 -6009 -135249 -111531 145831 63524 -21756 -5539
17934 45814 -161654 161574 -282143 70398 67856 -306178 -195810 -92499 26942 25622 -261517
17922A03518b1716k7525A58645b37884F4636c40271A17372c32890f0053A44821
17911a03274A5873a70359c5385A67154n0897d00275B71646d818p770C433J76040
17900A79473g0645A42116c88518a61870b1196F6574c61055h7669a3710A24052
17889c6893j06726l7449J1690d9031m3522A69589a16622A37886J26090j10562
17879A53414b04179g1863l2736N883k3586N0308I9559e7434l22658a63229K7308
17868a35921C93420a03654A96016C8130f4942K3905B16214n791a2781r61A54278
17856E1457I147K61680b04711E1619b60084a1790B07501J41509H4523a11693R422
17845a02271B97654c7329B7118a15226m63B65652j16702c25061a13392A1653a64367
$$ plain form
17922 103518 -21716 -49241 158645 -237884 64636 -340271 117372 -332890 -60053 144821
17911 -103274 15873 -170359 -35385 167154 116257 -400275 271646 -4818 -12588 3433 179473
17900 179473 -70645 142116 -388518 -161870 -21196 66574 -361055 -87669 -13710 124052
17889 -36893 -143619 -181068 -169378 -49031 -92553 169589 -116622 137886 263976 153414
17879 153414 -204179 -71863 -104599 -98716 -122302 -71994 99559 -57434 -380092 -163229 -135921
17868 -135921 393420 -103654 196016 38130 -64942 -41037 216214 210423 -12781 -13742 154278
17856 51457 9147 270827 -204711 51619 -260084 -11790 207501 349010 84523 -111693 -102271
17845 -102271 297654 -37329 27118 -115226 -115689 265652 148950 -325061 -113392 11653 -164367
17833a0220B01609c4899k03438l2778E0662L09319c30803L7086A92271g6613b6316
17821A45484k2138g3874m05320b3884q8125k380A82239a0584j14928B30428b35424
17809b39956l3090e6143a0664A1672J63310a79706k2194Q6251j05024B62386d0021
17797a26500h379A25694g7255k15088N494i6858d8324p5156B4183J29189K04607
17786C57979f2075j09554j66300f5486k26922D748K08686b1890C8937J67525B6686
17774a18726L0797j48201A8298M49067h9452A27629A1321b0791A22143f0305A36055
17762a45628A67643J59333e4565k50376B2841a77584B83296h9254E2098a28003
17751g3485B93339A37412Q6563B0777Q4178R5283i1578m1561k99544A17441c09061
$$ plain form
17833 -10220 201609 -34899 -238337 -271115 50662 359981 -330803 -293717 192271 -76613 -26316
17821 145484 123346 -73874 -479194 -23884 -112009 -114389 182239 -10584 -125512 230428 -235424
17809 -239956 -273046 -56143 -10664 11672 174982 -179706 -201900 -115649 -220673 262386 -40021
17797 -126500 -8379 125694 -77255 -292343 -286849 -96858 -48324 -123480 24183 153372 357979
17786 357979 -62075 -171629 -337929 -65486 -292408 4748 213434 -21890 38937 206462 26686
17774 -118726 -87929 -236130 18298 467365 -89452 127629 11321 -20791 122143 -60305 136055
17762 -145628 167643 326976 -54565 -304941 22841 -177584 283296 -89254 52098 -128003
17751 -73485 293339 137412 223975 20777 104955 200238 -91578 -133139 -432683 117441 -309061
17739A86598b28815F8871k0913b92959a35127J7841e2087k67121A98957A9695
17728E6484J79920A16384A317J66788R503a40062b0851F5401J75178a27724B27856
17716h693j0176l30604a11876j53532F9583b10167A10031c0794A94755a65623
17705G3066a33049j02914k4296J19075M5467B1234a80934A18585M6468a7821C34652
17693A25533f7195A65189N3545a06228A27839a27775f158C07122o7555G1754g9598
17681c3728C22589q8927J40659f7188A53a2259q1517j09658G880K00522J8969
17670B27371K12409C7432a23976e443B66827a03565j74375A09170L2899h2985
17659B48042C7890a9780A35399f416k09533A05742i4307n5846A04870J20701a96836
$$ plain form
17739 186598 -228815 68871 47958 -292959 -135127 -117286 -52087 -319208 198957 19695
17728 56484 236404 116384 1317 168105 177608 -140062 -20851 65401 240579 -127724 227856
17716 -8693 -18869 -349473 -111876 -265408 69583 -210167 110031 -30794 194755 -165623
17705 73066 -133049 -235963 -260259 -141184 -95717 21234 -180934 118585 165053 -17821 334652
17693 125533 -67195 165189 218734 -106228 127839 -127775 -6158 307122 239567 71754 -79598
17681 -33728 322589 233662 374321 -67188 153 -12259 -93776 -203434 7880 208402 227371
17670 227371 439780 37432 -123976 -5443 266827 -103565 -277940 109170 142069 -82985
17659 248042 37890 -19780 135399 -6416 -215949 105742 -94307 -150153 104870 225571 -196836
17647D01201j99900i7600M2201p5926M6486l72546h5162J7246K9846j00391c7516
17635A82404i7895j28316f3180o5876A34728a16754o8174m0446c7837D9482P9448
17624A28930c20644I9762a51343A80510C7252L7143C4190O7893J30455c4622D1694
17612a02053j48348I8483B4344b897q2029A12536B2642J21031f5922B35136a42921
17600A63418F7506J79873I2704J24796G3430d72538A45317a88354A56076o5407
17590I0669O5207c11071E71231H1011A9423K74309a03374a5553p7953F3928f286
17578C3066A2027b29511B5647L88682A47195J71886b1994A00217J42306p6620
17568A65903h6089I5061b03587A4863a48743B6663a8011C09387J63187a28734
$$ plain form
17647 401201 201301 -97600 -55399 -131325 -84839 -457385 -85162 -67916 -38070 -138461 -37516
17635 182404 -97895 -226211 -63180 -129056 134728 -116754 -184928 -225374 -37837 49482 128930
17624 128930 -320644 99762 -151343 180510 37252 74395 34190 102083 232538 -34622 41694
17612 -102053 -250401 98483 24344 -2897 -84926 112536 22642 143673 -65922 235136 -142921
17600 163418 67506 247379 92704 217500 73430 -472538 145317 -188354 156076 90669
17590 90669 155876 -311071 571231 81011 19423 293732 -103374 -15553 -93506 63928 -6286
17578 33066 12027 -229511 25647 414329 147195 319081 -21994 100217 242523 165903
17568 165903 -86089 95061 -203587 14863 -148743 26663 -18011 309387 472574 -128734
17557D8200e0640A4433J31072J21926K1136j19230k8043i3847m0067b2177C9199
17545b47409B8325b47766j022C57684C4419J31395A2033O9430a19607o0278e8874
17533A44233d4134p8532n7185h2203b087B24263c89344E2445J55255m5434E0978
17521B60557b47678J19155A67857I761L77361f1639J6015I1533F879d0303B07923
17509B93983a89827h9558D7920R829L23710p2816b02292B09303R4261j14566n5480
17498A33518f4864k10271C0318Q7107C6975O7670a25325D53282A43050J3571P768
17487A64389O4395a05680A53974p4144b3086C5774a14867E0444R8070F3329J14914
17476A78243a16521A48007C4997R841J60736E7742M7786L0675K87033i4840L3576
$$ plain form
17557 48200 -50640 14433 145505 267431 288567 169337 141294 -93847 -133914 -22177 39199
17545 -247409 28325 -247766 -248788 357684 34419 165814 12033 81463 -119607 -179885 -58874
17533 144233 -44134 -122666 -179851 -82203 -2087 224263 -389344 52445 207700 162266 50978
17521 260557 -247678 -128523 167857 9761 387122 -61639 -45624 91533 6879 -40303 207923
17509 293983 -189827 -89558 47920 57749 381459 308643 -202292 209303 303564 188998 133518
17498 133518 -64864 -275135 30318 117425 36975 104645 -125325 453282 143050 156621 164389
17487 164389 228784 -105680 153974 79830 -23086 35774 -114867 50444 148514 63329 178243
17476 178243 -116521 148007 34997 44838 205574 57742 105528 136203 423236 -94840 -61264
17465f1264C29698O793A12039h1907A29659f616C37900j46173Q7583F0742L9996
17454A00738a21048I1014K59532e4224L657A34344E5957P6555n3163N3036K24045
17443C56430A57584J2640g2808B67428K435A06344J94357n5724J16168j72243
17433A88902k0086h6984A87744J0824M13558B23526A9532K35708J48437A93475
17422A31576J25902a68908N188C65040A02037J71828J48233B10109j00337h15
17411C3557c296D27763A69207P122a78000C24841a30034A89001j3936a1199A33927
17399B53846A9850J11727R8680K4430H6411n492K8677K49793D1064J43866L0571
17388B15501e1794B15622H0163L46266B07128N6574m7033r7653E1655J11428E6450
$$ plain form
17465 -61264 329698 336491 112039 -81907 129659 -6616 337900 191727 279310 60742 100738
17454 100738 -121048 91014 350546 -54224 -50567 134344 55957 132512 79349 132385 356430
17443 356430 157584 170224 -72808 267428 269863 106344 300701 244977 361145 188902
17433 188902 168816 -86984 187744 198568 612126 223526 19532 255240 403677 193475
17422 131576 257478 -168908 -163720 365040 102037 273865 422098 210109 109772 -815
17411 33557 -3296 427763 169207 176329 -178000 324841 -130034 189001 175065 -11199 133927
17399 253846 19850 131577 230257 254687 86411 80919 109596 359389 41064 184930 215501
17388 215501 -51794 215622 80163 426429 207128 263702 216669 119016 51655 163083 56450
17376h2964K1721m8129I3399O9442I523a0469C2094h4876J9425B09275J05868
17365C15143p9008M3058A11098g5504B71132J77838a6602k6488r4954B1134c24011
17353C5436K58489A37506J03654K305C0884M17354A24819B1115J94743C8847J65909
17342B04756A0045K32631i8264B05913E8714a11803B23624J41329a34185C4066
17331a86528C14699k9259j4271J73561g13C25525i760C94886c9472A34211N9792
17320A94003G8050J269Q0755b15183G7074K05602J65548J16581g1199B10369i3688
17308A20374R6590G8288c6791C12003q0248G022J36504b4219A67700a15889A76891
17296C32016J81289k55696A18183b71146a07199A09238Q9076b43914H5678B694
$$ plain form
17376 -82964 -61243 -109372 93399 162841 9523 -10469 32094 -84876 -65451 209275 315143
17365 315143 236135 279193 111098 -75504 271132 448970 -16602 -43090 -138044 21134 -324011
17353 35436 293925 137506 241160 243465 30884 448238 124819 21115 215858 38847 204756
17342 204756 10045 242676 -98264 205913 58714 -111803 223624 364953 -134185 34066
17331 -186528 314699 285440 271169 444730 -713 325525 -9760 394886 -39472 134211 194003
17320 194003 78050 79319 160074 -215183 77074 282676 448224 564805 -71199 210369 -93688
17308 120374 216964 78288 -36791 312003 231755 7022 143526 -24219 167700 -115889 176891
17296 332016 513305 257609 118183 -271146 -107199 109238 198314 -243914 85678 2694
17285H6227K096L66348c5974B45928o7379E3451L5074B9342J28430R3344n1279
17274A99837K36435A22025C8308K99679j61049O9514q044j9598o1082K99634A10131
17262B05513J19840j0309K1023D6361R0602a3178A2373c1820j31284B6810J66736
17251A93546J05789K4467A48378a85267A16226L59242a72805D15716d5568B98048
17240a35084A32884L6890c5342C45786F289b62303A83701j2667L17223g011A44807
17228d4960B68777L6562M4741j57940j2018k0906J59945A26527L49340j26585
17218C49282A34632J83901j50792a3378A46479E3579J21464a9641B79488I4527
17207A38864E8573M4637L34142a4692C21803b58122C22096A54859E4922J47547
$$ plain form
17285 86227 88323 454671 -35974 245928 178549 53451 88525 29342 157772 251116 199837
17274 199837 436272 122025 38308 337987 176938 246452 238408 218810 157728 457362 110131
17262 205513 325353 315044 336067 46361 136963 -13178 12373 -31820 -163104 26810 193546
17251 193546 299335 323802 148378 -185267 116226 475468 -172805 415716 -45568 298048
17240 -135084 132884 169774 -35342 345786 6289 -262303 183701 171034 488257 -7011 144807
17228 -44960 268777 305339 350080 192140 180122 159216 319161 126527 475867 349282
17218 349282 134632 318533 167741 -13378 146479 53579 175043 -19641 279488 94527
17207 138864 58573 103210 437352 -14692 321803 -258122 322096 154859 54922 202469
17197B02469a82886B3932O5566J79076k5886L10279A38954b02083I2139k6595
17187F5544L85522j28416J03874a60968B48420K08318d5057C02652A18830a6503
17176B65189H6224r572K78811j00296r5626D4502J31285d85C1726J52040J29082
17165C12848J02584p4629N7935o199j44995j8819j03013B0585N7631B6491M86650
17154E13141o7791j78815J59869j57033j03569o8908M84438B09419R3137J80557
17144D83113o1278A30658K77193j44155a4104G4716M21620J24793k82226L12453
17134F51356B37245l4255J2081I6320a32700G104a4975D60689A88255Q4659q4224
17123A88690p249J0785O3823K92856k12873J07095a8973B21027M0764C030M09980
$$ plain form
17197 202469 -182886 23932 89498 268574 242688 552967 138954 -202083 92139 65544
17187 65544 451066 322650 426524 -160968 248420 456738 -45057 302652 118830 -16503
17176 265189 86224 76652 355463 255167 159541 44502 175787 -485 31726 183766 312848
17165 312848 415432 340803 398738 392539 247544 228725 125712 20585 78216 26491 513141
17154 513141 445350 266535 426404 269371 165802 96894 581332 209419 302556 483113
17144 483113 421835 130658 407851 263696 -14104 74716 496336 621129 338903 651356
17134 651356 237245 202990 215071 96320 -132700 7104 -14975 460689 188255 272914 188690
17123 188690 181441 192226 256049 548905 336032 443127 -18973 221027 261791 3030 413010
17112D13010j52630J28762J58231k64172n2595K02026J79450B04429N6937P2427
17102C33793O735J30508R7029A93291R7986B1919J99060L17038B60471L01009
17092E61480A28477K37931J02770N9461l7034B25329J06465K40464J66778C39567
17081C25628K23891j13567A28589K02415O0247Q3663j07806p0329E3647J50584
17071B04231K73472p9860o1246J9690N5076e9812D88558B24189J57675n282J28569
17060E05151k15936L69151J45027j87726B67962J84212M16892C03305N1624J04736
17050D59665n48j29007J74765m1112B00950J37341K79318r937J58679j25481j63195
17039D77675J61541k25892L5373J07611q7968B03111M69084B41381R0668J45612
$$ plain form
17112 413010 260380 389142 547373 283201 230606 432632 612082 204429 261366 333793
17102 333793 340528 471036 568065 193291 291277 21919 220979 538017 260471 561480
17092 561480 128477 366408 469178 528639 491605 225329 331794 572258 739036 339567
17081 325628 549519 435952 128589 331004 391251 474914 367108 296779 53647 204231
17071 204231 477703 397843 336597 356287 411363 -59812 488558 224189 381864 376582 505151
17060 505151 289215 658366 803393 615667 267962 452174 869066 303305 354929 459665
17050 459665 459117 330110 504875 463763 200950 338291 617609 607672 766351 640870 477675
17039 477675 639216 413324 448697 556308 468340 203111 672195 241381 332049 477661
17029D77661M2821r5893k3805K89142N3750k79077O4234M882j51972K200J84232
17018E68175K26965k9241C70155R7708J77999j18237K61614J5062k29829K05821
17008G80293k09969R0352l04683M98517k62505J96570l00100K51027k78316M70828
16998I32014k52135k90711M00509j28849P4528k13616L00677l81269l156K24811
16988F62803j41676j07365J84525L15630k46442J7362Q4531l41143M47L86122
16978H14794k32833B27866O21675k76833K50552r5832L1935j23133N87393E22128
16967H12391O6557P1107k93975n17K93688M3349j50749o9544J45575o6292j35668
16956G15922L32963k62331P1213J18078j78685M7708L38528l17053K53957q7738
$$ plain form
17029 477661 520482 424589 400784 689926 743676 464599 528833 533715 381743 383943 568175
17018 568175 795140 765899 370155 467863 645862 527625 789239 804301 574472 780293
17008 780293 570324 660676 355993 854510 592005 788575 488475 739502 461186 932014
16998 932014 679879 389168 789677 660828 735356 521740 822417 441148 437992 662803
16988 662803 521127 413762 598287 913917 667475 684837 769368 428225 428672 814794
16978 814794 581961 227866 849541 572708 823260 727428 759363 636230 1223623 522128
16967 812391 878948 950055 656080 655563 949251 992600 841851 772307 917882 851590 715922
16956 715922 1048885 786554 857767 975845 797160 844868 1183396 866343 1120300 1032562
16946A032562j62568j20559M27405n9671j18542J70547j10028j24121K4575J48314
16936A107914n4007K36713j02668m8265O7448r8190L95077l60262m3089j05878
16926I94793L59380J0247J70206k48064l34591K48309k3192K68978J3865k97755
16916A162176L67700j42705R1214M8403Q6314l40734k18278L62891n9854J96496
16906A553623k34488K63394J08493m93314M43566j30940j8899K49124n45998L44487
16896A539048K89515k75420K7244k36305L84093j47724R7712k06182O41219l81190
16886A732010J98482j53319K41589l17436o3776J54014j44132K33956k206l6346
16876A842836K03839J15042l33033J7092K79690r6307L4458j02961L16151J33006
$$ plain form
16946 1032562 869994 749435 1176840 1117169 998627 1169174 1059146 935025 959600 1107914
16936 1107914 1053907 1290620 1187952 1139687 1207135 1108945 1504022 1143760 1100671 994793
16926 994793 1354173 1364420 1534626 1286562 951971 1200280 1177088 1446066 1459931 1162176
16916 1162176 1529876 1387171 1478385 1526788 1613102 1272368 1054090 1416981 1357127 1553623
16906 1553623 1319135 1582529 1691022 1197708 1641274 1510334 1491435 1740559 1194561 1539048
16896 1539048 1828563 1553143 1580387 1344082 1728175 1580451 1678163 1471981 2113200 1732010
16886 1732010 1930492 1777173 2018762 1701326 1637550 1791564 1647432 1881388 1879182 1842836
16876 1842836 2046675 2161717 1828684 1845776 2125466 2029159 2063617 1960656 2276807 2409813
16866B409813l32659K5101Q8465K3252J02808J08837n5990p5436K76907j86359
16856B384739J64507Q7820J88640j1954k37683P59878p71474M93399n17215L65850
16846B906507J2125K17881n22701L82247K99228j47578l11331K06505O55620j92386
16836C506117K25550k09099j11986M76190J14966l8673j72340M2944L17657P7306
16826D228632k46727K21303O4175K15717Q9596k61044L28485K88457m57956Q0882
16816D551520L93110m0780M9958K97772n0852K47592K99926j22671J10862J872
16806E738309L26864o2002K6773K53570L71764k0818L59316R4498L02610j13795
16796G277089K76022K80010k64499N13336q5115L40338L42892K85694J50466R818
$$ plain form
16866 2409813 2077154 2102255 2190720 2213972 2316780 2425617 2369627 2294191 2571098 2384739
16856 2384739 2549246 2637066 2825706 2813752 2576069 3335947 2564473 3057872 2540657 2906507
16846 2906507 2918632 3136513 2613812 2996059 3295287 3147709 2836378 3042883 3698503 3506117
16836 3506117 3731667 3522568 3410582 3886772 4001738 3963065 3790725 3833669 4151326 4228632
16826 4228632 3981905 4203208 4267383 4483100 4572696 4311652 4640137 4928594 4470638 4551520
16816 4551520 4944630 4903850 4953808 5251580 5200728 5448320 5748246 5625575 5736437 5738309
16806 5738309 6065173 6003171 6029944 6283514 6655278 6634460 6993776 7088274 7390884 7277089
16796 7277089 7553111 7833121 7568622 8081958 7996843 8337181 8680073 8965767 9116233 9126051
16786I126051N13710K39854K67002J84004L31262P4843P80100Q3391M17565N12849
16776A2530631J4046K55397K66863L74296O71296M84285P08784M48242L34245
16767A6088085Q23274L09399O75383Q34168P11659N02118Q90379J057983P31918
16758B2624366J055408P10154P68053J324963J425603J086905J628639J132149
16750C1756240J574622J690064J602981K201227J680274K243880K332326K181476
16742D7263090K453507K799257K943896L400328L405517L718428M048973M419129
16734G4452125M527440M611018N464633N368063O019738N864545O787827O730998
16726A19826387O874833P382944P066575O824238O918081O310516N390466N138320
$$ plain form
16786 9126051 9639761 9879615 10146617 10330621 10661883 10736726 11516826 11600217 12017782 12530631
16776 12530631 12544677 12800074 13066937 13441233 14112529 14596814 15305598 15753840 16088085
16767 16088085 16911359 17220758 17896141 18730309 19441968 19944086 20834465 21892448 22624366
16758 22624366 23679774 24389928 25157981 26482944 27908547 28995452 30624091 31756240
16750 31756240 33330862 35020926 36623907 38825134 40505408 42749288 45081614 47263090
16742 47263090 49716597 52515854 55459750 58860078 62265595 65984023 70032996 74452125
16734 74452125 78979565 83590583 89055216 94423279 100443017 106307562 113095389 119826387
16726 119826387 126701220 134084164 141150739 147974977 154893058 161203574 166594040 171732360
16718A71732360M112133K916160J607525M25029o34844j897701l147418m394473
16710A70718771m318621o024946o374513o821377o756403p195895p338881p154088
16702A18734047o673738o740398o065870o087036n630801n432650m873065m722332
16694G2508157m409898l788432l967128l419028l176478k687585l073814k737256
16686D5248538k454864k251183k176988j319872k277395j383634j740355j673945
16678B9970302j470117j139449j130374j396685r83086q67096j172502n66243
16670B1244750j045860p51626q56344q02234m80713n19849m37059q48170o46040
16661A4856855l72636p55625m61062o98061k32899m01095l90117n67809k72239
$$ plain form
16718 171732360 175844493 178760653 180368178 180793207 180158363 178260662 175113244 170718771
16710 170718771 166400150 160375204 154000691 147179314 140422911 133227016 125888135 118734047
16702 118734047 112060309 105319911 99254041 93167005 87536204 82103554 77230489 72508157
16694 72508157 68098259 64309827 60342699 56923671 53747193 51059608 47985794 45248538
16686 45248538 42793674 40542491 38365503 37045631 34768236 33384602 31644247 29970302
16678 29970302 28500185 27360736 26230362 24833677 23850591 22983495 21810993 21244750
16670 21244750 20198890 19447264 18590920 17788686 17307973 16788124 16351065 15502895 14856855
16661 14856855 14484219 13728594 13267532 12569471 12336572 11935477 11545360 10977551 10705312
16652A0705312j71564m88660j84959k37189j58133m67416j24468n56404M20k20370
16642H096569j80573J7828p13744j03101k07986J38160l10411l99931J44051k58143
16632F222719j58681k29638j54189j17609k31967j57480J95441p8601m57585O4408
16622D896818k02252k78173j10169K31318J54680l37080k99261K75192j78017
16613D153056k29278j27463P1885j23617j92233L2592j81274J76834l21037q5975
16603C173490K5637n4748j33026J40320k66784L03754l23570J37469k76843K6770
16593B752469k67277K04302p8472J92260R6784p93096M55181q8890k20184K01237
16583B454314r9934j08793j15171L78930j09432m1432k35316j25541K01132k10392
$$ plain form
16652 10705312 10533748 10045088 9860129 9622940 9464807 8997391 8872923 8316519 8316939 8096569
16642 8096569 7915996 7933824 7220080 7116979 6908993 7047153 6736742 6336811 6480862 6222719
16632 6222719 6064038 5834400 5680211 5562602 5330635 5173155 5368596 5289995 4832410 4896818
16622 4896818 4694566 4416393 4306224 4537542 4692222 4355142 4055881 4331073 4153056
16613 4153056 3923778 3796315 3868200 3744583 3552350 3584942 3403668 3580502 3259465 3173490
16603 3173490 3199127 3144379 3011353 3151673 2884889 3188643 2865073 3002542 2725699 2752469
16593 2752469 2485192 2689494 2611022 2803282 2900066 2106970 2562151 2473261 2253077 2454314
16583 2454314 2354380 2245587 2130416 2509346 2399914 2358482 2123166 1997625 2198757 1988365
16573A988365J15377q6941p9739j54985J14425l23743K16762K06150k00810m1778
16563A753083o6233j98496J99317j53649K81242l15587n9967J00186r2025K61544
16553A709415k54325K9114k13980J18421p0643J2050j133l11909L55643j44213
16543A228440l94524M53979J08897p7036j9638J20074m12174j90945L81026j11951
16533A086148m8204J13371p4838l0178m0297O0228j85051J56339J52740n68235
16523F22023M06926k41333J40728l949j39108O2687k1277J2292K3986j97304L67073
16512A032744k86954J07152J62769m03324M02865R3209m78608M9905K40800j26768
16502G93790R0510k27077L56847l66521l9052J02881r6430K46864l51923L83351
$$ plain form
16573 1988365 2103742 2016801 1937062 1782077 1896502 1572759 1789521 1995671 1794861 1753083
16563 1753083 1686850 1488354 1687671 1534022 1815264 1499677 1439710 1539896 1447871 1709415
16553 1709415 1455090 1484204 1270224 1388645 1318002 1330052 1328919 1017010 1372653 1228440
16543 1228440 833916 1287895 1396792 1319756 1300118 1420192 1008018 817073 1198099 1086148
16533 1086148 1037944 1151315 1076477 1046299 1006002 1066230 881179 1037518 1190258 622023
16523 622023 1028949 787616 928344 924395 785287 847974 826697 838989 862975 665671 1032744
16512 1032744 745790 852942 1015711 612387 1015252 1108461 629853 679758 920558 793790
16502 793790 884300 657223 1014070 647549 608497 711378 614948 861812 509889 893240
16492H93240l04933L17855k93564N8974j26117j0258K11159j3254P654l15425
16482D25331Q1743p928J3170L69096l64666P1633p9920M457l0732J03801k0989
16471E64996j46174R3278j46189K24427L4097r9390k24451o5142M82757C06289
16460C44729L26475j64996A68560L36771q1203m6336J88500j6373K5501A0685
16449C60232Q3161K31117j64396j64979Q7371J43143K20186k64626j81647K24373
16439E73935j25870j15739J02873B00346O5471M2594J58349K16690A50783J25303
16429B76086Q9100l9759J0817q6201K498N5519J73565A19950L68768I7208M75443
16418E72651n6380j20496K66871d3705f381G6895M55202m9733j23423A34646L38355
$$ plain form
16492 893240 588307 906162 612598 671572 545455 535197 746356 733102 740756 425331
16482 425331 507074 499146 512316 881412 516746 588379 508459 512916 482184 585985 564996
16471 564996 418822 512100 365911 590338 624435 525045 300594 235452 718209 306289
16460 344729 671204 506208 168560 505331 424128 377792 566292 549919 575420 10685
16449 360232 443393 674510 510114 345135 432506 575649 795835 531209 349562 573935
16439 573935 448065 332326 435199 200346 265817 308411 466760 683450 150783 276086
16429 276086 365186 325427 336244 250043 252541 308060 481625 119950 488718 97208 572651
16418 572651 516271 395775 662646 -43705 -6381 76895 532097 482364 358941 134646 473001
16407D73001K33700C19785J47745A19479N01971F8679K17024m2033J21452J54499
16397E19621B05132N9733a1852D68091A61840K44609j46875k0219o4370K20349
16387C95334J06498j71308O7012b52860H0933f3974B66271L11379B23947o4224
16377A59723a80593B39129P6758A07626L32110F0803C0252K77174j23413m947
16367A79066K37234J57569A74160D7583K96161J07119A72891o2409O7455a06484
16356B29932Q1308a45190B70236k5205g8136I6979K44590j29277J6953C5738R8629
16345A34367K81209A94691l6890R471F8105k4738J67918I3413P6427M2791J14188
16334C26819A60534L21271j99607j33412h0130D68802A69290L04869e2022A26429
$$ plain form
16407 473001 706701 319785 467530 119479 621450 68679 285703 243670 365122 519621
16397 519621 205132 264865 -11852 468091 161840 406449 259574 239355 174985 395334
16387 395334 501832 330524 397536 -252860 80933 -63974 266271 577650 223947 159723
16377 159723 -180593 239129 315887 107626 439736 60803 30252 307426 184013 179066
16367 179066 416300 573869 174160 47583 343744 450863 172891 110482 177937 -106484
16356 229932 311240 -145190 270236 245031 -78136 96979 341569 212292 229245 35738 134367
16345 134367 415576 194691 157801 167272 68105 43367 211285 93413 169840 212631 326819
16334 326819 160534 481805 282198 148786 -80130 468802 169290 474159 -52022 126429
16323e6891C14990q5470I3493K22166q5213r8593J23852h4396A15220J22058r1055
16312A46223n0158A3888R9981E4490M63144A38225P0096a23517e122k30991F0349
16300A37467n240m4432K98852j80136E9358P7770D1518L7579Q9319o4109C5396
16288A87637q5618J39171A04476O9192H1083J53224J15828G9331N6151B1654K01275
16277B22929H5542J05231M2587b04138B56204b86891C18360C3985L08609j19291
16267B23303d1203I6098a70003B03359D410K65184c8764l3427E3009A5729g9061
16255B1896g2575A87168j038l9963o9607M12572C3471J47483K02185j77322p2690
16244A33127J84580a33477C094J00246Q5238a42993B3169J1127a67932j74059
$$ plain form
16323 -56891 314990 229520 93493 315659 230446 131853 255705 -84396 115220 237278 146223
16312 146223 96065 13888 113869 54490 517634 138225 208321 -123517 -5122 -236113 60349
16300 137467 132227 87795 386647 206511 59358 137128 41518 79097 168416 104307 35396
16288 187637 102019 241190 104476 173668 81083 234307 350135 79331 135482 21654 222929
16277 222929 85542 190773 233360 -204138 256204 -286891 318360 33985 342594 223303
16267 223303 -41203 96098 -170003 203359 4410 269594 -38764 -72191 53009 15729 -79061
16255 21896 -72575 187168 186130 146167 76560 489132 33471 180954 383139 205817 133127
16244 133127 317707 -133477 3094 103340 188578 -142993 23169 34296 -167932 -341991
16234c41991A9501K53871a32592F4027k7487J19518a86136b3882C27578d1539
16223b136j79958O5613P402I3354O7582a23326b6115p2050A07791b5698j53352
16212a79050j19915g2602g028G1723a76886A60412n3571d7014k7614k33009e7037
16200a09657B73044f5407k2219H7784M66719a44405K0783p006B68295b89082a31353
16188d4633N309A2076K1274c9313q797j86236A40104J37188j37305M183C1410
16176f924H1348k9796a16648B23547o9882c5478B22394a55578A04823b2857k661
16165b5518j8378j69558A18905R7500Q4377D3419J93074c06560d4244j05552O4083
16154h5713a4223C29482d0728D2321a22789A08554e33782a64790A21169J018a49187
$$ plain form
16234 -341991 19501 273372 -132592 64027 36540 156058 -186136 -23882 327578 -41539
16223 -2136 -182094 -116481 -109079 93354 160936 -123326 -26115 -98165 107791 -25698 -179050
16212 -179050 -298965 -72602 -7028 71723 -176886 160412 106841 -47014 -74628 -307637 -57037
16200 -109657 273044 -65407 -87626 87784 554503 -144405 -123622 -130628 268295 -289082 -131353
16188 -44633 -39324 12076 33350 -39313 -48110 -234346 140104 277292 139987 144170 31410
16176 -6924 81348 51552 -116648 223547 153665 -35478 222394 -155578 104823 -22857 -25518
16165 -25518 -43896 -213454 118905 216405 300782 43419 236493 -306560 -44244 -149796 -85713
16154 -85713 -14223 329482 -40728 42321 -122789 108554 -533782 -164790 121169 122187 -149187
16142a60153A3740b6234I8786J01665b7460B75239m5804b25368P9509j25860B34416
16130e0737B31177a78721E4081J91154e9970E4501b44903K0480A8610a8040E6155
16118d2522E6359j4050n053e09429a91321O5181N4845k28242A38917a20373a0756
16106a33961e2628A10699c6067D1433L8943b7724r036A99489e7554A01955o460
16095I5495i7341A34146g9325m0276j40405A91937f5671B35198F6844J56668b65395
16083g2266l361l57950a33788I4125J17944C9861L87021B6070L11571c9204j42727
16072a81931I5277a4564k4023A54201a87493h5974D29412A41565p0385p773b7288
16060a6499j87967c9146A47240a37964a2983d363H6236d8665a0994F3378Q2842
$$ plain form
16142 -160153 13740 -26234 98786 200451 -27460 275239 229435 -225368 -145859 -271719 234416
16130 -50737 231177 -178721 54081 245235 -59970 54501 -244903 -224423 18610 -18040 56155
16118 -42522 56359 42309 37256 -509429 -191321 -126140 -71295 -299537 138917 -120373 -10756
16106 -133961 -52628 110699 -36067 41433 80376 -27724 -36760 199489 -57554 101955 95495
16095 95495 -97341 134146 -79325 -119601 -260006 191937 -65671 235198 66844 223512 -265395
16083 -72266 -75627 -433577 -133788 94125 212069 39861 426882 26070 337641 -39204 -181931
16072 -181931 95277 -14564 -38587 154201 -187493 -85974 429412 141565 71180 63407 -27288
16060 -16499 -204466 -39146 147240 -137964 -12983 -4363 86236 -48665 -10994 63378 146220
16049A46220c2316e275m03682A80657a70621l6604A63460p6999J95793b19558
16038g6285l3647B1529c08855I5867a48838A5098J04685K9065G2910c2600A82357
16026b19621f4040a7620C50366a12328l20895B3890N9396a19375L4740K8351K3537
16015c2747C18214a89270b4332k3365k54813A15681c10435F6743A5050O3418a84551
16003C2826J613a51886A72777c8714a1761B5930R0965a70175b0711I9403a6706
15991A7042J08456c5244B8747M622K45100I3046k5442a07090A80223q9619M4956
15980A35560K44725e0376j83123B17855E3845K65142a97777b2067A48062C8850
15969A49613a59174D71060j17910A05010m8420a19704K525B27796A8591f3527
$$ plain form
16049 146220 -32316 -5275 -408957 180657 -170621 -207225 163460 86461 282254 -219558
16038 -76285 -109932 21529 -308855 95867 -148838 15098 119783 148848 72910 -32600 182357
16026 -219621 -64040 -17620 350366 -112328 -433223 23890 83286 -119375 -84635 -56284 -32747
16015 -32747 318214 -189270 -24332 -47697 -302510 115681 -310435 66743 15050 78468 -184551
16003 32826 34439 -151886 172777 -38714 -11761 25930 116895 -170175 -20711 99403 -16706
15991 17042 125498 -35244 28747 33369 278469 93046 67604 -107090 180223 90604 135560
15980 135560 380285 -50376 -233499 217855 53845 318987 -197777 -22067 148062 38850
15969 149613 -159174 471060 353150 105010 56590 -119704 -117179 227796 18591 -63527
15958a45611B08345a7030j54894B49220A12963O2732b09499o5172B56564b12871
15947f522C7653d91973B04532D6468b47732b627j46499B68345f9258N692j16481
15936a80047o62D5989b26236O7871L0068r2430C08829a44484B49479a32998A18129
15924a65840A43577a87206J1279F8175a76032j18032k8698H542i1055A82037J72289
15913C54326b16448d3890B90175r5500a3199k25069c1091k95674c5765G4490J08581
15902A83071M456c094j02417D3784N4459A9564J33397l5680a78346p6637c5042
15890a6748r2375J8550n7713c7248l21046H3091b64396A42837J6757c14130I1672
15878c2392A63124k6868a23783J2860d6141H8919o860Q0842h8856j7381j03608
$$ plain form
15958 -145611 208345 -17030 -171924 249220 112963 175695 -209499 -274671 256564 -212871
15947 -6522 37653 -491973 204532 46468 -247732 -2627 -149126 268345 -69258 -63566 -180047
15936 -180047 -180709 45989 -226236 -158365 -128297 -220727 308829 -144484 249479 -132998 118129
15924 -165840 143577 -187206 -175927 68175 -176032 -294064 -322762 8542 -91055 182037 354326
15913 354326 -216448 -43890 290175 194675 -13199 -238268 -31091 -326765 -35765 74490 183071
15902 183071 187527 -3094 -105511 43784 98243 19564 152961 117281 -178346 -254983 -35042
15890 -16748 -109123 -90573 -148286 -37248 -358294 83091 -264396 142837 159594 -314130 91672
15878 -32392 163124 136256 -123783 -110923 -46141 88919 82059 162901 -88856 -106237 -209845
15867b09845B07544h5572q297A83639a2181m6419A18723a62754e1268b3376l82916
15856d06292B6784O5460b45916i3964A52559L797n4155L79952G130J51408a35683
15844c7980j40731o2904A4568K49673p5750a6912E6739c55827a27946A65902a39131
15832a10797B39604b72407I3496J57783j07647a20230B94111c7725j86044D35655
15821b7325j65624j38439J56126a9250n2651b3795r528r4495A43285C9056d49890
15809b20073g361j25243G004J31680d510D7371a6625n1039k4293g060k30505R1742
15797a45823d8436k5994j40396I3039d19123a79119B0953g9291J2497A34506c40487
15785d3509D5079a38154G4496J35863g9905b0140A43893n2152g6252B74494n1949
$$ plain form
15867 -209845 207544 -85572 -93869 183639 -12181 -58600 118723 -162754 -51268 -23376 -406292
15856 -406292 26784 92244 -245916 -93964 152559 156356 102201 482153 7130 158538 -135683
15844 -37980 -178711 -241615 14568 264241 188491 -16912 56739 -355827 -127946 165902 -139131
15832 -110797 239604 -272407 93496 251279 143632 -120230 294111 -37725 -223769 435655
15821 -27325 -192949 -331388 -175262 -19250 -71901 -23795 -33323 -127818 143285 39056 -449890
15809 -220073 -7361 -132604 7004 138684 -4510 47371 -16625 -67664 -91957 -7060 -237565 -145823
15797 -145823 -48436 -74430 -214826 93039 -419123 -179119 20953 -79291 -66794 134506 -340487
15785 -43509 45079 -138154 74496 210359 -79905 -20140 143893 91741 -76252 274494 222545
15774B22545A8349b29800r5560B8313K3315b35340D1424R8152M3267p9519C7369
15762D1760b3772A70041b89074D3106b24532B17055D6829d3767r8419e0974k11290
15751b62264H6869a98321A85273h9956A26864a60936D68168F3996a29214b7247
15740c27540A99324b92506J13519g563G3576K1519a75436O3512q8354b1965j27915
15729a49880A62143p5662d0579d906m15153a28273k0548r7196D5925P7535a28367
15717B73335H1817d5472G0730i6107C7992K5764a23530l8427j47937c0857j15931
15706a46788j85712A80402k5540o2091a50431A80b98332J44353A21092b65438
15695D8399a10841e3655A49749N9165F15a01447b6259F6800g1656A23667n5798
$$ plain form
15774 222545 18349 -229800 -325360 28313 51628 -235340 41424 139576 182843 103324 37369
15762 41760 -23772 170041 -289074 43106 -224532 217055 46829 -43767 -142186 -50974 -262264
15751 -262264 86869 -198321 185273 -89956 126864 -160936 468168 63996 -129214 -27247
15740 -327540 199324 -292506 -178987 -7563 73576 95095 -175436 -111924 -200278 -21965 -149880
15729 -149880 162143 86481 -40579 -4906 -420059 -128273 -148821 -246017 45925 123460 -128367
15717 273335 81817 -45472 70730 -96107 37992 63756 -123530 -161957 -309894 -30857 -146788
15706 -146788 -332500 180402 154862 92771 -150431 180 -298332 -153979 121092 -265438
15695 48399 -110841 -53655 149749 208914 615 -101447 -26259 66800 -71656 123667 67869
15684F7869g6015O459B27330d25276a15329A30820a11200c774C09844b00722k16889
15673d17611K02014b8686A41258B6916b22395B6326O4892a3007A77051H0878L8743
15662A19621A3298b12150N040f1537H41b37681L1774R2768D7218d4848B39502
15650a01051q3970G4110O2051a05313A13376K4882a36982D57638f7951l0880I8808
15638e2844r1910d4495J7057j36477D6280L7308J5605Q3881K5019a29828B14143
15626c08552e4655M023A50693a79746J707A60563D734d1511H2189i2752D038a3544
15613h9018m8061b7847j66662K6749B7691J82872A04988C3762b14974O3843k02793
15602c53924a43665A07930b03825H6622l3564D244a18733J4362K092B20210f9332
$$ plain form
15684 67869 -76015 -69556 227330 -425276 -115329 130820 -111200 -3774 309844 -200722 -417611
15673 -417611 -215597 -28686 141258 26916 -222395 26326 91218 -13007 177051 80878 119621
15662 119621 13298 -212150 -207110 -61537 841 -237681 -205907 -113139 47218 -44848 239502
15650 -101051 -185021 74110 136161 -105313 113376 138258 -136982 457638 -67951 -98831 98808
15638 -52844 -144754 -44495 -27438 -163915 46280 83588 99193 183074 208093 -129828 214143
15626 -308552 -54655 -50632 150693 -179746 -178039 160563 4734 -41511 82189 -92752 4038 -13544
15613 -89018 -137079 -27847 -194509 -167760 27691 210563 104988 33762 -214974 -151131 -353924
15602 -353924 -143665 107930 -203825 86622 53058 4244 -118733 -104371 -102279 220210 -69332
15590I6490a0851j39230o8632Q6749E9004b55827B48624C9410J63319P3110A02393
15578A52151o4057J57243L6444a28885A07582b12308I8026a85054n86h8455j66080
15567b54535b5525C5722n603J50734H7165A930h3750I5673a8774A44274L3028
15556A77302A4225b72965F4521h0937A09417L6924a5766r6455L059n5871e7835
15544D4496J07230E9159h0059p5185A75777F1979K03722G2238c51505E4075N641
15533E9716g7782A8619f1039A75515e9353B33576b08309Q5169b1107j15360l6264
15522a72731E1274A9501a13805d6336A60482m8245c5143l88681B01831F302a84295
15510A68419d6443m7209k26689J19008I7593K7089i3828D38290c1365M198j19607
$$ plain form
15590 96490 -10851 -150081 -218713 -131964 59004 -255827 248624 39410 202729 275839 102393
15578 152151 88094 245337 281781 -128885 107582 -212308 98026 -185054 -185640 -88455 -254535
15567 -254535 -25525 35722 30119 180853 87165 1930 -83750 95673 -18774 144274 177302
15556 177302 14225 -272965 64521 -80937 109417 146341 -15766 -112221 -109162 -165033 -57835
15544 44496 151726 59159 -80059 -155244 175777 61979 265701 72238 -351505 54075 59716
15533 59716 -77782 18619 -61039 175515 -59353 233576 -208309 -123140 -21107 -136467 -172731
15522 -172731 51274 19501 -113805 -46336 160482 112237 -35143 -423824 201831 6302 -184295
15510 168419 -46443 -93652 -320341 -201333 97593 124682 -93828 438290 -31365 -27167 -146774
15499a46774j19188g550A55443a81363o6195E64049b05760b5103j13830f8627
15488a45773A35037a56206e9524l9113A42763g3316k06897h524C3704J71328h3920
15476d80648G8143k28J05500b15599n6728R6974H5424c17990J44902F0096J2357
15465G2453L2177g2110k3614A10300R0122e6173A58314a56651j84095D1727P4980
15454A16707J6215c055A13070n2968d15181a88160D0773d6559D0429a07162l02425
15443d09587B77644c17422g8043C1923a84354E5308a56792A66038a34957N669
15433a29288q2078A09516b14087B80394I4641g6941j7377e834B82543D6531a22095
15421A40467d2672m7324H0446B1649L6793a06439A35266e3336j3986j647K742
$$ plain form
15499 -146774 -265962 -7550 155443 -181363 -247558 564049 -205760 -25103 -138933 -68627
15488 -145773 135037 -156206 -59524 -98637 142763 -73316 -280213 -8524 33704 205032 -83920
15476 -480648 78143 77915 183415 -215599 -272327 -175353 85424 -317990 -173088 60096 72453
15465 72453 104630 -72110 -95724 110300 200422 -56173 158314 -156651 -340746 41727 116707
15454 116707 132922 -3055 113070 60102 -415181 -188160 40773 -46559 40429 -107162 -409587
15443 -409587 277644 -317422 -78043 31923 -184354 55308 -156792 166038 -134957 -129288
15433 -129288 -211366 109516 -214087 280394 94641 -76941 -94318 -5834 282543 46531 -122095
15421 140467 -42672 -89996 80446 21649 58442 -106439 135266 -53336 -67322 -68969 -66227
15410f6227E0898d2586m7333A55376G869K89497E817M5628d67168C9213a12647
15398G3976e2385j41516n6364j8828j45663I6762c22312B27729c4992d374B30321
15386B2450a07727A12346Q7945B1805P7405c946k36443B61278F844Q3699D4475
15374A40513b32449h0809p1142I7664i924j90544c1654A23429D9569J07851O5105
15363B22525a62068N5672j55876Q7400B76810j28003a2969A02440L8579i2604
15352I6893k2963K93517a04258E8766b12143p6137a8596B29301m7520J16550F8905
15340h0203A06863c36324A10407a54958k26011B89438j40562o5009J17507g2924
15329a2284I4717b11484c7607G2520J36799a44188f7289j94924A10414b47640
$$ plain form
15410 -66227 50898 -42586 -89919 155376 7869 297366 5817 51445 -467168 39213 -112647
15398 73976 -52385 -193901 -250265 -269093 -414756 96762 -322312 227729 -34992 -4374 230321
15386 22450 -107727 112346 200291 21805 99210 -3946 -240389 261278 6844 90543 44475
15374 140513 -232449 -80809 -151951 97664 -9924 -200468 -31654 123429 49569 157420 222525
15363 222525 -162068 -106396 -262272 -174872 276810 148807 -12969 102440 141019 -92604
15352 96893 73930 367447 -104258 58766 -212143 -288280 -18596 229301 181781 298331 68905
15340 -80203 106863 -336324 110407 -154958 -380969 289438 148876 83867 201374 -72924
15329 -12284 94717 -211484 -37607 72520 209319 -144188 -67289 -262213 110414 -247640
15318A59091B5215J85601p9455a6425A79501a00363A78916a24229b2276A01506
15307B96602q8937f9583o8061B97006A16308L7247g2622A66969Q5635m7697Q2507
15296B87414A40817L716P1560K7909e7139B5093P2349b18203g350A70639E2429
15284C58171m8704c87536A98770a86061B479a79168B08857b7957C6642a43374
15273C7864P8884i4770q1053A88148q0787a970o7625A63002M1532o5170d0009
15261A7212a8191A70144b5045C9324O8015N1432M7987a39448f2266B66574M7784
15250C14358c6558A90462K29560N66723q0157M70465L1535l43894m08007B53824
15239D96887j66818e4365A22616K58473A04455E791K18541a64642B1664K9785
$$ plain form
15318 159091 25215 210816 131361 -16425 179501 -100363 178916 -124229 -22276 101506
15307 296602 207665 -69583 -137644 297006 116308 153555 -72622 166969 252604 204907 287414
15296 287414 140817 144533 216093 244002 -57139 25093 97442 -218203 -7350 170639 52429
15284 358171 309467 -387536 198770 -186061 2479 -179168 208857 -27957 36642 -143374
15273 37864 116748 -94770 -175823 188148 107361 -1970 -69595 163002 204534 139364 -40009
15261 17212 -18191 170144 -25045 39324 107339 158771 206758 -139448 -62266 266574 314358
15250 314358 -36558 190462 420022 986745 906588 1377053 1408588 1064694 656687 253824
15239 496887 330069 -54365 122616 381089 104455 5791 224332 -164642 21664 51449
15229E1449b5670J628k47110A35347K20132I2576k8568f4614B78891F896a42689
15217b16458j9663e0628a7111A32522a86905N9702c4128l80969I3390B5049b15797
15205B0234a48834G0360g3206K9216A43826b63101G0452d96610E333a64196C40713
15193A74692i7035B69916j07817O5748K2028a33371B37699L6963b88274K7174
15183b61100i1380n6916f4093p6319J7973B81598a52709A68470a0578A51916p2943
15172G8973j6853c0380A78202K24536D4347N8700h1870G6535A785K9371f3626
15160d5024j08300A5175a17495B02872J38803A58194L9214k0007n2695m9970J81104
15149B55840I7853a20608j87569A35103p141J50864O4192D9957P3886d2516A15912
$$ plain form
15229 51449 -25670 -24042 -271152 135347 355479 92576 64008 -64614 278891 6896 -142689
15217 -216458 -236121 -50628 -17111 132522 -186905 -127203 -34128 -415097 93390 25049 -215797
15205 20234 -148834 70360 -73206 -43990 143826 -263101 70452 -496610 5333 -164196 340713
15193 174692 -97035 269916 162099 227847 249875 -133371 237699 274662 -288274 -261100
15183 -261100 -91380 -148296 -64093 -140412 -122439 281598 -152709 168470 -10578 151916 78973
15172 78973 62120 -30380 178202 402738 44347 103047 -81870 76535 1785 31156 -63626
15160 -45024 -153324 15175 -117495 202872 341675 158194 197408 177401 124706 74736 255840
15149 255840 97853 -120608 -308177 135103 127962 278826 343018 49957 123843 -42516 115912
15137i235A99449a2214l3427C0359L5101J84813F4844K86934L450A6881a82777
15125B14293J27943G4666N2038J75502A07846j4408i9038H032J45042o4798K37229
15114C25505B8295J92318o7203k198J39822a35618C55821m855j21747i2782A73615
15102A5857K15550A8854K39126a31879B9962K49579a4009F7729Q2287b15449E61536
15090A1542K7808i3097A43280J51041r4497N71J51936a3445p0569A35236a213
15078A4030l489e6569A21749e0867A07319f0400A41283l4884j6414a05610G0922
15066a82330B76708n9536b335B33467a74896A71300R2702J25437B430M71814a16933
15054a8333D78077A99926d501j70786h7416B24496b27735A97339n207h16C70068
$$ plain form
15137 -9235 199449 -12214 -45641 30359 65460 250273 64844 351778 355228 16881 -182777
15125 214293 342236 74666 126704 302206 107846 93438 -99038 8032 153074 88276 325505
15114 325505 28295 220613 153410 151212 291034 -135618 355821 350966 229219 -92782 173615
15102 15857 231407 18854 257980 -131879 29962 279541 -14009 67729 150016 -215449 561536
15090 11542 39350 -93097 143280 294321 199824 200395 352331 -13445 -84014 135236 -1213
15078 14030 10541 -56569 121749 -50867 107319 -60400 141283 106399 89985 -105610 70922
15066 -182330 276708 217172 -2335 233467 -174896 171300 264002 389439 2430 474244 -116933
15054 -18333 478077 199926 -4501 -175287 -87416 224496 -227735 197339 192132 -816 370068
15042D1189P5203e0375B9463J85377A07285J04128H2154i8309D10778a38813A79645
15030a0340G61a07683A77367M00223A13914L202J6493L9731E6528J98819A11931
15018A45507E1389L19944a73639N7094B33720a53460A31391E7354R0334i3344
15007A29906R0893o187D3656M2693R8581O9358g7008G8829J35470H6571M24783
14996E11354H2334K06677m3714r3167n9491M2778B8531Q4512C2248d94712A70161
14984A03893k2638Q3589K0566o5890a20821B39742a8597A86247n8572J46275J1657
14973B85607g6667C8854L00039G8141J91384J15113j88880h3995C57660A40021
14962E2600L47404J41383B58699M1410J91245R6397J05227f4137B20982J44955
$$ plain form
15042 41189 116392 -50375 29463 214840 107285 211413 82154 -98309 410778 -138813 179645
15030 -10340 761 -107683 177367 577590 113914 117116 133609 173340 56528 255347 111931
15018 145507 51389 371333 -173639 -116545 233720 -153460 131391 57354 147688 -93344
15007 129906 220799 214612 43656 86349 184930 254288 -77008 78829 214299 86571 511354
14996 511354 82334 289011 245297 152130 92639 135417 28531 113043 32248 -494712 170161
14984 103893 81255 164844 185410 119520 -120821 239742 -18597 186247 127675 273950 285607
14973 285607 -76667 38854 338893 78141 269525 384638 195758 -83995 357660 140021
14962 52600 400004 541387 258699 300109 491354 587751 692978 -64137 220982 365937
14952C65937p4514j4728C6734g6895A63242m4856L46290j79197K13264B32391
14941A97392K23701B6267N51852a8079A45117J81633J41975j84221J96544a3415
14930B0755L48908l8260G5705O2743m4856J41557G24K34617J16314q3907l4463
14919B33285J2437J39051n1071o3779n9600J5450J72650j64419J39499I8030K93106
14908C91136J27633j25422I8397O2174J94797j68008K07217j24227F808J47794
14898A54602P4579K64095A83948l7403K82141k10779J0581p0692J52883J34510
14888D45189j10376J52841j61059N991F2918M2125L13416P0247j37716p3675l5154
14877B42161J85497K55795A9764N42093j63911q5927q1310J81637n8344j129O1483
$$ plain form
14952 365937 291423 276695 36734 -76895 163242 118386 464676 285479 498743 232391
14941 197392 421093 26267 578119 -18079 145117 326750 468725 284504 481048 -13415
14930 20755 369663 331403 75705 138448 93592 235149 724 235341 351655 267748 233285
14919 233285 245722 384773 333702 269923 210323 225773 398423 234004 373503 98030 391136
14908 391136 518769 393347 98397 160571 355368 187360 394577 270350 6808 154602
14898 154602 229181 493276 183948 146545 428686 217907 228488 157796 310679 445189
14888 445189 334813 487654 326595 332586 62918 105043 418459 488706 350990 277315 242161
14877 242161 427658 683453 19764 561857 397946 312019 230709 412346 354002 352873 414356
14866D14356K6015j49099K2982Q833n7787L75807k09630k15287K07450j59505
14856B64135m9707J66472R3234A69004l6626L84370k12687j4703M16755C37125
14845C05648K25216q4511k03655K37032A32849K92506J13596p2932j92483K19485
14835D93021B22715L708J82316E4167O5896L83185j59056A49383M14596m7682
14825E16297P6958B71852M17939k30992B9921J72063L12971n6499j001j37534
14815C19921j24629M53229O1749j33529k70428n0651K17080J07997l4310L2475
14805E78904k75375K00245B26113J39068p0659L32338k72618M7847j21127J95664
14795D76626J10087j64291k05243J49909J32987k6079j36507j841J83166j65817
$$ plain form
14866 414356 440371 291272 314254 323087 265300 641107 431477 216190 423640 264135
14856 264135 214428 380900 474134 169004 132378 516748 304061 289358 706113 337125
14845 305648 530864 446353 242698 479730 132849 425355 538951 466019 273536 493021
14835 493021 222715 226423 408739 54167 120063 503248 344192 149383 563979 516297
14825 516297 593255 271852 689791 458799 29921 201984 514955 458456 457455 319921
14815 319921 195292 648521 710270 576741 306313 255662 472742 580739 546429 578904
14805 578904 303529 503774 226113 365181 294522 626860 354242 402089 280962 476626
14795 476626 586713 422422 217179 367088 500075 473996 337489 335648 518814 352997
14785C52997r0384J54073Q1374Q434j94639N52704l49970K64645k26832A84656
14774E84663j76431J12708m3520j76657N5049j3326K4421K01737r0553J41974
14764F20065K3593j87044J73364j08716J61714r5570J85622l26117A25699J25456
14754B51155K98256r9351j34710K07030P9537m3349j60389R7133J48838j51573
14744D92577k25616J4951M18326P5383j63233k52581M7313L51341J83824O6243
14734A008528D80056K70115j03987B79454N7753N5637K74154j24934L74215k13773
14724G02506o4748K1856P8449k4177k68198L5304K03407k9410K34764p0509k99372
14713E19872J11464q5305o8820K64741M1545n5817k73940K89906p5142j95575
$$ plain form
14785 352997 262613 416686 498060 506494 311855 864559 514589 779234 552402 184656
14774 584663 408232 520940 477420 300763 355812 342486 366907 568644 478091 620065
14764 620065 643658 456614 629978 521262 682976 587406 773028 446911 125699 251155
14754 251155 549411 450060 315350 522380 601917 558568 398179 495312 644150 492577
14744 492577 266961 281912 700238 775621 612388 359807 407120 758461 942285 1008528
14734 1008528 480056 750171 646184 279454 337207 392844 666998 542064 916279 702506
14724 702506 637758 659614 738063 713886 445688 480992 684399 654989 889753 819244 519872
14713 519872 631336 546031 477211 741952 783497 727680 453740 743646 668504 472929
14703D72929M3965N09676l99035o5170K14105J7237M6956J69653D67182M01702
14693H68884j0204l88380K61861k6220K02903p1730o9081O0659J17381m01369
14683E44704J43244j40467L38084j00717l05111N41626j73315J893K30802l67398
14673G13345J03028C97707L08423L5933J45206l95737M6461L69302Q563p6067
14663H39791K9497Q0460n6538n013K3705j98497J65496j9880J91623m34016L85892
14652A002520l75600K70298o4133L52325n7274J34884K0183m67124J38862J3488
14642I68429k05695O12289j72827r3054Q4491k02591Q5637J83500j59865N3237
14632A153551J18716o7452l59751N0210L09674j08584J26858j18713j07433O3097
$$ plain form
14703 472929 516894 1026570 627535 562365 776470 793707 840663 1010316 467182 868884
14693 868884 858680 470300 732161 705941 908844 837114 768033 828692 946073 544704
14683 544704 687948 547481 885565 784848 479737 1021363 848048 849941 1080743 713345
14673 713345 816373 397707 706130 742063 887269 491532 537993 907295 915858 839791
14663 839791 869288 949748 893210 888197 911902 713405 878901 859021 1050644 616628 1002520
14652 1002520 626920 897218 833085 1185410 1128136 1263020 1283203 816079 954941 968429
14642 968429 762734 1375023 1202196 1109142 1193633 991042 1076679 1260179 1100314 1153551
14632 1153551 1272267 1204815 845064 895274 1204948 1096364 1223222 1104509 997076 1060173
14622A060173K88291k20389J13303j03776Q9272j18746k0307K15225L3377K31794
14612A568217m27250J94898n1111K1365K1583L9008j29760J74024l14949O606
14602A102631L94865k06785L8888j40015M75987j30511j468l7816j66969j41184
14592A187623L03443k64653K50095Q1809O9881m22196J99798K22492N6310j04927
14582A579675j21172J22435L7797J68165k11377K92982k64019q3261N9030K05906
14572A786161J87203r4711r5363J77152j62356n5622J70104M4496j43508N94902
14562B408458j11193k87475K81224m4579n6372o5913L89684K04267K44440q6328
14552B876213M67598L85073P80710J096733L978759P665353J6210245k411882
$$ plain form
14622 1060173 1348464 1128075 1241378 1137602 1226874 1108128 1087821 1303046 1336423 1568217
14612 1568217 1140967 1335865 1284754 1306119 1327702 1366710 1236950 1410974 1096025 1102631
14602 1102631 1497496 1290711 1329599 1189584 1665571 1535060 1533592 1495776 1328807 1187623
14592 1187623 1491066 1226413 1476508 1558317 1628198 1206002 1405800 1628292 1684602 1579675
14582 1579675 1458503 1580938 1618735 1786900 1575523 1868505 1604486 1521225 1580255 1786161
14572 1786161 1973364 1878653 1783290 1960442 1798086 1742464 1912568 1957064 1813556 2408458
14562 2408458 2297265 2009790 2291014 2246435 2190063 2124150 2513834 2718101 2962541 2876213
14552 2876213 3343811 3728884 4509594 5606327 9585086 17250439 33460684 31048802
14544C1048802p347983r481880n179010l684420j964874j085773q1863l68071
14536A854928j60274k1142j45198Q1692J39620K97328m68096J91121J91155j08157
14526A852977M6419J12702o0407n0824L7032m7489M20420l75313J24559l21145
14516A738931Q00884o90506M55806k24742l7569L36366l751K09446l63628M68006
14506B689243l64576K71530o1458L09881j30738O4508J25537J74652k54005j33797
14496B690777K21766l36099M48620k13583o3465J93170K1875k0696K28073l21683
14486B848755K8657J89675N7229P9261J44324k18525J27457Q7571j72039L62673
14476C535038r2209k08433K78927j14649O24780l15729K44980l90160J76605J45845
$$ plain form
14544 31048802 23700819 14218939 9039929 5355509 3390635 2304862 2222999 1854928
14536 1854928 1694654 1673512 1528314 1610006 1749626 2046954 1578858 1769979 1961134 1852977
14526 1852977 1899396 2012098 1951691 1900867 1937899 1890410 2310830 1935517 2060076 1738931
14516 1738931 2539815 1849309 2305115 2080373 2042804 2379170 2375419 2584865 2221237 2689243
14506 2689243 2324667 2596197 2534739 2844620 2713882 2778390 2903927 3078579 2824574 2690777
14496 2690777 2912543 2576444 3025064 2811481 2748016 2941186 2963061 2942365 3170438 2848755
14486 2848755 2877412 3067087 3124316 3203577 3347901 3129376 3256833 3344404 3172365 3535038
14476 3535038 3442829 3234396 3513323 3398674 4023454 3707725 3952705 3562545 3739150 3884995
14466C884995Q7633k65103P0450L21611L29841l88792q8930r5995K90578K25583
14456D371871L36211k70673l0277K15822j0061k1352J44396k03136M23456l72947
14446D583310J60388q8369M09692k53019J4785K39463Q8799J89966k24684o44
14436E119687Q5953K63252r2783K93345M9287j09835J2897L16752j37651P5602
14426E876506P918M27465Q1742k80874K94902K6060K28148j12809J54324Q666
14416F712048O86722k23411L6380M13337j25434K42557o1718j49706M91893k521
14406H020147k40159M11530N3416M28910j16206j99353M05706J56666j16138M63277
14396I267796m027L39195L89043k09232r4531J07294P49578n4436O7450M86596
$$ plain form
14466 3884995 3972628 3707525 3777975 4099586 4429427 4040635 3951705 3855710 4146288 4371871
14456 4371871 4708082 4437409 4407132 4622954 4612893 4591541 4735937 4532801 4956257 4583310
14446 4583310 4743698 4655329 5065021 4812002 4826787 5066250 5155049 5345015 5120331 5119687
14436 5119687 5205640 5468892 5376109 5669454 5718741 5608906 5621803 5938555 5800904 5876506
14426 5876506 5884424 6311889 6393631 6112757 6407659 6433719 6661867 6549058 6703382 6712048
14416 6712048 7398770 7175359 7211739 7625076 7499642 7742199 7680481 7530775 8022668 8020147
14406 8020147 7779988 8191518 8244934 8673844 8557638 8358285 8763991 8920657 8804519 9267796
14396 9267796 9263769 9602964 9992007 9782775 9688244 9795538 10545116 10490680 10558130 11044726
14386A1044726M8891K7705M9594K08671N61938Q6290N13853j98001N72613P0927
14376A2987207M41902J97147J16336K36693K37201M66941N77259R9719L10748
14367A5671153K95897J03769K34859J04017P09970N06482M39796L8792Q59359
14358A8964094j60242N04614K84744Q81483M46376O34627K39681K89618J012459
14349B3097454K64486N55344Q13360Q92515N65840K22147J031998P2556J050376
14340B8566076O85324J075242Q12568M11261J414322Q77812R22074Q96956J267373
14331C6929008J030365J115630J443688J521206J193125J130119J467147J829880
14323D7660168J349978J746391J868679J687240K266618J954973K195663K344240
$$ plain form
14386 11044726 11093617 11121322 11170916 11379587 11941525 12027815 12541668 12343667 12916280 12987207
14376 12987207 13429109 13626256 13742592 13979285 14216486 14683427 15260686 15360405 15671153
14367 15671153 15967050 16070819 16305678 16409695 17119665 17626147 18065943 18104735 18964094
14358 18964094 18803852 19308466 19593210 20474693 20921069 21555696 21795377 22084995 23097454
14349 23097454 23361940 23917284 24730644 25623159 26188999 26411146 27443144 27515700 28566076
14340 28566076 29251400 30326642 31139210 31550471 32964793 33842605 34764679 35661635 36929008
14331 36929008 37959373 39075003 40518691 42039897 43233022 44363141 45830288 47660168
14323 47660168 49010146 50756537 52625216 54312456 56579074 58534047 60729710 63073950
14315F3073950K556169K567472K662846K930483K820056L425234L484376L429147
14307H6949733L987960M286456M273351M788204N092880N191493N571817O266713
14299A26408607O373288O496510P238748Q030879Q225538Q659753Q834134J0045283
14291A90312740J0238583J0869919J1802084J2573116J3089356J3802802J4088316
14284B76776916J5230408J5401653J6024078J6044645J6522722J6081809J5809147
14277C87891378J5316440J3753736J3048112J0799237O057850K016947J428466
14270D50312166o953117n629419J279433n444935n069063m689728q480259j0200888
14262D05124190j2713220j3929609j4837507j6394831j6792611j6538183j6001120
$$ plain form
14315 63073950 65630119 68197591 70860437 73790920 76610976 80036210 83520586 86949733
14307 86949733 90937693 95224149 99497500 104285704 109378584 114570077 120141894 126408607
14299 126408607 132781895 139278405 146517153 154548032 162773570 171433323 180267457 190312740
14291 190312740 200551323 211421242 223223326 235796442 248885798 262688600 276776916
14284 276776916 292007324 307408977 323433055 339477700 356000422 372082231 387891378
14277 387891378 403207818 416961554 430009666 440808903 446866753 448883700 450312166
14270 450312166 443359049 437729630 439009063 433564128 428495065 423805337 415325078 405124190
14262 405124190 392410970 378481361 363643854 347249023 330456412 313918229 297917109
14255B97917109j5913953j4896425j3539316j3422607j2633573j2293877j1851351
14248B03366007j0483894j0379248r610790q649611q517187p834511p499952o946156
14240A33444658o254132o463527n118987n081389n288567m525898m571881m435580
14232I1704697l509734l472104l920599k789544l091570l378761k753549k588517
14224F6200319k344376k304721k407323k284346k082067j592170j550248j930904
14216D9704164k087115j583622r17640j207239j378789j601371j226258j615498
14208C8086632m95313q44496j024870j382707q91675j193232p72792o70795p81126
14199C0029626p92569p78238j243630m86151p39243o33652o39952m93214p86466
$$ plain form
14255 297917109 282003156 267106731 253567415 240144808 227511235 215217358 203366007
14248 203366007 192882113 182502865 172892075 164242464 155725277 147890766 140390814 133444658
14240 133444658 127190526 120726999 115608012 110526623 105238056 100712158 96140277 91704697
14232 91704697 88194963 84722859 80802260 78012716 74921146 71542385 68788836 66200319
14224 66200319 63855943 61551222 59143899 56859553 54777486 53185316 51635068 49704164
14216 49704164 47617049 46033427 45115787 43908548 42529759 40928388 39702130 38086632
14208 38086632 37591319 36746823 35721953 34339246 33447571 32254339 31481547 30810752 30029626
14199 30029626 29237057 28458819 27215189 26729038 25989795 25356143 24716191 24222977 23436511
14190B3436511k20921j162491k92105m95815l87012n39782k87211o54173m98702
14181A8898299m82434j16846n36526n96608j42765r7923n17975l84017l82706
14172A5640499k94324o6830n12773j17009j63036p96666K84058m38138k09423
14163A3326358n69100k061j67907m22224r1405j23094m26622j05101j13280k62858
14153A1042706l5087K7517l79586l88630R7351k41369j54747l94472j60658j29697
14143I283328r4962P658N8068l21723n24518J23617j25417L7386j02807l27169
14133H013461J6680k62034J63735l98186j44621L43609m59336M0600j74345k96768
14123F842795J74588p6543n01390M98467m07167k48115l7147k46726M00218k69242
$$ plain form
14190 23436511 23215590 22053099 21760994 21265179 20878167 20338385 20051174 19397001 18898299
14181 18898299 18415865 18299019 17762493 17165885 17023120 16925197 16407222 16023205 15640499
14172 15640499 15346175 15279345 14766572 14649563 14486527 13689861 13973919 13535781 13326358
14163 13326358 12757258 12755197 12587290 12165066 12073661 11950567 11523945 11418844 11305564 11042706
14153 11042706 11007619 11035136 10655550 10266920 10364271 10122902 9968155 9573683 9413025 9283328
14143 9283328 9188366 9196024 9254092 8932369 8407851 8531468 8406051 8443437 8340630 8013461
14133 8013461 8030141 7768107 7931842 7533656 7389035 7732644 7273308 7313908 7139563 6842795
14123 6842795 7017383 6940840 6439450 6937917 6530750 6282635 6245488 5998762 6398980 6129738
14113F129738j17583j40993K30794j97554l84458J76495M9478m17926J83088J42586
14103E653665n46285L87406m34396l9878k4659K2328q1272O59039r42651J09890
14093D763187m0762O5333k3068k67187K1146r5966r7110O9033o7220j1812j28730
14082D186844J46495m00633L4092k65857J00146j84835N03517k0476n56378K9184
14072C572099n159P4338R3653k63249k07788J80144j64388l7516K03355n707K62317
14061C702099j41734j29038J47479K61009o88142q1315K27121R091j73842q6072
14051C046656j22837K55548p8842l3345L3923j04140l25399K21656l08199M4669
14041B629690J53091l11896J44465J96215j41968R2975j71585P765p6611L27516
$$ plain form
14113 6129738 6012155 5871162 6101956 5904402 5519944 5696439 5745917 5327991 5511079 5653665
14103 5653665 5107380 5494786 5060390 5020512 4995853 5018181 4936909 5595948 4653297 4763187
14093 4763187 4722425 4787758 4764690 4497503 4518649 4422683 4325573 4394606 4327386 4315574 4186844
14082 4186844 4333339 3932706 3966798 3700941 3801087 3616252 4119769 4099293 3542915 3572099
14072 3572099 3566940 3641278 3734931 3471682 3263894 3444038 3279650 3242134 3445489 3439782 3702099
14061 3702099 3560365 3431327 3578806 3839815 3151673 3070358 3297479 3306570 3132728 3046656
14051 3046656 2923819 3179367 3100525 3067180 3101103 2996963 2671564 2893220 2585021 2629690
14041 2629690 2782781 2470885 2615350 2811565 2669597 2762572 2590987 2598752 2522141 2849657
14031B849657l96372K03027m6302l3977L15812m30376j82174q4125K68555j65331
14021B298394J18990M1070j80150M6009k61006L29047j81678j22036j40400J02392
14011B050632k36284L11076K7385m33161M08866k73576r2853K25198l25436L31704
14001A993551k43025K09212j97869m4737J22422J63625m01132J41508j30671l5404
13991A577480M52769J77484O52349K308380O088585J8131873J847953m849964
13983B6386909r887651o223994l163328k240142o36344j009309o5814k22051m78207
13974B460069j7820j51288p3773k49685K45711K3347j73800M6906j23113K16483
13964B203037o36050N80489l03073k79396K66734K8664J82297o28936M35990J08227
$$ plain form
14031 2849657 2453285 2656312 2610010 2576033 2891845 2461469 2279295 2195170 2463725 2298394
14021 2298394 2417384 2458454 2278304 2324313 2063307 2392354 2210676 2088640 1948240 2050632
14011 2050632 1814348 2125424 2152809 1719648 2128514 1854938 1762085 1987283 1661847 1993551
14001 1993551 1750526 1959738 1761869 1717132 1839554 2003179 1602047 1743555 1612884 1577480
13991 1577480 2030249 2207733 2860082 5168462 11257047 29388920 31236873 26386909
13983 26386909 16499258 10275264 7111936 4871794 4235450 3226141 3160327 2938276 2460069
13974 2460069 2442249 2290961 2217188 1967503 2213214 2236561 2062761 2109667 1986554 2203037
13964 2203037 1566987 2147476 1844403 1565007 1831741 1860405 2042702 1413766 1849756 1957983
13954A957983n22498L30674J55009l84365J71622k93503J43280J12387q7373q8837
13944A494379J12366N491J01136k87649J74701j87797N7100Q2399k13712j12692
13934A225722j2162O15378m73725O0774J35910R6618k55212J75618q8341q3690
13924A396890l97078J31081J03672N3647L09911k18890k2188k5539j82384L3215
13914A182337j21229L0468L23479j0136p3090k46863O5949l7005L12860m77195
13904I49575K27748K20662l8511k62378m7505K61595k78458m149J14885j16925
13894A026539j1388N12255k44325J07220l88938J62239m48822j898K65500K05254
13884A183636j77619J1955J59397J82596E11516N35003n0661L40190j49007O0587
$$ plain form
13954 1957983 1435485 1766159 1921168 1536803 1708425 1414922 1558202 1670589 1583216 1494379
13944 1494379 1606745 1612236 1713372 1425723 1600424 1412627 1469727 1552126 1338414 1225722
13934 1225722 1213560 1828938 1355213 1415987 1551897 1648515 1393303 1568921 1480580 1396890
13924 1396890 999812 1130893 1234565 1288212 1598123 1379233 1357045 1331506 1149122 1182337
13914 1182337 1061108 1091576 1415055 1404919 1331829 1084966 1150915 1113910 1426770 949575
13904 949575 1177323 1397985 1359474 1097096 1049591 1311186 1032728 1028579 1143464 1026539
13894 1026539 1015151 1527406 1283081 1390301 1001363 1163602 714780 712882 978382 1183636
13884 1183636 1006017 1017972 1177369 1359965 511516 1046519 995858 1336048 1187041 1247628
13874A247628j2126j77701o434J35406q6063k80685J68796P3902o5451M410l8539
13863I63143J05206p4893j50527k13644M77681k21331P4069j30739M1026J08088
13853I78079J77711j09415j35585Q8935l78740J38482R7401m4964o8007L1003
13843G74900J29939J05699D65382R2488K78873j08528L2062L5080l1155J51412
13833I15614k34597K86929k51818J78276R8999p961l41894j31741J14517k4280
13823F02044J64093j24957n3322R6891p3848K06040o3591l43526N66045m77923
13813D97946L18522k37851K47692k17356O2511k06119L11674j65968L0436q1972
13803E59515K35221L0664M0671k33062k6885J39178j19028J33936n009j37304
$$ plain form
13874 1247628 1235502 1057801 1051367 1186773 1100710 820025 988821 1062723 997272 1001682 963143
13863 963143 1068349 993456 842929 629285 1106966 885635 959704 828965 869991 978079
13853 978079 1155790 1046375 910790 999725 620985 759467 856868 811904 743897 774900
13843 774900 904839 1010538 465382 557870 836743 728215 760277 795357 764202 915614
13833 915614 681017 967946 716128 894404 993403 985442 643548 511807 626324 602044
13823 602044 766137 641180 587858 684749 610901 816941 753350 409824 975869 497946
13813 497946 816468 578617 826309 608953 671464 465345 777019 611051 641487 559515
13803 559515 794736 825400 866071 633009 606124 745302 626274 760210 755201 617897
13793F17897r5865K76980j44738o8613J42926n330k60036l6591L33590J9313C16630
13781B88261M65074k08851J76480Q4164j40584k04644J41793P0755k77324M17600
13771H12724l77749L62891p6179j75270P1807j21863K802k14225K72358k15541
13761C41755L59699l18633K62979J04210m7624k69863J57719j51452j3778L75220
13751H00232p5751J22503k86154J14643l27370L75700B57077M30769p3732J12344
13741G26458j26744L3362L07139A12514M49098K99540A36487J71668O9096K91751
13731F69002A07371K88434J74322k13754M71912C54515L8278K18735B28308M8924
13721B77232J40678A85994K11064k5599N3485M6163M6588L5952B13287J52725
$$ plain form
13793 617897 522032 799012 654274 585661 728587 723257 463221 426630 760220 779533 316630
13781 288261 753335 544484 720964 805128 664544 459900 601693 672448 395124 812724
13771 812724 434975 797866 721687 546417 618224 496361 499163 284938 557296 341755
13761 341755 701454 382821 645800 750010 702386 432523 590242 438790 425012 800232
13751 800232 724481 846984 560830 675473 348103 723803 257077 687846 614114 726458
13741 726458 599714 633076 940215 112514 561612 861152 136487 308155 377251 669002
13731 669002 107371 395805 570127 356373 828285 354515 392793 611528 228308 277232
13721 277232 417910 185994 397058 371459 424944 471107 517695 553647 213287 366012
13711C66012M98557C11713n313M63492j29210B61796K46383j99240M7642J16260
13701D72841r7618O4129j78345K48098L6775j19526k5823L2397K17629k94086
13691C56471J3606j13979j525N0179L25179m2152Q6218k18014A24862n4097M10850
13680D81615o2659j12554l6021m1435K51058k21342L37144k86506A46286L46254
13670D92540K03R833j50453Q5418r0327A8208M89681A29288J85092m1305A01842
13658D36959J48692j23540J76222k94809Q7728J52524J30226l55165O1698K9151
13648D49686M9235L01289a44380A42339K86220J05950o9832R9913B78452o7035
13638B11417L34927k29567M17206k91145q8069J82825j49473K52998B03581r7669
$$ plain form
13711 366012 864569 311713 306400 769892 640682 261796 508179 308939 356581 472841
13701 472841 375223 439352 261007 509105 545880 426354 400531 432928 650557 356471
13691 356471 370077 256098 254573 304752 629931 587779 673997 455983 124862 70765 481615
13680 481615 418956 306402 270381 228946 480004 258662 595806 309300 146286 492540
13670 492540 492743 502576 352123 437541 347214 18208 507889 129288 314380 273075 101842
13658 436959 585651 462111 638333 343524 431252 583776 714002 358837 420535 449686
13648 449686 498921 800210 -144380 142339 428559 534509 464677 564590 278452 211417
13638 211417 546344 316777 733983 442838 354769 537594 388121 641119 203581 105912
13628A05912L18559M3581r0096o3743A37697J9797k5332N15303k60572J34190
13618E21083H7550M8798K8635K02782R5662o8166d914B12368R4062C5581O2482
13607I8063L54081P9555k51157J60549C1946K99894K43446D6749K69143n8892
13597B57000J77674J5052j64420L2806O0915J6512R4788A57024o5884L05489O4507
13586D61136B15432R4328J11217j15803J94937j37661j50164P2187A16709J80691
13576B97400r0779N4429K61286N1305j00932j15677Q2025B18254k083o2876N3629
13565B06924a63080H0029Q6971l6686L4287J45597R603C7867J82891K44265I1843
13553A18201K19163G6239h258A35447K37657J25173A17928K46820o5163m9245
$$ plain form
13628 105912 424471 468052 377956 314213 137697 157494 132162 647465 386893 521083
13618 521083 87550 136348 164983 367765 463427 395261 -4914 212368 306430 35581 98063
13607 98063 452144 531699 280542 441091 31946 331840 575286 46749 315892 257000
13597 257000 434674 449726 285306 318112 379027 395539 490327 157024 91140 396629 461136
13586 461136 215432 309760 420977 305174 500111 362450 212286 284473 116709 297400
13576 297400 206621 261050 522336 573641 472709 357032 439057 218254 216171 153295 206924
13565 206924 -163080 80029 167000 130314 164601 310198 319801 37867 220758 465023 91843
13553 118201 337364 76239 -8258 135447 373104 498277 117928 364748 299585 250340
13543B50340J87498A46675K39758f8258C98501n0750j28906K83769L4194B38253
13532A55525K54770j90614F771J55733J23129k878J3710J44085q0789j31384r478
13521B18899P0800n5531H5323M2216J78895p8628k0961L3498m46k4238m8282K9550
13509A96927K82432j73795K75855B76372o9069N3287F642K41963L95458A94757
13498A12352O4959l3505F2504J9782k354R842R1558J7941J89057j49426G756L45093
13486C52849H1756J22847J23773N099j48435k9289f4251B06221K4027K34310A76877
13474H7912J49532l6111J26837j5938I971L23460a15545f652C02142A23281K5244
13463A48525L7690n7646K01085j48561e7677A34224K3176Q1736e2945B10711f0097
$$ plain form
13543 250340 437838 146675 386433 -68258 398501 347751 218845 502614 536808 238253
13532 155525 410295 219681 6771 162504 285633 282755 296465 440550 359761 228377 218899
13521 218899 289699 234168 85323 127539 306434 227806 206845 240343 239897 215659 167377 196927
13509 196927 479359 305564 581419 276372 207303 260590 6642 248605 644063 194757
13498 112352 177311 143806 62504 82286 79932 89774 181332 199273 388330 238904 7756 352849
13486 352849 81756 204603 328376 333475 185040 155751 -64251 206221 230248 464558 176877
13474 87912 237444 201333 328170 312232 9971 333431 -115545 -6652 302142 123281 148525
13463 148525 186215 128569 329654 181093 -57677 134224 157400 239136 -52945 210711 -60097
13451D18680M3553A51114R1938a9659C06567j18952a61965B18202m7190K12309
13441C83321a87600D79659A03339L4876L84986B56243d2985F8999L3939J8539
13431A21477J55939p792j21523J40889A16076J26522Q6844M6624j13918m0431
13421B21717K73265j64250c39830C66023A20998n7906J07919K05064b222j47240
13411a49462j20583A26628b7723B28666A8511K94345Q2157j56177R7408A00465
13400A51376a31229A5159L38414A18576J28278m7737B5614K84915A9747L25611
13390C45358j1136a8540B76061r8386K29208q2097E7722J58004F7528O5938J5608
13379A49074J56008J84538c2597A26673o184f4035B36189I2775C9570P4596a23406
$$ plain form
13451 418680 462233 151114 243052 -19659 306567 187615 -161965 218202 171012 383321
13441 383321 -187600 479659 103339 138215 523201 256243 -42985 68999 102938 121477
13431 121477 277416 269624 148101 288990 116076 242598 329442 376066 262148 221717
13421 221717 494982 330732 -339830 366023 120998 63092 171011 376075 -2222 -149462
13411 -149462 -270045 126628 -27723 228666 18511 312856 395013 238836 336244 100465
13400 151376 -131229 15159 353573 118576 246854 199117 25614 310529 19747 345358
13390 345358 334222 -18540 276061 177675 406883 324786 57722 215726 67528 133466 149074
13379 149074 305082 489620 -32597 126673 120489 -64035 236189 92775 39570 114166 -123406
13367B79003Q0677r3254j21438g5146A27452O4349n453E6645Q0965Q4784E6262
13355B61516m6456Q0935J0905K8334A62718P3622b271B86835q1689L43829B08229
13343B51129J00720A12444B5296a61054A93538b7127C57684a24647B43011i9475
13332B76115G8739a4565B72379j34826C1966R422K08347I1383a61574C51472d8479
13320B64073p1344O8354G9800J17369L8994J22036j05428l9191L8061I8014J83812
13309B81826B8473K61181j7040p589q1686H1567a62641B1435e1900B9325d8378
13297H6008a05517B42126b4159A86529p5918a81131F1678Q3680l9880C0525g4811
13285a01233J166A68389c570I3004C8464a04862B42042J61126A66015J46963b47943
$$ plain form
13367 279003 359680 266426 144988 -75146 127452 191801 186348 56645 137610 222394 56262
13355 261516 215060 295995 306900 335234 162718 236340 -2271 286835 205146 548975 208229
13343 251129 351849 112444 25296 -161054 193538 -27127 357684 -124647 243011 -99475
13332 276115 78739 -14565 272379 137553 31966 41388 249735 91383 -161574 351472 -48479
13320 264073 192729 261083 79800 197169 236163 358199 252771 213580 251641 98014 281826
13309 281826 28473 289654 272614 265025 183339 81567 -162641 21435 -51900 29325 -48378
13297 86008 -105517 242126 -24159 186529 110611 -181131 61678 145358 105478 30525 -74811
13285 -101233 -100067 168389 -3570 93004 38464 -104862 242042 403168 166015 312978 -247943
13273A24948d1307A56547b94833i2751F9246J05009E9349M8026b45910A82667
13262C70284a96874K0992A01611J21206G2348e5282I3920K12391j07126a4839
13251A04797D5201L5203J61917a26059C01658j14377F8071a6629A05520b07907
13240C38629C1237f6740A87363b1666I0875L75404h5321B20664a10597A84516
13229C18249b7854j19376O9945q1147D3801a78879A1950A391Q2770d567j04004
13218a08571A58707a54482D823K73479A20969J19692p2180J4220a46050F2840
13207A25310J50032j30697d2616m4191C15186j50327L0915B1018b3701m450D15620
13195d0661F4180J39532f1872A36275C2870L08653J38379K0967A12581K88357
$$ plain form
13273 124948 -41307 156547 -294833 -92751 69246 174255 59349 107375 -245910 182667
13262 370284 -196874 -175882 101611 222817 72348 -55282 93920 306311 199185 -14839
13251 104797 45201 80404 242321 -126059 301658 187281 68071 -16629 105520 -207907
13240 338629 31237 -66740 187363 -21666 90875 466279 -85321 220664 -110597 184516
13229 318249 -27854 -147230 -77285 -158432 43801 -178879 11950 1391 84161 -4567 -108571
13218 -108571 158707 -154482 4823 278302 120969 240661 168481 182701 -146050 62840
13207 125310 275342 144645 -42616 -86807 315186 164859 195774 21018 -23701 -28151 415620
13195 -40661 64180 203712 -61872 136275 32870 341523 479902 500869 112581 400938
13185D00938i8046D18113d80699h3485E8072p436A7398N52b23556F1333L8517
13174I9850L5488f7911F166b34306h3039D1522K55732f519p6445G5839K9348J29017
13162B34204m1517H9509c37033E9290a01105l661A38023M0825p7789k9622a43914
13150B83135a58953f1376D24161D2180r711a20356j91979c47j04080A5389i6506
13138g8338H6931D2050b0720l17907F6013b72430C02279K9923b26030g7859C09409
13126A31937c8078C53592g4653q3271G2584M0130O4075p9702K86831b79534C7635
13114C9767K45946c0710j43024a1400q1806C5248J24938A1256h4798D11945E7236
13102h3215A45248a68186J8452e9709G1704A3651K24626e7303E1978J65069G0237
$$ plain form
13185 400938 -98046 418113 -480699 -83485 58072 50636 17398 17950 -223556 61333 99850
13174 99850 135338 -67911 6166 -234306 -83039 41522 297254 -6519 -82964 75839 105187 234204
13162 234204 192687 89509 -337033 59290 -101105 -104766 138023 178848 101059 71437 -143914
13150 283135 -158953 -61376 424161 42180 32469 -120356 -312335 -347 -104427 15389 -96506
13138 -78338 86931 42050 -20720 -338627 66013 -272430 302279 332202 -226030 -77859 309409
13126 131937 -38078 353592 -74653 -157924 72584 112714 176789 97087 383918 -279534 37635
13114 39767 285713 -30710 -173734 -11400 -93206 35248 160186 11256 -84798 411945 57236
13102 -83215 145248 -168186 -149734 -59709 71704 13651 238277 -57303 51978 217047 70237
13090A93164m6143G0998b30106B92902A18950a13437A02271e4001B14200f8029
13079c81109F6952k2664e2922A85394K69391b2877A64718j3919J65202b60003
13068F6441i8697I4626K24587i1752A81056d9736j33273F3399Q8635A1514J14090
13057A25604d1381A09247a846l3120A86079D441h6790F9838K4010J95697d3831
13045A39110n008J51325A25934B1415J02528P7326a75170B71581r0934G5308Q0505
13034A55813b22451C30615j45023a78077A38017i0192A35413G846O9783K06053
13024B83682H6507J34717d0301D16940A03916e4280A07739c4326B38127g9913
13013a23444A65189k3044E0096L59270A18814a71619H6827Q0502N07329k90535
$$ plain form
13090 193164 147021 70998 -230106 292902 118950 -113437 102271 -54001 214200 -68029
13079 -381109 66952 44288 -52922 185394 454785 -22877 164718 150799 316001 -260003
13068 66441 -98697 94626 319213 -91752 181056 -49736 -183009 63399 152034 11514 125604
13057 125604 -41381 109247 -1846 -34966 186079 4441 -86790 69838 93848 289545 -43831
13045 139110 134102 285427 125934 21415 123943 201269 -175170 271581 180647 75308 155813
13034 155813 -222451 330615 185592 -178077 138017 -90192 135413 7846 77629 283682
13024 283682 86507 221224 -40301 416940 103916 -54280 107739 -34326 238127 -79913
13013 -123444 165189 142145 50096 409366 118814 -171619 86827 167329 674658 384123
13003C84123j25936C5412J79259b8822E898a4763k7723A6874a6748J42l81584
12992c98190a12198B22365b67926O2874J7286B26734J04454K0970A53876c29449
12981c30278A50431C7763J41753a55521f5430G8421C7725k816Q926a18515A18306
12969d8940D7924J48690D1186j7271J74277G1645a03643k10257f3955A79444A7749
12957F3713a02803I4648k8201P0390D9617N3908L795e3647B31597n8i0262C5131
12944I5418K8981a43607b4868A84579b2787C54057A01859b30418j43227B03278
12933B32720J16719D070R923J40696O7919a21728B46203K58563A83788h1397e682
12921a42468C35889H5772a28322k6125L4487e2193H4151c96912H8769a89450A75870
$$ plain form
13003 384123 258187 35412 214671 -28822 5898 -14763 -42486 16874 -16748 -16606 -398190
12992 -398190 -112198 222365 -267926 -205052 -187766 226734 331188 352158 153876 -329449
12981 -330278 150431 37763 179516 -155521 -65430 78421 37725 34909 43835 -118515 118306
12969 -48940 47924 196614 41186 23915 198192 71645 -103643 -313900 -63955 179444 17749
12957 63713 -102803 94648 66447 136837 49617 103525 107320 -53647 231597 231539 -90262 35131
12944 95418 124399 -143607 -24868 184579 -22787 354057 101859 -230418 -373645 203278
12933 232720 349439 4070 13993 154689 222608 -121728 246203 504766 183788 -81397 -5682
12921 -142468 335889 85772 -128322 -154447 -119960 -52193 84151 -396912 88769 -189450 175870
12909C15394D6743b91514B17379a10332C14890f8242C5271h9399B31043A04106
12898e2881G359J91709i1945A47817J35377I0281b302B39793D0114b0314j35355
12887a55669D18115C2351j3278J33323J88910c53986J14565B25454B961d6531
12876H0577a37258E4253K7126c74777o2030B72578C3849d385m066q9263F5379
12864A07385D2828J7084M6280J06019o2589i6300j4324B90728o9563b33505E7071
12852C4201g5425D3223n30K4253L7045a55838E8475b442k4159D1774K16975M0930
12840B99679e8243J0025C3238J36137a06528A61558H729Q4956J06258p0450j4631
12829A14862J59656a10379k4612c7400G5337a6290k08296h1329A34623a5451k26045
$$ plain form
12909 315394 46743 -291514 217379 -110332 314890 -68242 35271 -89399 231043 104106
12898 -52881 7359 199068 -91945 147817 283194 90281 -2302 239793 40114 -20314 -155669
12887 -155669 418115 32351 19073 152396 341306 -353986 -239421 225454 2961 -46531
12876 80577 -137258 54253 81379 -374777 -436807 272578 33849 -4385 -8451 -97714 65379
12864 107385 42828 59912 106192 212211 149622 -96300 -110624 290728 221165 -233505 57071
12852 34201 -75425 43223 42693 66946 103991 -155838 58475 -2442 -26601 41774 258749 299679
12840 299679 -58243 -48218 33238 169375 -106528 161558 8729 93685 199943 129493 114862
12829 114862 274518 -110379 -134991 -37400 75337 -16290 -224586 -81329 134623 -15451 -241496
12818b41496d8182A15007g0187I9929a46260f2577A73864a41972f1688A51607
12807A53980J00438a63042A70560m6949d72291a30049I4553a64362J0749g0675
12796a01091A70351a52114B83381b6235B794a1355C6936a29527o302A42560b12801
12784f9125A89496b7749B4996a01535p6901f1254G476f2307A95126d0993k75665
12773c16658A77301B2390P4241L38616d4863A18043a7317D1026J44918k4961H0000
12761b05837h176A54381J01768o2501J15817a28958A46309A5561b14270A16833
12750h020p8120B1045R6047d0964A2749Q5893a20426c2065j50968I448R1297i9320
12737H7906g9920k12238G594K61732e882B74045j27463R5429C4288P4832e9696
$$ plain form
12818 -241496 -48182 115007 -70187 99929 -146260 -62577 173864 -141972 -61688 151607
12807 153980 254418 -163042 170560 123611 -472291 -130049 94553 -164362 -153613 -70675
12796 -101091 170351 -152114 283381 -26235 2794 -11355 36936 -129527 -135829 142560 -212801
12784 -69125 189496 -27749 24996 -101535 -178436 -61254 7476 -62307 195126 -40993 -316658
12773 -316658 177301 22390 96631 435247 -44863 118043 -17317 41026 185944 160983 80000
12761 -205837 -8176 154381 256149 193648 309465 -128958 146309 15561 -214270 116833
12750 -8020 -86140 21045 117092 -40964 12749 98642 -120426 -32065 -183033 9448 100745 -99320
12737 87906 -79920 -292158 7594 269326 -5882 274045 146582 242011 34288 109120 -59696
12725d36878b5544l27381g6088E8293F117J7223J99498b22963E7529J33338C9466
12713b68614a8448p1761C40863A50529J03950j10138o2130J8377R3884F2281K30556
12702B92837j32225N51111d7979A27016o2318k8490A5222h8065E2024L2230g6127
12690d1943n6492n0865D4842b5673B67159g5231K7091k40728B53474G813K61719
12679B69532A08826Q6849m6586a0330E1677J05594D6589g6698F4916I359b73747
12667d4220p9632m9973k4598C12891c9159A22629N1099J68991b2056j1094m9961
12656h3111D11668A62638a26357B5467d7377C53836G3391J98631A08516a15894
12645e1396G8126J94467g1158p0978A55048n2004N21P462l0619h3787A36832J54358
$$ plain form
12725 -436878 -25544 -352925 -76088 58293 6117 23340 222838 -222963 57529 190867 39466
12713 -268614 -18448 -90209 340863 150529 254479 144341 82211 100588 194472 62281 292837
12702 292837 160612 711723 -47979 127016 64698 36208 15222 -88065 52024 84254 -76127
12690 -41943 -98435 -149300 44842 -25673 267159 -75231 -48140 -288868 253474 7813 269532
12679 269532 108826 195675 149089 -10330 51677 157271 46589 -76698 64916 9359 -273747
12667 -44220 -123852 -173825 -198423 312891 -39159 122629 173728 342719 -22056 -33150 -83111
12656 -83111 411668 162638 -126357 25467 -47377 353836 73391 272022 108516 -115894
12645 -51396 78126 272593 -71158 -142136 155048 103044 103565 111027 80408 -83787 136832 291190
12633B91190B2191K13462E7911K90179J9464L81559C41190j06081a74043d8560
12622a34341B55898L38958a66115A63933i9860H9930a58973D43788a12653B63319
12611E9092J089J87514a5445j54546g2122L1850k3246B53744a06993K792D88827
12599B30146b1732D01078d26823A93885g5781A5010L58987f2655B9845L37704
12589C67549f9470D12833c532D223a60819B5057J15236J48745c3152A65567H1713
12577c9418G1611K62969E0601O5673B8504O3197d5384j66562f7457j20344j21613
12566c09414A92419H2995J23028i049A3998c2942B14732h8084A58046p3355J17945
12555B02636F3012a90973d789H4767b7079B18166C8054c6679J8145A28328f2861
$$ plain form
12633 291190 22191 235653 57911 348090 367554 749113 341190 235109 -174043 -48560
12622 -134341 255898 594856 -166115 163933 -99860 89930 -158973 443788 -112653 263319
12611 59092 60181 247695 -15445 -169991 -72122 -40272 -63518 253744 -106993 -104201 488827
12599 230146 -21732 401078 -426823 193885 -75781 15010 373997 -62655 29845 367549
12589 367549 -69470 412833 -3532 4223 -160819 25057 140293 289038 -33152 165567 81713
12577 -39418 71611 334580 50601 116274 28504 91701 -45384 -211946 -67457 -187801 -309414
12566 -309414 192419 82995 206023 -9049 13998 -32942 214732 -88084 158046 84691 202636
12555 202636 63012 -190973 -4789 84767 -27079 218166 38054 -36679 -18534 128328 -62861
12543h1138I7407p400K5933N3794E7389A601J56574J6668o1370a00778A24390
12531A57399b8135G5767J8744D0250M7922a88863g1761A4915J85641b33808A07426
12519g7708j10338j0483d0535E9593g5730A49936D4525a66164d5580I295a27195
12507F4022J39577j9266D4578j02K14224a53932A37047K55148E5459A8911c4876
12495b23664A94204j9572E0056J17218c45618R1537C18760j44907f5738j78199
12485b43937a03474m8385a700A1804E566e1959A92646D9113N159L5727b83574
12473a68216N5006B09547I8719a0999A09302K2092j0700a08302B08908b83371
12462I1000O7032R5787g7648D2338a76835D73548b08283M6163a5798j84630c3625
$$ plain form
12543 -81138 97407 90007 115940 169734 57389 1601 158175 174843 113473 -100778 124390
12531 157399 -28135 75767 94511 40250 88172 -188863 -71761 14915 200556 -233808 107426
12519 -77708 -188046 -198529 -40535 59593 -75730 149936 44525 -166164 -45580 9295 -127195
12507 64022 203599 184333 44578 44476 258700 -153932 137047 392195 55459 18911 -34876
12495 -223664 194204 174632 50056 167274 -345618 -254081 318760 173853 -65738 -243937
12485 -243937 -103474 -151859 -1700 11804 5566 -51959 192646 49113 54272 89999 -283574
12473 -168216 -113210 209547 98719 -10999 109302 131394 120694 -108302 208908 -283371
12462 91000 158032 253819 -77648 42338 -176835 473548 -208283 -162120 -15798 -200428 -33625
12450c01772A78161a27061A0726h9370l1252A39730j8186c55048a24322B15757
12439f7277L3499g03I5079e8446B13976h1024A20944a72172D9978g3467j10616
12428a84083D785c1577D16610A42038F767f2214A07837c42510A91447J49420A55908
12416A75589F478a47963p8386H1677g884j32103k9942M6778E5640b07171h5889
12404A4768J23086a95298C7607A8349a59853A16731d38296G215K61603b35954
12393I0624M6742a52733B92842a86331O5819c0565a57j11561A11195c9520j13815
12382a53335b1992j28145F0276d2966j97900e1134j30507A47363n7209A1979J19289
12371A31268M4060a15473A82840J96937b68576e4811B92708H257L8218J27740
$$ plain form
12450 -301772 178161 -127061 10726 -89370 -120622 139730 121544 -355048 -124322 215757
12439 -67277 -33778 -703 95079 -58446 213976 -81024 120944 -172172 49978 -73467 -184083
12428 -184083 4785 -31577 416610 142038 6767 -62214 107837 -342510 191447 340867 155908
12416 175589 6478 -147963 -226349 81677 -7884 -139987 -169929 -123151 55640 -207171 -85889
12404 14768 137854 -195298 37607 18349 -159853 116731 -438296 7215 268818 -235954
12393 90624 137366 -152733 292842 -186331 -120512 -30565 -157 -111718 111195 -39520 -153335
12382 -153335 -21992 -150137 60276 -42966 -240866 -51134 -181641 147363 90154 11979 131268
12371 131268 175328 -115473 182840 379777 -268576 -54811 292708 8257 46475 174215
12361A74215h2638k1769E2321c9211D12577H0077b71996E18537b84163h6169a3360
12349C6356K79331i2821E5240P4805a02784A45047a16042D0215b52851B10249
12338g0202A43576a59130A09087J09995f1623m3909A55131J3853c4292k4699l15572
12327c74563c5486B4593G534O7806a92506C887b56062J13273C23162A30841b54842
12315i7614C03368D5841a61814A27952n5032b6279j31352B89477l5028D237i292
12303f6374A16324L72085d4829j59371A269L18582a57199f381j36060B32472r9149
12292A33323a54019A29163a41026K8960B52331i8848B84952B4186b30118B43651
12281A44324a49005A22824a1596B87196a6871E9957L90626k16411G8519J32313
$$ plain form
12361 174215 -82638 -104407 52321 -39211 412577 80077 -271996 518537 -284163 -86169 -13360
12349 36356 315687 -92821 55240 130045 -102784 145047 -116042 40215 -252851 210249
12338 -70202 143576 -159130 109087 219082 -61623 -105532 155131 168984 -34292 -58991 -374563
12327 -374563 -35486 24593 7534 75340 -192506 3887 -256062 -142789 323162 130841 -254842
12315 -97614 303368 45841 -161814 127952 72920 -26279 -157631 289477 254449 4237 -9292
12303 -66374 116324 488409 -44829 -204200 1269 319851 -157199 -6381 -142441 232472 133323
12292 133323 -154019 129163 -141026 -112066 252331 -98848 284952 24186 -230118 243651
12281 144324 -149005 122824 -11596 287196 -16871 59957 450583 234172 78519 210832
12271B10832L11504A87110r002B2008M50507A21330L0429F4339j3110j0871k478
12260C7880J13096a2545j90722g0194H81J24540d3873k92654C4004J66152p2525
12249A27631Q8414Q362p7574a54471N9705A28966a04050A25199a27942B02286
12238A28765l1248A0823J68668q7295K69751p3622A18773a33096A97265f7600
12227C2857Q0856K7480O830R5172K8729g0599B14618k5580J94312j26749o2468
12216A94133e0893E7400a46248D04249B2843c35866A50633K46722H4562K67284
12206C51846A14622J58726j33591J38467n6756C8693J52401a02325C23871N5959
12196C79830C9913J06533M41979B71924j21566d516B62967Q7146I1567J14072
$$ plain form
12271 210832 522336 187110 178108 22008 472515 121330 151759 64339 51229 40358 37880
12260 37880 150976 -12545 -203267 -70194 881 125421 -43873 -336527 34004 200156 127631
12249 127631 216045 224407 146833 -154471 -94766 128966 -104050 125199 -127942 202286
12238 128765 97517 10823 179491 92196 361947 288325 118773 -133096 197265 -67600
12227 32857 113713 141193 148023 243195 271924 -70599 214618 189038 383350 256601 194133
12216 194133 -50893 57400 -146248 404249 22843 -335866 150633 397355 84562 351846
12206 351846 114622 273348 139757 278224 221468 38693 191094 -102325 323871 379830
12196 379830 39913 146446 588425 271924 150358 -4516 262967 350113 91567 205639
12186B05639c60601D24312a77543e0217A76157A2752J68674a19832b2027A63585
12175D8147L5217g2923A14050L21308p5145j48799L7949p4300K26895A23864N03444
12164F27308B89975d7244F8604q069k9789d9673F8533a48220B2841L3525O8011
12153A24377K49383a5204A3256b08266B39475n9669i5216F9791K66517A703J34648
12142A36351a05069A71894a7704j21574A94382i367j1458D6046N7712a73029D994
12130b57448A35017e9651B35616C7230J30067G0314J36854L00001o5957A10882
12119a1081l8940B93570F467L53721A46941J11102b50386i7887A21795C8574J27119
12108A65693d1407I9545a3358B4478a1194G8632d56867A6633N1159a01412b5516
$$ plain form
12186 205639 -360601 424312 -177543 -50217 176157 12752 181426 -119832 -22027 163585
12175 48147 83364 -72923 114050 435358 360213 211414 249363 175063 401958 123864 627308
12164 627308 289975 -47244 68604 60535 30746 -49673 68533 -148220 22841 56366 124377
12153 124377 373760 -15204 13256 -208266 239475 179806 -95216 69791 336308 1703 136351
12142 136351 -105069 171894 -17704 -139278 194382 -9367 -20825 46046 103758 -173029 4994
12130 -257448 135017 -59651 235616 37230 167297 70314 207168 507169 441212 110882
12119 -11081 -50021 293570 6467 360188 146941 258043 -250386 -97887 121795 38574 165693
12108 165693 -41407 99545 -13358 24478 -11194 78632 -456867 16633 67792 -101412 -25516
12096a27618C8525M7712f3481j60828a8664B19500j04729b34351c0570D3684K783
12085D6467b85271a5733o7110F8962N8578c0408J0746B15082M2854J049326n085
12074A302177j54199m09565B60041D5880K21663a49138n1441A18239b8605B12747
12063A07774K9492F7821P4812J93132a38793A17460c5718l6511j34277J02208
12053a04298H6081a46061j57486N419i3689k6016E5934O3935b62j45716G7213
12041B02475b90547A80722J84564g6291j54220c4110o0975b3870h833l006k99562
12030c11401a48365K3055c5981j53461o4746A9535b22788D98439h6290O202A46621
12018b85129e1188C40377c5183A10966B6296I487M9039J42527r6604B416P6764
$$ plain form
12096 -127618 38525 86237 -63481 -224309 -18664 219500 114771 -234351 -30570 43684 46467
12085 46467 -285271 -15733 -82843 68962 127540 -30408 -19662 215082 257936 1307262 1302177
12074 1302177 1147978 738413 260041 45880 267543 -149138 -200579 118239 -28605 212747
12063 107774 137266 67821 142633 335765 -138793 117460 -35718 -72229 -206506 -104298
12053 -104298 86081 -146061 -303547 -298128 -93689 -119705 55934 119869 -262 -145978 77213
12041 202475 -290547 180722 365286 -76291 -230511 -34110 -95085 -23870 -8833 -11839 -311401
12030 -311401 -148365 -125310 -35981 -189442 -254188 19535 -222788 498439 -86290 -80088 146621
12018 -285129 -51188 340377 -35183 110966 26296 9487 58526 201053 104449 2416 79180
12007G9180c6612B39478e1529a956C838b17945r3792C4071K13831j02877a09158
11995A77010A9784e5031n1690d9004O207m1685l9484G5437a26470A76575K47081
11984D23656A05722i1118A0268a68681p0000k5878M8132o145R9496p2671d0708
11972H7954c55015a61379j31038h2524j16110b6566j16150O511j25148A5007Q6973
11961A01980J4070k5592K985i4382H3444O526A4140b55158A2826f7175j63240
11950b30415C98565c7790B779M5960a35191B74983C7594a26007G6978A4389b45375
11938C7195K5847c1694l88662c2528j35397A18095g1469A59338k7880K0909c9094
11926a18795b6622E0224e7896B51841q1325a46010B46310p1354a23454H824K28988
$$ plain form
12007 79180 -36612 239478 -51529 -1956 3838 -217945 -311737 34071 247902 145025 -109158
11995 177010 19784 -55031 -106721 -49004 -42797 -84482 -123966 75437 -126470 176575 423656
11984 423656 105722 -91118 10268 -168681 -238681 -264559 -216427 -222572 -123076 -195747 -40708
11972 87954 -355015 -161379 -292417 -82524 -198634 -26566 -142716 -136205 -261353 15007 101980
11961 101980 116050 90458 93443 -94382 83444 89970 14140 -255158 12826 -67175 -230415
11950 -230415 398565 -37790 2779 48739 -135191 274983 37594 -126007 76978 14389 -245375
11938 37195 63042 -31694 -420356 -32528 -167925 118095 -71469 159338 131458 152367 -39094
11926 -118795 -26622 50224 -57896 251841 170516 -146010 246310 174956 -123454 8824 237812
11915B37812a81067M0585F5738b18631j9452a6784k4870B19678B8598K43236a44928
11903E0450j3151M5856a62522B0083b38685q5527I2876a6767E056c52844A22588
11891a27959H0039J04228a98042q9140g6716j88051J3962a4604k42450J04288
11881a52766G2360a2200p713j34875D3531K09966L4806e2830D7155b01094e6393
11869a095j81762C6387a24303I7209K36227E8302N4608b2118j42720b5830q9991
11858a15821B22746a45693e3857j30634A02384a81052A55373A4669h3366l1172
11848a14538J501L599A68630a83122P2056m7125a7656j48112A6699b99325f2090
11836b41190h5046c1733j15250e1266C9342g0744B39798e6191j7625E2815a49521
$$ plain form
11915 237812 -181067 -140482 65738 -218631 -238083 -16784 -41654 219678 28598 271834 -144928
11903 50450 37299 83155 -162522 20083 -238685 -324212 92876 -16767 5056 -352844 122588
11891 -127959 80039 184267 -198042 -287182 -76716 -264767 -250805 -14604 -257054 -152766
11881 -152766 72360 -12200 -19913 -154788 43531 253497 288303 -52830 47155 -201094 -56393
11869 -1095 -182857 36387 -124303 97209 333436 58302 112910 -22118 -164838 -25830 -115821
11858 -115821 222746 -145693 -53857 -184491 102384 -181052 155373 14669 -83366 -114538
11848 -114538 -113037 -109438 168630 -183122 -111066 -158191 -17656 -165768 16699 -299325 -62090
11836 -241190 -85046 -31733 -146983 -51266 39342 -70744 239798 -56191 -73816 52815 -149521
11824b06480A93127A3875d8339D55417A64608a54166C4013l609K62374a73342
11813A05183K18671b76080r1806H243Q380a44095G4536a79873C46525C8031R8798
11802A36829a08468j28316B7526c7577j13200j53460C6090D575a21838e4510A10428
11790a69054B16459I8530D1522a80046l8377B79864b11795K7561K6327L7139A8864
11778g0585C91135i1744B52342A04172a4164A61a56166A27600a49498A03376K1623
11767A24999f5949A65311c08844B19125a13418C51202b41866g9504A18074C2598
11756F0907a7890G2955h1468h657A63452c70686J18042B57647c8789m2558A8835
11744I6524c7846j11074A39438g9255A54522J39242a05959m7557g4522A45113
$$ plain form
11824 -206480 193127 13875 -48339 455417 164608 -154166 34013 30404 292778 -173342
11813 105183 323854 -276080 -367886 8243 16623 -144095 74536 -179873 346525 38031 136829
11802 136829 -108468 -236784 27526 -37577 -150777 -304237 36090 4575 -121838 -54510 110428
11790 -169054 216459 98530 41522 -180046 -218423 279864 -211795 -184234 -157907 -120768 18864
11778 -70585 391135 -91744 252342 104172 -14164 161 -156166 127600 -149498 103376 124999
11767 124999 -65949 165311 -308844 219125 -113418 351202 -241866 -79504 118074 32598
11756 60907 -17890 72955 -81468 -8657 163452 -370686 -252644 257647 -38789 -81347 18835
11744 96524 -37846 -148920 139438 -79255 154522 293764 -105959 -153516 -74522 145113
11733A75647b21693a01439n3704A60022J18606a15025c3880a0874A28465B8036
11722c0722j45003A39285a62012J5674M4158C01735d4833C62230a84639e4095
11711D136a60799P7400A68820J63766f9129F6086J17426f7329B00380A29L10595
11700C10724c1520B47815q8396k2514J02997h6443k4084l4491C4288J97634m5307
11689A86615l4517J35106d6591A50980a8388j13811E4340N2362g8426k00285B03824
11677D3376e2355p0595e3400B51653p8588J02261a85035n8163B80858F2459b9496
11665E6566a54004j3611A01027M7931a02966A63369m1631l6897j5567g8123D7707
11653B91701j05111I1817Q2755c4258A51623d3100A56180L245c0998j30902C0813
$$ plain form
11733 175647 -221693 -101439 -155143 160022 278628 -115025 -33880 -10874 128465 28036
11722 -30722 -175725 139285 -162012 -146338 -102180 301735 -44833 362230 -184639 -54095
11711 4136 -160799 -83399 168820 332586 -69129 66086 183512 -67329 200380 129 310724
11700 310724 -31520 247815 159419 136905 239902 -86443 -110527 -145018 34288 231922 186615
11689 186615 152098 287204 -46591 150980 -18388 -132199 54340 106702 -78426 -278711 203824
11677 43376 -52355 -122950 -53400 251653 173065 275326 -185035 -243198 280858 62459 -29496
11665 56566 -154004 -167615 101027 148958 -102966 163369 121738 84841 69274 -78123 47707
11653 291701 186590 91817 174572 -34258 151623 -43100 156180 159425 -30998 -161900 30813
11641C6121a56331A42178e6663j73707C9881a61248G3504a25871J299I4300C2938
11629b1095p2267A31447a39123a1063C52326A31058a7409H5873a63230q7323F6488
11617I6251b02246b5505A08302J60686c92894a18412C4403b1275A70082M2970
11607B13052P0851c2781C53863A38983c20705m1696A35967K60978E3717a51375
11596A31829a25526A20988e4210A46669k9193g5022j35448B14506O3213j30895
11586A46824l8408L95306E4057J63831a59393j95091a13350B45103a90417A0963
11575b84956D3578J25022E6944K41226F4774L09434F749g023C190J83935I178
11563f8816C73702K20922A3397c58878B82822c1611C9624Q1206A4635h4566A94755
$$ plain form
11641 36121 -156331 142178 -56663 -230370 39881 -161248 73504 -125871 -124572 94300 32938
11629 -21095 -93362 131447 -139123 -11063 352326 131058 -17409 85873 -163230 -250553 66488
11617 96251 -202246 -25505 108302 268988 -392894 -118412 34403 -21275 170082 213052
11607 213052 283903 -32781 353863 138983 -320705 -362401 135967 396945 53717 -151375
11596 131829 -125526 120988 -54210 146669 117476 -75022 -210470 214506 277719 146824
11586 146824 108416 503722 54057 217888 -159393 -354484 -113350 245103 -190417 10963
11575 -284956 43578 168600 56944 298170 64774 374208 6749 -7023 3190 187125 9178
11563 -68816 373702 594624 13397 -358878 282822 -31611 39624 120830 14635 -84566 194755
11551B00843a06171b6636M941l9856j35999H3499K5165K4012Q6539b73040A49579
11539D0813J84276a31760A84448a3426A18517K25707A38475a7338H4479f1751
11528A47642c8771B3363a06993b7183B31906J17750A25497a41202A8583B046P6587
11517G8633d3371A43172f8577C72366j84815C9474R8601Q3768o297O6918A28468
11505e4004A85404E0495J75544K26664J86511G202K94366g1742B62452c2922C17703
11493D41969B00757J13038b36922E8639J12477d470B91568i5495E35619H9918
11482b84637a4404A09568m2023M7546C9876K57003c6230I8066J85357j16683M8398
11471B15138O5766o7898m294I0095J03006A9956J38815K21500H1174K33750a59560
$$ plain form
11551 200843 -106171 -26636 -21695 -61551 -197550 83499 108664 132676 219215 -273040 149579
11539 40813 225089 -131760 184448 -13426 118517 344224 138475 -17338 84479 -61751
11528 147642 -38771 23363 -106993 -27183 231906 349656 125497 -141202 18583 2046 78633
11517 78633 -43371 143172 -68577 372366 187551 39474 138075 221843 215546 282464 128468
11505 -54004 185404 50495 226039 452703 639214 7202 301568 -71742 262452 -32922 317703
11493 441969 200757 313795 -236922 58639 171116 -4470 291568 -95495 535619 89918
11482 -284637 -14404 109568 67545 115091 39876 296879 -36230 98066 283423 166740 215138
11471 215138 280904 213006 208712 90095 193101 19956 158771 380271 81174 314924 -159560
11459b30595C42827b7153P796A43863N8902k2868F0969a82896j5015B85358C7809
11447B00370J17183O6j12833h051B06708B0464Q8757R2171q6876D826b05914a9016
11434C6464I309a13092A77465a70360C25249d9735D0839a4240m9839q2498H945
11422F4342J86599p9722D69a22842A31926a5665k05966L9010A62817g4501B00806
11410a2877k23477e4751G849e5008k98871a03354b5933j03947B00748J60430g9308
11398H2088B9263K41664O6006g9313a0500G8909a06481A21909a40704j1516c2584
11386i0121A30862m8092j5380J52162c86139A6989K2451I420O1841J55593i1683
11374A5457a83167A94637J01350D7390b81772a27108B64980D9088J80967d9388
$$ plain form
11459 -230595 342827 -27153 -19357 143863 202765 179897 60969 -182896 -197911 285358 37809
11447 200370 317553 317619 204786 -8051 206708 20464 109221 201392 114516 4826 -205914 -19016
11434 36464 9309 -113092 177465 -170360 325249 -49735 40839 -14240 -64079 -146577 8945
11422 64342 250941 171219 469 -122842 131926 -15665 -221631 -182621 162817 -74501 200806
11410 -12877 -236354 -54751 7849 -55008 -353879 -103354 -25933 -129880 200748 361178 -79308
11398 82088 29263 270927 336933 -79313 -10500 78909 -106481 121909 -140704 -152220 -32584
11386 -90121 130862 82770 67390 219552 -386139 16989 39440 9420 71261 226854 -91683
11374 15457 -183167 194637 295987 47390 -281772 -127108 264980 49088 230055 -49388
11363G1323M7829K4395K16123m3060b08837d6269j86918C74565A08664a09892
11352D3665Q652J02980J44647a40926f0862L0021F9984a07702l5362l4574G4793
11340i4915n7652A20342J82434j03544b54131L6452i2921a7378A64376g2046k37960
11329c10006a13357D8124b95105k7070J10992a01418a30j57351E3226b88D7100
11317e21305a52599B73025a23267d3367h04m15441b3121o3490B45806a4231F5382
11305b8379j04471k45997h1856D92011F6568a59922p5035B05340b0750q3989I6695
11293i8388B08509C0991P9739c1254A24391c088A27442i1186k42065J40976D9328
11281D9491a09298I0274e3945j97448a2094l9732p786j4485k63699O8784J12348
$$ plain form
11363 71323 119152 143547 359670 316610 -208837 -46269 -233187 374565 108664 -109892
11352 43665 52317 155297 299944 -140926 -60862 -30841 69984 -107702 -143064 -177638 74793
11340 -94915 -152567 120342 302776 199232 -254131 -217679 -92921 -17378 164376 -72046 -310006
11329 -310006 -113357 48124 -295105 -322175 -211183 -101418 -130 -157481 53226 -288 47100
11317 -521305 -152599 273025 -123267 -43367 -804 -416245 -23121 -86611 245806 -14231 65382
11305 -28379 -132850 -378847 -81856 492011 66568 -159922 -234957 205340 -20750 -104739 96695
11293 -98388 208509 30991 110730 -31254 124391 -3088 127442 -91186 -333251 -192275 49328
11281 49491 -109298 90274 -53945 -251393 -12094 -51826 -59612 -74097 -337796 -269012 -156664
11270a56664M3889B04516a55437B620J92881i8691A8491d56648e2177q5313B0450
11258G2577i7781F819M1428K6821a78361M7889B7715J31777k0887j7454a49789
11246A30769d7629r7407j53771A7552a22849I4420a1069r8414q9630a9139j34225
11235a53364A64786a74086B4432b38044c3835A0612K77226c55983e2078j15050
11225a67128A1547K6589a72187k02676P0293C597a85007h6387r8307A47269c34596
11213f325A05003H102N7254Q9777n8991b81311B85049a70252B16523E6347h7197
11201i5119M7203n9966b5021I6683b00398Q6321a0391A3559d76655A77872a90477
11189D48278A73912F0767a83301A70925n7285a06980B70364a76029r2789b6631
$$ plain form
11270 -156664 -112775 204516 -155437 2620 195501 -98691 18491 -456648 -52177 -137490 20450
11258 72577 -97781 6819 48247 75068 -178361 -130472 27715 159492 138605 121151 -149789
11246 130769 -47629 -145036 -298807 17552 -122849 94420 -11069 -109483 -199113 -19139 -153364
11235 -153364 164786 -174086 24432 -238044 -33835 10612 287838 -355983 -52078 -167128
11225 -167128 11547 38136 -172187 -374863 -304570 3597 -185007 -86387 -184694 147269 -334596
11213 -6325 105003 8102 65356 155133 96142 -281311 285049 -170252 216523 56347 -87197
11201 -95119 -47916 -107882 -25021 96683 -200398 -114077 -10391 13559 -476655 177872 -190477
11189 448278 173912 60767 -183301 170925 113640 -106980 270364 -176029 -268818 -26631
11178a58868k80895A0196D731f3662D1238M4473a36167j37760J07575P8836p3889
11167a61405k2220F1259a37462b2759C72016a26569B43492H011J49407a03857
11156i4783B09725e5837J2417A88489g3231j7916b0317j32769q5244J08328A84008
11144a0900p1981j41398B0783Q5752J34099b04719h4049L4096j04426A68715J5087
11133A83802J52914h9335K9999A84134c31143A29706D102J62571a28489B09703
11122A67413N7171a5343j200B7986J64639q8973J4893b06800G5578M1367M28j8654
11110I8719c0147N820B28976i087A00508J6384c4093A47905K46104F0530J43902
11099B04432O5359J3155J44627J24532B38225J71687A7932P2468K92552A52597
$$ plain form
11178 -158868 -439763 10196 4731 -63662 41238 85711 -136167 -273927 -166352 -87516 -161405
11167 -161405 -183625 61259 -137462 -22759 372016 -126569 243492 8011 157418 -103857
11156 -94783 209725 -55837 -43420 188489 -73231 -91147 -20317 -153086 -238330 -130002 184008
11144 -10900 -82881 -224279 20783 106535 240634 -204719 -84049 -49953 -154379 168715 183802
11133 183802 336716 -89335 -59336 184134 -331143 129706 4102 166673 -128489 209703
11122 167413 224584 -15343 -16543 27986 192625 103652 118545 -206800 75578 116945 117373 98719
11110 98719 -30147 -24327 228976 -9087 100508 116892 -34093 147905 394009 60530 204432
11099 204432 269791 282946 427573 552105 238225 409912 17932 90400 382952 152597
11088g1365A98639A7857e9924B37176P9352L1580B4531J30415O4004K39800A50736
11076C66460F4306J21387L01376j01622j77338a10712A97681H7110J74825p2941
11066A88994L36354j800M2270J44947B39629J11197k2744K6408J6662J32154J48615
11055F51921n0951J39094k46573J4636M1517L76714m28489K33295j04380J9035
11045F45819R5438o6365J60043j78963B77807M76978k33797J94677M023K2455
11035G42143J68324j68801j30777j4372M16052C37242P60480n08761p271P0589
11025F52279j0936K19668C32518K89731k9046J27954C36481K12825l7224k04217
11015C07865K39077O9824l5016Q9294N4278m1621k88403M68214l91372L78881
$$ plain form
11088 -71365 198639 17857 -59924 237176 316528 348108 24531 154946 218950 458750 150736
11076 366460 64306 185693 487069 385447 208109 -110712 197681 87110 261935 188994
11066 188994 525348 523548 565818 710765 239629 350826 328082 354490 371152 503306 651921
11055 651921 600970 740064 493491 508127 549644 926358 497869 731164 626784 645819
11045 645819 741257 674892 834935 655972 277807 754785 520988 715665 719688 742143
11035 742143 910467 741666 610889 596517 1012569 337242 1097722 588961 581690 652279
11025 652279 641343 861011 332518 622249 593203 721157 336481 549306 512082 307865
11015 307865 546942 616766 581750 671044 725322 683701 395298 863512 472140 851021
11005H51021j02956p1978K5105k025k49229L28665l07198m5974q969M49913J8499
10994H84874k23388m6656k49078L99944l01010L84360J83883k14153j83845L66559
10984A001490l28142L80297J38904K79982l97677k8644M41757o2216K57014j37412
10974A545353N35580J68964M9066M78883l9823k55786l5998m5988l33222Q7564
10964B154593o15801L46634m80113M64699Q7651q3113J38101m0885R1530J65401
10954B228697k61152l25803j14314k05118R5380E73788j00565r7907M4465j80688
10944B39093n7675L37167j70061L06694j98691k15990Q654j24158J34157p0460
10934A88730J91608A38678D0004M700h3490d1531D4605Q9063a20158A47673E0606
$$ plain form
11005 851021 748065 676087 701192 699167 449938 778603 471405 425431 416462 866375 884874
10994 884874 661486 614830 365752 765696 464686 849046 1032929 818776 634931 1001490
10984 1001490 673348 1053645 1192549 1472531 1074854 1046210 1487967 1425751 1682765 1545353
10974 1545353 2080933 2249897 2298963 2777846 2738023 2482237 2446239 2400251 2067029 2154593
10964 2154593 1538792 1885426 1405313 1870012 1957663 1874550 2012651 1971766 2063296 2228697
10954 2228697 1967545 1641742 1527428 1322310 1417690 573788 473223 375316 419781 239093
10944 239093 181418 518585 348524 655218 456527 240537 249191 125033 259190 188730
10934 188730 380338 138678 40004 44704 -83490 -41531 44605 133668 -120158 147673 50606
10922a08813A09025L8183J84344a75769o397A06643b07806B75065d09090D6703
10911a42984D5688O2931l8819K17813j29333M580a08992A6649g8521A41973D1702
10899A6600J42038a5843B6150J73997l2137d1052A02364i4093B71211f8478A68292
10887b39527E5980N5872a89714f7841j6611j23551f1445n3008M7001a573B89847
10875b06403B07759B7090i7234C4870c43561B9809b9248A93173h2217A76426b91182
10863C7154a51620D2134J7938d5390b0391l6913F5656R1125a80074e0423p2674
10852a23097A11680O64K22037F927d2078D5124J87321D9248J61804R4930b79162
10840A74633b0288A84168a52475f3436A85182a61258f1066a1538k30049i8832
$$ plain form
10922 -108813 109025 147208 331552 -175769 -182166 106643 -207806 275065 -409090 46703
10911 -142984 45688 108619 69800 287613 158280 162860 -108992 16649 -78521 141973 41702
10899 16600 158638 -15843 26150 200147 168010 -41052 102364 -94093 271211 -68478 168292
10887 -239527 55980 111852 -189714 -67841 -84452 -208003 -61445 -114453 -67452 -1573 289847
10875 -206403 207759 27090 -97234 34870 -343561 29809 -29248 193173 -82217 176426 -291182
10863 37154 -151620 42134 60072 -45390 -20391 -57304 65656 156781 -180074 -50423 -123097
10852 -123097 111680 112344 334381 6927 -42078 45124 232445 49248 211052 305982 -279162
10840 174633 -20288 184168 -152475 -63436 185182 -161258 -61066 -11538 -241587 -98832
10829G961J36081D5975b91945j2289C3499c3510k66918C89237c1760k0220A85724
10817D9792K10130b20235h6767A39567f8937k88483E62763B44059F6717K51832
10807C18549p4909d17385C1224N2303d0426n6759I1237A175c5636j43823B12854
10795a49515j81889a09393H5573J69845J06055f7374A9394a94154e9314A47007
10784a74001E1006d2716J403A98501e1646A8665L2346a05032j2205j949o4917
10773a84103f2007k08117J31147C34335G1131J18701a11742L9020l59137E824
10762I7905J68029h0390b9615j01330j14626C22711I903b35744A38085c405j41212
10751a44617M9399l39893R3586a57608B47076a69318e3140n0261B3975R4882a15988
$$ plain form
10829 7961 144042 45975 -291945 -304234 33499 -33510 -300428 389237 -31760 -51980 185724
10817 49792 259922 -220235 -86767 139567 -68937 -357420 562763 244059 66717 318549
10807 318549 243640 -417385 31224 83527 -40426 -97185 91237 1175 -35636 -179459 212854
10795 -149515 -331404 -109393 85573 255418 361473 -67374 19394 -194154 -59314 147007
10784 -174001 51006 -42716 -41313 198501 -51646 18665 51011 -105032 -117237 -119186 -184103
10773 -184103 -62007 -270124 -138977 334335 71131 189832 -111742 -72722 -431859 5824
10762 97905 265934 -80390 -29615 -130945 -245571 322711 9903 -235744 138085 -3405 -144617
10751 -144617 -95218 -435111 -341525 -157608 247076 -169318 -53140 -103401 23975 118857 -115988
10739i4084h553j28976q854G3708a35037A15624k1204b4490k04526A65714b3291
10727c10034E7180L2467i7418G4023b68367E7987b07558i6386A52158d13802B4723
10715E6355a39147k38106B54040b63630A00907c24242E638a90329k299J329a1800
10703f5752A49151a96926A4012K8751K55408G8810b92296A87465c43019a48797
10692a98445H0611e3853j77518F976a69518A81049J1941H4745e83112a44038A54104
10680a86871f1997B05164G5666b18789A06827J74868b28643A97573m3837a33285
10669B5757c01994b9141j22093B13742c9400B11893b84352A49968D758b72907
10658I2360b57800a03428K2949p2572A40800j4547a63223q0431g8313c2866j59270
$$ plain form
10739 -94084 -8553 -137529 -146383 73708 -135037 115624 94420 -24490 -229016 165714 -23291
10727 -310034 57180 89647 -97418 74023 -268367 57987 -207558 -96386 152158 -413802 24723
10715 56355 -139147 -377253 254040 -263630 100907 -324242 5638 -190329 -192628 -191299 -11800
10703 -65752 149151 -196926 14012 42763 298171 78810 -292296 187465 -343019 -148797
10692 -198445 80611 -53853 -231371 6976 -169518 181049 192990 84745 -583112 -144038 154104
10680 -186871 -61997 205164 75666 -218789 106827 281695 -228643 197573 153736 -133285
10669 25757 -301994 -29141 -151234 213742 -39400 211893 -284352 149968 4758 -272907
10658 92360 -257800 -103428 -80479 -153051 140800 126253 -163223 -243654 -78313 -32866 -192136
10647a92136q2868A33356b43170c370q9075P918I7767b18778N2803d0496a2901
10635E54409B16307p510b84341A80695O5368f9521q1082l3193j09707A71670J24639
10624B96309j47286c41612J30391I9052g7794A46799b18787m811k6163c7427n3254
10613i0681A37657a31413A70654f7343A35882b42588J00070b1137B74928b25574
10602A86975E000Q2511R1998f2359m8198K2251p1276j64851a32641C05803A2424
10590A14012a7410j47412a1341B586K3582N0291a22963A22244J82816M683F4305
10578a19768j96363D8663J04810c59757a11303K0176A18516A2053c7017k1869
10568e8886D5328J0096K7287C2362a57941d5322E1507a78555G5340e6189l7813
$$ plain form
10647 -192136 -275004 133356 -243170 -3370 -92445 -84527 97767 -218778 -165975 -40496 -12901
10635 554409 216307 208797 -284341 180695 246063 -69521 -150603 -183796 -293503 171670 296309
10624 296309 149023 -341612 -211221 99052 -77794 146799 -218787 -223598 -249761 -37427 -90681
10613 -90681 137657 -131413 170654 -67343 135882 -242588 -142518 -21137 274928 -225574
10602 186975 5000 87511 179509 -62359 -110557 -88306 -159582 -324433 -132641 305803 12424
10590 114012 -17410 -164822 -11341 2586 26168 76459 -122963 122244 305060 309743 64305
10578 -119768 -316131 48663 153473 -359757 -111303 -91127 118516 12053 -37017 -58886
10568 -58886 45328 55424 82711 32362 -157941 -45322 51507 -178555 75340 -56189 -94002
10557i4002G2614C1058d9708k10107N3275J8976A59688a2697A48825a40700a9905
10545e1975H4504F246a42140O5183L7398A72844a96607j38240a34013k43576D7000
10533d6023l14754a58103b0254e343F6120a49126G7110A1410i4821G1266a97618
10521a3972k28213R8311A48712a70975g7666k9370F7010J4786d05211e6630D1606
10509c03752J17594d1731A03832a06897j14941C9130A3352a18446G8462a47320
10498E5992O558J79431A5850a90525H38Q0195l9228L7562A1519b4068A07015a00660
10485a15527A84525b51753B55795R3891r3851J06874j20534K94983k03654q6456
10475B47048j2077c1366F3893a420A06898a10891F2148R6385D9259K56766a23741
$$ plain form
10557 -94002 72614 31058 -49708 -259815 -206540 -187564 159688 -12697 148825 -140700 -19905
10545 -51975 84504 6246 -142140 -76957 -39559 172844 -196607 -334847 -134013 -377589 47000
10533 -46023 -360777 -158103 -20254 -5343 66120 -149126 77110 11410 -94821 71266 -197618
10521 -13972 -242185 -143874 148712 -170975 -77666 -107036 67010 81796 -405211 -56630 41606
10509 -303752 -186158 -41731 103832 -106897 -221838 39130 13352 -118446 78462 -147320
10498 55992 62550 241981 15850 -190525 838 81033 41805 79367 11519 -24068 107015 -100660
10485 -115527 184525 -251753 255795 349686 255835 362709 242175 537158 333504 247048
10475 247048 234971 -31366 63893 -1420 106898 -110891 62148 158533 49259 306025 -123741
10463f4048C7962j130a87025b4797j43477B09218G5932B7448J4360J61566c28366
10451A67880a03519C48877h6322b3584A09634C4918J76317a29914j06199A43294
10440c00289h1956C02772b2433l58799F053b41847A51677g1350A01637a10818
10429C301c03416a08439b2427d505A08360H376a09722M5753B77194A29491b4656
10417a3503m6174E5975K15946d53812a08774M1952j51797A47428b48458A34357
10406A14551L08111a36341d8691C32464g943D7347K82220b23171c9318A38680
10395C29420C2773K77018I8978M6865m203f794F4872J07532l1007K66735d00184
10383B31388C8024J16915J61747j17538a28703e6707D8609L74282E4321O2116
$$ plain form
10463 -64048 37962 36832 -187025 -24797 -168274 209218 75932 27448 41808 203374 -328366
10451 167880 -103519 348877 -86322 -23584 109634 34918 211235 -129914 -236113 143294
10440 -300289 -81956 302772 -22433 -381232 6053 -241847 151677 -71350 101637 -110818
10429 3301 -303416 -108439 -22427 -4505 108360 8376 -109722 -63969 277194 129491 -24656
10417 -13503 -59677 55975 271921 -453812 -108774 -66822 -218619 147428 -248458 134357
10406 114551 422662 -136341 -48691 332464 -7943 47347 329567 -223171 -39318 138680
10395 329420 32773 309791 98978 145843 141640 -6794 64872 172404 141397 408132 -400184
10383 231388 38024 154939 316686 199148 -128703 -56707 48609 422891 54321 116437
10373A16437L7219M87565B93130a17729C78911k6954A25818M01561k60767J60349
10363D26961j35490q2758K07625j74397J2397K5260f2667C87564A60067K4971
10353A85038K39484p9835q6232K99574j67316o891K53261B27570J78764A27592
10342E05560A75339J33634m7608r4741P187C8864I715J50697P5760m8253D0043
10330A48636F7536R454F39O6902K65349G3442J69736l7638N8811c0910I7594a03856
10317a3645C11829l6470q4560b7755l81925a51331n7510A57868f0553G6938b61380
10305B55383F5712b9208A8433J6315b71635d2605j05124J1118c4139F1962a60257
10293A5759a02870B3375Q4370g3481A87063I2757K22902d7066j36493J8932B0718
$$ plain form
10373 116437 153656 641221 293130 -117729 378911 351957 125818 527379 266612 426961
10363 426961 291471 208713 416338 241941 254338 279598 -62667 387564 160067 185038
10353 185038 424522 344687 258455 558029 390713 383822 637083 227570 406334 127592
10342 505560 175339 308973 261365 166624 173811 38864 9715 160412 236172 187919 40043
10330 148636 67536 76990 639 67541 332890 73442 243178 205540 264351 -30910 97594 -103856
10317 -13645 311829 275359 190799 -27755 -409680 -151331 -208841 157868 -60553 76938 -261380
10305 255383 65712 -29208 18433 34748 -271635 -42605 -147729 -136611 -34139 61962 -160257
10293 15759 -102870 23375 107745 -73481 187063 92757 315659 -47066 -183559 -164627 20718
10281A45232C7842d27736e9739B17256n8844n4736J23335a19950I7610b58466
10270G3936L3579d5233A9022g0247A46333a55933D3959a10038N0881A75919J30574
10259C06493M8118k7981M7125J03877i164A98649b286j08378o4534A82334a93299
10247c66203J16183A21561F0622g2787J1746A17054q576D4398J84371c07201k413
10236c09614a04840p6124A7450J97702a3541r6007j3139A39772d8520A62991c42576
10224a25827e5110g623l2928A53357E4092K17944b07543a2119p285G4961a87019
10212a46912O7711K1540p26A73456a73994C1842a87943B26830E1250c05705a42840
10200b45848k9588A874N1338K24341c3022k19301e5301k03667l7894F2291b7262
$$ plain form
10281 145232 37842 -427736 -59739 217256 158412 103676 227011 -119950 97610 -258466
10270 73936 107515 -45233 19022 -70247 146333 -155933 43959 -110038 -59157 175919 306493
10259 306493 354611 326630 373755 477632 -9164 198649 -2286 -110664 -175198 182334 -193299
10247 -366203 -250020 121561 60622 -72787 -61041 117054 108478 44398 228769 -307201 -309614
10236 -309614 -104840 -180964 17450 215152 -13541 -109548 -122687 139772 -48520 162991 -342576
10224 -125827 -55110 -7623 -40551 153357 54092 272036 -207543 -12119 -19404 74961 -187019
10212 -146912 -79201 -57661 -58387 173456 -173994 31842 -187943 226830 51250 -305705 -142840
10200 -245848 -275436 1874 53212 277553 -33022 -252323 -55301 -258968 -296862 62291 -27262
10188D0778h9331j64574n6482d9963r7884c0488P118E8292K00079A1345c12878
10176B21391m7393a78657L2229B6329K3895c90465A34517f3222a6067j22502L7986
10165a00583d7211D1219a40140R789B51444p2191m7037J6808c1881j0643n3278
10154i5802j01805M1959H498J62487a54507k82583B0081c0743j11655A10578d6207
10142e5468I0274c44096a6623A45341E7803b53500P5522h5151d2490A29442a04420
10130F8879c42750I0034d2302A92606E5219a43863H6754c11306J24692k0263B68947
10118b25303j58194a66613B53273A15861L22616b17305A34402c84444J13032b0882
10107a16705B14339B4547O2196a10792D3552b50133Q1337G1098J8528O9239a30727
$$ plain form
10188 40778 -89331 -253905 -310387 -49963 -147847 -30488 -23370 58292 258371 11345 -312878
10176 221391 173998 -178657 -146428 26329 50224 -390465 134517 -63222 -16067 -138569 -100583
10165 -100583 -47211 41219 -140140 -130351 251444 179253 132216 149024 -31881 -42524 -95802
10154 -95802 -197607 -155648 8498 170985 -154507 -437090 20081 -30743 -142398 110578 -46207
10142 -55468 90274 -344096 -16623 145341 57803 -253500 -177978 -85151 -42490 129442 -104420
10130 68879 -342750 90034 -42302 192606 55219 -143863 86754 -311306 -186614 -206877 268947
10118 -225303 -383497 -166613 253273 115861 438477 -217305 134402 -384444 -271412 -20882
10107 -116705 214339 24547 86743 -110792 43552 -250133 -168796 71098 89626 158865 -130727
10095a58610L0975A1053e7135q3462C9491a2033B5271i5201M4232k10185J04310
10084a56844B95913b4082B74901b49024b0978k37524B48152b8287k17118A85439
10073A98814G3306b44530A64203e2450B6010O6530a46656B9511b5329Q462I5831
10061a94894J0631G1480b28627a04011M9776k09517A6749i1947j65940J7927G2299
10049a60298D18178e19249e6074j15294C8907b40970b5166j88797j451C26196
10038a80623o9365E6450O6949a15412A53048C775c08143G6048e9914A0917J27122
10027A38039e2553A66888b93730J34174A07215b44802E2683g5811G0625o356a35665
10015c44930i4093A94985G4808b50010j7325P4291m4480C070i6103d95B7283d0515
$$ plain form
10095 -158610 -127635 11053 -57135 -140597 39491 -12033 25271 -95201 -50969 -261154 -156844
10084 -156844 295913 -24082 274901 -249024 -20978 -258502 248152 -28287 -245405 185439
10073 198814 73306 -244530 164203 -52450 26010 92540 -146656 29511 -25329 -16867 95831
10061 -194894 -184263 71480 -228627 -104011 -54235 -263752 16749 -91947 -257887 -239960 72299
10049 -160298 418178 -519249 -56074 -171368 38907 -240970 -25166 -213963 -215414 326196
10038 -180623 -249988 56450 123399 -115412 153048 3775 -308143 76048 -59914 10917 138039
10027 138039 -52553 166888 -293730 -159556 107215 -244802 52683 -75811 70625 64269 -135665
10015 -344930 -94093 194985 74808 -250010 -267335 -193044 -237524 3070 -96103 -495 27283 -40515
10002C59392b96563D8561d15182D5899e0129J3402A95496b1225j54281l32021
9992e07527A81071b23031j77858g9193K9301j69888Q7807q0143A3319b18831K1569
9981a97262R1677H3896A9205d59495g8613j11469l2217b2060A43818f5892B4896
9969c95780J95316B876a58100j06260A67587a89015d788k22124M2820L1364H2051
9957g9127r4084g8934J2125L2006k85569J59576L3845j1263i104j61044B03398
9945C4036h7672j05579b1499B7152M6225j220b5861r8708j83897J52882A65918
9933h1837D1288a97233a882B5849b82548A38680b57764B04489E3551b6431H1287
9921a84050B06469a32696H96e7402k12952P5130i3635n9269O2895q9319E5114
$$ plain form
10002 359392 -296563 48561 -415182 45899 -50129 -36727 195496 -21225 -175506 -507527
9992 -507527 181071 -223031 -400889 -79193 -49892 -219780 -131973 -212116 13319 -218831 -197262
9981 -197262 -105585 83896 19205 -459495 -78613 -190082 -222299 -22060 143818 -65892 24896
9969 -395780 -200464 2876 -158100 -264360 167587 -189015 -4788 -226912 -184092 -152728 82051
9957 -79127 -173211 -78934 -66809 -34803 -320372 -160796 -126951 -138214 -9104 -170148 203398
9945 34036 -87672 -193251 -21499 27152 73377 72157 -25861 -124569 -308466 -155584 165918
9933 -81837 41288 -197233 -1882 25849 -282548 138680 -257764 204489 53551 -26431 81287
9921 -184050 206469 -132696 896 -57402 -270354 -195224 -93635 -152904 -90009 -179328 55114
9909g2543A1536g6152m8211b7076n6156I9L9205J45886g4859J796H3443F491b95813
9895c0593q3157A0750K7896c16658J41087B9838K36025i806A82997C5359b35080
9883a35529A51127c90781J50654A06080a10030K3103E6285a55954m359I5626R728
9872A05354f927l8892k44385g70H4965a47040a7962I4076a22078k1574C70775
9860a12127r2258A02637a07299A58916J79779a5556q2224A03392D9981E543a02608
9848a12589n2748o6807I4032c43718e8692H7400Q951c13754G6825J15111b05619
9836i8664c1040j22664n1177f4793o8356B3823i4478a4079C02955B3848K25314
9825B49162a48457A80805c793j3012A1204a47702j32935A50347b06157G3274d1754
$$ plain form
9909 -72543 11536 -76152 -124363 -27076 -83232 99 39304 185190 -74859 -73063 83443 6491 -295813
9895 -30593 -113750 10750 38646 -316658 -175571 29838 265863 -9806 182997 35359 -235080
9883 -135529 151127 -390781 -240127 106080 -110030 -86927 56285 -155954 -160313 95626 105354
9872 105354 -6927 -45819 -290204 -770 84965 -147040 -17962 94076 -122078 -143652 370775
9860 -112127 -204385 102637 -107299 158916 338695 -15556 -97780 103392 49981 5543 -102608
9848 -112589 -165337 -232144 94032 -343718 -58692 87400 96351 -313754 76825 191936 -205619
9836 -98664 -31040 -153704 -204881 -64793 -133149 23823 -94478 -14079 302955 23848 249162
9825 249162 -148457 180805 -3793 -16805 11204 -147702 -280637 150347 -206157 73274 -41754
9813c00601d3783B8436K0208c53034B12024J071b3959B02652a84292N2660c8628
9801c81759j13481c1008n8712A61996a554I2716J20910a34328m0988j01975i1954
9789F503J9017J91507m5315b03535C31201f7788j98483B38196a66339d8049A99495
9777a53B0760P5049J95015b72061A95744E6427Q7519a04742n3284d8689l3359
9766h2048J8176n9013n0692a2338A2106a27616A41411a32446A01681c46521a543
9754h711C0486O8031a0094r3370A40599g4254j90877A34821N5214C3296b2808
9742A3158J50732g7179l09934h8582K1274K7640n1368J3803o5221C27812f888
9730a08161A37361C6017K22114d89929A15897a36515m4223n0624j69396G4609
$$ plain form
9813 -300601 -43783 28436 48644 -353034 212024 213095 -23959 202652 -184292 -131632 -38628
9801 -381759 -495240 -31008 -89720 161996 -1554 92716 213626 -134328 -175316 -277291 -91954
9789 6503 25520 217027 171712 -203535 331201 -67788 -266271 238196 -166339 -48049 199495
9777 -153 20760 95809 290824 -272061 195744 56427 143946 -104742 -158026 -48689 -82048
9766 -82048 -63872 -122885 -173577 -12338 12106 -127616 141411 -132446 101681 -346521 -1543
9754 -8711 30486 98517 -10094 -103464 140599 -74254 -265131 134821 190035 33296 -22808
9742 13158 163890 -77179 -387113 -88582 -67308 -39668 -91036 -77233 -142454 327812 -6888
9730 -108161 137361 36017 258131 -489929 115897 -136515 -180738 -231362 -400758 74609
9719D1057h1140a5581k22912c6274k05734a00782d7426k6180n7087B6917J01935
9708A28852a17640p6556C1808e1725r1484H9074Q6455H2012a00147q5284A9869
9696a25433I7411D8393B770a27019b7975K364k14066B95507a38760r9264G4564
9684A75974B4759a96278m42569a75983c9462l05102P7772H4613b33769A72633
9673e4531j50608m24196a45266r6171m0639c5621o5601M4846A157f9125j628H7898
9660E7235a04555A67991p2868Q3408a33911m4055B0197J15467j132b3862A2689
9648F106b96710p7222d9305r8409N311j02074F4918b31943L697g3289k1143k17539
9636c11971a01859j2553j10727k2382C66199a42836K5347J2588D0519b01679Q2601
$$ plain form
9719 41057 -81140 -15581 -238493 -36274 -242008 -100782 -47426 -73606 -130693 26917 128852
9708 128852 -117640 -194196 31808 -51725 -143209 89074 175529 82012 -100147 -185431 19869
9696 -125433 97411 48393 2770 -127019 -27975 -25611 -239677 295507 -138760 -238024 74564
9684 175974 24759 -196278 -638847 -175983 -39462 -344564 -266792 84613 -233769 172633
9673 -54531 -205139 -629335 -145266 -241437 -282076 -35621 -101222 -56376 1157 -69125 -70753 87898
9660 57235 -104555 167991 95123 178531 -133911 -177966 20197 135664 134532 -23862 12689
9648 6106 -296710 -373932 -49305 -147714 -142403 -244477 64918 -231943 -228246 -73289 -94432 -311971
9636 -311971 -101859 -114412 -225139 -247521 366199 -142836 -117489 -104901 40519 -201679 -119078
9625a19078C5747d2311E0047b55173J26206M4046J5878Q764A18248K459B4436
9613B89382E8025b47568G5694Q8923C260K60971p8038B2536P0778O3413c78319
9601d04051A33801a78777C06581e5692a62k39336C6319b69340i167A48064J1245
9590A59309a45119j1794k76177R2029J44287k35649B58167r2675M4584L03862
9580E13938a03126J4186o1380G904a70164C60720i5886L5056B41084i7602j06890
9569b04492Q4060m8867A5069c29946b6044L327A49155n7707b42515A07191g7798
9557h702r6277k9003C0454b71309a068o1825B64233a11319c0309j5479B7327b55926
9544E6991f9828A13976b89495F4164J66913b7325B32581G2250D90e4261l93043
$$ plain form
9625 -119078 35747 -42311 50047 -255173 -128967 -84921 -69043 -60279 118248 120707 24436
9613 289382 58025 -247568 75694 164617 3260 264231 186193 22536 93314 156727 -378319
9601 -404051 133801 -178777 306581 -55692 -162 -239498 36319 -269340 -9167 148064 159309
9590 159309 -145119 -156913 -433090 -341061 -196774 -432423 258167 165492 210076 513938
9580 513938 -103126 -88940 -150320 7904 -170164 360720 -95886 -60830 241084 -97602 -204492
9569 -204492 -120432 -169299 15069 -329946 -26044 -22717 149155 91448 -242515 107191 -77798
9557 -8702 -104979 -133982 30454 -271309 -1068 -62893 264233 -111319 -30309 -45788 27327 -255926
9544 56991 -69828 113976 -289495 64164 231077 -27325 232581 72250 490 -54261 -447304
9533d47304J86824c6301A19115m1821C7198P1233O5776g0301A25200a51022F8152
9521d01306a12200k35173i4280P516E6704a57993f5500B0311b50666N3751p5078
9510b71993a08781A3690L1706L43425c49604a4954k30931F1552P2924c03782B73709
9498a99438g8842k03057h9477H7906c37199P2700A5114a58465c9978l0819j08578
9487a79375D5742a92553L2136b6654B41083a25883j31193C3438d131m5886C24765
9475h981k02516P3881A45233b78391J11766Q063E4189h094E7454c28228J8807
9464c09421f2974A29350a04574A85998o7792h5370I2217D2929J00916g7117l85202
9453d62319g0551A39649b05443L3519Q1382B25618a54997A66064a45902B1253
$$ plain form
9533 -447304 -260480 -36301 119115 77294 37198 108431 174207 -70301 125200 -151022 68152
9521 -401306 -112200 -347373 -94280 -86764 56704 -157993 -65500 20311 -250666 -196915 -271993
9510 -271993 -108781 13690 45396 388821 -349604 -14954 -245885 61552 134476 -303782 273709
9498 -199438 -78842 -281899 -89477 87906 -337199 -264499 15114 -158465 -39978 -70797 -179375
9487 -179375 45742 -192553 -160417 -26654 241083 -125883 -257076 33438 -4131 -50017 324765
9475 -8981 -211497 -137616 145233 -278391 -166625 -158562 54189 -8094 57454 -328228 -309421
9464 -309421 -62974 129350 -104574 185998 118206 -85370 92217 42929 143845 -77117 -462319
9453 -462319 -70551 139649 -205443 -171924 -90542 225618 -154997 166064 -145902 21253
9442a63489g1500j02940b7170A04739e6746j54485G4329N1744Q8764E5437J38294
9431A93731a14688A68490N8449r8789J42145F5108b02191o1375c2725B00584e3917
9419H6332g890A39224a79466M4590L3984B54517a4344G4656C474h9492J3932B8104
9406C1320g047k11966O2718A09915R6633d9226k85352J00986j44966f9036l58545
9395d27581a69633I0574B8426b84676a34505N4639A90775b34276Q2952A78598
9384c3713L11B9502L26243H6407b1857G5577i283m10656e1512l4390D049K03993
9372B08042b44144c3398a4138B6432a496A34503J44968a50674J6959l7937E7414
9360A71996b12238c2589k940k1488K5197n3322n6397O1726l1100c8239p2746k43642
$$ plain form
9442 -163489 -71500 -174440 -27170 104739 -56746 -211231 74329 126073 214837 55437 193731
9431 193731 -114688 168490 226939 128150 270295 65108 -202191 -263566 -32725 200584 -53917
9419 86332 -7890 139224 -179466 -134876 -100892 254517 -14344 74656 3474 -89492 -75560 28104
9406 31320 -7047 -219013 -156295 109915 206548 -49226 -334578 -233592 -378558 -69036 -427581
9395 -427581 -169633 90574 28426 -284676 -134505 -79866 190775 -234276 -151324 178598
9384 -33713 -33402 29502 355745 86407 -21857 75577 -9283 -419939 -51512 -85902 4049 208042
9372 208042 -244144 -33398 -14138 26432 -1496 134503 279471 -150674 -133715 -171652 57414
9360 171996 -212238 -32589 -35529 -57017 -31820 -85142 -141539 -79813 -110913 -38239 -110985 -354627
9348c54627a23886M9197l2803H2269b62938D127b75933d5111j70392B529b2362
9336B22192a30651J8944a8820j8360a6381j46153j52703c7523B78762l722b47301
9324a33806r2918A79590a6658k17816A26646b47102d778k44468n08J07391B05865
9312g5965A12063a68955j82637a69945k6827r317o1800J8187j537A72743a7363
9300F9239b41286O2943a1347F7421f09637a54348D65399a95188N5272f8628B8878
9288a06686A08854c47779G6555J64857k1987A06522l0129c6191E4665B4717L631
9277B8348d82583J86745a6294l48104a15669B19306c10604p327A50531m4462C0007
9265H8916o025f789A3198J33684g325A56465d9393r5479m1135C01716D4280a79716
$$ plain form
9348 -354627 -123886 -74689 -107492 82269 -262938 4127 -275933 -45111 -215503 2529 -22362
9336 222192 -130651 -111707 -18820 -37180 -16381 -162534 -315237 -37523 278762 275040 -247301
9324 -133806 -226724 179590 -16658 -234474 126646 -247102 -4778 -249246 -249754 -142363 205865
9312 -75965 112063 -168955 -351592 -169945 -196772 -206089 -267889 -249702 -251239 172743 -17363
9300 69239 -241286 -178343 -11347 67421 -609637 -154348 465399 -195188 -139916 -68628 28878
9288 -106686 108854 -347779 76555 241412 219425 106522 76393 -36191 54665 24717 28348
9277 28348 -482583 -295838 -16294 -364398 -115669 219306 -310604 -317931 150531 106069 30007
9265 88916 82891 -6789 13198 146882 -7325 156465 -49393 -144872 -186007 301716 44280 -179716
9252a05826E3255b93519H602b13435A86020c36532Q6862d5273l30122a0652m49931
9241d60583A50831h4081B1107J9776j769b16102N6010d048j9959l7890A31473
9229g3654C1252D120a4n3679k14367E4640J48173b70348b5777E7155R6310a88771
9216a94923C233d94060B9652P0139a64772F4583K698l2177c01210N2503q532C30200
9203c09871h3686j452k670G2416A901a21222A4270Q145K8770J12484C6295a19868
9190b32736f5809j5994r7223H5263b16830P6065f1491J3871h300B3217N575K2018
9178E0810C48e0319A38747i5097m080j37285D3201a64281n4263B45813b77450
9166H4904K13194a39976j61738a4103A37131C3426K07392c01715A40894e3666
$$ plain form
9252 -105826 53255 -293519 8602 -213435 186020 -336532 -249670 -45273 -375395 -10652 -460583
9241 -460583 150831 -84081 21107 40883 39114 -216102 -160092 -4048 -24007 -61897 131473
9229 -73654 31252 4120 -14 -53693 -268060 54640 202813 -270348 -25777 57155 153465 -188771
9216 -194923 3233 -494060 29652 99791 -164772 64583 67281 35104 -301210 -248707 -257239 330200
9203 -309871 -83686 -85138 -87808 72416 1901 -121222 14270 22415 51185 163669 36295 -119868
9190 -232736 -65809 -81803 -179026 85263 -216830 -140765 -61491 -47620 -8300 23217 28792 50810
9178 50810 348 -50319 138747 -95097 -99177 -236462 43201 -164281 -218544 245813 -277450
9166 84904 298098 -139976 -301714 -14103 137131 33426 240818 -301715 140894 -53666
9155A26297J55586N645A4752d5395j04376c9892j15669J1434A64045i5016C7142
9143A26038b97228j92300b6302H7078f8940D790J04922a10832A05965a70236n576
9132a75812d2472A08151M3112a92278A41489a17642A0448J98099H8168B9073b22700
9120b31548m5427g8494a8605k4397D23147b10777k5869D0886L00934a15398j81245
9109b96643A73327a75910q1262L7896O7004o7419i5192D563M6354c4095j88219
9098b22314B02762g653l39278b7320k25493A1099L8424e3857j14568k02837a72906
9086a53245A12055O332J75468a38379H236R0520b27695q5529J11005n4889J04176
9075a52932M2914E8977c4345k61812g6547G8118g3297b0054B77019b61925J27709
$$ plain form
9155 126297 281883 287528 14752 -45395 -149771 -39892 -155561 -144127 164045 -95016 37142
9143 126038 -297228 -489528 -26302 87078 -68940 4790 109712 -110832 105965 -170236 -175812
9132 -175812 -42472 108151 151263 -192278 141489 -117642 10448 208547 88168 29073 -222700
9120 -231548 -276975 -78494 -18605 -43002 423147 -210777 -236646 40886 341820 -115398 -296643
9109 -296643 173327 -175910 -257172 -219276 -152272 -219691 -95192 4563 50917 -34095 -222314
9098 -222314 202762 -7653 -346931 -27320 -252813 11099 49523 -53857 -168425 -371262 -172906
9086 -153245 112055 118387 293855 -138379 8236 98756 -227695 -313224 -202219 -257108 -152932
9075 -152932 -110018 58977 -34345 -296157 -76547 78118 -73297 -20054 277019 -261925 -134216
9064a34216k7671k4758B07662a941E3373b05157B64198c03454D15354a0006m9208
9053e9214A5634a65936D5311a97106M3071e8467R718C02299a75364B39218b96019
9041g2188D1482a29595j49589A87888F5916c70278C3659h4846j35211A40319b62028
9029H1829j9151a70464m8a6197H1831b68334M0200J00760R554L9524c6314r5172
9017a31486O2656n5069B54472I8638a25377k26730A38771c6351m5593F6883a77228
9005b40814J18059J8764k14860q0572H309J07103f4832j23568H6162F673a33801
8993a81731l3328A2409a19116j91462R1605a04277j76507m828B12379q0758A0146
8981A6409R6649A1298i6087G4493c50835J31360A24104a1907m8247I5636e541
$$ plain form
9064 -134216 -161887 -186645 207662 -1941 53373 -205157 264198 -303454 415354 -10006 -59214
9053 -59214 15634 -165936 45311 -197106 -154035 -58467 -48749 302299 -175364 239218 -296019
9041 -72188 41482 -129595 -279184 187888 65916 -370278 33659 -84846 -220057 140319 -262028
9029 81829 62678 -170464 -170512 -16197 81831 -268334 -228134 -127374 -117820 -78296 -36314 -131486
9017 -131486 -68830 -123899 254472 98638 -125377 -352107 138771 -36351 -81944 66883 -177228
9005 -240814 -122755 -103991 -318851 -399423 8309 115412 -64832 -188400 86162 6673 -133801
8993 -181731 -215059 12409 -119116 -310578 -218973 -104277 -280784 -285612 212379 131621 10146
8981 16409 113058 11298 -96087 74493 -350835 -219475 124104 -11907 -60154 95636 -5541
8969a94041J0667j05433c8954k39679j67716c7734r5188B69387i9683J2798A28527
8957A76434a68458J3241B8924J27073A7829d06111C792P4387l4925b51140B26211
8945e1320F3060d5197l0940A08939n1753a10158A55870g9806K167k53015B3733
8933A02798K34654a75510h4783m31A71621h5423C61285b12022R5608C62184J105421
8922A467605M793644o75040j780121A593888o18701C89217r7000I5070J94348
8913B89418O8273p5602A00629B2422K3977N7516a85741F8095R9372R833n5378
8902A21922e7425j9461G6649N4696b04276j04992I0918J85461a22298J729A2159
8890b02840b8932A53210D6497Q5570A1428b3785j18565I4186B614J83655f0172
$$ plain form
8969 -194041 -183374 -288807 -38954 -278633 -446349 -37734 -132922 269387 -99683 -86885 128527
8957 176434 -168458 -155217 28924 155997 17829 -406111 3792 78179 43254 -251140 226211
8945 -51320 63060 -45197 -76137 108939 57186 -110158 155870 -79806 -77639 -330654 23733
8933 102798 337452 -175510 -84783 -85214 171621 -85423 361285 -212022 -116414 362184 1467605
8922 1467605 6261249 5586209 3806088 1593888 975187 389217 292217 95070 289418
8913 289418 357691 282089 100629 22422 46399 103915 -185741 68095 167467 177300 121922
8902 121922 -57425 -76886 76649 131345 -204276 -309268 90918 276379 -122298 -120569 12159
8890 -202840 -28932 153210 46497 132067 11428 -23785 -142350 94186 2614 186269 -60172
8878E8527e7749k5150k61996A47628a26715Q608j20310I9433J56808g8824p6573
8867a55397C72134a41532l5342A527a70770Q3378j23925L7151M920A01919M63312
8856E65231A5621J10717b68174h8069j89582a10127c0302k87888f607E5409b0245
8844a2566G8832g1576B09198C5658b40294H762b48200j24993a11098j09139A17012
8832b66503J19203j8617A69362F7440i4235c0902G3425L10512F9353D963a24144
8820a66533E4595h3411r200B9049b73411h2333P013j54490A10751h0442m0726
$$ plain form
8878 58527 -57749 -82899 -344895 147628 -126715 -118107 -238417 99433 256241 -78824 -155397
8867 -155397 372134 -141532 -176874 1527 -170770 -87392 -211317 -174166 -169246 101919 565231
8856 565231 15621 126338 -268174 -88069 -277651 -110127 -30302 -318190 -6607 55409 -20245
8844 -12566 78832 -71576 209198 35658 -240294 8762 -248200 -373193 -111098 -220237 117012
8832 -266503 -147300 -165917 169362 67440 -94235 -30902 73425 383937 69353 4963 -124144
8820 -166533 54595 -83411 -92611 29049 -273411 -82333 -75320 -229810 110751 -80442 -121168
$$ [...]
##END NTUPLES=NMR SPECTRUM
##END=
