##TITLE=AC1662_NPAAH14398_8531281_C23E3ciWJy
##JCAMPDX= 6.0         $$ Bruker NMR JCAMP-DX V2.0
##DATA TYPE= NMR SPECTRUM
##DATA CLASS= NTUPLES
##ORIGIN= BRUKER
##OWNER= Administrator
$$ 1.72 TOPSPIN		Version 2.1
$$ 2014-03-14 15:08:11.311 -0800  Administrator@X
$$ Compression mode = diff/dup
##.OBSERVE FREQUENCY= 400.02188249412
##.OBSERVE NUCLEUS= ^1H
##.ACQUISITION MODE= SIMULTANEOUS (DQD)
##.ACQUISITION SCHEME= undefined
##.AVERAGES= 8
##.DIGITISER RES= 22
##SPECTROMETER/DATA SYSTEM= spect
##.PULSE SEQUENCE= zg30
##.SOLVENT NAME= COFFEE_meoh
##.SHIFT REFERENCE= INTERNAL, COFFEE_meoh, 1, 14.98509
##AUDIT TRAIL= $$ (NUMBER, WHEN, WHO, WHERE, PROCESS, VERSION, WHAT)
$$ ##TITLE= Audit trail, TOPSPIN		Version 2.1
$$ ##JCAMPDX= 5.01
$$ ##ORIGIN= Bruker BioSpin GmbH
$$ ##OWNER= Administrator
$$ $$ E:\/data/COFFEE/nmr/AC1662_NPAAH14398_8531281_C23E3ciWJy/10/pdata/1/auditp.txt
$$ ##AUDIT TRAIL=  $$ (NUMBER, WHEN, WHO, WHERE, PROCESS, VERSION, WHAT)
(   1,<2014-03-14 15:08:00.160 -0800>,<Administrator>,<X>,<go>,<TOPSPIN 2.1>,
      <created by zg
	started at 2014-03-14 15:07:07.959 -0800,
	POWCHK enabled, PULCHK disabled,
       configuration hash MD5:
       C8 4E 4E 5D D3 5C D8 9E 9F 52 82 E0 59 8A DE 15
       data hash MD5: 64K
       EC 0D AB 6B B6 4F A0 06 35 9D 70 A9 BC BD 94 38>)
(   2,<2014-03-14 15:08:03.760 -0800>,<Administrator>,<X>,<proc1d>,<TOPSPIN 2.1>,
      <Start of raw data processing
       efp LB = 0 FT_mod = 6 PKNL = 1 PHC0 = 0 PHC1 = 0 SI = 32K 
       data hash MD5: 32K
       C0 75 E3 25 82 82 0E B8 CE B6 64 F7 0F 46 31 F5>)
(   3,<2014-03-14 15:08:04.252 -0800>,<Administrator>,<X>,<proc1d>,<TOPSPIN 2.1>,
      <pk PHC0 = 92.77954 PHC1 = 0 
       data hash MD5: 32K
       00 03 10 F6 99 36 AE 0F CB CF C9 C6 BF A7 46 2F>)
(   4,<2014-03-14 15:08:04.591 -0800>,<Administrator>,<X>,<proc1d>,<TOPSPIN 2.1>,
      <abs ABSG = 1 
       data hash MD5: 32K
       76 65 5E A9 A5 84 35 3D 5C A0 0E 54 51 12 A9 60>)
(   5,<2014-03-14 15:08:04.745 -0800>,<Administrator>,<X>,<proc1d>,<TOPSPIN 2.1>,
      <abs ABSG = 2 
       data hash MD5: 32K
       4C C0 EF 82 59 3A 19 4B C3 CF 1F 40 65 E0 43 E6>)
(   6,<2014-03-14 15:08:04.837 -0800>,<Administrator>,<X>,<proc1d>,<TOPSPIN 2.1>,
      <abs ABSG = 3 
       data hash MD5: 32K
       E4 B6 F0 7B 18 71 F4 65 A6 91 B8 B5 7B 07 A4 4D>)
(   7,<2014-03-14 15:08:04.899 -0800>,<Administrator>,<X>,<proc1d>,<TOPSPIN 2.1>,
      <abs ABSG = 4 
       data hash MD5: 32K
       3F D9 12 C4 08 28 E6 78 4E 27 68 5B F7 E4 E7 CF>)
(   8,<2014-03-14 15:08:05.022 -0800>,<Administrator>,<X>,<proc1d>,<TOPSPIN 2.1>,
      <abs ABSG = 5 
       data hash MD5: 32K
       82 C8 19 1E 31 3E 2D C2 C1 2E 73 37 C1 98 B9 E3>)
$$ ##END=
$$ 
$$ $$ hash MD5
$$ $$ 07 B3 AF 70 C5 38 F0 04 EB A8 C6 53 21 8F 60 63
##$RELAX= 
##$RELAX= 
##$RELAX= 
##$RELAX= 
##$RELAX= 
##$RELAX= 
##$RELAX= 
$$ Bruker specific parameters
$$ --------------------------
##$DU= <E:\>
##$EXPNO= 10
##$NAME= <AC1662_NPAAH14398_8531281_C23E3ciWJy>
$$ [...]
150 150 150 150 150 150 150 150
##$TP07= 0
##$TPNAME0= <>
##$TPNAME1= <>
##$TPNAME2= <>
##$TPNAME3= <>
##$TPNAME4= <>
##$TPNAME5= <>
##$TPNAME6= <>
##$TPNAME7= <>
##$TPOAL= (0..7)
0.5 0.5 0.5 0.5 0.5 0.5 0.5 0.5
##$TPOFFS= (0..7)
0 0 0 0 0 0 0 0
##$TUNHIN= 0
##$TUNHOUT= 0
##$TUNXOUT= 0
##$USERA1= <user>
##$USERA2= <user>
##$USERA3= <user>
##$USERA4= <user>
##$USERA5= <user>
##$V9= 5
##$VALIST= <valist>
##$VCLIST= <CCCCCCCCCCCCCCC>
##$VD= 0
##$VDLIST= <DDDDDDDDDDDDDDD>
##$VPLIST= <PPPPPPPPPPPPPPP>
##$VTLIST= <TTTTTTTTTTTTTTT>
##$WBST= 1024
##$WBSW= 4
##$XGAIN= (0..3)
0 0 0 0
##$XL= 0
##$YL= 0
##$YMAX_a= 602735
##$YMIN_a= -512478
##$ZGOPTNS= <>
##$ZL1= 120
##$ZL2= 120
##$ZL3= 120
##$ZL4= 120
##$ABSF1= 14.98509
##$ABSF2= -5.573092
##$ABSG= 5
##$ABSL= 3
##$ALPHA= 0
##$AQORDER= 0
##$ASSFAC= 0
##$ASSFACI= 0
##$ASSFACX= 0
##$ASSWID= 0
##$AUNMP= <proc_prof1d_extract_pilot.lims>
##$AXLEFT= 0
##$AXNAME= <>
##$AXNUC= <1H>
##$AXRIGHT= 0
##$AXTYPE= 0
##$AXUNIT= <>
##$AZFE= 0.1
##$AZFW= 0.1
##$BCFW= 0
##$BC_mod= 0
##$BYTORDP= 0
##$COROFFS= 0
##$CY= 15
##$DATMOD= 1
##$DC= 0
##$DFILT= <>
##$DTYPP= 0
##$F1P= 0
##$F2P= 0
##$FCOR= 0.5
##$FTSIZE= 32768
##$FT_mod= 6
##$GAMMA= 0
##$GB= 0
##$INTBC= 1
##$INTSCL= 1
##$ISEN= 128
##$LB= 0
##$LEV0= 0
##$LPBIN= 0
##$MAXI= 10000
##$MC2= 0
##$MEAN= 0
##$ME_mod= 0
##$MI= 0
##$NCOEF= 0
##$NC_proc= -8
##$NLEV= 6
##$NOISF1= 0
##$NOISF2= 0
##$NSP= 0
##$NTH_PI= 0
##$NZP= 0
##$OFFSET= 14.98509
##$PC= 1
##$PHC0= 92.77954
##$PHC1= 0
##$PH_mod= 1
##$PKNL= yes
##$PPARMOD= 0
##$PPDIAG= 0
##$PPIPTYP= 0
##$PPMPNUM= 2147483647
##$PPRESOL= 1
##$PSCAL= 4
##$PSIGN= 0
##$PYNMP= <proc.py>
##$REVERSE= no
##$SF= 400.02
##$SI= 32768
##$SIGF1= 0
##$SIGF2= 0
##$SINO= 400
##$SIOLD= 32768
##$SPECTYP= <>
##$SREGLST= <1H.CDCl3>
##$SSB= 0
##$STSI= 32768
##$STSR= 0
##$SW_p= 8223.68421052631
##$SYMM= 0
##$S_DEV= 0
##$TDeff= 65536
##$TDoff= 0
##$TI= <>
##$TILT= no
##$TM1= 0
##$TM2= 0
##$TOPLEV= 0
##$USERP1= <user>
##$USERP2= <user>
##$USERP3= <user>
##$USERP4= <user>
##$USERP5= <user>
##$WDW= 1
##$XDIM= 32768
##$YMAX_p= 445549128
##$YMIN_p= -665910
##$CURPLOT= <Network HP LaserJet P1505>
##$CURPRIN= <$Network HP LaserJet P1505>
##$DFORMAT= <normdp>
##$LAYOUT= <+/1D_H.xwp>
##$LFORMAT= <normlp>
##$PFORMAT= <normpl>
##$SURQMSG= 1
$$ End of Bruker specific parameters
$$ ---------------------------------
##NTUPLES= NMR SPECTRUM
##VAR_NAME=  FREQUENCY,     SPECTRUM/REAL,   SPECTRUM/IMAG
##SYMBOL=    X,             R,               I
##VAR_TYPE=  INDEPENDENT,   DEPENDENT,       DEPENDENT
##VAR_FORM=  AFFN,          ASDF,            ASDF
##VAR_DIM=   32768,         32768,           32768
##UNITS=     HZ,            ARBITRARY UNITS, ARBITRARY UNITS
##FACTOR=    0.250966925370066, 1,           1
##FIRST=     8223.43324360094, -51949,       -218688
##LAST=      0,             -106513,         -67230
##MIN=       0,             -665910,         0
##MAX=       8223.43324360094, 445549128,    0
$$ Real data points
##PAGE= N=1
##DATA TABLE= (X++(R..R)), XYDATA
$$ [...]
19559A11071j4974D1487L54558H495e1819A10389c03275h1929L339j81923A29179
$$ 111071 96097 41487 396045 8495 -51819 110389 -303275 -81929 -78590 -260513 129179
19547E6968J11366q0340d14536J55278M6794B65131m0589b11843A14532c5537
$$ 56968 168334 87994 -414536 -259258 -212464 265131 224542 -211843 114532 -35537
19536A15099b54955E07377G0696a46832O0616o0772b6257r5281N6252I5340h5195
$$ 115099 -254955 507377 70696 -146832 -86216 -146988 -26257 -121538 -65286 95340 -85195
19524E9167d21297F2539c01498L769B34724g6879j13655f6407k8240B12921f7762
$$ 59167 -421297 62539 -301498 -297729 234724 -76879 -190534 -66407 -94647 212921 -67762
19512F9581a90520q5904J14055D4578A2557K35467a17255q5411p4122e8653C0898
$$ 69581 -190520 -276424 -162369 44578 12557 248024 -117255 -202666 -276788 -58653 30898
19500A85897a85323B5299c3627a0824m5298q4315a6026k08719C28612b56645e6410
$$ 185897 -185323 25299 -33627 -10824 -56122 -140437 -16026 -224745 328612 -256645 -56410
19488B49014b0577k41641F9041a78190j8620D59035f6334k3781q7877A2868a25587
$$ 249014 -20577 -262218 69041 -178190 -196810 459035 -66334 -90115 -177992 12868 -125587
19476i6393i728l14840Q2736p382c8415l62075d8867j76630B1131L64206K2302
$$ -96393 -9728 -324568 -241832 -249214 -38415 -400490 -48867 -225497 21131 385337 407639
19465D07639j15829h239l00602a4044C1213b87879A63727L61427a59025C4155
$$ 407639 291810 -8239 -308841 -14044 31213 -287879 163727 525154 -159025 34155
19454B89012h2643j80293j3194B55178a67527A47040a98534A01826a0731o5626
$$ 289012 -82643 -262936 -276130 255178 -167527 147040 -198534 101826 -10731 -76357
19444g6357j07475f5736A53335C6145c11947a52283f6828j05711H4743e6205j1070
$$ -76357 -183832 -65736 153335 36145 -311947 -152283 -66828 -172539 84743 -56205 -67275
19433f7275r473b1446j41749f7287j185P589j82186J09360d6513r6662I6431i1248
$$ -67275 -76748 -21446 -163195 -67287 -68472 -60883 -243069 -133709 -46513 -143175 96431 -91248
19420f3626l3048C1897J46348b8376j99688A28393b12084a8426C5662i7077g747
$$ -63626 -96674 31897 178245 -28376 -228064 128393 -212084 -18426 35662 -97077 -7747
19408a90613A78439a78088j355M0904c2813D927a17542j22433J07710N5884l3398
$$ -190613 178439 -178088 -179443 -138539 -32813 4927 -117542 -239975 -132265 -76381 -109779
19397a09779A8044b51159m4672a25551B93592A7251a6196B04152c10004f1829
$$ -109779 18044 -251159 -295831 -125551 293592 17251 -16196 204152 -310004 -61829
19386c3633l03276J37406G3625i6643r307m1830j17372H451M23792d9034o6721
$$ -33633 -336909 -199503 73625 -96643 -105950 -147780 -265152 8451 432243 -49034 -115755
19375a15755q1205F7908L2638c89945G5320c09314C5632a3305A00386a18165B54187
$$ -115755 -196960 67908 100546 -389945 75320 -309314 35632 -13305 100386 -118165 254187
19363a96797h0120C11039b55150A74156b28225A0564a52638f4910l09524A74657
$$ -196797 -80120 311039 -255150 174156 -228225 10564 -152638 -64910 -374434 174657
19352a25978d8068k15090H6304k8523J26126c18320J47294k8300j23372a20080
$$ -125978 -48068 -263158 86304 57781 183907 -318320 -171026 -199326 -322698 -120080
19341A9861b39263j18484G4976b67163d3155B5364K40116a3377k46011i2684r2155
$$ 19861 -239263 -357747 74976 -267163 -43155 25364 265480 -13377 -259388 -92684 -184839
19330a84839b0166j90520C8437a72796O8362A79499a25471d2622n0757b8236l2969
$$ -184839 -20166 -210686 38437 -172796 -104434 179499 -125471 -42622 -93379 -28236 -61205
19319f1205q4045j27705B003L7953J63740a78235r3618i3476A8790d8831A62123
$$ -61205 -145250 -272955 2003 39956 203696 -178235 -271853 -93476 18790 -48831 162123
19307G9472c8436j60704A54681b18920F7996j1368d82859J75471r7631b00292
$$ 79472 -38436 -199140 154681 -218920 67996 56628 -482859 -307388 -405019 -200292
19296d3632l5752A77563b46578B264c73920A49950b45118a05612B16533b55410
$$ -43632 -79384 177563 -246578 2264 -373920 149950 -245118 -105612 216533 -255410
19285a2292j65267M9584m1527r338j39334c9825A18903N7329A2831a30994n0132
$$ -12292 -177559 -127975 -169502 -178840 -318174 -39825 118903 176232 12831 -130994 -181126
19274a81126b6938I0912a59123J7458L7412A38804a51526o5174A54469k9937g3917
$$ -181126 -26938 90912 -159123 -141665 -104253 138804 -151526 -216700 154469 124532 -73917
19262g5143B99348j41342a27615A48875c55022N4806G439a09884A13249c04432
$$ -75143 299348 158006 -127615 148875 -355022 -300216 7439 -109884 113249 -304432
19251b9776E2056K37279a73585d617A46621c42150A75403D6312a19509C0366a2708
$$ -29776 52056 289335 -173585 -4617 146621 -342150 175403 46312 -119509 30366 -12708
19239d0801C1180K77246a71728j3822g0384j10111L4659d4261Q22j64575a4276
$$ -40801 31180 308426 -171728 -185550 -70384 -180495 -145836 -44261 -43439 -208014 -14276
19227C52097H7738P1504d324l11587a43720d9871r2852H0693a2932j48265H5882
$$ 352097 87738 159242 -4324 -315911 -143720 -49871 -142723 80693 -12932 -161197 85882
19215h855C693J78872e6319B41176d0732k77146c7002I7419a74958K9334j381
$$ -8855 3693 182565 -56319 241176 -40732 -317878 -37002 97419 -174958 -145624 -147005
19204a47005N5635a8704k99186D64062A30350E8489i0912k39412H7303a58009
$$ -147005 -91370 -18704 -317890 464062 130350 58489 -90912 -330324 87303 -158009
19193b14950E0886N9820b19662i3432j16058o9629Q6913A69140a57160j73771
$$ -214950 50886 110706 -219662 -93432 -209490 -279119 -192206 169140 -157160 -330931
19183c30931B2690J49653k2577K32000f7967a602k70574C7521b70435a12942k13773
$$ -330931 22690 172343 149766 381766 -67967 -1602 -272176 37521 -270435 -112942 -326715
19172c26715d7326B3299J33146i4382j51895a8276I699f8658E1702K12111a37196
$$ -326715 -47326 23299 156445 -94382 -246277 -18276 9699 -68658 51702 263813 -137196
19160B69343a89923O2506J427F8664a85123A81139i3775j72339D0914J21826a7356
$$ 269343 -189923 -127417 -125990 68664 -185123 181139 -93775 -266114 40914 162740 -17356
19148c18601I1183J15585a66880A91767a21802A8575J859K7596b70724P1872A00878
$$ -318601 91183 206768 -166880 191767 -121802 18575 20434 48030 -270724 -198852 100878
19136e8122j93279e9089l81728D4669a38228a4917l5484A98345b95457q7053I2565
$$ -58122 -251401 -59089 -440817 44669 -138228 -14917 -50401 198345 -295457 -382510 92565
19124A83665E3427P503J0816c5011j04636K5411j2519A32216h1713c7424J464
$$ 183665 53427 60930 71746 -35011 -139647 -114236 -126755 132216 -81713 -37424 -35960
19113c5960p9528j02863F8107a64015b0184j10822G1481A1561h3264A49066a61531
$$ -35960 -115488 -218351 68107 -164015 -20184 -131006 71481 11561 -83264 149066 -161531
19101b19335k6175e69j03294c674j86911a7140B84963F701a35180k4147B81864
$$ -219335 -245510 -569 -103863 -3674 -190585 -17140 284963 6701 -135180 -159327 281864
19089d5962k74207C25029a69618i207j81165B2061N5668c65041A60654R3737c88884
$$ -45962 -320169 325029 -169618 -9207 -190372 22061 77729 -365041 160654 254391 -388884
19077i5808l0537H210J75039g0762A05938L3496N5138b82212J23376o3320A79440
$$ -95808 -126345 8210 183249 -70762 105938 139434 194572 -282212 -158836 -222156 179440
19065b08311C26018B9613f4190B43747a58578I1860C4261a92491P6166d4493A57231
$$ -208311 326018 29613 -64190 243747 -158578 91860 34261 -192491 -116325 -44493 157231
19053A23565i9090F8748a0698n986B23000j02372c19937A07389J31790a63093
$$ 123565 -99090 68748 -10698 -16684 223000 120628 -319937 107389 239179 -163093
19042C23240A43639D7122B300K70289f4112i866B99391b96484R0671G2699A5642
$$ 323240 143639 47122 2300 272589 -64112 -9866 299391 -296484 -205813 72699 15642
19030B02645B7307J18736M2775f9716D00469A75175J46654l5118q1700F9123l3118
$$ 202645 27307 146043 188818 -69716 400469 175175 321829 286711 205011 69123 36005
19019C6005O6977l7101R3966a25008B74992a65297A10913J65848B6621J58697
$$ 36005 102982 65881 159847 -125008 274992 -165297 110913 276761 26621 185318
19009A85318d4173r8918k81947J67622B00872b30581c5623j00169A34838a78377
$$ 185318 -44173 -143091 -425038 -257416 200872 -230581 -35623 -135792 134838 -178377
18998i7101p0982f6748A04906h6650D96590a18937B40601a30479A09061J78283
$$ -97101 -168083 -66748 104906 -86650 496590 -118937 240601 -130479 109061 287344
18988B87344b11943e3091n4839j01432H6550a36750n5293A52391Q4287o4038D7682
$$ 287344 -211943 -53091 -107930 -209362 86550 -136750 -192043 152391 236678 172640 47682
18976g8528B21473i0560I8074B2749J55918a68939Q0821K1232C8961g4856b8876
$$ -78528 221473 -90560 98074 22749 178667 -168939 -88118 -66886 38961 -74856 -28876
18964H5860a68024C1995K81h7770l9921k3705J7703E0387J30973c97919g3093
$$ 85860 -168024 31995 32276 -87770 -127691 -151396 -133693 50387 181360 -397919 -73093
18952A03562i9219d0820l11702B0956a61632F0606b14629k2698c8692j18380C5235
$$ 103562 -99219 -40820 -352522 20956 -161632 60606 -214629 -237327 -38692 -157072 35235
18940A23790a20590k96263f5328l2174B112O294b29383E3677j7256a56896a8487
$$ 123790 -120590 -416853 -65328 -97502 2112 8406 -229383 53677 36421 -156896 -18487
18928d3963B3414a76605A04898c05637J33113O6497A8020M497a57446e9940j34198
$$ -43963 23414 -176605 104898 -305637 -172524 -106027 18020 22517 -157446 -59940 -194138
18917a94138b8587j06352j3209j27297J13785J8441A11994a35357O5099J7306
$$ -194138 -28587 -134939 -148148 -275445 -161660 -143219 111994 -135357 -70258 -52952
18907e2952k26632D6213c3942m20899J41227h8497c6145c450j54005j72054i7557
$$ -52952 -279584 46213 -33942 -454841 -313614 -88497 -36145 -3450 -157455 -329509 -97557
18895A84809o9743B5408J6946a75512F0860a90505f4415G3744G955b14715f7749
$$ 184809 115066 25408 42354 -175512 60860 -190505 -64415 73744 7955 -214715 -67749
18883h6834j46053B8688a72332J3444D4490L1352a73103I2711c15921J04071h8866
$$ -86834 -232887 28688 -172332 -158888 44490 75842 -173103 92711 -315921 -211850 -88866
18871a39335b8683H858b32804I0760P7811a09526I896b20678j9157i8407G3243
$$ -139335 -28683 8858 -232804 90760 168571 -109526 9896 -220678 -239835 -98407 73243
18859a93546e019j9833m01137h2148f128j37256l2034N255o8295l4306a5763k4801
$$ -193546 -5019 -24852 -425989 -82148 -6128 -143384 -175418 -170163 -238458 -272764 -15763 -40564
18847d0564k57428A5568J31621l4510a48847R993A46592D4172R2160E450d9401
$$ -40564 -297992 15568 147189 112679 -148847 -138854 146592 44172 136332 5450 -49401
18835b47340f2545G4126d4845J1589q2504A27268m6530b10021A55650b5246q9052
$$ -247340 -62545 74126 -44845 -33256 -115760 127268 80738 -210021 155650 -25246 -114298
18824a14298C7957a9996k6941D8991J20952a33630b2546k43088G5460b99776A56928
$$ -114298 37957 -19996 -46937 48991 169943 -133630 -22546 -265634 75460 -299776 156928
18812C42011C4704J83932K9063N3964j41753n2536K1992b51911J20772j50638
$$ 342011 34704 218636 247699 301663 159910 107374 129366 -251911 -131139 -281777
18802b81777b6761j70358A33069g6745A56977c28162G8000a2864B13185c7995
$$ -281777 -26761 -197119 133069 -76745 156977 -328162 78000 -12864 213185 -37995
18791a93831k9205J3059A5589J15229J5230a1100I8149q955P7390j9958c24177
$$ -193831 -223036 -209977 15589 130818 146048 -11100 98149 89194 166584 146626 -324177
18779C6535Q9578B9842c83713B84006c8180p7836A45992a46207C8933p386b3879
$$ 36535 126113 29842 -383713 284006 -38180 -116016 145992 -146207 38933 31547 -23879
18767a02711j07785j51777d0845r1566D5943f9798G4008C4733E317a95499O2622
$$ -102711 -210496 -362273 -40845 -132411 45943 -69798 74008 34733 5317 -195499 -132877
18756a32877K1483J9824H1450k2209f7703r6063A621K2582g5008j71271B43114
$$ -132877 -111394 -91570 81450 59241 -67703 -163766 1621 24203 -75008 -246279 243114
18744A37972c29212a54512j9082g6439P394G8275j502a259j36276J4826B32296
$$ 137972 -329212 -154512 -173594 -76439 -69045 78275 76773 -1259 -137535 -122709 232296
18732E370J60275c03211B40943a34183A06166J06774H8024a57871J2940D5587
$$ 5370 165645 -303211 240943 -134183 106166 212940 88024 -157871 -144931 45587
18721a05556A83124i3388b4692j09760j90816c2499A67595J78215b92552D0088
$$ -105556 183124 -93388 -24692 -134452 -325268 -32499 167595 345810 -292552 40088
18710i1395k44639H581h4848p9461j20219D3829g3117j24851h0684n0472c5799
$$ -91395 -336034 8581 -84848 -164309 -284528 43829 -73117 -197968 -80684 -131156 -35799
18698I6533l150g3637A20008a01035h310H2389b02043M2719g9483a1600C8962
$$ 96533 93383 -73637 120008 -101035 -8310 82389 -202043 -159324 -79483 -11600 38962
18686i7272C45077a62527M9124k7916B19428a87804b5048B42900e1622j17178
$$ -97272 345077 -162527 -113403 -141319 219428 -187804 -25048 242900 -51622 -168800
18676a68800F6724e0566I752K46270A04507D6635G980L11087b01647O2027B22338
$$ -168800 66724 -50566 9752 256022 104507 46635 7980 319067 -201647 -139620 222338
18664b77412a2703B05541a69341B88380D7898O9259b34276P9341l8995B6398M4246
$$ -277412 -12703 205541 -169341 288380 47898 117157 -234276 -154935 -193930 26398 70644
18653G0644b37940A73905C5695b3265k2063C21321e2003B7342a82835j14913J43325
$$ 70644 -237940 173905 35695 -23265 -45328 321321 -52003 27342 -182835 -297748 -154423
18642a54423a4198j42247m6089a9640j42548D88656h0663j35195d020D5111K82
$$ -154423 -14198 -156445 -202534 -19640 -162188 488656 -80663 -215858 -4020 45111 45393
18631D5393J03905B0722e8189k10679D7570O4968A1027b91895Q6322G6708a9917
$$ 45393 149298 20722 -58189 -268868 47570 112538 11027 -291895 -205573 76708 -19917
18619A85607p0928c296l14823G8627f5342K3510n54454A6526g8325j77811e1772
$$ 185607 114679 -3296 -318119 78627 -65342 -41832 -596286 16526 -78325 -256136 -51772
18607h2644A3202K98378f4084N250k08718R1310A49272B5067N023J47230o1312
$$ -82644 13202 311580 -64084 -58834 -267552 -176242 149272 25067 30090 177320 116008
18596A16008b71829N5019A5298b41204q344C3178a03080j37757O6806j50380c1784
$$ 116008 -271829 -216810 15298 -241204 -249548 33178 -103080 -240837 -174031 -324411 -31784
18584a10952a9491l186m5218j82356e8467k03088j13301A97173n8518P9877h4247
$$ -110952 -19491 -22677 -67895 -250251 -58467 -261555 -374856 197173 138655 218532 -84247
18572c1846j74441R6259I9474a43549A56010i5180J8190o3658d1061k41009B87179
$$ -31846 -206287 -110028 99474 -143549 156010 -95180 -76990 -140648 -41061 -282070 287179
18560g7995F4592d60220a95009R2770G1680i2627b8706A48683N7684A00940g7701
$$ -77995 64592 -460220 -195009 -102239 71680 -92627 -28706 148683 206367 100940 -77701
18548I4199l9128J59108B8197b01032A31804f6625j22881I2427d5719A37512c81551
$$ 94199 55071 214179 28197 -201032 131804 -66625 -189506 92427 -45719 137512 -381551
18536a46294p8627K0326C8578b94945a41557A09189a57633Q57A0757i0461c7555
$$ -146294 -224921 -204595 38578 -294945 -141557 109189 -157633 -156776 10757 -90461 -37555
18524C6479a01862j24528A7451J5759a07687d3352k11901F3937K98273A50548
$$ 36479 -101862 -226390 17451 33210 -107687 -43352 -255253 63937 362210 150548
18513b25924P2329F8989c1044o8873B65415F3564K8324R4898E3480b5342o0536
$$ -225924 -153595 68989 -31044 -99917 265415 63564 91888 186786 53480 -25342 -85878
18502h5878M0234B7880Q0038l5178b9678l58416d6455j2933A71579a7128F5595
$$ -85878 -45644 27880 107918 72740 -29678 -388094 -46455 -59388 171579 -17128 65595
18490f0571o6611l0698b6238r6916j38899G5429a21172m4034L5588C8544b06371
$$ -60571 -127182 -157880 -26238 -123154 -262053 75429 -121172 -165206 -129618 38544 -206371
18478a39208O184m7960B36599A15974B939a21367j04150N7069j15916b5722j69897
$$ -139208 -133024 -180984 236599 115974 2939 -121367 -225517 -168448 -284364 -25722 -195619
18467a95619m0188f0610m2410B86407G0894a54199E9996a46198B547a99868M3343
$$ -195619 -235807 -60610 -103020 286407 70894 -154199 59996 -146198 2547 -199868 -156525
18456a56525a6000j04016C7114b05420a3319C7269b20033J04465A01097r985a63509
$$ -156525 -16000 -120016 37114 -205420 -13319 37269 -220033 -115568 101097 91112 -163509
18444C6185a84138i0156K8008j69721A61630a02544C0040K05688d0776B37509
$$ 36185 -184138 -90156 -62148 -231869 161630 -102544 30040 235728 -40776 237509
18433b61032A35760f7567C3453j2218J1062f5910l9503b1122j34976B17752A1200
$$ -261032 135760 -67567 33453 21235 32297 -65910 -105413 -21122 -156098 217752 11200
18421a27871K3866O066J8800k06758g7246k05219d6949l29322A95914a97696O965
$$ -127871 -104005 -97939 -79139 -285897 -77246 -282465 -46949 -376271 195914 -197696 -190731
18410a90731Q3600k09934g1346J2826K7522l0134j49402O0191J0921l0517B39453
$$ -190731 -107131 -317065 -71346 -58520 -30998 -61132 -210534 -150343 -139422 -169939 239453
18398D97507B2846c00067f664k8787C20118c1995r1933c4432j61879I488d0802
$$ 497507 22846 -300067 -6664 -35451 320118 -31995 -123928 -34432 -196311 9488 -40802
18386b46186E7853a38729c4646j58375B99496D2471b70174H7500b11018A94075
$$ -246186 57853 -138729 -34646 -193021 299496 42471 -270174 87500 -211018 194075
18375A27290c39369A03952g7003B5081N3656b77209B06908a01089G6589c44185
$$ 127290 -339369 103952 -77003 25081 78737 -277209 206908 -101089 76589 -344185
18364B08424e5091j66381M1911C1078c38060C7940g5164G4459C5943A7941a77852
$$ 208424 -55091 -221472 -179561 31078 -338060 37940 -75164 74459 35943 17941 -177852
18352b49750B14314q8442b9385B04821a9310G4386b33363E7080a70371C11369
$$ -249750 214314 125872 -29385 204821 -19310 74386 -233363 57080 -170371 311369
18341A83692M1375K8382H0546C0694h3851E30854d2590B80713e8336r9167L0038
$$ 183692 225067 253449 80546 30694 -83851 530854 -42590 280713 -58336 -157503 -127465
18330a27465E444J83380i9400m9917o8401J02810G8544L0662J10712h7160k09471
$$ -127465 5444 188824 -99400 -149317 -217718 -114908 78544 109206 219918 -87160 -296631
18319b96631A78872e8757m8249c8633j08460O4720E8238J39464b61127A60556
$$ -296631 178872 -58757 -107006 -38633 -147093 -82373 58238 197702 -261127 160556
18308b94921G8413a38431j91246b8278k56356E9408J8744b59947A04194b83993
$$ -294921 78413 -138431 -329677 -28278 -284634 59408 78152 -259947 104194 -283993
18297a29831a2697F0899a02871a7171k53007O6202b4170C2768J4653R0994d9592
$$ -129831 -12697 60899 -102871 -17171 -270178 -203976 -24170 32768 47421 138415 -49592
18285a26052a4628A10516D6860h7369A07442a28711b546D0343K84004a75765D0147
$$ -126052 -14628 110516 46860 -87369 107442 -128711 -2546 40343 324347 -175765 40147
18273c67136a17709A47274c66849J18757C32882a67416c4732j77959A52143b15492
$$ -367136 -117709 147274 -366849 -248092 332882 -167416 -34732 -212691 152143 -215492
18262b34747b8546k70602a29722B430K85590b73907B36311c57612B1270K8376
$$ -234747 -28546 -299148 -129722 2430 288020 -273907 236311 -357612 21270 49646
18252D9646R029i4445k51808A7986b59981g0578A28237f0862g908G5448g4116
$$ 49646 58675 -94445 -346253 17986 -259981 -70578 128237 -60862 -7908 75448 -74116
18240D2061b22467A15736g4935A96705G8820D387c8735r3972l1127n9193A28284
$$ 42061 -222467 115736 -74935 196705 78820 4387 -38735 -132707 -163834 -223027 128284
18228E2870A4398a52740O3767j92113C21398a00498A88176F4294J01504a80063
$$ 52870 14398 -152740 -88973 -281086 321398 -100498 188176 64294 165798 -180063
18217E3701c1873C9935a43679G2443a93654j71515h2126I4244d3996A61442a86465
$$ 53701 -31873 39935 -143679 72443 -193654 -365169 -82126 94244 -43996 161442 -186465
18205a91870O4852N1482C03920a23398A95875a20408L6223G8382B8381a08954
$$ -191870 -127018 -75536 303920 -123398 195875 -120408 -84185 78382 28381 -108954
18194B49721b59250I3086g2756B3322I764L9191h854A36121k3230r020b4116A88293
$$ 249721 -259250 93086 -72756 23322 9764 48955 -8854 136121 112891 103871 -24116 188293
18181A08497m447f1256C22467C7066A1089a52365j30206O5695Q6455N360e0940
$$ 108497 104050 -61256 322467 37066 11089 -152365 -282571 -216876 -130421 -125061 -50940
18169A59383r500a08859d5226m4393b9841k80386J20561j20811A61680c06460
$$ 159383 149883 -108859 -45226 -89619 -29841 -310227 -189666 -310477 161680 -306460
18158i3909a3531f596A76494K93c8517D0975h9257M590G1924K21610A27693b53730
$$ -93909 -13531 -6596 176494 176787 -38517 40975 -89257 -84667 71924 293534 127693 -253730
18145A06445c17445J42840J6984J9060n629e8735k10402n6915g9477q6302d9672
$$ 106445 -317445 -174605 -157621 -138561 -144190 -58735 -269137 -326052 -79477 -165779 -49672
18133B26064b02785P3676L2337q7681j22694A23764j4841d370k78513h4067K743
$$ 226064 -202785 -129109 -96772 -184453 -307147 123764 108923 -4370 -282883 -84067 -81324
18122h1324K3239a549D63543c19105J33146A21126d1808F1730c05710i5089A05400
$$ -81324 -58085 -1549 463543 -319105 -185959 121126 -41808 61730 -305710 -95089 105400
18110G4681b37869P0397B10371a48003i04I5667P8349b57288B8162a05613M3382
$$ 74681 -237869 -167472 210371 -148003 -904 95667 174016 -257288 28162 -105613 -62231
18099f2231k4016A96038l359J09901O3446a09961M949j39934G0088c06139E9215
$$ -62231 -86247 196038 192679 302580 366026 -109961 -105012 -244946 70088 -306139 59215
18087b55035P0247d135k2541k15632F1865c49460B27125A10770b5803j26271J5218
$$ -255035 -184788 -4135 -26676 -242308 61865 -349460 227125 110770 -25803 -152074 -136856
18076a36856A18847a11116L7840j17023J8510H8086Q8744a86385L9622j08066
$$ -136856 118847 -111116 -73276 -190299 -171789 88086 176830 -186385 -146763 -254829
18066b54829N8677l97732H5029i4082j17313A19646a90920F7284a70548j55192
$$ -254829 -196152 -593884 85029 -94082 -211395 119646 -190920 67284 -170548 -325740
18056c25740A2900d42667d0381J6685k6598r2212B17953B8031a74315c665j3180
$$ -325740 12900 -442667 -40381 -23696 -50294 -142506 217953 28031 -174315 -3665 -16845
18045a6845k23906h3741J9698k50025e2842l2117E5923a11519r3889d2597A88079
$$ -16845 -240751 -83741 -64043 -314068 -52842 -84959 55923 -111519 -205408 -42597 188079
18033a07444I0884e372j02072B43403b4194p0898n0033a2510k29144A64720b5991
$$ -107444 90884 -5372 -107444 243403 -24194 -95092 -145125 -12510 -241654 164720 -25991
18021f3657m690k30359J39933c4660A03318b7811A20608L8180i8129n1945r571
$$ -63657 -68347 -298706 -158773 -34660 103318 -27811 120608 158788 -98129 -150074 -159645
18010a59645r4175f2996A13165b4740o5607K5809I1319l7283c11568c9696d2j22956
$$ -159645 -253820 -62996 113165 -24740 -90347 -64538 91319 54036 -311568 -39696 -42 -122998
17998a22998O89a9837A36811a6661m2162j25629A5466a9887n2340A53188i989
$$ -122998 -122309 -19837 136811 -16661 -58823 -184452 15466 -19887 -72227 153188 -9989
17986C106b00206b1130j90093c417A25315h0895K6569o6839C7781a02512a4556
$$ 3106 -200206 -21130 -211223 -3417 125315 -80895 -54326 -121165 37781 -102512 -14556
17974c1140j3255A11167f6543A61585a73499p3162A39002L918o3125a97455C79977
$$ -31140 -44395 111167 -66543 161585 -173499 -246661 139002 142920 79795 -197455 379977
17962A20214b44050H6862M0479a89322B02934c29214J25794A61388e1181j0040
$$ 120214 -244050 86862 127341 -189322 202934 -329214 -203420 161388 -51181 -61221
17952f1221j95494h2032k52785A55448a86241G0157J75857a42990A16467a8002
$$ -61221 -256715 -82032 -334817 155448 -186241 70157 246014 -142990 116467 -18002
17941c9121H0179a91973f4054b9828A44397e2138b349C40556a84172a7151A44626
$$ -39121 80179 -191973 -64054 -29828 144397 -52138 -2349 340556 -184172 -17151 144626
17929C00991a30069j2881C13553A39712d294A61638b22905d9564A37029e42330
$$ 300991 -130069 -142950 313553 139712 -4294 161638 -222905 -49564 137029 -542330
17918D0687j158Q0921b59638a27831K295L9312D8789k2989d99826H660J50991
$$ 40687 39529 120450 -259638 -127831 -125536 -86224 48789 25800 -499826 8660 159651
17907A59651m9421h0098A64409i3685n8085A71850b3394H0656J00851a10849m7418
$$ 159651 110230 -80098 164409 -93685 -151770 171850 -23394 80656 181507 -110849 -158267
17896a58267f7487j03668h1054C9152a13744A11708a08879c7179k22889D1332
$$ -158267 -67487 -171155 -81054 39152 -113744 111708 -108879 -37179 -260068 41332
17885D322d8098q9718N7768j09739F451J9322a14176D5626J69642J27908A15634
$$ 4322 -48098 -137816 -80048 -189787 6451 25773 -114176 45626 215268 343176 115634
17873c248j57280k10454J02762I7401b88447B47511d3020o1514H1935q208J651
$$ -3248 -160528 -370982 -268220 97401 -288447 247511 -43020 -104534 81935 73727 75378
17862G5378R4701b25608g8898E1107c61616i9779J4779B37454c6833C4333M2445
$$ 75378 170079 -225608 -78898 51107 -361616 -99779 -85000 237454 -36833 34333 76778
17851G6778l4385j1141b5373k02978g0079A43212a48334L0256A39150a29117k31917
$$ 76778 42393 31252 -25373 -228351 -70079 143212 -148334 -118078 139150 -129117 -361034
17840c61034c6296B92211a15219J2585k02751b3157k3707J9080k9537A82313a20181
$$ -361034 -36296 292211 -115219 -102634 -305385 -23157 -46864 -27784 -57321 182313 -120181
17828G1397P6011J23801d8957K1662B8326a44368f1249j94256D4626i0422m9203
$$ 71397 147408 271209 -48957 -27295 28326 -144368 -61249 -255505 44626 -90422 -139625
17817a39625a6885D7771a49067K4419A46310f408l64001A34962f7579e80l1623
$$ -139625 -16885 47771 -149067 -124648 146310 -6408 -370409 134962 -67579 -580 -32203
17806c2203j46438A49280f9774a2987A20755j628a49645E7002a32390n1519R0614
$$ -32203 -178641 149280 -69774 -12987 120755 119127 -149645 57002 -132390 -183909 -93295
17795i3295A48874J86153C4738K09811A00021d0696o5414n503G9082g5458A53226
$$ -93295 148874 335027 34738 244549 100021 -40696 -106110 -111613 79082 -75458 153226
17783b17028g6278b9849j51845D1274a90619j83210D7902h0500B27973c04365
$$ -217028 -76278 -29849 -181694 41274 -190619 -373829 47902 -80500 227973 -304365
17772a87862e6862A9091J016M2375J61563q3026b9763m00804A10832i4469C63681
$$ -187862 -56862 19091 20107 62482 224045 141019 -29763 -430567 110832 -94469 363681
17760a12390J3052k35904g5825A5588J26815b6526I3273g545j03571k4345j2032
$$ -112390 -99338 -335242 -75825 15588 142403 -26526 93273 -7545 -111116 -135461 -147493
17749a47493A08337a12151A02816a38402j1394n6209A0888O981d40656G9950B8490
$$ -147493 108337 -112151 102816 -138402 -149796 -206005 10888 17869 -440656 79950 28490
17737B61616k9092i7793k43720a2989l90081i5398A55411a2036B29452f5292l1478
$$ 261616 232524 -97793 -341513 -12989 -403070 -95398 155411 -12036 229452 -65292 -96770
17726i6770C58100b862A0230L88569A78451a62013B86123a47016b4871A70136
$$ -96770 358100 -2862 10230 398799 178451 -162013 286123 -147016 -24871 170136
17715E6563A8096K64235a38564e0516l6944B16810h2836A2223Q6908D5273a30019
$$ 56563 18096 282331 -138564 -50516 -87460 216810 -82836 12223 99131 45273 -130019
17703A6234L20619j51489b08093A76638D5511g9165A9856b8742B21980a947k22096
$$ 16234 336853 185364 -208093 176638 45511 -79165 19856 -28742 221980 -1947 -224043
17692b24043j61236f8043K3365k59544A02786O4256a37275f0625q9709d6049A56987
$$ -224043 -385279 -68043 -44678 -304222 102786 167042 -137275 -60625 -150334 -46049 156987
17680E8027d0426j47139A697a69621p7896D5277a55628A16560B7214J50247p7880
$$ 58027 -40426 -187565 1697 -169621 -247517 45277 -155628 116560 27214 177461 99581
17669I9581h5323E0254a16311e4182k8490C4732c31622a16449A7091R9158L9913
$$ 99581 -85323 50254 -116311 -54182 -82672 34732 -331622 -116449 17091 116249 156162
17658A56162m645j2928a43463C55515a5151B20358E9706R8367o7796j991l3020
$$ 156162 151517 138589 -143463 355515 -15151 220358 59706 158073 90277 88286 55266
17647E5266N9558b11464B91823A11969e8619b8236B72792A00153D5819j3902i1853
$$ 55266 114824 -211464 291823 111969 -58619 -28236 272792 100153 45819 31917 -91853
17635C6780P1858l9008a52140b5518A51524d686l4226B20371d9929m3361G7915
$$ 36780 108638 69630 -152140 -25518 151524 -4686 -38912 220371 -49929 -93290 77915
17623I8146b6031E5433J47035N6751K09301A58854c69362A30739A5933K01166
$$ 98146 -26031 55433 202468 259219 468520 158854 -369362 130739 15933 217099
17613B17099b2049A80018a60448q0488a301A9383K2340c9960A01128c84708F7232
$$ 217099 -22049 180018 -160448 -240936 -1301 19383 41723 -39960 101128 -384708 67232
17601i1815L0817n1690G8641A6783e2779B9793R4509a5819l01534F8071f6783
$$ -91815 -60998 -112688 78641 16783 -52779 29793 124302 -15819 -317353 68071 -66783
17589C40015a82999A36182i192H4268a13991c0307C6596j3250L15676d0929j79741
$$ 340015 -182999 136182 -9192 84268 -113991 -30307 36596 23346 339022 -40929 -220670
17578b20670q7987B92942j33570p376J82144j40549g3850J9054m2733n265L1611
$$ -220670 -308657 292942 159372 151996 334140 193591 -73850 -54796 -97529 -102794 -71183
17567g1183A631a52521E7983K92405a98621H1210b49151B72369b9038A88798h2371
$$ -71183 1631 -152521 57983 350388 -198621 81210 -249151 272369 -29038 188798 -82371
17555A44580d866j06515m15948J24576C89157j94517e5495r9691b9180A31139
$$ 144580 -4866 -111381 -527329 -402753 389157 194640 -55495 -155186 -29180 131139
17544g5481G5936A1817Q6024e601A95707B2440M34062I1764a33371m3793k39082
$$ -75481 75936 11817 97841 -5601 195707 22440 456502 91764 -133371 -177164 -416246
17533d16246A21984a20695k5253l6543C81475h0054A8698J87263b1626G9270e8950
$$ -416246 121984 -120695 -145948 -182491 381475 -80054 18698 205961 -21626 79270 -58950
17521B49489C2172b20323A38759b97397H8741k3234L06010q5915K6956R0985j94871
$$ 249489 32172 -220323 138759 -297397 88741 65507 371517 285602 312558 403543 208672
17510B08672l5391e9928A87328r2332K95670H7463k3236k2294J7768K6315l9097
$$ 208672 173281 -59928 187328 94996 390666 87463 64227 41933 59701 86016 46919
17499D6919f7434A76179O5236A00798d24971e9219A70454g4576E2229f5675A22725
$$ 46919 -67434 176179 241415 100798 -424971 -59219 170454 -74576 52229 -65675 122725
17487A03074J46492Q1140A29469N9199a29228B66634m7875F0409K31573A33598
$$ 103074 249566 330706 129469 188668 -129228 266634 218759 60409 291982 133598
17476A21608m7349k8697K53610I1302c8276B81197J11105J44076h5650I472J77958
$$ 121608 74259 45562 299172 91302 -38276 281197 392302 536378 -85650 9472 187430
17465A87430N1723m4872c5178a7148B21189B4481d1127k68153D11967h5163j01094
$$ 187430 239153 194281 -35178 -17148 221189 24481 -41127 -309280 411967 -85163 -186257
17454a86257B99188K8175i8332E3902J55787q1722J41866A01546N1912E4528J69316
$$ -186257 299188 327363 -98332 53902 209689 127967 269833 101546 153458 54528 223844
17443B23844A03360K19619F5104M36009A96980m2842J54274N7832A60288g4964
$$ 223844 103360 322979 65104 501113 196980 154138 308412 366244 160288 -74964
17432B45877I9675R9785J33571a55611B83370I2790j0972J90178R1324A45164
$$ 245877 99675 199460 333031 -155611 283370 92790 81818 271996 363320 145164
17421A12507J08421K77175A61645K90930G8856L06193j25778b1809A82259C6934
$$ 112507 220928 498103 161645 452575 78856 385049 259271 -21809 182259 36934
17410A10852K5301K05773j14551A05509B6658J47796L4709r8358B217c9544A1030
$$ 110852 136153 341926 227375 105509 26658 174454 209163 110805 2217 -39544 11030
17398I1551k9766a42166D95441G4709O7085m9424L8605f0105A49038D055L07443
$$ 91551 61785 -142166 495441 74709 141794 92370 130975 -60105 149038 4055 311498
17387C11498j08438f1088E1032L049N637P8865J07862I6326J00987J93472E363
$$ 311498 203060 -61088 51032 54081 59718 138583 246445 96326 197313 390785 5363
17375c28630a42880B2316L59688A09810l1256J39897D1990K72201a81937A2603
$$ -328630 -142880 22316 382004 109810 78554 218451 41990 314191 -181937 12603
17364a13044D05820H9313K86176I2593J93100j34242f7055l9575B28778r6960
$$ -113044 405820 89313 375489 92593 285693 151451 -67055 -106630 228778 131818
17354A31818L9259L7960I1517L2667J66356A02091e8702A69415e9703A44288J08912
$$ 131818 171077 209037 91517 124184 290540 102091 -58702 169415 -59703 144288 253200
17343B53200b02265d3394A4073J81030G1402K26359F0945L6837P0607d7385K2765
$$ 253200 -202265 -43394 14073 195103 71402 297761 60945 97782 168389 -47385 -24620
17332b4620A90374O0106J06044R1070j76753i145A35662a8426C52713A60896n0912
$$ -24620 190374 250480 356524 447594 270841 -9145 135662 -18426 352713 160896 109984
17321A09984M6836R7775J23544I6765D5168J61930o4926h4185A61887J5933c3797
$$ 109984 156820 254595 378139 96765 45168 207098 142172 -84185 161887 177820 -33797
17309c625A56411A932K91491m9609F1089J23412B8674K30056g2619A62348m9997
$$ -3625 156411 1932 293423 243814 61089 184501 28674 258730 -72619 162348 112351
17298A12351b4473B94381a99772C68765b7340A09584K623l356R5150J5847G8231
$$ 112351 -24473 294381 -199772 368765 -27340 109584 112207 108851 204001 219848 78231
17286B84449m3069P8402n4777b55176H5393J29405c3700B11938r6971K6632d4056
$$ 284449 241380 319782 265005 -255176 85393 214798 -33700 211938 114967 141599 -44056
17274C81425g485A25125D3J66602k2022n7472b9743H4992M09152e4890q1721A88365
$$ 381425 -7485 125125 43 166645 144623 87151 -29743 84992 494144 -54890 -136611 188365
17261i5508F8495K99854j71310m4343a9615C24805l9265H7761K88309J26829B47299
$$ -95508 68495 368349 197039 152696 -19615 324805 285540 87761 376070 502899 247299
17249B16458K01055F2148a16056D81530B9030J35823M9604O9958j28112n3722
$$ 216458 417513 62148 -116056 481530 29030 164853 214457 284415 156303 102581
17239A02581K13457p1846E3853p282K24991p5193J37443j58812a74971J8257B33503
$$ 102581 316038 244192 53853 46571 271562 196369 333812 175000 -174971 -156714 233503
17227C05506l7467K14152k24082K79865A89581j5926J6538J44027a23466B07629
$$ 305506 268039 482191 258109 537974 189581 173655 190193 334220 -123466 207629
17216B99985d5269n0674B83558D9323K04708q521A09669J57386J64565b731A93375
$$ 299985 -45269 -95943 283558 49323 254031 245510 109669 267055 431620 -2731 193375
17204B01267Q7165J11650C1690L00330j45338K44172k07402C5379K82686r2946
$$ 201267 288432 400082 31690 332020 186682 430854 223452 35379 318065 225119
17194B25119K62100a61353E6865L43298j83592J01342C2863J60995C3806L30383
$$ 225119 487219 -161353 56865 400163 216571 317913 32863 193858 33806 364189
17184C64189b2512A10777K72434j23331O9844l2043E5891L33803m7493C6284K84042
$$ 364189 -22512 110777 383211 259880 329724 297681 55891 389694 342201 36284 320326
17173C20326E1827K91821A38758J82163B584L03509A36201L47912A68677M5511
$$ 320326 51827 343648 138758 320921 2584 306093 136201 484113 168677 214188
17163B14188l1221K67124q9344K02508A82293E0205J52994J94051j08950J57600
$$ 214188 182967 450091 360747 563255 182293 50205 203199 397250 288300 445900
17153D45900o6152j09451I8445a52971B55913J24831L8193r8763k3418K0719J92480
$$ 445900 379748 270297 98445 -152971 255913 380744 418937 320174 296756 317475 509955
17142E09955j53413j12218J3815N063K59728A95170J69297F2409L16510A17765
$$ 509955 356542 244324 258139 263202 522930 195170 364467 62409 378919 117765
17131C76067J12663j98137l5086L47008k99050K24143B38636J54550P2729K401
$$ 376067 488730 290593 255507 602515 303465 527608 238636 393186 465915 468316
17121D68316j00175N2257B05852K8909O91018B87779N19236l28817J03642j49956
$$ 468316 368141 420398 205852 234761 925779 287779 807015 478198 581840 431884
17111D31884A37698K26701j05019K04357P2584j59756K66956B73339K89417A79973
$$ 431884 137698 364399 259380 463737 536321 376565 643521 273339 562756 179973
17100C10182L01005k47928J37449j961A34456K25008j61585j000k5259J56662
$$ 310182 611187 363259 500708 498747 134456 359464 197879 196879 171620 328282
17090C28282o343c3432E10634L25847k58080A68369g2705D12077J43647c1487
$$ 328282 321939 -33432 510634 836481 578401 168369 -72705 412077 555724 -31487
17079D90494k90m3650A14425P52402B33620P3879J23148j02744K51924q2378j7179
$$ 490494 490204 446554 114425 866827 233620 307499 430647 327903 579827 497449 480270
17068D80270G2835K76502J8934J98486M8616J4752K57144l39934j06026N738j88885
$$ 480270 72835 349337 368271 566757 615373 630125 887269 547335 441309 447047 258162
17057B58162K50812j24565K47331k89457P9730J86897k52971l8729L37332o6538
$$ 258162 508974 384409 631740 342283 422013 608910 355939 317210 654542 588004
17047E88004P1348k88778l2011n4261P3590O02188l65433K70177j57391B30755
$$ 588004 659352 370574 338563 284302 357892 960080 594647 864824 707433 230755
17036E78238K6129J41765l7749J57784j84353B01031L13147J69919B58909J86572
$$ 578238 604367 746132 708383 866167 681814 201031 514178 684097 258909 445481
17026D45481J94299j34589J52391k46684j10228L52712L59406B50172K45088J75503
$$ 445481 639780 505191 657582 410898 300670 653382 1012788 250172 495260 670763
17016F70763j72422j9748p1148n340J77600J24761k7219q1055J32194R0188L9322
$$ 670763 498341 478593 407445 402105 579705 704466 677247 596192 728386 818574 857896
17005H57896J32257m59713L6492K13367q3541K13359l22844N6370J56690N5526
$$ 857896 990153 530440 566932 780299 696758 910117 587273 643643 800333 855859
16995H55859j32023L72360k99123L05726j81440j27752J36328j71584j29200J75520
$$ 855859 723836 1096196 797073 1102799 921359 793607 929935 758351 629151 804671
16985H04671K90804k04809k31116J42468q2333K66169r2011k04101M10244j54750
$$ 804671 1095475 890666 659550 802018 719685 985854 893843 689742 1099986 945236
16975I45236k65148K05205o4208p9490P3101K40714k10713k65899L69909J2103
$$ 945236 680088 885293 821085 741595 814696 1055410 844697 578798 948707 960810
16965I60810p6776k49148L53096k4270j52257J96222l02882L49764k31758J55058
$$ 960810 884034 634886 987982 963712 811455 1007677 704795 1054559 822801 977859
16955I77859J14866j15742J41471J02561j32790o4943K02700k82137r6947J12629
$$ 977859 1092725 976983 1118454 1221015 1088225 1023282 1225982 943845 846898 959527
16945I59527J27481k15021J42891n6676O4946j16161L02319j96235N7250q5757
$$ 959527 1087008 871987 1014878 958202 1023148 906987 1209306 1013071 1070321 984564
16935I84564M8658J78678J03660n1102k69334O03939j25482j88806K21632j84417
$$ 984564 1033222 1211900 1315560 1264458 995124 1599063 1473581 1284775 1506407 1321990
16925A321990K24475l52398O7400j84153J53982J33537j56960L11510k92283M71505
$$ 1321990 1546465 1194067 1261467 1077314 1231296 1364833 1207873 1519383 1227100 1698605
16915A698605l98277m5269L48868j99601J71596j39785j56257N63580M9007n51211
$$ 1698605 1300328 1255059 1603927 1404326 1575922 1436137 1279880 1843460 1892467 1341256
16905A341256N10892l20939j49744j51360N34946k85398J48230J91753l345k18225
$$ 1341256 1852148 1531209 1381465 1230105 1765051 1479653 1627883 1819636 1816291 1598066
16895A598066k6980K5513J19064L4482J8952K84873m44034L34399J1782R1458
$$ 1598066 1571086 1596599 1715663 1750145 1769097 2053970 1609936 1944335 1956117 2047575
16885B047575q648r005J09306j10203J18364o1836j83259L22543j55253Q5758
$$ 2047575 2038927 2029922 2139228 2029025 2147389 2085553 1902294 2224837 2069584 2155342
16875B155342j25074J08815R6203J31134j55847m9974K97587K90n4110J01152
$$ 2155342 2030268 2139083 2235286 2366420 2210573 2160599 2458186 2458476 2404366 2505518
16865B505518j17239K90630m69480K81371J09662J02974m2079K78775J08895l69507
$$ 2505518 2388279 2678909 2209429 2490800 2600462 2703436 2661357 2940132 3049027 2679520
16855B679520N7576L68092L7522P0470j76505L3843M4997k2117J2587J04828r2613
$$ 2679520 2737096 3105188 3142710 3213180 3036675 3070518 3115515 3093398 3105985 3210813 3118200
16844C118200J03802Q0837M33557j83419O0440j42205M24135k28858K78652j97852
$$ 3118200 3222002 3302839 3736396 3552977 3613417 3471212 3895347 3666489 3945141 3747289
16834C747289L29610k70135K20451J38522l07939K19801K11420j69141O04099
$$ 3747289 4076899 3806764 4027215 4165737 3857798 4077599 4289019 4119878 4723977
16825D723977l49024M7978K80350L074j45213P34932k26526K4400L00716j51663
$$ 4723977 4374953 4422931 4703281 4706355 4561142 5296074 5069548 5093948 5394664 5243001
16815E243001j52898M62341l3243K15390M52809j20062N4698K93697K70785j94820
$$ 5243001 5090103 5552444 5519201 5734591 6187400 6067338 6122036 6415733 6686518 6491698
16805F491698R2280K79561O5191L60375L2658O29544r9165M79919r6059k10448
$$ 6491698 6583978 6863539 6928730 7289105 7321763 7951307 7852142 8332061 8236002 8025554
16795H025554K71060N45354j57902R3667N91927L2834M63120P0876L39525J19442
$$ 8025554 8296614 8841968 8684066 8777733 9369660 9402494 9865614 9936490 10276015 10395457
16785A0395457M19984J12513M79781J838O33972L31838L96926K78319K91669O39485
$$ 10395457 10815441 10927954 11407735 11409573 12043545 12375383 12772309 13050628 13342297 13981782
16775A3981782K57545O08414L98575O10500L29455N83488N56024M51415O44864
$$ 13981782 14239327 14847741 15246316 15856816 16186271 16769759 17325783 17777198 18422062
16766A8422062O78285M80527R80451Q85342M36485J002607M45746J096962J033256
$$ 18422062 19100347 19580874 20561325 21446667 21883152 22885759 23331505 24428467 25461723
16757B5461723J201069R24805J288564J065431J449892J254527J814623J303398
$$ 25461723 26662792 27587597 28876161 29941592 31391484 32646011 34460634 35764032
16749C5764032J637052J817996J896674K131672J877612K428147K093853K771143
$$ 35764032 37401084 39219080 41115754 43247426 45125038 47553185 49647038 52418181
16741E2418181K847767L041427K875289L827548L686866L729388M401983M280650
$$ 52418181 55265948 58307375 61182664 65010212 68697078 72426466 76828449 81109099
16733H1109099M925706M755338N242276N619279O207747O013768O746632O732204
$$ 81109099 86034805 90790143 96032419 101651698 107859445 113873213 120619845 127352049
16725A27352049O796611O981192O718514O738406O544303O271188M740351M705830
$$ 127352049 134148660 141129852 147848366 154586772 161131075 167402263 172142614 176848444
16717A76848444L170461K194033J350912k58363j225703k844013l435660n073764
$$ 176848444 180018905 182212938 183563850 183305487 182079784 179235771 175800111 170726347
16709A70726347n603124o111594o763844p301532p148498p219381p214069o868581
$$ 170726347 165123223 159011629 152247785 144946253 137797755 130578374 123364305 116495724
16701A16495724o411638o822336o021994n825176n441799n172576n061595m062247
$$ 116495724 110084086 103261750 97239756 91414580 85972781 80800205 75738610 71676363
16693G1676363m148255m086844l408646l386099l364749k887041k910619j980780
$$ 71676363 67528108 63441264 60032618 56646519 53281770 50394729 47484110 45503330
16685D5503330k355844k681310j582309k346653j450018j698802j444256j700850
$$ 45503330 43147486 40466176 38883867 36537214 35087196 33388394 31944138 30243288
16677C0243288j403159j166063j077598j131771j168753j106029p33332j348090
$$ 30243288 28840129 27674066 26596468 25464697 24295944 23189915 22456583 21108493
16669B1108493m71093j046817k96161q57956q97562m50264j206757J80024r27936
$$ 21108493 20637400 19590583 19294422 18436466 17538904 17088640 15881883 16061907 15133971
16660A5133971o01677l19401l49420m68936o54858k66024m77811k62747o57900
$$ 15133971 14532294 14212893 13863473 13394537 12739679 12473655 11995844 11733097 11075197
16651A1075197m62820k94689j90339L3091n68396k32829l61402m38133J34731
$$ 11075197 10612377 10317688 10127349 10160440 9592044 9359215 8997813 8559680 8694411
16642H694411j35902o16391J65599m36166m82219J20909j19051n7602j79263m88409
$$ 8694411 8558509 7942118 8107717 7671551 7189332 7310241 7191190 7133588 6954325 6465916
16632F465916o5395L15428n21581j74573j40037N7620m99299k70844K47263r4761
$$ 6465916 6400521 6715949 6194368 6019795 5879758 5937378 5438079 5167235 5414498 5319737
16622E319737L09759n94608l24727J19129l07046k1478o4532m7643l0341m7798
$$ 5319737 5629496 5034888 4710161 4829290 4522244 4500766 4436234 4388591 4358250 4310452
16612D310452J08l34045o4420N0516j01226m93533L65395m01642J17467n9795
$$ 4310452 4310560 3976515 3912095 3962611 3861385 3367852 3733247 3331605 3449072 3389277
16602C389277J56734m80923Q7407M0725j65542J66475k5384k28009r1634k39161
$$ 3389277 3546011 3065088 3152495 3193220 3027678 3194153 3168769 2940760 2849126 2609965
16592B609965J13268K59660j03537l90824K52526J47209m35203J20107j17939
$$ 2609965 2723233 2982893 2879356 2488532 2741058 2888267 2453064 2573171 2455232
16583B455232K5398q328j92714P9989k33459J67410p2269l68693K22484m4886
$$ 2455232 2480630 2472302 2279588 2359577 2126118 2293528 2221259 1852566 2075050 2030164
16573B030164J70566l91485n1214r3619K57086N8360K49888n43702k18698K52141
$$ 2030164 2200730 1809245 1758031 1664412 1921498 1979858 2229746 1686044 1467346 1719487
16563A719487N0855k39206J96565k668O1531J25553m81842L48814l72454K55642
$$ 1719487 1770342 1531136 1727701 1725033 1786564 1912117 1430275 1779089 1406635 1662277
16553A662277j62396L0789O2924j89018j5829p9649J92746J61655l04534K1809
$$ 1662277 1499881 1530670 1593594 1404576 1388747 1309098 1501844 1663499 1358965 1380774
16543A380774J9186j33722j70563M63229j95554J00401M0936j49801k28717j8293
$$ 1380774 1399960 1266238 1095675 1558904 1363350 1463751 1504687 1354886 1126169 1107876
16533A107876K27196k4193j13j10636m1475j24122J7641P5566m11677K43541r3353
$$ 1107876 1335072 1310879 1310766 1200130 1158655 1034533 1052174 1127740 716063 959604 866251
16522H66251N7613L55899P2690l83274O1482p7439j64548K77530k94167L14075
$$ 866251 923864 1279763 1352453 969179 1030661 953222 788674 1066204 772037 1086112
16512A086112m14225L82911k51635J27175D60407M44984o9262M6258J4576p4085
$$ 1086112 671887 1054798 803163 930338 460407 905391 836129 882387 896963 822878
16502H22878N5876J49318k38107k3326N6417r1775J28565j20233j74496J39843
$$ 822878 878754 1028072 789965 766639 823056 731281 859846 739613 565117 704960
16492G04960l4977L01645D37459L56303k62719M74127k13549K63017C17571L34327
$$ 704960 669983 971628 437459 793762 531043 1005170 791621 1054638 317571 651898
16482F51898J88378q7076j52523L64097j34261r445M0903j42891k31205K42969
$$ 651898 840276 753200 600677 964774 830513 821068 861971 719080 487875 730844
16472G30844p5263m3740J58604j07926j83805L5973K37325o7763B88170N05203
$$ 730844 655581 611841 770445 662519 478714 514687 752012 684249 288170 793373
16462G93373k32369K30272l19324L8533m401L09265C15275o986J88757k8291j66271
$$ 793373 561004 791276 471952 510485 506084 815349 315275 308289 497046 468755 302484
16451C02484L01503B64667N1234M20165k51495R5492k69623k2629K09547O0624
$$ 302484 603987 264667 315901 736066 484571 580063 310440 287811 497358 557982
16441E57982o6535k28613K83145L2870m2759p4091K9225J56069A68954M18925
$$ 557982 491447 262834 545979 578849 536090 461999 491224 647293 168954 587879
16431E87879B10699K40705j47191j14771M96081j49348j30102j62280J12888k2574
$$ 587879 210699 451404 304213 189442 685523 536175 406073 243793 356681 334107
16421C34107K78849B73907J7100k6304J38940l1846J45947j36134Q4166A32353
$$ 334107 612956 273907 291007 264703 403643 371797 517744 381610 465776 132353
16410D03929J40745A96532k7848k3561O16835k50407k9698B07392J11275j36218
$$ 403929 544674 196532 168684 145123 761958 511551 481853 207392 318667 182449
16400A82449L2494J95422E3698L92299h1778D67176j63406Q9480C8577K38050
$$ 182449 214943 410365 53698 445997 -81778 467176 303770 393250 38577 276627
16390B76627O3713a4383B77588J16796E5360M08875j90074R8802j63250Q7470
$$ 276627 340340 -14383 277588 394384 55360 464235 274161 372963 209713 297183
16380B97183O0460q6309m6092j12161m3486P0307B1808L01949e4733D24101e5418
$$ 297183 357643 271334 225242 113081 69595 139902 21808 323757 -54733 424101 -55418
16368B26132J03678q7298j9354k582j4269n7208m4568K14866J01977f2747C13253
$$ 226132 329810 242512 223158 220576 206307 149099 104531 319397 421374 -62747 313253
16356B07700A8809J35314J28893j31946q0m6906B0761h9350A05119L3431a52985
$$ 207700 18809 154123 283016 151070 150990 104084 20761 -89350 105119 138550 -152985
16344E9357B2577d1460C18794j46076M8788q4931K61132G7180J50608J64187b0488
$$ 59357 22577 -41460 318794 172718 221506 136575 397707 77180 227788 391975 -20488
16332D83583F0652K16293L5395A18139R9502a88969A27523N4012q7485c9048C45066
$$ 483583 60652 276945 312340 118139 217641 -188969 127523 181535 94050 -39048 345066
16320a78934D1136N46122d3977B13796e18C55893E8584K8863d1755B1794o215
$$ -178934 41136 587258 -43977 213796 -518 355893 58584 87447 -41755 21794 15579
16309A5579R3810K17722c7830j98223E80347g9537c11E194J02765g9060A60458
$$ 15579 109389 327111 -37830 -236053 580347 -79537 -311 5194 107959 -79060 160458
16297C36499a54877d3286k745C6031a29814D4465F209N1473R0789Q7198F6357
$$ 336499 -154877 -43286 -46031 36031 -129814 44465 6209 57682 148471 235669 66357
16285a18178C0728P8898K31269b07154A30763M79305A43949H248L00894j49063
$$ -118178 30728 109626 340895 -207154 130763 610068 143949 8248 309142 160079
16275A60079Q7575A917R4189L27614H3699K30397a6730B08383j02421E2646Q6485
$$ 160079 247654 1917 96106 423720 83699 314096 -16730 208383 105962 52646 139131
16264A39131e8779C52092j49673b8371l56080g7181D2463Q8931a09231B08723
$$ 139131 -58779 352092 202419 -28371 -384451 -77181 42463 131394 -109231 208723
16253a77987f0881A96051d46096B9789a7931A51508J52267A18816J13580H1630
$$ -177987 -60881 196051 -446096 29789 -17931 151508 303775 118816 232396 81630
16242B09938B339R2468L5424a40337e3030j3502B6493N6285a82800c6253A87900
$$ 209938 2339 94807 130231 -140337 -53030 -66532 26493 82778 -182800 -36253 187900
16230a80459e468C05511A875N183b16307B42381E5242e8785C39980A52477a31163
$$ -180459 -5468 305511 1875 7058 -216307 242381 55242 -58785 339980 152477 -131163
16218a89404B95695I6980O6932d1950j36845B02906c16024B73544A55N1709a73264
$$ -189404 295695 96980 163912 -41950 -178795 202906 -316024 273544 155 51864 -173264
16206B71855e4770g854A66905J26392D6229d3073G2334l0827K8147K15551j23114
$$ 271855 -54770 -7854 166905 293297 46229 -43073 72334 41507 69654 285205 162091
16195A62091b34738A73731o9894K79088F5843a4726B44707j7553i4518k9136H9040
$$ 162091 -234738 173731 103837 382925 65843 -14726 244707 227154 -94518 -123654 89040
16183a27104A14800f5213a1831A83820b33986H008d17185A17133a23900j78982
$$ -127104 114800 -65213 -11831 183820 -233986 8008 -417185 117133 -123900 -302882
16173c02882A54200J19729b18461c290C90674b61316A35316F3297e969k1929C42210
$$ -302882 154200 273929 -218461 -3290 390674 -261316 135316 63297 -5969 -27898 342210
16161B84384A41745o8048b65031K9393A59769c20195C28623a01766B87278a56467
$$ 284384 141745 73697 -265031 -235638 159769 -320195 328623 -101766 287278 -156467
16150g3994b0791C57059I6266J34811a00987A05070d63B60170b69558g3924D1638
$$ -73994 -20791 357059 96266 231077 -100987 105070 -463 260170 -269558 -73924 41638
16138B02713Q8563A05237b81857a14133B87617p1164a96294D6603K53826m7305
$$ 202713 291276 105237 -281857 -114133 287617 216453 -196294 46603 300429 253124
16128B53124a16433B03137l8486A6715J05004J28823a89457B36458C6976g5886
$$ 253124 -116433 203137 164651 16715 121719 250542 -189457 236458 36976 -75886
16117A30174d67327K15208A62948q0749k850Q3063j4697b07145c358B9710q08
$$ 130174 -467327 -252119 162948 82199 79349 162412 147715 -207145 -3358 29710 28902
16106B8902e6079H0785i1020c3076j187K903C17873A4009O7068f5774F9072h3536
$$ 28902 -56079 80785 -91020 -33076 -34263 -31360 317873 14009 81077 -65774 69072 -83536
16093i4580n6193e9945b0167l00196A59929a01701B33252G9270J7703d1945J96
$$ -94580 -150773 -59945 -20167 -320363 159929 -101701 233252 79270 96973 -41945 -41749
16082d1749D771J49146c35303I6380B9204Q9577b41491D6086a66743P5383j16381
$$ -41749 4771 153917 -335303 96380 29204 118781 -241491 46086 -166743 -91360 -207741
16071b07741A28436A3870J84198E6933K1240J8165b62413r4136F6229h9520j31373
$$ -207741 128436 13870 198068 56933 78173 96338 -262413 -356549 66229 -89520 -220893
16060b20893i2660C88054i4466D6306f1844r6755n3159B9966f0177m0863o9790
$$ -220893 -92660 388054 -94466 46306 -61844 -158599 -211758 29966 -60177 -101040 -170830
16049a70830k7714e0518A15492d052l93549h8283A83007a00136A69955K7569a69574
$$ -170830 -198544 -50518 115492 -4052 -397601 -88283 183007 -100136 169955 197524 -169574
16037A47675c07137Q4083E9073k6400a65127O0723C4841b427A22916H674c00652
$$ 147675 -307137 -223054 59073 32673 -165127 -104404 34841 -2427 122916 8674 -300652
16025a20007C54610e1661r9407A82305f8981m8148j99268J49644B21481a28349
$$ -120007 354610 -51661 -151068 182305 -68981 -117129 -316397 -166753 221481 -128349
16014E3038a25253N1960K0558n6385B82703f1005A33434D328d681D8733M3187
$$ 53038 -125253 -73293 -52735 -109120 282703 -61005 133434 4328 -4681 48733 91920
16003I1920D0815J62667B4976K19618F8110f5330l62335B65915n0973p7856J89326
$$ 91920 40815 203482 24976 244594 68110 -65330 -427665 265915 214942 137086 326412
15992C26412a39066J6546A63663c7354J6019G5259j1131m977q55L94173c871j9936
$$ 326412 -139066 -122520 163663 -37354 -21335 75259 64128 59151 58296 452469 -3871 -23807
15980b3807E36721A91008N9881c42729b9522A41468g723p2989A97294C8334L15272
$$ -23807 536721 191008 250889 -342729 -29522 141468 -7723 -80712 197294 38334 353606
15969C53606E1361R8756o7340P702a2882q0333j22344B06709a41759j01709F5371
$$ 353606 51361 150117 82777 90479 -12882 -93215 -215559 206709 -141759 -243468 65371
15957F532K40804A4094b07197h4601j4404j51003A82174a45494a612H6090M3098
$$ 6532 247336 14094 -207197 -84601 -99005 -250008 182174 -145494 -1612 86090 129188
15946A29188b08612b0780k67890m4051F6915N7423D7256J34016b86616C9536J32126
$$ 129188 -208612 -20780 -288670 -332721 66915 124338 47256 181272 -286616 39536 171662
15935A71662G6035a55769B32768j10655d9576A53848C5741L37372i6066c8854
$$ 171662 76035 -155769 232768 122113 -49576 153848 35741 373113 -96066 -38854
15924a51605k899k49766h1465B0011c2709o9587j40335A2523O5252b00847f9805
$$ -151605 -154504 -404270 -81465 20011 -32709 -102296 -242631 12523 77775 -200847 -69805
15912A55676E7281j0478J59366e7995q6201N0109C29415d19078I4576h8552A16886
$$ 155676 57281 46803 206169 -57995 -144196 -94087 329415 -419078 94576 -88552 116886
15900E3547d82722A81241B0408a57113K656B5282a16439b5392j14513j40565a06286
$$ 53547 -482722 181241 20408 -157113 -154457 25282 -116439 -25392 -139905 -280470 -106286
15888a07460A66809g3076C40169a09495B492q6K8910J5347A7405b16146e6574
$$ -107460 166809 -73076 340169 -109495 2492 2406 31316 46663 17405 -216146 -56574
15876A59108a35376C1018a20193k2695O5224F1019i7424L3187a559B9240b03678
$$ 159108 -135376 31018 -120193 -142888 -77664 61019 -97424 -64237 -1559 29240 -203678
15864F4903b1690A00037e4593E9131b65766A03790b84173a9422k17204A70177
$$ 64903 -21690 100037 -54593 59131 -265766 103790 -284173 -19422 -236626 170177
15853b98400a5313A48517a67267j17826b4496I330b59833i9686A56185K4428B9571
$$ -298400 -15313 148517 -167267 -285093 -24496 9330 -259833 -99686 156185 180613 29571
15841a43710A22865e5579A41620f2662c925A66048P1394a14632M6578l85510R1621
$$ -143710 122865 -55579 141620 -62662 -3925 166048 237442 -114632 -68054 -453564 -361943
15830c61943a52428E4123J05918a83847m1676K6445C639b41040D463L6625a21996
$$ -361943 -152428 54123 160041 -183847 -225523 -199078 3639 -241040 4463 41088 -121996
15818a61474I6150b35274q7673h4873D60a56837A2905J72532a87917i0248j39045
$$ -161474 96150 -235274 -322947 -84873 460 -156837 12905 185437 -187917 -90248 -229293
15807b29293d5677q9952a6631j77364L9204B2347c16996C17995A41396E0596q393
$$ -229293 -45677 -135629 -16631 -193995 -154791 22347 -316996 317995 141396 50596 42203
15796D2203A376J61088a28323B22573d142A22034i98j89290C6457K4803O4401
$$ 42203 1376 162464 -128323 222573 -4142 122034 -998 -190288 36457 61260 125661
15785A25661a26782a1006L553B43798l9426a73063Q6341j32130R288B4499M334
$$ 125661 -126782 -11006 -7453 243798 204372 -173063 -86722 -218852 -209564 24499 28833
15774B8833a09274j81067a37547L5726a578k61404B24042b35359h9253G4927j2179
$$ 28833 -109274 -290341 -137547 -101821 -1578 -262982 224042 -235359 -89253 74927 62748
15763F2748P9025o4502A14J86051A7595a82903e069B0850Q1504M4017j7297L5234
$$ 62748 141773 77271 114 186165 17595 -182903 -5069 20850 102354 146371 129074 164308
15751A64308a29780B4537M9933a65144p636N6352e1759Q213q4470E1419j0344
$$ 164308 -129780 24537 74470 -165144 -172780 -116428 -51759 -43546 -128016 51419 41075
15740D1075f0666b0028B96752m6911f7342A17199c093j70885A88193E9564J02991
$$ 41075 -60666 -20028 296752 249841 -67342 117199 -3093 -173978 188193 59564 162555
15729A62555G2100Q021L9231a24230G073J65226C7679L3415f7255n9434A28653
$$ 162555 72100 80121 119352 -124230 7073 172299 37679 71094 -67255 -126689 128653
15717A146K38497F3627B2809J24857F7424g766k93821D0082c31505G5335j6004
$$ 1146 239643 63627 22809 147666 67424 -7766 -301587 40082 -331505 75335 59331
15706E9331F099b08431A27560a33037E9784e6696j6704A16078J10182F1013d8784
$$ 59331 6099 -208431 127560 -133037 59784 -56696 -73400 116078 226260 61013 -48784
15694a8219B20141h2353j3687d2559a8352j60757A30900f7506G7304b77826A15226
$$ -18219 220141 -82353 -96040 -42559 -18352 -179109 130900 -67506 77304 -277826 115226
15682E5203J10912b81050A80185c2687O206j3256A47437f1257C32669G0415b0721
$$ 55203 166115 -281050 180185 -32687 -26481 -39737 147437 -61257 332669 70415 -20721
15670a06317j53513H9346J6331J0768a59392A63689b39240o3917L1295f1796j41605
$$ -106317 -259830 89346 105677 116445 -159392 163689 -239240 -303157 -271862 -61796 -203401
15659b03401A35017i3678l3131e9942D9991a38653j67577H6080a47875K5600A23231
$$ -203401 135017 -93678 -126809 -59942 49991 -138653 -306230 86080 -147875 -122275 123231
15647D58377B06400c99577A68795i7732B18834C1468P2460B6065c3793p6138p9564
$$ 458377 206400 -399577 168795 -97732 218834 31468 103928 26065 -33793 -109931 -189495
15636a89495B3837F622a2030j70767A82961d104B59463b63985J1796A5535e5624
$$ -189495 23837 6622 -12030 -182797 182961 -4104 259463 -263985 -252189 15535 -55624
15624C63410e09584G329f1026a3425j69389B30540a11277k97502a2438l2473j73001
$$ 363410 -509584 7329 -61026 -13425 -182814 230540 -111277 -408779 -12438 -44911 -217912
15613b17912A86065d5999r0367H263a26738A67394a91591B44446h4629C5847a53577
$$ -217912 186065 -45999 -136366 8263 -126738 167394 -191591 244446 -84629 35847 -153577
15601b4866A87579m2165b98187F5113B1710f5800A7679F949b52341c1674m8296
$$ -24866 187579 145414 -298187 65113 21710 -65800 17679 6949 -252341 -31674 -79970
15590g9970C2936J19240b1704j70483H6071J29944j03073a56417G5812R286L27946
$$ -79970 32936 152176 -21704 -192187 86071 216015 112942 -156417 75812 85098 413044
15579D13044A90946A8336c1118A46276p2398a63629K6566r3457J13270j300k92242
$$ 413044 190946 18336 -31118 146276 73878 -163629 -137063 -230520 -117250 -118550 -410792
15568d10792B6893c4598o4926a3122k11553A45524A4407a24047C48533a29500
$$ -410792 26893 -34598 -99524 -13122 -224675 145524 14407 -124047 348533 -129500
15557a17247N4523o0023C1767b63540A55085a99114e2605r9160C4121a1163k09945
$$ -117247 -62724 -122747 31767 -263540 155085 -199114 -52605 -151765 34121 -11163 -221108
15546b21108B71181c1289j61329d8889B38364F3179c5646B26737l3961p5258a4488
$$ -221108 271181 -31289 -192618 -48889 238364 63179 -35646 226737 192776 117518 -14488
15534D263e5634A11183e6173I8747B0000K57805n7656a20312k7005n479j18669
$$ 4263 -55634 111183 -56173 98747 20000 277805 220149 -120312 -147317 -152796 -271465
15523b71465A90003a19978p8622A56368f6451C1171a73214B554a01642b4063m3096
$$ -271465 190003 -119978 -198600 156368 -66451 31171 -173214 2554 -101642 -24063 -67159
15512f7159D2887c39988G327J8107e7773F4562f6595j9563K1950A30418k6255
$$ -67159 42887 -339988 7327 25434 -57773 64562 -66595 -86158 -64208 130418 104163
15501A04163J40270b8591B36725b24598n45A94903A2076M3464e1007g056j83784
$$ 104163 244433 -28591 236725 -224598 -225143 194903 12076 55540 -51007 -7056 -190840
15490a90840A56311a24078k2278A60898b35651g6946C6992g8380m17025a00142
$$ -190840 156311 -124078 -146356 160898 -235651 -76946 36992 -78380 -495405 -100142
15479A23761g5395a0120B13448f8971B8552a42481j80791A29087f6378K7138A64727
$$ 123761 -75395 -10120 213448 -68971 28552 -142481 -323272 129087 -66378 -39240 164727
15467e3358l05053A42310J80024b19588L4078A5813a78358k0807A58736a72327
$$ -53358 -358411 142310 322334 -219588 -185510 15813 -178358 -199165 158736 -172327
15456a99132L6635f9047k3132A46220l3846L9653G0603a57450o8123E7926P4815
$$ -199132 -162497 -69047 -92179 146220 112374 152027 70603 -157450 -225573 57926 132741
15445A32741J30390a19825a7603C9071c2134j16443F1108N2582a25963A46736
$$ 132741 263131 -119825 -17603 39071 -32134 -148577 61108 113690 -125963 146736
15434a8937C9591J08984c94161A97812I805b05659k36860A25186M0920F0011A7255
$$ -18937 39591 148575 -394161 197812 9805 -205659 -442519 125186 166106 60011 17255
15422B9245a28252j86106b7762H9146J25320d0823k95510d5484j19523A12711
$$ 29245 -128252 -314358 -27762 89146 214466 -40823 -336333 -45484 -165007 112711
15411A26193m4646A8756a20462C05869g8282B16445E3106F936P0323a05106J9503
$$ 126193 81547 18756 -120462 305869 -78282 216445 53106 6936 77259 -105106 -85603
15400h5603j79196a13000n9860K2914A58273J68671i0536c8943N35k15934g1520
$$ -85603 -264799 -113000 -172860 -149946 158273 326944 -90536 -38943 -38408 -254342 -71520
15388a4740C6925a12087j06702G1184d5540C7093R3945F0028N9745n5432a77912
$$ -14740 36925 -112087 -218789 71184 -45540 37093 131038 60028 119773 64341 -177912
15376f6255m8867c8341j84916C46488d8971Q237j10922D8184a4665F6358a25320
$$ -66255 -115122 -38341 -223257 346488 -48971 -40734 -151656 48184 -14665 66358 -125320
15364a73286B09054b07587E6852k6473A3042b7601j5321A60240a93210B5123e0888
$$ -173286 209054 -207587 56852 30379 13042 -27601 -42922 160240 -193210 25123 -50888
15352F1437B6973a14889A08341c5758k32876B05252H4073B737L16094e0175j9454
$$ 61437 26973 -114889 108341 -35758 -268634 205252 84073 2737 318831 -50175 -69629
15341f9629A05974Q6898n8052M768J88267g2329D21765a09299B5754b71710h558
$$ -69629 105974 192872 134820 139588 327855 -72329 421765 -109299 25754 -271710 -8558
15329B00524i2351c7843j11706G3356j9948J44863p8436C8613r357M07846j84316
$$ 200524 -92351 -37843 -149549 73356 53408 198271 119835 38613 29256 437102 252786
15318B52786j06315b4963A27920M8839a56184I1661J48412n5583O7846f4660M600
$$ 252786 146471 -24963 127920 176759 -156184 91661 240073 184490 252336 -64660 -60060
15307f0060m4542b8523B6389j0592a0112o2629C2976d8009B51036j18442J14762
$$ -60060 -104602 -28523 26389 15797 -10112 -72741 32976 -48009 251036 132594 247356
15296B47356O4681P2088a69319C11362j23420K84362B31706m4554k1854J19512
$$ 247356 312037 384125 -169319 311362 187942 472304 231706 187152 165298 284810
15286B84810a68031A53579m278R7069H352l5K31457I283b00786A45721k904P4806
$$ 284810 -168031 153579 149301 246370 8352 8317 239774 9283 -200786 145721 142817 217623
15274B17623I8595L31807B13632R1980b10991C32091A63748a19292c0054a3030
$$ 217623 98595 430402 213632 305612 -210991 332091 163748 -119292 -30054 -13030
15263A66937a58131A37330R247B124b7340k04757A22399J71411J8699A04806R4184
$$ 166937 -158131 137330 146577 2124 -27340 -232097 122399 293810 312509 104806 198990
15252A98990r7513m1945J34674R821L13314O68049J48941l94230R59976E56190
$$ 198990 101477 59532 194206 204027 517341 1185390 1334331 940101 1900077 556190
15241C21644A27143B7004J79500C7113g212D1595d960A25545a28780b9366B50719
$$ 321644 127143 27004 206504 37113 -7212 41595 -4960 125545 -128780 -29366 250719
15229D23498b7935B03683b614r7825k93161F3410K37424p6545E9050b3863j12500
$$ 423498 -27935 203683 -2614 -100439 -393600 63410 300834 224289 59050 -23863 -136363
15218a36363B8492L07026C4841J98011g42B04613A1528b4760A64572a28111K3423
$$ -136363 28492 335518 34841 232852 -742 204613 11528 -24760 164572 -128111 -104688
15207a04688F4723J2813a8392B46138p0363a41676B9328F933e130A14351a0911
$$ -104688 64723 77536 -18392 246138 175775 -141676 29328 6933 -5130 114351 -10911
15195I4456B5544d8990m1168A75276K27751D3142J60236a29797q018A22833L0244
$$ 94456 25544 -48990 -90158 175276 403027 43142 203378 -129797 -137815 122833 153077
15184A53077o5003J09580a42853A44744c2590A54361g8751k7770A14721C012b00979
$$ 153077 88074 197654 -142853 144744 -32590 154361 -78751 -106521 114721 3012 -200979
15172F2629f016D69730A90808H8746h837A43705Q5904a64416C79120j06037A06010
$$ 62629 -6016 469730 190808 88746 -8837 143705 229609 -164416 379120 273083 106010
15160a7542G3145g4752A83674k2272R8271a98295B38008e6716A54281K744j6457
$$ -17542 73145 -74752 183674 161402 259673 -198295 238008 -56716 154281 157025 140568
15149A40568a10533E8946J25761a8215j26765A65625B164K73172j26740K2124
$$ 140568 -110533 58946 184707 -18215 -144980 165625 2164 275336 148596 170720
15139A70720a54813A04320N8424e025j89737j6281l7315E2242O7843h73G108K84360
$$ 170720 -154813 104320 162744 -5025 -194762 -211043 -248358 52242 120085 -873 7108 291468
15127B91468e2960A57681a19342C12472n6505k2369H1533a22968B48244a691A68989
$$ 291468 -52960 157681 -119342 312472 255967 233598 81533 -122968 248244 -1691 168989
15115C63225a39348I5889m1350K88544A58131J4792D5444H700L23634F9895K00821
$$ 363225 -139348 95889 54539 343083 158131 172923 45444 8700 332334 69895 270716
15104B70716o513n2319p0969B9979M84937A46295O5900q0665d9582A83859L77729
$$ 270716 264203 211884 140915 29979 514916 146295 212195 131530 -49582 183859 561588
15093E61588I4799J06060E7951A5405a1615j928j26908A21474g8343B35997K35449
$$ 561588 94799 200859 57951 15405 -11615 -13543 -140451 121474 -78343 235997 471446
15082D71446G605L53080A26117A1359b8666F1852L89103j24835r8265a67608C33434
$$ 471446 7605 360685 126117 11359 -28666 61852 450955 326120 227855 -167608 333434
15070a86987A49367a47094D7107a35j14976A43120o5466J2856l7838J68746B3788
$$ -186987 149367 -147094 47107 -135 -115111 143120 77654 90510 52672 221418 23788
15058A48450K24J2501D068J3986J92028B0729J82379K67241h1046A45034n0175
$$ 148450 148674 161175 4068 18054 210082 20729 203108 470349 -81046 145034 94859
15047I4859J72716a42345N9952A84305a133B0434J38211P7711l2539K28174A44860
$$ 94859 267575 -142345 -82393 184305 -1133 20434 158645 236356 203817 431991 144860
15035C6572J94614n2396a87094B15796M6516G5627J42677D7835a1650C79085j15429
$$ 36572 231186 178790 -187094 215796 262312 75627 218304 47835 -11650 379085 263656
15024B63656I4467P6825a78306G7408J34758d8954C98326a71940C17938j01988
$$ 263656 94467 171292 -178306 77408 212166 -48954 398326 -171940 317938 215950
15014B15950A3155K75519j30383R861a55573C97689A47344d4837A17562h3622
$$ 215950 13155 288674 158291 168152 -155573 397689 147344 -44837 117562 -83622
15003d5928A99885J1419J70100r4498N5278A02826P9178O1259L3675K824L841
$$ -45928 199885 211304 381404 286906 342184 102826 182004 243263 276938 279762 283603
14992B83603m929J33091A27353j4798L15949j15089j27176p4701J09634K71724
$$ 283603 278674 411765 127353 112555 428504 313415 186239 111538 221172 492896
14982D92896A79041H8314J15035M658A5158a25948B36397m6392K63669B1307L06579
$$ 492896 179041 88314 203349 208007 15158 -125948 236397 190005 453674 21307 327886
14971C27886R4457A68874O2257O4627A39391L07000A49283J99873f6372B54404
$$ 327886 422343 168874 231131 295758 139391 446391 149283 349156 -66372 254404
14960C82123j72915G8852L08525j05794o4078A05445K1352J01600D204a26462
$$ 382123 209208 78852 387377 281583 217505 105445 126797 228397 4204 -126462
14949A99888j561N4626p7068L22419A90879l7617J01251A10034R2027J58751P5561
$$ 199888 198327 252953 175885 498304 190879 153262 254513 110034 202061 360812 436373
14938D36373q7123q8443G7746J77312A06154a34700B47492Q6444A60673K90226
$$ 436373 349250 260807 77746 255058 106154 -134700 247492 333936 160673 450899
14928D50899A41619N8208q184J46690p8062J77287A78007K01890J13700B26691
$$ 450899 141619 199827 191643 338333 260271 437558 178007 379897 493597 226691
14917B15838o1470o8104L64197k09795J62851A94463o1274a7147C09343A53056
$$ 215838 154368 86264 450461 240666 403517 194463 133189 -17147 309343 153056
14906B01595J42670A24072K59473a6820B11645L11613k23702J83994B39645n9224
$$ 201595 344265 124072 383545 -16820 211645 523258 299556 483550 239645 180421
14896A80421J90487O2025K4254r8909O5545o8086F5848J59510K61756J1893k03232
$$ 180421 370908 432933 457187 358278 423823 355737 65848 225358 487114 499007 295775
14885B95775K86392B48865k9760L57846k25647L68738B5600J58868K36122q125
$$ 295775 582167 248865 219105 576951 351304 720042 25600 184468 420590 412465
14875D12465M9914p5432M8291A37840L44187A99043J08321M09733n9641C17232
$$ 412465 462379 386947 435238 137840 482027 199043 307364 717097 657456 317232
14864C37390J57162B15964p8600K3710N64966C18165k0422r2587J21652j3747
$$ 337390 494552 215964 137364 161074 726040 318165 297743 205156 326808 313061
14854C13061p9821M3708P6675m0824A50096N68809B29638J03287A60867J32290
$$ 313061 233240 276948 353623 312799 150096 718905 229638 332925 160867 293157
14844B93157n2935K59087P2678A24207L33605j96638K16792L50815B83083L70542
$$ 293157 240222 499309 571987 124207 457812 261174 477966 828781 283083 653625
14834F53625k6158j67047j03786q0935A22532N25725j41256F9379M90268A72215
$$ 653625 627467 460420 356634 275699 122532 648257 507001 69379 559647 172215
14823C94758j8119A47037L11914l8170K2636k02448L09908J29241l05013R806
$$ 394758 376639 147037 458951 420781 443417 240969 550877 680118 375105 384911
14813C84911R5481O497n0664P4903M2589J91468l09494k07001p606N06328j83274
$$ 384911 480392 486889 436225 511128 553717 745185 435691 228690 221084 727412 544138
14802E44138j52448K42502k37427J98176j57359j7142O3547K06197j21178k21755
$$ 544138 391690 634192 396765 594941 437582 420440 483987 690184 569006 347251
14792C47251M51785C56006M7937A12110L03018J25851j38857M91455C02640L88295
$$ 347251 799036 356006 403943 112110 415128 540979 402122 893577 302640 690935
14782F90935j44053m8267K25431B91887J49701L1251O8422K0926K9827N2629B69319
$$ 690935 546882 498615 724046 291887 441588 472839 541261 562187 592014 644643 269319
14770E24975N9618k57347N51131l28181J42912o6236j33405L4170k2297O0455
$$ 524975 584593 327246 878377 550196 693108 626872 493467 527637 505340 565795
14760E65795j31362j21157L67154j41265N3100j2673K340j86001L65035j2268
$$ 565795 434433 313276 680430 539165 592265 579592 581932 395931 760966 748698
14750G48698K94088D13901J37601M3274J33309m4061k38933k6853J30379L6767
$$ 748698 1042786 413901 551502 594776 728085 684024 445091 418238 548617 585384
14740E85384k30245M52614k75544l5364M23885k44051J46528k85394m7248K46414
$$ 585384 355139 807753 532209 496845 920730 676679 823207 537813 490565 736979
14730G36979q3001K10987L0562l8865m23921L73028r8698K22881r6669l18020
$$ 736979 653978 864965 895527 856662 432741 805769 707071 929952 833283 515263
14720E15263J1943L4096N5873N3110j66917j03183M39068n5600n3875L45259k06706
$$ 515263 527206 561302 617175 670285 503368 400185 839253 783653 729778 1075037 868331
14709H68331N2992l16782L05113K12682l78679L55796l31183k18806Q6504L70436
$$ 868331 921323 604541 909654 1122336 743657 1099453 768270 549464 635968 1006404
14699A006404D47247M43022j73261L09675k50962k0459Q8669K45206l85252M36694
$$ 1006404 447247 890269 717008 1026683 775721 755262 843931 1089137 703885 1140579
14689A140579m72108M59747l19871J22290D26293O62256k73201j000j67662J79269
$$ 1140579 668471 1128218 808347 930637 426293 1088549 815348 814348 646686 825955
14679H25955J41107j3785N0645Q2191j4893j61323k63139M69424m55703L65515
$$ 825955 967062 953277 1003922 1086113 1071220 909897 646758 1116182 660479 1025994
14669A025994k63360K2594L79764k50128K62569k32688K50498j34120j73886L07669
$$ 1025994 762634 785228 1164992 914864 1177433 944745 1195243 1061123 887237 1194906
14659A194906O5757j79364j11049m2162J40902j81627l7329J20608J74369j42920
$$ 1194906 1260663 1081299 970250 928088 1068990 887363 850034 970642 1145011 1002091
14649A002091j52874J16120K07218O3098k18950j80484J55602K18153J17369l31910
$$ 1002091 849217 965337 1172555 1235653 1016703 836219 991821 1209974 1327343 995433
14639I95433M58213l25814k6613O4510J72243k83928o3125J5180K99881k28686
$$ 995433 1453646 1127832 1101219 1165729 1337972 1054044 990919 1006099 1305980 1077294
14629A077294j10766M68677Q9381j38655k7624k18489n2506L70752P0631m07877
$$ 1077294 966528 1435205 1524586 1385931 1358307 1139818 1087312 1458064 1528695 1120818
14619A120818M63798j39691k8570k76358J93703J51017q5405n1410j72367p013
$$ 1120818 1584616 1444925 1416355 1139997 1333700 1484717 1399312 1347902 1175535 1168522
14609A168522J22318r6395R8408L74265k40913K88825k37024J17904m06868K79791
$$ 1168522 1290840 1194445 1292853 1667118 1426205 1715030 1478006 1595910 1189042 1468833
14599A468833k14971O24070m09732K3407K05768k06850K1222O4573O5277m4866
$$ 1468833 1253862 1877932 1468200 1491607 1697375 1490525 1511747 1576320 1641597 1596731
14589A596731J63609o5416L52692l43556P4889J12006l18589M29558k3636k64255
$$ 1596731 1760340 1694924 2047616 1704060 1778949 1890955 1572366 2001924 1978288 1714033
14579A714033J90843J19431j89784O2877J35833K64608l01682j0448J42658N0346
$$ 1714033 1904876 2024307 1834523 1897400 2033233 2297841 1996159 1985711 2128369 2178715
14569B178715p4352M5129M43301l71640K78509J2584k97456K43607K13751m9217
$$ 2178715 2104363 2149492 2592793 2221153 2499662 2512246 2214790 2458397 2672148 2622931
14559B622931J00391J46425m33378O47664K92928J63947l98748R84027M87651
$$ 2622931 2723322 2869747 2436369 3084033 3376961 3540908 3142160 4126187 4613838
14550D613838R01352J771592L750179P856653J7747224P989440A9510510I265940
$$ 4613838 5515190 7286782 11036961 18893614 36640838 44630278 19510510 9265940
14541E069951k256965p91038k75749r9512J29300j03328J15516L09288j87897
$$ 5069951 2812986 2021948 1746199 1646687 1775987 1672659 1788175 2097463 1909566
14532A909566P1407m9811r0006K20651L9467j5057M81936n31469J44124L45826
$$ 1909566 1980973 1931162 1841156 2061807 2101274 2086217 2568153 2036684 2180808 2526634
14522B526634m05389M32987j15667j23289K28179j93919J30975k66672L75153
$$ 2526634 2121245 2554232 2438565 2315276 2543455 2349536 2480511 2213839 2588992
14513B588992j81040K24397M5911J25995L4111m85652O20116k98229J15670J71304
$$ 2588992 2407952 2632349 2678260 2804255 2838366 2352714 2972830 2674601 2790271 2961575
14503B961575M5548l2208l51167j2003K98355M9180K16195k50981O5030K31700
$$ 2961575 3007123 2974915 2623748 2611745 2910100 2959280 3175475 2924494 2989524 3221224
14493C221224j46874L45467j10337L1811N7520j51595R5423J03450J12450J00698
$$ 3221224 3074350 3419817 3309480 3341291 3398811 3247216 3342639 3446089 3558539 3659237
14483C659237o70687N35245J64725R3310N9257r6512J27140N0965j18521o355
$$ 3659237 2988550 3523795 3688520 3781830 3841087 3744575 3871715 3922680 3804159 3797804
14473C797804m6040L94437j73146L35036k51572K14266j53020m5094K8753J54943
$$ 3797804 3751764 4146201 3973055 4308091 4056519 4270785 4117765 4072671 4101424 4256367
14463D256367J07467k53717M92612k47443N1746J71616M22652l08616j01314L71750
$$ 4256367 4363834 4110117 4602729 4355286 4407032 4578648 5001300 4692684 4591370 4963120
14453D963120l25880J59199O04033n03638K27241L37323j93628o5238K05315J73007
$$ 4963120 4637240 4796439 5400472 4896834 5124075 5461398 5267770 5202532 5407847 5580854
14443E580854M6405L60435m20002J79613K81742L57658l17327k43445M90346J26367
$$ 5580854 5627259 5987694 5567692 5747305 6029047 6386705 6069378 5825933 6316279 6442646
14433F442646N215K51114k08260j13403J02401N14232j56374J95500j47035J56683
$$ 6442646 6447861 6698975 6490715 6377312 6479713 6993945 6837571 7033071 6886036 7042719
14423G042719Q2181K1186N43410k48241r5740K99339J55967J12225N9093K6351
$$ 7042719 7124900 7146086 7689496 7441255 7345515 7644854 7800821 7913046 7972139 7998490
14413G998490K99295j09121l4896L20804K04296M98197n9982J64264m03656N38844
$$ 7998490 8297785 8188664 8153768 8474572 8678868 9177065 9117083 9281347 8877691 9416535
14403I416535L11886k54131L20938L85925p76L42939k80467L88051J00541L09629
$$ 9416535 9728421 9474290 9795228 10181153 10180377 10523316 10242849 10630900 10731441 11041070
14393A1041070J77088K2318K69530N35236p8182K59155J29456L66509M31803J98589
$$ 11041070 11218158 11240476 11510006 12045242 11967060 12226215 12355671 12722180 13153983 13352572
14383A3352572J3877o845L17933L87873M33051K64132L31122Q6032L38478L45193
$$ 13352572 13366449 13359604 13677537 14065410 14498461 14762593 15093715 15179747 15518225 15863418
14373A5863418L50469N1255P07730J09640J03402O27624L66093M64051N8322N81451
$$ 15863418 16213887 16265142 16972872 17082512 17185914 17813538 18179631 18643682 18702004 19283455
14363A9283455M37995O02546L8603P01816O67995N33332P142O92374O31893M75388
$$ 19283455 19721450 20323996 20362599 21064415 21732410 22265742 22272884 22965258 23597151 24072539
14353B4072539N23836Q58457M07192N14023Q63074Q44664J80102J077978M76440
$$ 24072539 24596375 25454832 25862024 26376047 27239121 28083785 28263887 29341865 29818305
14344B9818305Q46405P65343J269129O68642P32714J301061J222235N34856Q42237
$$ 29818305 30664710 31430053 32699182 33367824 34100538 35401599 36623834 37158690 38000927
14335C8000927J486676J343126J188358J115257J448742J175796J243754J551028
$$ 38000927 39487603 40830729 42019087 43134344 44583086 45758882 47002636 48553664
14327D8553664J620681J733811J744246K039006J283850K353802J702503K468765
$$ 48553664 50174345 51908156 53652402 55691408 56975258 59329060 61031563 63500328
14319F3500328K394373K310327K337394K562719L091965L111484K867095L115615
$$ 63500328 65894701 68205028 70542422 73105141 76197106 79308590 82175685 85291300
14311H5291300L828355L423841M069798L910327M492166M558169M786654N096360
$$ 85291300 89119655 92543496 96613294 100523621 105015787 109573956 114360610 119456970
14303A19456970N252248N909351O091007O445116O771172P172374P556646P836741
$$ 119456970 124709218 130618569 136709576 143154692 149925864 157098238 164654884 172491625
14295A72491625Q655547Q883099R525469J0094809J0280080J1207669J1856798
$$ 172491625 181147172 190030271 199555740 209650549 219930629 231138298 242995096
14288B42995096J2268430J2818118J2924752J3973545J3561849J4566455J4491258
$$ 242995096 255263526 268081644 281006396 294979941 308541790 323108245 337599503
14281C37599503J4286852J4152281J4302424J3811402J3163375J2190255J0662630
$$ 337599503 351886355 366038636 380341060 394152462 407315837 419506092 430168722
14274D30168722Q992517N050045J309100K8744q70450j150018k010388m047886
$$ 430168722 439161239 444211284 445520384 445549128 444678678 443528660 441518272 437470386
14266D37470386p181285j0759449j2491058j3882392j4650234j5182749j5961096
$$ 437470386 430289101 419529652 407038594 393156202 378505968 363323219 347362123
14259C47362123j5706941j5816463j5358587j4957733j4729320j3392412j2586699
$$ 347362123 331655182 315838719 300480132 285522399 270793079 257400667 244813968
14252B44813968j2683165j1970174j1172177j0679121j0042035r456227q943852
$$ 244813968 232130803 220160629 208988452 198309331 188267296 178811069 169867217
14245A69867217q332650p695722p395650o909506o657703n851198o394002m883091
$$ 169867217 161534567 153838845 146443195 139533689 132875986 127024788 120630786 115747695
14237A15747695n192266m635468m663556m446736m179016l696289l432250l219174
$$ 115747695 110555429 105919961 101256405 96809669 92630653 88934364 85502114 82282940
14229H2282940l309071k634321l419632k557746k735059k676490k346469k085614
$$ 82282940 78973869 76339548 72919916 70362170 67627111 64950621 62604152 60518538
14221F0518538k399298j701104j762250j750638j771036k001962j234841j368730
$$ 60518538 58119240 56418136 54655886 52905248 51134212 49132250 47897409 46528679
14213D6528679j392427j388029j845711p92708j348370r96582n30873j020277
$$ 46528679 45136252 43748223 41902512 41109804 39761434 38764852 38233979 37213702
14205C7213702j519141r55323j268533q35524p64657m66415q69054j142574m04704
$$ 37213702 35694561 34739238 33470705 32635181 31870524 31404109 30535055 29392481 28987777
14196B8987777j120515o43967p49775o22849m70146m26930r46238m56019l87508
$$ 28987777 27867262 27223295 26473520 25850671 25380525 24953595 24007357 23551338 23163830
14187B3163830o23805k44017q99116l79680n96847m57605k73546k02059m57785
$$ 23163830 22540025 22296008 21396892 21017212 20420365 19962760 19689214 19487155 19029370
14178A9029370o85734J38967q11857j41872n68343m85586j42966k87715m55920
$$ 19029370 18343636 18482603 17670746 17528874 16960531 16474945 16331979 16044264 15588344
14169A5588344k29983N2614m04292m16159k12868m1952n48885J31020l37968l63791
$$ 15588344 15358361 15410975 15006683 14590524 14377656 14335704 13786819 13917839 13579871 13216080
14159A3216080k77958j84641k41120l85848l65864L5546k91619q2229k04545m52369
$$ 13216080 12938122 12753481 12512361 12126513 11760649 11796195 11504576 11422347 11217802 10765433
14149A0765433L09710m55561l51090L85969o32746k77949K18016j67936l12964
$$ 10765433 11075143 10619582 10268492 10654461 10021715 9743766 9961782 9793846 9480882
14140I480882J10656l15470o0951j25402k39618K85808n10834k38242N0528M5737
$$ 9480882 9591538 9276068 9215117 9089715 8850097 9135905 8625071 8386829 8437357 8483094
14130H483094k16284k6072l54671J21282l38838J98480m8225j50948k97332N7091
$$ 8483094 8266810 8240738 7886067 8007349 7668511 7866991 7818766 7667818 7370486 7427577
14120G427577k52929J30178j53238k76253k8554k89388K07290l67736j42460J39082
$$ 7427577 7174648 7304826 7151588 6875335 6846781 6557393 6764683 6396947 6254487 6393569
14110F393569J7972k22024J8726l11576M1516N1706n94857p032K53337l32990
$$ 6393569 6411541 6189517 6208243 5896667 5938183 5989889 5395032 5388000 5641337 5308347
14100E308347J40894K87575m41888K86969m04875j34878L46461j69690l52088
$$ 5308347 5449241 5736816 5294928 5581897 5177022 5042144 5388605 5218915 4866827
14091D866827N9771K774k48142L90500l24196J80470n52548K14408R3270j65356
$$ 4866827 4926598 4929372 4681230 5071730 4747534 4928004 4375456 4589864 4683134 4517778
14081D517778J35919l31311q4668K11946l49813K33974k27792j82399K63065j15333
$$ 4517778 4653697 4322386 4237718 4449664 4099851 4333825 4106033 3923634 4186699 4071366
14071D071366r6171K44044k62220n3203l4858k30688M3325J52682Q2018l29612
$$ 4071366 3975195 4219239 3957019 3903816 3868958 3638270 3681595 3834277 3916295 3586683
14061C586683K64205l53282M75270k5705l20901Q4074j62368J34822j55238o2863
$$ 3586683 3850888 3497606 3972876 3947171 3626270 3710344 3547976 3682798 3527560 3464697
14051C464697l9367k58238K58623p86k14088p9800K85868l40596K20456J3554
$$ 3464697 3425330 3167092 3425715 3424929 3210841 3131041 3416909 3076313 3296769 3310323
14041C310323q6844l99413L38198m13582K22844P1566j51279J02736l19933R3917
$$ 3310323 3223479 2824066 3162264 2748682 2971526 3043092 2891813 2994549 2674616 2768533
14031B768533J3784K21680r6180r1128K3232k47793K57612k25816j33206o0860
$$ 2768533 2782317 3003997 2907817 2816689 2839921 2592128 2849740 2623924 2490718 2429858
14021B429858o5815K14830k18544L54427m03792j1368J29923j22461j93557L06708
$$ 2429858 2364043 2578873 2360329 2714756 2310964 2299596 2429519 2307058 2113501 2420209
14011B420209p6624J82013n50807K55764k49531J10247J85840j71300q6943Q5439
$$ 2420209 2343585 2525598 1974791 2230555 1981024 2091271 2277111 2105811 2018868 2104307
14001B104307m3555l61716L94010R0906j88263J87978J7079j96372L48468j51870
$$ 2104307 2060752 1699036 2093046 2183952 1995689 2183667 2200746 2004374 2352842 2200972
13991B200972o847O72857P99575K206124O644036J7257263J6581373k1435893
$$ 2200972 2194125 2866982 3666557 5872681 12516717 29773980 46355353 24919460
13983B4919460A1754832n004414j829228j184931j86280k96731r1960l66548k10235
$$ 24919460 11754832 6750418 4921190 3736259 3549979 3253248 3161288 2794740 2584505
13974B584505j34202K17370j08371j41841p2493q6202o5009J89341k16970j63251
$$ 2584505 2450303 2667673 2559302 2417461 2344968 2258766 2193757 2383098 2166128 2002877
13964B002877R6612K6860j34567j92068m6541J51072J27015k22260P2360J46362
$$ 2002877 2099489 2126349 1991782 1799714 1753173 1904245 2031260 1809000 1881360 2027722
13954B027722J04810n43309p2711O35199m30116j22859L36905k71737l21691M94807
$$ 2027722 2132532 1589223 1516512 2151711 1721595 1598736 1935641 1663904 1342213 1837020
13944A837020l48957J96156j36536k69335O03607m06106J91544j33036o8878R1101
$$ 1837020 1488063 1684219 1547683 1278348 1881955 1475849 1667393 1534357 1465479 1556580
13934A556580j52253k32685M31983l96627M90492k21308p4404L5641L5157M5674
$$ 1556580 1404327 1171642 1603625 1206998 1697490 1476182 1401778 1437419 1472576 1518250
13924A518250k15086K81222k19297j30921K54988j2344o0136k15476K49677q8078
$$ 1518250 1303164 1584386 1365089 1234168 1489156 1476812 1416676 1201200 1450877 1362799
13914A362799n7943l2406L14193m01053O9518K57517j62024j63120J70034j56095
$$ 1362799 1304856 1272450 1586643 1185590 1255108 1512625 1350601 1187481 1357515 1201420
13904A201420l0379O17252l63094k09026l7717J4870N35919l87784M8477J07938
$$ 1201420 1171041 1788293 1425199 1216173 1178456 1193326 1729245 1341461 1389938 1497876
13894A497876k76668k70623O1001N6141n8089K55633Q0761l45541J61931J89722
$$ 1497876 1221208 950585 1011586 1067727 1009638 1265271 1346032 1000491 1162422 1352144
13884A352144j39136O1048l01074K61319K5942j25698P0420m69811K92085K73357
$$ 1352144 1213008 1274056 972982 1234301 1260243 1134545 1204965 735154 1027239 1300596
13874A300596j25212J65232j32283r3758l64419K89648q1676P4253j52268K08334
$$ 1300596 1175384 1340616 1208333 1114575 750156 1039804 958128 1032381 880113 1088447
13864A088447j47291K18918j48454N5530J59760l13654j00312R2027K10677l13308
$$ 1088447 941156 1160074 1011620 1067150 1226910 913256 812944 904971 1115648 802340
13854H02340K42849k88773L52995k1260j66675K30385l65495j8127L50125m42309
$$ 802340 1045189 756416 1109411 1088151 921476 1151861 786366 768239 1118364 676055
13844F76055K65310J13071j30792k64358N26110J5018k57682K15340j68148D27813
$$ 676055 941365 1054436 923644 659286 1185396 1200414 942732 1158072 989924 427813
13833G37255L31283k16441j67590n2416J62916r5059K08657l89185J88041J97867
$$ 737255 1068538 852097 684507 632091 795007 699948 908605 519420 707461 905328
13823I05328j23988j43428J73411j43273J83517J47862j49692k1287O0156R5946
$$ 905328 781340 637912 811323 668050 851567 999429 849737 828450 888606 984552
13813I84552J24415l33856K87521m45330L15568m56029M3624K57448M7198J48593
$$ 984552 1108967 775111 1062632 617302 932870 476841 520465 777913 825111 973704
13803I73704L4176j73958m7874j74496M47280A59953L62795J90132j30174J68414
$$ 973704 1007880 833922 786048 611552 1058832 159953 522748 712880 582706 751120
13793G51120m3593K18281l53470L00921p2431m4523j32696j51716L95234l26674
$$ 751120 707527 925808 572338 873259 800828 756305 623609 471893 867127 540453
13783E40453o6197J72286r4295J14573O5710k62792q3096K59539k0326N08j16391
$$ 540453 474256 646542 552247 666820 732530 469738 386642 646181 625855 626363 509972
13772E09972K6138J62989l14222L99689p2289l09295L35536k62834J60021K72570
$$ 509972 536110 699099 384877 784566 712277 402982 738518 475684 635705 908275
13762I08275m49657O5987m7476K64269k74873M1871J35538P2904j78304r2497
$$ 908275 458618 524605 477129 741398 466525 508396 643934 716838 538534 446037
13752D46037Q8369j95614M51156p3419p0923k16988M6209r9342L3227L89654k11006
$$ 446037 534406 338792 789948 716529 645606 428618 474827 375485 408712 798366 587360
13741E87360L2197L65194k18852B99082J16399J31398J22426m3145p8762k11824
$$ 587360 619557 984751 765899 299082 415481 546879 669305 626160 547398 335574
13731C35574J77599J57281j96895L30817C15668K05796L126J67029Q843m6224
$$ 335574 513173 670454 473559 804376 315668 521464 524590 691619 700462 654238
13721F54238k14751L20292l64593j44651J42145J05451M2929K95049C96075m510
$$ 654238 439487 759779 395186 250535 392680 498131 541060 836109 396075 391565
13711C91565J0301N4296r4014J76799J46127j11732j24620m5908J84866J9534
$$ 391565 401866 456162 362148 538947 685074 573342 448722 402814 587680 607214
13701F07214j79428O4643r4980j15965J70020q391J83439k13904k04686K86768
$$ 607214 427786 492429 397449 281484 451504 443113 626552 412648 207962 494730
13691D94730J43906J8146J5478j03081o8218k38281q4064M47728j31099O6916
$$ 494730 638636 656782 672260 569179 500961 262680 178616 626344 495245 562161
13681E62161j71727P6204j18348J943L18347k05929B30014O5070L56282g7288
$$ 562161 390434 466638 348290 350233 668580 462651 230014 295084 651366 -77288
13670E53595j43467q173j50368M04790j3177m7805n8083A69576K77197j45576
$$ 553595 410128 401955 251587 656377 643200 595395 537312 169576 446773 301197
13660C01197j28581L94456R2145j73585O8981o62j37965k2027l8408J46619j00383
$$ 301197 172616 567072 659217 485632 554613 553951 415986 393959 355551 502170 401787
13649D01787J77623j80474A69925M52960n9486q5003B31410j7410J22196o1107
$$ 401787 579410 398936 169925 622885 563399 478396 231410 214000 336196 275089
13639B75089J25204j58137J39055L4097K05746l09455N2972K04438c8830E66966
$$ 275089 400293 242156 381211 415308 621054 311599 364571 569009 -38830 566966
13628E85636O1633k98518N8633Q5878N6739A80176r0059J84437P783M23438j57313
$$ 585636 647269 348751 407384 493262 550001 180176 90117 274554 282337 705775 548462
13617E48462C5346M53306k43491J03969P5703l6698R7593k05817K56896H4571
$$ 548462 35346 488652 245161 349130 424833 388135 485728 279911 536807 84571
13606E27132k09455l9631m5672J71692K728I4520L62881L8063B06363J44038m878
$$ 527132 317677 278046 232374 404066 406794 94520 457401 495464 206363 350401 345523
13595C45523k6944J92420I5429N30143k73177n4227o2136J36756N7249A37579
$$ 345523 318579 510999 95429 625572 352395 298168 236032 372788 430037 137579
13584D73160k00086J7523j34340J03465K27588j65837l5165K18855j60495K80132
$$ 473160 273074 290597 156257 259722 487310 321473 286308 505163 344668 624800
13574F24800k93127G4365J32498K49945j03034j45156K42081A89200L67747k48969
$$ 624800 331673 74365 206863 456808 353774 208618 450699 189200 556947 307978
13564C07978J18915J49593k15885J91417F771L69758P9669k23237I4697J31670
$$ 307978 426893 576486 360601 552018 6771 376529 456198 232961 94697 226367
13554B26367n9308l0667J04515P8552j10394K1776K80463g4438F02023j03905
$$ 226367 167059 136392 240907 319459 209065 230841 511304 -74438 602023 498118
13544D98118A82545J36090j04895J53628R8242f4034D40347j70253J85011j6117
$$ 498118 182545 318635 213740 367368 465610 -64034 440347 270094 455105 438988
13534D38988A95760B3392J93817K0120e627C27286A12024e0167A08679J79125
$$ 438988 195760 23392 217209 237329 -5627 327286 112024 -50167 108679 287804
13524B87804m7545n2844P8093J39973j70939J48481j26357n3851J86037h367B33386
$$ 287804 240259 187415 265508 405481 234542 383023 256666 202815 388852 -8367 233386
13512B19408J74170A10704J33174I5183j4311J83466a1096C74743A19184c6714
$$ 219408 393578 110704 243878 95183 80872 264338 -11096 374743 119184 -36714
13501A83472A4168N25746b5256A08203K20956A49204J6597J41075r3927L2627
$$ 183472 14168 539914 -25256 108203 329159 149204 165801 306876 212949 245576
13491B45576A18300K24272g0024C9468L24363m6920I2500J03199Q3706B7750g6189
$$ 245576 118300 342572 -70024 39468 363831 316911 92500 195699 279405 27750 -76189
13479A01747N0644L35998k30411j16695F9662l3556J08596J4942g0368G938J08856
$$ 101747 152391 488389 257978 141283 69662 36106 144702 159644 -70368 7938 116794
13468A16794N9388K46784A64028J24611A27467f9303B95023P5835M3524j63946
$$ 116794 176182 422966 164028 288639 127467 -69303 295023 370858 414382 250436
13458B50436F3474K5479K0919J56934q7065P6411Q0092I958N65988a62294B31667
$$ 250436 63474 88953 109872 266806 179741 256152 336244 9958 575946 -162294 231667
13446B16914K4653Q4832B864J48691F6335J12817J86156k9568J59656j88361D3032
$$ 216914 241567 326399 2864 151555 66335 179152 365308 335740 495396 307035 43032
13434D07010n3415j45189L11888B36K00273E3849M37618A64487O3714r0982q565
$$ 407010 353595 208406 520294 236 200509 53849 491467 164487 228201 137219 128654
13423A28654E671M44199a30864A76375J70040o6367p6588J04544R10P2570R13
$$ 128654 5671 449870 -130864 176375 346415 280048 203460 308004 308914 381484 382397
13412C82397p0243f5663A3997M30127A6033J88089K1266p705A6665K4000K83657
$$ 382397 312154 -65663 13997 444124 16033 204122 225388 217683 16665 40665 324322
13401C24322B5557a7068A42565R0476c081E9646J39588G1758o389c2050C43860
$$ 324322 25557 -17068 142565 233041 -3081 59646 199234 71758 65369 -32050 343860
13389a28061A92511L03422b2444G70f0793B12628n6356J32381o7498G4765k8401
$$ -128061 192511 495933 -22444 770 -60793 212628 156272 288653 221155 74765 46364
13378D6364J28887P8832a73569C49413M4228j34052j27248M74552A20038C2267
$$ 46364 175251 254083 -173569 349413 393641 259589 132341 606893 120038 32267
13367C76626m292j25308N103J97479j72317J18395A75886C1100J19233J69963
$$ 376626 372334 247026 252129 449608 277291 395686 175886 31100 150333 320296
13357C20296A44756B8391b50458J18617B96759e5492A27813K28642D8688M47954
$$ 320296 144756 28391 -250458 -131841 296759 -55492 127813 356455 48688 496642
13347D96642k07925j28354R4545Q6429j57096l326Q7685K37348B10783K35744
$$ 496642 288717 160363 254908 341337 184241 180915 268600 505948 210783 446527
13337D46527l6679B5292L48646K6246e5004B56217J50582L6658K64444E3820K58621
$$ 446527 409848 25292 373938 400184 -55004 256217 406799 443457 707901 53820 312441
13326C12441I7766b49035C38398A57505B8821K07425J9506c2220m8760E73940
$$ 312441 97766 -249035 338398 157505 28821 236246 255752 -32220 -80980 573940
13315B99346j38196P4309e5691J5430C74475j39476a24229B04272F7551M0033
$$ 299346 161150 235459 -55691 -40261 374475 234999 -124229 204272 67551 107584
13305A07584C0319J25656N0985L79905B86033o5383A6676J72855d2883A58120
$$ 107584 30319 155975 206960 586865 286033 220650 16676 189531 -42883 158120
13294A92965J7215J67577j56630a82101C23869K8524A44103m3495J45090q6186
$$ 192965 210180 377757 221127 -182101 323869 352393 144103 100608 245698 159512
13284A59512a22743A63064a84369d7115A34064A3369a74123C44364q6783i3193
$$ 159512 -122743 163064 -184369 -47115 134064 13369 -174123 344364 257581 -93193
13273E03601a19797A59556J36941r7008b22259A41254J03173a5270A70296B746
$$ 503601 -119797 159556 296497 199489 -222259 141254 244427 -15270 170296 2746
13262B15055a54288B42764a8676j01289K3038C23624B9220b8058B79239B9759
$$ 215055 -154288 242764 -18676 -119965 -96927 323624 29220 -28058 279239 29759
13251B55000A4679J31244J0740D3040a25026A27100m0572J09480m2341J8955j1282
$$ 255000 14679 145923 156663 43040 -125026 127100 86528 196008 153667 172622 161340
13240A61340E4346h9899D30792B02751O2152A29500L13392f579A50359f8762F0046
$$ 161340 54346 -89899 430792 202751 264903 129500 442892 -6579 150359 -68762 60046
13228B4346L6131O6017c8088B54343a12883A71487g1387K6155B60300j06719K01968
$$ 24346 60477 126494 -38088 254343 -112883 171487 -71387 -45232 260300 153581 355549
13217C55549c07124h3582C1320J58092l4552L55255A82054q0161J4210L52652
$$ 355549 -307124 -83582 31320 189412 154860 510115 182054 101893 116103 468755
13207D68755C9088O8714N5422k7110L14476g7468A25609D4255J82069B6710R5361
$$ 468755 39088 107802 163224 136114 450590 -77468 125609 44255 226324 26710 122071
13196A22071j2992b1813A41781n8631K85945E889c39373G7775J37136J66856H7734
$$ 122071 109079 -21813 141781 83150 369095 5889 -339373 77775 214911 381767 87734
13184c6578l9095F8640e819B49241J2915C3882a5036C3312b9082A62882G0117
$$ -36578 -75673 68640 -5819 249241 262156 33882 -15036 33312 -29082 162882 70117
13172h701B41842P5020j23795K03928A44277K72849c01275b3069q271A43761f4560
$$ -8701 241842 316862 193067 396995 144277 417126 -301275 -23069 -31340 143761 -64560
13160B02399k0299A6938J02255j6985f5824i002I2248H50N1249a9424B01290g886
$$ 202399 182100 16938 119193 102208 -65824 -9002 92248 850 52099 -19424 201290 -7886
13147B23876G827c3351l74892A72748B3010K24436d7850d380A67325J12574k5113
$$ 223876 7827 -33351 -408243 172748 23010 247446 -47850 -4380 167325 279899 254786
13136B54786p6504d8516n4359L141L1169a0212p5111C11057J36055G046a64963
$$ 254786 178282 -48516 -102875 -99734 -68565 -10212 -85323 311057 447112 7046 -164963
13124C66575i1039D7909b07268J00401B0211g5555C0073c5776C02328B5908a56237
$$ 366575 -91039 47909 -207268 -106867 20211 -75555 30073 -35776 302328 25908 -156237
13112I2726K7822O9902d12778B32159b8861B22930g8223A38389B1498J97410a82873
$$ 92726 120548 190450 -412778 232159 -28861 222930 -78223 138389 21498 218908 -182873
13100B31249I4330a41180c1429K67A82495q8268J70716a0061j47722D34199e0908
$$ 231249 94330 -141180 -31429 -31162 182495 94227 264943 -10061 -157783 434199 -50908
13088G4409j5771K16297p5263J92691a49484B69703A06896L5026Q147R7129a29284
$$ 74409 58638 274935 199672 392363 -149484 269703 106896 141922 150069 247198 -129284
13076a10846B85189m7022F0005Q7467M3688a00632J4053B9890J14923f1953F109
$$ -110846 285189 238167 60005 147472 191160 -100632 -86579 29890 144813 -61953 6109
13064a2096n8237B19713F6943L48503A73175N8462A06224m5786f0507B7602J86473
$$ -12096 -70333 219713 66943 415446 173175 231637 106224 60438 -60507 27602 214075
13053B14075h0253A83295q0754g6084A6122J3604b66531B48247e3164B13097c8786
$$ 214075 -80253 183295 102541 -76084 16122 29726 -266531 248247 -53164 213097 -38786
13041A60665r01d9347B07484d6075k5101A48285J06211D353K5184J05790d7031
$$ 160665 159764 -49347 207484 -46075 -71176 148285 254496 4353 29537 135327 -47031
13029b7206A20877J35177h7291B78229l3512J29705A2959L39488I1143p718J0881
$$ -27206 120877 256054 -87291 278229 244717 374422 12959 352447 91143 83425 94306
13018I4306A6171a15159A37176J06974Q0541a3134j27326E27379F1994a47146
$$ 94306 16171 -115159 137176 244150 324691 -13134 -140460 527379 61994 -147146
13007E16451a32848C39751j20908B7658J77195l2793c18896B7764A2082C560P1689
$$ 516451 -132848 339751 218843 27658 204853 172060 -318896 27764 12082 3560 75249
12996G5249P4327J35131j07636p591h4891B91299G3012B2219L41949A50859A2531
$$ 75249 149576 284707 177071 169480 -84891 291299 73012 22219 364168 150859 12531
12984a36166B82967j22219a13348J2992B2180d9056e069A22365J24169J22156
$$ -136166 282967 160748 -113348 -100356 22180 -49056 -5069 122365 246534 368690
12974C68690E1639a33954G9954K65431d1472k09800B25762o934c54003C47720
$$ 368690 51639 -133954 79954 345385 -41472 -251272 225762 218828 -354003 347720
12963C45273b0451C09881m0872b80076N2104I6083L01212A01621n0443R964K85630
$$ 345273 -20451 309881 269009 -280076 -227972 96083 397295 101621 51178 61142 346772
12952C46772a70172j31383B5882a03689j75180d911o166F3014a55182g3159E1615
$$ 346772 -170172 -301555 25882 -103689 -278869 -4911 -11077 63014 -155182 -73159 51615
12940b20083d3136B74068d4149B94670a81896C20496a68884D0739d3650A27408
$$ -220083 -43136 274068 -44149 294670 -181896 320496 -168884 40739 -43650 127408
12929B9616P3967k0220f9989o8009F870J23236a40559e4967K1785A8641a86775
$$ 29616 103583 83363 -69989 -137998 6870 130106 -140559 -54967 -33182 18641 -186775
12917B58899q6498b34519E3779e2253A59767M1541K22130H1007C5654L87794e4861
$$ 258899 172401 -234519 53779 -52253 159767 201308 423438 81007 35654 423448 -54861
12905A28426J67955a64937B89110a76827f1089n8813A60425L0918n5384J87385
$$ 128426 296381 -164937 289110 -176827 -61089 -119902 160425 191343 135959 323344
12895C23344j54140J63854a16710B33257H7096Q4221e1340G4885a59994A14495
$$ 323344 169204 333058 -116710 233257 87096 171317 -51340 74885 -159994 114495
12884B12505A02296L21152a7982l8185D8886N5451b07992A96791B7151b55923
$$ 212505 102296 423448 -17982 -56167 48886 104337 -207992 196791 27151 -255923
12873D106b12731c0878j54604B2756J7817h3783L4636j44348O1315j91673C1166
$$ 4106 -212731 -30878 -185482 22756 40573 -83783 -49147 -193495 -132180 -323853 31166
12861A33479K07947G8114l5158b21254d0509A14761l6682O766L4189J94086f5866
$$ 133479 341426 78114 42956 -221254 -40509 114761 78079 84845 119034 313120 -65866
12849a25360B28991A0816Q6035a20409M393A42255J8455f9112J6343A8799e64795
$$ -125360 228991 10816 96851 -120409 -116016 142255 160710 -69112 -52769 18799 -564795
12837A19942k3303e5712A69304m6331k3072e7279l5372i795q6692E0757J99218
$$ 119942 96639 -55712 169304 122973 99901 -57279 -92651 -9795 -96487 50757 249975
12826B49975D3849J88869A01428R7516J03268h59k02521F8304e4840B79023h8551
$$ 249975 43849 232718 101428 198944 302212 -859 -203380 68304 -54840 279023 -88551
12814B11626b13096J00631B54037H8465a98506A38560a38953B98405B4424b46598
$$ 211626 -213096 -112465 254037 88465 -198506 138560 -138953 298405 24424 -246598
12803D8504b66091m8537d0707j67331C80104A8368g2631A02410K49405g1747l7152
$$ 48504 -266091 -314628 -40707 -208038 380104 18368 -72631 102410 351815 -71747 -108899
12792a08899F6211c3004E8532b90207A04775c41502A89974a77335A54465e5519
$$ -108899 66211 -33004 58532 -290207 104775 -341502 189974 -177335 154465 -55519
12781A48268c83063a11306I9361K98797a50249C5039J5987a70108j2480J7939
$$ 148268 -383063 -111306 99361 398158 -150249 35039 51026 -170108 -182588 -164649
12771a64649J7709G723P2322C0994O5815J46893c1436A54629d1849J8627k17578
$$ -164649 -146940 7723 80045 30994 96809 243702 -31436 154629 -41849 -23222 -240800
12760b40800f4159C8216a4450A5085a48354A43640c7785D8586J24562B7552h2973
$$ -240800 -64159 38216 -14450 15085 -148354 143640 -37785 48586 173148 27552 -82973
12748A07568a30137j81967f920A59695m2210f4238B16439g7566C04162q1959b8983
$$ 107568 -130137 -312104 -6920 159695 117485 -64238 216439 -77566 304162 222203 -28983
12736A35045R898P4812I8407b91596A6712a79935m4058A71686b22608H3280a17886
$$ 135045 144943 219755 98407 -291596 16712 -179935 -223993 171686 -222608 83280 -117886
12724C05473a14244j62710f8743C76068d2869r1607q0523D9148J77433J42505
$$ 305473 -114244 -276954 -68743 376068 -42869 -134476 -214999 49148 226581 369086
12714C69086j82294a72493A32270N3835B0882e961B35380r5511Q9114b6418A85400
$$ 369086 186792 -172493 132270 186105 20882 -5961 235380 139869 228983 -26418 185400
12702A85191b2495l1445A2118L36680j03209a5210k9096A94961a78146M1356a8962
$$ 185191 -22495 -53940 12118 348798 245589 -15210 -44306 194961 -178146 -136790 -18962
12690G0090K03852A20969M9586M3921o4589L7996Q8699A32715c62669i5714k7220
$$ 70090 273942 120969 170555 214476 149887 187883 276582 132715 -362669 -95714 -122934
12679a22934A48823E7900g0721A118R0793N5060g3811C5061J56424J5372g6955
$$ -122934 148823 57900 -70721 1118 91911 146971 -73811 35061 191485 206857 -76955
12667F7420a18262M2313A24745A5490b61459A75318K2257n2112a8458A08653K72203
$$ 67420 -118262 -75949 124745 15490 -261459 175318 197575 145463 -18458 108653 380856
12656C80856j41538a15307j8254A36030a49727j065M5118A74821J3710I1836m2816
$$ 380856 239318 -115307 -133561 136030 -149727 -150792 -105674 174821 188531 91836 49020
12645D9020A2891R3775a61290k45957b3416D4539N9099k6129a7048o663G5347
$$ 49020 12891 106666 -161290 -407247 -23416 44539 103638 77509 -17048 -23711 75347
12633E8746J75119g3542n5611F9296k1532P7103K73935A68715j9854g2617A6371
$$ 58746 233865 -73542 -129153 69296 47764 124867 398802 168715 148861 -72617 16371
12621D43662j45468M9606A36321N4129J3469n1060a14303k9480d6760A54847n6226
$$ 443662 298194 347800 136321 190450 203919 152859 -114303 -143783 -46760 154847 98621
12610I8621K11033E4387K1201G455L03010G3483b09275G7272a28395j05545A97252
$$ 98621 309654 54387 75588 7455 310465 73483 -209275 77272 -128395 -233940 197252
12598A16056K85284b9702J1731r4905g326k94225e6362C60428b24097D8059j4801
$$ 116056 401340 -29702 -17971 -112876 -7326 -301551 -56362 360428 -224097 48059 33258
12587C3258K76896h2886A19386f7933A68070F5384a85714f4742J9606j15806n6611
$$ 33258 310154 -82886 119386 -67933 168070 65384 -185714 -64742 -45136 -160942 -217553
12576b17553J985C98338g9035j52582A49545N894j7404c4396F3720K66699r0667
$$ -217553 -215568 398338 -79035 -231617 149545 155439 138035 -34396 63720 330419 239752
12565B39752a71610B22706a26089B10153a80591j12321D6423e3763N686A16663
$$ 239752 -171610 222706 -126089 210153 -180591 -292912 46423 -53763 -48077 116663
12554D0428P7416n7453b59837g170q1782p5415I3451O1897c0640H1551A1197L2637
$$ 40428 117844 60391 -259837 -7170 -88952 -164367 93451 155348 -30640 81551 11197 43834
12542D3834L6164a85588N5366l303A05338J12176j00114a49847B05907C2921A4220
$$ 43834 79998 -185588 -130222 -133525 105338 217514 117400 -149847 205907 32921 14220
12530F5839a507j88719j56584J19720A63319L246d0625A30423a28106H08J75099
$$ 65839 -1507 -190226 -346810 -227090 163319 166565 -40625 130423 -128106 808 175907
12519A75907a99947C2459J41328a81984H4084B0865a49590G4778L9375e4378B00755
$$ 175907 -199947 32459 173787 -181984 84084 20865 -149590 74778 114153 -54378 200755
12507a01412a6498C29525A00994b63281A24081f1366H4353A4486d1876A49185
$$ -101412 -16498 329525 100994 -263281 124081 -61366 84353 14486 -41876 149185
12496a386j92243B1319d8743D03113a24900A74623A6144L63468e174m1793l0415
$$ -1386 -193629 21319 -48743 403113 -124900 174623 16144 379612 -5174 -46967 -77382
12485g7382I3422Q2256a58560B48240o4710L2201B6645J2147L1636a69436l1187
$$ -77382 93422 175678 -158560 248240 183530 215731 26645 38792 70428 -169436 -200623
12474b00623f1912A33334c8497F5066c5576A15184D084i1156j4227j38210A86313
$$ -200623 -61912 133334 -38497 65066 -35576 115184 4084 -91156 -105383 -243593 186313
12462D1942n394K40512b11201E9971d1027J0900j5567m6931A57946f5910a1176
$$ 41942 36548 277060 -211201 59971 -41027 -30127 -45694 -92625 157946 -65910 -11176
12450b15538i7181A31101d01797B36372A926K20594I2409A467d9660j73419k01132
$$ -215538 -97181 131101 -401797 236372 1926 222520 92409 1467 -49660 -223079 -424211
12439d24211G1999a84927r8197h2340k8076E0426c624B6798J4114J87078j09126
$$ -424211 71999 -184927 -283124 -82340 -110416 50426 -3624 26798 40912 227990 118864
12428A18864a14084A06932a24268q6809f1002A63260a66700g5534c7204B08732
$$ 118864 -114084 106932 -124268 -211077 -61002 163260 -166700 -75534 -37204 208732
12417A0147O9444a86124D10440j32457a92078g9578n0629l1017a0541j41739M7912
$$ 10147 79591 -186124 410440 277983 -192078 -79578 -130207 -161224 -10541 -152280 -104368
12406a04368j9035B5653J7322d9549j34867J4152K1231L3814B75733g6212I0404
$$ -104368 -123403 25653 42975 -49549 -184416 -170264 -149033 -115219 275733 -76212 90404
12394A27551a61356f4774B92729A26671O1461p8074d1867j99131f4102q5477e2578
$$ 127551 -161356 -64774 292729 126671 188132 110058 -41867 -240998 -64102 -149579 -52578
12382c81168A44447o9864Q2601K06395F934J61138A4676g5459B81997j13938a64734
$$ -381168 144447 74583 157184 363579 6934 168072 14676 -75459 281997 168059 -164734
12370f0288k57039A27043C7436a32289A18747b22158q112B02865P6066A5418L9966
$$ -60288 -317327 127043 37436 -132289 118747 -222158 -230270 202865 278931 15418 55384
12359E5384J91911e9426A69155j5883J43835F6401K89567A37828c90897A43816
$$ 55384 247295 -59426 169155 153272 297107 66401 355968 137828 -390897 143816
12348F0159d8737E1314a88013n6826e288o0387B27093D7528J7125A4388J4794
$$ 60159 -48737 51314 -188013 -244839 -5288 -65675 227093 47528 64653 14388 29182
12337B9182n157K38302r013l9434d12515A30977J32583c9254n5799A65930a25052
$$ 29182 24025 262327 253314 213880 -412515 130977 263560 -39254 -95053 165930 -125052
12325c360B991J87239a85280O1947C3676G642a38429d9531A15582j3780G260J02585
$$ -3360 2991 190230 -185280 -123333 33676 7642 -138429 -49531 115582 101802 7260 109845
12313A09845j1496e6063j4091D12390I2109K41463a06955I0602c5032B7667a42609
$$ 109845 98349 -56063 -70154 412390 92109 333572 -106955 90602 -35032 27667 -142609
12301I4759M7767I276b11519H3426B68N653f9703B2403K16644j10920J96535H947
$$ 94759 142526 9276 -211519 83426 268 5921 -69703 22403 239047 128127 324662 8947
12288C03021j24814k3498G2506a07483j9719A67056J09409o4695H3569g5214C716
$$ 303021 178207 154709 72506 -107483 -127202 167056 276465 211770 83569 -75214 3716
12276D30310B03445G3046K79616J03122k09850E3382c9614B51647L12185A14585
$$ 430310 203445 73046 352662 455784 245934 53382 -39614 251647 563832 114585
12265A81871i540D586N38435B10371A4503b0969q1535A86078n0903F1825H871
$$ 181871 -9540 4586 543021 210371 14503 -20969 -102504 186078 135175 61825 8871
12253a19868d9043H4725O908A0484a12126c6811A47201A6310Q7863a15480A67147
$$ -119868 -49043 84725 91633 10484 -112126 -36811 147201 16310 104173 -115480 167147
12241I6126K33329F6378R0446M08150a01994A58831g2618B82442B6708J05456
$$ 96126 329455 66378 156824 564974 -101994 158831 -72618 282442 26708 132164
12231A32164J7005n292C0842L0607N2945K15682K7456A44085D4460L03187K0528
$$ 132164 149169 143877 30842 61449 114394 330076 357532 144085 44460 347647 368175
12220C68175A68034K95137B337Q9690a6315j3026A18069J2609n9178Q3995k2690
$$ 368175 168034 463171 2337 92027 -16315 -29341 118069 130678 71500 155495 132805
12209A32805K1346K34512H9895O5433K03412j04377j10280a1747B85621l6864
$$ 132805 154151 388663 89895 155328 358740 254363 144083 -11747 285621 248757
12199B48757A3050K04351N3553D6452K6401K5686L29161j70183A00320j8017i6963
$$ 248757 13050 217401 270954 46452 72853 98539 427700 257517 100320 82303 -96963
12187a48366C5236J98693L6370b6258A9033N7133L49268d7451b3613B20076b21133
$$ -148366 35236 233929 270299 -26258 19033 76166 425434 -47451 -23613 220076 -221133
12175A96244b7235q371B15624h099p5748l1139D5932K78477c25009a58294L7821
$$ 196244 -27235 -35606 215624 -8099 -83847 -114986 45932 324409 -325009 -158294 -120473
12164a20473B71494b2014B59021J9141j9082I4438P3835J30681E9226J10833A5988
$$ -120473 271494 -22014 259021 278162 259080 94438 168273 298954 59226 170059 15988
12152i6392C12299H5644r476J13974q1001b54111C40147A1854a12889B74878A4529
$$ -96392 312299 85644 76168 190142 109141 -254111 340147 11854 -112889 274878 14529
12140C10774I4599a01541B26422C9702K26418b13481B37901b0231h967n8521B82458
$$ 310774 94599 -101541 226422 39702 266120 -213481 237901 -20231 -8967 -67488 282458
12128c3826n7017a6461A99753G5851f0209a1742D3625a75761C4011e0295k11772
$$ -33826 -90843 -16461 199753 75851 -60209 -11742 43625 -175761 34011 -50295 -262067
12117b62067a18082m0893A05214j5856a34524B80872C0037b23378C52454a14996
$$ -262067 -118082 -158975 105214 89358 -134524 280872 30037 -223378 352454 -114996
12106G1008B7026L89364a2771A40645a7659C8453c17615H6944L3751d4760a6501
$$ 71008 27026 416390 -12771 140645 -17659 38453 -317615 86944 120695 -44760 -16501
12094D52022a7997D220Q8721b35977O2422B49095B7148J38236P692p925J48021
$$ 452022 -17997 4220 92941 -235977 -173555 249095 27148 165384 173076 165151 313172
12083C13172a9221A67997a39403B78436J3949J20337N85927R96299p26019C15680
$$ 313172 -19221 167997 -139403 278436 292385 412722 998649 1994948 1268929 315680
12072A10731E2964e9553a5599H7718J90189a09564l1113A41485O8689G9649O2889
$$ 110731 52964 -59553 -15599 87718 277907 -109564 -140677 141485 210174 79649 142538
12061A42538O6013J44505G5096L5896b39032E6081F210J62961d6805H4622f2222
$$ 142538 208551 353056 75096 110992 -239032 56081 6210 169171 -46805 84622 -62222
12049b24043B13752c37843B80747C9404E775a50268M460c4868b361j39495O5018
$$ -224043 213752 -337843 280747 39404 5775 -150268 -145808 -34868 -2361 -141856 -76838
12038g6838E1219d7110B44943a08420C32774b29135P2105d1002j0268m2239F1177
$$ -76838 51219 -47110 244943 -108420 332774 -229135 -157030 -41002 -51270 -93509 61177
12026A18635J262L6323A6416b60958a3201j87067A44059b99728J00089k4448A23788
$$ 118635 119897 156220 16416 -260958 -13201 -200268 144059 -299728 -199639 -224087 123788
12014C7361L39687A49154h3824a276j50840G0412a64550C46832D0670b17001k04897
$$ 37361 377048 149154 -83824 -1276 -152116 70412 -164550 346832 40670 -217001 -421898
12003d21898A162K447g0289I3790a3772C15928A08421A5929e5449k3148k0536
$$ -421898 1162 3609 -70289 93790 -13772 315928 108421 15929 -55449 -78597 -99133
11992i9133b2567p5292r7765O8102l9453B85680c6383D8317A9148b73523O6385
$$ -99133 -22567 -97859 -195624 -127522 -166975 285680 -36383 48317 19148 -273523 -207138
11981b07138j86750a86188B49436j21854C8809a52408G0629a89521i606n3137
$$ -207138 -393888 -186188 249436 127582 38809 -152408 70629 -189521 -9606 -62743
11971f2743A85634a15266b1293m40877a06925j86597C40071a4091B60515b01477
$$ -62743 185634 -115266 -21293 -462170 -106925 -293522 340071 -14091 260515 -201477
11960B77581b03881j03976A63989A5050J31001O3454N08612a42911j23744E0014
$$ 277581 -203881 -307857 163989 15050 146051 209505 718117 -142911 -266655 50014
11949C49651C4129P7188b36355b0086C5747h3438q7150e8095A7981J51204F2099
$$ 349651 34129 111317 -236355 -20086 35747 -83438 -170588 -58095 17981 169185 62099
11937C2463K031a07249G882g5737R86A56329N0971a24641N3909A66285A1652J35627
$$ 32463 34494 -107249 7882 -75737 -74751 156329 207300 -124641 -70732 166285 11652 147279
11925A47279g776k0866j34429h0076E6038b78835i5353j55470I2535b0999O657
$$ 147279 -7776 -28642 -163071 -80076 56038 -278835 -95353 -250823 92535 -20999 -14342
11914a4342C13426G1865a78604d8277A51054i948k29372H244K50927b54656L1209
$$ -14342 313426 71865 -178604 -48277 151054 -9948 -239320 8244 259171 -254656 -223447
11903b23447F265c24227a8551C5507d019h18B48165l9723D6142E283b16301f3640
$$ -223447 6265 -324227 -18551 35507 -4019 -818 248165 208442 46142 5283 -216301 -63640
11890F8130J08843e4356b3038m404q5793k39358B44671I1535f6307J7983o17586
$$ 68130 176973 -54356 -23038 -27442 -113235 -352593 244671 91535 -66307 -48324 -665910
11879f65910A42856l1814C6034N21Q9924e7212A16726N297a42802C34522a276
$$ -665910 142856 111042 36034 36555 126479 -57212 116726 122023 -142802 334522 -1276
11867i220j35455A03431a85990K5411d3704G8467l0692N3550i075j12939C7484
$$ -9220 -144675 103431 -185990 -160579 -43704 78467 47775 101325 -9075 -122014 37484
11855a98211k05920a35021O6145M918r6671q6337b351k03948O0865n5377q3317
$$ -198211 -404131 -135021 -68876 -63958 -160629 -246966 -2351 -206299 -145434 -200811 -284128
11844b84128B39120h4550A65158N7050e1476M562m25348C7320c75582J65153B2507
$$ -284128 239120 -84550 165158 222208 -51476 -46914 -472262 37320 -375582 -210429 22507
11832a8403j99454N8377j31926j2559A29229e245k80294j34256C04209A50246
$$ -18403 -217857 -159480 -291406 -303965 129229 -5245 -285539 -419795 304209 150246
11821A30623R7116c70426g2990A32933b33435R8592A26994o1278c4292k6719B56293
$$ 130623 227739 -370426 -72990 132933 -233435 -134843 126994 65716 -34292 -61011 256293
11809C794P1675b10619h5659j23849P0162B14191b4113j92624B17275b46367f9065
$$ 3794 75469 -210619 -85659 -209508 -139346 214191 -24113 -216737 217275 -246367 -69065
11797a16307F2129e4945A54720J4688a61727k0913Q0111D8617p730P8448f131
$$ -116307 62129 -54945 154720 169408 -161727 -182640 -102529 48617 40887 119335 -6131
11785I1344g9827a5951A68955K11974b17290C4193a9223k9245A67787c45081C0786
$$ 91344 -79827 -15951 168955 380929 -217290 34193 -19223 -48468 167787 -345081 30786
11773A80331J00024d2828A07853e361m2323A03026r268c03786A92152O380o2440
$$ 180331 280355 -42828 107853 -5361 -47684 103026 93758 -303786 192152 198532 136092
11762A36092l1716k4713a51159A67618l4521n7821a53929B36648J00602f3628
$$ 136092 104376 79663 -151159 167618 133097 75276 -153929 236648 337250 -63628
11751B30241b1868j17923o5236B56784b2831j57038Q499K0517C02548A4413a49078
$$ 230241 -21868 -139791 -205027 256784 -22831 -179869 -171370 -150853 302548 14413 -149078
11739B67753a73165N4512C19108A59146a77364E1618P7576c22153A81888h6572
$$ 267753 -173165 -118653 319108 159146 -177364 51618 129194 -322153 181888 -86572
11728B05622I2683a31189I572a5389o9612c221B42652r7355J47665B892b45422
$$ 205622 92683 -131189 9572 -15389 -85001 -3221 242652 145297 292962 2892 -245422
11716f3017nA45123a43495d655k60222J31411L6502j11426A68674D5168a3545
$$ -63017 -63022 145123 -143495 -4655 -264877 -133466 -96964 -208390 168674 45168 -13545
11704B42813a02162M2635C14376m4408C7367b47531A1540E129c31142A44692F7558
$$ 242813 -102162 -59527 314376 269968 37367 -247531 11540 5129 -331142 144692 67558
11692e8612k55169a26255A60346g9218F5993K44740b04022B40765j00713R9401
$$ -58612 -313781 -126255 160346 -79218 65993 310733 -204022 240765 140052 239453
11682B39453b09992A41115J16662a29385d0432k32915A45929l6479K35454a31668
$$ 239453 -209992 141115 257777 -129385 -40432 -273347 145929 109450 344904 -131668
11671a92465p9995j6722B09318m949o9889a14816G4798j7115J39945a12522j84683
$$ -192465 -272460 -289182 209318 204369 134480 -114816 74798 57683 197628 -112522 -297205
11660b97205K9737p6500A65605J71290g682B52216Q2226A20706h3895B9961J89457
$$ -297205 -267468 -343968 165605 336895 -7682 252216 334442 120706 -83895 29961 219418
11649B19418G869J76125m1597a94177D3666c68A25942a49352D9824K7316K9440
$$ 219418 7869 183994 142397 -194177 43666 -368 125942 -149352 49824 77140 106580
11638A06580i5103A59948D8674c15895A92378J00424a26316e4821A59895a24622
$$ 106580 -95103 159948 48674 -315895 192378 292802 -126316 -54821 159895 -124622
11627A84562e8836J6320B18417K30496a95037N1654C09845G6506R2564p7426l3165
$$ 184562 -58836 -42516 218417 448913 -195037 -143383 309845 76506 169070 91644 58479
11616E8479b85128h6771G1980a7825C2915L96422a94793J3962N1865m356C98045
$$ 58479 -285128 -86771 71980 -17825 32915 429337 -194793 -180831 -128966 -133322 398045
11604A09154K92126I5269K49799f1707r5309P8075H933a91113A20559J92080j34777
$$ 109154 401280 95269 345068 -61707 -157016 -78941 8933 -191113 120559 312639 177862
11593A77862a24478B19994I0355J03259j2945a09763H4270O7189j5997o500Q905
$$ 177862 -124478 219994 90355 193614 180669 -109763 84270 151459 135462 128962 137867
11582A37867J06282G7383P091d3750B924b60395A22888a32582I2528Q9645q8243
$$ 137867 244149 77383 84474 -43750 2924 -260395 122888 -132582 92528 182173 93930
11571I3930N9056a02266f082C3659Q2068A2335d5773F3054e4181C45984D4201
$$ 93930 152986 -102266 -6082 33659 115727 12335 -45773 63054 -54181 345984 44201
11559H4260J7094A1129J3062a85921A13286a45915A24589i1283b3104B40948K8423
$$ 84260 101354 11129 24191 -185921 113286 -145915 124589 -91283 -23104 240948 269371
11548B69371G2220e8442A13412D0064J29201l8169K34278D6613J57855J9122p3400
$$ 269371 72220 -58442 113412 40064 169265 131096 365374 46613 204468 223590 150190
11537A50190M6797J41942A54330l3970b8645n08k2775H2296K10510a20743c7186
$$ 150190 196987 338929 154330 120360 -28645 -29153 -51928 82296 292806 -120743 -37186
11525B6665d07786E7059c3672B14173E2558c587A81489p6062l0407K44501C2179
$$ 26665 -407786 57059 -33672 214173 52558 -3587 181489 105427 75020 319521 32179
11513C02109j39672K9346N7317C0866c4704l0395B83926f6221A23712J02708E4818
$$ 302109 162437 191783 249100 30866 -34704 -65099 283926 -66221 123712 226420 54818
11501A11947E5611b56119E7806J03606K2864J84168d4114j88441e6012q9836B88583
$$ 111947 55611 -256119 57806 161412 184276 368444 -44114 -232555 -56012 -145848 288583
11489G4236Q8557F8747M5292K27129j14841F6082J1860J10806A1213K44343K6271
$$ 74236 162793 68747 114039 341168 226327 66082 77942 188748 11213 255556 281827
11478B81827q0966a80030l7085A56211a75847j12981c6315l7783j06850B34227
$$ 281827 200861 -180030 -217115 156211 -175847 -288828 -36315 -74098 -180948 234227
11467A84049b0307A54877B2544O2631J36126n6454a1967B54056e093B21038K88750
$$ 184049 -20307 154877 22544 85175 221301 164847 -11967 254056 -5093 221038 509788
11456E09788b03990A87183j2841D0889N9100P0343G5136a18762A567b85974A54108
$$ 509788 -203990 187183 174342 40889 99989 170332 75136 -118762 1567 -285974 154108
11444G0582g3292C9151R8332F4116i4918q5290B30751c46515a8490j76925R1835
$$ 70582 -73292 39151 137483 64116 -94918 -180208 230751 -346515 -18490 -195415 -103580
11433a03580A10893D2025a07197j20730R6766j94355B42822q4541J02436a69012
$$ -103580 110893 42025 -107197 -227927 -131161 -325516 242822 158281 260717 -169012
11422C80810c1996n2060j16518i1251A7557J01929m705a6997k59836D54015c977
$$ 380810 -31996 -84056 -200574 -91251 17557 119486 114781 -16997 -276833 454015 -3977
11410C08934e0643A21223A8906a86193D21243D0736Q0892D9684a4275A01351J99755
$$ 308934 -50643 121223 18906 -186193 421243 40736 121628 49684 -14275 101351 301106
11399C01106a26858A88485A339N2136L90670j58980h8624G7559a75495A8893d05342
$$ 301106 -126858 188485 1339 53475 444145 285165 -88624 77559 -175495 18893 -405342
11387a53511A12331B6905a83800Q7582k7436c4010A75828k2198b4774j92564P4784
$$ -153511 112331 26905 -183800 -96218 -123654 -34010 175828 153630 -24774 -217338 -142554
11376a42554M0215A46816B2156J7333d02938a33269B35330C6658Q2025Q2442K2070
$$ -142554 -102339 146816 22156 39489 -402938 -133269 235330 36658 118683 201125 223195
11365B23195A9727M1870L0146J26664a56870b0358j02677d3959a137j10252d0327
$$ 223195 19727 61597 91743 218407 -156870 -20358 -123035 -43959 -1137 -111389 -40327
11353b74811H3162P1981b41201g1843b6352a1250j11030B23756D6870A5124b08792
$$ -274811 83162 155143 -241201 -71843 -26352 -11250 -122280 223756 46870 15124 -208792
11341a28274a2583A0043J77315D2232j7960O3732b2858q4877d2697k14811b6207
$$ -128274 -12583 10043 187358 42232 24272 88004 -22858 -107735 -42697 -257508 -26207
11329C9021b70809k00010C7577j1446J53407f8880I414a61115A98396L19356b13506
$$ 39021 -270809 -470819 37577 26131 179538 -68880 9414 -161115 198396 517752 -213506
11317B0494d6893B5729b7846k77133i8014c3436A77584J03804a85948e3680A0856
$$ 20494 -46893 25729 -27846 -304979 -98014 -33436 177584 281388 -185948 -53680 10856
11305f7126o4910j72754a13730c5767j29640l0959A26024Q6565C1876J27845E7555
$$ -67126 -132036 -304790 -113730 -35767 -165407 -196366 126024 212589 31876 159721 57555
11293A23326g1758n4322A01879a04689A58667A7598a58953Q490H6229b41819f4695
$$ 123326 -71758 -126080 101879 -104689 158667 17598 -158953 -150463 86229 -241819 -64695
11281C9969N8518e7286k56795n2420a03131B38426J33562a24899j8988A54371
$$ 39969 98487 -57286 -314081 -366501 -103131 238426 371988 -124899 -143887 154371
11270a3958G529R5831C5905N1393a9400l29536C2616O9922i8319F3968A3482n029
$$ -13958 7529 103360 35905 87298 -19400 -348936 32616 102538 -98319 63968 13482 8453
11258H453b80937a7709H2491B0124L6511J39088A4996a30217a382k09465C1949
$$ 8453 -280937 -17709 82491 20124 56635 195723 14996 -130217 -1382 -210847 31949
11246e5583A95883J758c4214j33251I2228L8198d32770a26650C8573a7607K526
$$ -55583 195883 197641 -34214 -167465 92228 130426 -432770 -126650 38573 -17607 -15081
11235a5081l43002h2317j31199B7900J05892J7367a77129e1261A8726b07162Q9
$$ -15081 -358083 -82317 -213516 27900 133792 151159 -177129 -51261 18726 -207162 -207073
11224b07073G9816a16006K7403k74870J17367a20727M5416K6552A71208d26315
$$ -207073 79816 -116006 -88603 -363473 -246106 -120727 -75311 -48759 171208 -426315
11213e6012F3886a70606C6758a14600A79731a02965p080j72506E992b8012k80325
$$ -56012 63886 -170606 36758 -114600 179731 -102965 -110045 -282551 5992 -28012 -308337
11202c08337c4316l08585d1693o7248B50754f6898H0460a2757r8371j03839M9377
$$ -308337 -34316 -342901 -41693 -108941 250754 -66898 80460 -12757 -111128 -214967 -165590
11191a65590Q0433I0457K52583b40749b1937k34275B40474b06247A09452a00560
$$ -165590 -85157 90457 343040 -240749 -21937 -256212 240474 -206247 109452 -100560
11180b88912H3349q804c6149p3597h018B6593d99712B21733a64781H1387J3899
$$ -288912 83349 74545 -36149 -109746 -8018 26593 -499712 221733 -164781 81387 95286
11169I5286l0953B5850M3589h9864j50808D9393J95667R0915j65322J334M5482
$$ 95286 64333 25850 69439 -89864 -240672 49393 245060 335975 170653 171987 217469
11158B17469n1164a10538H5778h5513r7069B11632g2512H6455d4903m4437k71377
$$ 217469 166305 -110538 85778 -85513 -182582 211632 -72512 86455 -44903 -89340 -360717
11147c60717J25234E6083b29840k23961C4092c82697f2878A27023c1775K196q2434
$$ -360717 -235483 56083 -229840 -453801 34092 -382697 -62878 127023 -31775 -29579 -112013
11136a12013B2360h3380B10175d9226k1071B0171a61512d5747k620l4173H1351
$$ -112013 22360 -83380 210175 -49226 -70297 20171 -161512 -45747 -48367 -82540 81351
11124d1834a636A95429a00880d6201A92627i5796j8125B8469R7921L09767C8842
$$ -41834 -1636 195429 -100880 -46201 192627 -95796 -113921 28469 126390 436157 38842
11112B55734A12477J6197B1199J28791c12j7407I8024Q8332m1103m2574r298K80737
$$ 255734 112477 128674 21199 149990 -312 -17719 98024 186356 145253 102679 93381 374118
11100C74118j0879A78374Q0380o1254R051o5101a28965A87774H5115B5993M02274
$$ 374118 363239 178374 258754 197500 206551 141450 -128965 187774 85115 25993 428267
11089D28267I8013a56366P6337B52276a6600B40528n6448m2133L07116A68638
$$ 428267 98013 -156366 -80029 252276 -16600 240528 184080 141947 449063 168638
11078B54312D3603M32537j19064j78453P2704A13049j1032K84177p6202j024B8494
$$ 254312 43603 476140 357076 178623 251327 113049 102017 386194 309992 308968 28494
11066C32680A27720K56631J8754j20838J81074q2132J59441k4850k10565J62945
$$ 332680 127720 384351 403105 282267 463341 381209 540650 515800 305235 468180
11056D68180K77047K53611k42659B63726J90009K49321N8911C59331J75251R1578
$$ 468180 745227 998838 756179 263726 453735 703056 761967 359331 534582 626160
11046F26160K751L3323J77491p7209j92323K08388k06990J68182n7832j43879
$$ 626160 628911 662234 839725 762516 570193 778581 571591 739773 681941 538062
11036E38062J53220p7795J03963B85351J28081K91488L19965k10579C50068m781
$$ 538062 691282 613487 717450 285351 413432 704920 1024885 814306 350068 345287
11026C45287L93468o9734j32196J18630C05643K61678R2854l8759K61601l24001
$$ 345287 738755 669021 536825 655455 305643 567321 660175 621416 883017 559016
11016E59016J58049j07311L68047D07523L24576C14690M11816l38213L39255k33544
$$ 559016 717065 609754 977801 407523 732099 314690 726506 388293 727548 494004
11006D94004o3576L70190B89101n9506J72570J00311L00645k28482r498k1453
$$ 494004 430428 800618 289101 229595 402165 502476 803121 574639 565141 543688
10996E43688A90339M29749n986L45080j58267k34100R1025J44593K10804j24404
$$ 543688 190339 620088 614102 959182 800915 566815 657840 802433 1013237 888833
10986H88833P5435j26736R7092K86254j69115m9394J22110q7677M14004j79463
$$ 888833 964268 837532 934624 1220878 1051763 1002369 1124479 1036802 1450806 1271343
10976A271343M63734L96966l3954l2295J28243P35852k90746k36892M9193k32300
$$ 1271343 1735077 2132043 2098089 2065794 2194037 2929889 2639143 2402251 2451444 2219144
10966B219144n77974J26323j56755R4487M22440n28042L22796q3473K06893j57809
$$ 2219144 1641170 1767493 1610738 1705225 2127665 1599623 1922419 1838946 2045839 1888030
10956A888030J0006j13955l15759j14234k78422q3522J22005j64646j47471l15443
$$ 1888030 1898036 1784081 1468322 1354088 1075666 992144 1114149 949503 802032 486589
10946D86589l9303j64644J86796m5867A87053K14291m7492A55163b0116B77578
$$ 486589 447286 282642 469438 423571 187053 401344 353852 155163 -20116 277578
10935A52061o7625J62524D4818K64040j09834a46790O7546j6181q461H9429N9667
$$ 152061 84436 246960 44818 308858 199024 -146790 -79244 -95425 -103886 89429 149096
10924A49096P4504B7330a13987B38695O582b5631A73073m7053l1531l3422J7732
$$ 149096 223600 27330 -113987 238695 245277 -25631 173073 126020 94489 61067 78799
10913G8799h4131G8862a2059B60723h4113k4660k20327B30905I3699g2977d258
$$ 78799 -84131 78862 -12059 260723 -84113 -108773 -329100 230905 93699 -72977 -4258
10901A82431b88453I1217c6776H5792J10892a10257L2510l1241A17279a07354
$$ 182431 -288453 91217 -36776 85792 196684 -110257 -77747 -108988 117279 -107354
10890a49073A96490K23828B130P0467c7532G0843B7621J37833a15458L2288B54910
$$ -149073 196490 420318 2130 72597 -37532 70843 27621 165454 -115458 -83170 254910
10878a11384b4764G5413a53427f6651I9502e9796j34734H2205d13680N3323A16044
$$ -111384 -24764 75413 -153427 -66651 99502 -59796 -194530 82205 -413680 -360357 116044
10866C17690B8495J77403a70006k1888P8826K4165B8478L8405b61016h1074k33313
$$ 317690 28495 205898 -170006 -191894 -113068 -88903 28478 66883 -261016 -81074 -314387
10855c14387B7936a08702A20011a40254M439J4311B22437F9883N6519a33139n1408
$$ -314387 27936 -108702 120011 -140254 -135815 -121504 222437 69883 126402 -133139 -184547
10844a84547B2864J68019k3945B3882e4263m3715A16591i8837l53365B46557G972
$$ -184547 22864 190883 166938 23882 -54263 -97978 116591 -98837 -452202 246557 7972
10832b63582L0225f8798E2394c88986d935A31049a74447j35089h7576A26893a80631
$$ -263582 -233357 -68798 52394 -388986 -4935 131049 -174447 -309536 -87576 126893 -180631
10820a37980l9275o0125N6165n060h789j5357k8507j56950k37247E9612a91926
$$ -137980 -177255 -237380 -181215 -186275 -8789 -24146 -52653 -209603 -446850 59612 -191926
10808A4928b68158j1795e4059j06290a9578F770b79819b0768F0281L7869J62486
$$ 14928 -268158 -279953 -54059 -160349 -19578 6770 -279819 -20768 60281 98150 260636
10797B60636A24224a51299I898a93552E4388g1438l3740F6087g6783K3295A83406
$$ 260636 124224 -151299 9898 -193552 54388 -71438 -105178 66087 -76783 -53488 183406
10785a50957O5201A25053N8775Q2567c41132J41194D49607b75197J31587d1806
$$ -150957 -85756 125053 183828 266395 -341132 -199938 449607 -275197 -143610 -41806
10774A61524b26311B59151D4084A8720a51732D94083b38266q1526c165j13016
$$ 161524 -226311 259151 44084 18720 -151732 494083 -238266 -319792 -3165 -116181
10764a16181n5757j84221k580i2557j06899B55224G0828B6937G389O500J14168
$$ -116181 -171938 -356159 -358739 -92557 -199456 255224 70828 26937 7389 13889 128057
10753A28057J4190a4969A85823e7677j73353B47445E4702c57981a4667A73203
$$ 128057 142247 -14969 185823 -57677 -231030 247445 54702 -357981 -14667 173203
10742a59251a4078j26431c0364E7752a70689H3394J23378n4393N3384G4066a42614
$$ -159251 -14078 -140509 -30364 57752 -170689 83394 206772 152379 205763 74066 -142614
10730C6048a55278A74548q6067b72486I9258h3702b7619E0437c97292D078L0759
$$ 36048 -155278 174548 88481 -272486 99258 -83702 -27619 50437 -397292 4078 34837
10719C4837a38144A8459a45606L396H8145d8009C27046F3630d5984H1383b22495
$$ 34837 -138144 18459 -145606 -142210 88145 -48009 327046 63630 -45984 81383 -222495
10707A45272i4298D6737Q1228K9266k3275b67771j8072i1615G1650C2J92393a10842
$$ 145272 -94298 46737 127965 157231 133956 -267771 -285843 -91615 71650 32 192425 -110842
10694C32792d7633j27013D946J5883a71918h0975j5741C1032a77087A07312a33627
$$ 332792 -47633 -174646 4946 20829 -171918 -80975 -96716 31032 -177087 107312 -133627
10682c02828C5848a02959D8326J8337a24289j35580N2149A07690a28197C71411
$$ -302828 35848 -102959 48326 66663 -124289 -259869 -207720 107690 -128197 371411
10671c07399a18083b7347F4731f9669j5844K6754J5576j72077g6454e319D8270
$$ -307399 -118083 -27347 64731 -69669 -85513 -58759 -43183 -215260 -76454 -5319 48270
10659a79488N0206C00539j36379m8830J76478b57489R0494L9214c5496k56491
$$ -179488 -129282 300539 164160 115330 291808 -257489 -166995 -127781 -35496 -291987
10649b91987I5610b842l9567k17372A568R142b22068N6785j47996A67480c30564
$$ -291987 95610 -2842 -42409 -259781 1568 10710 -222068 -165283 -313279 167480 -330564
10637B12680g6108A68357f2538H3489c56671O4171c2893q3973B20955p3859a01089
$$ 212680 -76108 168357 -62538 83489 -356671 -292500 -32893 -116866 220955 147096 -101089
10625a0695l10905f2608j11494F4196j3517b5109k9792m7186A67520b28993B7139
$$ -10695 -321600 -62608 -174102 64196 50679 -25109 -54901 -102087 167520 -228993 27139
10613F5930b47715b9677k5540o3125m2093l1297B28935H4476f0654C4107K67608
$$ 65930 -247715 -29677 -55217 -118342 -160435 -191732 228935 84476 -60654 34107 301715
10602C01715b6259k9634A33057h0975A8117h2614k29221A44430m3385n0217d4850
$$ 301715 -26259 -55893 133057 -80975 18117 -82614 -311835 144430 101045 50828 -44850
10590h137p9013k01286O5084M1199q6653A46478G47J25273c49317G616c2529B77772
$$ -8137 -87150 -288436 -223352 -182153 -268806 146478 747 126020 -349317 7616 -32529 277772
10577g905B9083j4068N4091i4507j54535f9703l46327c0827i594n7005A79948
$$ -7905 29083 15015 69106 -94507 -249042 -69703 -416030 -30827 -9594 -66599 179948
10565a10088B59a83495j41807C23787j58600k7324a99162g6257K7269A27904j8550
$$ -110088 259 -183495 -325302 323787 165187 137863 -199162 -76257 -48988 127904 109354
10554A09354b29843j6648L0047Q9119b1359A25814h3259j98651g8872A03921a23106
$$ 109354 -229843 -246491 -216444 -127325 -21359 125814 -83259 -281910 -78872 103921 -123106
10542e4231A27239b79577h7478k17832j35562a18389a2383B1078J93688H2018
$$ -54231 127239 -279577 -87478 -305310 -440872 -118389 -12383 21078 214766 82018
10531a72448A80211n5937i5102M75A14206C5018o513b1226k00246a02655D7624
$$ -172448 180211 124274 -95102 -94627 114206 35018 28505 -21226 -221472 -102655 47624
10519b45639P8601B2630g8647j90720h1733c8879n17601A9776n572c37563B08595
$$ -245639 -167038 22630 -78647 -269367 -81733 -38879 -556480 19776 14204 -337563 208595
10507f9037J0498l5682A19686a62029A58703J61117j54640a6615j36133k26380
$$ -69037 -58539 -94221 119686 -162029 158703 319820 165180 -16615 -152748 -379128
10497c79128C24087r4233p7337C9041a35930A23681h2669m29684I9354h0696C92147
$$ -379128 324087 229854 152517 39041 -135930 123681 -82669 -512353 99354 -80696 392147
10485C6980J68414I7130M45690k02535J22682n0459J94194k30975j8196l8041
$$ 36980 205394 97130 542820 340285 462967 412508 606702 375727 357531 319490
10475C19490H0974f8482m0302C12736b9894E4657O5633l1942J91247r8686B1133
$$ 319490 80974 -68482 -108784 312736 -29894 54657 120290 88348 279595 180909 21133
10463b69139C1083K74174j05475I6903f8520j70549F0762d0176A42493a25953
$$ -269139 31083 305257 199782 96903 -68520 -239069 60762 -40176 142493 -125953
10452E4551e7707D7554a4119D8660a40128J0451J9749A53165K5852D8989b1272
$$ 54551 -57707 47554 -14119 48660 -140128 -129677 -109928 153165 179017 48989 -21272
10440G1304c23532B26972a66782P871A16581J05544j08388a55083O9528A77317
$$ 71304 -323532 226972 -166782 -158911 116581 222125 113737 -155083 -85555 177317
10429b19997B03066o5491a10287B82555j02809J26035d9154j71977G3323b35594
$$ -219997 203066 137575 -110287 282555 179746 305781 -49154 -221131 73323 -235594
10418B85838A3838Q7083a73123k1177B5175h8817o5587B18596a01467k62103d8034
$$ 285838 13838 100921 -173123 -194300 25175 -88817 -154404 218596 -101467 -363570 -48034
10406a77162f8749j46719E6214N2661h4047A25415a07928Q711A98349i3231b2800
$$ -177162 -68749 -215468 56214 108875 -84047 125415 -107928 -99217 198349 -93231 -22800
10394A02772g1574j59402D7536K38995I8001m0556L5741l0469a92900h96A84562
$$ 102772 -71574 -230976 47536 286531 98001 57445 93186 62717 -192900 -896 184562
10382f254A96771j6250q0350K17807B4009G816Q7492C2131J75480A9578M09772
$$ -6254 196771 180521 100171 317978 24009 7816 95308 32131 207611 19578 429350
10371D29350P8264H3789L00432A48373O19477C71299K65428k35225A68888q0998
$$ 429350 507614 83789 384221 148373 767850 371299 636727 401502 168888 87890
10361H7890k1843J37365L42119G0195B561R7662l7314J68715l5415K01739J78669
$$ 87890 66047 203412 545531 70195 2561 100223 62909 231624 196209 397948 576617
10350E76617r5102k623k37044L00117B26388D8498O5773J33946m4811k08K52119
$$ 576617 481515 478892 241848 541965 226388 48498 114271 248217 203406 203198 455317
10339D55317A39550J05710K45177q8261a87368C01103j12933F1816c925H8011
$$ 455317 139550 245260 490437 402176 -187368 301103 188170 61816 -3925 88011
10328A89849J43016j09056G987L284K20702L6787A32370M00493A08428J8132f403
$$ 189849 332865 223809 7987 11271 231973 268760 132370 532863 108428 126560 -6403
10316B08536b42760A74721o7298d5613B56337B1185b43470d7246j98053A62185
$$ 208536 -242760 174721 107423 -45613 256337 21185 -243470 -47246 -245299 162185
10305A30067a45956P2646C64655b72516D6617j8050J55634b66378F9187b90241
$$ 130067 -145956 -73310 364655 -272516 46617 28567 184201 -266378 69187 -290241
10294E5333J88128c3007B20947a4234r0432j11959d5773l36795E959J63303a30839
$$ 55333 243461 -33007 220947 -14234 -104666 -216625 -45773 -382568 5959 169262 -130839
10282a99261N9755j989r0343A33305a56066M3071G7218a1977m2932L963o4627
$$ -199261 -139506 -141495 -231838 133305 -156066 -112995 77218 -11977 -54909 -50946 -115573
10271a15573A82618b43679g8009A60874c817B72585F7081J67795h716r0856A2168
$$ -115573 182618 -243679 -78009 160874 -3817 272585 67081 234876 -8716 -99572 12168
10259B06320J40524P0j34554j9671N5434m907O2714b58174d6295B08644O995f9555
$$ 206320 346844 346914 212360 192689 248123 243216 305930 -258174 -46295 208644 215639 -69555
10246a1566E9198K31918H3739a53917b2440G3507N2482a70256c8394A9967c53150
$$ -11566 59198 291116 83739 -153917 -22440 73507 125989 -170256 -38394 19967 -353150
10234A41019M4786a00647L5490J6566r3464o1443J3548C29420A37411a0231l18435
$$ 141019 185805 -100647 -65157 -48591 -142055 -203498 -189950 329420 137411 -10231 -328666
10223c28666e8308k7410C08927a63946f0437A2283a28036J8464A52006h95j52666
$$ -328666 -58308 -85718 308927 -163946 -60437 12283 -128036 -109572 152006 -895 -153561
10212a53561q0579d5269B2523f3757A39992a48736a5874k67951G9002e931G0084
$$ -153561 -234140 -45269 22523 -63757 139992 -148736 -15874 -283825 79002 -5931 70084
10200a70695J0510a6419A5554c00409b250A52926A1613b14025F3287g5346r4057
$$ -170695 -160185 -16419 15554 -300409 -2250 152926 11613 -214025 63287 -75346 -169403
10189a69403G2015J16192r2287b08904b7045E6456J31575b90552B3302a26325
$$ -169403 72015 188207 95920 -208904 -27045 56456 188031 -290552 23302 -126325
10178b02007D168i365c345l4987R003B99353A02408d66781C38087G565a20706
$$ -202007 4168 -9365 -3345 -38332 -29329 299353 102408 -466781 338087 7565 -120706
10166c42021E4782R0950a73753g7458A22672A1035a51648L4022H9368a25307j4167
$$ -342021 54782 145732 -173753 -77458 122672 11035 -151648 -117626 89368 -125307 -139474
10155a39474C09196C2671j5881a42231j62948A4389b28734j5454B94767H8219
$$ -139474 309196 32671 16790 -142231 -305179 14389 -228734 -244188 294767 88219
10144b30639A33346n3778f8657k22708b6980f829F4876e1844b1742k89138i378
$$ -230639 133346 79568 -68657 -291365 -26980 -6829 64876 -51844 -21742 -310880 -9378
10132A29990a54086j48144a43864A44784a80664o8831B19692i0613F0383J79365
$$ 129990 -154086 -302230 -143864 144784 -180664 -249495 219692 -90613 60383 239748
10122B39748c15798J24432m8703j48417a55353b3804k33952h0089C4495K737a5194
$$ 239748 -315798 -191366 -240069 -388486 -155353 -23804 -257756 -80089 34495 37232 -15194
10110A16241Q149a05336j02842h226k7205n8571J6715k92356G2317J04784J7145
$$ 116241 124390 -105336 -208178 -8226 -35431 -94002 -77287 -369643 72317 177101 194246
10099A94246d3247J348J2293r860j6891A28127b02451B33410b33405E1394j3919
$$ 194246 -43247 -41899 -29606 -39466 -56357 128127 -202451 233410 -233405 51394 37475
10088C7475c09924B017b46121J21062B32743B7247J80606a26596j28097I0910
$$ 37475 -309924 2017 -246121 -125059 232743 27247 207853 -126596 -254693 90910
10077G4839R3925C147b22997j12156a01439b9966B52189a04370I0961a86831h9353
$$ 74839 168764 3147 -222997 -335153 -101439 -29966 252189 -104370 90961 -186831 -89353
10065a9579D19646a73386j5485q849f8905l35711a45258D406b93439A26251Q4866
$$ -19579 419646 -173386 -188871 -197720 -68905 -404616 -145258 4406 -293439 126251 211117
10054B11117c8777L910k39929b4234k32020j5082L0145l8281O278C59168j33169
$$ 211117 -38777 -34867 -274796 -24234 -256254 -271336 -241191 -279472 -273194 359168 225999
10043B25999G3378c19508J07243A16976a31556C4274A2985R7814o070g1649A64350
$$ 225999 73378 -319508 -212265 116976 -131556 34274 12985 110799 104729 -71649 164350
10031H4876b29422j75846a87632a18H7062k1190a46248n9301j89342A6885d35709
$$ 84876 -229422 -405268 -187632 -118 87062 65872 -146248 -205549 -394891 16885 -435709
10019G7838a37956l4930j90782A86008a46209d4604F7987C971c79377f9031p4115
$$ 77838 -137956 -172886 -363668 186008 -146209 -44604 67987 3971 -379377 -69031 -143146
10008a43146J9039C2077N0888g3543k13112a29502j02318q6630g2196j34853j33455
$$ -143146 -124107 32077 82965 -73543 -286655 -129502 -231820 -318450 -72196 -207049 -340504
9997c40504B0924N046J48600d3970k32228A13735a04955E7977a40847A30479f7983
$$ -340504 20924 25970 174570 -43970 -276198 113735 -104955 57977 -140847 130479 -67983
9985a28973r956e4409n9459l2354K366A44351h0239A24657D4592B1435c569C2345
$$ -128973 -138929 -54409 -113868 -146222 -143856 144351 -80239 124657 44592 21435 -3569 32345
9972I5563O0119G7841b84482O6555e4184j4730C1830b69764A50040a00777b9144
$$ 95563 155682 77841 -284482 -217927 -54184 -68914 31830 -269764 150040 -100777 -29144
9960b17159K0736C9234K17458o1725D9981d39931N7618G5089l4721a75288A42998
$$ -217159 -196423 39234 256692 194967 49981 -439931 -382313 75089 40368 -175288 142998
9948C0795G815J43883E4640G794e1054D5213b41338O6293g8890a034A11643c7407
$$ 30795 7815 151698 54640 7794 -51054 45213 -241338 -175045 -78890 -1034 111643 -37407
9935A61081b40310K4791Q0875H419J26440L1169L7335d57619b0657j70851A88397
$$ 161081 -240310 -215519 -134644 8419 134859 166028 203363 -457619 -20657 -191508 188397
9923E1129a12835A08995M5232a94937k89F0458K9233j9780a7526j95645o621m1753
$$ 51129 -112835 108995 154227 -194937 -195226 60458 89691 69911 -17526 -213171 -219792 -261545
9911b61545a8751k09130M7782A33664a46677B9279h0712a4575j79402k150J6551
$$ -261545 -18751 -227881 -180099 133664 -146677 29279 -80712 -14575 -193977 -196127 -179576
9900a79576O2093m04422H0128b15793O0806A62962C7297a32039A19107d23476
$$ -179576 -117483 -521905 80128 -215793 -154987 162962 37297 -132039 119107 -423476
9889f6568A7317M8624c1622n61446b76230a20679M7616A84195e0853a8705j52848
$$ -66568 17317 65941 -31622 -593068 -276230 -120679 -73063 184195 -50853 -18705 -171553
9878a71553O6196H9251M099b4144l77781c760j81662B63785c98134a08375d4898
$$ -171553 -105357 89251 93350 -24144 -401925 -3760 -185422 263785 -398134 -108375 -44898
9866A1833d388k16818M8755A31313g6488b4559k95456o1381C67569a44733A6433
$$ 11833 -4388 -221206 -172451 131313 -76488 -24559 -320015 -381396 367569 -144733 16433
9854e6222A13595i7164l6019D8938K005c79595J30129D2134O6617B4855J67641
$$ -56222 113595 -97164 -133183 48938 50943 -379595 -249466 42134 108751 24855 192496
9843A92496e1225B93595a727m0020B37751i2644A56135j754b83429j84858a0856
$$ 192496 -51225 293595 -1727 -41747 237751 -92644 156135 154381 -283429 -468287 -10856
9831I6082a51309k4024C4165a61538A31913c09022a192j30021o2159A00682A6549
$$ 96082 -151309 -175333 34165 -161538 131913 -309022 -1192 -131213 -193372 100682 16549
9819g659G8293b32715I037K0193b80791c2961j16536C4007R5179i0851f189p2824
$$ -7659 78293 -232715 9037 29230 -280791 -32961 -149497 34007 129186 -90851 -6189 -79013
9807g9013A91008N1680j10801b20317L6891M4924K4482B17260a29997j48738F4855
$$ -79013 191008 242688 131887 -220317 -183426 -138502 -114020 217260 -129997 -278735 64855
9795C15117h6024j17878n6124A79359A9837K85959a62352L3591D559K50346a22297
$$ 315117 -86024 -203902 -260026 179359 19837 305796 -162352 -128761 4559 254905 -122297
9783A76113b32900a05078j0159Pc4385j86716f4912m7566k1521k94901f8873A3649
$$ 176113 -232900 -105078 -115237 -115230 -34385 -221101 -64912 -112478 -133999 -428900 -68873 13649
9770a77458H9646J8912a76276L8751C896e7519F3250a08609l07653i9900j14894
$$ -177458 89646 108558 -176276 -137525 3896 -57519 63250 -108609 -416262 -99900 -214794
9759b14794A57926o02h865m47989J31694g0474E0212a00554m7866A98425a2767
$$ -214794 157926 157324 -8865 -456854 -325160 -70474 50212 -100554 -148420 198425 -12767
9747H1009n398d7937B11085E3164c34733A23537a29572C38366b82594A91221f203
$$ 81009 75611 -47937 211085 53164 -334733 123537 -129572 338366 -282594 191221 -6203
9735E6799b62267I0832e0471E216f5917C77737G9559a25201A5894J5545c35451
$$ 56799 -262267 90832 -50471 5216 -65917 377737 79559 -125201 15894 31439 -335451
9723a09982B78711c26299C7126K45646q1186p9970a49818j4620j13377f7785I1269
$$ -109982 278711 -326299 37126 282772 201586 121616 -149818 -164438 -277815 -67785 91269
9711a44446r7869A24751k579j0397l6191a81683j07987A75785N0905G6610b31241
$$ -144446 -242315 124751 122172 111775 75584 -181683 -289670 175785 226690 76610 -231241
9699a98758B00403c08171R7605g4376C9808b64574j28650a33022l4619f015H3822
$$ -198758 200403 -308171 -210566 -74376 39808 -264574 -393224 -133022 -167641 -6015 83822
9687B78425a4866A67996f089l99605A7761N2293a3799A35118n7381k6775c21949
$$ 278425 -14866 167996 -6089 -405694 17761 70054 -13799 135118 77737 50962 -321949
9675c14622B3352c16743b463k11935A38634a6150j74012q6299O048b0282A80486
$$ -314622 23352 -316743 -2463 -214398 138634 -16150 -190162 -276461 -270413 -20282 180486
9663b11557Q3537J7396B13462M2535D0825D051R1159B1009a78317J0637I7400
$$ -211557 -128020 -110624 213462 255997 40825 4051 95210 21009 -178317 -167680 97400
9651B6361f9808k39986c3752I3067m776a11302D6706g2521l52309C6724g4206
$$ 26361 -69808 -309794 -33752 93067 88291 -111302 46706 -72521 -424830 36724 -74206
9639I2344e6340j01598C59352a76379h6795p6660A35965F5757a12572b2549j01258
$$ 92344 -56340 -157938 359352 -176379 -86795 -163455 135965 65757 -112572 -22549 -123807
9628a23807B50684B2837a12734K7703j40673m0125J6783a2949j90626h8585A75396
$$ -123807 250684 22837 -112734 -85031 -225704 -265829 -249046 -12949 -203575 -88585 175396
9616a0458A32835A1885O3048a35336I4784j5609c1981o2156k67065C5436d259
$$ -10458 132835 11885 74933 -135336 94784 79175 -31981 -94137 -361202 35436 -4259
9604f0780K8643o2113e659B04907h125H4121e12693a64366P9357L5330k42431
$$ -60780 -32137 -94250 -5659 204907 -8125 84121 -512693 -164366 -85009 -49679 -292110
9593b92110c6764m2863H2282b12549e438k32232A42359d01599c3263k40138i9992
$$ -292110 -36764 -79627 82282 -212549 -5438 -237670 142359 -401599 -33263 -273401 -99992
9581D43298b04997P5612M7784F0827O8840i6878C0622a73718B9930L821a88574
$$ 443298 -204997 -129385 -81601 60827 129667 -96878 30622 -173718 29930 33751 -188574
9569H1474b53695f4175m4665j81153a19575k42166A63441a43145c6984j64077
$$ 81474 -253695 -64175 -108840 -289993 -119575 -361741 163441 -143145 -36984 -201061
9559b01061A80486c08960d8724K3325j70762q3402f1347B14151a49775A0040L3397
$$ -201061 180486 -308960 -48724 -25399 -196161 -279563 -61347 214151 -149775 10040 43437
9548D3437K0050P9008e33843E1990N8452J38404a96338B07892i0543b4153j08850
$$ 43437 63487 142495 -533843 51990 110442 248846 -196338 207892 -90543 -24153 -133003
9537a33003l0988P9822l0817A95782f0602b2556j04513A33638b0596j84590C6896
$$ -133003 -163991 -84169 -114986 195782 -60602 -22556 -127069 133638 -20596 -205186 36896
9525f6266C39104a7397g783j50807I2137b11972g6382B2718a94762B437J2299
$$ -66266 339104 -17397 -7783 -158590 92137 -211972 -76382 22718 -194762 2437 14736
9514A4736f6178B11727c1680j15275A44316f1797o2802k34952a27877e4529k6231
$$ 14736 -66178 211727 -31680 -146955 144316 -61797 -124599 -359551 -127877 -54529 -80760
9503h0760o1987J955M227q134J5303j63869a7899k35989B065b57293j35673k0
$$ -80760 -142747 -140792 -136565 -144699 -129396 -293265 -17899 -253888 2065 -257293 -392966 -392986
9491c92986D7609a97026A02621L5193a78483F5038b30644a06305J3939b5763c036
$$ -392986 47609 -197026 102621 137814 -178483 65038 -230644 -106305 -92366 -25763 -3036
9479A471c5603p0303d1980j52125c5560A19571a40522O9941k2175B04024G6493
$$ 1471 -35603 -105906 -41980 -194105 -35560 119571 -140522 -70581 -92756 204024 76493
9467I0300i7392A00394a14159r8386C4051e7448m684C05370b2076l43345J31810
$$ 90300 -97392 100394 -114159 -212545 34051 -57448 -62132 305370 -22076 -365421 -233611
9456b33611j705i1434c4705j29968A65839a28801k97179a70864j08216A24032
$$ -233611 -235316 -91434 -34705 -164673 165839 -128801 -425980 -170864 -279080 124032
9445a98906E1542g0315d174k08479j47335a37446C5897a89421A32490i8924G2483
$$ -198906 51542 -70315 -4174 -212653 -359988 -137446 35897 -189421 132490 -98924 72483
9433h258I1190c4502A19736C0439O7297g6541n1816j98989C3692J36179i3644
$$ -8258 91190 -34502 119736 30439 97736 -76541 -128357 -327346 33692 169871 -93644
9421A12958b68350C94593G6998f7846j38042G5960c1747j20078j22019j18353
$$ 112958 -268350 394593 76998 -67846 -205888 75960 -31747 -151825 -273844 -392197
9411c92197a03526e937o332k05355B97188d22770J18446B0700M6990a92162e8176
$$ -392197 -103526 -5937 -12269 -217624 297188 -422770 -304324 20700 67690 -192162 -58176
9399A26572a48811J493c6815j72257O6434F1145a45835j01863f3812A56182i7139
$$ 126572 -148811 -147318 -36815 -209072 -142638 61145 -145835 -247698 -63812 156182 -97139
9387a05781I5147h9499p016j4724A68084b35404j0197c7641n78k36066J24560
$$ -105781 95147 -89499 -96515 -111239 168084 -235404 -245601 -37641 -38219 -274285 -149725
9376a49725l6877g1598A8254J658O5484j3460K2702h9198L6666A7492a78763Q0665
$$ -149725 -186602 -71598 18254 19912 85396 71936 94638 -89198 -52532 17492 -178763 -98098
9364i8098M7298o3212m1319B4109c90931A89945b00846K7148h6556C0749K3178
$$ -98098 -50800 -114012 -155331 24109 -390931 189945 -200846 -173698 -86556 30749 53927
9353E3927K6120a05759D3062k0088a6646l44935G3303d92496d5344l9316b3654
$$ 53927 80047 -105759 43062 22974 -16646 -361581 73303 -492496 -45344 -84660 -23654
9341A76020k1977C0839M1606b19063i3324D3947K07584K7557a63426B05781d7209
$$ 176020 154043 30839 72445 -219063 -93324 43947 251531 279088 -163426 205781 -47209
9329d8784j04807L949O7866b6766j06587D83799b22547A66377i1617j44651g4168
$$ -48784 -153591 -149642 -81776 -26766 -133353 483799 -222547 166377 -91617 -236268 -74168
9317A15084b41145i7284B51890c33450D1343J74162c5616A96246g0439k38046
$$ 115084 -241145 -97284 251890 -333450 41343 215505 -35616 196246 -70439 -308485
9307c08485a11241m3273D4550A984a87954D9361b47395j12059I3879b92951J31853
$$ -308485 -111241 -154514 44550 1984 -187954 49361 -247395 -359454 93879 -292951 -161098
9296a61098l38048K05493G310M25650c81339f5683A68120F8995b31171k05674
$$ -161098 -499146 -293653 7310 432960 -381339 -65683 168120 68995 -231171 -436845
9286d36845h5151D2728K44318a48697d6615D2364a23809g364o1368B52086j10926
$$ -436845 -85151 42728 287046 -148697 -46615 42364 -123809 -7364 -68732 252086 141160
9275A41160C6564b09307D06387h4770j43588B10713b61198A13578k8958a87751
$$ 141160 36564 -209307 406387 -84770 -228358 210713 -261198 113578 84620 -187751
9264h4457r0580k2213C46425a92947B70645a38040p9779j59953a12842b8067k9762
$$ -84457 -175037 -197250 346425 -192947 270645 -138040 -217819 -377772 -112842 -28067 -57829
9253e7829m1630q5803E6807a874l8760j44975g2598K5765A80923b58338B7347
$$ -57829 -99459 -185262 56807 -1874 -40634 -185609 -72598 -46833 180923 -258338 27347
9241h2397j34460D4833j7873a05957r6900n5481A14414b25258A06250a06107j72891
$$ -82397 -216857 44833 26960 -105957 -202857 -258338 114414 -225258 106250 -106107 -278998
9230b78998b0686k56070h9631l5015b0092C66737q7997c813j58270f8618A32734
$$ -278998 -20686 -276756 -89631 -124646 -20092 366737 278740 -3813 -162083 -68618 132734
9218A63296e5062n3315Q85M4680A82537E3116e9092j53262N4739D07821b53339
$$ 163296 -55062 -108377 -107492 -62812 182537 53116 -59092 -212354 -157615 407821 -253339
9206c35277a04396j24629f0556k23644g2113A0125P0372a14409o0823j48823B65785
$$ -335277 -104396 -229025 -60556 -284200 -72113 10125 80497 -114409 -175232 -324055 265785
9194b16650F0341B9458a98678G6644K9473c1926A1040a32768G9570a73203E5366
$$ -216650 60341 29458 -198678 76644 106117 -31926 11040 -132768 79570 -173203 55366
9182A49471a9080C59578B3577N7359b57284b1981B0892N3712Q4712a53025j76516
$$ 149471 -19080 359578 23577 80936 -257284 -21981 20892 74604 159316 -153025 -329541
9171c29541C8532R272B003L9845d56443A81674d4127F4472a44422E6661J03022
$$ -329541 38532 47804 2003 41848 -456443 181674 -44127 64472 -144422 56661 159683
9160A59683b78671e494A09554Q0856p7481q125l1379Q5885F0829a6437j72384
$$ 159683 -278671 -5494 109554 190410 112929 104804 73425 159310 60829 -16437 -188821
9149a88821M1729q3268l113B00064I5512K90507C8000a87520d2613q6770k26064
$$ -188821 -147092 -230360 -233473 200064 95512 386019 38000 -187520 -42613 -129383 -355447
9138c55447J24093R0774A96683b8616D4050h9234j04383C3611a12997F6782a85744
$$ -355447 -231354 -140580 196683 -28616 44050 -89234 -193617 33611 -112997 66782 -185744
9126C6819R1916e0709A12075c32267E0302b2588o3601k00458a31417e1518B69981
$$ 36819 128735 -50709 112075 -332267 50302 -22588 -86189 -286647 -131417 -51518 269981
9114a21274G597a52293A65996a92106O1097a4684j42011q7031H8761c08798N2658
$$ -121274 7597 -152293 165996 -192106 -131009 -14684 -156695 -243726 88761 -308798 -256140
9103b56140g4429n0118J6609A21142D5726b75747O6386i2842o6293B8484i7541
$$ -256140 -74429 -124547 -107938 121142 45726 -275747 -209361 -92842 -159135 28484 -97541
9091a56378q7329g5643q3152b2570l82608f3402a7038A24932K8580O1044b37582
$$ -156378 -243707 -75643 -158795 -22570 -405178 -63402 -17038 124932 153512 214556 -237582
9079d10706h5974A87229D2577b02552b3635H0425f4604A21148a11730p086N4511
$$ -410706 -85974 187229 42577 -202552 -23635 80425 -64604 121148 -111730 -118816 -64305
9068f4305j58506M8327m7611j28511J60084d3506H0931a00060E1736J11178a81997
$$ -64305 -222811 -174484 -222095 -350606 -190522 -43506 80931 -100060 51736 162914 -181997
9056B15317b73273I4303d3520a5394l38530a52506p8310H0485k3696J440d6789
$$ 215317 -273273 94303 -43520 -15394 -353924 -152506 -230816 80485 56789 58229 -46789
9044c6848j99967A00483d37106a93467j5622E3713a01011J0059A80310H0639b28214
$$ -36848 -236815 100483 -437106 -193467 -209089 53713 -101011 -90952 180310 80639 -228214
9032C5458a14816C8891J90105d6341B15629a29410j86425e617B2198a43620m6930
$$ 35458 -114816 38891 228996 -46341 215629 -129410 -315835 -5617 22198 -143620 -190550
9021a90550h4596k07278A53344p4252a14187d0375k06093j3578G8257a04366j9198
$$ -190550 -84596 -291874 153344 79092 -114187 -40375 -246468 -260046 78257 -104366 -123564
9010a23564A34745a98974A27651N19e4024B21748a82241A20721c08178h2541A19625
$$ -123564 134745 -198974 127651 128170 -54024 221748 -182241 120721 -308178 -82541 119625
8998b89053G0570b06750B34742r8410P3413A2329L01b00721k03620N7091H9496
$$ -289053 70570 -206750 234742 136332 209745 12329 12630 -200721 -404341 -347250 89496
8986c3732m7019A88162e7646j85815I8899g7877A30426b93500B3659a57307f4627
$$ -33732 -80751 188162 -57646 -243461 98899 -77877 130426 -293500 23659 -157307 -64627
8974h8377b3028A7527L5094c52514B13869A03204b28753A96826B3837f0414C1874
$$ -88377 -23028 17527 52621 -352514 213869 103204 -228753 196826 23837 -60414 31874
8962a9261j5444l5127r9365c4424D6059c667B89090a62264A58206h6025j02193
$$ -19261 -34705 -69832 -169197 -34424 46059 -3667 289090 -162264 158206 -86025 -188218
8951a88218g4331A61287D7563j10a9791n10481a45063j04771A83818B9705E209
$$ -188218 -74331 161287 47563 47453 -19791 -530272 -145063 -249834 183818 29705 5209
8939a86505l3144A3787a81757m2455M6755B5104J28148a72837E3922f8296B1878
$$ -186505 -219649 13787 -181757 -224212 -177457 25104 153252 -172837 53922 -68296 21878
8927a6752A8856K82722K34740k2228J364087M739297K152005B382402C67850i3105
$$ -16752 18856 301578 536318 514090 1878177 6617474 8769479 2382402 367850 -93105
8916C39963Q0300C106a3243A28280a62394j03434A82504a52079D46078H917a74236
$$ 339963 420263 3106 -13243 128280 -162394 -265828 182504 -152079 446078 8917 -174236
8904c35760e7430C36712f4710B01233J18789i8453j52164F381f7871k30299P0835
$$ -335760 -57430 336712 -64710 201233 320022 -98453 -250617 6381 -67871 -298170 -227335
8893b27335f5312j20151A42841P9799c61671D111J62242j5431a4091C9514f6112
$$ -227335 -65312 -185463 142841 222640 -361671 4111 166353 150922 -14091 39514 -66112
8881d9146j46818B23194b28179l3469A17121b30242Q2381B25912A0706h521k7013
$$ -49146 -195964 223194 -228179 -261648 117121 -230242 -147861 225912 10706 -8521 -35534
8870c5534C8584b39239m7727A88414R9128p2626G3283J3244d3623m6603D8438
$$ -35534 38584 -239239 -286966 188414 287542 214916 73283 86527 -43623 -90226 48438
8858a93550C2367L6641a2117G8115a01956k85458B13348c29436A00401C5866M8613
$$ -193550 32367 69008 -12117 78115 -101956 -387414 213348 -329436 100401 35866 84479
8847H4479b7518n2685m2135J2565j13627A2397K50835A0440b01925B9730b59578
$$ 84479 -27518 -80203 -122338 -109773 -223400 12397 263232 10440 -201925 29730 -259578
$$ [...]
##END NTUPLES=NMR SPECTRUM
##END=
