##TITLE=AC1662_NPAAH14398_8531281_C23E3ciWJy
##JCAMPDX= 6.0         $$ Bruker NMR JCAMP-DX V2.0
##DATA TYPE= NMR SPECTRUM
##DATA CLASS= NTUPLES
##ORIGIN= BRUKER
##OWNER= Administrator
$$ 1.72 TOPSPIN		Version 2.1
$$ 2014-03-14 15:21:25.774 -0800  Administrator@X
$$ Compression mode = diff/dup
##.OBSERVE FREQUENCY= 400.02188249412
##.OBSERVE NUCLEUS= ^1H
##.ACQUISITION MODE= SIMULTANEOUS (DQD)
##.ACQUISITION SCHEME= undefined
##.AVERAGES= 64
##.DIGITISER RES= 22
##SPECTROMETER/DATA SYSTEM= spect
##.PULSE SEQUENCE= noesygpps1d.comp
##.SOLVENT NAME= COFFEE_meoh
##.SHIFT REFERENCE= INTERNAL, COFFEE_meoh, 1, 14.96093
##AUDIT TRAIL= $$ (NUMBER, WHEN, WHO, WHERE, PROCESS, VERSION, WHAT)
$$ ##TITLE= Audit trail, TOPSPIN		Version 2.1
$$ ##JCAMPDX= 5.01
$$ ##ORIGIN= Bruker BioSpin GmbH
$$ ##OWNER= Administrator
$$ $$ E:\/data/COFFEE/nmr/AC1662_NPAAH14398_8531281_C23E3ciWJy/12/pdata/1/auditp.txt
$$ ##AUDIT TRAIL=  $$ (NUMBER, WHEN, WHO, WHERE, PROCESS, VERSION, WHAT)
(   1,<2014-03-14 15:21:19.805 -0800>,<Administrator>,<X>,<go>,<TOPSPIN 2.1>,
      <created by zg
	started at 2014-03-14 15:10:02.612 -0800,
	POWCHK enabled, PULCHK disabled,
       configuration hash MD5:
       C8 4E 4E 5D D3 5C D8 9E 9F 52 82 E0 59 8A DE 15
       data hash MD5: 64K
       75 D3 70 0D 7F D5 A7 5F 2D EF A4 85 ED 36 A5 02>)
(   2,<2014-03-14 15:21:23.788 -0800>,<Administrator>,<X>,<proc1d>,<TOPSPIN 2.1>,
      <Start of raw data processing
       efp LB = 0.3 FT_mod = 6 PKNL = 1 PHC0 = 0 PHC1 = 0 SI = 128K 
       data hash MD5: 128K
       6F 1B A4 0B 09 6C C4 5F B6 74 DC 2A 44 02 F6 7B>)
(   3,<2014-03-14 15:21:24.781 -0800>,<Administrator>,<X>,<proc1d>,<TOPSPIN 2.1>,
      <pk PHC0 = -85.36926 PHC1 = 0 
       data hash MD5: 128K
       FF AE BE 02 38 1B 29 E1 7D 37 A6 05 83 82 83 B0>)
(   4,<2014-03-14 15:21:25.224 -0800>,<Administrator>,<X>,<proc1d>,<TOPSPIN 2.1>,
      <abs ABSG = 1 
       data hash MD5: 128K
       45 E3 EC 5D 91 E9 5A 60 C5 34 35 43 EB 06 9F DA>)
(   5,<2014-03-14 15:21:25.343 -0800>,<Administrator>,<X>,<proc1d>,<TOPSPIN 2.1>,
      <abs ABSG = 2 
       data hash MD5: 128K
       24 C8 FD F1 3B 77 9B 14 08 3A E3 8A 26 D6 E6 70>)
(   6,<2014-03-14 15:21:25.415 -0800>,<Administrator>,<X>,<proc1d>,<TOPSPIN 2.1>,
      <abs ABSG = 3 
       data hash MD5: 128K
       D0 7D 33 D1 E0 8B 98 E9 CB 8C 89 D4 67 8F 95 9C>)
(   7,<2014-03-14 15:21:25.499 -0800>,<Administrator>,<X>,<proc1d>,<TOPSPIN 2.1>,
      <abs ABSG = 4 
       data hash MD5: 128K
       3B 85 A1 93 FB 96 7C CF 72 52 48 86 C2 18 D1 D8>)
(   8,<2014-03-14 15:21:25.570 -0800>,<Administrator>,<X>,<proc1d>,<TOPSPIN 2.1>,
      <abs ABSG = 5 
       data hash MD5: 128K
       83 B4 3F 0E 3B 2F B9 45 8E F3 DA 2B F6 8C 04 E3>)
$$ ##END=
$$ 
$$ $$ hash MD5
$$ $$ C5 49 5A F7 CB 31 98 E3 14 CB 57 B7 56 FC 1C 32
##$RELAX= 
##$RELAX= 
##$RELAX= 
##$RELAX= 
##$RELAX= 
##$RELAX= 
##$RELAX= 
##$RELAX= 
$$ Bruker specific parameters
$$ --------------------------
##$DU= <E:\>
##$EXPNO= 12
$$ [...]
##$TP07= 0
##$TPNAME0= <>
##$TPNAME1= <>
##$TPNAME2= <>
##$TPNAME3= <>
##$TPNAME4= <>
##$TPNAME5= <>
##$TPNAME6= <>
##$TPNAME7= <>
##$TPOAL= (0..7)
0.5 0.5 0.5 0.5 0.5 0.5 0.5 0.5
##$TPOFFS= (0..7)
0 0 0 0 0 0 0 0
##$TUNHIN= 0
##$TUNHOUT= 0
##$TUNXOUT= 0
##$USERA1= <user>
##$USERA2= <user>
##$USERA3= <user>
##$USERA4= <user>
##$USERA5= <user>
##$V9= 5
##$VALIST= <valist>
##$VCLIST= <CCCCCCCCCCCCCCC>
##$VD= 0
##$VDLIST= <DDDDDDDDDDDDDDD>
##$VPLIST= <PPPPPPPPPPPPPPP>
##$VTLIST= <TTTTTTTTTTTTTTT>
##$WBST= 1024
##$WBSW= 4
##$XGAIN= (0..3)
0 0 0 0
##$XL= 0
##$YL= 0
##$YMAX_a= 8259582
##$YMIN_a= -8613294
##$ZGOPTNS= <>
##$ZL1= 120
##$ZL2= 120
##$ZL3= 120
##$ZL4= 120
##$ABSF1= 14.96093
##$ABSF2= -5.597252
##$ABSG= 5
##$ABSL= 3
##$ALPHA= 0
##$AQORDER= 0
##$ASSFAC= 0
##$ASSFACI= 0
##$ASSFACX= 0
##$ASSWID= 0
##$AUNMP= <proc_prof1d_extract.lims>
##$AXLEFT= 0
##$AXNAME= <>
##$AXNUC= <1H>
##$AXRIGHT= 0
##$AXTYPE= 0
##$AXUNIT= <>
##$AZFE= 0.1
##$AZFW= 0.1
##$BCFW= 0
##$BC_mod= 0
##$BYTORDP= 0
##$COROFFS= 0
##$CY= 15
##$DATMOD= 1
##$DC= 0
##$DFILT= <>
##$DTYPP= 0
##$F1P= 0
##$F2P= 0
##$FCOR= 0.5
##$FTSIZE= 131072
##$FT_mod= 6
##$GAMMA= 0
##$GB= 0
##$INTBC= 1
##$INTSCL= 1
##$ISEN= 128
##$LB= 0.3
##$LEV0= 0
##$LPBIN= 0
##$MAXI= 10000
##$MC2= 0
##$MEAN= 0
##$ME_mod= 0
##$MI= 0
##$NCOEF= 0
##$NC_proc= -2
##$NLEV= 6
##$NOISF1= 0
##$NOISF2= 0
##$NSP= 0
##$NTH_PI= 0
##$NZP= 0
##$OFFSET= 14.96093
##$PC= 1
##$PHC0= -85.36926
##$PHC1= 0
##$PH_mod= 1
##$PKNL= yes
##$PPARMOD= 0
##$PPDIAG= 0
##$PPIPTYP= 0
##$PPMPNUM= 2147483647
##$PPRESOL= 1
##$PSCAL= 4
##$PSIGN= 0
##$PYNMP= <proc.py>
##$REVERSE= no
##$SF= 400.020009664183
##$SI= 131072
##$SIGF1= 0
##$SIGF2= 0
##$SINO= 400
##$SIOLD= 131072
##$SPECTYP= <>
##$SREGLST= <1H.CDCl3>
##$SSB= 0
##$STSI= 131072
##$STSR= 0
##$SW_p= 8223.68421052631
##$SYMM= 0
##$S_DEV= 0
##$TDeff= 65536
##$TDoff= 0
##$TI= <>
##$TILT= no
##$TM1= 0
##$TM2= 0
##$TOPLEV= 0
##$USERP1= <user>
##$USERP2= <user>
##$USERP3= <user>
##$USERP4= <user>
##$USERP5= <user>
##$WDW= 1
##$XDIM= 131072
##$YMAX_p= 322375164
##$YMIN_p= -483836625
##$CURPLOT= <Network HP LaserJet P1505>
##$CURPRIN= <$Network HP LaserJet P1505>
##$DFORMAT= <normdp>
##$LAYOUT= <+/1D_H.xwp>
##$LFORMAT= <normlp>
##$PFORMAT= <normpl>
##$SURQMSG= 1
$$ End of Bruker specific parameters
$$ ---------------------------------
##NTUPLES= NMR SPECTRUM
##VAR_NAME=  FREQUENCY,     SPECTRUM/REAL,   SPECTRUM/IMAG
##SYMBOL=    X,             R,               I
##VAR_TYPE=  INDEPENDENT,   DEPENDENT,       DEPENDENT
##VAR_FORM=  AFFN,          ASDF,            ASDF
##VAR_DIM=   131072,        131072,          131072
##UNITS=     HZ,            ARBITRARY UNITS, ARBITRARY UNITS
##FACTOR=    0.0627417313425164, 1,          1
##FIRST=     8223.62146879497, 792,          -46816
##LAST=      0,             1691,            -47445
##MIN=       0,             -483836625,      0
##MAX=       8223.62146879497, 322375164,    0
$$ Real data points
##PAGE= N=1
##DATA TABLE= (X++(R..R)), XYDATA
$$ [...]
$$ plain form
62752 2035895 1923486 1810986 1701088 1595925 1496482 1402919 1315499 1234895 1161512 1094960
62742 1094960 1034397 979165 928954 883679 843415 808109 777108 749267 723885 701281 682041
62731 682041 665883 651717 638772 627208 617538 609850 603790 599016 595439 593133 592131 592190 592742 593296
62717 593296 594025 595745 599149 604277 610955 619422 630085 642817 657121 673122 691733 713521 737951
62704 737951 764400 793479 826561 864178 905692 950637 999430 1052445 1109261 1169456 1233501
62693 1233501 1302058 1374727 1450182 1527145 1604353 1679697 1750293 1813589 1867800 1911246 1941997
62682 1941997 1958497 1960035 1946508 1918293 1876627 1823536 1761029 1690708 1614350 1534335 1453124
62671 1453124 1372614 1294224 1219116 1147931 1080713 1017545 959037 905858 858114 815527 777843
$$ packed form
62752B035895j12409j12500j09898j05163r9443r3563q7420q0604p3383o6552
62742A094960o0563n5232n0211m5275m0264l5306l1001k7841k5382k2604j9240
62731F82041j6158j4166j2945j1564r670p688o060m774l577k306j002N9N52N54
62717E93296P29J720L404N128O678Q467J0663J2732J4304J6001J8611K1788K4430
62704G37951K6449K9079L3082L7617M1514M4945M8793N3015N6816O0195O4045
62693A233501O8557P2669P5455P6963P7208P5344P0596O3296N4211M3446L0751
62682A941997J6500J538j3527k8215m1666n3091o2507p0321p6358q0015q1211
62671A453124q0510p8390p5108p1185o7218o3168n8508n3179m7744m2587l7684
$$ plain form
62660 777843 744591 714748 687274 661918 639082 618975 601315 585755 572113 560029 548785
62649 548785 537661 526445 515617 506065 498388 492255 486613 480762 475071 470410 467149 465021 463724
62636 463724 463173 463253 463729 464438 465218 465666 465279 463864 461570 458608 455260 452057 449575 447980 447075 446733 446954
62619 446954 447627 448647 450320 453148 457160 461844 466841 472286 478322 484789 491631 499145 507445 516042
62605 516042 524460 533073 542917 554694 568331 583567 600709 620727 644674 672979 705198 740510
62593 740510 778551 819658 864287 912381 963490 1017177 1072837 1129102 1183778 1234535 1279527
62582 1279527 1317326 1346564 1365905 1374436 1372069 1359705 1338868 1310904 1276348 1235358 1188887 1139135
62570 1139135 1088392 1037609 986641 935944 887353 842759 802471 765497 731162 699782 671778
$$ packed form
62660G77843l3252k9843k7474k5356k2836k0107j7660j5560j3642j2084j1244
62649E48785j1124j1216j0828r552p677o133n642n851n691m661l261k128j297
62636D63724n51Q0M76P09P80M48l87j415k294k962l348l203k482j595r05l42K21
62619D46954O73J020J673K828M012M684M997N445O036O467O842P514Q300Q597
62605E16042Q418Q613R844J1777J3637J5236J7142K0018K3947K8305L2219L5312
62593G40510L8041M1107M4629M8094N1109N3687N5660N6265N4676N0757M4992
62582A279527L7799K9238J9341Q531k367j2364k0837k7964l4556m0990m6471m9752
62570A139135n0743n0783n0968n0697m8591m4594m0288l6974l4335l1380k8004
$$ plain form
62559 671778 646962 625014 606035 590076 576484 564318 553251 543571 535346 528121 521486 515547
62547 515547 510695 507168 504896 503485 502302 500862 499270 498056 497495 497367 497486 498089 499368 500767 501167
62532 501167 500003 498146 497463 499304 503361 508172 512785 517636 523707 531293 540136 550450 563047 578351
62518 578351 595986 615599 637502 662161 689621 719870 753315 790328 830647 873768 919672
62507 919672 968485 1019511 1071086 1121352 1168652 1211384 1248185 1278455 1302147 1318930 1328193 1330108
62495 1330108 1326164 1318272 1307781 1295814 1284163 1275223 1271039 1272629 1280101 1293144 1311576 1335699
62483 1335699 1366047 1402602 1444466 1490505 1539917 1591541 1642626 1688754 1725357 1749609 1761381
62472 1761381 1762748 1756019 1741318 1715892 1676364 1622027 1555867 1482528 1405768 1327712 1249542 1172203
$$ packed form
62559F71778k4816k1948j8979j5959j3592j2166j1067r680q225p225o635n939
62547E15547m852l527k272j411j183j440j592j214n61j28J19O03J279J399M00
62532E01167j164j857o83J841M057M811M613M851O071P586Q843J0314J2597J5304
62518E78351J7635J9613K1903K4659K7460L0249L3445L7013M0319M3121M5904
62507I19672M8813N1026N1575N0266M7300M2732L6801L0270K3692J6783R263J915
62495A330108l944p892j0491j1967j1651q940m184J590P472J3043J8432K4123
62483A335699L0348L6555M1864M6039M9412N1624N1085M6128L6603K4252J1772
62472A761381J367o729j4701k5426l9528n4337o6160p3339p6760p8056p8170p7339
$$ plain form
62460 1172203 1096748 1024570 957244 895909 840995 792714 751461 717350 689642 667059 648560
62449 648560 633483 621187 611079 603010 597251 594036 593382 595262 599540 605659 612770 620326 628360 637165
62435 637165 646823 656922 666338 673387 676713 676235 672905 667471 659855 649901 638200 625779 613269
62422 613269 600831 588690 577200 566434 556141 546277 537260 529479 522701 516137 509070 501410 493753
62409 493753 486966 481589 477457 473890 470313 466720 463556 461228 459831 459244 459246 459475 459558 459596 460392 462832 466934
62392 466934 471728 476136 479754 482759 485469 488210 491245 494472 497462 500162 503353 507947 513932 520454
62378 520454 526917 533567 540971 549354 558512 567991 577248 585981 594499 603511 613467 624319 635938 648495
62364 648495 662487 678758 698415 722220 749901 780591 814101 851353 893320 940012 990703
$$ packed form
62460A172203p5455p2178o7326o1335n4914m8281m1253l4111k7708k2583j8499
62449F48560j5077j2296j0108q069n759l215o54J880M278O119P111P556Q034Q805
62435F37165R658J0099R416P049L326m78l330n434p616r954j1701j2421j2510
62422F13269j2438j2141j1490j0766j0293r864r017p781o778o564p067p660p657
62409D93753o787n377m132l567l577l593l164k328j397n87KK29Q3L8P96K440M102
62392D66934M794M408L618L005K710K741L035L227K990K700L191M594N985O522
62378E20454O463O650P404Q383R158R479R257Q733Q518R012R956J0852J1619J2557
62364F48495J3992J6271J9657K3805K7681L0690L3510L7252M1967M6692N0691
$$ plain form
62353 990703 1044641 1101088 1158907 1216379 1271104 1320007 1360152 1390161 1410567 1422480 1426413 1422811
62341 1422811 1412952 1398333 1379376 1355587 1326943 1294384 1259059 1221947 1184247 1147260 1111620
62330 1111620 1077353 1044981 1015789 990521 968456 948341 929710 912608 896423 879831 861924
62319 861924 842710 822423 800967 778341 755172 732383 710488 689536 669681 651423 635225
62308 635225 621145 609046 599019 591358 586101 582840 581062 580562 581382 583465 586535 590403 595230 601341
62294 601341 608668 616472 623864 630694 637732 645722 654460 663049 670893 677959 684158 689110 692722 695474
62280 695474 697761 699411 700242 700673 701235 701764 701643 700712 699436 698327 697729 698136 700115 703790 708885 715378
62264 715378 723740 734439 747645 763641 783143 806969 835616 869309 908278 952731 1002583 1057183
$$ packed form
62353I90703N3938N6447N7819N7472N4725M8903M0145L0009K0406J1913L933l602
62341A422811r859j4619j8957k3789k8644l2559l5325l7112l7700l6987l5640
62330A111620l4267l2372k9192k5268k2065k0115j8631j7102j6185j6592j7907
62319H61924j9214k0287k1456k2626k3169k2789k1895k0952j9855j8258j6198
62308F35225j4080j2099j0027p661n257l261j778n00Q20K083L070L868M827O111
62294F01341P327P804P392O830P038P990Q738Q589P844P066O199M952L612K752
62280F95474K287J650Q31M31N62N29j21r31j276j109n98M07J979L675N095O493
62264G15378Q362J0699J3206J5996J9502K3826K8647L3693L8969M4453M9852N4600
$$ plain form
62252 1057183 1115209 1174937 1234870 1293968 1350869 1403035 1447267 1481362 1505021 1519078 1524313
62241 1524313 1521185 1510136 1491573 1465602 1432150 1391392 1344056 1291497 1235638 1178611 1122173
62230 1122173 1067476 1015356 966619 921916 881604 845889 814849 788124 764910 744626 727360
62219 727360 713207 701339 690308 679496 669791 662400 657158 652451 646860 640553 634840 630686 628034
62206 628034 626476 625954 626498 627706 629035 630615 633379 638171 644849 652263 659058 664582 669279 674215 680076
62191 680076 686654 693334 699833 706242 712564 718729 725098 732533 741709 752420 763612 774042 783088
62178 783088 791138 799082 807166 814555 820318 824685 828913 834137 840931 849859 861713 877095 896486
62165 896486 920852 951356 987942 1028816 1071860 1116031 1160741 1204330 1244042 1277506 1303641
$$ packed form
62252A057183N8026N9728N9933N9098N6901N2166M4232L4095K3659J4057N235
62241A524313l128j1049j8563k5971l3452m0758m7336n2559n5859n7027n6438
62230A122173n4697n2120m8737m4703m0312l5715l1040k6725k3214k0284j7266
62219G27360j4153j1868j1031j0812r705p391n242m707n591o307n713m154k652
62206F28034j558n22N44J208J329J580K764M792O678P414O795N524M697M936N861
62191F80076O578O680O499O409O322O165O369P435R176J0711J1192J0430R046
62178G83088Q050P944Q084P389N763M367M228N224O794Q928J1854J5382J9391
62165H96486K4366L0504L6586M0874M3044M4171M4710M3589L9712L3464K6135
$$ plain form
62154 1303641 1322172 1332994 1336401 1333455 1325595 1313731 1297839 1277453 1252547 1223842 1192313 1158617
62142 1158617 1123288 1087336 1052243 1019279 989163 962493 940018 922181 908593 898207 889854
62131 889854 882589 875873 869600 863626 857194 849323 840007 830481 821959 814635 808414 803955 802088 802480
62117 802480 803769 805098 806779 809370 812878 817128 822247 828201 834043 838046 838669 835401 828906 820526
62103 820526 811669 803597 797587 794672 794708 795862 795631 792613 787226 780914 775054 770470 767384 765565 764777
62088 764777 765154 766955 770017 773858 778300 783551 789635 796240 803267 811034 819725 829100 839124 850535
62074 850535 864290 880528 898312 916337 933749 950493 967100 984156 1001960 1020799 1041326
62063 1041326 1064153 1089007 1114817 1140880 1167306 1193835 1218679 1239240 1253779 1261918 1263841 1259882
$$ packed form
62154A303641J8531J0822L407k946p860j1864j5892k0386k4906k8705l1529l3696
62142A158617l5329l5952l5093l2964l0116k6670k2475j7837j3588j0386q353
62131H89854p265o716o273n974o432p871r316r526q522p324o221m459j867L92
62117H02480J289J329J681K591L508M250N119N954N842M003O23l268o495q380
62103H20526q857q072o010k915L6J154k31l018n387o312n860m584l086j819p88
62088G64777L77J801L062L841M442N251O084O605P027P767Q691R375J0024J1411
62074H50535J3755J6238J7784J8025J7412J6744J6607J7056J7804J8839K0527
62063A041326K2827K4854K5810K6063K6426K6529K4844K0561J4539Q139J923l959
$$ plain form
62051 1259882 1250940 1238436 1223359 1205682 1184875 1160577 1132606 1100884 1065855 1028682 990572
62040 990572 952045 913205 874527 836928 801119 767335 735698 706524 680101 656437 635329
62029 635329 616531 599876 585404 573367 563890 556561 550572 545217 540100 534993 529892 525189 521240
62016 521240 517616 513286 507828 502027 496928 492746 489130 486004 483504 481489 479917 479495 480998 483876
62002 483876 486495 488127 489886 493170 497878 502802 507221 511257 514940 517859 519836 521242 522324 522664
61988 522664 521558 518655 514023 507828 500193 491293 481511 471501 462065 453756 446577 440170 434316 429044
61974 429044 424280 419701 415077 410564 406525 403177 400596 398860 397868 397093 395858 394085 392502 391893 392299
61959 392299 393180 394128 394928 394994 393516 390616 387859 386955 388184 390592 393493 397004 401181 405518 409704 414229
$$ packed form
62051A259882q942j2504j5077j7677k0807k4298k7971l1722l5029l7173l8110
62040I90572l8527l8840l8678l7599l5809l3784l1637k9174k6423k3664k1108
62029F35329j8798j6655j4472j2037r477p329n989n355n117n107n101m703l949
62016E21240l624m330n458n801n099m182l616l126k500k015j572m22J503K878
62002D83876K619J632J759L284M708M924M419M036L683K919J977J406J082L40
61988E22664j106k903m632o195p635q900r782j0010r436q309p179o407n854n272
61974D29044m764m579m624m513m039l348k581j736r92p75j235j773j583o09M06
61959C92299Q81R48Q00O6j478k900k757r04J229K408K901L511M177M337M186M525
$$ plain form
61943 414229 419844 426921 435668 446401 458981 472453 485906 499446 513667 528403 542719 556082
61931 556082 568730 580745 591565 600856 609230 617422 625007 630558 633106 632916 630720 626705 620704 613145
61917 613145 605213 597945 591617 586260 582345 580417 580352 581641 584425 589534 597269 606759 616907 627416
61903 627416 638299 648791 657440 663276 666412 667547 667286 665902 663295 659059 652945 645396 637462 630111
61889 630111 623710 618098 612947 608098 603674 599825 596362 592835 589063 585254 581370 576700 570396 562211
61875 562211 552429 541514 530300 520137 512161 506433 502329 499567 498240 498031 498275 498926 500657 503709
61861 503709 507340 510888 514811 520100 527036 535125 544094 554384 566518 580347 595136 610367 626332
61848 626332 643819 663128 683523 703803 723321 742136 760247 776987 791245 802075 809006 812078
$$ packed form
61943D14229N615P077Q747J0733J2580J3472J3453J3540J4221J4736J4316J3363
61931E56082J2648J2015J0820R291Q374Q192P585N551K548j90k196m015o001p559
61917F13145p932p268o328n357l915j928o5J289K784N109P735R490J0148J0509
61903F27416J0883J0492Q649N836L136J135k61j384k607m236o114p549p934p351
61889F30111o401n612n151m849m424l849l463l527l772l809l884m670o304q185
61875E62211r782j0915j1214j0163p976n728m104k762j327k09K44O51J731L052
61861E03709L631L548L923N289O936Q089Q969J0290J2134J3829J4789J5231J5965
61848F26332J7487J9309K0395K0280J9518J8815J8111J6740J4258J0830O931L072
$$ plain form
61836 812078 811740 808611 803276 796272 788125 779301 770350 762289 756480 753705 753613 755531 759559 766179 774952
61821 774952 784425 793417 801657 808914 814245 816509 815115 809930 801042 789015 774943 759808 744104
61808 744104 728326 713276 699401 686338 673655 661628 650662 640339 629811 619046 608974
61797 608974 600314 592827 585782 578698 571542 564644 558559 553612 549416 545127 540384 535738 531979 529238
61783 529238 526968 524701 522582 521125 520556 520490 520206 519212 517547 515745 514542 514397 515009 515408 514849 513621
61767 513621 512672 512532 513031 514025 515779 518363 521264 524035 526959 530608 535092 540165 545736 551643 557115
61752 557115 561107 563188 563645 562753 560516 557182 553399 549550 545321 540261 534560 529048 524520 521186 518610
61737 518610 516042 512939 509376 505954 503304 501700 501076 501208 501799 502537 503165 503495 503377 502848 502330 502472 503604
$$ packed form
61836H12078l38l129n335p004q147q824q951q061n809k775r2J918M028O620Q773
61821G74952R473Q992Q240P257N331K264j394n185q888j2027j4072j5135j5704
61808G44104j5778j5050j3875j3063j2683j2027j0966j0323j0528j0765j0072
61797F08974q660p487p045p084p156o898o085m947m196m289m743m646l759k741
61783E29238k270k267k119j457n69o6k84r94j665j802j203j45O12L99n59j228
61767E13621r49j40M99R94J754K584K901K771K924L649M484N073N571N907N472
61752E57115L992K081M57q92k237l334l783l849m229n060n701n512m528l334k576
61737E18610k568l103l563l422k650j604o24J32N91P38O28L30j18n29n18J42J132
$$ plain form
61720 503604 505389 507157 508584 510000 511973 514669 517666 520336 522252 523172 522844 521104 518132 514397 510323
61705 510323 506150 502020 497925 493586 488838 484206 480648 478446 476774 474647 471918 468868 465281 460684
61691 460684 455365 450313 445994 441891 437596 433681 430871 428785 426228 422701 418980 416038 413944 412135
61677 412135 410371 408919 407910 407003 405790 404213 402454 400698 399255 398660 399273 400815 402576 404068 405211
61662 405211 405910 405901 405212 404495 404604 405949 408400 411593 415038 418135 420558 422698 425320 428561 431519 433179
61646 433179 433612 433879 434742 435932 436885 437727 438967 440426 441205 440864 440015 439459 439298 439336 439729 440566 441178 440736
61628 440736 439428 438215 437416 436308 434294 431663 428866 425765 422098 418178 414545 411274 408090 404948
61614 404948 402045 399437 397014 394710 392460 390096 387504 384698 381532 377631 372886 367807 363124 359231
$$ packed form
61720E03604J785J768J427J416J973K696K997K670J916R20l28j740k972l735m074
61705E10323m173m130m095m339m748m632l558k202j672k127k729l050l587m597
61691D60684n319n052m319m103m295l915k810k086k557l527l721k942k094j809
61677D12135j764j452j009r07j213j577j759j756j443n95O13J542J761J492J143
61662D05211O99ro89p17J09J345K451L193L445L097K423K140K622L241K958J660
61646D33179M33K67Q63J190R53Q42J240J459P79l41q49n56j61L8L93Q37O12m42
61628D40736j308j213p99j108k014k631k797l101l667l920l633l271l184l142
61614D04948k903k608k423k304k250k364k592k806l166l901m745n079m683l893
$$ plain form
61600 359231 356164 353789 351754 349558 347018 344405 341926 339418 336855 334673 333140 331768 329912 327724
61586 327724 325953 324949 324356 323712 322870 321914 321056 320574 320497 320447 320115 319705 319534 319392 318780 317650 316436 315519
61568 315519 315103 315481 316846 318825 320702 322192 323597 325216 326986 328673 330010 330714 330799 330887 331706 333255
61552 333255 334815 335768 336032 335816 335495 335696 336897 338834 340759 342372 344015 345878 347597 348786 349506 350000
61536 350000 350401 350893 351747 353029 354630 356639 359201 361892 363797 364501 364507 364357 363801 362257 359740 356870
61520 356870 354163 351661 349178 346690 344522 343199 342916 343129 343041 342531 342195 342355 342533 342174 341473 341066 341210
61503 341210 341633 341993 342177 342302 342626 343306 344077 344507 344713 345482 347389 350110 352891 355339 357426 359026 359923
61486 359923 360215 360303 360545 361156 362325 364219 366919 370467 374770 379326 383348 386368 388507 390030 390998 391573
$$ packed form
61600C59231l067k375k035k196k540k613k479k508k563k182j533j372j856k188
61586C27724j771j004n93o44q42r56q58m82p7n0l32m10j71j42o12j130j214r17
61568C15519m16L78J365J979J877J490J405J619J770J687J337P04Q5Q8Q19J549
61552C33255J560R53K64k16l21K01J201J937J925J613J643J863J719J189P20M94
61536C50000M01M92Q54J282J601K009K562K691J905P04Oj50n56j544k517k870
61520C56870k707k502k483k488k168j323k83K13q8n10l36J60J78l59p01m07J44
61503C41210M23L60J84J25L24O80P71M30K06P69J907K721K781K448K087J600Q97
61486C59923K92Q8K42O11J169J894K700L548M303M556M022L020K139J523R68N75
$$ plain form
61470 391573 392175 392930 393345 392958 391993 390931 389817 388541 387447 386956 386787 386278 385380 384595 383971 383044 381873
61453 381873 381322 381886 382942 383576 383592 383185 382214 380494 378539 377245 376916 377131 377526 378136 378927 379579 379958 380399
61435 380399 381247 382366 383425 384464 385894 387942 390245 392032 392681 392248 391513 391354 391960 392754 393213 393545
61419 393545 394384 395973 397952 399871 401545 402887 403793 404352 404918 405708 406491 406872 406745 406318 405808 405321 404935
61402 404935 404645 404229 403368 401958 400280 398894 398361 398904 400155 401318 401743 401387 400753 400454 400809 401629 402376
61385 402376 402742 403069 403922 405255 406517 407692 409641 412964 417065 420918 424369 427997 431970 435807 439193
61370 439193 442286 445192 447786 450137 452496 454747 456468 457671 458888 460390 461979 463710 466152 469533
61356 469533 473255 476693 480023 483823 488278 493217 498529 504113 509708 515167 520578 525715 529725 531875
$$ packed form
61470C91573O02P55M15l87r65j062j114j276j094m91j69n09q98p85o24r27j171
61453C81873n51N64J056O34J6m07r71j720j955j294l29K15L95O10P91O52L79M41
61435C80399Q48J119J059J039J430K048K303J787O49m33p35j59O06P94M59L32
61419C93545Q39J589J979J919J674J342R06N59N66P90P83L81j27m27n10m87l86
61402D04935k90m16q61j410j678j386n33N43J251J163M25l56o34k99L55Q20P47
61385D02376L66L27Q53J333J262J175J949L323M101L853L451L628L973L837L386
61370D39193L093K906K594K351K359K251J721J203J217J502J589J731K442L381
61356D69533L722L438L330L800M455M939N312N584N595N459N411N137M010K150
$$ plain form
61342 531875 532415 532318 532318 532511 532658 532547 532198 531947 532091 532294 531741 530158 528257 526806 525730 524550 523171 521684
61324 521684 519858 517594 515543 514497 514365 514559 515212 517150 520660 525168 530296 536439 543990 552698 562158
61309 562158 572456 583962 596914 611466 627738 645538 664364 683783 703373 722101 738281
61298 738281 750544 758560 762635 763091 760389 755315 748499 739976 729632 717842 705205 691942 678063
61285 678063 664040 650746 638773 628212 619071 611486 605432 600715 597330 595455 594911 595005 595170 595505
61271 595505 596417 597959 599826 601885 604326 607184 609982 612056 613252 614296 616440 620659 627087 635124
61257 635124 643988 653051 661707 669262 675231 679639 682749 684544 684759 683457 681232 678641 675652 671894
61243 671894 667298 662291 657458 653237 649883 647462 645840 644773 644000 643232 642233 641104 640427 640915 642998
$$ packed form
61342E31875N40r7%J93J47j11l49k51J44K03n53j583j901j451j076j180j379j487
61324E21684j826k264k051j046j32J94O53J938L510M508N128O143P551Q708R460
61309E62158J0298J1506J2952J4552J6272J7800J8826J9419J9590J8728J6180
61298G38281J2263Q016M075M56k702n074o816q523j0344j1790j2637j3263j3879
61285F78063j4023j3294j1973j0561r141p585o054m717l385j875n44R4J65L35
61271E95505R12J542J867K059K441K858K798K074J196J044K144M219O428Q037
61257F35124Q864R063Q656P555N969M408L110J795K15j302k225k591k989l758
61243F71894m596n007m833m221l354k421j622j067p73p68r99j129o77M88K083
$$ plain form
61228 642998 646840 652520 659854 668168 676714 685318 694341 703976 713940 723874 733688 743412 753016 762518
61214 762518 771960 781183 789894 798056 805878 813338 820040 825699 830434 834487 837988 841146 844313 847700
61200 847700 851471 856292 863293 873058 884991 898039 911789 926566 942824 960716 979781 998472
61188 998472 1014371 1025560 1031838 1034379 1034500 1033125 1030900 1028004 1023934 1018068 1010419 1001322 990661 978192
61174 978192 964555 951063 938242 925284 911223 896073 880459 864731 848909 833095 817412
61163 817412 801755 785965 770168 754688 739849 725994 713445 702170 691766 682134 674002 668401
61151 668401 665633 664993 665612 667373 670858 676388 683154 689356 693220 693871 691343 686194 679429 672495 666661
61136 666661 662227 658607 655350 652795 651755 652877 656457 662515 670823 681030 692912 706358 721138
$$ packed form
61228F42998L842N680P334Q314Q546Q604R023R635R964R934R814R724R604R502
61214G62518R442R223Q711Q162P822P460O702N659M735M053L501L158L167L387
61200H47700L771M821P001R765J1933J3048J3750J4777J6258J7892J9065J8691
61188I98472J5899J1189O278K541J21j375k225k896m070n866p649r097j0661j2469
61174I78192j3637j3492j2821j2958j4061j5150j5614j5728j5822j5814j5683
61163H17412j5657j5790j5797j5480j4839j3855j2549j1275j0404r632q132n601
61151F68401k768o40O19J761L485N530O766O202L864O51k528n149o765o934n834
61136F66661m434l620l257k555j040J122L580O058Q308J0207J1882J3446J4780
$$ plain form
61123 721138 737036 754332 773738 795678 819854 845692 872876 901242 930510 960439 991032
61112 991032 1022234 1053599 1084490 1114420 1142948 1169527 1193882 1216355 1237417 1256841 1273694
61101 1273694 1287090 1296612 1301995 1302875 1299057 1290798 1278696 1263413 1245472 1225081 1202128 1176751
61089 1176751 1150026 1123737 1099180 1076380 1054691 1033948 1014701 997568 982787 970402 960444
61078 960444 952783 947058 943000 940662 940234 941836 945589 951604 959677 969178 979585 991002 1003909 1018470
61064 1018470 1034414 1051469 1069552 1088539 1108303 1129082 1151366 1175218 1200131 1225809 1252718
61053 1252718 1281436 1311775 1342955 1374392 1405826 1436863 1467106 1496770 1526538 1556522 1585836
61042 1585836 1613552 1639621 1664453 1687926 1709472 1728974 1746920 1763564 1778615 1792150 1805211
$$ packed form
61123G21138J5898J7296J9406K1940K4176K5838K7184K8366K9268K9929L0593
61112I91032L1202L1365L0891K9930K8528K6579K4355K2473K1062J9424J6853
61101A273694J3396R522N383Q80l818q259j2102j5283j7941k0391k2953k5377
61089A176751k6725k6289k4557k2800k1689k0743j9247j7133j4781j2385r958
61078I60444p661n725m058k338m28J602L753O015Q073R501J0407J1417J2907J4561
61064A018470J5944J7055J8083J8987J9764K0779K2284K3852K4913K5678K6909
61053A252718K8718L0339L1180L1437L1434L1037L0243K9664K9768K9984K9314
61042A585836K7716K6069K4832K3473K1546J9502J7946J6644J5051J3535J3061
$$ plain form
61031 1805211 1818810 1832525 1844853 1855081 1864215 1873835 1884676 1896790 1910599 1926995 1946411 1968383
61019 1968383 1992086 2016977 2043008 2070828 2102091 2139271 2184990 2241500 2310436 2392512 2487423
61008 2487423 2594649 2714812 2850539 3006629 3190115 3410085 3676863 4001148 4393891
60999 4393891 4866442 5430913 6102413 6903195 7864780 9025856 10429495 12118011 14108674
60990 14108674 16339307 18616085 20631062 22079098 22808385 22890587 22563595 22111835 21777904
60981 21777904 21724666 22001023 22495558 22934953 22981261 22390036 21120043 19322548 17240197
60972 17240197 15101965 13070248 11236222 9635150 8265329 7106758 6135011 5326328
60964 5326328 4657341 4105774 3652641 3282179 2979556 2730046 2520684 2341647 2186081
$$ packed form
61031A805211J3599J3715J2328J0228R134R620J0841J2114J3809J6396J9416K1972
61019A968383K3703K4891K6031K7820L1263L7180M5719N6510O8936Q2076R4911
61008B487423J07226J20163J35727J56090J83486K19970K66778L24285L92743
60999D393891M72551N64471O71500Q00782R61585J161076J403639J688516J990663
60990A4108674K230633K276778K014977J448036P29287Q2202l26992m51760l33931
60981B1777904n3238K76357M94535M39395M6308n91225j269993j797495k082351
60972A7240197k138232k031717j834026j601072j369821j158571r71747q08683
60964E326328o68987n51567m53133l70462l02623k49510k09362j79037j55566
$$ plain form
60955 2186081 2049609 1929814 1824781 1731712 1647710 1571689 1504236 1445413 1393851 1348152 1307717
60944 1307717 1271491 1237090 1202146 1165917 1128926 1091720 1054691 1018467 983632 950343 918763
60933 918763 889484 862985 839061 817259 797561 780150 764851 751264 739164 728372 718531 709362
60921 709362 700872 693012 685530 678428 672126 666801 661939 656962 651929 647337 643611 641076 639908 639736
60907 639736 639764 639706 640047 640987 641716 641285 639716 637632 635272 632528 629478 626159 622078 616653 609892 602100
60891 602100 593297 583623 573959 565377 558101 551673 545850 540572 535299 529277 522399 515077 507367 499113
60877 499113 490975 484292 479608 476053 472585 469228 466700 465353 464910 464936 465165 465539 466098 466787 467396 467941
60861 467941 469033 471418 475093 479212 483043 486695 490805 495765 501362 506905 511610 515054 517398 519122
$$ packed form
60955B186081j36472j19795j05033r3069q4002p6021o7453n8823n1562m5699m0435
60944A307717l6226l4401l4944l6229l6991l7206l7029l6224l4835l3289l1580
60933I18763k9279k6499k3924k1802j9698j7411j5299j3587j2100j0792r841r169
60921G09362q490p860p482p102o302n325m862m977n033m592l726k535j168j72
60907F39736K8n8L41R40P29m31j569k084k360k744l050l319m081n425o761p792
60891F02100q803r674r664q582p276o428n823n278n273o022o878p322p710q254
60877D99113q138o683m684l555l468l357k528j347m43K6K29L74N59O89O09N45
60861D67941J092K385L675M119L831L652M110M960N597N543M705L444K344J724
$$ plain form
60847 519122 520662 522407 524789 528038 531873 535655 538686 540201 539438 536198 531157 525187 518533 511102
60833 511102 503308 495983 489563 483939 479084 475073 471501 467627 463361 459447 456339 453472 450086 446308
60819 446308 442905 440234 437911 435410 432574 429451 425932 421724 416692 411144 405664 400671 396279 392549
60805 392549 389556 387106 384810 382718 381389 380913 380356 378853 376926 375881 376104 376804 377424 378350 379974 381902
60789 381902 383511 384640 385379 385789 386226 387387 389526 392001 394035 395582 397143 399099 401572 404487 407265
60774 407265 408833 408520 406888 405260 404545 404742 405363 405903 406070 405944 405906 406191 406619 406931 407196 407638 408173 408418
60756 408418 408072 407105 405665 403912 401878 399484 396872 394646 393385 392862 392231 391178 390364 390391 390845 390823 389956
60739 389956 388295 385580 381405 376074 370637 365969 362275 359477 357478 355944 354401 352845 351895 352024 352922
$$ packed form
60847E19122J540J745K382L249L835L782L031J515p63l240n041n970o654p431
60833E11102p794p325o420n624m855m011l572l874m266l914l108k867l386l778
60819D46308l403k671k323k501k836l123l519m208n032n548n480m993m392l730
60805C92549k993k450k296k092j329m76n57j503j927j045K23P00O20R26J624J928
60789C81902J609J129P39M10M37J161K139K475K034J547J561J956K473K915K778
60774D07265J568l13j632j628p15J97O21N40J67j26l8K85M28L12K65M42N35K45
60756D08418l46r67j440j753k034k394k612k226j261n23o31j053q14K7M54k2q67
60739C89956j661k715m175n331n437m668l694k798j999j534j543j556r50J29Q98
$$ plain form
60724 352922 353842 354363 354607 354972 355871 357574 360001 362686 365087 366882 367991 368573 369135 370369 372524 375023
60708 375023 376988 378129 378917 379983 381639 383920 386633 389209 390921 391579 391716 391837 391747 391040 390000 389416
60692 389416 389518 389703 389412 388763 388074 387332 386497 385887 385746 385748 385459 385084 385243 386139 387453 389003 390975 393439
60674 393439 396127 398770 401305 403704 405894 407834 409276 409534 408009 405067 401855 399079 396420 393388
60660 393388 390268 387779 386137 384884 383484 381761 379887 378292 377573 378200 380209 383177 386467 389553 392306
60645 392306 394965 397637 399826 400777 400343 399125 397614 395552 392434 388375 384202 380820 378658 377507 376703
60630 376703 375655 374447 373777 374082 374961 375700 376160 376790 377879 379151 380135 380632 380762 380773 380856 380997 380984 380675
60612 380675 380328 380464 381324 382521 383382 383613 383548 383717 384335 385334 386674 388205 389301 389187 388011 387113 387671
$$ packed form
60724C52922R20N21K44L65Q99J703K427K685K401J795J109N82N62J234K155K499
60708C75023J965J141P88J066J656K281K713K576J712O58J37J21r0p07j040n84
60692C89416J02J85k91o49o89p42q35o10j41Kk89l75J59Q96J314J550J972K464
60674C93439K688K643K535K399K190J940J442K58j525k942l212k776k659l032
60660C93388l120k489j642j253j400j723j874j595p19O27K009K968L290L086K753
60645C92306K659K672K189R51m34j218j511k062l118m059m173l382k162j151q04
60630C76703j048j208o70L05Q79P39M60O30J089J272R84M97J30J1Q3J41j3l09
60612C80675l47J36Q60J197Q61K31o5J69O18R99J340J531J096j14j176q98N58
$$ plain form
60595 387671 389297 390554 390780 390774 391676 393764 396565 399571 402539 405522 408849 412723 416617 419494 420918
60580 420918 421561 422337 423457 424739 426372 428764 431845 435159 438665 442979 448712 455902 464140 473033 482459
60565 482459 492631 503976 516831 531106 546196 561149 574919 586604 595541 601181 603019 600862
60553 600862 595147 586814 576925 566629 557232 549759 544370 540706 538826 539186 541578 544871 548301 552451
60539 552451 558461 566725 576899 588751 602411 618082 636109 657032 680862 706383 731672 755141
60527 755141 775650 791959 802913 808156 808083 803177 794020 781827 768188 754086 739777 725667 712601
60514 712601 701088 690968 682184 675239 670467 667364 665154 663676 663290 664194 666396 670204 676408 685947
60500 685947 699591 717719 740217 766829 797806 833947 875700 922491 973255 1027312 1084080
$$ packed form
60595C87671J626J257K26oR02K088K801L006K968K983L327L874L894K877J424
60580D20918O43P76J120J282J633K392L081L314L506M314N733P190Q238Q893R426
60565D82459J0172J1345J2855J4275J5090J4953J3770J1685Q937N640J838k157
60553F00862n715q333r889j0296r397p473n389l664j880L60K392L293L430M150
60539E52451O010Q264J0174J1852J3660J5671J8027K0923K3830K5521K5289K3469
60527G55141K0509J6309J0954N243p3m906r157j2193j3639j4102j4309j4110j3066
60514G12601j1513j0120q784o945m772l103k210j478l86R04K202L808O204R539
60500F85947J3644J8128K2498K6612L0977L6141M1753M6791N0764N4057N6768
$$ plain form
60489 1084080 1141978 1198255 1250250 1296553 1336807 1370691 1397405 1415953 1425550 1425681 1415937 1395912
60477 1395912 1365295 1324197 1273576 1215363 1152053 1086101 1019725 955127 894493 839451 790528
60466 790528 747321 709211 675865 647175 622926 602560 585122 569516 555001 541484 529187
60455 529187 518123 508101 499139 491511 485282 480082 475411 470907 466299 461458 456622 452178 448113 444100
60441 444100 440349 437782 436981 437303 437592 437439 437231 437180 436947 436154 434722 432734 430465 428581 427731 427776 427787 427016
60423 427016 425612 424300 423665 423816 424448 425083 425525 426132 427439 429492 431775 433740 435094 435734 435898 436400
60407 436400 438087 440805 443426 445194 446614 448590 451081 453175 454310 454872 455590 456803 458463 460527 463104
60392 463104 466313 470100 474127 477817 480634 482517 484069 486178 489259 492774 495658 497350 498329 499510
$$ packed form
60489A084080N7898N6277N1995M6303M0254L3884K6714J8548R597J31r744k0025
60477A395912l0617m1098n0621n8213o3310o5952o6376o4598o0634n5042m8923
60466G90528m3207l8110l3346k8690k4249k0366j7438j5606j4515j3517j2297
60455E29187j1064j0022q962p628o229n200m671m504m608m841m836m444m065m013
60441D44100l751k567q01L22K89j53k08n1k33p93j432j988k269j884q50M5J1p71
60423D27016j404j312o35J51O32O35M42O07J307K053K283J965J354O40J64N02
60407D36400J687K718K621J768J420J976K491K094J135N62P18J213J660K064K577
60392D63104L209L787M027L690K817J883J552K109L081L515K884J692R79J181
$$ plain form
60378 499510 501269 503303 505307 507322 509435 511543 513671 516147 519148 522241 524679 526078 526633 526810 527055
60363 527055 527665 528672 529849 530981 532151 533681 535929 539278 544064 550195 556935 563476 569822 576768
60349 576768 584884 593791 602621 610884 618514 625219 630233 632857 632982 630919 626986 621479 614920 607954
60335 607954 600921 593726 586222 578624 571437 565108 559845 555634 552256 549241 546020 542292 538289 534549
60321 534549 531372 528582 525946 523719 522471 522307 522659 523212 524801 528858 535922 545116 555239 565989
60307 565989 577897 591388 606284 622052 638215 654498 670794 686935 702281 715621 725691
60296 725691 731876 734290 733207 728447 719398 705712 688155 668749 649834 632852 618072 605351
60284 605351 594744 586302 579719 574491 570197 566417 562640 558534 554081 549322 544240 539069 534289 529960
$$ packed form
60378D99510J759K034K004K015K113K108K128K476L001L093K438J399N55J77K45
60363E27055O10J007J177J132J170J530K248L349M786O131O740O541O346O946
60349E76768Q116Q907Q830Q263P630O705N014K624J25k063l933n507o559o966
60335F07954p033p195p504p598p187o329n263m211l378l015l221l728m003l740
60321E34549l177k790k636k227j248j64L52N53J589M057P064R194J0123J0750
60307E65989J1908J3491J4896J5768J6163J6283J6296J6141J5346J3340J0070
60296G25691O185K414j083m760r049j3686j7557j9406j8915j6982j4780j2721
60284F05351j0607q442o583n228m294l780l777m106m453m759n082n171m780m329
$$ plain form
60270 529960 525519 520657 515970 512161 509025 505907 502856 500376 498181 495262 491431 487912 485909 485292
60256 485292 485170 485175 485546 486440 487803 489648 491821 493659 494465 494353 494124 494306 494732 495129 495654 496636 498083 499692
60238 499692 501171 502358 503170 503604 503740 503655 503432 503386 504085 505947 508844 512289 516008 520042 524322 528494
60222 528494 532392 536392 540979 546200 551906 558332 565866 574286 582784 590906 598972 607400 616231 625621
60208 625621 636133 647881 659794 670455 679601 688222 697242 706613 715650 723727 730517 736027 740548
60195 740548 744262 746858 747869 747405 746134 744438 741888 737699 731535 723834 715564 707604 700119 692553
60181 692553 684437 676019 667833 659900 651941 644212 637482 632124 627775 624035 620947 618581 616680 615004
60167 615004 613582 612391 611186 609936 608997 608540 608164 607395 606284 605166 604170 603332 602974 603509 604925 606712
$$ packed form
60270E29960m441m862m687l809l136l118l051k480k195k919l831l519k003o17
60256D85292j22NL71Q94J363J845K173J838Q06j12k29J82M26L97N25R82J447J609
60238D99692J479J187Q12M34J36q5k23m6O99J862K897L445L719M034M280M172
60222E28494L898M000M587N221N706O426P534Q420Q498Q122Q066Q428Q831R390
60208F25621J0512J1748J1913J0661R146Q621R020R371R037Q077O790N510M521
60195G40548L714K596J011m64j271j696k550m189o164p701q270p960p485p566
60181F92553q116q418q186p933p959p729o730n358m349l740l088k366j901j676
60167F15004j422j191j205j250r39m57l76p69j111j118r96q38l58N35J416J787
$$ plain form
60151 606712 608274 609306 609961 610852 612647 615449 618706 621910 625162 628860 633144 637961 643492 650067 657709
60136 657709 666110 675064 684660 694983 705850 716974 728280 739867 751575 762593 771619 777558
60124 777558 780158 780042 778338 776327 775090 775108 776162 777851 780051 782671 785171 786923 787967 788915 790006
60109 790006 790729 790512 789268 787081 783884 779702 774792 769164 762369 754181 745249 736700 729252 722938 717467
60094 717467 712569 708162 704485 701925 700531 699890 699658 699918 700804 702110 703546 705121 706926 708829 710832
60079 710832 713495 717412 722197 726379 728455 727840 724780 719634 712484 703368 692726 681424 670205 659162
60065 659162 647907 636299 624841 614351 605379 597965 591718 586122 580897 576067 571597 567222 563044
60052 563044 559996 559121 560360 562606 565037 567772 571221 575571 581123 588254 596568 604819 612294 619583
$$ packed form
60151F06712J562J032O55Q91J795K802L257L204L252L698M284M817N531O575P642
60136F57709Q401Q954R596J0323J0867J1124J1306J1587J1708J1018R026N939
60124G77558K600j16j704k011j237J8J054J689K200K620K500J752J044R48J091
60109G90006P23k17j244k187l197m182m910n628o795q188q932q549p448o314n471
60094G17467m898m407l677k560j394o41k32K60Q86J306J436J575J805J903K003
60079G10832K663L917M785M182K076o15l060n146p150r116j0642j1302j1219j1043
60065F59162j1255j1608j1458j0490q972p414o247n596n225m830m470m375m178
60052E63044l048q75J239K246K431K735L449M350N552P131Q314Q251P475P289
$$ plain form
60038 619583 627359 635082 641729 647188 651876 655380 656704 655883 654202 652568 650584 647586 643681 639202
60024 639202 633826 626967 618659 609398 599289 588020 575684 563124 551264 540478 530853 522682 516230
60011 516230 511077 506233 501148 496266 492346 489575 487755 486979 487397 488426 489034 489046 489476 491229 493996 496796
59995 496796 499082 500856 502249 503544 505286 507846 511044 514626 518768 523718 529211 534663 539650 543836
59981 543836 546825 548557 549439 549591 548450 545773 542510 539797 537401 534141 529705 525113 521369 518645 516922
59966 516922 516479 517354 519089 521446 524826 529674 535987 543676 552769 562764 572278 579883 585029 587887 588639
59951 588639 587430 584745 581299 577550 573599 569556 565768 562615 560191 558168 555988 553232 549803 545768
59937 545768 541215 536408 531871 528042 524991 522727 521628 522156 524283 527568 531763 536917 542953 549615
$$ packed form
60038F19583P776P723O647N459M688L504J324q21j681j634j984k998l905m479
60024F39202n376o859q308r261j0109j1269j2336j2560j1860j0786r625q171o452
60011E16230n153m844n085m882l920k771j820p76M18J029O08J2M30J753K767K800
59995D96796K286J774J393J295J742K560L198L582M142M950N493N452M987M186
59981E43836K989J732Q82J52j141k677l263k713k396l260m436m592l744k724j723
59966E16922m43Q75J735K357L380M848O313P689R093R995R514P605N146K858P52
59951E88639j209k685l446l749l951m043l788l153k424k023k180k756l429m035
59937E45768m553m807m537l829l051k264j099N28K127L285M195N154O036O662
$$ plain form
59923 549615 556794 564426 571949 578332 582812 585346 586340 586354 586113 586333 587353 589201 592015 596056 601276
59908 601276 607354 614167 621732 629589 636828 642917 648015 652237 655182 656576 656889 656791 656325 655101 653147
59893 653147 651123 649773 649528 650579 653003 656715 661444 666849 672721 679133 686295 694075 701814 708955
59879 708955 715811 723312 731916 741216 750693 760264 769706 777961 783616 786047 785828 784097 781763 779217
59865 779217 776406 773032 768790 763572 757562 751152 744656 737924 730376 721627 712048 702493 693535 685213
59851 685213 677461 670465 664589 660146 657272 655870 655846 657609 662023 669393 678659 688075 696458 703281 707907
59836 707907 709785 709518 708836 709166 710941 714439 720247 728179 736485 742981 746717 747952 746996 743801 738482
59821 738482 731517 723405 714496 705044 695086 684510 673634 663480 654994 648109 641921 635618 628918
$$ packed form
59923E49615P179P632P523O383M480K534R94J4k41K20J020J848K814M041N220
59908F01276O078O813P565P857P239O089N098M222K945J394L13r8m66j224j954
59893F53147k024j350k45J051K424L712M729N405N872O412P162P780P739P141
59879G08955O856P501Q604R300R477R571R442Q255N655K431k19j731k334k546
59865G79217k811l374m242n218o010o410o496o732p548q749r579r555q958q322
59851F85213p752o996n876m443k874j402k4J763M414P370R266R416Q383O823M626
59836G07907J878k67o82L30J775L498N808P932Q306O496L736J235r56l195n319
59821G38482o965q112q909r452r958j0576j0876j0154q486o885o188o303o700
$$ plain form
59808 628918 621926 615087 609171 604730 601563 599068 597000 595512 594556 593638 592212 590007 587073 583808 580827
59793 580827 578453 576392 574190 571889 569884 568280 566792 565197 563524 561832 560193 558879 558205 558163 558506
59778 558506 559168 560313 562032 564265 566917 569724 572167 574009 575861 578727 582882 587652 592328 596835
59764 596835 601418 606203 611323 617003 623162 629324 635325 641877 649986 659873 670794 681867 692840
59751 692840 704072 716057 728992 742581 756118 768873 780526 791273 801510 811358 820408 827912
59739 827912 833349 836816 838764 839288 837951 834527 829789 825154 821402 817980 813785 808499 802909 798014
59725 798014 794133 790961 788186 785781 783816 782220 780709 778779 775808 771385 765634 759169 752748 747029
59711 747029 742475 739244 737117 735718 734804 734237 733737 732966 731958 731263 731462 732559 733900 734680 734595 734149 734285
$$ packed form
59808F28918o992o839n916m441l167k495k068j488r56r18j426k205k934l265k981
59793E80827k374k061k202k301k005j604j488j595j673j692j639j314o74m2L43
59778E58506O62J145J719K233K652K807K443J842J852K866M155M770M676M507
59764E96835M583M785N120N680O159O162O001O552Q109R887J0921J1073J0973
59751F92840J1232J1985J2935J3589J3537J2755J1653J0747J0237R848R050P504
59739H27912N437L467J948N24j337l424m738m635l752l422m195n286n590m895
59725G98014l881l172k775k405j965j596j511j930k971m423n751o465o421n719
59711G47029m554l231k127j399r14n67n00p71j008o95J99J097J341P80q5m46J36
$$ plain form
59694 734285 735578 737768 740107 742045 743446 744289 744477 743933 742709 741034 739413 738454 738258 738095 737052 734933
59678 734933 732158 728921 724954 720115 714607 708554 701915 694986 688375 682244 676133 669860 664067 659447
59664 659447 655883 652834 650168 648103 646717 646095 646742 649212 653352 658400 663719 669025 673989 678218 681739
59649 681739 685051 688473 691670 693965 694932 694573 693002 690010 685008 677550 668043 657772 648116 639812
59635 639812 632971 627406 622748 618564 614680 611248 608276 605344 601976 598011 593370 587937 582064 576734
59621 576734 572529 568734 564201 558961 554181 550512 547286 543643 539678 536016 532849 530050 527961 527407
59607 527407 528840 531873 535668 539551 543151 546218 548495 549786 550128 549895 549669 549905 550687 551757 552753 553429
59591 553429 553731 553795 553890 554223 554688 554812 554135 552720 551203 550213 549788 549375 548261 545942 542350 538029 533942
$$ packed form
59694G34285J293K190K339J938J401Q43J88n44j224j675j621r59j96j63j043k119
59678G34933k775l237l967m839n508o053o639o929o611o131o111o273n793m620
59664F59447l564l049k666k065j386o22O47K470M140N048N319N306M964M229L521
59649F81739L312L422L197K295R67l59j571k992n002p458r507j0271r656q304
59635F39812o841n565m658m184l884l432k972k932l368l965m641n433n873n330
59621E76734m205l795m533n240m780l669l226l643l965l662l167k799k089n54
59607E27407J433L033L795L883L600L067K277J291L42k33k26K36P82J070R96O76
59591E53429L02O4R5L33M65J24o77j415j517r90m25m13j114k319l592m321m087
$$ plain form
59574 533942 530775 528484 526699 525337 524420 523583 522408 521180 520612 520791 521133 521534 522641 524573 526202 526439
59558 526439 525614 524830 524354 523590 522406 521555 521653 522415 523163 523643 524121 525009 526557 528768 531557 535004 539325
59541 539325 544544 550561 557745 567067 579338 594678 612921 633711 655287 673723 684665 686338
59529 686338 680538 670922 660943 653020 648277 646387 646193 647003 648931 651868 654755 656324 656141 654533 651784
59514 651784 647830 642521 635869 628121 619786 611440 603405 595729 588449 581590 574923 568176 561652 556216
59500 556216 552387 549760 547586 545610 544058 543088 542708 543071 544362 546309 548117 549143 549526 550085 551581
59485 551581 554095 557044 559734 561922 563959 566486 569978 574399 579223 583812 587879 591535 594994 598356
59471 598356 601654 604874 607906 610668 613310 615994 618458 620175 621042 621505 621851 621909 621775 622303 624368 627992
$$ packed form
59574E33942l167k291j785j362r17q37j175j228n68J79L42M01J107J932J629K37
59558E26439q25p84m76p64j184q51R8P62P48M80M78Q88J548K211K789L447M321
59541E39325N219O017P184R322J2271J5340J8243K0790K1576J8436J0942J673
59529F86338n800r616r979p923m743j890j94Q10J928K937K887J569j83j608k749
59514F51784l954n309o652p748q335q346q035p676p280o859o667o747o524n436
59500E56216l829k627k174j976j552r70l80L63J291J947J808J026L83N59J496
59485E51581K514K949K690K188K037K527L492M421M824M589M067L656L459L362
59471E98356L298L220L032K762K642K684K464J717Q67M63L46N8j34N28K065L624
$$ plain form
59455 627992 632644 638107 644520 651834 659826 668421 677447 686175 693638 699251 702755 703826 702379 699064
59441 699064 694736 689456 682588 673900 664045 654058 644985 637830 633119 630382 628639 627510 627340 628318 630127
59426 630127 632515 635643 639793 645268 652542 661984 673520 687217 703845 723937 746371 769016 790915
59413 790915 812883 835947 860435 886594 914109 939929 958120 963799 957096 942510 925096 908268
59401 908268 894328 885103 881632 884231 892902 906554 921456 931610 931811 920748 901387 878747 857096
59388 857096 838267 821868 806906 793245 781506 771938 763975 756916 750622 745310 740994 737420 734466
59375 734466 732363 731353 731114 730727 729480 727672 726268 725783 725869 726092 726618 727875 729998 732980 736975 742023
59359 742023 747767 753934 760863 769100 778652 789123 800420 812788 826185 840189 854648 870006
$$ packed form
59455F27992M652N463O413P314P992Q595R026Q728P463N613L504J071j447l315
59441F99064m328n280o868q688r855r987r073p155m711k737j743j129j70R78J809
59426F30127K388L128M150N475P274R442J1536J3697J6628K0092K2434K2645K1899
59413G90915K1968K3064K4488K6159K7515K5820J8191N679o703j4586j7414j6828
59401I08268j3940r225l471K599Q671J3652J4902J0154K01j1063j9361k2640k1651
59388H57096j8829j6399j4962j3661j1739r568p963p059o294n312m316l574k954
59375G34466k103j010k39l87j247j808j404m85Q6K23N26J257K123K982L995N048
59359G42023N744O167O929Q237R552J0471J1297J2368J3397J4004J4459J5358
$$ plain form
59347 870006 886828 905227 924807 944836 964358 982436 998545 1012669 1024879 1034831 1041709 1044663
59335 1044663 1043299 1037825 1028722 1016412 1001346 984237 965874 946624 926418 905288 883710 862329
59323 862329 841671 822205 804400 788520 774610 762717 752820 744426 736685 729124 721928 715334 709181
59310 709181 703323 697962 693144 688366 683212 678121 674035 671506 670555 671079 672834 675226 677739 680604 684679
59295 684679 690753 699308 710612 724346 738998 752029 760772 763146 758170 746623 731172 715034
59283 715034 700243 687500 677433 671041 668668 669456 672465 677830 686147 697148 709771 723473 738731
59270 738731 755969 774485 792835 809974 825636 839751 852005 862155 870341 876655 880567 881238
59258 881238 878428 872814 865355 856772 847752 839169 831677 825290 819710 814915 811228 808910 808008 808459 810048
$$ packed form
59347H70006J6822J8399J9580K0029J9522J8078J6109J4124J2210R952O878K954
59335A044663j364n474r103j2310j5066j7109j8363j9250k0206k1130k1578k1381
59323H62329k0658j9466j7805j5880j3910j1893r897q394p741p561p196o594o153
59310G09181n858n361m818m778n154n091m086k529r51N24J755K392K513K865M075
59295F84679O074Q555J1304J3734J4652J3031Q743K374m976j1547j5451j6138
59283G15034j4791j2743j0067o392k373P88L009N365Q317J1001J2623J3702J5258
59270G38731J7238J8516J8350J7139J5662J4115J2254J0150Q186O314L912O71
59258H81238k810n614p459q583r020q583p492o387n580m795l687k318r02M51J589
$$ plain form
59243 810048 812344 814958 817818 821027 824549 828251 832130 836186 840127 843352 845197 845088 842680 838165
59229 838165 832294 825757 818539 810074 799923 788086 774820 760540 745892 731615 718236 706055
59217 706055 695277 685888 677473 669525 661928 654909 648580 642970 638468 635738 634882 635023 635061 634690 634449
59202 634449 634877 635949 637327 638880 640801 643329 646513 650188 654041 657742 661251 665024 669677 675239
59188 675239 680934 685914 690080 693935 697818 701672 705383 708861 711716 713392 713808 713522 713102 712661 712139
59173 712139 711675 711525 711951 713249 715446 717862 719519 720248 720844 721855 722782 722939 722487 721935 721000 718738 714634
59156 714634 708953 702074 694140 685379 676219 666925 657461 647796 638134 628855 620357 612828 605990 599303
59142 599303 592640 586489 581201 576370 571431 566573 562579 559850 558042 556612 555342 554389 554153 554979 556801
$$ packed form
59243H10048K296K614K860L209L522L702L879M056L941L225J845j09k408m515
59229H38165n871o537p218q465j0151j1837j3266j4280j4648j4277j3379j2181
59217G06055j0778r389q415p948p597p019o329n610m502k730q56J41L8l71k41
59202F34449M28J072J378J553J921K528L184L675L853L701L509L773M653N562
59188F75239N695M980M166L855L883L854L711L478K855J676M16k86m20m41n22
59173G12139m64j50M26J298K197K416J657P29N96J011R27J57m52n52r35k262m104
59156G14634n681o879p934q761r160r294r464r665r662r279q498p529o838o687
59142E99303o663o151n288m831m939m858l994k729j808j430j270r53k36Q26J822
$$ plain form
59127 556801 559255 562327 566450 571665 577239 582593 588090 594249 600731 607014 613658 621780 631313 640875
59113 640875 649525 657703 666220 675235 684587 694275 704022 712949 720247 725834 730030 733039 735051 736391
59099 736391 737117 736799 735037 731956 727966 723434 718855 714905 711862 709317 706827 704660 703454 703305 703506
59084 703506 703105 701456 698388 694180 689298 683928 677782 670563 662527 654394 646789 639880 633508 627482
59070 627482 621757 616494 611914 608010 604405 600599 596424 592262 588787 586404 584872 583485 581646 579291
59056 579291 576829 574800 573487 572619 571417 569235 566244 563248 560793 558847 557404 556775 556973 557376 557559
59041 557559 557979 559188 560748 561749 562240 563255 565392 568129 570743 573260 576263 580323 585890 593258 602349
59026 602349 612823 624648 638236 653929 671621 690901 711075 730896 748776 763581 774962
$$ packed form
59127E56801K454L072M123N215N574N354N497O159O482O283O644Q122R533R562
59113F40875Q650Q178Q517R015R352R688R747Q927P298N587M196L009K012J340
59099G36391P26l18j762l081l990m532m579l950l043k545k490k167j206j49K01
59084G03506m01j649l068m208m882n370o146p219q036q133p605o909o372o026
59070F27482n725n263m580l904l605l806m175m162l475k383j532j387j839k355
59056E79291k462k029j313q68j202k182k991k996k455j946j443o29J98M03J83
59041E57559M20J209J560J001M91J015K137K737K614K517L003M060N567P368R091
59026F02349J0474J1825J3588J5693J7692J9280K0174J9821J7880J4805J1381
$$ plain form
59015 774962 782777 786569 785932 781133 773128 763099 752123 741044 730383 720405 711381 703766 698093
59002 698093 694693 693436 693731 695046 697542 701819 707808 714273 719885 724398 728240 731325 733152 733999 735097
58987 735097 737303 740132 742306 742800 741366 738650 736022 734748 735044 736297 738337 741946 747958 756305 766226
58972 766226 777081 788731 801408 815294 829997 844470 857841 870239 882329 894184 905250
58961 905250 915362 924970 934142 942096 947973 951386 951905 948737 941449 930559 916934 901051 883175
58948 883175 863848 843776 823621 804202 786440 770713 756609 743692 732189 722642 715258 709966
58936 709966 706748 705567 706202 708397 711909 716248 720747 725061 729208 732998 735917 737743 738700 738751 737385
58921 737385 734471 730724 726800 722452 717171 711303 705921 701795 698864 696555 694333 692211 690958 691465
$$ packed form
59015G74962P815L792o37m799q005j0029j0976j1079j0661r978r024p615n673
59002F98093l400j257K95J315K496M277N989O465N612M513L842L085J827Q47J098
58987G35097K206K829K174M94j434k716k628j274K96J253K040L609O012Q347R921
58972G66226J0855J1650J2677J3886J4703J4473J3371J2398J2090J1855J1066
58961I05250J0112R608R172P954N877L413N19l168p288j0890j3625j5883j7876
58948H83175j9327k0072k0155j9419j7762j5727j4104j2917j1503r547p384n292
58936G09966l218j181O35K195L512M339M499M314M147L790K919J826R57N1j366
58921G37385k914l747l924m348n281n868n382m126k931k309k222k122j253N07
$$ plain form
58907 691465 693692 696766 700361 705383 712829 722586 733926 746657 760985 776583 792602 808527 824423
58894 824423 840357 856131 871590 886799 901949 917428 933917 952113 972315 994294 1017265
58883 1017265 1039818 1060301 1077615 1091455 1101696 1108023 1110402 1109331 1105191 1097810 1087196 1074303
58871 1074303 1060523 1046693 1033061 1019868 1007409 995776 985053 975578 967519 960409 953489 946299
58859 946299 938605 930156 921053 911986 903462 894995 885690 875546 865715 857535 851680 847905 845124 841830
58845 841830 837014 830583 822610 812548 799761 784589 768250 751767 735566 719965 705457 692422
58833 692422 680963 671016 662350 654612 647787 642395 638847 636844 635838 635774 636814 638629 640753 643511
58819 643511 647806 653772 660296 666117 670967 675399 679898 684414 688609 692332 695770 699029 701541 702220
$$ packed form
58907F91465K227L074L595N022P446R757J1340J2731J4328J5598J6019J5925J5896
58894H24423J5934J5774J5459J5209J5150J5479J6489J8196K0202K1979K2971
58883A017265K2553K0483J7314J3840J0241O327K379j071m140p381j0614j2893
58871A074303j3780j3830j3632j3193j2459j1633j0723r475q059p110o920p190
58859I46299p694q449r103r067q524q467r305j0144r831q180n855l775k781l294
58845H41830m816o431p973j0062j2787j5172j6339j6483j6201j5601j4508j3035
58833F92422j1459r947q666p738o825n392l548k003j006o4J040J815K124K758
58819F43511M295N966O524N821M850M432M499M516M195L723L438L259K512O79
$$ plain form
58805 702220 700417 696545 691589 686311 681041 675732 669852 662724 654459 646136 638526 631130 623080 614558
58791 614558 606522 599416 593059 587655 583941 582242 582162 583336 585782 589382 593653 598252 603156 608251 613226
58776 613226 618001 622738 627234 630759 632639 632604 630526 626295 620146 612768 604985 597507 590867 585198 580113
58761 580113 575311 571250 568766 568040 568485 569657 571701 574761 578508 582408 586028 588897 590502 590703 589838
58746 589838 588353 586682 585549 585842 587906 591252 595239 599789 605177 611315 617535 623043 627495 631186
58732 631186 634727 638549 642752 647389 652575 658149 663467 667863 671262 674125 676928 679915 683211 686905
58718 686905 691105 696046 701998 708932 716528 724612 733182 741748 749115 754248 757023 757723 756185 751952
58704 751952 744934 735383 723508 709615 694347 678233 661213 643107 624309 605443 586683 568091
$$ packed form
58805G02220j803l872m956n278n270n309n880p128q265q323p610p396q050q522
58791F14558q036p106o357n404l714j699q0J174K446L600M271M599M904N095M975
58776F13226M775M737M496L525J880l5k078m231o149p378p783p478o640n669n085
58761E80113m802m061k484p26M45J172K044L060L747L900L620K869J605K01q65
58746E89838j485j671j133K93K064L346L987M550N388O138O220N508M452L691
58732F31186L541L822M203M637N186N574N318M396L399K863K803K987L296L694
58718F86905M200M941N952O934P596Q084Q570Q566P367N133K775P00j538m233
58704G51952p018r551j1875j3893j5268j6114j7020j8106j8798j8866j8760j8592
$$ plain form
58692 568091 550461 535127 522880 513517 506278 500240 494533 488815 483471 478884 474723 470411 465991
58679 465991 461892 458169 454678 451710 449695 448460 447520 446952 447209 448244 449666 451656 454904 459667 465749
58664 465749 473372 483143 494959 507656 519808 530211 537678 541275 541023 537738 532125 524643 516132
58651 516132 507697 499822 492354 485380 479290 473931 468596 463128 458230 454466 451717 449812 448940 449199 450442
58636 450442 452748 456285 460513 464348 467371 470058 472505 473819 473339 471726 470194 469092 467785 465698
58622 465698 463084 460883 459986 460485 461727 463338 465892 470094 475702 481956 488720 496228 503950 510801 516454
58607 516454 521362 525486 528155 529381 530101 530833 531217 531214 531527 532294 532480 531249 528955 526167 522775 518898
58591 518898 515763 514705 515843 518550 522646 528393 535869 545081 556252 569249 583051 596388 608712
$$ packed form
58692E68091j7630j5334j2247r363p239o038n707n718n344m587m161m312m420
58679D65991m099l723l491k968k015j235r40n68K57J035J422J990L248M763O082
58664D65749P623R771J1816J2697J2152J0403P467L597k52l285n613p482q511
58651E16132q435p875p468o974o090n359n335n468m898l764k749j905q72K59J243
58636D50442K306L537M228L835L023K687K447J314m80j613j532j102j307k087
58622D65698k614k201q97M99J242J611K554M202N608O254O764P508P722O851N653
58607E16454M908M124K669J226P20P32L84lL13P67J86j231k294k788l392l877
58591E18898l135j058J138K707M096N747P476R212J1171J2997J3802J3337J2324
$$ plain form
58578 608712 620133 630794 640774 650192 658994 666956 674244 681640 689946 699627 711193 725296 742109
58565 742109 761244 782703 807322 835797 867681 901731 936714 971413 1004279 1033516 1057346
58554 1057346 1074128 1082814 1083598 1077821 1067214 1053650 1039373 1026466 1015855 1007447 1001205 997062 993722
58541 993722 988740 980280 967935 951573 930631 905165 876612 846753 816666 787177 759434 734365
58529 734365 712252 693351 678135 666401 657005 649019 642351 636825 631696 626710 622654 620008 617966
58516 617966 615494 612538 609422 605981 602126 598446 595388 592602 589880 587941 587407 587706 587842 587551 586983
58501 586983 586091 585181 585196 586422 587644 587588 586545 585643 585251 585193 585851 587826 590865 594231 597966 602937 609823
58484 609823 618661 629115 640724 653346 667743 685105 705575 728016 751445 775541 799164 819763
$$ packed form
58578F08712J1421J0661R980R418Q802P962P288P396Q306R681J1566J4103J6813
58565G42109J9135K1459K4619K8475L1884L4050L4983L4699L2866K9237K3830
58554A057346J6782Q686P84n777j0607j3564j4277j2907j0611q408o242m143l340
58541I93722m982q460j2345j6362k0942k5466k8553k9859l0087k9489k7743k5069
58529G34365k2113j8901j5216j1734r396p986o668n526n129m986m056k646k042
58516F17966k472k956l116l441l855l680l058k786k722j939n34K99J36k91n68
58501E86983q92r10J5J226J222n6j043r02l92n8O58J975L039L366L735M971O886
58484F09823Q838J0454J1609J2622J4397J7362K0470K2441K3429K4096K3623K0599
$$ plain form
58472 819763 835241 845295 850063 848773 841032 828414 813427 797783 782693 769658 759400 751031
58460 751031 743849 739164 738808 742661 749313 758474 770861 786148 802831 819919 837108 853332 866517
58447 866517 874796 876988 872361 861234 845472 827187 807311 786504 766657 749914 736657 725943
58435 725943 717433 711380 707288 704357 702959 703921 706638 709668 713061 718231 725579 733985 742801 752502
58421 752502 763013 772962 780959 786269 788016 785242 778254 768769 758294 747255 735769 724145 712505
58408 712505 700899 689835 679740 670169 660660 652070 645808 641952 639459 637943 637748 638530 639404 640530
58394 640530 642956 646752 650733 654092 656908 659073 660216 660786 661729 663013 663881 664482 665679 667349 668652
58379 668652 670118 673646 680084 688448 697799 708125 718970 729004 737711 746014 754644 763283 771840
$$ packed form
58472H19763J5478J0054M768j290p741j2618j4987j5644j5090j3035j0258q369
58460G51031p182m685l56L853O652R161J2387J5287J6683J7088J7189J6224J3185
58447H66517Q279K192m627j1127j5762j8285j9876k0807j9847j6743j3257j0714
58435G25943q510o053m092k931j398R62K717L030L393N170P348Q406Q816R701
58421G52502J0511R949P997N310J747k774o988r485j0475j1039j1486j1624j1640
58408G12505j1606j1064j0095r571r509q590o262l856k493j516j95P82Q74J126
58394F40530K426L796L981L359K816K165J143N70R43J284Q68O01J197J670J303
58379F68652J466L528O438Q364R351J0326J0845J0034Q707Q303Q630Q639Q557
$$ plain form
58366 771840 781155 791812 803564 816453 831128 847449 864014 879740 894838 909714 923920 936619
58354 936619 947102 954607 958644 959709 958712 955802 950954 945585 941961 940799 940948 941683 943835 948315 954976
58339 954976 963334 973160 984053 995613 1008242 1022661 1038686 1055680 1073954 1094084 1114973 1134249
58327 1134249 1150573 1164020 1174453 1181409 1185537 1188173 1189508 1189063 1187805 1187601 1188623 1189629 1190816 1193893
58313 1193893 1199059 1204624 1210139 1217239 1226589 1236529 1245740 1255018 1265412 1276805 1289187 1303142 1318193
58300 1318193 1332803 1346899 1362202 1379260 1396448 1412794 1429458 1447426 1466091 1485215 1505922
58289 1505922 1528508 1551425 1573615 1595817 1618631 1641412 1664080 1687710 1712419 1736998 1761560
58278 1761560 1788068 1817284 1847827 1879310 1913562 1951493 1991427 2031955 2073672 2116676 2159193
$$ packed form
58366G71840R315J0657J1752J2889J4675J6321J6565J5726J5098J4876J4206J2699
58354I36619J0483P505M037J065r97k910m848n369l624j162J49P35K152M480O661
58339I54976Q358R826J0893J1560J2629J4419J6025J6994J8274K0130K0889J9276
58327A134249J6324J3447J0433O956M128K636J335m45j258k04J022J006J187L077
58313A193893N166N565N515P100R350R940R211R278J0394J1393J2382J3955J5051
58300A318193J4610J4096J5303J7058J7188J6346J6664J7968J8665J9124K0707
58289A505922K2586K2917K2190K2202K2814K2781K2668K3630K4709K4579K4562
58278A761560K6508K9216L0543L1483L4252L7931L9934M0528M1717M3004M2517
$$ plain form
58267 2159193 2200356 2241855 2285398 2331125 2379795 2433507 2492545 2554295 2616794 2680536 2745343
58256 2745343 2808784 2869558 2929353 2989474 3048776 3106846 3166004 3228176 3292952 3360564 3433353
58245 3433353 3512298 3595571 3682552 3775599 3875857 3981359 4091468 4208905 4334818 4466359
58235 4466359 4602094 4745428 4899558 5063431 5235855 5419031 5614598 5820883 6037663
58226 6037663 6269022 6517847 6782503 7062685 7363227 7688089 8036139 8407352 8807429
58217 8807429 9241715 9710814 10217393 10771083 11381359 12052298 12790016 13608087 14519732
58208 14519732 15532752 16659285 17922889 19349757 20962923 22793726 24890286 27309029
58200 27309029 30112867 33389692 37259917 41854159 47297995 53731849 61332793 70314541
$$ packed form
58267B159193M1163M1499M3543M5727M8670N3712N9038O1750O2499O3742O4807
58256B745343O3441O0774N9795O0121N9302N8070N9158O2172O4776O7612P2789
58245C433353P8945Q3273Q6981R3047J00258J05502J10109J17437J25913J31541
58235D466359J35735J43334J54130J63873J72424J83176J95567K06285K16780
58226F037663K31359K48825K64656K80182L00542L24862L48050L71213M00077
58217H807429M34286M69099N06579N53690O10276O70939P37718Q18071R11645
58208A4519732J013020J126533J263604J426868J613166J830803K096560K418743
58200B7309029K803838L276825L870225M594242N443836O433854P600944Q981748
$$ plain form
58192 70314541 80946149 93604747 108792581 127083372 149053191 175128019 205068973
58185 205068973 237069909 267186256 290085801 301155417 298611991 284073495 261377011
58178 261377011 234802402 207879887 182985612 161298751 142888179 127035818 112799963
58171 112799963 99528951 87042103 75485790 65084041 55970707 48148102 41522865
58164 41522865 35955828 31294317 27390153 24113318 21357560 19034125 17064822 15384234
58156 15384234 13942847 12701629 11625566 10685279 9859668 9131145 8481090 7893924 7361577
58147 7361577 6878904 6437846 6030501 5654425 5309793 4993877 4702892 4436572 4196101
58138 4196101 3979400 3782649 3604522 3444817 3300414 3166303 3039207 2917155 2797473
$$ packed form
58192G0314541J0631608J2658598J5187834J8290791K1969819K6074828K9940954
58185B05068973L2000936L0116347K2899545J1069616k543426j4538496k2696484
58178B61377011k6574609k6922515k4894275k1686861j8410572j5852361j4235855
58171A12799963j3271012j2486848j1556313j0401749r113334p822605o625237
58164D1522865n567037m661511l904164l276835k755758k323435j969303j680588
58156A5384234j441387j241218j076063r40287q25611p28523o50055n87166n32347
58147G361577m82673m41058m07345l76076l44632l15916k90985k66320k40471
58138D196101k16701j96751j78127j59705j44403j34111j27096j22052j19682
$$ plain form
58129 2797473 2678637 2562542 2451906 2346963 2247210 2154138 2069099 1990452 1915932 1846062
58119 1846062 1782174 1722929 1665980 1611449 1560702 1513230 1467747 1424905 1385877 1349526 1313875
58108 1313875 1279204 1247001 1217067 1188225 1160542 1134145 1107185 1077760 1046731 1016105 986013
58097 986013 956042 928184 905172 886668 869961 853797 838787 824755 810523 796009 782012
58086 782012 768305 754211 740665 729278 719723 710206 700101 689953 679403 667470 654573 642036
58074 642036 629761 616532 602446 589016 576912 565452 554227 543510 533198 522995 513427 505157
58062 505157 497644 489992 482605 476400 470989 465390 459903 455349 450973 445154 437892 430645 423968 417331
58048 417331 411063 406431 403643 401557 399444 397413 395142 391850 387638 383332 379057 374410 369850 366236
$$ packed form
58129B797473j18836j16095j10636j04943r9753r3072q5039p8647p4520o9870
58119A846062o3888n9245n6949n4531n0747m7472m5483m2842l9028l6351l5651
58108A313875l4671l2203k9934k8842k7683k6397k6960k9425l1029l0626l0092
58097I86013k9971k7858k3012j8504j6707j6164j5010j4032j4232j4514j3997
58086G82012j3707j4094j3546j1387r555r517j0105j0148j0550j1933j2897j2537
58074F42036j2275j3229j4086j3430j2104j1460j1225j0717j0312j0203r568q270
58062E05157p513p652p387o205n411n599n487m554m376n819p262p247o677o637
58048D17331o268m632k788k086k113k031k271l292m212m306m275m647m560l614
$$ plain form
58034 366236 363128 359238 354557 350322 346829 342983 338198 333179 328580 324312 320368 316988 313842 310281
58020 310281 306465 303041 299882 296474 293292 291258 289965 288105 285592 283572 282304 280792 278707 276904
58006 276904 275662 274113 271916 270038 269336 269762 271332 274380 278327 281625 283617 285196 287106 288839 289818
57991 289818 290454 291272 292043 292413 292495 292310 291567 290413 289487 288764 287325 284632 281090 277036 272310 267271 263068
57974 263068 260233 258040 255853 254198 253800 254438 255483 256817 258559 260459 262158 263538 264420 264497 263943 263466
57958 263466 263455 263629 263702 263631 263019 261193 258237 255126 252398 249528 246044 242457 239612 237793 236917 236965 237821
57941 237821 239290 241600 245190 249805 254598 259395 264919 271408 278063 284399 291073 298523 305617 310621
57927 310621 312997 313395 312340 309808 305860 300909 295325 289210 282581 275564 268509 261904 255912 250097
$$ packed form
58034C66236l108l890m681m235l493l846m785n019m599m268l944l380l146l561
58020C10281l816l424l159l408l182k034j293j860k513k020j268j512k085j803
58006B76904j242j549k197j878p02M26J570L048L947L298J992J579J910J733R79
57991B89818O36Q18P71L70Q2j85p43j154r26p23j439k693l542m054m726n039m203
57974B63068k835k193k187j655l98O38J045J334J742J900J699J380Q82P7n54m77
57958B63466j1J74P3p1o12j826k956l111k728k870l484l587k845j819q76M8Q56
57941B37821J469K310L590M615M793M797N524O489O655O336O674P450P094N004
57927C10621K376L98j055k532l948m951n584o115o629p017p055o605n992n815
$$ plain form
57913 250097 244147 238810 235363 234098 234042 234261 234600 234959 234893 234384 234094 234325 234530 234382 234442 235128 235852 236036
57895 236036 236307 237771 240550 243888 247332 251037 255119 259453 263950 268471 272677 276453 280287 284686
57881 284686 289388 293596 296779 298882 299976 300203 299905 299457 299007 298623 298471 298663 299171 300024 301272 302587
57865 302587 303334 303235 302549 301452 299775 297602 295546 294052 293033 292592 293424 295858 298976 301402 302724 303547
57849 303547 304453 305480 306460 307285 307859 308146 308216 308042 307481 306737 306477 307124 308288 309318 310208 311566 313817
57832 313817 316726 319578 321572 322298 322141 322094 322914 324578 326543 328228 329073 328631 327003 324902 322934 320941
57816 320941 318320 314834 310905 307172 303854 300492 296421 291662 287085 283278 279598 274952 269280 263481
57802 263481 258044 252762 247812 243903 240994 237984 234277 230827 229021 229201 230766 232908 234688 235268 234834
$$ packed form
57913B50097n950n337l447j265n6K19L39L59o6n09k90K31K05j48O0O86P24J84
57895B36036K71J464K779L338L444L705M082M334M497M521M206L776L834M399
57881B84686M702M208L183K103J094K27k98m48m50l84j52J92N08Q53J248J315
57865C02587P47r9o86j097j677k173k056j494j019m41Q32K434L118K426J322Q23
57849C03547R06J027R80Q25N74K87P0j74n61p44k60O47J164J030Q90J358K251
57832C13817K909K852J994P26j57m7Q20J664J965J685Q45m42j628k101j968j993
57816C20941k621l486l929l733l318l362m071m759m577l807l680m646n672n799
57802B63481n437n282m950l909k909l010l707l450j806J80J565K142J780N80m34
$$ plain form
57787 234834 234627 235478 236991 238684 240953 244166 247797 251465 255961 262051 268924 275071 280177 284961 289614
57772 289614 293732 297430 301103 304198 305563 305142 304173 303588 303309 303191 303495 304124 304447 304231 303926 303765 303469
57755 303469 303169 303711 305571 308146 310593 312752 314874 317054 319379 322134 325383 328640 331265 332951 333694
57740 333694 333695 333409 333279 333286 333093 332617 331983 330946 329083 326725 325016 324701 325425 326467 327683 329298 331287
57723 331287 333347 335152 336371 336806 336852 337386 338802 340445 341362 341357 341041 341080 341714 342762 343737 344115 343789 343227
57705 343227 342987 343235 343837 344687 345674 346509 346912 346951 346989 347248 347525 347360 346526 345292 344112 343004 341400 338818
57687 338818 335560 332489 330226 328827 328085 327767 327563 327320 327522 329276 333633 341033 351402 364544 380422
57672 380422 399302 421760 448432 479822 516608 559959 610949 668875 729576 785030 825110
$$ packed form
57787B34834k07Q51J513J693K269L213L631L668M496O090O873O147N106M784M653
57772B89614M118L698L673L095J365m21r69n85k79j18L04O29L23k16l05j61k96
57755C03469l00N42J860K575K447K159K122K180K325K755L249L257K625J686P43
57740C33694Jk86j30Pj93m76o34j037j863k358j709l15P24J042J216J615J989
57723C31287K060J805J219M35M6N34J416J643R17nl16L9O34J048R75L78l26n62
57705C43227k40K48O02Q50R87Q35M03L9L8K59K77j65q34j234j180j108j604k582
57687C38818l258l071k263j399p42l18k04k43K02J754M357P400J0369J3142J5878
57672C80422J8880K2458K6672L1390L6786M3351N0990N7926O0701N5454M0080
$$ plain form
57661 825110 841398 831208 798727 752102 699166 645541 595323 551587 515570 486429 462689
57650 462689 443607 428738 416871 406344 396373 387474 380520 375763 372796 371008 369911 369204 368799 368776
57636 368776 369250 370203 371438 372766 374256 376127 378253 380013 380922 381265 381773 382736 383826 384758 385659 386656
57620 386656 387519 387969 388062 388122 388446 389199 390341 391537 392338 392616 392673 392910 393577 394795 396452 398048 398998 399268
57602 399268 399446 400009 400776 401235 401214 401071 401379 402498 404199 405720 406414 406384 406208 406018 405323 403874 402338 401793
57584 401793 402777 405033 407921 410877 413623 416150 418441 420252 421395 422219 423358 424872 426053 426327 425954
57569 425954 425553 425311 425089 425029 425514 426591 427860 429019 430279 432197 435224 439264 443476 446723 448594 449984
57553 449984 452386 456531 461923 467687 473496 479486 485597 491442 496810 501936 507052 511886 515871 518749
$$ packed form
57661H25110J6288j0190l2481m6625n2936n3625n0218m3736l6017k9141k3740
57650D62689j9082j4869j1867j0527r971q899o954m757k967j788j097p07m05k3
57636C68776M74R53J235J328J490J871K126J760R09L43N08R63J090R32R01R97
57620C86656Q63M50R3O0L24P53J142J196Q01K78N7K37O67J218J657J596R50K70
57602C99268J78N63P67M59k1j43L08J119J701J521O94l0j76j90o95j449j536n45
57584D01793R84K256K888K956K746K527K291J811J143Q24J139J514J181K74l73
57569D25954m01k42k22o0M85J077J269J159J260J918L027M040M212L247J871J390
57553D49984K402M145N392N764N809N990O111N845N368N126N116M834L985K878
$$ plain form
57539 518749 520726 522140 523357 524962 527554 531090 534830 538240 541591 545349 549345 553066 556454 559827
57525 559827 563212 566428 569754 573848 578942 584691 590879 597592 604521 610807 615959 620448 625104 630324
57511 630324 636142 642514 649115 655231 660376 664808 669105 673468 677750 681902 686002 690000 693750 697220
57497 697220 700461 703520 706480 709405 712157 714561 716877 719719 723360 727493 731845 736466 741098 744910
57483 744910 747459 749540 752429 756549 761523 767244 774002 781538 788786 794917 800114 804999 809741 814103
57469 814103 818085 822045 826208 830407 834422 838442 843044 848711 855389 862571 869761 876757 883555 890189
57455 890189 896765 903480 910478 917768 925298 932972 940490 947425 953633 959429 965198 971005 976792 982786
57441 982786 989390 996662 1004145 1011318 1018127 1025009 1032443 1040477 1048696 1056621 1064065 1071194 1078369 1085994
$$ packed form
57539E18749J977J414J217J605K592L536L740L410L351L758L996L721L388L373
57525E59827L385L216L326M094N094N749O188O713O929O286N152M489M656N220
57511F30324N818O372O601O116N145M432M297M363M282M152M100L998L750L470
57497F97220L241L059K960K925K752K404K316K842L641M133M352M621M632L812
57483G44910K549K081K889M120M974N721O758P536P248O131N197M885M742M362
57469H14103L982L960M163M199M015M020M602N667O678P182P190O996O798O634
57455H90189O576O715O998P290P530P674P518O935O208N796N769N807N787N994
57441I82786O604P272P483P173O809O882P434Q034Q219P925P444P129P175P625
$$ plain form
57427 1085994 1094236 1102665 1110480 1117398 1124135 1131520 1139331 1146605 1153057 1159477 1166602 1174319 1182246 1190365
57413 1190365 1198604 1206459 1213731 1221160 1229581 1238690 1247433 1255431 1263277 1271398 1279447 1287100 1294781 1303101
57399 1303101 1311936 1320619 1328921 1337360 1346454 1355987 1365292 1374121 1382961 1392429 1402608 1413158 1423889
57386 1423889 1434862 1446009 1457030 1467781 1478451 1489206 1499876 1510142 1519803 1528757 1536961 1544571
57374 1544571 1552001 1559628 1567580 1575855 1584517 1593616 1602945 1611956 1620006 1626941 1633528 1640960 1649586 1658457
57360 1658457 1666590 1674286 1682530 1691405 1700109 1708485 1717403 1727334 1737576 1747383 1756933 1766616 1776258 1785768
57346 1785768 1795665 1806065 1815917 1824309 1831983 1840404 1849680 1858587 1866490 1874012 1881763 1889519 1896979 1904435
57332 1904435 1912254 1920330 1928408 1936398 1944089 1951099 1957474 1963945 1971226 1979290 1987494 1995202 2002183 2008633
$$ packed form
57427A085994Q242Q429P815O918O737P385P811P274O452O420P125P717P927Q119
57413A190365Q239P855P272P429Q421R109Q743P998P846Q121Q049P653P681Q320
57399A303101Q835Q683Q302Q439R094R533R305Q829Q840R468J0179J0550J0731
57386A423889J0973J1147J1021J0751J0670J0755J0670J0266R661Q954Q204P610
57374A544571P430P627P952Q275Q662R099R329R011Q050O935O587P432Q626Q871
57360A658457Q133P696Q244Q875Q704Q376Q918R931J0242R807R550R683R642R510
57346A785768R897J0400R852Q392P674Q421R276Q907P903P522P751P756P460P456
57332A904435P819Q076Q078P990P691P010O375O471P281Q064Q204P708O981O450
$$ plain form
57318 2008633 2014925 2021267 2027623 2034114 2041167 2048870 2056462 2062991 2068384 2073374 2078479 2083659 2088866 2094243
57304 2094243 2099628 2104537 2108886 2113261 2118216 2123723 2129454 2135172 2140613 2145429 2149552 2153359 2157285 2161495
57290 2161495 2165985 2170693 2175401 2179859 2184152 2188690 2193808 2199660 2206444 2214243 2222580 2230645 2238163 2245506
57276 2245506 2252723 2258951 2263211 2265471 2266539 2267198 2267749 2268142 2268090 2267129 2264857 2261177 2256271 2250545 2244716
57261 2244716 2239595 2235483 2231875 2227945 2223240 2217824 2212057 2206498 2201771 2198121 2195163 2192283 2189243 2186177
57247 2186177 2183200 2180407 2178196 2177168 2177454 2178443 2179408 2180238 2181283 2182599 2183703 2184163 2184120 2183968 2183692 2182827
57231 2182827 2180982 2178116 2174210 2168981 2162023 2153156 2142504 2130413 2117364 2103821 2090065 2076254
57219 2076254 2062695 2049968 2038845 2030166 2024671 2022587 2023371 2026164 2030553 2036657 2044532 2053833 2063913
$$ packed form
57318B008633O292O342O356O491P053P703P592O529N393M990N105N180N207N377
57304B094243N385M909M349M375M955N507N731N718N441M816M123L807L926M210
57290B161495M490M708M708M458M293M538N118N852O784P799Q337Q065P518P343
57276B245506P217O228M260K260J068O59N51L93n2r61k272l680m906n726n829
57261B244716n121m112l608l930m705n416n767n559m727l650k958k880l040l066
57247B186177k977k793k211j028K86R89R65Q30J045J316J104M60m3j52k76q65
57231B182827j845k866l906n229o958q867j0652j2091j3049j3543j3756j3811
57219B076254j3559j2727j1123q679n495k084P84K793M389O104P875R301J0080
$$ plain form
57206 2063913 2073676 2081315 2084958 2083953 2079024 2070876 2059373 2044676 2028705 2014764 2005797 2003356 2007808
57193 2007808 2018786 2035395 2056368 2080017 2103935 2125191 2141378 2151465 2155464 2153668 2146433 2134162
57181 2134162 2116795 2093547 2063701 2027536 1986086 1940308 1890943 1838810 1784572 1728357 1670251
57170 1670251 1611038 1551870 1493275 1434981 1376644 1318277 1260093 1202347 1145287 1088818 1032298
57159 1032298 974910 915938 854403 788917 718448 642807 561696 473735 377144 271067 155335
57148 155335 29151 -108941 -259771 -423042 -598402 -786141 -986549 -1199162 -1423046 -1657430
57138 -1657430 -1901763 -2155329 -2417021 -2685495 -2959536 -3238352 -3521395 -3808154 -4098620
57129 -4098620 -4394152 -4697359 -5010866 -5336614 -5676497 -6032966 -6408701 -6806374 -7229029
$$ packed form
57206B063913R763P639L643j005m929q148j1503j4697j5971j3941q967k441M452
57193B007808J0978J6609K0973K3649K3918K1256J6187J0087L999j796p235j2271
57181B134162j7367k3248k9846l6165m1450m5778m9365n2133n4238n6215n8106
57170A670251n9213n9168n8595n8294n8337n8367n8184n7746n7060n6469n6520
57159A032298n7388n8972o1535o5486p0469p5641q1111q7961r6591j06077j15732
57148A55335B9151a08941j50830j63271j75360j87739k00408k12613k23884k34384
57138a657430k44333k53566k61692k68474k74041k78816k83043k86759k90466
57129d098620k95532l03207l13507l25748l39883l56469l75735l97673m22655
$$ plain form
57120 -7229029 -7679877 -8161325 -8675086 -9223806 -9811818 -10443984 -11125139 -11861671 -12662783
57111 -12662783 -13539592 -14504287 -15571186 -16757478 -18082143 -19565988 -21235067 -23124466
57103 -23124466 -25279574 -27757525 -30631831 -33997802 -37976091 -42717055 -48407976 -55277697
57095 -55277697 -63591657 -73636390 -85695250 -100016652 -116783228 -136097577 -157987767
57088 -157987767 -182412947 -209250006 -238266821 -269097227 -301215720 -333905151 -366234624
57081 -366234624 -397074904 -425149368 -449100076 -467581416 -479421174 -483836625 -480606027
57074 -480606027 -470093101 -453122499 -430794122 -404318122 -374895922 -343645148 -311568214
57067 -311568214 -279553795 -248382546 -218716637 -191079445 -165841384 -143216599 -123269397
$$ packed form
57120g229029m50848m81448n13761n48720n88012o32166o81155p36532q01112
57111a2662783q76809r64695j066899j186292j324665j483845j669079j889399
57103b3124466k155108k477951k874306l365971l978289m740964n690921o869721
57095e5277697q313960j0044733j2058860j4321402j6766576j9314349k1890190
57088a57987767k4425180k6837059k9016815l0830406l2118493l2689431l2329473
57081c66234624l0840280k8074464k3950708j8481340j1839758m415451L230598
57074d80606027J0512926J6970602K2328377K6476000K9422200L1250774L2076934
57067c11568214L2014419L1171249K9665909K7637192K5238061K2624785J9947202
$$ plain form
57060 -123269397 -105933554 -91044963 -78377963 -67675362 -58671776 -51112823 -44767674
57053 -44767674 -39432954 -34932634 -31118681 -27870513 -25090420 -22697837 -20626448 -18822883
57045 -18822883 -17244158 -15854889 -14626149 -13534583 -12560348 -11685813 -10896385 -10181071 -9530931
57036 -9530931 -8937592 -8393846 -7894340 -7434374 -7008682 -6612368 -6242207 -5896045 -5571564
57027 -5571564 -5266483 -4979128 -4707635 -4449098 -4200590 -3960750 -3729372 -3505567 -3287509
57018 -3287509 -3074779 -2871058 -2684164 -2522502 -2390087 -2284130 -2197290 -2122191 -2053936 -1989670
57008 -1989670 -1927650 -1867163 -1808211 -1750632 -1694017 -1638576 -1585236 -1534593 -1486516 -1440837 -1397605
56997 -1397605 -1356461 -1316637 -1277820 -1240192 -1203439 -1166616 -1129277 -1091848 -1054605 -1017141 -979072
$$ packed form
57060a23269397J7335843J4888591J2667000J0702601R003586P558953O345149
57053d4767674N334720M500320L813953L248168K780093K392583K071389J803565
57045a8822883J578725J389269J228740J091566R74235Q74535P89428P15314O50140
57036i530931N93339N43746M99506M59966M25692L96314L70161L46162L24481
57027e571564L05081K87355K71493K58537K48508K39840K31378K23805K18058
57018c287509K12730K03721J86894J61662J32415J05957Q6840P5099O8255O4266
57008a989670O2020O0487N8952N7579N6615N5441N3340N0643M8077M5679M3232
56997a397605M1144L9824L8817L7628L6753L6823L7339L7429L7243L7464L8069
$$ plain form
56986 -979072 -940351 -900537 -858738 -814764 -769653 -724794 -681425 -641181 -605969 -576559 -551988
56975 -551988 -530756 -511901 -494615 -477877 -461075 -444281 -427445 -410073 -392096 -374095 -356062
56964 -356062 -336821 -315453 -292535 -269192 -245434 -220150 -192336 -161822 -129319 -96488 -65802
56953 -65802 -39869 -20863 -10310 -8487 -13625 -22381 -31650 -39781 -46142 -50365 -52357 -52288 -50135 -45685
56939 -45685 -39096 -30745 -20358 -7123 9114 27637 48125 71316 97966 127852 159795 191475
56927 191475 218814 236983 243294 238769 226560 209663 190506 171396 154049 139093 126715 117303
56915 117303 110849 106515 103570 102198 102751 104819 107717 111268 115395 119616 123720 128362 134129 140452
56901 140452 146202 150978 155186 159298 163737 168994 175067 181120 186492 191795 198409 207123 217752 229768
$$ packed form
56986i79072L8721L9814M1799M3974M5111M4859M3369M0244L5212K9410K4571
56975e51988K1232J8855J7286J6738J6802J6794J6836J7372J7977J8001J8033
56964c56062J9241K1368K2918K3343K3758K5284K7814L0514L2503L2831L0686
56953f5802K5933J9006a0310J823n138q756r269q131o361m223j992O9K153M450
56939d5685O589Q351J0387g123I114J8523K0488K3191K6650K9886L1943L1680
56927A91475K7339J8169O311m525j2209j6897j9157j9110j7347j4956j2378r412
56915A17303o454m334k945j372N53K068K898L551M127M221M104M642N767O323
56901A40452N750M776M208M112M439N257O073O053N372N303O614Q714J0629J2016
$$ plain form
56887 229768 242765 256552 271166 286314 300318 310097 312950 308315 297650 283206 267350 252296
56875 252296 239504 229330 221594 216204 213038 211776 212345 215113 220332 227919 238119 251717 269143
56862 269143 290021 314144 342252 375088 411889 449880 484542 510262 522177 518787 502757 478818
56850 478818 451380 424059 399852 380339 365286 354073 347095 345112 347949 354858 365672 380829
56838 380829 400840 426591 459554 500785 550172 607192 671041 738170 800080 845560 866150
56827 866150 859714 829914 783825 729652 674525 622869 576627 536779 504082 478626 459674 446278
56815 446278 437765 433782 434434 440326 452102 470053 494552 526466 566459 613682 664840 713759
56803 713759 751833 770637 766065 740414 700236 652544 602945 555621 513157 476397 445392 420376
$$ packed form
56887B29768J2997J3787J4614J5148J4004R779K853m635j0665j4444j5856j5054
56875B52296j2792j0174p736n390l166j262N69K768N219P587J0200J3598J7426
56862B69143K0878K4123K8108L2836L6801L7991L4662K5720J1915l390j6030k3939
56850D78818k7438k7321k4207j9513j5053j1213o978j983K837O909J0814J5157
56838C80829K0011K5751L2963M1231M9387N7020O3849O7129O1910M5480K0590
56827H66150o436k9800m6089n4173n5127n1656m6242l9848l2697k5456j8952j3396
56815D46278q513l983O52N892J1776J7951K4499L1914L9993M7223N1158M8919
56803G13759L8074J8804m572k5651m0178m7692m9599m7324m2464l6760l1005k5016
$$ plain form
56791 420376 401240 386807 375766 367973 363912 363374 365792 371532 381734 397005 417140 441582 468747
56778 468747 494868 514772 524260 521561 507198 483758 455506 426744 399838 375147 352543 332173
56766 332173 314107 298383 285391 275394 267752 261470 256258 252192 248712 245066 241519 239002 237673
56753 237673 236924 236616 237008 237535 237072 235629 234501 234418 234705 234634 234433 234436 234238 233327 231889 230480 229434 228851
56735 228851 228588 228129 227083 225944 225656 226349 227175 227549 227757 228179 228613 228670 228328 228032 228692 231397 236326 241955
56717 241955 246117 247964 248333 248440 248963 250161 251802 252991 253036 252547 252801 254053 255494 256824 258649 261162
56701 261162 263614 265397 266607 267249 266962 265938 265099 264873 264692 264060 263248 262514 261560 260262 259122 258515 258230
56684 258230 258185 258822 260326 262171 263851 265415 266933 268160 269041 269809 270210 269480 267604 265787 265119 265422
$$ packed form
56791D20376j9136j4433j1041p793m061n38K418N740J0202J5271K0135K4442K7165
56778D68747K6121J9904R488k699j4363k3440k8252k8762k6906k4691k2604k0370
56766C32173j8066j5724j2992r997p642o282n212m066l480l646l547k517j329
56753B37673p49l08L92N27m63j443j128q3K87p1k01Lj98r11j438j409j046n83
56735B28851k63m59j046j139k88O93Q26L74K08M22M34N7l42k96O60K705M929N629
56717B41955M162J847L69J07N23J198J641J189M5m89K54J252J441J330J825K513
56701B61162K452J783J210O42k87j024q39k26j81o32q12p34r54j298j140o07k85
56684B58230m5O37J504J845J680J564J518J227Q81P68M01p30j876j817o68L03
$$ plain form
56668 265422 265909 266309 266781 267330 267950 268838 269978 270926 271480 272098 273222 274588 275603 276020 275944 275564 275224 275308
56650 275308 275729 275883 275375 274468 273660 273170 273003 273083 273198 273134 272937 272716 272388 272088 272495 273978 275611 275965 274868
56631 274868 273463 272529 271787 270938 270223 269596 268402 266448 264488 263165 262226 261262 260427 259861 259141 257923 256595
56614 256595 255804 255711 256061 256543 256862 256971 257320 258276 259228 259060 257652 256118 255380 255354 255685 256299 256921 257061 256933
56595 256933 257425 258684 259630 259451 258687 258308 258557 259344 260922 263348 265841 267414 267822 267516 267111 267204 268093
56578 268093 269348 270253 270847 271841 273337 274587 275291 276114 277507 279084 280741 283278 287178 291673 295848
56563 295848 299862 304348 309467 315365 322775 332157 342765 353262 362683 370169 374552 375203 372849 368826
56549 368826 363961 358772 354079 350446 347495 344563 341664 339129 336756 334095 331275 328810 326808 324942
$$ packed form
56668B65422M87M00M72N49O20Q88J140R48N54O18J124J366J015M17p6l80l40Q4
56650B75308M21J54n08r07q08m90j67Q0J15o4j97k21l28l00M07J483J633L54j097
56631B74868j405r34p42q49p15o27j194j954j960j323r39r64q35n66p20j218j328
56614B56595p91r3L50M82L19J09L49R56R52j68j408j534p38k6L31O14O22J40j28
56595B56933M92J259R46j79p64l79K49P87J578K426K493J573M08l06m05R3Q89
56578B68093J255R05N94R94J496J250P04Q23J393J577J657K537L900M495M175
56563B95848M014M486N119N898P410R382J0608J0497R421P486M383O51k354m023
56549C68826m865n189m693l633k951k932k899k535k373k661k820k465k002j866
$$ plain form
56535 324942 322953 320734 318263 315842 314032 312996 312322 311732 311360 311082 310363 309237 308638 309150 310141 310747
56519 310747 311031 311439 311700 311035 309102 306227 303107 300654 299508 299293 298896 297814 296532 295363 293881 291937
56503 291937 290194 289051 288043 286968 286523 287019 287523 287251 286830 287158 287897 288186 288019 287792 287256 286159 285227
56486 285227 285245 285724 285744 285606 286285 287590 288305 288085 287961 288828 290402 291807 292433 292201 291608 291426 291859 292210
56468 292210 291897 291416 291621 292466 293154 293240 292893 292376 291896 291660 291587 291277 290732 290577 291112 291779 292127 292544 293356
56449 293356 294018 294098 294290 295483 297391 299113 300507 302050 303760 305240 306429 307439 308042 308101 308098 308433 308705
56432 308705 308424 307897 307583 307179 306193 304838 303524 302128 300628 299690 299652 299705 299217 299026 300116 301756 302426
56415 302426 302083 301965 302506 302986 303075 303200 303422 303349 303260 303980 305425 306390 306103 305120 304446 304528 305221 306147 307002 307955
$$ packed form
56535C24942j989k219k471k421j810j036o74n90l72k78p19j126n99N12R91O06
56519C10747K84M08K61o65j933k875l120k453j146k15l97j082j282j169j482j944
56503B91937j743j143j008j075m45M96N04k72m21L28P39K89j67k27n36j097r32
56486B85227J8M79K0j38O79J305P15k20j24Q67J574J405O26k32n93j82M33L51
56468B92210l13m81K05Q45O88Q6l47n17m80k36p3l10n45j55N35O67L48M17Q12
56449B93356O62Q0J92J193J908J722J394J543J710J480J189J010O03N9lL35K72
56432C08705k81n27l14m04r86j355j314j396j500r38l8N3m88j91J090J640O70
56415C02426l43j18N41M80Q9J25K22p3q9P20J445R65k87r83o74Q2O93R26Q55R53
$$ plain form
56395 307955 309571 311924 314156 315510 316276 317096 317915 318379 318754 319549 320676 321752 322709 323437 323512 323095 323300
56378 323300 324730 326427 327283 327591 328120 328616 328583 328647 329527 330435 330166 329224 329199 330425 331931 333299 334899 336531
56360 336531 337608 338591 340601 343550 346178 347937 349392 350790 351715 352278 353244 354822 356522 358204 360083
56345 360083 361775 362624 362960 363750 365096 366245 367021 368057 369769 372243 375856 380715 385812 390102 394078
56330 394078 398845 404049 408339 411613 415041 419018 422864 426466 430377 434169 436510 437154 437190 437127 436412 435163
56314 435163 434638 435403 436486 436820 436362 435497 434635 434677 436558 439998 443767 447256 450744 454322 457925 462206
56298 462206 467805 473881 479029 483532 488970 495671 502460 508960 516047 523748 530847 537171 544279 553151
56284 553151 562873 572341 581649 591114 600588 610430 621619 634146 646738 658862 671504 685355 699751
$$ packed form
56395C07955J616K353K232J354P66Q20Q19M64L75P95J127J076R57P28P5m17K05
56378C23300J430J697Q56L08N29M96l3O4Q80R08k69r42k5J226J506J368J600J632
56360C36531J077R83K010K949K628J759J455J398R25N63R66J578J700J682J879
56345C60083J692Q49L36P90J346J149P76J036J712K474L613M859N097M290L976
56330C94078M767N204M290L274L428L977L846L602L911L792K341O44L6o3p15j249
56314D35163n25P65J083L34m58q65q62M2J881L440L769L489L488L578L603M281
56298D62206N599O076N148M503N438O701O789O500P087P701P099O324P108Q872
56284E53151R722R468R308R465R474R842J1189J2527J2592J2124J2642J3851J4396
$$ plain form
56271 699751 714249 729824 747577 767438 788923 812129 837351 864697 894550 927442 963204
56260 963204 1001393 1042771 1089150 1141713 1200804 1267363 1342866 1427644 1521019 1623509 1737166
56249 1737166 1863303 2001492 2151182 2312490 2484734 2665815 2853593 3046197 3240394
56240 3240394 3431175 3613558 3783327 3935782 4065716 4169293 4244269 4287971 4297262 4271483
56230 4271483 4213714 4128263 4018489 3887708 3740195 3580170 3411226 3237416 3063149 2891238
56220 2891238 2722753 2559490 2404556 2259657 2123857 1996145 1877311 1768105 1667447
56211 1667447 1573884 1487210 1407398 1333554 1265246 1203393 1148500 1099298 1054223 1012927 975410
56200 975410 941087 909763 882116 858274 837271 818520 802162 787366 772365 757149 744029
$$ packed form
56271F99751J4498J5575J7753J9861K1485K3206K5222K7346K9853L2892L5762
56260I63204L8189M1378M6379N2563N9091O6559P5503Q4778R3375J02490J13657
56249A737166J26137J38189J49690J61308J72244J81081J87778J92604J94197
56240C240394J90781J82383J69769J52455J29934J03577P4976M3702R291k5779
56230D271483n7769q5451j09774j30781j47513j60025j68944j73810j74267j71911
56220B891238j68485j63263j54934j44899j35800j27712j18834j09206j00658
56211A667447r3563q6674p9812p3844o8308o1853n4893m9202m5075m1296l7517
56200I75410l4323l1324k7647k3842k1003j8751j6358j4796j5001j5216j3120
$$ plain form
56189 744029 734327 726512 718779 711377 704945 698742 692298 686910 683546 680855 677153 673018 670117 668695
56175 668695 667929 667593 667787 668052 668223 669112 671088 673069 674149 675121 677303 681042 686256 693059 700893 708514
56159 708514 715872 724459 734921 746049 757095 769125 782998 797983 813683 831309 851668 873911
56147 873911 897713 924625 955774 990412 1028515 1072611 1125015 1185215 1252053 1326567 1410278
56136 1410278 1501991 1598147 1694689 1786733 1868423 1935920 1989901 2033664 2070180 2102348 2133639
56125 2133639 2165492 2194983 2217209 2229332 2231098 2223261 2207602 2187154 2164134 2138139 2107300 2069612
56113 2069612 2022029 1960637 1884143 1796126 1702448 1607952 1516733 1432932 1358866 1293963 1237432
56102 1237432 1190207 1152643 1122562 1097718 1078206 1064336 1054232 1045798 1039136 1034862 1032041 1029989
$$ packed form
56189G44029r702p815p733p402o432o203o444n388l364k691l702m135k901j422
56175F68695p66l36J94K65J71Q89J976J981J080R72K182L739N214O803P834P621
56159G08514P358Q587J0462J1128J1046J2030J3873J4985J5700J7626K0359K2243
56147H73911K3802K6912L1149L4638L8103M4096N2404O0200O6838P4514Q3711
56136A410278R1713R6156R6542R2044Q1690O7497N3981M3763L6516L2168L1291
56125B133639L1853K9491K2226J2123J766p837j5659k0448k3020k5995l0839l7688
56113B069612m7583o1392p6494q8017r3678r4496r1219q3801p4066o4903n6531
56102A237432m7225l7564l0081k4844j9512j3870j0104q434o662m274k821k052
$$ plain form
56090 1029989 1029964 1032744 1036584 1039882 1043727 1049465 1055995 1062011 1068665 1077350 1086964 1096075 1105638 1116912
56076 1116912 1128841 1140207 1152141 1165727 1179474 1192050 1205172 1220651 1236882 1251501 1265361
56065 1265361 1280608 1296933 1312937 1329132 1346338 1363215 1378584 1393974 1410685 1426716 1440000
56054 1440000 1452250 1466080 1480774 1494607 1508868 1525692 1544182 1562571 1581920 1603767 1626484
56043 1626484 1647993 1669784 1694200 1720149 1745615 1771872 1800916 1831296 1860977 1891863 1926860
56032 1926860 1964846 2003055 2041846 2082460 2122714 2159935 2195684 2232783 2270437 2307245 2346049
56021 2346049 2390332 2438615 2487800 2539160 2595398 2654938 2714993 2777196 2844087 2913319 2981846
56010 2981846 3052579 3129982 3212279 3295100 3379682 3470003 3564857 3660597 3758907 3864044 3975122
$$ packed form
56090A029989k5K780L840L298L845N738O530O016O654Q685R614R111R563J1274
56076A116912J1929J1366J1934J3586J3747J2576J3122J5479J6231J4619J3860
56065A265361J5247J6325J6004J6195J7206J6877J5369J5390J6711J6031J3284
56054A440000J2250J3830J4694J3833J4261J6824J8490J8389J9349K1847K2717
56043A626484K1509K1791K4416K5949K5466K6257K9044L0380K9681L0886L4997
56032A926860L7986L8209L8791M0614M0254L7221L5749L7099L7654L6808L8804
56021B346049M4283M8283M9185N1360N6238N9540O0055O2203O6891O9232O8527
56010B981846P0733P7403Q2297Q2821Q4582R0321R4854R5740R8310J05137J11078
$$ plain form
55999 3975122 4088988 4207786 4335602 4470720 4609623 4755398 4913411 5082062 5257026
55990 5257026 5441131 5640276 5853059 6074700 6307804 6558727 6826858 7108596 7408274
55981 7408274 7733542 8083693 8454679 8851735 9284382 9753335 10256047 10800853 11401305
55972 11401305 12061401 12781878 13575994 14462607 15449485 16541913 17762505 19143768 20708439
55963 20708439 22479508 24503933 26845193 29563719 32734362 36476201 40935630 46249791
55955 46249791 52560936 60057886 68972801 79568185 92193693 107353805 125674986
55948 125674986 147826045 174441504 205751291 240601071 275386699 304228143 321046846
55941 321046846 322375164 308801689 284138270 253326928 220700899 189277030 160763551
$$ packed form
55999C975122J13866J18798J27816J35118J38903J45775J58013J68651J74964
55990E257026J84105J99145K12783K21641K33104K50923K68131K81738K99678
55981G408274L25268L50151L70986L97056M32647M68953N02712N44806O00452
55972A1401305O60096P20477P94116Q86613R86878J092428J220592J381263J564671
55963B0708439J771069K024425K341260K718526L170643L741839M459429N314161
55955D6249791O311145P496950Q914915J0595384J2625508J5160112J8321181
55948A25674986K2151059K6615459L1309787L4849780L4785628K8841444J6818703
55941C21046846J328318j3573475k4663419l0811342l2626029l1423869k8513479
$$ plain form
55934 160763551 135836520 114511802 96506176 81450469 68948387 58603003 50062488
55927 50062488 43031975 37244411 32454126 28463498 25126594 22320698 19936051 17892362
55919 17892362 16138123 14626780 13310417 12155874 11145553 10258730 9468622 8758599
55911 8758599 8123964 7555823 7038688 6565136 6137428 5752517 5399317 5072352 4774627
55902 4774627 4505032 4255439 4022183 3808647 3614520 3433507 3263397 3107879 2966629
55893 2966629 2833536 2706401 2588896 2481493 2379579 2281939 2192182 2110391 2031984 1956230
55883 1956230 1887591 1827179 1770920 1717576 1670816 1631837 1597243 1565383 1537354 1510425 1477912
55872 1477912 1437404 1392704 1346519 1297947 1248256 1202021 1160705 1121428 1083531 1050054 1021230
$$ packed form
55934A60763551k4927031k1324718j8005626j5055707j2502082j0345384q540515
55927E0062488p030513n787564m790285l990628l336904k805896k384647k043689
55919A7892362j754239j511343j316363j154543j010321q86823p90108p10023
55911H758599o34635n68141n17135m73552m27708l84911l53200l26965k97725
55902D774627k69595k49593k33256k13536j94127j81013j70110j55518j41250
55893B966629j33093j27135j17505j07403j01914r7640q9757q1791p8407p5754
55883A956230o8639o0412n6259n3344m6760l8979l4594l1860k8029k6929l2513
55872A477912m0508m4700m6185m8572m9691m6235m1316l9277l7897l3477k8824
$$ plain form
55861 1021230 992943 963452 935643 910797 886138 860726 838069 820455 805611 791180 777816
55850 777816 765837 753241 739014 724454 709761 693261 675167 658029 642374 626042 608722
55839 608722 592891 579273 565774 551974 540288 531442 523087 514167 506409 500172 493073 484278 476190
55826 476190 470344 465343 460242 456174 453124 448781 442185 435192 428956 422295 414759 407981 402768 398082
55812 398082 393969 392156 392650 393131 392812 393629 396631 400630 405462 412851 422701 432108 439565 446862 455332
55797 455332 463438 469551 473900 476337 475341 470845 464960 458345 448966 436069 422414 410755 400999 392504
55783 392504 386282 382898 380616 377574 373604 368505 360959 350864 340510 331906 324974 319594 317027 317924
55769 317924 321150 325941 332841 341090 347470 349339 346911 341433 333496 324340 316267 309977 303616 295997
$$ packed form
55861A021230k8287k9491k7809k4846k4659k5412k2657j7614j4844j4431j3364
55850G77816j1979j2596j4227j4560j4693j6500j8094j7138j5655j6332j7320
55839F08722j5831j3618j3499j3800j1686q846q355q920p758o237p099q795q088
55826D76190n846n001n101m068l050m343o596o993o236o661p536o778n213m686
55812C98082m113j813M94M81l19Q17L002L999M832P389R850R407P457P297Q470
55797D55332Q106O113M349K437r96m496n885o615r379j2897j3655j1659r756q495
55783C92504o222l384k282l042l970n099p546j0095j0354q604o932n380k567Q97
55769C17924L226M791O900Q249O380J869k428n478p937r156q073o290o361p619
$$ plain form
55755 295997 288637 283151 278819 274411 270393 267640 265756 264230 263545 263602 262732 259698 255148 249976 243937
55740 243937 237093 230861 226327 223057 220562 219268 219023 218500 217128 215883 215277 214448 213153 212544 212883 212574
55724 212574 210683 208399 206745 204850 201830 198433 195584 193148 191317 191199 192773 194202 194515 194985 196656
55709 196656 198681 200550 203629 208666 213740 216596 217349 217147 215908 213174 209629 205973 201671 196402 191295
55694 191295 187265 183679 180093 177598 176837 176405 175028 173728 174042 175576 177147 178920 181609 184845 188158
55679 188158 192207 197332 202216 205790 209107 213429 217714 219974 220017 218944 217066 214322 211707 210158 208758
55664 208758 206028 202475 200039 199574 200554 202677 206021 210001 213716 217149 220843 224813 228754 232632 236053
55649 236053 237901 237712 236529 235301 233396 229840 225018 219877 214521 208871 203675 199423 195251 190313
$$ packed form
55755B95997p360n486m332m408m018k753j884j526o85N7q70l034m550n172o039
55740B43937o844o232m534l270k495j294k45n23j372j245o06q29j295o09L39l09
55724B12574j891k284j654j895l020l397k849k436j831j18J574J429L13M70J671
55709A96656K025J869L079N037N074K856P53k02j239k734l545l656m302n269n107
55694A91295m030l586l586k495p61m32j377j300L14J534J571J773K689L236L313
55679A88158M049N125M884L574L317M322M285K260M3j073j878k744k615j549j400
55664B08758k730l553k436m65R80K123L344L980L715L433L694L970L941L878L421
55649B36053J848j89j183j228j905l556m822n141n356n650n196m252m172m938
$$ plain form
55635 190313 185222 180792 176441 171412 166542 163148 161068 159403 158311 158425 159215 159642 159737 160029 160070 159131
55619 159131 157676 156547 155354 153282 150841 149196 148241 146892 144859 142664 140435 138107 136279 135437 134877
55604 134877 133745 132546 132222 132428 132223 131770 131774 131883 131380 130830 131211 131839 131029 128619 126101 124357 122894
55587 122894 121262 119660 118113 116472 115282 115407 116819 118800 121069 123520 125308 125685 125485 126334 128506
55572 128506 130854 132628 134021 135138 135938 137112 139572 143006 146160 148528 150534 152148 152681 152000 150739
55557 150739 149191 147071 144444 141886 139768 138214 137581 138003 138722 138890 138743 138982 139447 139564 139667 140547 142007
55540 142007 143233 144357 146222 148778 151067 152735 154242 155655 156571 157089 157499 157120 154908 151279 147830
55525 147830 145199 142594 139652 137173 135611 134150 131894 128958 125907 123057 120710 119211 118422 117806 117221
$$ packed form
55635A90313n091m430m351n029m870l394k080j665j092J14P90M27R5K92M1r39
55619A59131j455j129j193k072k441j645r55j349k033k195k229k328j828q42n60
55604A34877j132j199l24K06k05m53MJ09n03n50L81O28q10k410k518j744j463
55587A22894j632j602j547j641j190J25J412J981K269K451J788L77k00Q49K172
55572A28506K348J774J393J117Q00J174K460L434L154K368K006J614N33o81j261
55557A50739j548k120k627k558k118j554o33M22P19J68j47K39M65J17J03Q80J460
55540A42007J226J124J865K556K289J668J507J413R16N18M10l79k212l629l449
55525A47830k631k605k942k479j562j461k256k936l051k850k347j499p89o16n85
$$ plain form
55510 117221 116913 116722 116121 115127 114355 114133 114290 114682 115139 115071 114059 112725 112073 112152 112318 112565 113472 114908
55492 114908 115929 116014 115417 114420 113233 112474 112618 113092 113039 112799 113437 114953 116314 117127 117853 118339 117716 115961
55474 115961 114148 112830 111575 110386 110079 110737 111169 110607 109718 109265 108913 108132 107270 106872 106754 106527 106446 107030
55456 107030 108295 109801 111038 111520 111047 110105 109515 109522 109813 110322 111191 111913 111545 110082 108763 108658 109702
55439 109702 111293 113018 114502 115374 115755 116117 116416 116063 114927 113608 112563 111714 111113 111136 111759 112409 112803
55422 112803 113226 113721 113804 113219 112364 111684 111299 111323 111871 112640 113165 113522 114051 114449 114035 112940 112117 112031 112217
55403 112217 112192 111904 111277 110316 109723 110294 111576 112213 111771 111037 110347 108985 106739 104739 104062 104519 105411 106567
55385 106567 108016 109539 111061 112722 114168 114667 114300 114031 114215 114156 113521 112955 112676 111848 110239 109274 110187
$$ packed form
55510A17221l08j91o01r94p72k22J57L92M57o8j012j334o52P9J66K47R07J436
55492A14908J021Q5n97r97j187p59J44M74n3k40O38J516J361Q13P26M86o23j755
55474A15961j813j318j255j189l07O58M32n62q89m53l52p81q62l98j18k27q1N84
55456A07030J265J506J237M82m73r42n90PK91N09Q69P22l68j463j319j05J044
55439A09702J591J725J484Q72L81L62K99l53j136j319j045q49o01K3O23O50L94
55422A12803M23M95Q3n85q55o80l85K4N48P69N25L57N29L98m14j095q23q6J86
55403A12217k5k88o27r61n93N71J282O37m42p34o90j362k246k000o77M57Q92J156
55385A06567J449J523J522J661J446M99l67k69J84n9o35n66k79q28j609r65R13
$$ plain form
55368 110187 112060 112965 112409 111499 111169 111374 111741 112006 111918 111444 110977 110872 111054 111452 112316 113567 114366 113995
55350 113995 112753 111440 110306 109154 108159 107908 108742 110434 112349 113757 114321 114481 114937 115649 115915 115598
55334 115598 115423 115746 115881 115180 114039 113170 112551 111815 111117 110852 110939 111045 111212 111623 112076 112240 112151 112024 111911
55315 111911 111948 112492 113546 114446 114637 114347 114054 113711 113044 112260 111850 111921 112208 112553 112918 113149 113130 113068 113287 113831
55295 113831 114415 114645 114279 113546 113172 113701 114838 115823 116328 116405 115863 114573 113276 113015 113660 114086 113994 114345
55277 114345 115630 116968 117526 117626 117636 116969 115203 113308 112609 113188 114258 115464 116784 117794 118148 118390
55261 118390 119238 120339 120741 120300 119717 119361 118991 118553 118426 118818 119526 120246 120672 120484 119679 118719 117982 117426
55243 117426 117122 117524 118666 119671 119775 119309 119012 118875 118469 117912 117614 117398 116751 115687 114598 113565 112668
$$ packed form
55368A10187J873R05n56r10l30K05L67K65q8m74m67j05J82L98Q64J251P99l71
55350A13995j242j313j134j152r95k51Q34J692J915J408N64J60M56P12K66l17
55334A15598j75L23J35p01j141q69o19p36o98k65Q7J06J67M11M53J64q9j27j13
55315A11911L7N44J054R00J91k90k93l43o67p84m10P1K87L45L65K31j9o2K19N44
55295A13831N84K30l66p33l74N29J137R85N05P7n42j290j297k61O45M26r2L51
55277A14345J285J338N58J00J0o67j766j895o99N79J070J206J320J010L54K42
55261A18390Q48J101M02m41n83l56l70m38j27L92P08P20M26j88q05r60p37n56
55243A17426l04M02J142J005J04m66k97j37m06n57k98k16o47j064j089j033q97
$$ plain form
55226 112668 112567 113818 115814 117320 117926 118159 118393 118635 119247 120742 122744 124093 124229 123686 123082 122394 121495
55209 121495 120643 120081 119706 119431 119441 119851 120531 121413 122568 123784 124514 124463 123949 123462 123096 122552 121542 120153
55191 120153 118901 118394 118843 119974 121437 122976 124108 124142 122974 121536 120975 121498 122360 122737 122326 121335 120310
55174 120310 119814 119945 120358 120922 121898 123253 124390 125034 125731 126871 127827 127928 127731 128355 129796 130973 131304
55157 131304 131249 131287 131362 131493 132019 132841 133147 132285 130484 128449 126708 125491 124761 124102 122998 121503 120338
55140 120338 120190 121144 122877 124990 127024 128489 129115 128930 128040 126524 124569 122515 120714 119436 118837 118799
55124 118799 118896 118726 118261 117799 117717 118274 119348 120255 120243 119416 118711 118719 119011 119037 119055 119559 120264 120539 120526 121003 122183
55103 122183 123494 124561 125692 127241 129069 130800 132157 132945 133169 133279 133893 135191 136871 138697 140657
$$ packed form
55226A12668j01J251J996J506O06K33K34K42O12J495K002J349J36n43o04o88q99
55209A21495q52n62l75k75J0M10O80Q82J155J216P30n1n14m87l66n44j010j389
55191A20153j252n07M49J131J463J539J132L4j168j438n61N23Q62L77m11r91j025
55174A20310m96J31M13N64R76J355J137O44O97J140R56J01j97O24J441J177L31
55157A31304n5L8P5J31N26Q22L06q62j801k035j741j217p30o59j104j495j165
55140A20338j48R54J733K113K034J465O26j85q90j516j955k054j801j278n99l8
55124A18799R7j70m65m62q2N57J074R07j2q27p05QK92K6J8N04P05K75j3M77J180
55103A22183J311J067J131J549J828J731J357P88K24J10O14J298J680J826J960
$$ plain form
55088 140657 142537 143785 143986 143277 142202 141279 140662 140112 139380 138640 138307 138436 138776 139508 141205 143667 145532
55071 145532 145774 145019 144619 144889 145165 145207 145382 145617 145258 144197 143212 142851 142680 141956 140493 138620 136805 135485
55053 135485 134803 134358 133616 132705 132355 132987 134221 135271 135422 134236 131940 129702 128904 129840 131440 132405 132310
55036 132310 131658 131313 131892 133263 134536 134927 134657 134586 135053 135563 135657 135480 135349 135235 134957 134546 134256 134375 135038
55017 135038 135949 136400 135946 135014 134473 134645 135150 135630 136157 136904 137865 138962 140059 140857 141108 140961 140857 141122
54999 141122 141826 142864 143983 144949 145904 147126 148264 148433 147547 146777 147000 147484 147096 146109 145584 145462 144753
54982 144753 143461 142722 142882 142897 142102 141217 140938 140677 139544 137782 136457 136250 137157 138825 140714 142379 143962
54965 143962 145887 147860 148922 148847 148659 149255 150211 150536 149962 148909 147765 146872 146705 147360 148233 148808 149418
$$ packed form
55088A40657J880J248K01p09j075r23o17n50p32p40l33J29L40P32J697K462J865
55071A45532K42p55m00K70K76M2J75K35l59j061r85l61j71p24j463j873j815j320
55053A35485o82m45p42r11l50O32J234J050J51j186k296k238p98R36J600R65r5
55036A32310o52l45N79J371J273L91k70p1M67N10R4j77j31j14k78m11k90J19O63
55017A35038R11M51m54r32n41J72N05M80N27P47R61J097J097P98K51j47j04K65
54999A41122P04J038J119R66R55J222J138J69q86p70K23M84l88r87n25j22p09
54982A44753j292p39J60J5p95q85k79k61j133j762j325k07R07J668J889J665J583
54965A43962J925J973J062p5j88N96R56L25n74j053j144q93j67O55Q73N75O10
$$ plain form
54948 149418 150613 152114 153010 152826 151877 150797 150162 150317 151071 151681 151580 151012 150675 150922 151604 152445 153265 154018
54930 154018 154892 156159 157777 159448 161300 164056 168154 173092 178128 183353 189532 196999 205185 213160
54916 213160 220214 225892 229828 231737 231452 228926 224275 217872 210438 202979 196348 190625 185098 179232
54902 179232 173520 169015 166142 164414 163217 162270 161316 160059 158654 157720 157648 158261 159245 160391 161305 161521
54886 161521 161239 161439 162969 165854 169653 173966 178427 182778 187277 192517 198608 205047 211536 218202 224632
54871 224632 229450 231428 230603 227777 223459 217849 211385 204610 197729 190773 183976 177599 171680 166377
54857 166377 162169 159243 157010 154746 152490 150821 149952 149503 149007 148215 147047 145602 144117 142692 141213
54842 141213 139754 138728 138410 138609 139078 139910 141293 143159 145299 147467 149165 149876 149785 149718 149978 149819 148610
$$ packed form
54948A49418J195J501Q96j84r49j080o35J55P54O10j01n68l37K47O82Q41Q20P53
54930A54018Q74J267J618J671J852K756M098M938N036N225O179P467Q186P975
54916B13160P054N678L936J909k85k526m651o403p434p459o631n723n527n866
54902A79232n712m505k873j728j197r47r54j257j405r34p2O13R84J146R14K16
54886A61521k82K00J530K885L799M313M461M351M499N240O091O439O489O666O430
54871B24632M818J978q25k826m318n610o464o775o881o956o797o377n919n303
54857A66377m208k926k233k264k256j669q69m49m96p92j168j445j485j425j479
54842A41213j459j026l18J99M69Q32J383J866K140K168J698P11r1o7K60j59j209
$$ plain form
54825 148610 146943 145926 145790 145876 145680 145239 144692 144149 143932 144376 145352 146379 147125 147560 147847 148399 149664 151448
54807 151448 152733 152680 151540 150155 148918 147735 146652 145899 145494 145389 145815 146971 148546 150002 151147 151992
54791 151992 152370 152265 152208 152732 153616 154299 154759 155327 155863 155913 155580 155479 155809 156192 156460 156907 157725 158826 160357
54772 160357 162718 165961 169773 174210 179811 186766 194508 202342 209954 217093 223316 228378 232471 235681
54758 235681 237484 237065 233986 228459 221223 213299 205561 198411 191976 186456 181917 177795 173252 168216
54744 168216 163621 160398 158615 157868 157999 159005 160482 161674 162099 161934 161817 162423 164104 166692 169618 172414
54728 172414 175151 178315 182211 186549 190752 194727 199171 204890 211789 218766 224650 228901 231269 231225 228298
54713 228298 222863 216141 209353 203114 197589 192805 188658 184878 181199 177528 173912 170460 167331 164754
$$ packed form
54825A48610j667j017j36Q6j96m41n47n43k17M44R76J027P46M35K87N52J265J784
54807A51448J285n3j140j385j237j183j083p53m05j05M26J156J575J456J145Q45
54791A51992L78j05n7N24Q84O83M60N68N36N0l33j01L30L83K68M47Q18J101J531
54772A60357K361L243L812M437N601O955P742P834P612P139O223N062M093L210
54758B35681J803m19l079n527p236p924p738p150o435n520m539m122m543n036
54744A68216m595l223j783p47J31J006J477J192M25j65j17O06J681K588K926K796
54728A72414K737L164L896M338M203L975M444N719O899O977N884M251K368m4k927
54713B28298n435o722o788o239n525m784m147l780l679l671l616l452l129k577
$$ plain form
54699 164754 162973 162081 161804 161543 160842 159824 158916 158144 157084 155621 154331 153837 154089 154540 154713 154354 153415
54682 153415 152292 151710 151892 152120 151587 150441 149463 148969 148633 148310 148315 148768 149223 149198 148750 148296 148054 147772 146935
54663 146935 145282 143249 141773 141423 141918 142659 143476 144457 145327 145598 145326 145236 145940 147297 148607 149225 149008
54646 149008 148444 148297 148925 149942 150720 150992 150760 149935 148564 147221 146722 147383 148782 150180 150911 150634 149649
54629 149649 148806 148722 149169 149542 149686 149810 149899 149767 149541 149483 149441 149075 148547 148303 148232 147784 147044 146923 147949 149440
54609 149440 150316 150301 149987 149958 150219 150339 149923 148990 147954 147204 146845 146950 147780 149349 151021 152023 152258 152137
54591 152137 151807 151204 150778 151350 152987 154689 155512 155528 155387 155373 155270 154835 154055 153162 152617 152862 153865 155040
54573 155040 155750 155780 155311 154679 154151 153697 152987 151847 150662 150044 150163 150743 151512 152193 152277 151449 150282 149828
$$ packed form
54699A64754j781q92k77k61p01j018r08p72j060j463j290m94K52M51J73l59r39
54682A53415j123n82J82K28n33j146r78m94l36l23NM53M55k5m48m54k42k82q37
54663A46935j653k033j476l50M95P41Q17R81Q70K71k72r0P04J357J310O18k17
54646A49008n64j47O28J017P78K72k32q25j371j343m99O61J399J398P31k77r85
54629A49649q43q4M47L73J44J24Q9j32k26n8m2l66n28k44p1m48p40j21J026J491
54609A49440Q76j5l14k9K61J20m16r33j036p50l59J05Q30J569J672J002K35j21
54591A52137l30o03m26N72J637J702Q23J6j41j4j03m35p80q93n45K45J003J175
54573A55040P10L0m69o32n28m54p10j140j185o18J19N80P69O81Q4q28j167m54
$$ plain form
54555 149828 150356 151084 151327 151316 151622 152382 153439 154761 156286 157678 158601 159051 159205 159283 159697 160928 162935
54538 162935 165011 166496 167373 167933 168209 168065 167573 166978 166399 165818 165251 164797 164535 164441 164282 163701 162631 161512
54520 161512 160787 160289 159578 158733 158283 158335 158451 158446 158659 159231 159771 160014 160203 160469 160429 159856 159210 159021 159231 159620
54500 159620 160415 161844 163460 164510 164821 164706 164218 163090 161420 159850 158963 158820 159118 159550 159942 160264 160581
54483 160581 160917 161286 161884 162961 164309 165187 165074 164353 163906 164173 164828 165317 165446 165511 166026 167253 168906 170403
54465 170403 171518 172590 173952 175413 176550 177276 177863 178529 179260 179950 180443 180532 180108 179287 178276 177138 175821
54448 175821 174297 172644 171036 169761 169130 169271 170053 171112 171898 171886 171073 170151 169856 170157 170446 170448 170469 170720
54430 170720 170923 170798 170494 170335 170491 171045 172036 173237 174335 175462 177112 179299 181251 182245 182363 182126 181793
$$ packed form
54555A49828N28P28K43j1L06P60J057J322J525J392R23M50J54P8M14J231K007
54538A62935K076J485Q77N60K76j44m92n95n79n81n67m54k62r4j59n81j070j119
54520A61512p25m98p11q45m50N2J16nK13N72N40K43J89K66m0n73o46j89K10L89
54500A59620P95J429J616J050L11j15m88j128j670j570q87j43K98M32L92L22L17
54483A60581L36L69N98J077J348Q78j13p21m47K67O55M89J29O5N15J227J653J497
54465A70403J115J072J362J461J137P26N87O66P31O90M93Q9m24q21j011j138j317
54448A75821j524j653j608j275o31J41P82J059P86j2q13r22k95L01K89KK1K51
54430A70720K03j25l04j59J56N54R91J201J098J127J650K187J952R94J18k37l33
$$ plain form
54413 181793 181355 180844 180228 179277 177932 176569 175568 174860 174210 173684 173522 173738 174153 174649 175187 175799 176760 178478
54395 178478 180962 183640 185890 187460 188257 188139 187215 186008 185035 184519 184573 185202 185886 185829 184995 184331 184513 185054
54377 185054 185234 185303 185999 187284 188440 189235 190184 191685 193604 195751 198233 201240 204868 209173 214019 218949
54361 218949 223441 227138 229560 230036 228479 225925 223666 221959 220194 218051 215786 213487 210903 208106
54347 208106 205559 203339 200935 198122 195454 193559 192370 191428 190573 189986 189764 189739 189618 189149 188262 187207
54331 187207 186403 186067 186052 186055 185864 185432 184852 184288 183801 183279 182689 182316 182621 183851 185815 187953 189542 190058
54313 190058 189463 188045 186018 183549 181188 179725 179366 179459 179331 179048 179009 179276 179712 180376 181203 181608 181046 179812
54295 179812 178757 178311 178225 178082 177660 176982 176475 176764 177819 178657 178502 177947 178202 179444 180711 181296 181344 181082
$$ packed form
54413A81793m38n11o16r51j345j363j001p08o50n26j62K16M15M96N38O12R61J718
54395A78478K484K678K250J570P97j18r24j207r73n16N4O29O84n7q34o64J82N41
54377A85054J80O9O96J285J156P95R49J501J919K147K482L007L628M305M846M930
54361B18949M492L697K422M76j557k554k259j707j765k143k265k299k584k797
54347B08106k547k220k404k813k668j895j189r42q55n87k22k5j21m69q87j055
54331A87207q04l36j5Lj91m32n80n64m87n22n90l73L05J230J964K138J589N16
54313A90058n95j418k027k469k361j463l59R3j28k83l9K67M36O64Q27M05n62j234
54295A79812j055m46q6j43m22o78n07K89J055Q38j55n55K55J242J267N85M8k62
$$ plain form
54277 181082 180426 179588 179285 179942 181223 182572 183703 184405 184440 183931 183396 183218 183474 184267 185675 187227 188183
54260 188183 188552 189243 190902 193112 195016 196215 196746 196777 196708 197087 197949 198585 198389 197633 197052 196957 197141 197377
54242 197377 197623 197859 197983 197774 196902 195268 193460 192479 192732 193564 194028 193844 193400 193157 193361 194054 195048 195987
54224 195987 196675 197253 197957 198882 199979 200970 201259 200328 198441 196594 195533 195163 195029 194944 194849 194498 193716 192755
54206 192755 192031 191698 191761 192394 193790 195735 197534 198307 197465 195207 192670 191142 190870 190934 190516 189877 189822 190611
54188 190611 191817 192937 193648 193712 193124 192347 192020 192414 193324 194383 195237 195656 195763 196025 196711 197491 197833 197640
54170 197640 197180 196555 195634 194451 193284 192286 191362 190475 189891 189956 190686 191586 191908 191236 189916 188809 188491 188794
54152 188794 189134 189135 188838 188534 188543 188976 189500 189513 188758 187672 186952 186867 187110 187248 187118 186827 186505 186152 185745 185477
$$ packed form
54277A81082o56q38l03O57J281J349J131P02L5n09n35j78K56P93J408J552R56
54260A88183L69O91J659K210J904J199N31L1o9L79Q62O36j96p56n81r5J84K36
54242A97377K46K36J24k09q72j634j808r81K53Q32M64j84m44k43K04O93R94R39
54224A95987O88N78P04R25J097R91K89r31j887j847j061l70j34q5r5l51p82r61
54206A92755p24l33O3O33J396J945J799P73q42k258k537j528k72O4m18o39n5P89
54188A90611J206J120P11O4n88p77l27L94R10J059Q54M19J07K62O86P80L42j93
54170A97640m60o25r21j183j167r98r24q87n84O5P30R00L22o72j320j107l18L03
54152A88794L40Jk97l04RM33N24J3p55j086p20q5K43J38j30k91l22l53m07k68
$$ plain form
54132 185477 185667 186302 186950 187430 188340 190399 193361 196119 197920 198899 199381 199346 198870 198463 198550 199020 199626 200350
54114 200350 201121 201773 202612 204426 207400 210637 213341 215895 219042 222571 225735 228589 231873 235702 239354
54099 239354 242363 244879 246790 247399 246312 243979 241095 238047 235188 232968 231462 230322 229552 229800 231483
54084 231483 234014 236280 237529 237534 236303 234033 231095 227763 224212 220954 218771 217900 217711 217574 217620 218198
54068 218198 219108 219996 221112 222830 224631 225486 225302 225157 225822 226847 227511 227938 228648 229503 229933 229995 230416 231532
54050 231532 232855 233949 235098 236765 238808 240779 242740 245221 248373 251660 254588 257444 261102 266189
54036 266189 272559 279451 286087 292274 298573 305767 314020 322560 330259 336405 340908 344034 346240 348197
54022 348197 350562 353484 356438 358742 360224 361211 361862 361812 360697 358835 356977 355212 352556 347967 341539
$$ packed form
54132A85477J90O35O48M80R10K059K962K758J801R79M82l5m76m07Q7M70O06P24
54114B00350P71O52Q39J814K974L237K704K554L147L529L164K854L284L829L652
54099B39354L009K516J911O09j087k333k884l048k859k220j506j140p70K48J683
54084B31483K531K266J249Nj231k270k938l332l551l258k183q71j89j37M6N78
54068B18198R10Q88J116J718J801Q55j84j45O65J025O64M27P10Q55M30O2M21J116
54050B31532J323J094J149J667K043J971J961K481L152L287K928K856L658N087
54036B66189O370O892O636O187O299P194Q253Q540P699O146M503L126K206J957
54022C48197K365K922K954K304J482R87O51n0j115j862j858j765k656m589o428
$$ plain form
54007 341539 334354 327286 320431 313706 307438 302083 297667 293793 290035 286190 282379 279069 276744 275323
53993 275323 274126 272635 271045 269779 268714 267261 265095 262425 259619 256934 254610 252897 251875 251431
53979 251431 251416 251622 251688 251321 250639 250037 249698 249531 249621 250376 252068 254485 257251 260269 263689 267632 272238
53962 272238 277910 285189 294242 304465 314546 322876 328087 329485 327231 322220 315768 309193 303384 298559
53948 298559 294487 291028 288409 286997 286918 288083 290450 294011 298439 303019 307140 310818 314556 318674 322886
53933 322886 326554 329206 330804 331708 332538 333895 335991 338549 341261 344330 348340 353558 359559 365668 371632
53918 371632 377756 384442 391778 399566 407670 416216 425342 434786 443939 452495 460801 469237 477298 483796
53904 483796 488061 490540 491961 492298 490940 487724 483365 478926 475129 472118 469507 466573 462615 457337
$$ packed form
54007C41539p185p068o855o725o268n355m416l874l758l845l811l310k325j421
53993B75323j197j491j590j266j065j453k166k670k806k685k324j713j022m44
53979B51431j5K06O6l67o82o02l39j67R0P55J692K417K766L018L420L943M606
53962B72238N672P279R053J0223J0081Q330N211J398k254n011o452o575n809m825
53948B98559m072l459k619j412p9J165K367L561M428M580M121L678L738M118M212
53933C22886L668K652J598R04Q30J357K096K558K712L069M010N218O001O109N964
53918C71632O124O686P336P788Q104Q546R126R444R153Q556Q306Q436Q061O498
53904D83796M265K479J421L37j358l216m359m439l797l011k611k934l958n278
$$ plain form
53890 457337 450884 443587 435724 427437 418704 409479 400011 390915 382684 375135 367603 359756 352048 345289
53876 345289 339922 335760 332236 328789 325106 321203 317296 313581 310075 306661 303226 299747 296282 292947
53862 292947 289924 287413 285418 283564 281256 278172 274527 270771 267150 263793 261039 259277 258402 257850 257326
53847 257326 257153 257629 258362 258632 258243 257606 257082 256619 256034 255333 254639 254038 253563 253209 252944 252789 252840 253042 253065
53828 253065 252665 252140 252143 252953 254124 254938 255041 254636 254221 254221 254701 255356 255844 256179 256640 257403 258451 259878 261947
53809 261947 264645 267457 269910 272294 275516 280132 285747 291481 296909 302354 308308 314811 321482 327991
53795 327991 334303 340480 346449 352029 356994 361112 364276 366773 369230 372088 375051 377256 378003 377275 375539
53780 375539 373178 370191 366398 361802 356667 351281 345782 340269 334946 329991 325356 320816 316219 311539
$$ packed form
53890D57337o453p297p863q287q733r225r468r096q231p549p532p847p708o759
53876C45289n367m162l524l447l683l903l907l715l506l414l435l479l465l335
53862B92947l023k511j995j854k308l084l645l756l621l357k754j762q75n52n24
53847B57326j73M76P33K70l89o37n24m63n85p01o94o01m75l54k65j55N1K02K3
53828B53065m00n25LQ10J171Q14J03m05m15%M80O55M88L35M61P63J048J427K069
53809B61947K698K812K453K384L222M616N615N734N428N445N954O503O671O509
53795C27991O312O177N969N580M965M118L164K497K457K858K963K205P47p28j736
53780C75539k361k987l793m596n135n386n499n513n323m955m635m540m597m680
$$ plain form
53766 311539 306777 302010 297513 293546 290033 286719 283703 281470 280229 279479 278467 276857 274767 272380
53752 272380 269877 267566 265677 264036 262180 259820 257043 254147 251557 249878 249591 250504 251679 252190 251969
53737 251969 251786 252365 253636 254923 255753 256242 256686 257070 257264 257476 258077 259028 259920 260661 261713 263447 265671
53720 265671 267971 270211 272331 274010 274954 275408 275980 276952 278070 278979 279668 280497 281938 284280 287461 291149
53704 291149 294978 298566 301428 303270 304457 305815 307800 310231 313016 316541 320996 325773 330126 334033
53690 334033 337784 341047 343090 343878 344222 344708 345048 344611 343106 340630 337512 334291 331510 329382 327887
53675 327887 327152 327311 328031 328646 328847 328777 328392 327317 325609 324076 323417 323357 323116 322585 322560 323750 325768 327292
53657 327292 327260 325899 324546 324402 325587 327419 329246 330710 331580 331923 332362 333573 335393 336884 337413 337305
$$ packed form
53766C11539m762m767m497l967l513l314l016k233j241p50j012j610k090k387
53752B72380k503k311j889j641j856k360k777k896k590j679k87R13J175N11k21
53737B51969j83N79J271J287Q30M89M44L84J94K12O01R51Q92P41J052J734K224
53720B65671K300K240K120J679R44M54N72R72J118R09O89Q29J441K342L181L688
53704B91149L829L588K862J842J187J358J985K431K785L525M455M777M353L907
53690C34033L751L263K043P88L44M86L40m37j505k476l118l221k781k128j495
53675C27887p35J59P20O15K01p0l85j075j708j533o59o0k41n31k5J190K018J524
53657C27292l2j361j353j44J185J832J827J464Q70L43M39J211J820J491N29j08
$$ plain form
53641 337305 337424 338525 340987 344614 348486 351602 353907 356216 358903 361290 362728 363722 365355 367932 370813
53626 370813 373404 375767 378308 381351 385033 389252 393672 398032 402422 407015 411589 415600 418713 421035
53612 421035 422904 424709 426838 429504 432538 435558 438358 440966 443382 445515 447446 449468 451705 453851
53598 453851 455521 456828 458372 460481 462576 463590 463102 461808 460658 459781 458591 456813 454910 453444 452432
53583 452432 451510 450414 449052 447372 445401 443279 441141 439070 437216 435671 434180 432348 430240 428348
53569 428348 426737 424722 421840 418782 416774 416192 416369 416607 416818 417126 417491 417932 418634 419501 420012 419873 419582
53552 419582 419910 421023 422482 424038 425912 428113 429949 430640 430277 429798 430045 431200 433180 436087 440011
53537 440011 444691 449798 455317 461306 467446 473335 479132 485346 491966 498399 504527 511275 519708 529896
$$ packed form
53641C37305J19J101K462L627L872L116K305K309K687K387J438R94J633K577K881
53626C70813K591K363K541L043L682M219M420M360M390M593M574M011L113K322
53612D21035J869J805K129K666L034L020K800K608K416K133J931K022K237K146
53598D53851J670J307J544K109K095J014m88j294j150q77j190j778j903j466j012
53583D52432r22j096j362j680j971k122k138k071j854j545j491j832k108j892
53569D28348j611k015k882l058k008n82J77K38K11L08L65M41P02Q67N11j39k91
53552D19582L28J113J459J556J874K201J836O91l63m79K47J155J980K907L924
53537D40011M680N107N519N989O140N889N797O214O620O433O128O748Q433J0188
$$ plain form
53523 529896 541084 552653 564459 576419 588391 600510 613260 627017 641762 657290 673538
53512 673538 690625 708714 727861 747905 768557 789719 811632 834500 857976 881305 903980
53501 903980 926094 947908 969289 989703 1008713 1026361 1043105 1059485 1075811 1092120 1108317
53490 1108317 1124292 1139932 1155159 1170100 1185206 1201034 1217789 1235077 1252226 1268842 1284965
53479 1284965 1300651 1315635 1329629 1342875 1356002 1369181 1381608 1392076 1399880 1404981 1407543 1407669
53467 1407669 1405547 1401450 1395471 1387483 1377454 1365682 1352717 1339272 1326127 1313765 1301966 1289960
53455 1289960 1277139 1263453 1249052 1233799 1217377 1199836 1181794 1163997 1146668 1129411 1111835
53444 1111835 1094222 1077355 1061691 1047080 1033438 1021263 1011100 1002920 996546 992335 990652 990733 990944
$$ packed form
53523E29896J1188J1569J1806J1960J1972J2119J2750J3757J4745J5528J6248
53512F73538J7087J8089J9147K0044K0652K1162K1913K2868K3476K3329K2675
53501I03980K2114K1814K1381K0414J9010J7648J6744J6380J6326J6309J6197
53490A108317J5975J5640J5227J4941J5106J5828J6755J7288J7149J6616J6123
53479A284965J5686J4984J3994J3246J3127J3179J2427J0468P804N101K562J26
53467A407669k122m097n979p988j0029j1772j2965j3445j3145j2362j1799j2006
53455A289960j2821j3686j4401j5253j6422j7541j8042j7797j7329j7257j7576
53444A111835j7613j6867j5664j4611j3642j2175j0163q180o374m211j683Q1K11
$$ plain form
53431 990944 990451 990043 991064 994022 998496 1003880 1009772 1015980 1022547 1029654 1037431 1046112 1056297 1068556
53417 1068556 1082636 1097683 1113476 1130817 1150317 1171438 1193307 1215923 1239843 1264992 1290659
53406 1290659 1316636 1343629 1372394 1402905 1434606 1467140 1500686 1535780 1572915 1612226 1653531
53395 1653531 1696632 1741440 1787848 1835751 1885220 1936266 1988285 2040169 2091224 2141592 2191492
53384 2191492 2240453 2287723 2333028 2376401 2417611 2456291 2492416 2526031 2556595 2583211 2605486
53373 2605486 2623706 2638104 2648428 2654344 2655851 2653100 2645992 2634026 2616383 2592273 2561505 2524827
53361 2524827 2483656 2439506 2393682 2347158 2300363 2253256 2205912 2158892 2112784 2067647 2023371
53350 2023371 1980460 1939913 1902244 1866963 1833092 1799923 1767205 1734872 1702761 1670603 1638318
$$ packed form
53431I90944m93m08J021K958M474N384N892O208O567P107P777Q681J0185J2259
53417A068556J4080J5047J5793J7341J9500K1121K1869K2616K3920K5149K5667
53406A290659K5977K6993K8765L0511L1701L2534L3546L5094L7135L9311M1305
53395A653531M3101M4808M6408M7903M9469N1046N2019N1884N1055N0368M9900
53384B191492M8961M7270M5305M3373M1210L8680L6125L3615L0564K6616K2275
53373B605486J8220J4398J0324N916J507k751p108j1966j7643k4110l0768l6678
53361B524827m1171m4150m5824m6524m6795m7107m7344m7020m6108m5137m4276
53350B023371m2911m0547l7669l5281l3871l3169l2718l2333l2111l2158l2285
$$ plain form
53339 1638318 1606294 1575228 1545647 1517815 1492114 1469045 1448588 1430006 1412662 1396793 1383108
53328 1383108 1371864 1362551 1354143 1345378 1335287 1323857 1311718 1298803 1284009 1266948 1249386 1233812
53316 1233812 1220825 1208963 1197034 1185486 1175348 1166935 1160087 1154869 1151431 1149608 1149045 1149386 1150173
53303 1150173 1150986 1151923 1153589 1156560 1161253 1168263 1178139 1190664 1204958 1220534 1237721 1256884 1277771
53290 1277771 1299854 1322690 1345749 1368474 1390863 1413343 1435752 1457079 1476608 1494596 1511196
53279 1511196 1525408 1535968 1542931 1547495 1550418 1551392 1549969 1546293 1540572 1532423 1521286 1507350 1491652
53266 1491652 1475080 1457416 1437638 1415333 1391551 1367928 1345048 1322105 1298196 1273409 1248422
53255 1248422 1223500 1198338 1172662 1146662 1120952 1096303 1073222 1051550 1030594 1009834 989303
$$ packed form
53339A638318l2024l1066k9581k7832k5701k3069k0457j8582j7344j5869j3685
53328A383108j1244r313q408q765j0091j1430j2139j2915j4794j7061j7562j5574
53316A233812j2987j1862j1929j1548j0138q413o848n218l438j823n63L41P87
53303A150173Q13R37J666K971M693P010R876J2525J4294J5576J7187J9163K0887
53290A277771K2083K2836K3059K2725K2389K2480K2409K1327J9529J7988J6600
53279A511196J4212J0560O963M564K923R74j423l676n721q149j1137j3936j5698
53266A491652j6572j7664j9778k2305k3782k3623k2880k2943k3909k4787k4987
53255A248422k4922k5162k5676k6000k5710k4649k3081k1672k0956k0760k0531
$$ plain form
53244 989303 969208 949410 929545 909503 889595 870368 852200 834943 817957 800882 784378
53233 784378 769606 756858 745251 734053 723763 715341 708805 703126 697278 690838 683730 675936 667533
53220 667533 658558 648800 637946 625912 612817 598773 584077 569488 555819 543171 530946 518829
53208 518829 507432 497674 489679 482589 475468 468112 460808 453578 446059 438140 430195 422442 414446 405786
53194 405786 396923 388815 381762 375234 368832 362746 357133 351733 346450 341711 337811 334387 330976 327722
53180 327722 325069 323096 321569 320333 319224 317873 316086 314159 312363 310437 308086 305668 303710 301937
53166 301937 299575 296688 294508 294152 295451 297222 298289 298054 296583 294514 292726 291692 291101 290237 288665
53151 288665 286545 284354 282441 280837 279465 278484 278271 278976 280234 281505 282580 283567 284446 284952 284978 284868
$$ packed form
53244I89303k0095j9798j9865k0042j9908j9227j8168j7257j6986j7075j6504
53233G84378j4772j2748j1607j1198j0290q422o536n679n848o440p108p794q403
53220F67533q975r758j0854j2034j3095j4044j4696j4589j3669j2648j2225j2117
53208E18829j1397r758p995p090p121p356p304p230p519p919p945p753p996q660
53194D05786q863q108p053o528o402o086n613n400n283m739l900l424l411l254
53180C27722k653j973j527j236j109j351j787j927j796j926k351k418j958j773
53166C01937k362k887k180l56J299J771J067k35j471k069j788j034n91q64j572
53151B88665k120k191j913j604j372r81k13P05J258J271J075R87Q79N06K6j10
$$ plain form
53135 284868 285112 285771 286364 286400 285980 285740 286153 287045 287904 288502 288993 289574 290398 291696 293575 295699 297666 299741
53117 299741 302656 306436 309972 312196 313264 314161 315450 316875 317940 318305 317734 316145 313838 311357 309057
53102 309057 306938 304825 302605 300408 298676 297776 297404 296672 295083 293101 291480 290335 289279 288109 286843
53087 286843 285312 283293 281018 279061 277754 277108 277179 277972 279024 279592 279417 278935 278736 279149 280302 282059
53071 282059 283777 284584 284152 282945 281632 280492 279473 278468 277339 275953 274393 273025 272241 272197 272769 273570
53055 273570 274086 274047 273673 273321 272983 272426 271804 271717 272544 273991 275483 276769 277982 279252 280392 280951 280569
53038 280569 279366 277969 276977 276456 276055 275560 275154 275165 275737 276708 277681 278289 278539 278819 279430 280253 280975 281475
53020 281475 281837 282250 283051 284467 285996 286533 285622 284240 283675 283951 284109 283848 283919 284873 286399 288176 290440
$$ packed form
53135B84868K44O59N93L6m20k40M13Q92Q59N98M91N81Q24J298J879K124J967K075
53117B99741K915L780L536K224J068Q97J289J425J065L65n71j589k307k481k300
53102C09057k119k113k220k197j732r00l72p32j589j982j621j145j056j170j266
53087B86843j531k019k275j957j307o46P1P93J052N68j75m82j99M13J153J757
53071B82059J718Q07m32j207j313j140j019j005j129j386j560j368p84m4N72Q01
53055B73570N16l9l74l52l38n57o22q7Q27J447J492J286J213J270J140N59l82
53038B80569j203j397r92n21m01m95m06J1N72R71R73O08K50K80O11Q23P22N00
53020B81475L62M13Q01J416J529N37r11j382n65K76J58k61P1R54J526J777K264
$$ plain form
53003 290440 293110 295140 295510 294433 292953 291693 290665 289978 289938 290446 290980 291346 291922 293024 294439 295863
52987 295863 297420 299445 301948 304644 307436 310549 314132 317915 321333 323808 324885 324330 322364 319719
52973 319719 317219 315279 313899 312988 312448 312054 311644 311429 311734 312399 312905 313189 313792 314965 316222 317112 317861
52956 317861 318723 319259 318942 318082 317410 317049 316620 316062 315448 314258 311894 308916 306665 305434 304045 301649
52940 301649 298988 297318 296852 296960 297247 297695 298171 298497 298823 299371 300068 300789 301630 302514 302962 302768 302502 302725
52922 302725 303012 302501 301236 300264 300347 301168 301858 301792 300848 299390 298146 297655 297699 297609 297208 297035 297498 298241 298697
52903 298697 298907 299356 300093 300430 299712 298175 296820 296450 296965 297690 298175 298446 298666 298964 299698 301350 303825
52886 303825 306092 306943 306078 304233 302401 301176 300671 300660 300805 301056 301817 303433 305538 307291 308424 309673
$$ packed form
53003B90440K670K030L70j077j480j260j028o87m0N08N34L66N76J102J415J424
52987B95863J557K025K503K696K792L113L583L783L418K475J077n55j966k645
52973C19719k500j940j380r11n40l94m10k15L05O65N06K84O03J173J257Q90P49
52956C17861Q62N36l17q60o72l61m29n58o14j190k364k978k251j231j389k396
52940C01649k661j670m66J08K87M48M76L26L26N48O97P21Q41Q84M48j94k66K23
52922C02725K87n11j265r72Q3Q21O90o6r44j458j244m91M4r0m01j73M63P43M56
52903B98697K10M49P37L37p18j537j355l70N15P25M85K71K20K98P34J652K475
52886C03825K267Q51q65j845j832j225n05j1J45K51P61J616K105J753J133J249
$$ plain form
52870 309673 311905 315071 318319 321067 323583 326426 329616 332590 334817 336135 336495 335725 333718 330654 326852
52855 326852 322611 318378 314740 311799 308780 304829 300209 296101 293114 290645 287986 285408 283593 282469
52841 282469 281341 279989 278930 278539 278482 278202 277575 276872 276405 276397 276927 277788 278532 278877 279014 279346 279964 280470 280338
52822 280338 279421 278105 276984 276349 276024 275696 275314 275066 275061 275212 275492 276114 277321 278973 280558 281757 282864
52805 282864 284386 286184 287331 287052 285585 283812 282270 280913 279705 278843 278281 277579 276479 275245 274179
52790 274179 273167 272048 271103 270743 270923 271232 271432 271532 271469 271093 270467 269876 269547 269560 269922 270478 270859 270858 270820 271294
52770 271294 272324 273404 274102 274340 274047 273005 271355 269864 269230 269217 268858 267654 266278 265911 266988 268885
52754 268885 270873 273039 275923 279430 282623 284798 286335 288071 290078 291557 291958 291737 291818 292601 293758
$$ packed form
52870C09673K232L166L248K748K516K843L190K974K227J318L60p70k007l064l802
52855C26852m241m233l638k941l019l951m620m108k987k469k659k578j815j124
52841B82469j128j352j059l91n7k80o27p03m67qN30Q61P44L45J37L32O18N06j32
52822B80338r17j316j121o35l25l28l82k48nJ51K80O22J207J652J585J199J107
52805B82864J522J798J147k79j467j773j542j357j208q62n62p02j100j234j066
52790B74179j012j119r45l60J80L09K00J00o3l76o26n91l29J3L62N56L81jl8M74
52770B71294J030J080O98K38k93j042j650j491o34j3l59j204j376l67J077J897
52754B68885J988K166K884L507L193K175J537J736K007J479M01k21Q1P83J157
$$ plain form
52739 293758 294800 295546 296050 296329 296327 296029 295534 295030 294825 295333 296782 298805 300500 301163 300998 300880 301407 302299
52721 302299 302775 302322 301080 299670 298677 298138 297474 296115 294191 292411 291278 290702 290372 290110 289758 289175 288615
52704 288615 288682 289561 290638 291289 291750 292713 294243 295643 296368 296573 296680 296817 296836 296577 295963 295041 294026 293187
52686 293187 292595 292107 291561 290891 290168 289689 289861 290739 291736 292157 291956 291649 291520 291336 290941 290680 290966 291702 292459
52667 292459 293031 293572 294234 294960 295671 296458 297513 298836 300085 300840 301143 301679 303176 305588 308109 310136
52651 310136 311999 314495 317796 321043 323033 323112 321424 318574 315280 312196 309709 307825 306381 305450 305357
52636 305357 306192 307544 308862 309952 310875 311544 311797 311853 312352 313854 316514 320155 324265 327866 329892 329976
52620 329976 328610 326346 323217 319232 315082 311859 310165 309802 310155 310578 310556 310010 309474 309606 310401 311148 311261
$$ packed form
52739B93758J042P46N04K79kk98m95n04k05N08J449K023J695O63j65j18N27Q92
52721C02299M76m53j242j410r93n39o64j359j924j780j133n76l30k62l52n83n60
52704B88615O7Q79J077O51M61R63J530J400P25K05J07J37J9k59o14r22j015q39
52686B93187n92m88n46o70p23m79J72Q78R97M21k01l07j29j84l95k61K86P36P57
52667B92459N72N41O62P26P11P87J055J323J249P55L03N36J497K412K521K027
52651C10136J863K496L301L247J990P9j688k850l294l084k487j884j444r31r3
52636C05357Q35J352J318J090R23O69K53N6M99J502K660L641M110L601K026Q4
52620C29976j366k264l129l985m150l223j694l63L53M23k2n46n36J32P95P47J13
$$ plain form
52603 311261 310959 310975 311663 312514 312606 311607 310298 309871 310667 311803 312207 311745 311156 311122 311738 312749 313921 315135
52585 315135 316378 317729 319240 320842 322408 323811 324883 325512 325864 326299 326925 327465 327668 327570 327210 326500 325607
52568 325607 325065 325118 325299 325072 324532 323992 323272 322086 320874 320450 320875 321406 321615 321866 322438 322876 322575 321590
52550 321590 320478 319604 318934 318324 317741 317286 317113 317276 317678 318252 319068 320043 320733 320767 320413 320304 320635 321018 321083
52531 321083 320804 320264 319611 319354 320164 322176 324813 327405 329623 331300 332320 332909 333571 334539 335615 336727
52515 336727 338191 340196 342484 344842 347536 350876 354622 358179 361189 363610 365396 366392 366449 365392 362968
52500 362968 359025 353777 347840 342059 337184 333440 330411 327622 325221 323746 323217 322945 322422 321887 321752
52485 321752 321833 321589 320834 319872 319120 318898 319445 320823 322833 325183 327606 329698 330938 331174 330965 331183 332271
$$ packed form
52603C11261l02J6O88Q51R2r99j309m27P96J136M04m62n89l4O16J011J172J214
52585C15135J243J351J511J602J566J403J072O29L52M35O26N40K03r8l60p10q93
52568C25607n42N3J81k27n40n40p20j186j212m24M25N31K09K51N72M38l01r85
52550C21590j112q74o70o10n83m55j73J63M02N74Q16R75O90L4l54j09L31L83O5
52531C21083k79n40o53k57Q10K012K637K592K218J677J020N89O62R68J076J112
52515C36727J464K005K288K358K694L340L746L557L010K421J786R96N7j057k424
52500C62968l943n248n937n781m875l744l029k789k401j475n29k72n23n35j35
52485C21752Q1k44p55r62p52k22N47J378K010K350K423K092J240K36k09K18J088
$$ plain form
52468 332271 334037 336084 338311 341001 344504 348810 353467 357970 362059 365494 367778 368505 367811 366082 363318
52453 363318 359353 354632 350036 345855 341615 337182 333298 330616 328828 327253 325758 324552 323509 322380
52439 322380 321404 321082 321471 322134 322683 322953 322834 322354 321854 321723 321994 322396 322616 322384 321652 320901 320881 321718 322730
52420 322730 323479 324497 326407 328853 330953 332479 333857 335341 336937 338965 341844 345414 349191 353320
52406 353320 358526 365136 372888 381711 391830 402822 413303 421869 427790 430576 429601 424748 417048 408183
52392 408183 399489 391564 384469 378034 372242 367502 364304 362547 361622 361204 361456 362282 363089 363701 364942 367663
52376 367663 371521 375294 378233 380614 383109 386242 390473 396174 403152 410348 416273 419874 421154 421057 420625
52361 420625 420111 418980 416860 414260 412120 410841 410143 409776 409919 410721 411789 412505 412742 413014 413866 415305
$$ packed form
52468C32271J766K047K227K690L503M306M657M503M089L435K284P27o94j729k764
52453C63318l965m721m596m181m240m433l884k682j788j575j495j206j043j129
52439C22380r76l22L89O63N49K70j19m80n00j31K71M02K20k32p32p51k0Q37J012
52420C22730P49J018J910K446K100J526J378J484J596K028K879L570L777M129
52406C53320N206O610P752Q823J0119J0992J0481Q566N921K786r75m853p700q865
52392D08183q694p925p095o435n792m740l198j757r25m18K52Q26Q07O12J241K721
52376C67663L858L773K939K381K495L133M231N701O978P196N925L601J280r7m32
52361D20625n14j131k120k600k140j279o98l67J43Q02J068P16K37K72Q52J439
$$ plain form
52345 415305 417018 418961 421439 424531 427775 430691 433415 436480 440137 444352 449401 455881 463861 472552
52331 472552 481160 489736 498798 508487 518699 529812 542555 557042 572526 588320 604474 621247
52319 621247 638336 655079 671099 686390 701027 715336 730211 746671 764998 784771 805806
52308 805806 828493 852913 878138 902939 926977 950813 974892 998953 1022525 1045518 1068148
52297 1068148 1090424 1111829 1131362 1147934 1160875 1170117 1175824 1178081 1177200 1174096 1169871 1164936 1158932
52284 1158932 1151542 1142999 1133736 1123974 1113892 1103858 1094271 1085437 1077771 1071845 1068020 1066195 1065979 1066842
52270 1066842 1068206 1069914 1072756 1077846 1085179 1093386 1101352 1109422 1118487 1128522 1138989 1150318 1163854
52257 1163854 1180231 1198622 1217843 1237471 1257560 1277902 1298054 1317707 1336559 1353935 1368919
$$ packed form
52345D15305J713J943K478L092L244K916K724L065L657M215N049O480P980Q691
52331D72552Q608Q576R062R689J0212J1113J2743J4487J5484J5794J6154J6773
52319F21247J7089J6743J6020J5291J4637J4309J4875J6460J8327J9773K1035
52308H05806K2687K4420K5225K4801K4038K3836K4079K4061K3572K2993K2630
52297A068148K2276K1405J9533J6572J2941R242N707K257q81l104m225m935o004
52284A158932p390q543r263r762j0082j0034r587q834p666n926l825j825k16Q63
52270A066842J364J708K842N090P333Q207P966Q070R065J0035J0467J1329J3536
52257A163854J6377J8391J9221J9628K0089K0342K0152J9653J8852J7376J4984
$$ plain form
52246 1368919 1380867 1389661 1395438 1398203 1397792 1394318 1388581 1381755 1374480 1366528 1357468 1347269 1335961
52233 1335961 1323211 1308901 1293823 1279066 1264747 1250040 1234474 1218543 1202938 1187890 1173495
52222 1173495 1160085 1147881 1136720 1126415 1117004 1108418 1100375 1092949 1086834 1082640 1080175 1078727 1077760
52209 1077760 1077071 1076672 1076952 1078668 1082263 1087199 1092255 1096484 1099726 1102456 1105456 1109443 1114630 1120596 1126793
52194 1126793 1133161 1140151 1148211 1157374 1167152 1176684 1185120 1192041 1197421 1201136 1202746 1201931 1198915 1194192
52180 1194192 1187990 1180198 1170740 1159876 1148302 1137097 1127269 1119065 1111863 1104961 1098406 1092810 1088543
52167 1088543 1085422 1083061 1081269 1080140 1080035 1081505 1084985 1090451 1097313 1104553 1110974 1115666 1118423 1119623
52153 1119623 1119571 1118243 1115846 1113238 1111408 1110739 1111183 1112880 1115996 1120000 1123778 1126710 1129195 1131920 1135006
$$ packed form
52246A368919J1948Q794N777K765m11l474n737o826p275p952r060j0199j1308
52233A335961j2750j4310j5078j4757j4319j4707j5566j5931j5605j5048j4395
52222A173495j3410j2204j1161j0305r411q586q043p426o115m194k465j448r67
52209A077760o89l99K80J716L595M936N056M229L242K730L000L987N187N966O197
52194A126793O368O990Q060R163R778R532Q436O921N380L715J610q15l016m723
52180A194192o202p792r458j0864j1574j1205r828q204p202o902o555n596m267
52167A088543l121k361j792j129j05J470L480N466O862P240O421M692K757J200
52153A119623n2j328k397k608j830o69M44J697L116M004L778K932K485K725L086
$$ plain form
52138 1135006 1138120 1141001 1143440 1145023 1145479 1145298 1145557 1147054 1149942 1154372 1161089 1171052 1184598 1201317
52124 1201317 1220662 1242319 1265929 1290879 1316685 1343322 1370863 1398936 1426896 1454462 1481719
52113 1481719 1508427 1533756 1557098 1578868 1600098 1621213 1641540 1660142 1676899 1692617 1708188
52102 1708188 1723893 1739514 1754786 1769482 1783241 1795597 1806242 1814926 1821011 1823417 1821181 1813913
52090 1813913 1801687 1784922 1764639 1742381 1719364 1695902 1672085 1648768 1627197 1607777 1589874
52079 1589874 1572900 1556910 1541991 1527818 1514333 1502355 1492955 1486467 1482521 1480754 1481046 1483259 1487287
52066 1487287 1493337 1501784 1512577 1525065 1538545 1552890 1568557 1585929 1604714 1624176 1644044 1664840
52054 1664840 1686903 1709226 1729850 1747421 1761806 1773174 1781215 1785612 1786612 1784586 1779489 1771268
$$ packed form
52138A135006L114K881K439J583M56j81K59J497K888M430O717R963J3546J6719
52124A201317J9345K1657K3610K4950K5806K6637K7541K8073K7960K7566K7257
52113A481719K6708K5329K3342K1770K1230K1115K0327J8602J6757J5718J5571
52102A708188J5705J5621J5272J4696J3759J2356J0645Q684O085K406k236p268
52090A813913j2226j6765k0283k2258k3017k3462k3817k3317k1571j9420j7903
52079A589874j6974j5990j4919j4173j3485j1978r400o488l946j767K92K213M028
52066A487287O050Q447J0793J2488J3480J4345J5667J7372J8785J9462J9868K0796
52054A664840K2063K2323K0624J7571J4385J1368Q041M397J000k026n097q221
$$ plain form
52042 1771268 1760411 1747536 1732747 1716007 1697866 1679216 1660461 1641551 1622694 1604352 1586553
52031 1586553 1568850 1551115 1533800 1517171 1500693 1483415 1464774 1444955 1424711 1404895 1385879
52020 1385879 1367368 1348996 1331108 1314610 1299961 1286632 1273725 1260934 1248730 1237697 1227776
52009 1227776 1218184 1208096 1197324 1186093 1174132 1160454 1144402 1126522 1107905 1088894 1069038
51998 1069038 1048316 1027800 1008958 992685 979038 967477 957184 947434 937815 927905 916863 903768
51986 903768 888421 871430 853522 835166 816879 799282 782543 766126 749358 732044 714492
51975 714492 697311 681286 667070 654834 644584 636880 632658 632083 634134 637770 643040 650544 660132
51962 660132 670681 680968 690239 698036 703965 707637 708531 706046 700078 691477 681571 671346 661464 652919
$$ packed form
52042A771268j0857j2875j4789j6740j8141j8650j8755j8910j8857j8342j7799
52031A586553j7703j7735j7315j6629j6478j7278j8641j9819k0244j9816j9016
52020A385879j8511j8372j7888j6498j4649j3329j2907j2791j2204j1033r921
52009A227776r592j0088j0772j1231j1961j3678j6052j7880j8617j9011j9856
51998A069038k0722k0516j8842j6273j3647j1561j0293r750r619r910j1042j3095
51986I03768j5347j6991j7908j8356j8287j7597j6739j6417j6768j7314j7552
51975G14492j7181j6025j4216j2236j0250p704m222n75K051L636N270P504R588
51962F60132J0549J0287R271P797N929L672Q94k485n968q601r906j0225r882q545
$$ plain form
51948 652919 646983 644276 644364 646522 650589 656770 665015 675122 687405 702737 721612 743348 766454
51935 766454 789808 813253 837003 860676 883023 902339 916814 924620 924240 915104 897815 873670
51923 873670 844185 811196 776976 743645 712360 683282 656334 631830 610383 592475 578146
51912 578146 566928 558037 550837 545269 541715 540442 541255 543729 547598 552864 559587 567594 576358 585105
51898 585105 592995 599093 602160 600858 594544 583935 570684 556289 541596 527272 514245 503332
51886 503332 494614 487507 481485 476598 473399 472493 474069 477741 482898 489357 497592 508124 520772 534563
51872 534563 548239 560586 570493 577151 580419 580829 579200 576298 572735 568783 564308 559250 554303 550692
51858 550692 549085 549137 550333 552778 556636 561227 565394 568631 571131 572721 572473 569671 564562 557795 549605
$$ packed form
51948F52919n936k707Q8K158M067O181Q245J0107J2283J5332J8875K1736K3106
51935G66454K3354K3445K3750K3673K2347J9316J4475P806l80r136j7289k4145
51923H73670k9485l2989l4220l3331l1285k9078k6948k4504k1447j7908j4329
51912E78146j1218q891p200n568l554j273Q13K474L869N266O723Q007Q764Q747
51898E85105P890O098L067j302o314j0609j3251j4395j4693j4324j3027j0913
51886E03332q718p107o022m887l199r06J576L672N157O459Q235J0532J2648J3791
51872E34563J3676J2347R907O658L268M10j629k902l563l952m475n058m947l611
51858E50692j607N2J196K445L858M591M167L237K500J590k48k802n109o767q190
$$ plain form
51843 549605 540035 529646 519409 509955 501267 493087 485375 478406 472675 468685 466576 465942 466162 466965
51829 466965 468572 471300 475003 478812 481455 482050 480720 478305 475543 472724 470063 467867 466179 464723
51815 464723 463516 463038 463415 463891 463728 463276 463413 464113 464412 463810 462960 462684 462944 463131 462885 462271 461527 461031
51797 461031 461235 462271 463790 465436 467205 469030 470261 470037 468202 465543 463119 461505 460662 460242 459955
51782 459955 459761 459882 460598 462012 463931 465990 467952 470010 472672 476240 480504 485186 490586 497411 505917
51767 505917 515595 525821 536322 546699 555866 562544 566252 567390 566336 562902 556796 548236 537862
51754 537862 526319 514281 502698 492526 483958 476199 468320 460297 453018 447314 443276 440589 439184
51741 439184 439245 440716 443169 446175 449658 453813 458842 464789 471502 478654 485819 492444 497749 500923 501701
$$ packed form
51843E49605r570j0389j0237r454q688q180p712o969n731l990k109o34K20Q03
51829D66965J607K728L703L809K643N95j330k415k762k819k661k196j688j456
51815D64723j207m78L77M76j63m52J37P00K99o02q50k76K60J87k46o14p44m96
51797D61031K04J036J519J646J769J825J231k24j835k659k424j614q43m20k87
51782D59955j94J21P16J414J919K059J962K058K662L568M264M682N400O825Q506
51767E05917R678J0226J0501J0377R167O678L708J138j054l434o106q560j0374
51754E37862j1543j2038j1583j0172q568p759p879q023p279n704m038k687j405
51741D39184O1J471K453L006L483M155N029N947O713P152P165O625N305L174P78
$$ plain form
51726 501701 500734 499228 498307 498761 501055 505014 509534 513059 514496 513577 510513 505827 500544 495964 492915
51711 492915 491429 491103 491288 490878 488695 484658 480180 476892 475303 475153 476538 479737 484005 487504 488849
51696 488849 488205 486539 484365 481751 479153 477483 477248 478114 479467 481032 482656 483739 483342 480936 476874
51681 476874 472068 467363 463323 460343 458629 458019 458054 458403 459133 460484 462405 464494 466395 468220 470582
51666 470582 474289 480044 488316 499154 511828 524674 535559 542751 545505 544065 539366 532679 525154
51653 525154 517577 510702 505730 503939 505662 510102 516406 524291 533001 540234 543167 540689 534002 525037
51639 525037 515025 504730 495127 487153 481157 477022 474513 473126 471961 470252 467931 465406 462957 460677
51625 460677 458791 457611 457187 457144 456843 455584 452935 449122 444967 441215 438007 435094 432347 429775 427297
$$ packed form
51726E01701r67j506r21M54K294L959M520L525J437r19l064m686n283m580l049
51711D92915j486l26J85m10k183m037m478l288j589j50J385L199M268L499J345
51696D88849o44j666k174k614k598j670k35Q66J353J565J624J083l97k406m062
51681D76874m806m705m040k980j714o10L5L49P30J351J921K089J901J825K362
51666D70582L707N755Q272J0838J2674J2846J0885P192K754j440m699o687p525
51653E25154p577o875m972j791J723M440O304P885Q710P233K933k478o687q965
51639E25037j0012j0295r603p974n996m135k509j387j165j709k321k525k449k280
51625D60677j886j180m24m3l01j259k649l813m155l752l208k913k747k572k478
$$ plain form
51610 427297 424820 422479 420499 418831 417150 415232 413243 411685 411133 411926 414068 417442 422073 427997 434957
51595 434957 442646 451367 462062 475336 490516 505686 518419 526496 528624 525071 517565 508287 498921
51582 498921 490549 483944 479525 477295 477282 479930 485820 495043 507021 520793 535395 550324 565913
51569 565913 583019 602049 622494 643531 664682 685607 705811 725179 744612 765664 789644
51558 789644 817401 849530 886022 925630 965946 1004107 1037239 1062733 1078880 1085272 1082175 1069605
51546 1069605 1047600 1017330 981274 942152 901997 862126 823437 786659 752797 723353 699573
51535 699573 681373 667450 656455 647563 639907 632218 623406 613124 601573 589212 576797 565154
51523 565154 554570 544759 535640 527663 521072 515291 509459 503271 496951 490701 484577 478699 473227 468261
$$ packed form
51610D27297k477k341j980j668j681j918j989j558n52P93K142L374M631N924O960
51595D34957P689Q721J0695J3274J5180J5170J2733Q077K128l553p506r278r366
51582D98921q372o605m419k230j3K648N890R223J1978J3772J4602J4929J5589
51569E65913J7106J9030K0445K1037K1151K0925K0204J9368J9433K1052K3980
51558G89644K7757L2129L6492L9608M0316L8161L3132K5494J6147O392l097j2570
51546A069605k2005l0270l6056l9122m0155l9871l8689l6778l3862k9444k3780
51535F99573j8200j3923j0995q892p656p689q812j0282j1551j2361j2415j1643
51523E65154j0584r811r119p977o591n781n832o188o320o250o124n878n472m966
$$ plain form
51509 468261 463951 460487 457713 454988 451766 448162 444656 441412 438274 435317 433059 431990 432132 433103 434490
51494 434490 436143 438189 440735 443454 445594 446582 446682 446929 448253 450556 452671 453385 452584 451228 450109
51479 450109 448871 446602 443227 439847 437634 436810 436801 436968 436812 435778 433327 429368 424483 419605 415348 411561
51463 411561 407634 403360 399425 396796 395727 395595 395598 395323 394702 393924 393532 394187 396085 398701 401295 403585
51447 403585 405956 409183 413902 420161 427614 436392 447504 461805 478600 495771 511308 524174 533826
51434 533826 539965 543278 545634 548631 552044 554118 553223 548858 541432 531700 520538 508883 497702 487912
51420 487912 480013 473657 467908 462155 456545 451448 447006 443500 441560 441389 442112 442554 442531 442827 443958 445545
51404 445545 446924 447842 448417 448923 449872 452008 455838 461178 467277 473442 479584 486141 493397 500982 508309
$$ packed form
51509D68261m310l464k774k725l222l604l506l244l138k957k258j069J42R71J387
51494D34490J653K046K546K719K140R88J00K47J324K303K115P14q01j356j119
51479D50109j238k269l375l380k213q24rJ67j56j034k451l959m885m878m257l787
51463D11561l927m274l935k629j069j32Lk75o21p78l92O55J898K616K594K290
51447D03585K371L227M719O259P453Q778J1112J4301J6795J7171J5537J2866R652
51434E33826O139L313K356K997L413K074q95m365p426r732j1162j1655j1181r790
51420D87912p899o356n749n753n610n097m442l506j940j71P23M42k3K96J131J587
51404D45545J379R18N75N06R49K136L830N340O099O165O142O557P256P585P327
$$ plain form
51389 508309 515584 524018 534820 548289 564166 582532 603947 628916 657754 690896 728893 771923
51377 771923 819578 871219 926461 985185 1046845 1109301 1168123 1217523 1252744 1271856 1275432 1264986
51365 1264986 1242039 1208220 1165425 1115676 1061046 1003607 945141 887019 830639 777671 729394
51354 729394 686014 647220 613206 584443 560493 539978 521969 506652 494234 483886 474456 465796
51342 465796 458631 453251 448927 444756 440599 437002 434495 433175 432751 432811 433118 433864 435509 438145 440912
51327 440912 442393 441812 439729 437315 435140 433007 430710 428294 425541 422015 418032 414909 413659 413823 414218
51312 414218 414491 415264 417045 419742 423122 426915 430342 432262 432083 430204 427545 425046 423486 423059 422979 422100
51296 422100 420058 417361 414416 411251 408265 406327 405683 405591 405534 406014 407518 409444 410981 412526 415230 419327
$$ packed form
51389E08309P275Q434J0802J3469J5877J8366K1415K4969K8838L3142L7997M3030
51377G71923M7655N1641N5242N8724O1660O2456N8822M9400L5221J9112L576j0446
51365A264986k2947l3819m2795m9749n4630n7439n8466n8122n6380n2968m8277
51354G29394m3380l8794l4014k8763k3950k0515j8009j5317j2418j0348r430q660
51342D65796p165n380m324m171m157l597k507j320m24O0L07P46J645K636K767
51327D40912J481n81k083k414k175k133k297k416k753l526l983l123j250J64L95
51312D14218K73P73J781K697L380L793L427J920j79j879k659k499j560m27q0q79
51296D22100k042k697k945l165k986j938o44r2n7M80J504J926J537J545K704M097
$$ plain form
51280 419327 423940 428568 433867 440645 448640 456538 462843 466653 468101 468274 468354 468697 468995 469242 469956 471312
51264 471312 472694 473594 474547 476511 479355 481477 481139 477989 473176 468185 463765 459829 456051 452303 448587
51249 448587 444821 440859 436643 432224 427728 423475 420066 418087 417587 417919 418225 418063 417540 416945 416414 416003
51233 416003 415952 416637 418172 420165 422021 423428 424468 425296 425907 426214 426168 425710 424768 423378 421737 420152 418974
51216 418974 418582 419207 420717 422708 424817 426756 428113 428513 428165 427941 428688 430617 433479 436995 440845 444573
51200 444573 447947 451261 454860 458418 461114 462558 463235 463948 465046 466215 466797 466309 464882 463173 461623
51185 461623 459942 457620 454820 452250 450245 448551 447086 446249 446205 446487 446779 447560 449365 451773 453799 455084
51169 455084 455995 456672 456751 456127 455278 454548 453692 452536 451642 451816 453236 455384 457628 459460 460396 460155 459052
$$ packed form
51280D19327M613M628N299O778P995P898O305L810J448J73Q0L43K98K47P14J356
51264D71312J382R00R53J964K844K122l38l150m813m991m420l936l778l748l716
51249D48587l766l962m216m419m496m253l409j979n00L32L06j62n23n95n31m11
51233D16003n1O85J535J993J856J407J040Q28O11L07m6m58r42j390j641j585j178
51216D18974l92O25J510J991K109J939J357M00l48k24P47J929K862L516L850L728
51200D44573L374L314L599L558K696J444O77P13J098J169N82m88j427j709j550
51185D61623j681k322k800k570k005j694j465q37m4K82K92P81J805K408K026J285
51169D55084R11O77P9o24q49p30q56j156q94J74J420K148K244J832R36k41j103
$$ plain form
51152 459052 457873 457234 457101 456869 455805 453632 450895 448624 447360 446587 445359 443389 441250 439597 438528
51137 438528 437741 437047 436683 437237 439135 442013 444746 446455 447347 448241 449469 450756 452049 453733 455932 458246
51121 458246 460395 462526 464592 466074 466778 467342 468457 470067 471859 474055 477023 480468 483738 486675 489423
51106 489423 491613 492680 492964 493638 495359 497745 500342 503284 506582 509573 511664 513150 514700 516379 517639
51091 517639 518033 517483 516176 514654 513696 513571 513586 512870 511509 510415 510185 510629 511385 512346 513359 514033 514191
51074 514191 514119 514119 514145 514213 514894 516964 520606 525257 530242 535295 540567 546505 553844 563398 575664 590765
51058 590765 608851 630230 654644 680451 704854 725188 740112 749921 756192 761206 767103 774933
51046 774933 784216 793453 801116 806368 809201 810009 808790 804699 796710 785023 771598 759141 749707 744223
$$ packed form
51152D59052j179o39j33k32j064k173k737k271j264p73j228j970k139j653j069
51137D38528p87o94l64N54J898K878K733J709Q92Q94J228J287J293J684K199K314
51121D58246K149K131K066J482P04N64J115J610J792K196K968L445L270K937K748
51106D89423K190J067K84O74J721K386K597K942L298K991K091J486J550J679J260
51091E17639L94n50j307j522r58j25J5p16j361j094k30M44P56R61J013O74J58
51074E14191p2%K6O8O81K070L642M651M985N053N272N938P339R554J2266J5101
51058E90765J8086K1379K4414K5807K4403K0334J4924R809O271N014N897P830
51046G74933R283R237P663N252K833Q08j219m091p989j1687j3425j2457r434n484
$$ plain form
51032 744223 742460 742648 741448 735467 723402 706664 688022 670019 654362 641869 632445 625499 620732
51019 620732 618319 618290 620232 623830 629340 637169 647264 659099 671940 684917 697256 708765 719874
51006 719874 730903 741570 751345 759937 767080 772305 775333 776471 776201 774668 771920 768336 764312 759786
50992 759786 754683 749696 746047 744454 744786 746696 750114 755118 761857 770777 782480 797186 814592 834376
50978 834376 856560 881235 908155 936570 965247 992816 1018669 1043801 1070411 1100485 1134927
$$ packed form
51032G44223j763J88j200n981j2065j6738j8642j8003j5657j2493r424o946m767
51019F20732k413k9J942L598N510P829J0095J1835J2841J2977J2339J1509J1109
51006G19874J1029J0667R775Q592P143N225L028J138k70j533k748l584m024m526
50992G59786n103m987l649j593L32J910L418N004O739Q920J1703J4706J7406J9784
50978H34376K2184K4675K6920K8415K8677K7569K5853K5132K6610L0074L4442
$$ [...]
##END NTUPLES=NMR SPECTRUM
##END=
