##TITLE=AC1663_CTIAH14354_8570663_Yji3kNUmoW
##JCAMPDX= 6.0         $$ Bruker NMR JCAMP-DX V2.0
##DATA TYPE= NMR SPECTRUM
##DATA CLASS= NTUPLES
##ORIGIN= BRUKER
##OWNER= Administrator
$$ 1.72 TOPSPIN		Version 2.1
$$ 2014-04-11 16:47:16.426 -0700  Administrator@X
$$ Compression mode = diff/dup
##.OBSERVE FREQUENCY= 400.02188249412
##.OBSERVE NUCLEUS= ^1H
##.ACQUISITION MODE= SIMULTANEOUS (DQD)
##.ACQUISITION SCHEME= undefined
##.AVERAGES= 8
##.DIGITISER RES= 22
##SPECTROMETER/DATA SYSTEM= spect
##.PULSE SEQUENCE= zg30
##.SOLVENT NAME= COFFEE_meoh
##.SHIFT REFERENCE= INTERNAL, COFFEE_meoh, 1, 14.98509
##AUDIT TRAIL= $$ (NUMBER, WHEN, WHO, WHERE, PROCESS, VERSION, WHAT)
$$ ##TITLE= Audit trail, TOPSPIN		Version 2.1
$$ ##JCAMPDX= 5.01
$$ ##ORIGIN= Bruker BioSpin GmbH
$$ ##OWNER= Administrator
$$ $$ E:\/data/COFFEE/nmr/AC1663_CTIAH14354_8570663_Yji3kNUmoW/10/pdata/1/auditp.txt
$$ ##AUDIT TRAIL=  $$ (NUMBER, WHEN, WHO, WHERE, PROCESS, VERSION, WHAT)
(   1,<2014-04-11 16:47:07.797 -0700>,<Administrator>,<X>,<go>,<TOPSPIN 2.1>,
      <created by zg
	started at 2014-04-11 16:46:01.087 -0700,
	POWCHK enabled, PULCHK disabled,
       configuration hash MD5:
       C8 4E 4E 5D D3 5C D8 9E 9F 52 82 E0 59 8A DE 15
       data hash MD5: 64K
       FD C1 C9 B5 8A 39 C0 93 58 82 9C 9B AF C5 CB 89>)
(   2,<2014-04-11 16:47:12.292 -0700>,<Administrator>,<X>,<proc1d>,<TOPSPIN 2.1>,
      <Start of raw data processing
       efp LB = 0 FT_mod = 6 PKNL = 1 PHC0 = 0 PHC1 = 0 SI = 32K 
       data hash MD5: 32K
       DA 12 58 5B 23 6B 85 F4 02 FC BF 3F 38 8B 77 CC>)
(   3,<2014-04-11 16:47:12.590 -0700>,<Administrator>,<X>,<proc1d>,<TOPSPIN 2.1>,
      <pk PHC0 = 92.04346 PHC1 = 0 
       data hash MD5: 32K
       2A E5 75 F1 03 35 4E AB 7E 4D 48 A7 58 2C 97 28>)
(   4,<2014-04-11 16:47:12.698 -0700>,<Administrator>,<X>,<proc1d>,<TOPSPIN 2.1>,
      <abs ABSG = 1 
       data hash MD5: 32K
       4B E4 56 52 B4 A9 60 C8 C8 70 16 39 74 57 93 6B>)
(   5,<2014-04-11 16:47:12.752 -0700>,<Administrator>,<X>,<proc1d>,<TOPSPIN 2.1>,
      <abs ABSG = 2 
       data hash MD5: 32K
       74 50 B2 8E E3 C7 45 C0 ED 68 48 85 EC EC 90 E7>)
(   6,<2014-04-11 16:47:12.873 -0700>,<Administrator>,<X>,<proc1d>,<TOPSPIN 2.1>,
      <abs ABSG = 3 
       data hash MD5: 32K
       56 A7 23 A8 82 61 85 DF A6 3F CE C3 72 BA 03 EE>)
(   7,<2014-04-11 16:47:12.941 -0700>,<Administrator>,<X>,<proc1d>,<TOPSPIN 2.1>,
      <abs ABSG = 4 
       data hash MD5: 32K
       B9 1D DB 2D 71 1A 0A 26 81 E2 CB CD C5 9E 61 E8>)
(   8,<2014-04-11 16:47:13.008 -0700>,<Administrator>,<X>,<proc1d>,<TOPSPIN 2.1>,
      <abs ABSG = 5 
       data hash MD5: 32K
       0C CF 9C D0 B6 02 39 90 AB 7B 79 96 43 FB 24 32>)
$$ ##END=
$$ 
$$ $$ hash MD5
$$ $$ 7C 76 9C C9 78 33 ED 24 74 77 04 68 DC 11 99 EE
##$RELAX= 
##$RELAX= 
##$RELAX= 
##$RELAX= 
##$RELAX= 
##$RELAX= 
##$RELAX= 
$$ Bruker specific parameters
$$ --------------------------
##$DU= <E:\>
##$EXPNO= 10
##$NAME= <AC1663_CTIAH14354_8570663_Yji3kNUmoW>
$$ [...]
150 150 150 150 150 150 150 150
##$TP07= 0
##$TPNAME0= <>
##$TPNAME1= <>
##$TPNAME2= <>
##$TPNAME3= <>
##$TPNAME4= <>
##$TPNAME5= <>
##$TPNAME6= <>
##$TPNAME7= <>
##$TPOAL= (0..7)
0.5 0.5 0.5 0.5 0.5 0.5 0.5 0.5
##$TPOFFS= (0..7)
0 0 0 0 0 0 0 0
##$TUNHIN= 0
##$TUNHOUT= 0
##$TUNXOUT= 0
##$USERA1= <user>
##$USERA2= <user>
##$USERA3= <user>
##$USERA4= <user>
##$USERA5= <user>
##$V9= 5
##$VALIST= <valist>
##$VCLIST= <CCCCCCCCCCCCCCC>
##$VD= 0
##$VDLIST= <DDDDDDDDDDDDDDD>
##$VPLIST= <PPPPPPPPPPPPPPP>
##$VTLIST= <TTTTTTTTTTTTTTT>
##$WBST= 1024
##$WBSW= 4
##$XGAIN= (0..3)
0 0 0 0
##$XL= 0
##$YL= 0
##$YMAX_a= 632568
##$YMIN_a= -539006
##$ZGOPTNS= <>
##$ZL1= 120
##$ZL2= 120
##$ZL3= 120
##$ZL4= 120
##$ABSF1= 14.98509
##$ABSF2= -5.573092
##$ABSG= 5
##$ABSL= 3
##$ALPHA= 0
##$AQORDER= 0
##$ASSFAC= 0
##$ASSFACI= 0
##$ASSFACX= 0
##$ASSWID= 0
##$AUNMP= <proc_prof1d_extract_pilot.lims>
##$AXLEFT= 0
##$AXNAME= <>
##$AXNUC= <1H>
##$AXRIGHT= 0
##$AXTYPE= 0
##$AXUNIT= <>
##$AZFE= 0.1
##$AZFW= 0.1
##$BCFW= 0
##$BC_mod= 0
##$BYTORDP= 0
##$COROFFS= 0
##$CY= 15
##$DATMOD= 1
##$DC= 0
##$DFILT= <>
##$DTYPP= 0
##$F1P= 0
##$F2P= 0
##$FCOR= 0.5
##$FTSIZE= 32768
##$FT_mod= 6
##$GAMMA= 0
##$GB= 0
##$INTBC= 1
##$INTSCL= 1
##$ISEN= 128
##$LB= 0
##$LEV0= 0
##$LPBIN= 0
##$MAXI= 10000
##$MC2= 0
##$MEAN= 0
##$ME_mod= 0
##$MI= 0
##$NCOEF= 0
##$NC_proc= -8
##$NLEV= 6
##$NOISF1= 0
##$NOISF2= 0
##$NSP= 0
##$NTH_PI= 0
##$NZP= 0
##$OFFSET= 14.98509
##$PC= 1
##$PHC0= 92.04346
##$PHC1= 0
##$PH_mod= 1
##$PKNL= yes
##$PPARMOD= 0
##$PPDIAG= 0
##$PPIPTYP= 0
##$PPMPNUM= 2147483647
##$PPRESOL= 1
##$PSCAL= 4
##$PSIGN= 0
##$PYNMP= <proc.py>
##$REVERSE= no
##$SF= 400.02
##$SI= 32768
##$SIGF1= 0
##$SIGF2= 0
##$SINO= 400
##$SIOLD= 32768
##$SPECTYP= <>
##$SREGLST= <1H.CDCl3>
##$SSB= 0
##$STSI= 32768
##$STSR= 0
##$SW_p= 8223.68421052631
##$SYMM= 0
##$S_DEV= 0
##$TDeff= 65536
##$TDoff= 0
##$TI= <>
##$TILT= no
##$TM1= 0
##$TM2= 0
##$TOPLEV= 0
##$USERP1= <user>
##$USERP2= <user>
##$USERP3= <user>
##$USERP4= <user>
##$USERP5= <user>
##$WDW= 1
##$XDIM= 32768
##$YMAX_p= 463584883
##$YMIN_p= -770390
##$CURPLOT= <Network HP LaserJet P1505>
##$CURPRIN= <$Network HP LaserJet P1505>
##$DFORMAT= <normdp>
##$LAYOUT= <+/1D_H.xwp>
##$LFORMAT= <normlp>
##$PFORMAT= <normpl>
##$SURQMSG= 1
$$ End of Bruker specific parameters
$$ ---------------------------------
##NTUPLES= NMR SPECTRUM
##VAR_NAME=  FREQUENCY,     SPECTRUM/REAL,   SPECTRUM/IMAG
##SYMBOL=    X,             R,               I
##VAR_TYPE=  INDEPENDENT,   DEPENDENT,       DEPENDENT
##VAR_FORM=  AFFN,          ASDF,            ASDF
##VAR_DIM=   32768,         32768,           32768
##UNITS=     HZ,            ARBITRARY UNITS, ARBITRARY UNITS
##FACTOR=    0.250966925370066, 1,           1
##FIRST=     8223.43324360094, -36895,       -222925
##LAST=      0,             -81969,          120293
##MIN=       0,             -770390,         0
##MAX=       8223.43324360094, 463584883,    0
$$ Real data points
##PAGE= N=1
##DATA TABLE= (X++(R..R)), XYDATA
$$ [...]
19540a06108J1787m05783A53556b17178C26419A34337o1819J89898I6497a00057
19529A21870a435j34193m1801q5656p1393A9371a2633r7917p2738O9835l11561
19518d25014h6326C7329i1382I6101a46623F6498K2640N4529m5563l3748i5010
19506b0166j22090e768B59910C3807J31000k9382F2805c89242M6874G3774j1539
19495F2235J65397a10733M4296m1186n859K2306j53549E0571N0670b10757Q0402
19484a30355E3219b36099q3168A21269b20376f1033c173k29976a0369j43612B07436
19472a73772B38668l0429c0730H3889c13549d7831q7529p3811L0744P6909p639
19461a09157d7956j1015r0515a177j93232l3800i5645L7764j75383a7749F1587
$$ y = [-106108, -94321, -500104, 153556, -217178, 326419, 134337, 72518, 262416, 96497, -100057, 121870, -1435, -135628, -177429, -263085, -334478, 19371, -12633, -110550, -183288, -113453, -425014, -86326, 37329, -91382, 96101, -146623, 66498, 89138, 143667, 98104, 64356, -95010, -20166, -142256, -5768, 259910, 33807, 164807, 135425, 62805, -389242, -342368, 73774, 62235, 227632, -110733, -66437, -107623, -113482, -91176, -244725, 50571, 101241, -210757, -130355, 53219, -236099, -319267, 121269, -220376, -61033, -3173, -233149, -10369, -153981, 207436, -173772, 238668, 208239, -30730, 83889, -313549, -47831, -135360, -209171, -178427, -101518, -109157, -47956, -58971, -149486, -1177, -194409, -228209, -95645, -57881, -233264, -17749, 61587]
19449b63300F0678K2717Q366e34999a55591p3897J07199p3879j74142J34038f7520
19437a72372A1134L58a93823C5176a67919b7276B29446B9738c18519A07538J18873
19426B26411a00955l984k59152a81501A20588j3139C6399a88901Q592A60256a18693
19414d9619j14468L0907g464j932A02872B7813a71868B5362d37250d0365k36307
19403b76672A86879a5282E0238c91912a47077l13014K21854K0185o6937e9819
19392A27366b86062a39642q428K7748A4334c82794a82841G9553A0381J04730a72459
19380I3119h04A16435J29249c8707H2518a99149m3503h4846E8950O8304b75959
19368a08058k4517b0697F405a39164K3621p0397R0059A11686Q343c00325f5403
$$ y = [-263300, 60678, 83395, 91761, -534999, -155591, -229488, -122289, -196168, -370310, -236272, -67520, -172372, 11134, 11492, -193823, 35176, -167919, -27276, 229446, 29738, -318519, 107538, 226411, -100955, -104939, -364091, -181501, 120588, 107449, 36399, -188901, -180309, 160256, -118693, -49619, -164087, -133180, -7464, -9396, 102872, 27813, -171868, 25362, -437250, -40365, -276672, 186879, -15282, 50238, -391912, -147077, -460091, -238237, -218052, -284989, -59819, 127366, -286062, -139642, -148070, -120322, 14334, -382794, -182841, 79553, 10381, 115111, -172459, 93119, -804, 116435, 245684, -38707, 82518, -199149, -242652, -84846, 58950, 127254, -275959, -108058, -132575, -20697, 6405, -139164, -115543, -185940, -95881, 111686, 120029, -300325, -65403]
19356b09446M0736k19623J06925j85588q3968d7510j02834A6139d57989C1098
19345A0275b53629K2096p9174M6719a8122j91774D5560K89403i9003c8070D8493
19333c00318f2135j70533C7071J05445c12257a13465A1067a81794Q7694f200o1581
19322f7781j20081A22218g8406D6443L7703d880I6281j4063b45776c0672j00624
19311a31296j09211Q5672F4093a68604A05543e7129K2032j07793f0673E8275O779
19300F5054J46755o1864a62283K9953l0426A1252K68988a74104B56993a03812
19289i3663k67391J36586B78850I0009a78454A15165h44m21660J81987F8135E721
19277a49672B58296h9898a5082o2375Q857H9731D3507M4875d0770j07251A04031
$$ y = [-209446, -168710, -388333, -281408, -466996, -550964, -47510, -150344, 16139, -457989, 31098, 10275, -253629, -231533, -310707, -263988, -18122, -209896, 45560, 334963, -99003, -38070, 48493, -300318, -62135, -232668, 37071, 142516, -312257, -113465, 11067, -181794, -94100, -6200, -67781, -187862, 122218, -78406, 46443, 84146, -4880, 96281, 82218, -245776, -30672, -131296, -240507, -154835, 64093, -168604, 105543, -57129, -35097, -142890, -60673, 58275, 65054, 211809, 149945, -162283, -132330, -162756, 11252, 280240, -174104, 256993, -103812, -93663, -361054, -224468, 278850, 90009, -178454, 115165, -844, -422504, -240517, 68135, 5721, -149672, 258296, -89898, -15082, -77457, -68600, 89731, 43507, 88382, -40770, -148021, 104031]
19265C40523a53026k56126i5848F1858f1372l6184B37268h6507j20970f5052C6797
19253C15274a95874A82551H5995a78868a7863l76177B2645h6681b8928r324r34
19242c9186l7441j54768B03477B4403J73992P5646b1267H1548e0004I2124j666
19231I0458c4862A08699j737b55978a13646E0098d00613i1512A24507D281L9224
19220D3505M2451a78684r8824g9991A09553a27333o013C8753a54359A33651a97927
19208B44500E2797d2273E4136c31166C58780A44356a68453q1497p0650g3692B21007
19196b06344e8536A60662a87345i2978n558d7506j51375N3201l2576j08109G0550
19184a93877E3589J36301p3407c40238q7564a26388l0822N8575l39092J13476
$$ y = [340523, -153026, -409152, -95848, 61858, -61372, -97556, 237268, -86507, -207477, -65052, 36797, 315274, -195874, 182551, 85995, -178868, -17863, -394040, 22645, -86681, -28928, -38252, -39186, -76627, -231395, 203477, 24403, 198395, 274041, -21267, 81548, -50004, 92124, 90458, -34862, 108699, 106962, -255978, -113646, 50098, -400613, -91512, 124507, 4281, 43505, 85956, -178684, -277508, -79991, 109553, -127333, -133346, 38753, -154359, 133651, -197927, 244500, 52797, -42273, 54136, -331166, 358780, 144356, -168453, -249950, -320600, -73692, 221007, -206344, -58536, 160662, -187345, -92978, -98536, -47506, -198881, -145680, -178256, -286365, 70550, -193877, 53589, 189890, 116483, -340238, -427802, -126388, -157210, -98635, -437727, -324251]
19174c24251A33705b02234g8872H137J0580O9934M8947b88518f0634b3047l5942
19163e8989A89384D3381c23057d0517C22068G5245a48015n756f2134q095j47303
19152b17532c1707D751M7114a86681B84282E6976a25145M0304A24604a11187O290
19141a04897j90187L0870h216q9846j54986A03507K89599b46914b9746l74109
19131d03855J16554c9977j894B8367a67248q9720L9365B15552i6734L2392j78181
19120b42523a09876l3649G1703a19200A47064a28621k6711A76008j8673B8982
19109C8664c4902k1158H2816a1484E6916K1532c11094A42491j8495d688m16646
19098d21334A04594a67368A54361e73789b0496j99415c6463a7944j0467j73737
$$ y = [-324251, 133705, -202234, -78872, 8137, 18717, 88651, 137598, -288518, -60634, -23047, -58989, 189384, 43381, -323057, -40517, 322068, 75245, -148015, -153771, -62134, -70229, -217532, -31707, 4751, 51865, -186681, 284282, 56976, -125145, -84841, 124604, -111187, -104897, -295084, -264214, -8216, -98062, -253048, 103507, 393106, -246914, -29746, -403855, -287301, -39977, -41871, 28367, -167248, -256968, -217603, 215552, -96734, -64342, -242523, -109876, -143525, 71703, -119200, 147064, -128621, -155332, 176008, 157335, 28982, 38664, -34902, -56060, 82816, -11484, 56916, 78448, -311094, 142491, 123996, -4688, -421334, 104594, -167368, 154361, -573789, -20496, -219911, -36463, -17944, -28411, -202148]
19088b02148j7541B02620p2790g0301A39076a27680B23154E820K6950J81805j0022
19077B04553a09059A26656l1612h9712M3209K0431A32003a38861f5883K0383b092
19065F6515N162b46605j10575h6624r6598K8316O2536j16615F4886f1492A11663
19053E8384L04829a94629m0922N7417H8805d10662A59637F2038b97215J43033
19043a54182c4096C2294a61595m4539A70828a76101B2211f8118B53566o7724b5643
19031f6970G8475M4048j4538L77771A81525l788a04923O961b1614G1412b18556
19019b8649C79826a24833j87327J37695N2268H4443b45324B69840d5953j60175
19009b06128J4208j6862i8699A68516i5783A43201a73502N4612E7719a07157F1440
$$ y = [-202148, -219689, 202620, 129830, -70301, 139076, -127680, 223154, 5820, 32770, 214575, 204553, -109059, 126656, 95044, -89712, -46503, -26072, 132003, -138861, -65883, -45500, -2092, 66515, 71677, -246605, -357180, -86624, -183222, -154906, -92370, -208985, 64886, -61492, 111663, 58384, 363213, -194629, -235551, -178134, 88805, -410662, 159637, 62038, -297215, -154182, -34096, 32294, -161595, -206134, 170828, -176101, 22211, -68118, 253566, 185842, -25643, -66970, 78475, 122523, 107985, 485756, 181525, 177737, -104923, -97962, -21614, 71412, -218556, -28649, 379826, -124833, -312160, -174465, -122197, 84443, -245324, 269840, -45953, -206128, -191920, -208782, -98699, 168516, -95783, 143201, -173502, -118890, 57719, -107157, 61440]
18997b15860A41227a32047d5674N185D6219c2073B42901h2599j33453A11273b02097
18985E8215b79679n6395h8789F3229c95265a25874D7714g9879A13009b47633H5502
18973A91369O1894b12237j3457e6842o1017k3893C0606P7941h4681I0709C3655
18961g8285k020G4355b58780e3481A6023b98547D2807A2730Q5438l057i8568m4630
18949a43198e9218j80921i2720l7020D4176Q7002a04786D3663h2607F7612d3642
18937c8638p5257r1488A25636a51556A67685g903I880M3259Q7849b53641A02049
18925a1536j06896C37282A13499a83446d9516F9595J15846C4206j1558e0266j7468
18914f7734r7223B28310a86256o6339F9616L9393h2602H634a6436B64077i8577
$$ y = [-215860, 141227, -132047, -45674, -40489, 46219, -32073, 242901, -82599, -216052, 111273, -202097, 58215, -279679, -336074, -88789, 63229, -395265, -125874, 47714, -79879, 113009, -247633, 85502, 191369, 253263, -212237, -225694, -56842, -117859, -141752, 30606, 108547, -84681, 90709, 33655, -78285, -80305, 74355, -258780, -53481, 16023, -298547, 42807, 12730, 98168, 95111, -98568, -143198, -59218, -240139, -92720, -129740, 44176, 131178, -104786, 43663, -82607, 67612, -43642, -38638, -113895, -205383, 125636, -151556, 167685, -7903, 9880, 53139, 140988, -253641, 102049, -11536, -118432, 337282, 113499, -183446, -49516, 69595, 185441, 34206, 22648, -50266, -67734, -164957, 228310, -186256, -252595, 69616, 109009, -82602, 8634, -16436, 264077, -98577]
18902f2990A29763f6349G0661a30922f0242l3998D8232a39861A24346M0017k3878
18891A40485i1158B05947d28914I781c01103A28993f7649k86661i4979j8561k45078
18880c58618A04458J29957I1852f2638B46630D5992i8400k48149B5744b95611
18869D627j875b12357K0882M3079B766K5422a47850K8080D004L0546e79066A00703
18856a55824m1221A71179n934f2683B68253a77949I0298b42240M0779g0558C5120
18844e0207j08226b0850i729A97662e1654o6091A3190K4484K26517a4656A80463
18832A6056a97096j31014a23800A79624E8051N2694b3654A49426j6147b72426
18821E8093L06361A59691J61821i0574A46952a08717E7194J4176L04642n2216
$$ y = [-62990, 129763, -66349, 70661, -130922, -60242, -94240, 48232, -139861, 124346, 164363, 140485, -91158, 205947, -428914, 9781, -301103, 128993, -67649, -354310, -94979, -113540, -358618, 104458, 234415, 91852, -62638, 246630, 45992, -98400, -346549, 25744, -295611, 4627, 2752, -212357, -191475, -148396, 2766, 28188, -147850, -119770, 4004, 34550, -579066, 100703, -155824, -197045, 171179, 165245, -62683, 268253, -177949, 90298, -242240, -201461, -70558, 35120, -50207, -158433, -20850, -9729, 197662, -51654, -117745, 13190, 37674, 264191, -14656, 180463, 16056, -197096, -328110, -123800, 179624, 58051, 110745, -23654, 149426, 133279, -272426, 58093, 364454, 159691, 321512, -90574, 146952, -108717, 57194, 71370, 376012, 323796]
18811C23796j37841A8280M3768P1877C8557a70570j31664a17713B4532J99024
18801B23556f4048A75402a3147E0889N0567d0145m161k94205c4560A21907a3841
18789d2558E5532J00305a32572n0057J4649p1980g7169n9260k94946e2568o1839
18778a14407j0377q337j3079c068A65104b7544k08914A54836E5187c06633a08468
18766A63286a09210m3574m36C18590j01499d9060k74351H6065f5610k70018B0994
18754a26928r839q1929g3209b9168F8548J39559b93037e3886D8031j6404d3228
18742a14048k17245C65691g0714k76310A68093J97556a67110g3896G0458b01028
18731b49318j07219A29267a05888l9338F8369f2030j31754B3743a32623j96924
$$ y = [323796, 185955, 18280, 62048, 133925, 38557, -170570, -302234, -117713, 24532, 223556, -64048, 175402, -13147, 50889, 101456, -40145, -44306, -338511, -34560, 121907, -13841, -42558, 55532, 155837, -132572, -182629, -167980, -239960, -77169, -136429, -431375, -52568, -114407, -124784, -133121, -146200, -3068, 165104, -27544, -236458, 154836, 55187, -306633, -108468, 163286, -109210, -152784, -153220, 318590, 217091, -49060, -323411, 86065, -65610, -335628, 20994, -126928, -136767, -218696, -73209, -29168, 68548, 208107, -293037, -53886, 48031, 31627, -43228, -114048, -331293, 365691, -70714, -347024, 168093, 365649, -167110, -73896, 70458, -201028, -249318, -356537, 129267, -105888, -145226, 68369, -62030, -193784, 23743, -132623, -329547]
18721c29547N4369B58417e5882m9831m63207H4951f0801D7660i5999m0185A62947
18709c37274N9993g3732k65093a21564K5545B7576b41286h6603k40577a1738j22466
18698a34204c92F4790h8740l07373c1412p9454A21379a09599o1009Q466o6671
18687b28813p524A74392a37840A10178a09315M9679o3334k41829a32542E1231
18676a67856k4689G9829c05391a26396q9040e7647A22062B2519a65186I2840b15241
18664b33468C64987a47193N3996C29281C5271J0808a18150l1449a5391A28231
18653a63541G0670O206J02582f4586j46597b3264B97430p1051c98741A7707b47003
18641b53741f4932D7257N0212c70150I9961r243c21635H6341O9911a16272k91894
$$ y = [-329547, -275178, 258417, -55882, -105713, -568920, 84951, -60801, 47660, -95999, -136184, 162947, -337274, -277281, -73732, -338825, -121564, -96019, 27576, -241286, -86603, -327180, -11738, -134204, -392, 64790, -88740, -396113, -31412, -110866, 121379, -109599, -170608, -162142, -228813, -236337, 174392, -137840, 110178, -109315, -59636, -122970, -364799, -132542, 51231, -167856, -192545, 79829, -305391, -126396, -215436, -57647, 122062, 22519, -165186, 92840, -215241, -233468, 364987, -147193, -93197, 329281, 35271, 46079, -118150, -149599, -15391, 128231, -163541, 70670, 76876, 179458, -64586, -211183, -23264, 297430, 226379, -398741, 17707, -247003, -253741, -64932, 47257, 97469, -370150, 99961, 90718, -321635, 86341, 156252, -116272, -408166]
18630d08166a43092O6468R29b2216l7524j31304a5359D4035d06670I7660J66435
18619B64095b2721l83125C2270i4186D1235g202B50078A3599b22632C519g0262
18607c0762j37496b7879l16731a24259A14729E213a51875k7325h169H760b56199
18595a49836A6874J2035b13815B24422M4176P7432A02164b2790N428A58625a02520
18583B13110r0156C0309K44071c8271r8272A13651b41616d673B80976b81659l2923
18572c14582f4892B7431M16110H4657P2280K8174q7216b20991M2334d450j14720
18561a19170j76308a45585k5563C3282J34787b1309j99892O9008C9089A6549O2956
18550G9505a69095k4231o3813D3293c3517B9225c05273J02457j99581e3033j7944
$$ y = [-408166, -143092, -76624, -75695, -22216, -59740, -191044, -15359, 44035, -406670, 97660, 264095, -22721, -405846, 32270, -94186, 41235, -7202, 250078, 13599, -222632, 3519, -70262, -30762, -168258, -27879, -344610, -124259, 114729, 5213, -151875, -179200, -8169, 8760, -256199, -149836, 16874, 28909, -213815, 224422, 268598, 346030, 102164, -22790, -17362, 158625, -102520, 213110, 122954, 30309, 274380, -38271, -136543, 113651, -241616, -4673, 280976, -281659, -314582, -64892, 27431, 443541, 84657, 156937, 185111, 97895, -220991, -178657, -4450, -119170, -295478, -145585, -171148, 33282, 168069, -21309, -221201, -152193, 39089, 16549, 79505, -169095, -193326, -257139, 43293, -33517, 29225, -305273, -202816, -402397, -53033, -70977]
18539g0977A06972C5063b70573B22307I990g7784E9364c44461O2366f2421a8375
18527a57950A36709a04780Q103B76141E6093a3281f58j41933j10416B15228a73789
18515B17737a71096C49798e4460k21337C2099d3875B4888a64808f7948l8361A4370
18503c07409E0682J65413c87564J92786g5087b2511j40303O4434c9347A75423
18492c1386j78734A21224b06483R9903A91551J17644D4501a4159A41009b67366
18481b22584k13241a36078A07562a49116b633j81384O7239D2855b08187A6241
18470b56643L4282C7446f0748A07654H236J53963I182J72062e2539i363B54488
18458B12730p9821g4335b768j1837o3224A75513b85631P0028A53448b37387g8164
$$ y = [-70977, 106972, 35063, -270573, 222307, 9990, -77784, 59364, -344461, -282095, -62421, -18375, -157950, 136709, -104780, -96677, 276141, 56093, -13281, -658, -142591, -253007, 215228, -173789, 217737, -171096, 349798, -54460, -275797, 32099, -43875, 24888, -164808, -67948, -106309, 14370, -307409, 50682, 216095, -387564, -194778, -75087, -22511, -162814, -98380, -39347, 175423, -31386, -210120, 121224, -206483, -106580, 191551, 309195, 44501, -14159, 141009, -267366, -222584, -435825, -136078, 107562, -149116, -2633, -184017, -116778, 42855, -208187, 16241, -256643, -222361, 37446, -60748, 107654, 8236, 162199, 9182, 181244, -52539, -9363, 254488, 212730, 132909, -74335, -2768, -14605, -77829, 175513, -285631, -215603, 153448, -237387, -78164]
18446b2030k49724a19716A90586p9917a96041c3302j72067p3088A80530i9905
18435b04211E998b25733j8839g6816j19823O8117H5301b49k81718F3605c27576
18423d8597A38665O0484m0749g030E1141M9013a37496M7311H0897B9322L4517
18412F3839f8409a1838H9379C247K61570A08242e1900B37822j14489L4532J7568
18401A75433D0030L3330a72510I8764A4785L82028h8482j16905d3960j6994l7055
18390i8009a3038D6121C329f9212n6844a8245C74441E5540J21890a97882A819
18378C0470J27909b91764e3740J8017j52918Q5989m45653a30546J3454d9806b1501
18366f0729A83228K85874F4526j5768J38619a51067A8145d7128O20C26589D3786
$$ y = [-22030, -271754, -119716, 190586, 110669, -196041, -33302, -205369, -278457, 180530, -99905, -204211, 5998, -225733, -244572, -76816, -196639, -128522, 85301, -249, -281967, 63605, -327576, -48597, 138665, 199149, 158400, -7030, 51141, 100154, -137496, -90185, 80897, 29322, 63839, -68409, -11838, 89379, 3247, 264817, 108242, -51900, 237822, 123333, 157865, 175433, 40030, 73360, -172510, 98764, 14785, 396813, -88482, -205387, -43960, -60954, -98009, -13038, 46121, 3329, -69212, -126056, -18245, 374441, 55540, 177430, -197882, 1819, 30470, 158379, -291764, -53740, -35723, -188641, -102652, -548305, -130546, -117092, -49806, -21501, -60729, 183228, 469102, 64526, 48758, 187377, -151067, 18145, -47128, -46508, 326589, 43786]
18354A65129b87829g2325L144G4721b84599c2568C0768a69088k18264F5350g1277
18342b86044D1168f54148e6104A1999a00065q3961A64580a48217C22874d0676
18331f2735l97244A82739b48939C11506F3246J25202F8684d26102a52098l7045
18321a89143A48785d5470A19814b75099g2243J1551D4324a28666A96447g7994
18310a24063k9552D4178a83022H0987b49018j01114B53794a5313p4691a6443I6817
18298a23841A63539a44808r1531r6428A40130d19736H9620D2603N0052b15043
18287b24884c5902k6299G631d20375d0266j50334A74529a0351I4461a7864E1646
18275F4588b35521Q5730B65640I1700a28073n173A36411c4848c401m4547l617
$$ y = [165129, -287829, -72325, -69181, 74721, -284599, -32568, 30768, -169088, -387352, 65350, -71277, -286044, 41168, -654148, -56104, 11999, -100065, -184026, 164580, -148217, 322874, -40676, -62735, -459979, 182739, -248939, 311506, 63246, 188448, 68684, -426102, -152098, -189143, 148785, -45470, 119814, -275099, -72243, -60692, 44324, -128666, 196447, -77994, -124063, -153615, 44178, -183022, 80987, -249018, -350132, 253794, -15313, -90004, -16443, 96817, -123841, 163539, -144808, -236339, -332767, 140130, -419736, 89620, 42603, 92655, -215043, -224884, -35902, -62201, 7631, -420375, -40266, -190600, 174529, -10351, 94461, -17864, 51646, 64588, -235521, -149791, 265640, 91700, -128073, -133246, 136411, -34848, -3401, -47948, -51565]
18264e1565D5278g2791j77741c8244l0748B9009b13808I511f8769G3126J6565
18253H9691Q7205f1220A9725c19803b9025k1385l7676A12539i3783k41001N2435
18242b82349J01782g6599C6799a07463j57943A87153e2375C23573N927A49776
18231b4554E9895P0899n5486J68634C8457P4670c23330F2524d04557B454L09848
18220C12302b43569A49140b3059b500A90155m6087a87900c7386j00141A36137
18209I0555K6982J87338B3038a65792L085j67449a19097A12033a72552A22027
18198a94517O8548m02405h6078j4624j6647j1191e9147j13530A50033n8306i8463
18186a79704K4766H1641A3899J75630B0491d2891C57571f149j08859D7572h6630
$$ y = [-51565, 45278, -72791, -250532, -38244, -68992, 29009, -213808, 9511, -68769, 73126, 89691, 176896, -61220, 19725, -319803, -29025, -50410, -88086, 112539, -93783, -334784, -282349, -180567, -76599, 36799, -107463, -265406, 187153, -52375, 323573, 329500, 149776, -24554, 59895, 130794, 75308, 243942, 38457, 113127, -323330, 62524, -404557, 2454, 312302, -243569, 149140, -23059, -2500, 190155, 144068, -187900, -37386, -137527, 136137, 90555, 117537, 304875, 23038, -165792, -162707, -330156, -119097, 112033, -172552, 122027, -194517, -125969, -528374, -86078, -100702, -117349, -128540, -59147, -172677, 150033, 91727, -98463, -179704, -154938, 81641, 13899, 189529, 20491, -42891, 357571, -6149, -115008, 47572, -86630]
18174G6132B2007d4290A17670A1442a92184K0439B85995k0210d11930A56897b62638
18162d2239C7592R1387B3242b50675P4415H9846K84168D5443c36455c7793o5673
18151a03466j15969b2l13867L9571B52493j3535A5853n306L7895e9442L359m8852
18139a04935C7200a37060A41739b75534A42974a03055A00421g4192a8064E0408
18128a02648A74456a8414k55912f7936j993C9811b42377a07563M3593B1643J34766
18117A56409b50485B08075a22094H8190A578e41572I5676a43764N1632B69700
18106A69773a71517K1029B8284c40859A02027a08507n8177A35946a79053C95731
18095B99785a07224b04B41538m652B9320J75159c47279C6524d7454A14822a16827
$$ y = [76132, 22007, -44290, 117670, 11442, -192184, -171745, 285995, 265785, -411930, 156897, -262638, -42239, 37592, 128979, 23242, -250675, -176260, 89846, 374014, 45443, -336455, -37793, -103466, -219435, -22, -313889, -274318, 252493, 238958, 15853, 10547, 48442, -59442, -56083, -104935, 37200, -137060, 141739, -275534, 142974, -103055, 100421, -74192, -18064, 50408, -102648, 174456, -18414, -274326, -67936, -69929, 39811, -242377, -107563, -63970, 21643, 156409, -250485, 208075, -122094, 88190, 1578, -541572, 95676, -143764, -92132, 269700, 169773, -171517, -150488, 28284, -340859, 102027, -108507, -166684, 135946, -179053, 395731, 299785, -107224, -204, 241538, 236886, 29320, 204479, -347279, 36524, -47454, 114822, -116827]
18083b07596f9840B1471O8265a60680j57770A04175b35169A67644R519c01641
18072a30854K0715B58954a57174N7198j49270A71855c05539j27268Q0652J24987
18062b27168j49677a07439j18509h0740k5965k79854C65719A15190f1748I3608
18051a16185B63147a0014j69789h9655q1418h0131o1275N8494J8614b6114m30741
18040d56855j8516a08669j42562N6142N7202j3796A12191L03895b25655C2550
18029I1196Q2706B19a77475k40028a03881E1299J1750J68867a48730j06030c7456
18017d58507C0879L45801I2665A2536R6416K30681G7667i6991j12545f6066C98038
18005H6014J36044a38705B51065C5274d3851D9394b46166A8921J78639i3410a2696
$$ y = [-207596, -69840, 21471, 89736, -160680, -318450, 104175, -235169, 167644, 177163, -301641, -130854, -110139, 258954, -157174, -99976, -249246, 171855, -305539, -432807, -352155, -227168, -376845, -107439, -225948, -80740, -106705, -386559, 365719, 115190, -61748, 93608, -116185, 263147, -10014, -179803, -89655, -171073, -80131, -141406, -82912, -64298, -26114, -456855, -475371, -108669, -251231, -195089, -137887, -151683, 112191, 416086, -225655, 32550, 91196, 173902, 219, -177475, -417503, -103881, 51299, 63049, 231916, -148730, -254760, -37456, -458507, 30879, 376680, 92665, 12536, 108952, 339633, 77667, -96991, -209536, -66066, 398038, 86014, 222058, -138705, 251065, 35274, -43851, 49394, -246166, 18921, 197560, -93410, -12696]
17993a14040j4120C30645O011b00020L8603B51192D2826a06746j107B2486Q3320
17982A05806a10223m0940A2652a90416i1547A3178J4123b41996n5222B92849b8704
17970A99453C5468a25156G6004a91156k27296a28283e5054K1292j02226A12130
17959e6386A55105n1879p993b9583A28890c9960p3016B2343J81247p5224F3537
17947A56359c23081I5076J26636P3953b18443F8625b22427A20201P4664M1430
17937B36295a24907A43228e4337A4831J29665a53488k68206A88777D9961e6854
17926f2052r0486L6626B56498C0039J35717a04177l30571i0981j7027D1605a90499
17914a09198d2819k47766D7753L1481e4529A93825B6797J39950a33014a349C43945
$$ y = [-114040, -128160, 330645, 336656, -200020, -161417, 251192, 42826, -106746, -107853, 22486, 105806, -110223, -151163, 12652, -190416, -91547, 13178, 27301, -241996, -297218, 292849, -28704, 199453, 35468, -125156, 76004, -191156, -418452, -128283, -55054, -33762, -135988, 112130, -56386, 155105, 103226, 95233, -29583, 128890, -39960, -112976, 22343, 203590, 128366, 63537, 156359, -323081, 95076, 221712, 295665, -218443, 68625, -222427, 120201, 194865, 236295, -124907, 143228, -54337, 14831, 144496, -153488, -421694, 188777, 49961, -56854, -62052, -152538, -115912, 256498, 30039, 165756, -104177, -434748, -90981, -108008, 41605, -190499, -109198, -42819, -290585, 47753, 79234, -54529, 193825, 26797, 166747, -133014, -1349, 343945]
17902c0452n299D2188Q0347n3565b15005A93835F5857A7682b47280B9704a51796
17890e1729A51243J687a20248n2476r386c8742k61155A95322p5735a61758A73491
17878A27324K3972J8974q1389C0674J03664R9131J69382e2990n0359m9782R073
17867a44058i583j18407C7762c0728j01127H8985b4164n3330j31861h8527A73496
17855f7808H200a1140A09635c08257b4480j63892p2427P4335B63703e6689C3914
17843a12301B62906d0184G0724b4750E32693a01k3511A03582n503J7581D5899
17831f6979j19045C6868J87760B0069K74337A07578c4492B95O9573K305c04309
17819h4385K8897A94576a57161C9035L4899L1815m0822M9039f6213j82389A57764
$$ y = [-30452, -35751, 42188, 122535, 68970, -215005, 193835, 65857, 17682, -247280, 29704, -151796, -51729, 151243, 152930, -120248, -172724, -182110, -38742, -299897, 195322, 119587, -161758, 173491, 127324, 151296, 170270, 88881, 30674, 134338, 233469, 402851, -52990, -103349, -153131, -144058, -9583, -127990, 37762, -30728, -131855, 88985, -24164, -77494, -209355, -88527, 173496, -67808, 8200, -11140, 109635, -308257, -24480, -188372, -260799, -186464, 263703, -56689, 33914, -112301, 262906, -40184, 70724, -24750, 532693, -101, -23612, 103582, 98079, 115660, 45899, -66979, -186024, 36868, 224628, 20069, 294406, 107578, -34492, 295, 69868, 72173, -304309, -84385, -55488, 194576, -157161, 39035, 73934, 105749, 64927, 113966, -66213, -248602, 157764]
17807a49809M9237o2286K7039j2151o2169i7234c8868F0576a51218A16174j9211
17796I6963m2362P069O2869h9211k0082c4856H4364J87693h6127J6882A59225
17784A081J11652b8417C125b73414F4890E234L9632K12389c44181k25387B71408
17772a62074A02300l3540d2834B72774A21802B5207J65164a87376M8100D9234
17761A64103K74471c29285A74121a64977f7837E189b84947h5975c0251C0081L3212
17750F3293j994J9105M8107a37089j66956G0076b9513C4208M2253b35969L7907
17739a98062h8076A92241g6239l4790g219G8072d16526B36523A9858J50869c9113
17727A30099c1257B57560j20792a56360b8888j10640j5910E6584L6126g9762k12413
$$ y = [-149809, -100572, -162858, -135819, -147970, -210139, -97234, -38868, 60576, -151218, 116174, 96963, 54601, 61670, 124539, -89211, -109293, -34856, 84364, 272057, -86127, -69245, 159225, 1081, 112733, -28417, 3125, -273414, 64890, 5234, 44866, 257255, -344181, -569568, 271408, -162074, 102300, 68760, -42834, 272774, 121802, 25207, 190371, -187376, -139276, 49234, 164103, 438574, -329285, 174121, -164977, -67837, 5189, -284947, -85975, -30251, 30081, 63293, 61299, 80404, 128511, -137089, -304045, 70076, -29513, 34208, 76461, -235969, -198062, -88076, 192241, -76239, -111029, -7219, 78072, -416526, 236523, 19858, 170727, -39113, 130099, -31257, 257560, 136768, -156360, -28888, -139528, -155438, 56584, 92710, -79762, -292175]
17716b92175f6073B06096G7089g9961A14543l1733J90366b0528m0999B57754a66017
17704d6414G1780c05032B5272L12011A2236J39286b16694A76946h3965B95561
17693f844I8220r147P4015C402J87166b83180e2608N170A9089g8810f950G3431
17680d1486F3059M2896a04565k0280A1020c1076j1994B80715b80127M3820B38038
17668C41297b09j58413j76794A71556c3792B05530o3284f6923B6963b48642g9916
17656A22303a78709E9234J92542d0438A86891a66957O0099H3062J36491j03478
17646A16075k8126J82351l2021d7734m2847B50143e4504q0185j828p6614c6690
17634g0901L809B18197D3923J22102C9491Q4444f3721B38362C7949P6419j0942
$$ y = [-292175, -66073, 206096, 77089, -79961, 114543, 82810, 273176, -20528, -61527, 257754, -166017, -46414, 71780, -305032, 25272, 337283, 12236, 151522, -216694, 176946, -83965, 295561, -6844, 98220, 89073, 163088, 3402, 190568, -283180, -52608, -47438, 19089, -78810, -6950, 73431, -41486, 63059, 105955, -104565, -124845, 11020, -31076, -43070, 280715, -280127, -236307, 238038, 341297, -209, -158622, -335416, 171556, -33792, 205530, 142246, -66923, 26963, -248642, -79916, 122303, -178709, 59234, 251776, -40438, 186891, -166957, -106858, 83062, 219553, 116075, 87949, 270300, 238279, -47734, -90581, 250143, -54504, -134689, -136517, -213131, -36690, -70901, -67092, 218197, 43923, 166025, 39491, 123935, -63721, 238362, 37949, 114368, 103426]
17623A03426i5893A9717b77448i060A42236b22303o7822K4105A77748H0172i7190
17611b88027H8657M2300a48329b1593D8425L5268B0549b87916B948b32519D5075
17599a49869F1100P1415E6992B8275a73837A68057H0079J97582j30724A1859h7739
17587C24880A26731l6873a41672f928j96163I7934K01282C1443a28410J627C18834
17575B96837a79486C8626j2518K06245D7668a48740b018A5707J49334D4383a76790
17563a26935q360j15566G2147Q6710E7518K55959F9629a12928d181k9546A253
17551b49900n622A72892C6603j5237a99275O7153C14317j33632a48661A60524
17540a80462A60237G3109K45374a86444p0263B7349h1147a1745C10010j43513
$$ y = [103426, -95893, 19717, -277448, -9060, 142236, -222303, -290125, -266020, 177748, 80172, -97190, -288027, 88657, 130957, -148329, -21593, 48425, 83693, 20549, -287916, 2948, -232519, 45075, -149869, 61100, 132515, 56992, 28275, -173837, 168057, 80079, 277661, 146937, 11859, -87739, 324880, 126731, 89858, -141672, -6928, -203091, 97934, 299216, 31443, -128410, -126783, 318834, 296837, -179486, 38626, 26108, 232353, 47668, -148740, -2018, 15707, 165041, 44383, -176790, -126935, -135295, -250861, 72147, 158857, 57518, 313477, 69629, -112928, -4181, -33727, 1253, -249900, -255522, 172892, 36603, 21366, -199275, -132122, 314317, 180685, -148661, 160524, -180462, 160237, 73109, 318483, -186444, -256707, 27349, -81147, -11745, 310010, 166497]
17530A66497G7849m256L22215F0007i9437D8457h8065j66267H1321L0089P6339
17519A87749F8543N378b26206A92471b26422K7013e1304B99955C6471J90811p096
17508B20186l8841L2988a16402j632m7887D6247P1252K16336i737I1136b31757
17496B79937a27126D8109K9552K58607j26579o5653Q5721B0409L74977A7069J56450
17485A73519L2275J30961E7758r398a45321C35428A64029A4737L119K12049N9350
17474B89255A00396B9932L14998o2592m5703E8364B3733i787B04617n4877J2216
17463A61956i8653C7877K63764m6470c3033I1053J56449p0139j8074m8570l6548
17452G4171K33347F1471J58055B7690K98669N4198J64589j94113J30218j60237
$$ y = [166497, 77849, 73593, 395808, 60007, -99437, 48457, -88065, -254332, 81321, 111410, 187749, 68543, 73921, -226206, 192471, -226422, -199409, -51304, 299955, 36471, 227282, 220186, 181345, 214333, -116402, -118034, -165921, 46247, 117499, 333835, -9737, 91136, -231757, 279937, -127126, 48109, 77661, 336268, 209689, 144036, 229757, 20409, 395386, 17069, 173519, 205794, 336755, 57758, 48360, -145321, 335428, 164029, 14737, 17856, 229905, 289255, 100396, 29932, 344930, 282338, 236635, 58364, 23733, -9787, 204617, 149740, 161956, -98653, 37877, 301641, 255171, -33033, 91053, 247502, 177363, 159289, 110719, 74171, 307518, 61471, 219526, 27690, 326359, 380557, 545146, 351033, 481251, 321014]
17442C21014p1628O7298r6795R8900D8684K08961J79140p7369A16407B0591R7376
17431A17967O69668C11530j45069i7804I2283K37512D3331J99919o8252O29226
17421H04224B66251P6375r5784o8158N2598K21216A39612n3615J85870A19301
17410I6532a99463B64419E2766L55442j50433D0814K1765B3011b30110O2433F2270
17398C26062H8434M5006b4386e916D50990h7877A35800J44855c11598C46918A46504
17386F6680K28012B3064J00747K24086l1540A57086a18770B21873N6656I7562
17375C47228A29212C5943J46563q6424a50752A68750N0450h619A47245R203L25313
17364D81761a14539C1460a65340e646C22233c93969B35739M942b4700B82508I8702
$$ y = [321014, 249386, 316684, 219889, 318789, 48684, 257645, 436785, 359416, 116407, 20591, 117967, 787635, 311530, 166461, -97804, 92283, 329795, 43331, 243250, 174998, 804224, 266251, 342626, 246842, 178684, 231282, 452498, 139612, 85997, 271867, 119301, 96532, -199463, 264419, 52766, 408208, 257775, 40814, 62579, 23011, -230110, -167677, 62270, 326062, 88434, 133440, -24386, -5916, 450990, -87877, 135800, 280655, -311598, 346918, 146504, 66680, 294692, 23064, 123811, 347897, 316357, 157086, -118770, 221873, 278529, 97562, 347228, 129212, 35943, 182506, 96082, -150752, 168750, 219200, -8619, 147245, 156448, 481761, -114539, 31460, -165340, -5646, 322233, -393969, 235739, 240681, -24700, 282508, 98702]
17352a48908A86561p0243f7351A17674m7139c29145B69579J58400H8419g1245
17341b2162C59983A64770L20310a88380A96301a56266A26521j6760h6941B83611
17330B47927G3629J89631F1865K58591A11047L99071A69255A0760J24299M4454
17320A79513J95668f326J671o8373C48342h1823L6659A23892k6392K45445i407
17308I560m513L0769Q7152m3287J51865H9402O6836L7013a22613A29377J36258
17297B65635j2777j06179l0506j3930J04217a0497C92587B1417J01638m0731M1084
17286A23408Q7645j3690r1119c21500D55357A39299K9832g664E4422L3495K34224
17275C22141j34300j8888K8184J11854C7598K36327J12355j8440m7221l8813l1310
$$ y = [-148908, 186561, 116318, -67351, 117674, 70535, -329145, 269579, 427979, 88419, -71245, -22162, 359983, 164770, 485080, -188380, 196301, -156266, 126521, 109761, -86941, 283611, 247927, 73629, 263260, 61865, 320456, 111047, 510118, 169255, 10760, 135059, 179513, 375181, -6326, -4655, -73028, 348342, -81823, -45164, 123892, 97500, 342945, -9407, 9560, 5047, 35816, 122968, 79681, 231546, 89402, 156238, 193251, -122613, 129377, 265635, 252858, 146679, 116173, 102243, 206460, -10497, 392587, 21417, 123055, 82324, 123408, 211053, 197363, 106244, -321500, 455357, 139299, 169131, -7664, 54422, 87917, 322141, 187841, 168953, 197137, 308991, 37598, 273925, 386280, 367840, 320619, 281806, 250496]
17264B50496K60461A37210a3567D42950j93277G6891g8991K1287C70703P1404
17254D42107B14931b86C26463J72283A03849j7223R1940a9908A31774E605N40833
17243E46438B43007a14302A0786M0583J63690J00663A23624L8917p1425B3758
17232B58526L744l7403I2047L09673f857D97755M379A06779K76163j81449L8101
17221B39594P4231G9498L47910c7245B74422R2068A21182h7005L842A99142O7608
17210B66750r3617L63367a5047C14458A43609J98770o692B8340e6005L255C28092
17198E5123M41058B30348O2598E7420Q272M5350J64176J06049j34661K0298M692
17187B71596r6422J20920J09634J42123A73288K1483L15197j2923A82532J26472
$$ y = [250496, 510957, 137210, -13567, 442950, 249673, 76891, -78991, -57704, 370703, 442107, 214931, -286, 326463, 498746, 103849, 86626, 178566, -19908, 131774, 5605, 546438, 243007, -114302, 10786, 51369, 215059, 315722, 123624, 162541, 91116, 23758, 258526, 262270, 224867, 92047, 401720, -6857, 497755, 502134, 106779, 382942, 201493, 239594, 313825, 79498, 427408, -37245, 274422, 366490, 121182, -87005, -83163, 199142, 266750, 173133, 536500, -15047, 314458, 143609, 342379, 335687, 28340, -56005, -52750, 328092, 55123, 496181, 230348, 292946, 57420, 65692, 111042, 275218, 381267, 246606, 266904, 271596, 175174, 296094, 405728, 547851, 173288, 194771, 509968, 497045, 182532, 309004]
17177C09004A49484n1527J40155O684M293k2379b31517A99545J12723A20451J92245
17166C12696j20107O767K58518p1066N8707q801M0531e9058C06019J40354D0129
17154B16376J95237A28592K84349A13304M43322j13006j15192K23141j09759j36701
17144C05109J52224l0335O4716j13341p7979M509j15950J79742n4505q4639J61442
17133C90993j29572R1869J62167j37150p9475l7988N537J59759o7174r5159H4841
17121E01036D5396J21810O2241K48996j73307L49737A46570K36918j48125K01944
17111D37307K16599F2716J16723K4858K04095K6968j66434K38201j93348A52889
17100C92721j31196J66027A91244M14118B53772M4294J34543j37541J75551A77597
$$ y = [309004, 149484, 97957, 238112, 244796, 249089, 226710, -231517, 199545, 312268, 120451, 312696, 192589, 199356, 457874, 386808, 445515, 436714, 477245, -59058, 306019, 446373, 40129, 216376, 411613, 128592, 412941, 113304, 556626, 443620, 328428, 551569, 441810, 305109, 457333, 426998, 491714, 378373, 300394, 304903, 188953, 368695, 314190, 229551, 390993, 261421, 353290, 515457, 378307, 298832, 260844, 266381, 426140, 358966, 263807, 84841, 501036, 45396, 167206, 229447, 478443, 305136, 654873, 146570, 383488, 235363, 437307, 653906, 62716, 179439, 204297, 408392, 435360, 268926, 507127, 313779, 152889, 392721, 261525, 427552, 191244, 605362, 253772, 298066, 432609, 295068, 470619, 177597]
17089B97327J19979Q3151K08117j73630A40751N6193J05224N6076K85447J43020
17079G86711l35172O2779p3261j65208J93387K39588j95257j20012K91023n0239
17069F34339k24493n819Q5599A46209N52662r0513N8136k78989K67822k16051
17059D39276K37855m469B41523N39541k07975k79663Q5255K40723K30899p2788
17049G77515l43659O942K44867l20624J28326L52894m12416k6135M7840J57370
17039F12920n1273J23155K40887l77589M80461D58611n8178J16523K73488l36698
17029D53746R8747p4986L7271M72440l17300L5880J20785K5869j55944k03872
17019D92636J7683J85335j22147n4130J48993R0730o6027j91955L8424L07762
$$ y = [297327, 417306, 500457, 708574, 534944, 140751, 196944, 302168, 358244, 643691, 786711, 451539, 514318, 441057, 275849, 469236, 708824, 513567, 393555, 684578, 634339, 409846, 404027, 489626, 146209, 698871, 608358, 666494, 387505, 655327, 439276, 677131, 672662, 241523, 781064, 573089, 293426, 378681, 619404, 850303, 777515, 433856, 440798, 685665, 365041, 493367, 846261, 433845, 407710, 455550, 612920, 561647, 684802, 925689, 548100, 1028561, 458611, 400433, 516956, 790444, 453746, 552493, 477507, 514778, 987218, 669918, 705798, 826583, 852452, 696508, 492636, 510319, 695654, 573507, 519377, 668370, 759100, 693073, 501118, 539542, 847304]
17009H47304l27185M89155k70558j65815L65683l84689M163J45832L88570j11706
16999I80754m49790R5760K70107j24010j8550r1031r0572J14398M74744k11817
16989I49993l31866K34526k35348K05652l2931J59269k48008K6402j68120M80376
16979A039945l10568J14801o3866L09099j56052Q5841k74741K7981P1644N34748
16969A378832l4963F44781M18566k33788J33187O3447j03885J79867j93630K73353
16959A181898k84622L34058l5774p58j6607j59438l17652M58087J45114j56965
16949A147341J06810j32135k90595K40272J73922k11071k29066K88995K22902
16940A317375j21177K23393l24775L92596m0405r5652q246j66798K63761j99739
$$ y = [847304, 520119, 1009274, 738716, 572901, 938584, 553895, 558058, 703890, 1092460, 980754, 530964, 626724, 896831, 772821, 754271, 663240, 572668, 687066, 1161810, 949993, 618127, 852653, 617305, 822957, 790026, 949295, 701287, 727689, 559569, 1039945, 729377, 844178, 780312, 1089411, 933359, 1019200, 744459, 772440, 844084, 1378832, 1343869, 644781, 1063347, 829559, 962746, 1026193, 922308, 1102175, 908545, 1181898, 897276, 1231334, 1195560, 1194802, 1178195, 1018757, 701105, 1159192, 1304306, 1147341, 1254151, 1122016, 831421, 1071693, 1245615, 1034544, 805478, 1094473, 1317375, 1196198, 1419591, 1094816, 1487412, 1447007, 1351355, 1343109, 1176311, 1440072, 1240333]
16930A240333K90838l36872P9513J55973J98139l90483K78960j10601K09680k31777
16920A383703k20274l7773M13208j19468J90475K47611k93314k9873l5288m3435
16910A455572L24626k03801k83572L22658j23131L60288j56853k80117L93685
16901A809355M4386q1808j855p9084M19319k94214k68796K33494L18810j28845
16891A970762K30759j60907k69731O8906J53745j31167J72403K22023j77427K64811
16881B344177o1414l2597k8299q2642R5302K38014k98876L94124M39648p54687
16871B252750J13437K53389J00305k52158J4943J39389k11534K39595L6588L82611
16861C069315j62086q9383K94600l95815M85034m31298L19425k3469K80243j70998
$$ y = [1240333, 1531171, 1194299, 1273812, 1429785, 1627924, 1237441, 1516401, 1405800, 1615480, 1383703, 1163429, 1125656, 1538864, 1419396, 1609871, 1857482, 1564168, 1534295, 1499007, 1455572, 1780198, 1576397, 1292825, 1615483, 1492352, 1852640, 1695787, 1415670, 1809355, 1853741, 1771933, 1770078, 1690994, 2110313, 1816099, 1547303, 1780797, 2099607, 1970762, 2201521, 2040614, 1770883, 1839789, 1993534, 1862367, 2034770, 2256793, 2079366, 2344177, 2282763, 2250166, 2221867, 2139225, 2234527, 2472541, 2173665, 2567789, 3007437, 2252750, 2366187, 2619576, 2719881, 2467723, 2482666, 2622055, 2410521, 2650116, 2686704, 3069315, 2907229, 2817846, 3112446, 2716631, 3201665, 2770367, 3089792, 3066323, 3346566, 3175568]
16851C175568j10326J41932L5002M54336k89605j1203L14576p3021o6150m6157
16841C524952J07790L24854j32469r8485K66700j02111J54276q559J12831J6909
16831D166688J02251M01184m74139L09821L25483o3906L97807k69345J47144J46605
16821E189593J57183j61852L26990L74844l82m61550L52465K15571L13378N6483
16811F362723L3888J67430r8905L09142K02797M5243K17780j35773N29219o2847
16801G570697K91592K34511r6916O53698j54084M36197J18509J04752L32463L33801
16791I825220L707O66907K10532L31448K31699M55677p5384K42320L33393O95387
16781A2920906L96403K19810P17146K25249L14699O93680K1471Q41409L22987
$$ y = [3175568, 3065242, 3207174, 3242176, 3696512, 3406907, 3395704, 3710280, 3637259, 3571109, 3524952, 3632742, 3957596, 3825127, 3726642, 3993342, 3891231, 4045507, 4036948, 4149779, 4166688, 4268939, 4670123, 4195984, 4505805, 4831288, 4767382, 5165189, 4895844, 5042988, 5189593, 5346776, 5184924, 5511914, 5886758, 5886376, 5424826, 5777291, 5992862, 6306240, 6362723, 6396611, 6564041, 6465136, 6774278, 6977075, 7022318, 7240098, 7104325, 7633544, 7570697, 7862289, 8096800, 7999884, 8653582, 8499498, 8935695, 9054204, 9158956, 9491419, 9825220, 9828927, 10495834, 10706366, 11037814, 11269513, 11725190, 11649806, 11892126, 12225519, 12920906, 13317309, 13537119, 14254265, 14479514, 14794213, 15487893, 15509364, 16350773, 16673760]
16772A6673760N18793M29038P09096O18603O25148J025597O09468P26289O79025
16763B2614817J155854N43969J159422P66307J471949Q95268J321043J192335
16755C1120964J130943J608474J707482J565886J289138J959417J909445J803977
16747D4095726K439733K176998K791708K769823K703833L039991L017656L477068
16739F6512536L437859M322176M318822M222305M770018N181607N373930N816125
16731A03955378O314871N630919O638986O619125P317315O720803O892868O882387
16723A56972652O821775O111176N238389N088351L899250K945656J450791N46144
16715A89074184n50785j998632k987094m002627n096720n580817o804455o540401
$$ y = [16673760, 17192553, 17621591, 18330687, 18949290, 19574438, 20600035, 21209503, 21935792, 22614817, 23770671, 24314640, 25474062, 26240369, 27712318, 28607586, 29928629, 31120964, 32251907, 33860381, 35567863, 37133749, 38422887, 40382304, 42291749, 44095726, 46535459, 48712457, 51504165, 54273988, 56977821, 60017812, 63035468, 66512536, 69950395, 74272571, 78591393, 82813698, 87583716, 92765323, 98139253, 103955378, 110270249, 115901168, 122540154, 129159279, 136476594, 143197397, 150090265, 156972652, 163794427, 169905603, 175143992, 180232343, 184131593, 187077249, 188528040, 189074184, 188523399, 186524767, 183537673, 179535046, 174438326, 168857509, 162053054, 155512653]
16707A55512653p107638p302265p064651p229214o975910o839982o410874o091526
16699A00490593n824521n762691m954003m716719m529646m108588m362738l472728
16691F2758959l484703l418520l030665k289816k980250k382973k266075j729451
16683D1176506k076848k075301j603640j507428j696898j552659j282927j103964
16675B8276841j084612j166843j211156r34693j034499q77698j134378o31686
16667B0201276p13042r8302j134281p63326p25062k75248p68012o83549l92785
16658A4647669l25612m08277r11514M08063j022168k17248l42939k57427q28661
16649A0741886J0278o19030L73294n88818j93259n38622j84325J80670n32120
$$ y = [155512653, 148405015, 141102750, 134038099, 126808885, 119832975, 112992993, 106582119, 100490593, 94666072, 88903381, 83949378, 79232659, 74703013, 70594425, 66231687, 62758959, 59274256, 55855736, 52825071, 50535255, 47555005, 45172032, 42905957, 41176506, 39099658, 37024357, 35420717, 33913289, 32216391, 30663732, 29380805, 28276841, 27192229, 26025386, 24814230, 23879537, 22845038, 21967340, 20832962, 20201276, 19488234, 19389932, 18255651, 17492325, 16767263, 16492015, 15724003, 15040454, 14647669, 14322057, 13913780, 13002266, 13410329, 12388161, 12170913, 11827974, 11570547, 10741886, 10752164, 10133134, 10506428, 9917610, 9724351, 9185729, 9001404, 9182074, 8649954]
16640H649954l25892l39120M04286p80136J05585j94769m30787j91760K34776
16631G132137l96584m77301J74273l69263J01353k49627j29893j32855J57846
16622E810086l11657n74706J64324J38153l78624L73J68651l35170j17212J34591
16612D698809n00235N89473l67425l02111K39351j67587n77498J13613J08518
16603C834908j42252k13000J07384K95927j68394k94128l54050K23884j53059
16594C137220m0231r6198J29074K01007r2720j05527p3983q8932j85644M6249
16584B830315k86199K5756j49346j9009K77846j92145k36005J91219L2652o3578
16574B411506J46077m16533K7538r3318L62067K2837o55801R8068l9470O1483
$$ y = [8649954, 8324062, 7984942, 8389228, 7609092, 7714677, 7519908, 7089121, 6897361, 7132137, 6735553, 6258252, 6432525, 6063262, 6164615, 5914988, 5785095, 5652240, 5810086, 5498429, 4923723, 5088047, 5226200, 4847576, 4847949, 5016600, 4681430, 4564218, 4698809, 4198574, 4788047, 4420622, 4118511, 4357862, 4190275, 3612777, 3726390, 3834908, 3692656, 3479656, 3587040, 3882967, 3714573, 3420445, 3066395, 3290279, 3137220, 3096989, 3000791, 3129865, 3330872, 3238152, 3132625, 3058642, 2969710, 2784066, 2830315, 2544116, 2569872, 2420526, 2401517, 2679363, 2487218, 2251213, 2442432, 2475084, 2411506, 2557583, 2141050, 2168588, 2075270, 2437337, 2460174, 1804373, 1902441, 1862971, 1924454]
16564A924454J91457q0411l15671o1982k4498q9250O2352J87819p4916j6880J66763
16553A869237j49694J39941l62803M36415m778l43262j24001J69456k82196K2126
16543A370441L0796K9690j9624m1184J16553l18953J17922j24661J64089j52803
16533A172266K64636k85459J34417m59918M18974O1427J11167k59255O3261J68435
16523A389951l70320K97756k40634k22211K01910J27400K09970n04527J66709
16514A056004K11859n52688L15660j25293k1902K79552k85141m21515N86681m2884
16504A000333O3470j42045q8195j20972J76933j56624K0317J1022J3899k1695
16494G56443R0787K32452k27079J46611m41367k3566M14464j36118K32548E06641
$$ y = [1924454, 2115911, 2035500, 1719829, 1657847, 1633349, 1544099, 1606451, 1794270, 1719354, 1702474, 1869237, 1719543, 1859484, 1496681, 1933096, 1928318, 1585056, 1461055, 1630511, 1348315, 1370441, 1401237, 1430927, 1411303, 1370119, 1486672, 1167719, 1285641, 1160980, 1325069, 1172266, 1436902, 1151443, 1285860, 825942, 1244916, 1306343, 1417510, 1158255, 1221516, 1389951, 1019631, 1317387, 1076753, 854542, 1056452, 1183852, 1393822, 889295, 1056004, 1267863, 715175, 1030835, 905542, 883640, 1163192, 878051, 456536, 1043217, 1000333, 1063803, 921758, 833563, 712591, 889524, 732900, 753217, 764239, 778138, 756443, 847230, 1079682, 852603, 999214, 557847, 534281, 948745, 812627, 1045175, 506641]
16483G11532J83793l19746J66483j35144K5611k77765K24477L40607m11842M66231
16473I74237j81490J96965l11881k5256j55892j7673K86295j79384R1301n8635
16463F18587K67040C66056L77222k26574j69969J16732L1334q1975J20157m4829
16453D88154Q2085p5448Q5861J67222C56952Q0602j73075J66735j29326L46293
16443F48181j12591A79428L78271j5214R1623r0113J15778j07330B55096L55825
16433F10921A85007J95553I761M41161J97427j06832L61570l28979R0690j72681
16423D92117L870M6586j74920L8763R6803F3970L38905j2525L9019J87477B50556
16411B01603J6243M83959j81874j37422J3169j01702J11901n382L7374J59642
$$ y = [711532, 895325, 575579, 742062, 606918, 632529, 354764, 579241, 919848, 508006, 974237, 792747, 989712, 677831, 652575, 496683, 479010, 765305, 585921, 677222, 618587, 885627, 366056, 743278, 516704, 346735, 463467, 494801, 412826, 532983, 488154, 570239, 494791, 580652, 747874, 356952, 437554, 264479, 431214, 301888, 648181, 535590, 179428, 557699, 542485, 634108, 543995, 659773, 552443, 255096, 610921, 185007, 380560, 9761, 450922, 648349, 541517, 903087, 574108, 664798, 492117, 495987, 542573, 367653, 406416, 503219, 63970, 402875, 390350, 429369, 616846, 250556, 201603, 217846, 701805, 519931, 382509, 395678, 293976, 405877, 400495, 437869, 597511]
16401E97511j00809q9502O897L39689l49134j44848J86143m8431Q7419J69743
16391F54678k58586j67847D9611J46093L09613n314l1987A81255P6693A1158f3747
16379B46377l6549k5724a93471C85664j50821I7991L29600k07419P01r840J30893
16368C41926J28194F6801N54012k18711A86737a7900B45857P71J20689l4883j6648
16357C15786j37039J03511J01997A13254L3699O9990M21032B56419n9247L4158
16347B31330o7665G9349K8131L43892j38046m385J1206B6294K72802A4172M54302
16336D68474q4530O2157g968E6197L67067M8885k00857j08535J98573p6557I4683
16324A94994J35415A32797L4281l9322d1349a6276j1130C00941J12J8665k0063
$$ y = [597511, 496702, 407200, 414097, 753786, 404652, 259804, 445947, 397516, 484935, 654678, 396092, 228245, 49611, 195704, 505317, 500003, 468016, 181255, 257948, 11158, -63747, 246377, 209828, 184104, -193471, 385664, 234843, 97991, 427591, 220172, 220873, 211033, 341926, 470120, 66801, 620813, 402102, 186737, -17900, 245857, 246628, 367317, 332434, 315786, 178747, 282258, 384255, 113254, 146953, 216943, 637975, 256419, 197172, 231330, 163665, 79349, 107480, 451372, 313326, 308941, 320147, 26294, 299096, 14172, 468474, 383944, 446101, -7968, 56197, 423264, 472149, 271292, 162757, 361330, 284773, 94683, 194994, 330409, 132797, 167078, 127756, -41349, -16276, -27406, 300941, 301053, 319718, 299655]
16313B99655A05725A6649Q6971A0552Q6079d7079B46545j1816g9844B10176c4847
16301A73909O1827d9050D1937J11860l3577B0578d498A90721N7081f1291A00773
16289I839P6008N6194b52733e93A72353i1275a4454B12208B2139K84064N1670
16278C57873A47689p3834M86870A4906J11387K71731a68763E0411J89913m3192
16268A97132B4721a04469A27158K48557A15086e3607B46264e6118C03455k5572
16258B77883A38840J70439e50j65231f7147B70485A24766K29126E2369L00006
16248C52375g2977B7281a19819H5722J95148c3752C07573l8403G2936a55602j72689
16237c28291a25689C65448A9536Q8305L6764a12449A76457m9162e3523B4848M504
$$ y = [299655, 105725, 16649, 103620, 10552, 96631, -47079, 246545, 234729, -79844, 210176, -34847, 173909, 235736, -49050, 41937, 153797, 120220, 20578, -4498, 190721, 247802, -61291, 100773, 9839, 85847, 142041, -252733, -593, 172353, -91275, -14454, 212208, 22139, 306203, 357873, 147689, 73855, 560725, 14906, 126293, 398024, -168763, 50411, 240324, 197132, 24721, -104469, 127158, 375715, 115086, -53607, 246264, -56118, 303455, 277883, 138840, 309279, -550, -165781, -67147, 270485, 124766, 353892, 52369, 352375, -72977, 27281, -119819, 85722, 280870, -33752, 307573, 269170, 72936, -155602, -328291, -125689, 365448, 19536, 107841, 144605, -112449, 176457, 127295, -53523, 24848, 29352]
16226B9352N6602R7236d5899A04325Q2741c2195A58328P5467A10769N4777A0146
16214i4862A14457n5107K3578M2359j7001m924A5486J99086G5428L4144b43385
16202A87501l8678a3956J265j33746A80764n2413b63337G5285J37963C6541b3773
16190b3917m7543B34129c59656I7455a11093l1987j92822A04227j3719h6510j52807
16179b39317q6174i6563n9669A74204a8491n1735k17064A62428c9262j19819B75233
16167d55086A85857J78164h332D24381E1211a79050A113L52562B7415J55932D4977
16155f6111B10812e9394B33666d0031j4251G5432J48642B629a51285F6221a41670
16143A53749J08769p6691e6300A32271n0649C4512a42013A77350o5232i9461A71155
$$ y = [29352, 85954, 183190, -45899, 104325, 187066, -32195, 158328, 233795, 110769, 165546, 10146, -94862, 114457, 59350, 82928, 125287, 108286, 103362, 15486, 214572, 75428, 109572, -243385, 187501, 148823, -13956, -12691, -146437, 180764, 128351, -263337, 75285, 213248, 36541, -23773, -23917, -71460, 234129, -359656, 97455, -111093, -143080, -335902, 104227, 90508, -86510, -239317, -325491, -96563, -156232, 174204, -18491, -70226, -287290, 162428, -39262, -159081, 275233, -455086, 185857, 364021, -8332, 424381, 51211, -179050, 1113, 353675, 27415, 183347, 44977, -66111, 210812, -59394, 233666, -40031, -54282, 75432, 224074, 2629, -151285, 66221, -141670, 153749, 262518, 185827, -56300, 132271, 81622, 34512, -142013, 177350, 112118, -99461, 171155]
16131C56709j48721G4853e2400A03920a49679B59811b78602e5102j1389a470j5773
16120a7243A50994P6539F0067K9709a89093f6227k5301G0011a88973D5796b54418
16108c29197F8335O0337K18637a0294A86947o3131g5676c7241E1843b6410F4540
16096A74848H3194J75820m2560K03031h1740j85167A05756b14830D3145K40282
16086B83427H2337a01201H5863c02556B81676H2260b08656C60880E2212a42028
16075a42463J3012E5730B7747J61575f3938c1807q3983A31809a40840B10338A01743
16063f01154g900E3840a97072A50600e5278D8891k2714a48267N3533q812K641
16052a00905C03053F663c51011A30642c51237Q0682B82660b16857L3608K6431
$$ y = [356709, 207988, 74853, -52400, 103920, -149679, 259811, -278602, -55102, -66491, -1470, -17243, 150994, 227533, 60067, 89776, -189093, -66227, -91528, 70011, -188973, 45796, -254418, -329197, 68335, 128672, 347309, -10294, 186947, 123816, -75676, -37241, 51843, -26410, 64540, 174848, 83194, 259014, 216454, 419485, -81740, -266907, 105756, -214830, 43145, 283427, 82337, -101201, 85863, -302556, 281676, 82260, -208656, 360880, 52212, -142028, -142463, -129451, 55730, 27747, 189322, -63938, -31807, -115790, 131809, -140840, 210338, 101743, -601154, -7900, 53840, -197072, 150600, -55278, 48891, 26177, -148267, -94734, -103546, -100905, 303053, 6663, -351011, 130642, -351237, -270555, 282660, -216857, -183249, -156818]
16042a56818B2264K8977b09036A42307a97220F2940a78997H0381a19791A70552
16031A78314G093b64040B4101P5960g6518E0898a61344e3023b5573r0409n7009
16020a72991B16190b4815q4211J3732r6004E2159K6135c8547k58512h6135n0934
16009a37069C3486b36356a5985B27303o9854a73420g274n7992c0980n3100J5479
15998f8601I1192c47046R4499A79248c37254P2351B5587K7680b25099B17323j4947
15987B02376J69050A34658J46562H4017Q4546L41595K55174B05587P2870L4783
15977C13240b14220B68792f7866k44462e1285C00049H7602J9093N4014a3703k18116
15966b31819N1263B13468F0699a11651A23182a86346B40639b03187A20791g2715
$$ y = [-156818, 22264, 51241, -209036, 142307, -197220, 62940, -178997, 80381, -119791, 170552, 178314, 7093, -264040, 24101, 100061, -76518, 50898, -161344, -53023, -25573, -115982, -172991, 216190, -24815, -109026, -95294, -191298, 52159, 78294, -38547, -297059, -86135, -137069, 33486, -236356, -15985, 227303, 157449, -173420, -7274, -65266, -30980, -84080, -68601, 91192, -347046, -252547, 179248, -337254, -264903, 25587, 53267, -225099, 217323, 202376, 371426, 134658, 281220, 84017, 168563, 510158, 765332, 205587, 278457, 313240, -214220, 268792, -67866, -312328, -51285, 300049, 87602, 106695, 160709, -13703, -231819, -180556, 213468, 60699, -111651, 123182, -186346, 240639, -203187, 120791, -72715]
15955A25904b39402Q6697B19006a02937L6033k07754J05669F8149j5197a96769
15944c44718N138a11037k5445c2429F2847e4513C16091a10780j21016B50478e3274
15932C42049b05679j12678L0165c1267Q469Q586A27249h7011L2984l4978A68826
15920a21757o321F1849b28727c9337G7360O3450g2143f384j10600f654j85050
15909a91704A4776a10554D31917B00514d02259J64761Q8188B75529b13597A93750
15898C33450a22045M0050A34365b63494I6935a36641E5138e1919E0278J72b26803
15886A44721l1287B014c62996a08925b8504j15566k7186C73679i5430B83685b33673
15874e8878Q946o7478d1029r5585H1676l1448N7875d7903C5238J6072c11567p2121
$$ y = [125904, -239402, -152705, 219006, -102937, -66904, -274658, -168989, 68149, 52952, -196769, -344718, -339580, -111037, -136482, -32429, 62847, -54513, 316091, -110780, -231796, 250478, -53274, 342049, -205679, -318357, -288192, -31267, -22798, -14212, 127249, -87011, -54027, -89005, 168826, -121757, -128078, 61849, -228727, -39337, 77360, 140810, -72143, -6384, -116984, -6654, -191704, 14776, -110554, 431917, 200514, -402259, -237498, -149310, 275529, -213597, 193750, 333450, -122045, -81995, 134365, -263494, 96935, -136641, 55138, -51919, 50278, 50450, -226803, 144721, 113434, 2014, -362996, -108925, -28504, -144070, -171256, 373679, -95430, 283685, -233673, -58878, -49932, -117410, -41029, -136614, 81676, 50228, 108103, -47903, 35238, 51310, -311567, -383688]
15862c83688a16365B02115i2970A29465n8928a66295D6897j063h2132E6789j8185
15851C8604a92966E9052a46063G0668P109A1501e1769A17095b46493A93128a84470
15839a79985p08J6809A64546J05779a68520B9364a58471N3335I6280J94983g0024
15827a77074p8936A08226b30763a13028B11148a87085a8950a251A26774b30604
15816b80288J13551j45698J32704B7923a56341L2019F7952c09998a1736A26710
15805B62846e9449j60336D3081g7818H0239A236a06848b6780l4617F5975L23447
15794C89422a9891n2490A34359O4575d4402A92624b69517k7434L9010A53510J07878
15783B61388G8167C662e7816o3771j23514n2126f7597C711d14317e5014A12774
$$ y = [-383688, -116365, 202115, -92970, 129465, 70537, -166295, 46897, 45834, -82132, 56789, 38604, -192966, 59052, -146063, 70668, 77777, 11501, -51769, 117095, -246493, 193128, -184470, -179985, -180693, -163884, 164546, 270325, -168520, 29364, -158471, -105136, 96280, 291263, -70024, -177074, -256010, 108226, -230763, -113028, 211148, -187085, -18950, -1251, 126774, -230604, -280288, -166737, -312435, -179731, 27923, -156341, -124322, 67952, -309998, -11736, 126710, 262846, -59449, -219785, 43081, -77818, 80239, 1236, -106848, -26780, -61397, 65975, 389422, -19891, -72381, 134359, 198934, -44402, 192624, -269517, -296951, -257941, 153510, 261388, 78167, 3662, -57816, -121587, -245101, -297227, -67597, 3711, -414317, -55014, 112774]
15771a53115l803J5689A15048c20907B67521c13269a252C7462J532P6930f8737
15759A7864M6528h8450A6348M59186g0410j60578C1923a4768I2026K53125f8224
15747B0073K9614o754J12629b42455P7354B6613J97243d0261A76010J50983a3443
15735C101P3384J8718a36913E1894a95306A88862h7961B26718e9339C21316f4797
15723i0026C03207A42570m2172b32280k309A00424B5129g856m4056j16142a7380
15711A4079b00249d1903k49348H526a66107C86270E2985a12272j55573K397H8503
15699b13747a4140A68593f7472c3408k28870A73455a93823C53251j55445h7722
15688E8813b63589B4025J70901c45324P8172E4753c3355B32025n6930l3112i7348
$$ y = [-153115, -156918, -141229, 115048, -320907, 267521, -313269, -1252, 37462, 38994, 115924, -68737, 17864, 64392, -88450, 16348, 475534, -70410, -230988, 31923, -14768, 92026, 345151, -68224, 20073, 49687, 42933, 155562, -242455, -165101, 26613, 223856, -40261, 176010, 326993, -13443, 3101, 76485, 95203, -136913, 51894, -195306, 188862, -87961, 226718, -59339, 321316, -64797, -90026, 303207, 142570, 100398, -232280, -234589, 100424, 25129, -7856, -51912, -168054, -17380, 14079, -200249, -41903, -291251, 8526, -166107, 386270, 52985, -112272, -267845, -265448, 88503, -213747, -14140, 168593, -67472, -33408, -262278, 173455, -193823, 353251, 197806, -87722, 58813, -263589, 24025, 194926, -345324, -267152, 54753, -33355, 232025, 175095, 141983, -97348]
15676c61726J19457D5334J6704a41229B70203C0696b95727B37279d5828j01057
15666a46885H7149c61544a59648F5136c51325G7635b42327A48226a92641a8562
15655c9853r3827b7329I5618A8374b17765G7639k8621a52129L6827e274B09609
15643a69766B89697f4548j34085A06882m5538p520O2086j5589e3432F9950K4122
15632I4072K52559A1304b87797p2903a17603I450d202A59492a0049B79354b67847
15620a19135I0655N943B441K07075c3494A63825c2062A59994a92690A77981q7400
15609I0581b11104j6484H2402b18424j19366A07438a4470A33631o4438a78120
15598a58171A53573a00979j7627k21453j2739J75064A69403a09950F9520b73460
$$ y = [-361726, -242269, 45334, 62038, -141229, 270203, 30696, -295727, 237279, -45828, -146885, 87149, -361544, -159648, 65136, -351325, 77635, -242327, 148226, -192641, -18562, -39853, -133680, -27329, 95618, 18374, -217765, 77639, 49018, -152129, -115302, -5274, 209609, -169766, 289697, -64548, -198633, 106882, 61344, 53824, 115910, 100321, -53432, 69950, 94072, 346631, 11304, -287797, -360700, -117603, 9450, -4202, 159492, -10049, 279354, -267847, -119135, 90655, 96598, 2441, 209516, -33494, 163825, -32062, 159994, -192690, 177981, 90581, -211104, -227588, 82402, -218424, -337790, 107438, -14470, 133631, 69193, -178120, -158171, 153573, -100979, -118606, -340059, -352798, -177734, 169403, -109950, 69520, -273460]
15587a44408b7481B15708e9314A88532a987l7136B07155D9121j2813M585b7058
15575a46113B16471a50315f332C377d00181C1124L5750j1287b55353C3237g3071
15563B61111B9869O9243K5286e9373k71457F7358e00728a460A13818D4760A9175
15551a94824n9159b5729b645A6190M7811a72587j13228D6687a06946A29701J2434
15540A42135a02724a5109k14923B14047I9039b44959h1783j50356R8179B30458
15529I5761C0258O1820b43095a4780A84622b40161C4715L11837j26935A02015
15518A20985D4346i4872D1571O5445o990b7025i053j4119A73961b21539a07179
15506A91570p2124g6452A2206b51536c954A22980B6979K6764J97923A58R1930
$$ y = [-144408, -27481, 215708, -59314, 188532, -1987, -39123, 207155, 49121, 36308, 40893, -27058, -146113, 216471, -150315, -6332, 3377, -400181, 31124, 66874, 55587, -255353, 33237, -73071, 261111, 29869, 99112, 124398, -59373, -330830, 67358, -500728, -1460, 113818, 44760, 19175, -194824, -253983, -25729, -2645, 16190, 64001, -172587, -285815, 46687, -106946, 129701, 142135, -102724, -15109, -230032, 214047, 99039, -244959, -81783, -232139, -133960, 230458, 95761, 30258, 92078, -243095, -14780, 184622, -240161, 34715, 346552, 219617, 102015, 120985, 44346, -94872, 41571, 107016, 100026, -27025, -9053, -23172, 173961, -221539, -107179, 191570, 119446, -76452, 12206, -251536, -3954, 122980, 26979, 53743, 251666, 158, 92088]
15495I2088a52031p8232Q5034O9951j23619B2240c02918Q6166a02210g324A94953
15483E5894N5591i7552P336B33780a5674m4024j9051j9078D4138d8944k3918A24511
15470i4702M4750B00102c43034a8636A27113r571L8967k7715f7674k08874B41882
15458I3221c4876D448c654A25166B289P1401K04032b70034C8894b25069K3681
15447b01388j96536a5722A55718o4691J46045a73944A37617a27812F0560Q8879
15437A49439L3516C1305f8687A08400A7641h222l6127C3018d39455B30394a3271
15425c89561a94201g608j57096j4880C01401A48143I545a84032d54m5726k78463
15414c24643A58050b72071D4236R5550K83854a0891j25735D8814j9871j3504c321
$$ y = [92088, -152031, -230263, -145229, -75278, -198897, 22240, -302918, -216752, -102210, -7324, 194953, 55894, 111485, -97552, -90216, 233780, -15674, -59698, -78749, -97827, 44138, -48944, -72862, 124511, -94702, -49952, 200102, -343034, -18636, 127113, 117542, 156509, 128794, -67674, -276548, 241882, 93221, -34876, 4448, -3654, 125166, 2289, 73690, 277722, -270034, 38894, -225069, -201388, -397924, -15722, 155718, 91027, 237072, -173944, 137617, -127812, 60560, 149439, 182955, 31305, -68687, 108400, 17641, -8222, -44349, 33018, -439455, 230394, -13271, -389561, -194201, -7608, -164704, -179584, 301401, 148143, 9545, -184032, -454, -46180, -324643, 158050, -272071, 44236, 139786, 423640, -10891, -136626, 48814, 28943, 15439, -3321]
15402b94211i146k26497a4041l82415B11000c9845I4985g064k32783e0718l11884
15391c62602a29793A52161a42551l5034B50815H9628f7960A47724b4482Q641l8841
15380e4682o3896B1400O0873A9655L1977J49665F9878Q1622F4753a93120N5690
15369a37430D4438b91038A55777b28224b2196j0127C20037f2911C32248I7951
15358B0011L52994b55774J21860j53805a37318A01843J00382I1996a56797A57177
15347A41606c11315A71896c70151A4787b23045i4155A42048b5884o6242B96344
15336A1230P5453J001M5071a79768B316d4424l7285m5541k56647A21504a40182
15324i715E7147r201a64292O5180C4438M143J56135d07587G7545c53223C57883
$$ y = [-294211, -9146, -235643, -14041, -396456, 211000, -39845, 94985, -7064, -239847, -50718, -362602, -129793, 152161, -142551, -177585, 250815, 89628, -67960, 147724, -24482, -15841, -54682, -118578, 21400, 82273, 19655, 51632, 201297, 69878, 151500, 64753, -193120, -137430, 44438, -291038, 155777, -228224, -22196, -32323, 320037, -62911, 332248, 97951, 20011, 373005, -255774, -133914, -287719, -137318, 101843, 202225, 91996, -156797, 157177, 141606, -311315, 171896, -370151, 14787, -223045, -94155, 142048, -25884, -92126, 296344, 11230, 86683, 87684, 132755, -179768, 2316, -44424, -81709, -127250, -383897, 121504, -140182, -9715, 57147, 47946, -164292, -99112, 34438, 38581, 194716, -407587, 77545, -353223, 357883]
15312B43412a38663B0724O6760J22600e7919B07585F0964O8472c4464A8242R1307
15301A09549n0442K37924A33746a82454d3515C16124F9938a8619A74043O3729
15291B37772a3368B11661d97972A45489E3154J77605i4522A23053p679b66665
15280A90177a23400K3616C53920I9387J37828H2076b5790C64770A36947J33730
15270B70677l9689h2388J2889A00628D4206b9490B09705J06659A52146d3392C9275
15258B07081N9595H4642g5372B77198A00872P0642A256N3015L45925A03993M61267
15247E65260J215286n65273j12059J28830C61879O5271D3503L01135C4474L76405
15237D10879j63638D1445d6361F3066j3191L8476Q8824i1403B37075A06591L2467
$$ y = [243412, -138663, 20724, 87484, 210084, -57919, 207585, 60964, 129436, -34464, 18242, 109549, 59107, 297031, 133746, -182454, -43515, 316124, 69938, -18619, 174043, 237772, -13368, 211661, -497972, 145489, 53154, 230759, -94522, 123053, 115374, -266665, 190177, -123400, -99784, 353920, 99387, 237215, 82076, -25790, 364770, 136947, 270677, 230988, -82388, -69499, 100628, 44206, -29490, 209705, 316364, 152146, -43392, 39275, 207081, 266676, 84642, -75372, 277198, 100872, 171514, 1256, 54271, 400196, 103993, 565260, 1780546, 1215273, 1103214, 1232044, 361879, 427150, 43503, 344638, 34474, 410879, 247241, 41445, -46361, 63066, 49875, 88351, 177175, -91403, 237075, 106591, 139058]
15226A39058a69801e5650K4378k73964D29632C4431c9243C5518L48580A80329
15215B54135a73217M1436c2246C83660A19687a65881O2947l2642j9534j1903C13151
15203b40814e9956A93516a26419A4409K56902o8937r1446C2185K10291A3440b72058
15191C33825q5067j9779a46757D52847a87660G9667a59172k59966A48314N621
15181A53935J76628d3504A3193b35984C75693A50139D3202P2666R7961e9468B00229
15169C05162b08933C28147n3631H9221Q559b1403C53686a76791Q7433E0507J1241
15158F1748i8271F2886B4561A127c46558I5878J34274E16b0019B84108m5715a55460
15145b5374I1596M8979C1448K34862J14707J01832g5744j75874A20400N5534Q6096
$$ y = [139058, -169801, -55650, -31272, -305236, 429632, 34431, -39243, 35518, 384098, 180329, 254135, -173217, -131781, -32246, 383660, 119687, -165881, -102934, -135576, -155110, -167013, 313151, -240814, -59956, 193516, -126419, 14409, 271311, 202374, 110928, 32185, 242476, 13440, -272058, 333825, 248758, 228979, -146757, 452847, -187660, 79667, -159172, -419138, 148314, 153935, 330563, -43504, 13193, -235984, 375693, 150139, 43202, 115868, 213829, -59468, 200229, 305162, -208933, 328147, 274516, 89221, 97780, -21403, 353686, -176791, -89358, 50507, 61748, -98271, 62886, 24561, 1127, -346558, 95878, 230152, 516, -20019, 284108, 238393, -155460, -25374, 91596, 140575, 31448, 266310, 381017, 482849, -75744, -251618, 120400, 175934, 262030]
15134B62030i1457r3191g4220B52517p6510o6519K73391a64024F3670L31751A24396
15122C04620A06197L9059J69357A16701b08966I0151L18240j62110a06676E9933
15111A48562B4745K51127b49331A46755Q8271r2790J49706Q6020H2574C9105K8231
15100F7336a20642A77561c6782l0919b6065C08153A04654N5459n6877N2034a82003
15088e4871C03393q5162K2376C0428a70676B76621j8058I3166G426h54m5064r1086
15076a37004j43699B71871A01335d9254j0231r9373a0031D29512D116L28875q0938
15065B52053l7914c39751A09461C1321L42534E3644b16336B36127R8063j32281
15055B01909J40735F2770a42319A18461J33766A11572L26688j74993L8968J24476
$$ y = [262030, -91457, -184648, -74220, 252517, 176007, 109488, 382879, -164024, 63670, 395421, 124396, 304620, 106197, 145256, 314613, 116701, -208966, 90151, 408391, 246281, -106676, 59933, 148562, 24745, 275872, -249331, 146755, 235026, 142236, 291942, 377962, 82574, 39105, 67336, -120642, 177561, -36782, -67701, -26065, 308153, 104654, 160113, 103236, 155270, -182003, -54871, 303393, 218231, 240607, 30428, -170676, 276621, 258563, 93166, 7426, -854, -45918, -137004, -280703, 271871, 101335, -49254, -59485, -158858, -10031, 429512, 4116, 332991, 252053, 214139, -339751, 109461, 31321, 373855, 53644, -216336, 236127, 334190, 201909, 342644, 62770, -142319, 118461, 252227, 111572, 438260, 263267, 302235, 426711]
15045D26711r7091j09624J90632A73871J9132q9347J27728R7070j33905L0565
15035B25114K61215A00651P6485R4461E4638R1069J52574p1363d2594A83561i5827
15023C15352l769b35279A36142L1185K8907F6619K74059K44658B07718J55069
15013C62787A19724K81106A35986k2566K84350A81659K0210J40725A39757j6877
15003A22880K08769C0143L16352j28528J57957j37841J3984l8329K96786E7819
14992A54107R4739G2443K99741F2272e1029B84116q6853E544M27603J47558F5509
14980A27299L62790D7031P3645K97553j07669A21958J28046A22016L2491K018
14970A56525E0699L81233A08017K16866p8154k3782L65709B44084H2459N2783
$$ y = [426711, 329620, 219996, 410628, 173871, 193003, 103656, 231384, 328454, 194549, 225114, 486329, 100651, 177136, 271597, 54638, 145707, 298281, 226918, -42594, 183561, -95827, 315352, 311583, -235279, 136142, 167327, 196234, 66619, 340678, 585336, 207718, 362787, 119724, 400830, 135986, 113420, 397770, 181659, 201869, 342594, 139757, 122880, 331649, 30143, 346495, 217967, 375924, 238083, 252067, 213738, 510524, 57819, 154107, 248846, 72443, 372184, 62272, -51029, 284116, 197263, 5544, 433147, 580705, 65509, 127299, 490089, 47031, 120676, 418229, 310560, 121958, 250004, 122016, 154507, 156525, 50699, 431932, 108017, 324883, 246729, 222947, 588656, 244084, 82459, 135242]
14960A35242J18679J67505A33710J81325j1103R5490D5150K73878C9827P0320
14950A10147m8206J69971K87554j09215n5803M9594j96252e3867D69632n4396
14940D15236A79532C6321K9512R9845e8700D73414L5j36662h484A72991B6506
14928H0409M59348l3890B11302L52774B41353R3436M60504l71709l4533O8014
14918D57065a0204D91673j30944j45820K02307A99780L15246B48005q3803L48511
14908E12713A18852K56430G050K03590I1193L77406I2905L13777j9314D8112K45915
14897B94027M43053E0361e4531A30236K77817j21984N3392R080R0839j5823q6274
14886C37283M0231L72095j13950B22379c082C49617A1071M50927L7690B35808
$$ y = [135242, 253921, 421426, 133710, 315035, 303932, 399422, 45150, 319028, 39827, 110147, 61941, 231912, 519466, 410251, 354448, 404042, 207790, -53867, 469632, 415236, 179532, 36321, 65833, 165678, -58700, 473414, 473449, 336787, -8484, 172991, 26506, 80409, 539757, 505867, 211302, 564076, 241353, 334789, 795293, 423584, 389051, 457065, -10204, 491673, 360729, 214909, 417216, 199780, 515026, 248005, 164202, 512713, 118852, 375282, 7050, 210640, 91193, 468599, 92905, 406682, 387368, 48112, 294027, 737080, 50361, -54531, 130236, 408053, 286069, 339461, 348541, 439380, 423557, 337283, 377514, 749609, 635659, 222379, -3082, 349617, 11071, 461998, 499688, 235808]
14875C44778p8280m5308m2997R8697N7410O8385A41217J94583m9789J18892R6033
14864E00936B44309n4498K71833q2340l5749J0362A58617O58508B27933N330J31734
14853C64997M2075J88772J11714k27849R3795O628j88738k5160M5131A20811K60216
14842C81027K74989B05277H0816N05490k87510A11746L85309J44000j71754J78981
14832F48282j90611N242r3910N7807K49324j57536K49169j57967B61999J80003
14822D42002o8488K39275j61768o287Q107K2423j44970N26453D07915N9343k21309
14811B45949K83066A93747M39564k28446j42283N71991C62892A23677K80875N07656
14801I12208l57915j78903K48947B61265i4654F25872j87659j64903Q7888A00703
$$ y = [344778, 266498, 221190, 178193, 276890, 334300, 402685, 141217, 335800, 286011, 404903, 500936, 244309, 189811, 461644, 379304, 343555, 353917, 158617, 817125, 227933, 233263, 364997, 407072, 595844, 707558, 479709, 573504, 580132, 391394, 366234, 411365, 120811, 381027, 656016, 205277, 80816, 586306, 298796, 111746, 497055, 641055, 469301, 648282, 457671, 462913, 369003, 426810, 676134, 518598, 767767, 609800, 261999, 442002, 373514, 612789, 451021, 444734, 452841, 475264, 330294, 856747, 407915, 467258, 245949, 529015, 193747, 633311, 404865, 262582, 834573, 362892, 123677, 404552, 912208, 554293, 375390, 624337, 261265, -94654, 625872, 438213, 273310, 361198, 100703]
14790D49071R1568j06999o4795K90020r3435k25701R6077P9143P3238P2853B77532
14778G25121C58904J80310Q085J9030J93959p1728J19623k42366K44641J7529
14768H27987o6311J4449C32076L48617r2532K30714r2264n8575J437j227J46131
14757H14377k96506O2103j66032J49520J59074j06735J63671C89537O30403k09733
14747H10207k03390K22687k42156L58310l02025J64595l46613M1653K96911j35184
14737F64995R1702j85686K43559l8979R3892m19789K85552p2392k9452J32890
14727G66292O4044k62049L37931N3919J07127l02645p0450J58543j09813J57116
14717I00015k4592k95621J44138L75941m23576K16520k45964J06797K80342p9333
$$ y = [449071, 540639, 433640, 368845, 658865, 565430, 339729, 435806, 514949, 588187, 661040, 277532, 725121, 358904, 539214, 547299, 566329, 760288, 688560, 808183, 565817, 810458, 827987, 761676, 776125, 332076, 680693, 588161, 818875, 726611, 668036, 669473, 668246, 814377, 517871, 579974, 413942, 563462, 722536, 615801, 779472, 389537, 1019940, 810207, 606817, 829504, 587348, 945658, 643633, 808228, 461615, 503268, 800179, 664995, 756697, 571011, 814570, 775591, 869483, 449694, 735246, 662854, 633402, 766292, 830336, 568287, 906218, 960137, 1067264, 764619, 694169, 852712, 742899, 900015, 875423, 579802, 723940, 1099881, 676305, 892825, 646861, 753658, 1034000, 954667]
14707I54667j21634m8464j00475K8481K73831l10536K45749l15592J85721J54805
14697I46553j69663M47349n44018N27191m36594m4462q8783K74452R5881j94377
14687H13529J26109k05696K22000k7486o403l0027K13349j57690o5038M00842
14677A283489m44567l2686j3442M9794Q3461Q4415J11172k50615J72109m0574
14667A002556p9193J89859j71820q5877K28811j76406j24901l2107L46816n8988
14657A038750J28014J27300m88548J92674J23679j54403j07552j42672L52388
14648A069630j11126N6988M490Q3782L33188j25705o116k16920J28890o3605L8783
14637A192279K00050L7613m025r9440k10856L8233K85379k72652K35636m7691
$$ y = [954667, 833033, 784569, 684094, 712575, 986406, 675870, 921619, 606027, 791748, 946553, 776890, 1224239, 680221, 1207412, 770818, 726356, 637573, 912025, 1007906, 813529, 939638, 733942, 955942, 928456, 922053, 892026, 1105375, 947685, 882647, 1283489, 838922, 806236, 792794, 842588, 926049, 1010464, 1121636, 871021, 1043130, 1002556, 923363, 1113222, 941402, 855525, 1084336, 907930, 783029, 750922, 1097738, 1038750, 1166764, 1294064, 805516, 998190, 1121869, 967466, 859914, 717242, 1069630, 958504, 1015492, 1019982, 1103764, 1436952, 1311247, 1305131, 1088211, 1217101, 1153496, 1192279, 1392329, 1429942, 1425917, 1326477, 1115621, 1153854, 1439233, 1166581, 1402217, 1354526]
14627A354526L12398m54879M2170J19061k75523M44981l38030N1193K40828j3559
14617A483166p2302R7355R1240K06064n55615J8573m1509N63883j82617k05530
14607A402708J41254M7936k70932J28881R6084K88438m01016J24879L90421l99806
14597A548847R6141K13665k42920J0614K4888q4119n6136J61386m2486P1558L47147
14586B048585j46212l03224J54674M5815L21891j78256J54304k58601l9256K74058
14576B073778j33514K33668j18548J21562l8441k16569K53790l3181j55741K18416
14566B205220N8108O4879p0362O4335L82059l53834M17787K30053J19296l61483
14556B756058M04016J85178L61K53192P69591K26890N73960J597697L799108Q380451
$$ y = [1354526, 1666924, 1212045, 1254215, 1373276, 1097753, 1542734, 1204704, 1255897, 1496725, 1483166, 1410864, 1508219, 1599459, 1805523, 1249908, 1268481, 1226972, 1790855, 1608238, 1402708, 1543962, 1591898, 1320966, 1449847, 1545931, 1834369, 1433353, 1558232, 1948653, 1548847, 1644988, 1858653, 1615733, 1626347, 1651235, 1567116, 1510980, 1672366, 1629880, 1701438, 2048585, 1902373, 1599149, 1753823, 1799638, 2121529, 1943273, 2097577, 1838976, 1799720, 2073778, 1940264, 2173932, 2055384, 2176946, 2138505, 1921936, 2175726, 2142545, 1986804, 2205220, 2263328, 2328207, 2257845, 2322180, 2704239, 2350405, 2768192, 2998245, 3117541, 2756058, 3160074, 3345252, 3345613, 3598805, 4368396, 4595286, 5169246, 6766943, 10566051, 18946502]
14546A8946502K4297955K082418A9927877q840367E255745k056985j048394j38781
14538B011585k58793K11719l37410K70939K4306K63092L7653k74111L11881m18964
14528A841897K33125l7679L66875l88284J77155L34896j44226J5009J95889j05060
14518B489597K3498p3643J51317J79635R8132N7810m8463j99088L46266m00922
14508B624139m1928J98609L04665l90013J25234J50213m6036p0378K70607m2680
14498C082432l4539M48811n10764K86120j25672l1712J66643R2204K63629j47288
14488C489864j31155L56986o98j7695k14559J28191Q7348L828K71945O6665j87076
14477C853644J93641j75007J8786K94127J54987j0076j58825K54586l17444J81348
$$ y = [18946502, 43244457, 45326875, 19927877, 11087510, 5255745, 3198760, 2150366, 2011585, 1752792, 1964511, 1627101, 1898040, 1922346, 2185438, 2223091, 1948980, 2260861, 1841897, 2075022, 2037343, 2404218, 2015934, 2193089, 2527985, 2383759, 2398768, 2594657, 2489597, 2513095, 2439452, 2590769, 2770404, 2868536, 2926346, 2877883, 2678795, 3025061, 2624139, 2582211, 2780820, 3085485, 2695472, 2820706, 2970919, 2924883, 2854505, 3125112, 3082432, 3047893, 3496704, 2985940, 3272060, 3146388, 3114676, 3281319, 3373523, 3637152, 3489864, 3358709, 3715695, 3714997, 3697302, 3482743, 3610934, 3698282, 3702110, 3974055, 4040720, 3853644, 4047285, 3872278, 3891064, 4185191, 4340178, 4330102, 4171277, 4425863, 4108419, 4289767]
14467D289767O9194L05206k76001K32026m1757J22263j27819K03400j05243M33448
14457E104484n65775M44803j76878L51500k40645L98277k63517J83161J90325
14448E425735k99317L71889Q2312J8814J94499Q126J53166l13765J86188L58080
14438F185727l6579j24456K35281l2727j25627M03696K49325j92072Q6590M94024
14428G143182j79942K09993l04960N47916j7616J87721k23179Q9217K10577j40330
14418G522579O45048j22681N35892J89526o8602k23901M4239L94205Q8486K45194
14408I249985M31772l36820K34152j36153L55952O6881M39529j61535M55376k50939
14398A0348200L16577K37343L26157K5853L7940L71496K45859J63967K53134k7624
$$ y = [4289767, 4358961, 4664167, 4388166, 4620192, 4578435, 4700698, 4572879, 4776279, 4671036, 5104484, 4538709, 4983512, 4806634, 5158134, 4917489, 5315766, 5052249, 5235410, 5425735, 5126418, 5498307, 5580619, 5599433, 5793932, 5802058, 5955224, 5641459, 5827647, 6185727, 6149148, 6024692, 6259973, 6227246, 6101619, 6505315, 6754640, 6562568, 6649158, 7143182, 6963240, 7173233, 6868273, 7416189, 7398573, 7586294, 7363115, 7452332, 7662909, 7522579, 8167627, 8044946, 8580838, 8770364, 8701762, 8477861, 8522100, 8916305, 9004791, 9249985, 9681757, 9344937, 9579089, 9442936, 9798888, 9865769, 10305298, 10143763, 10599139, 10348200, 10664777, 10902120, 11228277, 11254130, 11292070, 11663566, 11909425, 12073392, 12326526, 12298902]
14388A2298902O32010j18555L26540J39387m5131N97069K41650O20443k14271
14379A4478044M91275p607M43882L22850M32148J52264K71400J63188O25143N99732
14369A7972319J60144P3363L65303N86104L70871N76926L55626L66286M82061
14360B1309003M61844N69141L63417O69898K39312O55434R60337K32004L24400
14351B5784790J036566Q16846Q03256L87624J087494N76903N62043J030514P09960
14342C2795996R44130Q75827R48710J318605O65890J354270J183258J019326J386562
14333D2492574J198078J093541J586400J210067J410689J656629J746744J830273
14325E4224995J683854J983276K130329J805195K308914J863903K881009K425123
$$ y = [12298902, 12930912, 12812357, 13138897, 13278284, 13233153, 13830222, 14071872, 14692315, 14478044, 14969319, 14961712, 15405594, 15728444, 16160592, 16312856, 16584256, 16747444, 17372587, 17972319, 18132463, 18205826, 18571129, 19157233, 19528104, 20105030, 20460656, 20826942, 21309003, 21770847, 22339988, 22703405, 23373303, 23612615, 24268049, 25228386, 25460390, 25784790, 26821356, 27638202, 28441458, 28829082, 29916576, 30493479, 31055522, 32086036, 32795996, 33740126, 34615953, 35564663, 36883268, 37549158, 38903428, 40086686, 41106012, 42492574, 43690652, 44784193, 46370593, 47580660, 48991349, 50647978, 52394722, 54224995, 55908849, 57892125, 60022454, 61827649, 64136563, 66000466, 68881475, 71306598]
14317G1306598K416141L247097K920778L343435L001405L986216L243354L733086
14309I7198110M078759M706381M753579M661280N054953N512870N769352N983016
14301A37718300O622524O575915O872063P892267Q009312Q743602R065720R303004
14293B00802707J0061959J0797284J1018957J1819062J2280427J2680477J3554339
14286B83015212J3208053J4375382J4563493J4647790J4455163J4811425J4916042
14279C83992560J4165797J3899161J3253793J1931550J0648940Q796332N457055
14272D62145188J192914K46781l95750n759733m135520n248695n909906q649710
14264D33485569j0826192j3570006j4862607j5142423j5659846j6279340j5934655
$$ y = [71306598, 73722739, 76969836, 79890614, 83234049, 86235454, 90221670, 93465024, 97198110, 101276869, 105983250, 110736829, 115398109, 120453062, 125965932, 131735284, 137718300, 144340824, 150916739, 157788802, 165681069, 173690381, 182433983, 191499703, 200802707, 210864666, 221661950, 232680907, 244499969, 256780396, 269460873, 283015212, 296223265, 310598647, 325162140, 339809930, 354265093, 369076518, 383992560, 398158357, 412057518, 425311311, 437242861, 447891801, 456688133, 462145188, 463338102, 463584883, 463189133, 457429400, 453293880, 448045185, 442135279, 433485569, 422659377, 409089371, 394226764, 379084341, 363424495, 347145155, 331210500]
14257C31210500j5824292j5195830j5058228j3335809j3206029j3093280j2353932
14250B33143100j1928888j0989678j0639480r836925r493431q530977p817065
14243A63906656p841499p444852o957513o566415o301402n093137n386995n031625
14235A13283218n298586m070929m478726l996575l392560l590291l621169l789016
14227H1045366k935676k794667l110703k467945k362530k639386j902094k172242
14219F0660123k322116j456238k250549j568335k132973j048635j501820j461249
14211D6918208j566700j479099j355464r00491l59680j323835j500401j424584
14203C7007954j033161j033787l86369n90723j095367r76597r31523o39387q91531
$$ y = [331210500, 315386208, 300190378, 285132150, 271796341, 258590312, 245497032, 233143100, 221214212, 210224534, 199585054, 189748129, 180254698, 171723721, 163906656, 156065157, 148620305, 141662792, 135096377, 128794975, 123701838, 118314843, 113283218, 107984632, 103913703, 99434977, 95438402, 92045842, 88455551, 84834382, 81045366, 78109690, 75315023, 72204320, 69736375, 67373845, 64734459, 62832365, 60660123, 58338007, 56881769, 54631220, 53062885, 50929912, 49881277, 48379457, 46918208, 45351508, 43872409, 42516945, 41616454, 41256774, 39932939, 38432538, 37007954, 35974793, 34941006, 34554637, 33963914, 32868547, 31891950, 30960427, 30321040, 29429509]
14194B9429509m44223q24221p52158o08224p04798p77076j20146p46755q22726
14185B3629182j28823r30641m10197m30720n3729p60126l93954m07349k59014
14176A9854629n59737n84045k17218m16262j06099n68813k59669n15556K98150
14167A6925380j112585o833l85050q5756l03504j96102m01231l40110J55326o80414
14157A3569121n1807l22552k64213O6423o58007Q684j1921m48983j28345J01635
14147A1860035m76768N8041k42901j05844o7058o35933j2904J92700l64543n32688
14137I672137L88642l39675m9206J57521o59845J00896k55165k91259r9832j82306
14127H441908M7791o3838l35563n3175J66144k67806l9721k65717k68286J96761
$$ y = [29429509, 28985286, 28161065, 27408907, 26800683, 26095885, 25318809, 25198663, 24451908, 23629182, 23500359, 22569718, 22159521, 21728801, 21675072, 20914946, 20520992, 20113643, 19854629, 19294892, 18710847, 18493629, 18077367, 17971268, 17402455, 17142786, 16627230, 16925380, 15812795, 15805962, 15420912, 15335156, 15031652, 14835550, 14434319, 14094209, 14249535, 13569121, 13517314, 13194762, 12930549, 12996972, 12338965, 12347649, 12335728, 11886745, 11758400, 11860035, 11383267, 11441308, 11198407, 11092563, 11025505, 10389572, 10376668, 10569368, 10204825, 9672137, 10060779, 9721104, 9671898, 9829419, 9169574, 9270470, 9015305, 8724046, 8624214, 8441908, 8489699, 8425861, 8090298, 8037123, 8203267, 7935461, 7895740, 7630023, 7361737, 7558498]
14117G558498j026m70721k3874K273k34002K07837n6391L8065m84804J06178o1243
14106F580790J59821o63047L43547l39173k167J12535k1906j23991O8985j36728
14096E978666r352j53208J22831k80572k61334K45141m51738K10539r7493k42423
14086E061057J19826l47189K62199j16624k73450m8395J92892k33114n9874J6124
14076D573452M23016k38670j89281j28836k61218J25989J4554p1676L87068p31027
14066C903371J22118o235L0580l36364K49276Q6896Q1608J57620o1567l69729
14056C857574J86763J09744l39381n8021k62879R7352K44478m07051m0797K1471
14046C409253j21797O5272K62510k98026j67626J91712p2819k9132m00697L13437
$$ y = [7558498, 7557472, 7086751, 7062877, 7065150, 6831148, 7038985, 6982594, 7020659, 6535855, 6642033, 6580790, 6740611, 6077564, 6421111, 6081938, 6079771, 6192306, 6170400, 6046409, 6115394, 5978666, 5969314, 5816106, 5938937, 5658365, 5397031, 5642172, 5190434, 5400973, 5303480, 5061057, 5180883, 4833694, 5095893, 4979269, 4705819, 4657424, 4850316, 4617202, 4557328, 4573452, 4996468, 4757798, 4568517, 4439681, 4178463, 4304452, 4319006, 4247330, 4634398, 3903371, 4025489, 4019254, 4049834, 3713470, 3962746, 4049642, 4131250, 4288870, 4227303, 3857574, 4044337, 4154081, 3814700, 3756679, 3493800, 3591152, 3835630, 3428579, 3387782, 3409253, 3287456, 3352728, 3615238, 3317212, 3149586, 3341298, 3268479, 3239347, 2838650, 3152087]
14036C152087k73838J02005M46061k27603j47498O317M27998m19858k3763j07239
14026B934669n3377k28497L6470K23668r8915l04618K03973k03861J93876k52250
14016B451138r8833k172K81144k02668K14406j02512p4361k53480j44276N26162
14006B594548k86742K51670k01134J84474l1238j46770m62929N91612k86275k1345
13996B185871l7620j59856J40808P4372k12652K04849K19276R78830K444768N795791
13986A1634437K1917828J4975310k3128899j1788418n346556k831152j020534
13979D412016j058330O4505P2085m27521j61463j86864j16233q5330j73389k09964
13969B129512L73273k18234l640J17734q5341j50786k3489J31879K58680n11485
$$ y = [3152087, 2878249, 2980254, 3426315, 3198712, 3051214, 3057531, 3485529, 3065671, 3041908, 2934669, 2881292, 2652795, 2689265, 2912933, 2814018, 2509400, 2713373, 2509512, 2703388, 2451138, 2352305, 2350133, 2631277, 2428609, 2643015, 2540503, 2466142, 2212662, 2068386, 2594548, 2307806, 2559476, 2358342, 2542816, 2511578, 2364808, 1901879, 2493491, 2207216, 2185871, 2148251, 1988395, 2129203, 2203575, 1990923, 2195772, 2415048, 3393878, 5838646, 11634437, 33552265, 48527575, 25398676, 13610258, 8263702, 5432550, 4412016, 3353686, 3418191, 3490276, 3062755, 2901292, 2714428, 2598195, 2512865, 2339476, 2129512, 2502785, 2284551, 2280911, 2398645, 2313304, 2162518, 2139029, 2270908, 2529588, 2018103]
13959B018103O7721M7739j95731m5185K5395K26692r6979Q7025M7977k02461K49194
13948B229490m33412J22375M8895o8193l2158q8425L09512j35450l13089K28764
13938A868309l20003K42623q9318q9418L02164n08968M10237O9555l95242Q9015
13928A578954J25130K92508k75612L2689l78418J18377M88554j52829n3652k75257
13918A500444j94914P0423J1029l110J9288K52941l6561j59648q6420J69465j49689
13907A393248K39260k81275m6926L69824l86930O1138L0187k77245K31981j95984
13897A137278R3533J67230j22716n9318p7427K34617j80643J98785m29957L34315
13887A295697p1617l45975J73490K06062L1170j6954J60052J60775o20912P7509
$$ y = [2018103, 2085824, 2133563, 1937832, 1892647, 1918042, 2144734, 2047755, 2134780, 2182757, 1980296, 2229490, 1796078, 1918453, 1967348, 1899155, 1866997, 1778572, 2088084, 1952634, 1639545, 1868309, 1548306, 1790929, 1701611, 1612193, 1914357, 1405389, 1815626, 1885181, 1489939, 1578954, 1704084, 1996592, 1720980, 1753669, 1375251, 1493628, 1982182, 1829353, 1775701, 1500444, 1305530, 1375953, 1386982, 1383872, 1403160, 1656101, 1619540, 1459892, 1373472, 1542937, 1393248, 1632508, 1351233, 1304307, 1674131, 1287201, 1348339, 1378526, 1101281, 1333262, 1137278, 1230811, 1398041, 1275325, 1216007, 1138580, 1373197, 1192554, 1391339, 961382, 1295697, 1224080, 878105, 1051595, 1257657, 1288827, 1271873, 1431925, 1592700, 971788, 1049297]
13877A049297L44202m24334K20416l17766J76773L19004j6014l49895j5287J95180
13867A181576J24903n20035L67914j03450l5798J77211L4785l01974L33351k85070
13857I73413m7961J3336K79164j83480o1151o5610J62303j50057L9344P0579l28648
13846G01232M16766p8804J64478k31164N6512j48333M8597L40174r6956j23701
13836A048801j13718J46748R9050E32219L96398J07227J77100l78284M7799j26737
13826G55722M33554k94059K49985m04132J5732j52887L51287l88765j3800P49526
13816A302163n03761C86646O06292k69553J208K46611n8399j61811Q9228r9275
13806G40947r5409M78690D49755M04347j67498q6806J35906N3N71822D95155J51025
$$ y = [1049297, 1393499, 969165, 1189581, 871815, 1048588, 1367592, 1351578, 1001683, 986396, 1181576, 1306479, 786444, 1154358, 1050908, 1015110, 1192321, 1227106, 925132, 1258483, 973413, 925452, 938788, 1217952, 1034472, 973321, 907711, 1070014, 919957, 959301, 1029880, 701232, 1117998, 1039194, 1203672, 972508, 1029020, 880687, 929284, 1269458, 1172502, 1048801, 935083, 1081831, 1180881, 532219, 928617, 1035844, 1212944, 834660, 882459, 755722, 1189276, 895217, 1145202, 741070, 756802, 603915, 955202, 566437, 552637, 1302163, 798402, 386646, 992938, 723385, 724593, 971204, 912805, 750994, 840222, 740947, 645538, 1124228, 449755, 854102, 686604, 599798, 735704, 735757, 1307579, 495155, 646180]
13795F46180L49652k94621o9775n8277K45336o4926J86371j33313j08011J20595
13785H19211K47315k37995K4787Q336O0015j95732l28487L93737j12681K8117
13775G06623J26812J31003D45553K4543K03366J49039l35472L52076j90232j63068
13765D85805L29625j53346j29649M03479m45620K01931j73922M32824J3784k22622
13755G42289l46488J39084J03495J41623m5024B88823L29150N361R5953k13300
13745E05987r6115L94788n4698n388B94305M25583k26571o8788N06664j5915C08404
13733F79775l19075M77057k46750J4361m5241Q9895l5252J0948k38196L22912
13723G10434C47959L13585j59760N3379K3371K24835B72151J34752K81836j21160
$$ y = [646180, 995832, 701211, 631436, 573159, 818495, 753569, 939940, 806627, 698616, 819211, 1066526, 828531, 853318, 861654, 921669, 725937, 397450, 791187, 678506, 706623, 833435, 964438, 445553, 470096, 673462, 822501, 487029, 839105, 648873, 485805, 815430, 662084, 532435, 935914, 490294, 692225, 518303, 951127, 964911, 742289, 395801, 534885, 638380, 780003, 734979, 288823, 617973, 623334, 719287, 505987, 409872, 804660, 749962, 744574, 294305, 719888, 493317, 424529, 931193, 915278, 308404, 679775, 360700, 837757, 591007, 605368, 560127, 650022, 614770, 625718, 387522, 710434, 347959, 661544, 501784, 555163, 578534, 803369, 272151, 406903, 688739, 567579]
13713E67579p3896K4551J11444k5157k2956M181K97450j32375k2530j15007Q3311
13702F96595K2031j36465q1343P803j66812J9940O72373k96939j53915O234j15661
13691D73841J09113o301Q8060l22055M05442j74123j70068O4467K12875P2864
13681G54115B83564j71M61170C03882N16533j81832k57672j51258K59502J06416
13671E95571j00432J71654J9249n2680j62450L0226Q5819k19391j6507K59312
13661F10371k27876L60677C19031P6878K16133j64223J37505k44131J71823N0496
13651E63512p8235j43754j55013J1039L15956Q9200j44123j35927K0265K2130
13641C65050j48896K51594p6019J68343B55621l2139j8175M68305k66493J5015
$$ y = [567579, 493683, 518234, 629678, 604521, 581565, 585746, 883196, 750821, 728291, 613284, 696595, 718626, 582161, 500818, 508621, 341809, 361749, 1034122, 737183, 583268, 589502, 473841, 582954, 576653, 664713, 342658, 748100, 573977, 403909, 468376, 681251, 754115, 283564, 283393, 744563, 303882, 820415, 638583, 380911, 229653, 489155, 595571, 495139, 666793, 686042, 633362, 470912, 501138, 586957, 367566, 351059, 610371, 382495, 743172, 319031, 395909, 612042, 447819, 585324, 341193, 513016, 563512, 485277, 341523, 186510, 197549, 513505, 602705, 458582, 322655, 342920, 365050, 216154, 467748, 391729, 560072, 255621, 223482, 205307, 673612, 407119, 422134]
13631D22134J70511B69113L1669J19056J64185p6802A39005J98704j3191l2993
13621B91525h4005C78218L31766K7311j02031j148A09363K16777M9545G1767L45891
13610D17658J46028B46283L87395j64055k13274J91070k5687r2844K12544A85585
13599F75914B28109L18391J59091B32873K91558B6289K76872j6086L88022l33881
13589C41216j03813J20801J59853k40253L75147O5450C34813L53417j43675B42071
13578B04181K02998J70605k39848J66526r1968H1156L8622K72971j60270F9230
13567F68127B90811J55224l8223j83818K59936j1673L1195B03309J04566J73584
13557D81459l2933k16119A05275M02760H3078j6221K02881r6660g1264E14570
$$ y = [422134, 592645, 269113, 300782, 419838, 584023, 507221, 139005, 337709, 324518, 291525, -84005, 378218, 709984, 737295, 635264, 634116, 109363, 326140, 375685, 71767, 417658, 563686, 246283, 633678, 469623, 256349, 447419, 421732, 328888, 541432, 185585, 675914, 228109, 546500, 705591, 232873, 524431, 26289, 303161, 287075, 675097, 341216, 237403, 358204, 518057, 277804, 652951, 718401, 334813, 688230, 544555, 242071, 204181, 407179, 577784, 337936, 504462, 412494, 81156, 119778, 392749, 232479, 69230, 668127, 290811, 446035, 407812, 223994, 483930, 472257, 503452, 203309, 307875, 481459, 448526, 232407, 105275, 508035, 83078, 66857, 269738, 173078, -71264, 514570]
13546D61223J0688j04459q8184C5593M71042B34808K7832q583J0077j24054k5510
13535A14570K85886A33238K49948B6581L37504I2872K00334k7017f9540C67029
13524B89005Q5544K5224A25404K13141M9709J01288A63154K45855j27355p1630
13514B10024K08199j39927f264A98537J35400A60905m6491L27800j0638r8158
13504C33418r5274A08312N2188p5012j6302K87956j50200B132J92445J17793j7459
13493B94911j973B452L52391d650D41305j82906J27334q2503l2266q3289M5672
13482B33347J11750L8928J44926k36626q8095j9782j9610G9570J36723J2508J36994
13471C65795O2242j62739n9761M1043R4776n7183A16951j4023P6078L25311D9502
$$ y = [461223, 471911, 367452, 279268, 35593, 506635, 234808, 262640, 254057, 264134, 140080, 114570, 400456, 133238, 383186, 26581, 364085, 92872, 293206, 266189, -69540, 367029, 289005, 374549, 399773, 125404, 338545, 388254, 489542, 163154, 409009, 281654, 210024, 418223, 278296, -6264, 198537, 333937, 160905, 114414, 442214, 431576, 333418, 238144, 108312, 160500, 85488, 69186, 357142, 206942, 2132, 194577, 312370, 294911, 292938, 2452, 354843, -4650, 441305, 258399, 385733, 303230, 270964, 187675, 233347, 345097, 384025, 528951, 292325, 204230, 184448, 164838, 79570, 216293, 228801, 365795, 428037, 265298, 205537, 246580, 341356, 284173, 116951, 102928, 179006, 504317, 49502]
13459E28014B30622q1294M1247f8858A76175M6576J7227A5690L3050L31034j24243
13448B55531o9454M4446L3916J22189j80977J92161j33334L14321B49824B6039
13437A20639L8971K63911B07579J6557a3044B82063q8780m0666J75988N0923A67976
13425C33392r0177g177D2597J0828K59509N8686G2325J90302j8611J11G0892J68457
13413B39349K7845K44544G3215N92210C31356j43617a49338B36696K54135k18248
13403B72583a00646A34716D7481L57587j50761A10162B3172K79046a3032B06817
13392b5794A37464J41439O4142F0662J77626F4373J49286k293A3947L04131b83005
13380B57053P356K71100j24873j80844A8348N43584B18366p0820Q7974a45169
$$ y = [528014, 230622, 149328, 190575, -68858, 176175, 222751, 239978, 15690, 48740, 379774, 255531, 186077, 230523, 264439, 386628, 205651, 397812, 264478, 578799, 249824, 26039, 120639, 159610, 423521, 207579, 224136, -13044, 282063, 193283, 152617, 328605, 379528, 167976, 333392, 243215, -7177, 42597, 53425, 312934, 371620, 72325, 262627, 244016, 244127, 70892, 239349, 267194, 511738, 73215, 665425, 331356, 187739, -149338, 236696, 490831, 272583, -100646, 134716, 47481, 405068, 254307, 110162, 23172, 302218, -13032, 206817, -25794, 137464, 278903, 343045, 60662, 238288, 64373, 213659, 211366, 13947, 318078, -283005, 257053, 264409, 535509, 410636, 229792, 18348, 561932, 218366, 147546, 235520, -145169]
13369D11044b67329D60834a3639C51566q5225p9806K35448j4616j26100B3963
13358A61075f4609g493A31300J29204a24133A99606I5116M63335A86127J49064
13348C35191j44111H9598L67875j07275o5728J60650A78659M38115B99254k4732
13338B74522A2940M80734F7889k3889L25564A15106K49093j17154G7488N9343
13328A36831J0824Q8800J38356j19965f3014G0306K1757J59963K49679G9980J72195
13317B52175M1427j00935j3790J33588E9783J47691J56604n2137H1547K90962
13307C72509b1725B54536o4026K3665q7274R0458f5895C74225b258A12338C3641
13295A15132a17888A64918D8117K00281J60312A57517J04478A07320d0441A04913
$$ y = [411044, -267329, 460834, -13639, 351566, 266341, 186535, 421983, 407367, 281267, 23963, 161075, -64609, -7493, 131300, 260504, -124133, 199606, 95116, 558451, 186127, 335191, 191080, 89598, 457473, 350198, 284470, 445120, 178659, 616774, 299254, 274522, 12940, 493674, 67889, 44000, 369564, 115106, 364199, 247045, 77488, 136831, 147655, 236455, 374811, 254846, -63014, 70306, 92063, 252026, 501705, 79980, 252175, 293602, 192667, 178877, 312465, 59783, 207474, 364078, 311941, 81547, 372509, -21725, 254536, 190510, 214175, 126901, 217359, -65895, 374225, -2258, 112338, 33641, 115132, -117888, 164918, 48117, 248398, 408710, 157517, 261995, 107320, -40441, 104913]
13284A94906l3316b9074B10223L8508f6730B48536A01782A7984b55757A25369
13273D0315K14580I9719m99O3079B3712L42122j78135J26440m2485L1002H4650
13261A02790C8976c6508B13793K89628k38824I5602K58969A63226G8290M02117
13251D80407A92999J47823R2370d1503B96786O3863A3420J21971N1854G8081M2495
13240A20576J1056a98325A34418l036M2533M345H5056J32724a68399b7488A85637
13228B80058j27345j868o1271k9539M4834K8233Q4322a0691D6725L0143L909Q1907
13216A62684L5067a95251O9795B10737i0615C4057K30759I0275J30799a37322
13205G4530L30710H3718d6979l9537I0084B5114R0427a77369A68980C4031a22467
$$ y = [194906, 161590, -29074, 210223, 248731, -66730, 248536, 101782, 17984, -255757, 125369, 40315, 254895, 99719, 99220, 162299, 23712, 365834, 187699, 314139, 271654, 302656, 84650, 102790, 38976, -36508, 213793, 503421, 264597, 95602, 354571, 163226, 78290, 480407, 192999, 340822, 433192, -41503, 296786, 360649, 13420, 135391, 187245, 78081, 120576, 131632, -198325, 134418, 131382, 173915, 178260, 85056, 217780, -168399, -27488, 185637, 280058, 152713, 150845, 89574, 60035, 104869, 133102, 217424, -10691, 46725, 76868, 80777, 162684, 197751, -195251, -125456, 210737, -90615, 34057, 264816, 90275, 221074, -137322, 74530, 405240, 83718, -46979, -86516, 90084, 25114, 115541, -177369, 168980, 34031, -122467]
13193c4123A76124J03065c3682j03241G0205J19779I4358e314A90916b4803E340
13181D28643G9197K0468J12667A05161m3424K94027A43818M7625B224M66292k28423
13170B40093J97997b41518b7106m2848j0739A47174a67788N5261A11951J4903
13160A26854R3925g7670B97277j21828b19869A52789L1244R6020j13227M2420
13150B09246C0205a41866A06721N471K73691r5828a18320C34631b1742j65554
13140a87296E5565D374J25406L12025j63436I9800K24105h288l1597j88651B92656
13128i0638A15509K0374e0011A42644a34608c83A86391N6674J63206p3928a90550
13116A92204R2991b5222j47270B91104K4850a25957E7826A8212R4625A6360L587
$$ y = [-34123, 176124, 279189, -33682, -136923, 70205, 189984, 94358, -5314, 190916, -24803, 5340, 428643, 79197, 99665, 212332, 105161, 61737, 355764, 143818, 191443, 2224, 468516, 240093, 438090, -241518, -27106, -69954, -80693, 147174, -167788, -112527, 111951, 126854, 220779, -77670, 297277, 175449, -219869, 152789, 184033, 280053, 166826, 209246, 30205, -141866, 106721, 112192, 385883, 290055, -118320, 334631, -21742, -187296, 55565, 4374, 129780, 441805, 278369, 99800, 323905, -8288, -39885, -228536, 292656, -90638, 115509, 135883, -50011, 142644, -134608, -383, 186391, 243065, 406271, 332343, -190550, 192204, 285195, -25222, -172492, 291104, 315954, -125957, 57826, 18212, 112837, 16360, 19947]
13105A9947J06022J53617A31692m7561O4536l3408K0476c1491C44287B4645f9116
13093C8700J35698K25685A60773d1084A15903b00774A13328J64376B1873L8774
13083F0647b05975G5986a03956a7521A79450k5765L9807J70634F0569J6494J69766
13072B46829f8945p8184A3807P5057K58232a0571B32288j07871P621E0314J31215
13061A81529a6980A79398J41280a8478C85687A33763F1866d8677B1757a53525
13050A26094J14482h4470B02449b30066e3388A8282b89011A50798O9251R4924
13040C14973c3710A24873J33527b10620M1903N7826H8322L1559A0319K28857j02264
13029A36912b54936B80949G0387a5840C45817I2341a7017B76147a14836B19746
$$ y = [19947, 125969, 279586, 131692, 84131, 148667, 115259, 135735, -31491, 344287, 24645, -69116, 38700, 174398, 400083, 160773, -41084, 115903, -200774, 113328, 277704, 21873, 60647, -205975, 75986, -103956, -17521, 179450, 153685, 193492, 364126, 60569, 77063, 246829, -68945, -147129, 13807, 88864, 347096, -10571, 232288, 124417, 132038, 50314, 181529, -16980, 179398, 320678, -18478, 385687, 133763, 61866, -48677, 21757, -153525, 126094, 240576, -84470, 202449, -230066, -53388, 18282, -289011, 150798, 220049, 314973, -33710, 124873, 258400, -210620, -168717, -110891, 88322, 119881, 10319, 239176, 136912, -254936, 280949, 70387, -15840, 345817, 92341, -17017, 276147, -114836, 219746]
13018A06619a01056C49973e5030B17769k9159J50618h3811E03643r461a15444
13007a5762A91773K7630a21432C50626C1942c22005B80144D7188c6510A80737
12996C76026G2089J11875a4438C9417j6240J3414a80341A24341C3171f5348B12305
12984G3414K7330a1567o0463G4610f1285a8292B40864A00056i1936C39155b68328
12972H4309b2939k43704A0226J25618J74082j25276o1742d5265j51818n3647J0089
12961b40641B64244F2029J53063d3377J0407f330F1576N1120J28399B8729i8962
12949A80467o0732L29536a54274A27158J14776A11661f1584A30467n9824N34111
12939F04754I511J82685K2685h0381l7307j83298A22358e7590D6195c0396n6009
$$ y = [106619, -101056, 349973, -55030, 217769, 188610, 339228, -83811, 503643, 494182, -115444, -15762, 191773, 219403, -121432, 350626, 31942, -322005, 280144, 47188, -36510, 180737, 376026, 72089, 183964, -14438, 39417, 23177, 36591, -180341, 124341, 33171, -65348, 212305, 73414, 100744, -11567, -72030, 74610, -61285, -18292, 240864, 100056, -91936, 339155, -268328, 84309, -22939, -266643, 10226, 135844, 309926, 184650, 122908, -45265, -197083, -250730, -240641, 264244, 62029, 215092, -43377, -32970, -6330, 61576, 112696, 241095, 28729, -98962, 180467, 119735, 449271, -154274, 127158, 241934, 111661, -61584, 130467, 70643, 604754, 9511, 192196, 214881, -80381, -117688, -300986, 122358, -57590, 46195, -30396, -86405]
12928h6405G8013P2684G1991M5200E5361g2501j6960A09798R8374G6691J44935
12917B21626o5324j1887j4368M4003a33440d7590B81246b8345B30756i1618L0395
12906f1223H7557L21569A91261c18837C3050a15083A34858J63726M9485A07913
12895A63554a25228H1605J01379K07456b1535j63846F3728b547q2556A7557L63520
12884C81077i2545A13004d9202b434C6942Q7753b63802B09498b38621B55807r9313
12873A56494J46852b13876A23381L940K56393j10432A1685e20763a92788F9342
12862G5911h1340A43127a4903l4217q4209l3176Q1741c8072E8547c7934B69458
12850a12357a7605I6814L75913A65640i7953G996k93b04064Q6751j39252h6237
$$ y = [-86405, 78013, 150697, 71991, 117191, 55361, -72501, -89461, 109798, 208172, 76691, 221626, 156302, 144415, 130047, 174050, -133440, -47590, 281246, -28345, 230756, -91618, -61223, 87557, 409126, 191261, -318837, 33050, -115083, 134858, 298584, 348069, 107913, 163554, -125228, 81605, 182984, 390440, -21535, -185381, 63728, -2547, -85103, 17557, 381077, -92545, 113004, -49202, -2434, 36942, 124695, -263802, 209498, -238621, 255807, 156494, 303346, -213876, 123381, 127321, 383714, 273282, 11685, -520763, -192788, 69342, 75911, -81340, 143127, -14903, -49120, -133329, -166505, -84764, -38072, 58547, -37934, 269458, -112357, -17605, 96814, 472727, 165640, -97953, 7996, 7703, -204064, -117313, -256565, -86237]
12838C64011a2321D4891J06265F2685k5386b22962M0892f6506D49036A31464g4227
12826B3742e2033B87302b26243F8917K3330a01340d6480A42153i5747d6900i341
12814A95399b54503J24031K0214K5776C1769K03203J3793i8217k09734I4073K1508
12803A15581C187d86587h4447H7185d0222A0724a160C1261N5207J1314Q6444a19814
12790E766L68539C6204M2575a13704E9399k528a47037C50499a04151r0056a5867
12778B7257J72607h8953A42777b88484C0949Q0403b95300f1465B51191a17082
12767E8438P9331a20265J4208B10500f821k15972C01655A06732K13168F5497a2278
12755B21054g8959B30827q2109f7119A93957a19373k97B73216m2807r4287l1782
$$ y = [364011, -12321, 44891, 151156, 62685, 37299, -222962, -182070, -66506, 449036, 131464, -74227, 23742, -52033, 287302, -226243, 68917, 92247, -101340, -46480, 142153, -95747, -46900, -9341, 195399, -254503, -130472, -110258, -84482, 31769, 234972, 248765, -98217, -307951, 94073, 115581, 3187, -486587, -84447, 87185, -40222, 10724, -1160, 31261, 86468, 97782, 184226, -119814, 5766, 374305, 36204, 78779, -113704, 59399, 56871, -147037, 350499, -104151, -194207, -15867, 27257, 199864, -88953, 142777, -288484, 30949, 111352, -295300, -61465, 251191, -117082, 58438, 137769, -120265, -106057, 210500, -6821, -222793, 301655, 106732, 319900, 65497, -12278, 221054, -78959, 230827, 148718, -67119, 193957, -119373, -119670, 273216, 230409, 136122, 104340]
12744A04340f4988B56184p5216a10675A97931L20564a2812A81577O6877N947E5655
12732H0803a54784B07512a49777e1861j4902k45813A85277k2932j7190E1181a99853
12720B3516K37652P3572b4010F5038A1013K51211a63595C81016D44K20832a0689
12708E24336k43734M91456d370j00470A60503K45346b29109A86247L03828A03190
12697B16905G1396f0852J2865A67119G1676a01292b8958C55276a03841A39131
12686i5002q9304m8266A37114P0565i1428C5544N20641j23255C1583M09539q9143
12675C51979j25609a05260B75327j6826a33799F5811b57070B53436o2823J84250
12665C74863E0649a55181E3639b56107C9028b08802A58510p7976K89138A1359
$$ y = [104340, -64988, 256184, 180968, -110675, 197931, 518495, -12812, 181577, 248454, 254401, 55655, 80803, -154784, 207512, -149777, -51861, -66763, -312576, 185277, 162345, 145155, 51181, -199853, 23516, 261168, 334740, -24010, 65038, 11013, 262224, -163595, 381016, 444, 221276, -10689, 524336, 280602, 772058, -4370, -104840, 160503, 405849, -229109, 186247, 490075, 103190, 216905, 71396, -60852, -47987, 167119, 71676, -101292, -28958, 355276, -103841, 139131, -95002, -184306, -232572, 137114, 207679, -91428, 35544, 556185, 432930, 31583, 441122, 351979, 226370, -105260, 275327, 258501, -133799, 65811, -257070, 253436, 190613, 374863, 50649, -155181, 53639, -256107, 39028, -208802, 158510, 80534, 369672, 11359]
12654g7868B17412E29O5435b10219B58655A8151b00062A10482i8987A24102K2934
12643A47036b7210A7479M42054F9693B7050L65921E2302O0803g2898C0847J88205
12632B19052F3536K03195k8106J9346A7883a35755F36255A70293J13888r1278
12622A92903M15078F0003d6002B53360A6074K66775F6114C0388L9512c0597j1309
12611d1906j19936B24954b51398j2550C3471K37310H2135K0938h4819K8465F0712
12599C36707a02234D54506f8697E5791a13112B4621N60085B45922C2816j2334
12589B0482J29727K03002a00383B20486a24835n4807c8705k2595I6342b05035
12578a20644M7193D1896M1832j695b3620H1680B8579J50543b0107F6528j6021
$$ y = [-77868, 217412, 529, 65964, -210219, 258655, 18151, -200062, 110482, -98987, 124102, 147036, -27210, 17479, 459533, 69693, 27050, 392971, 52302, 113105, -72898, 30847, 219052, 63536, 266731, 238625, 257971, 17883, -135755, 636255, 170293, 284181, 192903, 607981, 60003, -46002, 253360, 16074, 282849, 66114, 30388, 69900, -30597, -41906, -161842, 224954, -251398, -263948, 33471, 270781, 82135, 103073, -84819, -56354, 60712, 336707, -102234, 454506, -68697, 55791, -113112, 24621, 584706, 245922, 32816, 20482, 150209, 353211, -100383, 220486, -124835, -179642, -38705, -61300, 96342, -205035, -120644, -73451, 41896, 83728, 82033, -23620, 81680, 28579, 179122, -20107, 66528, 50507]
12567E0507h4932A65658Q709g818j4251G337a16991C19J92893b18461j0353A17681
12554I2278a65974k1450B88377J04738d7642b2871A02560d64786A03992g0450
12543a23450j60295a30601c4280A6301c3828G6771b26726i8863k5623j9501d0734
12531b7503r7748H5064P2764M6066b33428i7311A60455K9107b52263b0494k01063
12520b21557c4906A84511b3985p00B5739a50627M0983B29908C3939b17320A4187
12508A3436a18534A70229j2380b97261A74298a62855B82080a11361J4135j5556
12498a12782H2623h7106C56312h7401o074o9646m4494L9119D3067b9626C6907
12486a23763D8729b88759E23542j62479a45282p5103d828p8697j01011j37725
$$ y = [50507, -84932, 165658, 174367, -7818, -22069, 7337, -116991, 319, 193212, -218461, -228814, 117681, 92278, -165974, -187424, 288377, 393115, -47642, -22871, 102560, -464786, 103992, -70450, -123450, -283745, -130601, -34280, 16301, -33828, 76771, -226726, -98863, -124486, -143987, -40734, -27503, -125251, 85064, 157828, 203894, -233428, -97311, 160455, 189562, -252263, -20494, -221557, -34906, 184511, -23985, -24685, 25739, -150627, -109644, 229908, 33939, -217320, 14187, 13436, -118534, 170229, 157849, -297261, 174298, -162855, 282080, -111361, -97226, -112782, 82623, -87106, 356312, -87401, -93475, -163121, -207615, -168496, 43067, -29626, 36907, -123763, 48729, -288759, 523542, 361063, -145282, -220385, -4828, -83525, -184536, -322261]
12476c22261I7120e6794j87998b864F6633J90212l4108d2975F6550M7419D8912
12464a92369O0861C11354E2660L43320F696a19692G0450b20899j46791d1780C06323
12452H2294J7235J02424a22942G8505J48339b37054k6583h8120G3215R719j6900
12441F6034J49556b5498k22828C8739e8716B47843q0486a5332I8856f5880E2249
12429B63647q2909J4982m7397N1448c31999a65905e2603A03624J29617q9539i3371
12417H8614N724Q0062J3208f7547j45021J3771j83261F9373g0746b614n2568k8627
12405h3809o4733A25913a3159G8636b8534j21743j09281R5613G1423l3649M9629
12394H7403a62552g0331E9446q487j5312h1721A02077n390G262K10996O3531E5534
$$ y = [-322261, 97120, -56794, -244792, -2864, 66633, 256845, 222737, -42975, 66550, 113969, 48912, -192369, -131508, 311354, 52660, 395980, 6696, -119692, 70450, -220899, -367690, -41780, 306323, 82294, 99529, 201953, -122942, 78505, 226844, -237054, -263637, -88120, 73215, 82934, 66034, 215590, -25498, -248326, 38739, -58716, 247843, 167357, -15332, 98856, -65880, 52249, 263647, 180738, 195720, 148323, 199771, -331999, -165905, -52603, 103624, 233241, 143702, -93371, 88614, 94338, 174400, 187608, -67547, -212568, -198797, -382058, 69373, -70746, -2614, -55182, -83809, -148542, 125913, -13159, 78636, -28534, -150277, -259558, -163945, 71423, 37774, 87403, -162552, -70331, 59446, 50959, 35647, -81721, 102077, 96687, 7262, 218258, 281789, 55534]
12381a19122j05494E2294K42797G1366a65453C93391a03075q9769F7813K13880
12371B81693a40180A07526A0891L80999a36892A39659c06598I5450K819b56273
12360b0754e345A48690J014h3963j9343E2942L6826a58370A51112i6173B3608
12348e4100C1486J69521f9722B9300a71209C90180A15001J54819F7818O2304A2414
12336B7732c24056A89480l8359m7467i3443C8334J9895J28578I1604k1411B9990
12324b00560A9667n182a44603f0163A13238m4673d16985J92121Q2792c8016D93763
12312H4170J45034a5653p8686B61866p1485d70328B67416A8898e0669A70508G2276
12300f1777l05808d8926H9157Q4538R6705J21841i1280B55351j13808k4066a39467
$$ y = [-119122, -224616, 52294, 295091, 71366, -165453, 393391, -103075, -192844, 67813, 281693, -140180, 107526, 10891, 391890, -136892, 139659, -306598, 95450, 98269, -256273, -20754, -5345, 148690, 149704, -83963, -103306, 52942, 89768, -158370, 151112, -96173, 23608, -54100, 31486, 201007, -69722, 29300, -171209, 390180, 115001, 269820, 67818, 130122, 12414, 27732, -324056, 189480, 151121, 103654, -93443, 38334, 58229, 186807, 91604, 70193, 29990, -200560, 19667, 14485, -144603, -60163, 113238, 68565, -416985, -224864, -142072, -38016, 493763, 84170, 229204, -15653, -94339, 261866, 190381, -470328, 267416, 18898, -50669, 170508, 72276, -61777, -367585, -48926, 89157, 173695, 270400, 392241, -91280, 255351, 141543, 117477, -139467]
12288A48875K19852a44070B28524b668r2176G4911a03100A11042a41747A11979
12277d1443G1920d0659B26956p2555a6418B39285C6189J06105a478l7619G6238
12265a20222C6446K64022a06804C58998j46472A7459p010K59737o683H3046L8547
12254A21593D5747e5998n0848A42243J14033f274m21437A39205e3222A04077E1832
12242G4197a53788D7166K03611L9695n7865a33800A74375J93774A39233O3057
12232B02290n0072g9419F7099B5529P6515K04984d1393A07187b5701A60835D2588
12220B7631L69996A47312K41856A36745J41593d395D07911C8046a35413B85445
12209G9761J27121n1844a19212E72511E0509K76552A44964L39420A03880d01530
$$ y = [148875, 368727, -144070, 228524, -2668, -94844, 74911, -103100, 111042, -141747, 111979, -41443, 71920, -40659, 226956, 154401, -16418, 239285, 36189, 142294, -1478, -39097, 76238, -120222, 36446, 300468, -106804, 358998, 212526, 17459, 10449, 270186, 263503, 83046, 121593, 45747, -55998, -106846, 142243, 256276, -6274, -427711, 139205, -53222, 104077, 51832, 74197, -153788, 47166, 250777, 290472, 232607, -133800, 174375, 368149, 139233, 202290, 152218, -79419, 67099, 25529, 102044, 307028, -41393, 107187, -25701, 160835, 42588, 27631, 397627, 147312, 389168, 136745, 278338, -4395, 407911, 38046, -135413, 285445, 79761, 206882, 155038, -119212, 572511, 50509, 327061, 144964, 484384, 103880, -401530]
12198A94762I2320R118m1281M9340J19497F4696K65195a21798A77978f1898l8353
12187a00251A01662a66630c2084k1314D42918B8691J92620a6239D01513F3132
12176d1105G4769d2558C91587a35206J7713C45518A70251F1679F827K35903h1625
12164C02936l2214j04300p4939J5129J95290A26550K2069p203K7528a31882B5120
12152E1241a03427K8809B79329E5581M9585J08921H9743B2112K18826E9808a27777
12140C93225E7771f6606A58364e3612G5569b03016A47912c68579D17051i7563
12129A34600J29956O0664b21945A28901a19914B26323J46084g5195J1422A75909
12118b605j28098G917L87931d7950B11085e6187K6978A33314b28911J2748A00119
$$ y = [194762, 92320, 101438, 60157, 109497, 228994, 64696, 329891, -121798, 177978, -61898, -100251, 101662, -166630, -32084, -53398, 442918, 28691, 221311, -16239, 401513, 63132, -41105, 74769, -42558, 391587, -135206, -117493, 345518, 170251, 61679, 6827, 242730, -81625, 302936, 270722, 166422, 91483, 106612, 301902, 126550, 148619, 141416, 168944, -131882, 25120, 51241, -103427, -74618, 279329, 55581, 105166, 214087, 89743, 22112, 240938, 59808, -127777, 393225, 57771, -66606, 158364, -53612, 75569, -203016, 147912, -368579, 417051, -97563, 134600, 264556, 325220, -221945, 128901, -119914, 226323, 372407, -75195, -63773, 175909, -2605, -130703, 7917, 395848, -47950, 211085, -56187, -29209, 133314, -228911, -216163, 100119]
12106a03939b2798l03622f2452p4110e6096O95k23389J03369A95269R9209A10587
12094A40335a78166B55720a85322e4546B8246K22035p3907E9452J69855F98a30380
12082c62865A38973O3860a4642A51606N27384J337376o53056n33644H8665f9742
12071d6245A3792b76156c4846A98424b8787A49334O7503A4743J05278f3347B30018
12059b0168A7051i267A11085K94998F1358a38791I9472l0146b2559A1494b23189
12047A1822J74192b09750c2227j68782B35107E3385i1636k50612I1344a49234
12036a75563G5855c51221f9201B4312m62b17082A06655J4609a95374d1633l27606
12025c69239J57500R9637B2537J24318a12054q5568c0357a2177G6794M8827d3425
$$ y = [-103939, -22798, -326420, -62452, -136562, -56096, -55401, -278790, -175421, 195269, 294478, 110587, 140335, -178166, 255720, -185322, -54546, 28246, 250281, 176374, 59452, 229307, 698, -130380, -362865, 138973, 202833, -14642, 151606, 678990, 2016366, 1363310, 829666, 88665, -69742, -46245, 13792, -276156, -34846, 198424, -28787, 149334, 216837, 14743, 120021, -63347, 230018, -20168, 17051, -9267, 111085, 406083, 61358, -138791, 99472, 69326, -22559, 11494, -223189, 11822, 186014, -209750, -32227, -201009, 235107, 53385, -91636, -342248, 91344, -149234, -175563, 75855, -351221, -69201, 24312, 23850, -217082, 106655, 121264, -195374, -41633, -369239, -211739, -112102, 22537, 146855, -112054, -197622, -30357, -12177, 76794, 125621, -43425]
12013e6705C47251H9370f6790K2145A34452K85000i6205A53274g1092j99594A00019
12001b9868A30828a11790j2991a0586j79775P6879C7584e5185m271a9301I0610
11989i3260E3459g3972G1671a50712O2352j299j005k21950a28281b1427D6751
11977f9656b3452B69240a25370E6206a59059m0496K0779A8095R5002b2990o8040
11966i1030j4094o2299k0741B23806q8019M7650c02975e0467a0934m7081G1183
11954A37891l6385J9491b6800B13236J33533B3274J34788f5503G4810K53210B6496
11942C7817a59615A88510A8618K58025C5836e5670A44231I480J4847i6617L2939
11931f3678A9591J15241f5108A61177a60299P5065J9653B64060a81227A77958
$$ y = [-56705, 347251, 89370, -66790, -44645, 134452, 419452, -96205, 153274, -71092, -270686, 100019, -29868, 130828, -111790, -124781, -10586, -190361, -113482, 37584, -55185, -59456, -19301, 90610, -93260, 53459, -73972, 71671, -150712, -88360, -89659, -90664, -312614, -128281, -21427, 46751, -69656, -23452, 269240, -125370, 56206, -159059, -199555, -178776, 18095, 113097, -22990, -91030, -105124, -167423, -188164, 223806, 135787, 183437, -302975, -50467, -10934, -58015, 71183, 137891, 101506, 120997, -26800, 213236, 346769, 23274, 158062, -65503, 74810, 328020, 26496, 37817, -159615, 188510, 18618, 276643, 35836, -55670, 144231, 9480, 24327, -96617, -63678, 19591, 134832, -65108, 161177, -160299, -85234, -65581, 264060, -181227, 177958]
11920b28746B2336R8200i774C986i5179o9039F8719O3479o4946a37810B7487a19375
11907G2034J26c840E9427k7504i798B02856b45353A3269J35345c16237a23350
11895A11679g275A5224a47338B8421b50636B4426a60780j00780J19963c7142j13103
11884a50245d8053k20570E6738b4347k72891J19916M5159M427A59296a56423K5785
11873a30638I538M5809d267I0239j314R9627k5382k2864f6648p5052f4881F3564
11860b59943g9244D00340j13074A26327J55436e7496F1184f3529B7954J62139
11850A90093B7297b01638F4723J36897E1661L0482C3149J97060C7776N05099a13921
11838I9715L3617a80205d2189j54180c7858o2487C39852d56636g0909D2949a23082
$$ y = [-228746, 22336, 120536, -9774, 3986, -95179, -164218, 68719, 132198, 67252, -137810, 27487, -119375, 72034, 72160, -3840, 59427, 31923, -9798, 202856, -245353, 13269, 148614, -316237, -123350, 111679, -7275, 15224, -147338, 28421, -250636, 24426, -160780, -261560, -141597, -37142, -150245, -48053, -268623, 56738, -24347, -297238, -177322, -132163, -127736, 159296, -156423, -130638, 9538, 55347, -4267, 90239, 88925, 188552, 163170, 140306, -66648, -141700, -64881, 63564, -259943, -79244, 400340, 287266, 126327, 281763, -57496, 61184, -63529, 27954, 190093, 27297, -201638, 64723, 201620, 51661, 82143, 33149, 230209, 37776, 542875, -113921, 99715, 133332, -180205, -42189, -196369, -37858, -100345, 339852, -456636, -70909, 42949, -123082]
11826a58341L1708K0883m4080A3920b10926a906A05007a17247c8516l12640A84593
11814D9759d389k11211E1926b28022c851j12723K5376A28543m4248J2094a27069
11802A99609a36099M5760A56708O4939L6111A05217J87263h9334j06245A62584
11791A35980J43124I6293c59187H597J89815B3440a46790H6650d11416J97970
11781b13446A45804a72314h0967C5261b87105E443d432k91370D7244j76Q0759
11770A27827J26643a97691A23313b12798i5086d4805A09800B306b18292F667L1450
11759C8117K4715O1473c1968C01488A3817c8960j61795A06321P0156j0289p5924
11748I0264k6624r70B8230M00a2459j93664h120B35046j05228a80632D42547G9142
$$ y = [-158341, -126633, -105750, -149830, 13920, -210926, -1906, 105007, -117247, -38516, -351156, 184593, 49759, -4389, -215600, 51926, -228022, -3851, -116574, -91198, 128543, 84295, 96389, -127069, 199609, -136099, -90339, 156708, 221647, 257758, 105217, 292480, -89334, -195579, 162584, 135980, 279104, 96293, -359187, 8597, 198412, 23440, -146790, 86650, -411416, -213446, 145804, -172314, -80967, 35261, -287105, 5443, -4432, -295802, 47244, 47068, 127827, 254470, -197691, 123313, -212798, -95086, -44805, 109800, 2306, -218292, 6667, 38117, 62832, 124305, -31968, 301488, 13817, -38960, -200755, 106321, 176477, 166188, 90264, 63640, 62670, 28230, 28630, -12459, -206123, -8120, 235046, 129818, -180632, 442547, 79142]
11735G9021J50157l0337a18292A41704J057J58526A17779a51081K3920F0861a53034
11723A35374F6075L2652e3498a0306A07470J8406a07539F9357Q7315g2143k53847
11712c25990B37030o4000J6694M6602q1521a5410A84211h1328l5518a9973B53870
11700A14600j4270m7297a846j04269A05317N7619o8472M179a82469R926E14701
11688A25569d93530C73786B9672i8594L9326k2500b843D2027c8447D49869e4039
11676G587J01779a73509N4630G5329J37395q7326d3638k63042c7389j8686D5015
11664a76159N4540o1111h6193D127J44299b5875r5649B29943J19202A68446K9052
11653A97498a23899A08770b25022B5907h5511j20622R0124J5569A92112P5876
$$ y = [79021, 229178, 198841, -118292, 141704, 142761, 301287, 117779, -151081, -127161, 60861, -153034, 135374, 66075, 98727, -53498, -10306, 107470, 125876, -107539, 69357, 156672, -72143, -325990, 237030, 173030, 189724, 236326, 154805, -15410, 184211, -81328, -116846, -19973, 253870, 114600, 100330, 53033, -1846, -106115, 105317, 162936, 94464, 98643, -182469, -172543, 514701, 125569, -493530, 373786, 29672, -98594, -59268, -81768, -2843, 42027, -38447, 449869, -54039, 7587, 109366, -173509, -118879, 75329, 212724, 125398, -43638, -306680, -37389, -56075, 45015, -176159, -121619, -182730, -86193, 4127, 148426, -25875, -121524, 229943, 349145, 168446, 197498, -123899, 108770, -225022, 25907, -85511, -206133, -116009, -100440, 192112, 267988]
11643B67988h698D2744c4203H9481m0063g6781o2714M8941I1704J6441Q7389a17615
11630H7226J63787d27C63050f3313A14521J19487k809m0821a25061E9369g6336
11618B10328q1589K17200A45828c4876B0190M073K30674D6702c2795C40670i407
11606A07292Q2383J55702f3462o5821r874l00435E8695K55415j15865B35Q4049
11595H4284a5025B21599J163a47953a4766A07631P7622i3584d392A40010E0799
11583C23458r460d8217D3934J30772a88040A75095o3890J43267H7955K07436J14944
11572D10335k02992F6263M1762J13019J93986j89940k7516a3179C38486A43686
11561B49917I9488g0727A41301h7972C56534E7375b37341B29862k2858e1153G7152
$$ y = [267988, -8698, 42744, -34203, 89481, 49418, -76781, -139495, -90554, 91704, 108145, 195534, -117615, 87226, 251013, -427, 363050, -63313, 114521, 234008, 231199, 190378, -125061, 59369, -76336, 210328, 128739, 345939, 145828, -34876, 20190, 24263, 254937, 46702, -32795, 340670, -9407, 107292, 189675, 345377, -63462, -129283, -139157, -439592, 58695, 314110, 198245, 235, 84284, -15025, 221599, 222762, -147953, -14766, 107631, 185253, -93584, -4392, 140010, 50799, 323458, 313998, -48217, 43934, 174706, -188040, 175095, 111205, 254472, 87955, 295391, 410335, 207343, 66263, 108025, 221044, 415030, 225090, 197574, -13179, 338486, 143686, 249917, 99488, -70727, 141301, -87972, 356534, 57375, -237341, 229862, 207004, -51153, 77152]
11549c8889A59430a74548B28176H6096Q6315J44277d54B16571C2618a7599E9007
11537B61296D3595N92820k91649q7782a92426g7338D19204j67406a965q691A03926
11525c220l4469A67391a93276A36161J14403c9162j84848A15413l7922J22583
11515B00074L8980r7203E9720a27926n6958C20319C5316N1037K54379B9781B742
11503C48994e9617A71540e5997F7946J52557d9264n2988n7650B24167j1471M5480
11492B58176l1656J77975A88451p5261P4139J13483K8383j14763D9246J9372J6416
11481H5034e1118B74139A05493K3755b01518B60287J4268o1682F4474j2575Q2651
11470A34550L2725K71214q0114G5207J80715g2748A57543L56730M4440a68863
$$ y = [-38889, 159430, -174548, 228176, 86096, 172411, 316688, -454, 216571, 32618, -17599, 59007, 261296, 43595, 636415, 344766, 256984, -192426, -77338, 419204, 251798, -1965, -10656, 103926, -3220, -37689, 167391, -193276, 136161, 250564, -39162, -224010, 115413, 77491, 200074, 239054, 141851, 59720, -127926, -184884, 320319, 35316, 86353, 340732, 29781, 2742, 348994, -59617, 171540, -55997, 67946, 220503, -49264, -102252, -159902, 224167, 212696, 258176, 226520, 404495, 188451, 113190, 187329, 300812, 329195, 214432, 49246, 68618, 85034, -51118, 274139, 105493, 129248, -201518, 260287, 274555, 212873, 64474, 51899, 134550, 167275, 438489, 358375, 75207, 255922, -72748, 157543, 514273, 558713, -168863]
11459A85195J52635d072j2250k7705A21837D8395J03255p3407K24521b452q2112
11448h4564B44694B3240J53355a31078q6613A9703c6239h886C84550b90881B57274
11436C08617k1726j26645a84766n969F7921J19854C1656J03975C8128b74185d8042
11424B34671k8381q6930l1343e2864E9192c6328B14194a68451B31750j15544J61402
11413B77608j25225f5978A4201J62126a34096H2467R1105a78936c8699B19275
11402B20675F4180K16426h6238L7797j55220D19619c4493r1865A37247L8576b38202
11390C1738b42656M6664e6215B7047k49b26601k15568A79855a84245h2641A8707
11378a10228A81828l8714b01414a449A03824L9756d1027m0902H7581a0758j91913
$$ y = [185195, 337830, -4072, -16322, -44027, 121837, 48395, 151650, 78243, 302764, -2452, -84564, 244694, 23240, 176595, -131078, -217691, 19703, -36239, -8886, 384550, -290881, 257274, 308617, 286891, 160246, -184766, -190735, 67921, 187775, 31656, 135631, 38128, -274185, -48042, 234671, 206290, 119360, 88017, -52864, 59192, -36328, 214194, -168451, 231750, 116206, 277608, 152383, -65978, 14201, 176327, -134096, 82467, 173572, -178936, -38699, 219275, 220675, 64180, 280606, -86238, -48441, -203661, 419619, -34493, -126358, 137247, 175823, -238202, 31738, -242656, -195992, -56215, 27047, 26798, -226601, -442169, 179855, -184245, -82641, 18707, -110228, 181828, 143114, -201414, -1449, 103824, 143580, -41027, -81929, 87581, -10758, -202671]
11367b02671A03789J08967b25230a00280B20233R8696j20611M565B168L8559a94939
11355E8693c3095l27146q7049A97277N3303b59293B81727a36998a146B73790l7885
11344B35905H1985J71646j26315m504b15709b5840A9272f6955C17959q0590c61403
11332b8620k50670D3573J1417c95899c9112j6142q0834L0100M6206E7788k0137
11321C7651a81190N3035C31096b56110B64309B9253a40301a8749n7306J1376e697
11309B69629i2955B25094d61233D438Q7135Q6802a50232c9782j09936D7674a92326
11297b1042l2403A31109a1300l8261Q508a3765H855c34473h9093A1511J72423
11286A83934j8961D1579c9289j5550j67633A54420c66193I6245b17266e5008D4858
$$ y = [-202671, 103789, 212756, -225230, -100280, 220233, 318929, 198318, 202883, 2168, 40727, -194939, 58693, -33095, -360241, -447290, 197277, 250580, -259293, 281727, -136998, -1146, 273790, 235905, 81985, 253631, 127316, 122812, -215709, -25840, 19272, -66955, 317959, 237369, -361403, -28620, -279290, 43573, 54990, -395899, -39112, -55254, -136088, -105988, -59782, 57788, 37651, -181190, -128155, 331096, -256110, 264309, 29253, -140301, -18749, -76055, -64679, -5697, 269629, -92955, 225094, -461233, 4438, 91573, 178375, -150232, -39782, -149718, 47674, -192326, -21042, -53445, 131109, -11300, -49561, -41053, -13765, 8855, -334473, -89093, 11511, 183934, 164973, 41579, -39289, -54839, -222472, 154420, -366193, 96245, -217266, -55008, 44858]
11274a08981k02754B97333f2024B49238g4545H3379h3883J9789k86758B79897
11263c65880f3839A96717a62146F6685b10502D03631h2262A91142a33903J5520
11253a18383G6118c3639q6078A36752a72411A8326K39307D7137c5794p2060D035
11241a1788k16334C47466A19865A3580b82759D1424K13423f273B26962h4052r3381
11230a77433A09211B3046b34436h1264l1317b8942B94456h0247j77362l1244D2079
11218h382k33567n9685C7259a05752B77696M3803i6330j7115A14343f1160F1782
11206D45075A37174g4658j34869D8262A2612c17381A30a13873A83733J09997c77
11194a15675j15528f0422D0883f5954j25881A25772L9635Q1263B9231i8968D54070
$$ y = [-108981, -311735, 297333, -62024, 249238, -74545, 83379, -83883, -64094, -350852, 279897, -365880, -63839, 196717, -162146, 66685, -210502, 403631, -82262, 191142, -133903, -118383, 76118, -33639, -119717, 136752, -172411, 18326, 257633, 47137, -35794, -107854, 4035, -11788, -228122, 347466, 119865, 13580, -282759, 41424, 254847, -6273, 226962, -84052, -177433, 109211, 23046, -234436, -81264, -112581, -28942, 294456, -80247, -257609, -288853, 42079, -8382, -241949, -301634, 37259, -105752, 277696, 321499, -96330, -113445, 114343, -61160, 61782, 445075, 137174, -74658, -209527, 48262, 12612, -317381, 130, -113873, 183733, 293730, -377, -115675, -231203, -60422, 40883, -65954, -191835, 125772, 165407, 246670, 29231, -98968, 454070]
11182i376A21369e7896j09369k4882A38465K09019j67376F5749a71463a6955n7362
11171g4317q7341q6854A46286a6452A6695a83859b2463A02401b04588C31820b9201
11159e089n7376A0537a15017e6254l8747b7098o4599L6968A40707g7616l5459
11148a13075M2141c3104j58610a7624n10066A5710a23911J3233q2054A36453a89513
11136A40947M65A9451J0123R953R6020n115g6126L2615F70200C6373K57893a83857
11123F2631O5440f1688j8943A59915f1124j57722E6443a36603H6001a01470a3566
11111B29729k0898a02024A40886a89644A48193J09439M8128A42810D128O5081
11101F9209a51055A20783J60801D7575a15445C90387B1806J87968e3701B82553
$$ y = [-9376, 121369, -57896, -167265, -192147, 138465, 347484, 180108, 65749, -171463, -16955, -74317, -161658, -248512, 146286, -16452, 16695, -183859, -22463, 102401, -204588, 331820, -29201, -5089, -62465, 10537, -115017, -56254, -95001, -27098, -91697, -54729, 140707, -77616, -113075, -70934, -33104, -191714, -17624, -527690, 15710, -123911, -110678, -192732, 136453, -189513, 140947, 141412, 19451, 29574, 39527, 135547, 130432, -76126, -43511, 670200, 36373, 294266, -183857, 62631, 128071, -61688, -80631, 159915, -61124, -218846, 56443, -136603, 86001, -101470, -13566, 229729, 208831, -102024, 140886, -189644, 148193, 257632, 305760, 142810, 4128, 69209, -151055, 120783, 281584, 47575, -115445, 390387, 21806, 209774, -53701, 282553]
11090B58834J49281A11742J40180H5219O26138F4892A6487O8004J09765M3356
11080B37612J20784A70040L9143J47849J95356l9103k03508k359K7445M1235J63547
11069E39645A30798L64315A72385K91245K5200k962M3110K23367B35516L14121
11059E49637L3998J9899K91586p8919p0118j49428J86065k00730n8940M6161N2651
11048F21862R1596K06673k06134J64684K06559k13273L9335l32193p288K03810
11038G75631P8946q3108j66526M4465j72094J36781J33210p7354L42873m58305
11028E54519o3892K09367J07865Q5033j1321j33683j79277j53306K21416M60538
11018A097259n17961M00252j88791K2139j6025l5538k84419K25855j37892K2936
$$ y = [258834, 408115, 111742, 251922, 85219, 711357, 64892, 16487, 84491, 194256, 237612, 358396, 170040, 209183, 357032, 552388, 513285, 309777, 307418, 334863, 376098, 539645, 130798, 495113, 172385, 463630, 488830, 485868, 528978, 752345, 235516, 549637, 583635, 603534, 895120, 816201, 746083, 596655, 782720, 581990, 523050, 569211, 621862, 713458, 920131, 713997, 878681, 1085240, 871967, 911302, 579109, 571821, 775631, 854577, 771469, 604943, 649408, 477314, 614095, 747305, 669951, 1012824, 554519, 490627, 699994, 807859, 892892, 881571, 747888, 568611, 415305, 636721, 1097259, 579298, 979550, 790759, 812898, 796873, 761335, 476916, 702771, 564879, 587815]
11008E87815j81326L35444j84545K59704B50132J90688R8923K86659M7901j75312
10998F98991j09017J12352J5167k84435j9563O50405D31266O41300D66081P44904
10988A210985n3146l83948J60402p1308J98095J88951j48604M06710m66153L14609
10978A356593k1796J78332L60914j96467J30635O98503r2106N24326n73657J80196
10968B545473j84055J95489o18764J13017O7380k30877j16697J70004K44983l54575
10958A831378l9922M39999k24241L45444m44275p1590j39968j01647k73849n68038
10948G53291L89839m35323j59626k35646p3740K13605G3176K0796L25846j91679
10938B28139r0397N9741J37074A27033L59316j52010I747L6768a9797k2901A15792
$$ y = [587815, 406489, 741933, 557388, 817092, 250132, 440820, 539743, 826402, 874303, 698991, 589974, 702326, 717493, 433058, 413495, 1063900, 431266, 1072566, 466081, 1210985, 1157839, 773891, 934293, 862985, 1061080, 1250031, 1101427, 1508137, 1041984, 1356593, 1334797, 1513129, 1874043, 1677576, 1808211, 2506714, 2414608, 2938934, 2365277, 2545473, 2361418, 2556907, 1938143, 2051160, 2118540, 1887663, 1770966, 1940970, 2185953, 1831378, 1791456, 2231455, 2007214, 2352658, 1908383, 1836793, 1696825, 1595178, 1321329, 753291, 1143130, 707807, 548181, 312535, 238795, 452400, 73176, 93972, 419818, 228139, 137742, 197483, 334557, 127033, 486349, 334339, 9747, 46515, -19797, -42698, 115792]
10926C25315f8088A03355f9136I8912B6291J07027f5105j30826C20733j43588
10916A77145h6807C282g5419K072P686B71206J92710a00236C17596A41504a81653
10904a43343C40532g8867j9156D09026B7626e6480o2648n2098j29427D92409A39929
10892A70518a76502d4779A5829c01501C71628a52112H8971c2879j29930M5964
10882a16845m2373p7877J6649O7662L2124c6943k8701E1518h0524K6879m343C5139
10869a84794A81391F4751a61952M5697B74660f206A14659a54296A94556c63213
10858D2871a28401B9988a63159m7781M172B70209b01615A73197I398j823c23440
10846b05547G5234G685h9311q8063e0447C08948a43897K4570J4753H650a00494
$$ y = [325315, -68088, 103355, -69136, 98912, 26291, 133318, -65105, -195931, 320733, 177145, -86807, 3282, -75419, -73347, -65661, 271206, 463916, -100236, 317596, 141504, -181653, -143343, 340532, -78867, -98023, 409026, 27626, -56480, -119128, -171226, -300653, 492409, 139929, 170518, -176502, -44779, 15829, -301501, 371628, -152112, 88971, -32879, -162809, -116845, -159218, -237095, -220446, -152784, -120660, -36943, -65644, 51518, -80524, -53645, -57988, 35139, -184794, 181391, 64751, -161952, -116255, 274660, -6206, 114659, -154296, 194556, -363213, 42871, -128401, 29988, -163159, -210940, -206768, 270209, -201615, 173197, 9398, 7575, -323440, -205547, 75234, 7685, -89311, -177374, -50447, 308948, -143897, -119327, -104574, 8650, -100494]
10834c19271A31377O9983b75893A30678C6779g8252k07016d745E0015J56135a4770
10822B61974e4890j55728O2895M2213k9314m2858A99998m8392d6400B71698a44329
10810a19811A87254G9881b35307e2580q7025N7608b6060l70423d1579k49715B39421
10798A68426a32040d0610o9978B72557e1572k27684F713c33762i1576M298K6867
10787f0411A42379A7316a64520b1333B4595a05995r1444Q7971B163O6229J03672
10776A72064a11190g146k76251P4746L1174f4124H3886d7085F4708O5203a40714
10764b26776A36348L6626b91634J43364D14111a30657k545A11258a81192j22410
10754c03602C20127f8094C4683K40528A25725n5848h4538j4424B32828o1416a95413
$$ y = [-319271, 131377, 201360, -275893, 130678, 36779, -78252, -285268, -4745, 50015, 206150, -14770, 261974, -54890, -210618, -147723, -105510, -134824, -177682, 199998, 151606, -46400, 271698, -144329, -119811, 187254, 79881, -235307, -52580, -139605, -81997, -26060, -396483, -41579, -291294, 239421, 168426, -132040, -40610, -110588, 272557, -51572, -279256, 6713, -333762, -91576, -87278, -60411, 142379, 17316, -164520, -21333, 24595, -105995, -197439, -109468, 2163, 68392, 172064, -111190, -7146, -283397, -208651, -177477, -64124, 83886, -47085, 64708, 129911, -140714, -226776, 136348, 172974, -291634, -148270, 414111, -130657, -133202, 111258, -181192, -303602, 320127, -68094, 34683, 275211, 125725, 69877, -84538, -98962, 232828, 171412, -195413]
10742A02250e1752A67279a26102j42384j38614h8496A48207a02656j74333e7220
10731b03082q6819A15433g2839b5266n556A30564O4372g6668j16584F095b31765
10719a72898f7288A19172a29876N5865m8528a058A60217a29747E8582a61212A29902
10707d27107A80986a21896B47114F0051F888Q8296D2087b01482N3459f4606C24211
10695b82614j12964h5170A13497c52623B45378E0189a89371B82257H5490d51211
10684f8534j47210A29190R8052a86519j87884B9859e8891A18607d45036C85925
10673b67540i3911A48064c42197Q5376g6299k18941A44086e1670I8104J30755
10663B28859j8918A0113M3566L16736b87548A18466k5787a2769A20197b57988
$$ y = [102250, -51752, 167279, -126102, -268486, -407100, -88496, 148207, -102656, -276989, -57220, -203082, -289901, 115433, -72839, -25266, -30822, 130564, 194936, -76668, -193252, 6095, -231765, -172898, -67288, 119172, -129876, -74011, -122539, -1058, 160217, -129747, 58582, -161212, 129902, -427107, 180986, -121896, 247114, 60051, 6888, 95184, 42087, -201482, -148023, -64606, 324211, -282614, -395578, -85170, 113497, -352623, 245378, 50189, -189371, 282257, 85490, -451211, -68534, -215744, 129190, 227242, -186519, -374403, 29859, -58891, 118607, -445036, 385925, -267540, -93911, 148064, -342197, -256821, -76299, -295240, 144086, -51670, 98104, 228859, 209941, 10113, 53679, 370415, -287548, 118466, 92679, -12769, 120197, -257988]
10652A92785E8271a20183k43K6922k79404a71379Q4648A84682d6184A70877i6324
10640b38606i5656J4299j74968l3069A59063C901R2355b4546q7859n2565A24972
10628C6149L888K0994O2182a44587L0797B9195a57591m922l5636A59067b86357
10616c2247C3461r00K81225g8252k82794A97307B1640L3619c65509G8550e451
10604D037M7015a11869j8644l1913A39833b99367A18066l2914a13265G3235d618
10592F4065g5832b9235k1713j4763j96570i4384q1066f6177C3907A2028J9641
10581C1669c12076F06a38720C03471A38868a28081F5554a01184C3666Q8984b74511
10569g6063b0831j10467N0074B28199d6219p2127A87030L5962b233k12943g9197
$$ y = [192785, 58271, -120183, -120426, -93504, -372908, -171379, -86731, 184682, -46184, 170877, -96324, -238606, -95656, -81357, -256325, -289394, 159063, 3901, 96256, -24546, -112405, -164970, 124972, 36149, 40037, 61031, 123213, -144587, -113790, 29195, -157591, -162513, -198149, 159067, -286357, -32247, 33461, 32561, 313786, -78252, -361046, 197307, 21640, 55259, -365509, 78550, -5451, 4037, 51052, -111869, -130513, -162426, 139833, -299367, 118066, 85152, -113265, 73235, -4618, 64065, -75832, -29235, -50948, -65711, -262281, -94384, -175450, -66177, 33907, 12028, 31669, -312076, 606, -138720, 303471, 138868, -128081, 65554, -101184, 33666, 122650, -274511, -76063, -20831, -131298, -81224, 228199, -46219, -118346, 187030, 222992, -2233, -215176, -79197]
10557a73933j4614J6579f4104A63970a82382H5768d0585B23152a35719A6863J85565
10546B02428K38468b10165b6735A4387e5321j7076k2008p2168C20145b84163G1924
10534d246k5796p1567F2902d2465A22188c2764B5110J10555d1826J6244B80094
10522c1055k71113a19835A34185e4401C0553g3438j6507K2363k371l87186a28274
10510b42693O9367e8977b512B17379a27172A13689g4916j57285A3213J93430A9287
10498E2101c5665A04781b58074c8796k2659J9629a3026D9974R846a19648j53566
10487b73214a4241o6384H4034L9526J78823M786J81741J21802m9473J52026k00872
10476E12393B37556F8704J01341b36780a09362A20706A4652L8218b71509b4005
$$ y = [-173933, -188547, -171968, -64104, 163970, -182382, 85768, -40585, 223152, -135719, 16863, 202428, 440896, -210165, -26735, 14387, -55321, -72397, -94405, -166573, 320145, -284163, 71924, -4246, -30042, -101609, 62902, -42465, 122188, -32764, 25110, 135665, -41826, -25582, 280094, -31055, -302168, -119835, 134185, -54401, 30553, -73438, -89945, -67582, -69953, -457139, -128274, -242693, -173326, -58977, -2512, 217379, -127172, 113689, -74916, -232201, 13213, 206643, 19287, 52101, -35665, 104781, -258074, -38796, -61455, -41826, -13026, 49974, 59820, -119648, -273214, -14241, -80625, 84034, 123560, 302383, 307169, 488910, 610712, 561239, 713265, 512393, 237556, 68704, 170045, -236780, -109362, 120706, 14652, 52870, -271509, -24005]
10465a45773A20815K36631a07631A30880h3305J0313j03914A84206b26741A03342
10454b32095K0926J5873O1382C11963D581a4751j67026F3673a70248j38069F9070
10442i5505B24274Q7720e265j54976A70891a09907k9089A54240n3398f1446k21877
10431b83323K5218D588a77257k40146B56418B7489a27702A64034L1631a49283
10420B07031d03322a02519k42274B75554F965a11192L1719r0604D7972b78972
10409C81859A90350K59068c5041k19263J22274E2680J46745f0014k08163H3445
10398A24469M841c0137k35064A87623e4933n9574A12880K40932e122r0464J7676
10387g7910I6687d4545H0765J24740H7752P7211p8667b05B2582p377K14739l9358
$$ y = [-145773, 120815, 357446, -107631, 130880, -83305, -72992, -176906, 184206, -226741, 103342, -232095, -211169, -195296, -133914, 311963, 4581, -14751, -181777, 63673, -170248, -308317, 69070, -95505, 224274, 311994, -5265, -160241, 170891, -109907, -138996, 154240, 100842, -61446, -283323, -258105, 4588, -177257, -417403, 256418, 27489, -127702, 164034, 195665, -149283, 207031, -403322, -102519, -344793, 275554, 6965, -111192, -79473, -170077, 47972, -278972, 381859, 190350, 449418, -35041, -254304, -132030, 52680, 199425, -60014, -268177, 83445, 124469, 129310, -30137, -265201, 187623, -54933, -114507, 112880, 353812, -5122, -95586, -77910, 96687, -44545, 80765, 205505, 87752, 164963, 86296, -205, 22582, 15205, 229944, 190586]
10375A90586E6806c0711E23448B57196L18867K283k12670j51536K39496Q4457
10365E38093j05754K1676J47951j59962A97249K57507p6095G1033k9504J7272
10355E8801a99686B76342j09673J74912K63618j37195j12512j59122R0855K70693
10345E57918j43554j92393M45774j45593j10049r8641h1276D66825a8274A92967
10334E7207L7963m695Q8681Q8317K99239B6977d115j49031e0842A3278J34584
10323A47862a70951A73936a4343A25391J26038o3661r026K59582i4819B62825
10312B60030N3248H1553i3986G5162c12675N6095J13674M6495J0691B13068g8260
10300B26156C9458a62166F2811e22991B72541h2322B14741b74925c5904B24683
$$ y = [190586, 56806, -30711, 523448, 257196, 576063, 578346, 365676, 214140, 453636, 538093, 432339, 454015, 601966, 442004, 197249, 454756, 378661, 71033, 41529, 58801, -199686, 276342, 166669, 341581, 605199, 468004, 355492, 196370, 287225, 557918, 414364, 221971, 667745, 522152, 412103, 313462, -81276, 466825, -18274, 192967, 57207, 95170, 90475, 179156, 267473, 566712, 26977, -4115, -153146, -50842, 13278, 147862, -170951, 173936, -14343, 125391, 251429, 187768, 178742, 438324, -94819, 262825, 260030, 313278, 81553, -93986, 75162, -312675, -256580, -142906, -96411, -85720, 213068, -78260, 226156, 39458, -162166, 62811, -522991, 272541, -82322, 214741, -274925, -35904, 224683]
10289b98381m6800b2869j15113C1673c924m3914I2380d90279i4048m9536b9600
10277a90516A47542l8257a28181j81622J48119r4852f24o1930A6152a18642B9623
10265c03088G6114N6861a45793b3146A21424J55860J77586j31962L408I3558J85664
10254B79222a36278a6571B5423J98817c14713a496m9744j51359e0866j91300c4124
10242c16635q2938A0096a14740C03376A689R5934K4723i9528E6853h1314I3350
10230b1548D9248M2310a6764A46602a89941H9109a96517A35856a36938M5158q8604
10219a80384c3385k930B05589k6869a53393m2375a8818B9753a10442L2160j47453
10208b25735A73485F362J02170O5900b20575A60711f1236F4509b31567Q6220I3348
$$ y = [-298381, -345181, -22869, -137982, 31673, -3924, -47838, 92380, -490279, -94048, -143584, -29600, -190516, 147542, 109285, -128181, -309803, -161684, -256536, -624, -62554, 16152, -118642, 29623, -303088, 76114, 132975, -145793, -23146, 121424, 277284, 454870, 322908, 326316, 93558, 279222, -136278, -16571, 25423, 224240, -314713, -1496, -51240, -202599, -50866, -242166, -34124, -316635, -399573, 10096, -114740, 303376, 1689, 97623, 122346, -99528, 56853, -81314, 93350, -21548, 49248, 91558, -16764, 146602, -189941, 89109, -196517, 135856, -136938, -91780, -180384, -33385, -36315, 205589, 178720, -153393, -195768, -18818, 29753, -110442, -78282, -225735, 173485, 6362, 108532, 174432, -220575, 160711, -61236, 64509, -231567, -145347, 93348]
10196A09380L9493a13132j9977B6862J28556b6319F974i4085m2137k36753c0371
10184b79924Q5381A36794k7480b53803B42096a66462K9119A07249a76705m0022
10174b16727N5424A6850K1268j2679a9737B25679c6218j16604j46768e6570D05250
10162B0571L6744i424A55489J27947b21736j78300h2164A17264K7164j2638a269
10150A83206f8836A08749d66548b8521k35462A15047Q0426a45239d7068A18849
10139A77288L8544i2167O212A13264n6594b12560a0783A40859o4247N09a3451
10127g6864F9289b2968g34k83631h3153j69616g7768j46653N0585K2074P958D46653
10114F9448a4342k35215a16026K6273d607o6326J4929n3621B86358a388j89923
$$ y = [109380, 148873, -113132, -133109, 26862, 155418, -26319, 6974, -94085, -136222, -372975, -30371, -279924, -194543, 136794, 109314, -253803, 242096, -166462, -137343, 107249, -176705, -216727, -161303, 16850, 38118, 25439, -19737, 225679, -36218, -152822, -299590, -56570, 405250, 20571, 57315, -9424, 155489, 283436, -221736, -400036, -82164, 117264, 144428, 131790, -1269, 183206, -68836, 108749, -466548, -28521, -263983, 115047, 195473, -145239, -47068, 118849, 177288, 215832, -92167, -85955, 113264, 56670, -212560, -10783, 140859, 76612, 77121, -13451, -76864, 69289, -22968, -734, -284365, -83153, -252769, -77768, -224421, -173836, -151762, -143804, 446653, 69448, -14342, -249557, -116026, -89753, -4607, -70933, -56004, -109625, 286358, -1388, -191311]
10103a91311f4949j31299A73621a28290m9140p4232k1684g8621p7993l9828I9471
10091a8386B71603M8094a03776d4409A42276k1662a9965H1036J35748f9642l1848
10080a01490H8418c21971A6161f9083H541b83630C7468a17688A87463a29488j59438
10069b88926i6088A71895m9552m7214c83204M3330c4975B10199d7431A35793d5018
10057B4026b58782B61300C3909a21859j4664b7235A30978i9788A7213b1628j3529
10046c5157D8987a12055q3140j17741g783k31482L4104b6768B851J9682b07027
10034A04058B2717g6515j09663j60423a45353N9224A67445b4771m5420b6095m7128
10023g3223A47989a34092A99567a97379n1750i159k44872K934F2808c6821k6562
$$ y = [-191311, -64949, -196248, 173621, -128290, -177430, -251662, -273346, -78621, -156614, -196442, 99471, -18386, 271603, 319697, -103776, -44409, 142276, 120614, -19965, 81036, 216784, -69642, -101490, 88418, -321971, 16161, -69083, 8541, -283630, 37468, -117688, 187463, -129488, -288926, -96088, 171895, 122343, 75129, -383204, -339874, -34975, 210199, -47431, 135793, -45018, 24026, -258782, 261300, 33909, -121859, -136523, -27235, 130978, -99788, 17213, -21628, -35157, 48987, -112055, -195195, -312936, -7783, -239265, -205161, -26768, 2851, 22533, -207027, 104058, 22717, -76515, -186178, -346601, -145353, -86129, 167445, -24771, -70191, -26095, -73223, 147989, -134092, 199567, -197379, -249129, -9159, -254031, -251097, 62808, -36821, -63383]
10012f3383k8512k1033A27487b3561A41174h9266C26188p6480a68448A81382j1326
10001A70056K3472o5072i3022B7971p860c0745j27231o4691A4186a81015j8984
9990a99999O6228j97885a36536H3207J29512b2506j32509j1651c180j9730n6164
9979g9074H5531a35899d3072B66831a60501B84535C0020a61294e1292A45870n9923
9968H5947n077g2865k37869J16067G5287b77830J07172K1396j88940j03483a2072
9956i50D2092a16706B08157a39907A89841C1296J89475A0350c8109j92838I7960
9944b05642I497J02595J299d03271g6591B906b19969e8601j46356e6526J8581
9933c7945k91410J6887c1063I03a64111A0355P8135a57482L6456j77707A66357
$$ y = [-63383, -91895, -112928, 127487, -23561, 141174, -89266, 326188, 249708, -168448, 181382, 170056, 193528, 128456, -93022, 27971, 20111, -30745, -157976, -222667, 14186, -181015, -199999, -133771, -331656, -136536, 83207, 212719, -22506, -155015, -166666, -3180, -22910, -79074, 85531, -135899, -43072, 266831, -160501, 284535, 30020, -161294, -51292, 145870, 85947, 80870, -72865, -310734, -194667, 75287, -277830, -170658, -149262, -338202, -441685, -12072, -950, 42092, -116706, 208157, -139907, 189841, 31296, 220771, 10350, -38109, -230947, 97960, -205642, 9497, 112092, 113391, -403271, -76591, 2906, -219969, -58601, -204957, -56526, -37945, -329355, -312468, -31063, 903, -164111, 10355, 88490, -157482, -121026, -298733, 166357]
9921a34994r343b6654m12231A05708a18169m0752j48507r8296e1206A08747b4108
9909B29571K5305R28f056k73858a13266B78853c02884a21668N2730M670A5822
9897A30981g4439m3384A639e8061m480o4520f756r9146A44589e797n3175k31051
9885b90023B01828c08982f7898j4985B90874A22762a79402j58819A20851a47138
9874b56580R3504K2264e5014j71157K3798Q4417A79385b7068F460i9763J099A6298
9861B87514a74932O245j10020C88402A64710b96263A48538c3238p9353k10309
9851c22900i6971D8820h2351r7491b1762I2630a81354Q49P6810j58100P0605P9733
9839a11457k7522A54896a68995K9383b3312E75626c47807d79F8243k7334a85267
$$ y = [-134994, -144337, -26654, -438885, 105708, -118169, -158921, -307428, -405724, -51206, 108747, -24108, 229571, 254876, 255804, -6056, -279914, -113266, 278853, -302884, -121668, -68938, -64268, 15822, 130981, -74439, -117823, 1639, -58061, -62541, -127061, -6756, -105902, 144589, -5797, -58972, -290023, 201828, -308982, -67898, -82883, 290874, 122762, -179402, -338221, 120851, -147138, -256580, -163076, -140812, -55014, -226171, -202373, -117956, 179385, -27068, 6460, -99763, -98664, 16298, 287514, -174932, -168687, -278707, 388402, 164710, -296263, 148538, -33238, -112591, -322900, -96971, 48820, -82351, -179842, -21762, 92630, -181354, -180505, -103695, -261795, -191190, -111457, -138979, 154896, -168995, -139612, -23312, 575626, -347807, -479, 68243, 40909, -185267]
9827B068a06734I4333B803b72512K6589A70727b78233f4316q4161A22392a62664
9815b16872H6883b9045A37579j8384d7936E1902P6188b6522l26844J34643j38855
9804c57578m784A60159a80497l175B17014H486O2065k0349J85209a02822D7622
9792A00470K709J00802b72204h75j82669b3801I864J79889e4964q845K266q8264
9780a49807H8896C1430b47456B37712I7537b33696n4372b3394k48986A84017m9620
9769A34397a67033L8358E2858K3168P8791A8389a3001H1478i5269l4114i412r5318
9757a04730O829L1124q8891j01701k0802I3313c4302A06610l3090h82F4146a50128
9744c6378k07150h7897l3474b5488j20124j14051M8739C7482a84346I9197b43634
$$ y = [2068, -106734, 94333, 2803, -272512, -245923, 170727, -278233, -64316, -148477, 122392, -162664, -216872, 86883, -29045, 137579, 119195, -47936, 51902, 128090, -26522, -353366, -218723, -357578, -362362, 160159, -180497, -183672, 217014, 8486, 70551, 50202, 235411, -102822, 47622, 100470, 103179, 203981, -272204, -875, -183544, -23801, 9864, 189753, -54964, -63809, -61543, -149807, 88896, 31430, -247456, 237712, 97537, -233696, -288068, -23394, -272380, 184017, 134397, -167033, -128675, 52858, 76026, 154817, 18389, -13001, 81478, -95269, -129383, -9412, -104730, -97901, -66777, -155668, -257369, -278171, 93313, -34302, 106610, 73520, -882, 64146, -150128, -36378, -243528, -87897, -121371, -25488, -145612, -259663, -210924, 37482, -184346, 99197, -243634]
9732f9196n2787b3542A29635f1683B89834B6547c89841J67978N7914N7212j32262
9721b38999c5643A42961c2380l20680J36517j3258c2061m3577l94492E0736c39142
9709F6438a64499k1722M5117f3035j66343F4279c36426D4344c3478k99651a60002
9697a04652N360c4723k98380E2339b00365A5553a44593a3858d78F4595c25767
9685a69868N657f0219J1583m0919q4036B89097a85661A26610b12783A06584k6941
9674G9643k996b23098f5811H3299a40744a3707B63803A00834c39349A11543q259
9663A03284J37160a12624d1812B98486B5400J75528a14412n3613l49004E4161
9652c88659c7753B11123a29951j12810m7497C41259i8803G7123b75439A10385
$$ y = [-69196, -121983, -23542, 129635, -61683, 289834, 26547, -389841, -221863, -163949, -106737, -238999, -35643, 142961, -32380, -353060, -216543, -229801, -32061, -75638, -470130, 50736, -339142, 66438, -164499, -186221, -141104, -63035, -229378, 64279, -336426, 44344, -33478, -333129, -160002, -104652, -99292, -34723, -333103, 52339, -200365, 15553, -144593, -13858, -478, 64595, -325767, -169868, -164211, -60219, -48636, -89555, -173591, 289097, -185661, 126610, -212783, 106584, 79643, 76647, -223098, -65811, 83299, -140744, -13707, 263803, 100834, -339349, 111543, 103284, 240444, -112624, -41812, 298486, 25400, 200928, -114412, -168025, -517029, 54161, -388659, -37753, 211123, -129951, -242761, -290258, 341259, -98803, 77123, -275439, 110385]
9641b22835A11814a86630E5615c09865A80709a74144M2930j46686J28310A11917
9630I8950a50563J6177M940j62003h5254p0148N227K4017K8162A08871D3487A2443
9617a63617A0882N8387f2206n64621a44962B11647b23260h6720A67354g2408L2291
9606d0117m6611j9732j9321A95402b4876C8031b34396c5212B07843I1752A4379
9594d93801B39234j08772R895D6513a6560A32354A2262b0447G7782b00352j98788
9583c99140a50408p3341O420a5576j02963j27366j14786f4608E3373a20017M7154
9572g2863n579k407G1718a22470J5265A03991a10494A65934D3066J00673a8251
9560a44508l5418e6798A90457g6466k86554A86926a05363k13257b5728A60490
$$ y = [-222835, 111814, -186630, 55615, -309865, 180709, -174144, -131214, -277900, -149590, 111917, 98950, -150563, -134386, -129446, -291449, -85254, -155402, -150175, -126158, -97996, 108871, 43487, 12443, -163617, 10882, 69269, -62206, -626827, -144962, 211647, -223260, -86720, 167354, -72408, -40117, -86728, -106460, -125781, 195402, -24876, 38031, -234396, -35212, 207843, 91752, 14379, -493801, 239234, 130462, 140357, 46513, -16560, 132354, 12262, -20447, 77782, -200352, -399140, -150408, -223749, -217329, -15576, -118539, -245905, -360691, -64608, 53373, -120017, -72863, -78442, -80849, 71718, -122470, -107205, 103991, -110494, 165934, 43066, 143739, -18251, -144508, -179926, -56798, 190457, -76466, -363020, 186926, -105363, -318620, -25728, 160490]
9549d2547k7743j55816B24961e2673I0019c2651n4477j58756K5314e7015o5228
9538a22243C9080h0820l7627A75010a29384J8857B17325E2685e927A30393c92911
9526g0450G0696p445f5043C36338B2622K4534h8641a9823j95053J06005E9636
9514a26111A21979a53067D9426b02609g666D2412J76059c06429e9370j27848O1169
9503a26049M7153J8484a8946F0218A5769c13341g1939g300A00508g2032K874a8068
9490a95353q578e4938Q553D7411a08104d3244B64826h14j50182H9635a13562b7959
9477c69280A16209b7700C16735e33925f347j98617K64B05328d1620o9966J7560
9466i4026k7864c3418k6479G6341a89145f5295j31747k11279J46027J14266A77153
$$ y = [-42547, -70290, -226106, 224961, -52673, 90019, -32651, -87128, -245884, -220570, -57015, -122243, 39080, -80820, -118447, 175010, -129384, -110527, 217325, 52685, -5927, 130393, -392911, -70450, 70696, 63251, -65043, 336338, 22622, 47156, -88641, -19823, -214876, -108871, 59636, -126111, 121979, -153067, 49426, -202609, -7666, 42412, 218471, -306429, -59370, -187218, -126049, -78896, -60412, -18946, 60218, 15769, -313341, -71939, -7300, 100508, -72032, -69158, -18068, -195353, -203931, -54938, -46385, 47411, -108104, -43244, 264826, -814, -150996, 89635, -113562, -27959, -369280, 116209, -27700, 316735, -533925, -6347, -204964, -204700, 205328, -41620, -111586, -94026, -121890, -33418, -59897, 76341, -189145, -65295, -197042, -408321, -262294, -148028, 177153]
9454A70890a86188m8293P9367A05323O5066a28927A49249a07233n00171J36053
9444d71351R2490c7062B94019j40965k9523B8601J55151b43259G052J19113P9045
9433B05210L591c91162C79212H151L06580d12134e8851k6177l3014H4820c6474
9421A12422a04259j46042A79602G2693b78958A0047J5218J8663J73173c6750G9822
9409F5430a2079J952B39883b70052f6344J754j06916D3455a80182k7791n0150
9398b58123a26331j40687h6480F9462a11410e713k07625A15654e1928n3808m5489
9387a51225r161O3587A16614a70440l84778A67725n5518f1095o1622J0470l4577
9376a46824a3339C523L15938a68886e4761r2881f0467j19053Q8159B4696a40923
$$ y = [170890, -186188, -234481, -155114, 105323, 170389, -128927, 149249, -107233, -607404, -471351, -378861, -37062, 294019, 153054, 123531, 28601, 183752, -243259, 7052, 126165, 205210, 208801, -391162, 379212, 8151, 314731, -412134, -58851, -85028, -118042, 84820, -36474, 112422, -104259, -250301, 179602, 72693, -278958, 10047, 25265, 43928, 217101, -36750, 79822, 65430, -12079, -10127, 239883, -270052, -66344, -64590, -171506, 43455, -180182, -207973, -258123, -126331, -267018, -86480, 69462, -111410, -5713, -213338, 115654, -51928, -105736, -151225, -160386, -96799, 116614, -170440, -555218, 167725, 112207, -61095, -122717, -112247, -146824, -13339, 3523, 319461, -168886, -54761, -147642, -60467, -179520, -91361, 24696, -140923]
9364c9448P972D3350c09324G6037O7689a47790M7138o3745C22878c94675C54448
9352f3664l8728a3095C090K46615a15899A48423f1430C8145a74280A19084a85087
9340G1948K933d38578H9309a94826e7743r9177A77004a99087C87145B5970b00076
9328b19853M7418l39821b04261i6331B9916c5970r0206L9417j79955P9781P6870
9317a10063j14206A8468k193L2531f1802D0907a26153N3293B48967a98963A18464
9305A90979B4347O9095a93070A63934J6498h3018k8275L4902a7493B23520j00722
9294A22798b52381q6809e505j59232D5813a37870C76906a63592g4385o8563A40261
9282b43728F1918c35303a28683j38825l9416I546J87380b56499I1107L0013K7122
$$ y = [-39448, -31476, 43350, -309324, 76037, 143726, -147790, -100652, -164397, 322878, -394675, 354448, -63664, -102392, -13095, 3090, 249705, -115899, 148423, -61430, 38145, -174280, 119084, -185087, 71948, 74881, -438578, 89309, -194826, -57743, -156920, 177004, -199087, 387145, 25970, -200076, -219853, -172435, -512256, -204261, -96331, 29916, -35970, -126176, -86759, -266714, -186933, -110063, -224269, 18468, 16275, 48806, -61802, 40907, -126153, -72860, 248967, -198963, 118464, 190979, 24347, 93442, -193070, 163934, 180432, -83018, -111293, -76391, -17493, 223520, 122798, -252381, -339190, -5505, -164737, 45813, -137870, 376906, -163592, -74385, -142948, 140261, -243728, 61918, -335303, -128683, -267508, -306924, 9546, 196926, -256499, 91107, 121120, 148242]
9271A48242a14985p9742r6683e8446k2760k63835A77839p8253L8468a54457A96412
9259a29906e7059b4165C79700j12226c66527J24639k697N1660A30490J3156i6242
9247d68311A5920M4686c23153a09348a222n6798r1072q9659c7290k76730R8815
9236b15205Q706C097a96457A11563b145A62241a61653P1762A73934n8992b85431
9224a1142D5681b07734k28911a34384C998A515b29887j00539A31608b46458M4177
9213b02281r5684J43911c6989D6150a97029A4711Q9245a29239n6414A76831b27519
9201B14461b05060i6607K5822j1002B5634a18507A0576K00202b08572k0870H0161
9189e4972l42868h9430p7990o145F8887a46981j12095c1987r4939M165a4432I4998
$$ y = [148242, -114985, -194727, -291410, -58446, -81206, -345041, 177839, 99586, 138054, -154457, 196412, -129906, -57059, -24165, 379700, 267474, -366527, -241888, -244585, -192925, 130490, 143646, -96242, -468311, 15920, 60606, -323153, -109348, -1222, -58020, -149092, -238751, -37290, -314020, -215205, -206499, 3097, -196457, 111563, -2145, 162241, -161653, -89891, 173934, 114942, -285431, -11142, 45681, -207734, -436645, -134384, 3998, 1515, -229887, -330426, 131608, -246458, -202281, -297965, -154054, -36989, 46150, -197029, 14711, 103956, -129239, -185653, 176831, -227519, 214461, -205060, -96607, -70785, -81787, 25634, -118507, 10576, 210778, -208572, -229442, 80161, -54972, -397840, -89430, -167420, -173565, 68887, -146981, -259076, -31987, -126926, -122761, -14432, 94998]
9176A81666d5202b1344B38702B387e3189H1806k984c13345H7721a25399E9431
9164a68036p284D8780a10292A31868E5261d42787a2805k58928a29010G35J59224
9153A59959m6387D068K03932G0179C911R692h2306A77951c36859A1795o13h4387
9140b23408M0201h8649G7066h2934a2145l83164g5075k20256o1842M1017A0074
9128A86449a33557k71884J34638J07058A04164l4725b66090P222C7324j2498R9192
9117A24018b39301R8800C4007P158J88520B7709a9367q8405b1525j67966D749
9105E8531a21669I8195b60022A19482h6395r1021j41709a43874D57d5597j98466
9094b44063g6368j6638j11666c511j01464A96670r3064B6898m613f01304B6587
$$ y = [181666, -45202, -21344, 238702, 2387, -53189, 81806, 78822, -313345, 87721, -125399, 59431, -168036, -175320, 48780, -110292, 131868, 55261, -442787, -12805, -271733, -129010, 735, 159959, 113572, 4068, 208000, 70179, 3911, 13603, -82306, 177951, -336859, 11795, 11182, -84387, -223408, -183207, -88649, 77066, -82934, -12145, -395309, -75075, -295331, -357173, -316156, 10074, 186449, -133557, -405441, -270803, -163745, 104164, 69439, -266090, -258868, 37324, 24826, 124018, -239301, -140501, 34007, 41165, 229685, 27709, -19367, -107772, -21525, -189491, 4749, 58531, -121669, 98195, -260022, 119482, -86395, -177416, -319125, -143874, 457, -45597, -244063, -76368, -93006, -204672, -3511, -104975, 196670, 103606, 26898, 22285, -601304, 26587]
9082a34753O4622R979r6516K4549A94911b32556B36742A188P8852c04353K9336
9071b75017c84k80938A02208J22891a37347j5825j16937H3988c9742k64235h9935
9059A9144c2415j70020f3953m0004r5518q3133B8909P0830l9025d03920A19468
9047I5574D0918J13288a68199A56023N2896B900b54216h6761A16698m0105B2044
9035A45028B9062G577b1307j30619n1943e5583A6493e2436D1181A7754a5438E7223
9022e4336A87401b8126F1269J50159l2214a69381j50275H6606e1869k06172E5842
9010A96262a9715m5354I5223b63049a585q7462q5777j63424B5715a7210E7353
8998A59085M3238A3733a92619b2924j54988A01947b57565P7832b6411q6601F5011
$$ y = [-134753, -70131, -60152, -156668, -132119, 194911, -232556, 236742, 1188, 80040, -304353, -275017, -384, -281322, 102208, 225099, -137347, -153172, -270109, 83988, -39742, -303977, -89935, 19144, -32415, -202435, -63953, -103957, -199475, -282608, 28909, 99739, 60714, -403920, 119468, 95574, 40918, 154206, -168199, 156023, 208919, 2900, -254216, -86761, 116698, 76593, 22044, 145028, 29062, 7577, -21307, -151926, -203869, -55583, 16493, -52436, 41181, 17754, -15438, 57223, -54336, 187401, -28126, 61269, 211428, 179214, -169381, -319656, 86606, -51869, -258041, 55842, 196262, -19715, -65069, 95223, -263049, -1585, -89047, -174824, -338248, 25715, -17210, 57353, 159085, 202323, 13733, -192619, -22924, -177912, 101947, -257565, -179733, -26411, -113012, 65011]
8986b28587I6391a39268F7880J6631c80262D55472b85196J6412A34734D3309d1264
8974c3863n2461j7562F4273d0975A0777J95626a79773D9923a5534B71147F6793
8962b38126f0649n8819A5972K06897b05400d5328q1991H7018J07091H617K62920
8951B71537b830k31110e331l6697j5956A98929b7526G4316a67081H2518a77606
8939B8105M4026e8372n6874I2991J32604A6497d4732l05453a66196l5951B46051
8927C7276a7494D5325K87002J30561M36993K752546J802423A369744D12329K27398
8917F39727A14361a7859p181D5516a74158j61432a42263j16893A23281a76868
8906i4644j70867e5351k50873a06532l47118a46345j15669A20768b29283F2483
$$ y = [-228587, 96391, -139268, 67880, 84511, -380262, 455472, -285196, -268784, 134734, 43309, -41264, -33863, -86324, -103886, 64273, -40975, 10777, 206403, -179773, 49923, -15534, 271147, 66793, -238126, -60649, -119468, 15972, 222869, -205400, -45328, -127319, 87018, 194109, 8617, 271537, -2830, -233940, -5331, -42028, -57984, 198929, -27526, 74316, -167081, 82518, -177606, 28105, 72131, -58372, -115246, 92991, 225595, 16497, -44732, -350185, -166196, -202147, 246051, 37276, -17494, 45325, 332327, 462888, 899881, 3652427, 5454850, 1369744, 412329, 639727, 114361, -17859, -25040, 45516, -174158, -335590, -142263, -259156, 123281, -176868, -94644, -265511, -55351, -306224, -106532, -453650, -146345, -262014, 120768, -229283, 62483]
8895A15269a59346C8205a98529j2672R0883A32311E5575b38329C1296a16275o2196
8884a78471I6429f86j4284j35907j45552O0609j1100K2334B30302B9682a06923
8872i9939H3207a83947e4685a7551A33853a02238D1081a43727F7707a89674A13689
8860B10787L825a22658D0168A5072J19662J92198c13365H6400i7336D6807g8855
8848b16238m3366f8835R94A87576e0321A94644a753j08794j02634d6119j84783
$$ y = [115269, -159346, 38205, -198529, -211201, -120318, 132311, 55575, -238329, 31296, -116275, -178471, 96429, -686, -14970, -150877, -296429, -235820, -246920, -224586, 230302, 29682, -106923, -99939, 83207, -183947, -54685, -17551, 133853, -102238, 41081, -143727, 67707, -189674, 113689, 210787, 214612, -122658, 40168, 15072, 134734, 326932, -313365, 86400, -97336, 46807, -78855, -216238, -259604, -68835, -67841, 187576, -50321, 194644, -1753, -110547, -213181, -46119, -230902]
$$ [...]
##END NTUPLES=NMR SPECTRUM
##END=
