##TITLE=AC1663_CTIAH14354_8570663_Yji3kNUmoW
##JCAMPDX= 6.0         $$ Bruker NMR JCAMP-DX V2.0
##DATA TYPE= NMR SPECTRUM
##DATA CLASS= NTUPLES
##ORIGIN= BRUKER
##OWNER= Administrator
$$ 1.72 TOPSPIN		Version 2.1
$$ 2014-04-11 17:00:15.197 -0700  Administrator@X
$$ Compression mode = diff/dup
##.OBSERVE FREQUENCY= 400.02188249412
##.OBSERVE NUCLEUS= ^1H
##.ACQUISITION MODE= SIMULTANEOUS (DQD)
##.ACQUISITION SCHEME= undefined
##.AVERAGES= 64
##.DIGITISER RES= 22
##SPECTROMETER/DATA SYSTEM= spect
##.PULSE SEQUENCE= noesygpps1d.comp
##.SOLVENT NAME= COFFEE_meoh
##.SHIFT REFERENCE= INTERNAL, COFFEE_meoh, 1, 14.96101
##AUDIT TRAIL= $$ (NUMBER, WHEN, WHO, WHERE, PROCESS, VERSION, WHAT)
$$ ##TITLE= Audit trail, TOPSPIN		Version 2.1
$$ ##JCAMPDX= 5.01
$$ ##ORIGIN= Bruker BioSpin GmbH
$$ ##OWNER= Administrator
$$ $$ E:\/data/COFFEE/nmr/AC1663_CTIAH14354_8570663_Yji3kNUmoW/12/pdata/1/auditp.txt
$$ ##AUDIT TRAIL=  $$ (NUMBER, WHEN, WHO, WHERE, PROCESS, VERSION, WHAT)
(   1,<2014-04-11 17:00:09.868 -0700>,<Administrator>,<X>,<go>,<TOPSPIN 2.1>,
      <created by zg
	started at 2014-04-11 16:48:42.871 -0700,
	POWCHK enabled, PULCHK disabled,
       configuration hash MD5:
       C8 4E 4E 5D D3 5C D8 9E 9F 52 82 E0 59 8A DE 15
       data hash MD5: 64K
       EB 0E 2D 2C 62 A4 AE E1 7E DB CA 9A F6 6B 18 39>)
(   2,<2014-04-11 17:00:12.990 -0700>,<Administrator>,<X>,<proc1d>,<TOPSPIN 2.1>,
      <Start of raw data processing
       efp LB = 0.3 FT_mod = 6 PKNL = 1 PHC0 = 0 PHC1 = 0 SI = 128K 
       data hash MD5: 128K
       1D 7A F3 E7 33 4A 38 E2 64 8F 22 66 54 40 72 2F>)
(   3,<2014-04-11 17:00:13.969 -0700>,<Administrator>,<X>,<proc1d>,<TOPSPIN 2.1>,
      <pk PHC0 = -85.77026 PHC1 = 0 
       data hash MD5: 128K
       9E 89 53 4D CC F4 E3 84 32 94 DD BD EF CD BD 37>)
(   4,<2014-04-11 17:00:14.498 -0700>,<Administrator>,<X>,<proc1d>,<TOPSPIN 2.1>,
      <abs ABSG = 1 
       data hash MD5: 128K
       8F 60 51 2E AA 6D 15 52 10 7A B9 A4 C7 03 8A 92>)
(   5,<2014-04-11 17:00:14.606 -0700>,<Administrator>,<X>,<proc1d>,<TOPSPIN 2.1>,
      <abs ABSG = 2 
       data hash MD5: 128K
       F6 40 DE 13 47 5D BC DC C3 A9 02 1B 6E E5 47 ED>)
(   6,<2014-04-11 17:00:14.731 -0700>,<Administrator>,<X>,<proc1d>,<TOPSPIN 2.1>,
      <abs ABSG = 3 
       data hash MD5: 128K
       1D 7E CD 56 F6 8D 3B F5 93 D9 83 1B 7F 39 27 C5>)
(   7,<2014-04-11 17:00:14.824 -0700>,<Administrator>,<X>,<proc1d>,<TOPSPIN 2.1>,
      <abs ABSG = 4 
       data hash MD5: 128K
       47 92 B4 EA 6B 53 69 A3 37 CE 58 80 FD 74 69 4E>)
(   8,<2014-04-11 17:00:14.933 -0700>,<Administrator>,<X>,<proc1d>,<TOPSPIN 2.1>,
      <abs ABSG = 5 
       data hash MD5: 128K
       EF CE 1D 5E 47 58 A0 06 A5 B5 6D A3 F8 E3 FD D5>)
$$ ##END=
$$ 
$$ $$ hash MD5
$$ $$ DB 2A F4 C6 3D 51 6E C6 C8 E5 42 D2 ED 1A EB 7F
##$RELAX= 
##$RELAX= 
##$RELAX= 
##$RELAX= 
##$RELAX= 
##$RELAX= 
##$RELAX= 
##$RELAX= 
$$ Bruker specific parameters
$$ --------------------------
##$DU= <E:\>
##$EXPNO= 12
$$ [...]
##$TP07= 0
##$TPNAME0= <>
##$TPNAME1= <>
##$TPNAME2= <>
##$TPNAME3= <>
##$TPNAME4= <>
##$TPNAME5= <>
##$TPNAME6= <>
##$TPNAME7= <>
##$TPOAL= (0..7)
0.5 0.5 0.5 0.5 0.5 0.5 0.5 0.5
##$TPOFFS= (0..7)
0 0 0 0 0 0 0 0
##$TUNHIN= 0
##$TUNHOUT= 0
##$TUNXOUT= 0
##$USERA1= <user>
##$USERA2= <user>
##$USERA3= <user>
##$USERA4= <user>
##$USERA5= <user>
##$V9= 5
##$VALIST= <valist>
##$VCLIST= <CCCCCCCCCCCCCCC>
##$VD= 0
##$VDLIST= <DDDDDDDDDDDDDDD>
##$VPLIST= <PPPPPPPPPPPPPPP>
##$VTLIST= <TTTTTTTTTTTTTTT>
##$WBST= 1024
##$WBSW= 4
##$XGAIN= (0..3)
0 0 0 0
##$XL= 0
##$YL= 0
##$YMAX_a= 6466959
##$YMIN_a= -13395317
##$ZGOPTNS= <>
##$ZL1= 120
##$ZL2= 120
##$ZL3= 120
##$ZL4= 120
##$ABSF1= 14.96101
##$ABSF2= -5.597172
##$ABSG= 5
##$ABSL= 3
##$ALPHA= 0
##$AQORDER= 0
##$ASSFAC= 0
##$ASSFACI= 0
##$ASSFACX= 0
##$ASSWID= 0
##$AUNMP= <proc_prof1d_extract.lims>
##$AXLEFT= 0
##$AXNAME= <>
##$AXNUC= <1H>
##$AXRIGHT= 0
##$AXTYPE= 0
##$AXUNIT= <>
##$AZFE= 0.1
##$AZFW= 0.1
##$BCFW= 0
##$BC_mod= 0
##$BYTORDP= 0
##$COROFFS= 0
##$CY= 15
##$DATMOD= 1
##$DC= 0
##$DFILT= <>
##$DTYPP= 0
##$F1P= 0
##$F2P= 0
##$FCOR= 0.5
##$FTSIZE= 131072
##$FT_mod= 6
##$GAMMA= 0
##$GB= 0
##$INTBC= 1
##$INTSCL= 1
##$ISEN= 128
##$LB= 0.3
##$LEV0= 0
##$LPBIN= 0
##$MAXI= 10000
##$MC2= 0
##$MEAN= 0
##$ME_mod= 0
##$MI= 0
##$NCOEF= 0
##$NC_proc= -2
##$NLEV= 6
##$NOISF1= 0
##$NOISF2= 0
##$NSP= 0
##$NTH_PI= 0
##$NZP= 0
##$OFFSET= 14.96101
##$PC= 1
##$PHC0= -85.77026
##$PHC1= 0
##$PH_mod= 1
##$PKNL= yes
##$PPARMOD= 0
##$PPDIAG= 0
##$PPIPTYP= 0
##$PPMPNUM= 2147483647
##$PPRESOL= 1
##$PSCAL= 4
##$PSIGN= 0
##$PYNMP= <proc.py>
##$REVERSE= no
##$SF= 400.020009632322
##$SI= 131072
##$SIGF1= 0
##$SIGF2= 0
##$SINO= 400
##$SIOLD= 131072
##$SPECTYP= <>
##$SREGLST= <1H.CDCl3>
##$SSB= 0
##$STSI= 131072
##$STSR= 0
##$SW_p= 8223.68421052631
##$SYMM= 0
##$S_DEV= 0
##$TDeff= 65536
##$TDoff= 0
##$TI= <>
##$TILT= no
##$TM1= 0
##$TM2= 0
##$TOPLEV= 0
##$USERP1= <user>
##$USERP2= <user>
##$USERP3= <user>
##$USERP4= <user>
##$USERP5= <user>
##$WDW= 1
##$XDIM= 131072
##$YMAX_p= 405450123
##$YMIN_p= -11844
##$CURPLOT= <Network HP LaserJet P1505>
##$CURPRIN= <$Network HP LaserJet P1505>
##$DFORMAT= <normdp>
##$LAYOUT= <+/1D_H.xwp>
##$LFORMAT= <normlp>
##$PFORMAT= <normpl>
##$SURQMSG= 1
$$ End of Bruker specific parameters
$$ ---------------------------------
##NTUPLES= NMR SPECTRUM
##VAR_NAME=  FREQUENCY,     SPECTRUM/REAL,   SPECTRUM/IMAG
##SYMBOL=    X,             R,               I
##VAR_TYPE=  INDEPENDENT,   DEPENDENT,       DEPENDENT
##VAR_FORM=  AFFN,          ASDF,            ASDF
##VAR_DIM=   131072,        131072,          131072
##UNITS=     HZ,            ARBITRARY UNITS, ARBITRARY UNITS
##FACTOR=    0.0627417313425164, 1,          1
##FIRST=     8223.62146879497, 2013,         -64607
##LAST=      0,             4381,            -64288
##MIN=       0,             -11844,          0
##MAX=       8223.62146879497, 405450123,    0
$$ Real data points
##PAGE= N=1
##DATA TABLE= (X++(R..R)), XYDATA
$$ [...]
$$ plain form
61550 397755 397420 396862 396502 396411 396246 395776 395361 395593 396502 397505 398203 398873 399938 401249 402243 402733 403196 404195
61532 404195 405753 407552 409548 411911 414248 415452 414878 413355 412323 412048 411523 410240 408997 408440 407768
61517 407768 405874 403203 401368 401092 401548 401770 401753 401913 402265 402602 402940 403391 403912 404512 405433 406906 408930
61500 408930 411478 414665 418493 422627 426625 430313 433822 437360 441026 444824 448801 453089 457621 461844
61486 461844 465007 466884 467934 468667 469261 470005 471586 474410 478013 481637 485070 488337 490953 492234 492160
61471 492160 491171 489241 486022 481967 478459 476463 475632 474982 473948 472472 470570 468198 465296 461743 457512
61456 457512 453020 449124 446619 445811 446418 447612 448409 448460 448432 449210 450891 452949 455063 457158 458879 459851
61440 459851 460467 461601 463423 465280 466785 468224 469686 470699 471107 471548 472558 473837 474817 475426 475846 476096
$$ packed form
61550C97755l35n58l60r1j65m70m15K32R09J003O98O70J065J311R94M90M63R99
61532D04195J558J799J996K363K337J204n74j523j032k75n25j283j243n57o72
61517D07768j894k671j835k76M56K22j7J60L52L37L38M51N21O00R21J473K024
61500D08930K548L187L828M134L998L688L509L538L666L798L977M288M532M223
61486D61844L163J877J050P33N94P44J581K824L603L624L433L267K616J281p4
61471D92160r89j930l219m055l508j996q31o50j034j476j902k372k902l553m231
61456D57512m492l896k505q08O07J194P97N1k8P78J681K058K114K095J721R72
61440D59851O16J134J822J857J505J439J462J013M08M41J010J279R80O09M20K50
$$ plain form
61424 476096 476360 477237 479149 481839 484826 487987 491291 494408 496943 498716 499524 499118 497799 496499 495775
61409 495775 495164 493992 492381 490945 489987 489576 489986 491246 492496 492581 491341 489708 488512 487746 487091 486627
61393 486627 486729 487495 488527 489277 489628 490074 491157 492762 494271 495548 497369 500581 505087 510037 514823
61378 514823 519583 524786 530598 536629 542245 547199 551903 556845 561746 565660 567999 569044 569354 569149 568429
61363 568429 567240 565570 563392 561048 559106 557577 555829 553671 551998 551892 553516 556381 560266 565258
61349 565258 571184 577557 583906 589676 594098 596661 597555 597250 595926 593800 591558 589794 588227 586228 584007
61334 584007 582522 582175 582243 581792 580608 579051 577439 575916 574675 574043 574351 575712 577895 580473 583248 586370
61318 586370 590057 594395 599516 605625 612673 620395 628906 638800 650321 662944 676256 690835 707580
$$ packed form
61424D76096K64Q77J912K690K987L161L304L117K535J773Q08m06j319j300p24
61409D95775o11j172j611j436r58m11M10J260J250Q5j240j633j196p66o55m64
61393D86627J02P66J032P50L51M46J083J605J509J277J821L212M506M950M786
61378E14823M760N203N812O031N616M954M704M942M901L914K339J045L10k05p20
61363E68429j189j670k178k344j942j529j748k158j673j06J624K865L885M992
61349E65258N926O373O349N770M422K563Q94l05j324k126k242j764j567j999k221
61334E84007j485l47O8m51j184j557j612j523j241o32L08J361K183K578K775L122
61318E86370L687M338N121O109P048P722Q511R894J1521J2623J3312J4579J6745
$$ plain form
61305 707580 726446 746432 766535 786008 803852 818819 830040 837217 840312 839670 836276 831177 824552
61292 824552 815941 805401 793761 781627 768933 755757 742941 731388 721176 711816 703079 695175
61280 695175 688322 682552 677848 674186 671437 669442 668196 667898 668798 670975 674134 677648 680901 683657 686045
61265 686045 688313 690737 693704 697635 702769 709053 716175 723658 730989 737767 743638 748143 750858 751788
61251 751788 751335 749845 747512 744815 742510 740867 739327 737288 734877 732582 730581 728980 728268 728856 730266
61236 730266 731391 731448 730325 728344 726277 725344 726448 729431 733606 738787 745132 752250 759380 766517 774515
61221 774515 783886 794083 804053 812892 820031 825662 831067 837636 845211 852219 857748 862619 867953 873573
61207 873573 878555 882652 886334 889862 893240 896883 901594 907890 915890 925731 937578 951300 966636
$$ packed form
61305G07580J8866J9986K0103J9473J7844J4967J1221P177L095o42l394n099o625
61292H24552q611j0540j1640j2134j2694j3176j2816j1553j0212r360q737p904
61280F95175o853n770m704l662k749j995j246k98R00K177L159L514L253K756K388
61265F86045K268K424K967L931N134O284P122P483P331O778N871M505K715R30
61251G51788m53j490k333k697k305j643j540k039k411k295k001j601p12N88J410
61236G30266J125N7j123j981k067r33J104K983M175N181O345P118P130P137P998
61221G74515R371J0197R970Q839P139N631N405O569P575P008N529M871N334N620
61207H73573M982M097L682L528L378L643M711O296Q000R841J1847J3722J5336
$$ plain form
61194 966636 983618 1002303 1022055 1041528 1059377 1074569 1086056 1092871 1094989 1093763 1090993 1087566
61182 1087566 1083195 1077308 1069783 1060770 1050285 1038394 1025589 1012461 998972 984510 968912 953005
61170 953005 937788 923403 909335 895272 881119 866414 850582 834018 818197 804312 792225
61159 792225 781113 770709 761419 753555 747104 742271 739734 740135 743500 749232 756493 764425 772181 778961
61145 778961 784113 787108 787391 784448 778289 769938 761207 753780 748470 745214 743523 742827 742830 743841 746600
61130 746600 751536 758345 766518 775999 787076 799880 814390 830704 848883 868683 889892 912800
61118 912800 937864 965005 993679 1023506 1054329 1085728 1117097 1148235 1179318 1210206 1240231
61107 1240231 1268804 1295749 1321029 1344562 1366354 1386222 1403260 1416123 1424086 1427419 1426672 1422151
$$ packed form
61194I66636J6982J8685J9752J9473J7849J5192J1487O815K118j226k770l427
61182A087566m371n887p525r013j0485j1891j2805j3128j3489j4462j5598j5907
61170I53005j5217j4385j4068j4063j4153j4705j5832j6564j5821j3885j2087
61159G92225j1112j0404r290p864o451m833k537M01L365N732P261P932P756O780
61145G78961N152K995K83k943o159q351q731p427n310l256j691o96LJ011K759
61130G46600M936O809Q173R481J1077J2804J4510J6314J8179J9800K1209K2908
61118I12800K5064K7141K8674K9827L0823L1399L1369L1138L1083L0888L0025
61107A240231K8573K6945K5280K3533K1792J9868J7038J2863P963L333p47m521
$$ plain form
61095 1422151 1414276 1403836 1391442 1377110 1360785 1343018 1324851 1307221 1290592 1274920 1259837
61084 1259837 1245175 1231426 1219387 1209301 1200672 1192925 1185871 1179516 1173965 1169617 1166853 1165348 1164203
61071 1164203 1162999 1162203 1162376 1163463 1165064 1166741 1167812 1167536 1165991 1164205 1162980 1162086 1161048 1160108 1159766
61056 1159766 1159892 1159995 1160065 1160533 1161622 1163367 1166027 1169938 1175035 1181042 1187991 1196113 1205366 1215514 1226550
61041 1226550 1238651 1251796 1265785 1280458 1295648 1311078 1326570 1342145 1357755 1373290 1389091
61030 1389091 1405939 1424148 1443228 1462881 1483808 1506886 1532102 1559023 1587825 1618944 1651998
61019 1651998 1686087 1721150 1758317 1799060 1844861 1897623 1959392 2031322 2113461 2205696 2308540
61008 2308540 2423451 2553562 2704462 2883773 3100052 3362610 3681749 4067811 4530481
$$ packed form
61095A422151p875j0440j2394j4332j6325j7767j8167j7630j6629j5672j5083
61084A259837j4662j3749j2039j0086q629p747p054o355n551m348k764j505j145
61071A164203j204p96J73J087J601J677J071k76j545j786j225q94j038r40l42
61056A159766J26J03P0M68J089J745K660L911N097O007O949Q122R253J0148J1036
61041A226550J2101J3145J3989J4673J5190J5430J5492J5575J5610J5535J5801
61030A389091J6848J8209J9080J9653K0927K3078K5216K6921K8802L1119L3054
61019A651998L4089L5063L7167M0743M5801N2762O1769P1930Q2139R2235J02844
61008B308540J14911J30111J50900J79311K16279K62558L19139L86062M62670
$$ plain form
60999 4530481 5081207 5737138 6521818 7463680 8598221 9970067 11616497 13523122 15578130
60990 15578130 17573734 19274602 20513996 21252435 21570004 21619000 21576684 21605868 21807745
60981 21807745 22172025 22561969 22763703 22579716 21909130 20771155 19273686 17560240 15766234
60972 15766234 13996807 12323206 10788707 9415545 8209383 7163259 6263176 5493544
60964 5493544 4839512 4286641 3820821 3429336 3101306 2826845 2596336 2400918 2233347
60955 2233347 2088184 1961415 1850037 1751779 1664946 1588407 1521482 1463431 1412929 1368067 1326816
60944 1326816 1287446 1248764 1210314 1172254 1134836 1098082 1062158 1027714 995328 964728 935142
60933 935142 906500 879752 855806 834619 815563 798185 782262 767510 753814 741565 731256
$$ packed form
60999D530481N50726O55931P84680R41862J134541J371846J646430J906625K055008
60990A5578130J995604J700868J239394P38439L17569M8996m2316K9184K01877
60981B1807745L64280L89944K01734j83987o70586j137975j497469j713446j794006
60972A5766234j769427j673601j534499j373162j206162j046124r00083p69632
60964E493544o54032n52871m65820l91485l28030k74461k30509j95418j67571
60955B233347j45163j26769j11378r8258q6833p6539o6925n8051n0502m4862m1251
60944A326816l9370l8682l8450l8060l7418l6754l5924l4444l2386l0600k9586
60933I35142k8642k6748k3946k1187j9056j7378j5923j4752j3696j2249j0309
$$ plain form
60922 731256 722674 714864 706990 699024 691578 685245 680095 675593 671044 666314 662009 658726 656209 653645
60908 653645 650757 648216 646837 646795 647775 649421 651246 652449 652351 650968 648788 646044 642571 638326 633664
60893 633664 629004 624420 619632 614203 607858 600891 594273 589002 585252 582352 579552 576508 573086 569177
60879 569177 564840 560254 555301 549658 543546 537990 533870 530946 528250 525294 522463 520284 518827 517925
60865 517925 517555 517729 518243 518899 519974 522195 526040 531071 536182 540633 544699 549037 553564 557371 559797
60850 559797 561159 562193 563246 564336 565586 567006 568061 568118 567330 566518 566017 565137 562932 559091 553832 547398
60834 547398 540082 532415 524803 517122 509161 501355 494566 489076 484345 479953 476234 473553 471421 469052
60820 469052 466579 464938 464384 463843 462148 459424 456674 454363 452099 449566 447067 444911 442829 440283 437082
$$ packed form
60922G31256q582p810p874p966p446o333n150m502m549m730m305l283k517k564
60908F53645k888k541j379m2R80J646J825J203r8j383k180k744l473m245m662
60893F33664m660m584m788n429o345o967o618n271l750k900k800l044l422l909
60879E69177m337m586m953n643o112n556m120k924k696k956k831k179j457r02
60865E17925l70J74N14O56J075K221L845N031N111M451M066M338M527L807K426
60850E59797J362J034J053J090J250J420J055N7p88q12n01q80k205l841n259o434
60834E47398p316p667p612p681p961p806o789n490m731m392l719k681k132k369
60820D69052k473j641n54n41j695k724k750k311k264k533k499k156k082k546l201
$$ plain form
60805 437082 433427 429622 426032 423139 421354 420720 420920 421498 422088 422540 422914 423244 423338 423050 422763 423261 424914
60788 424914 427213 429366 431182 433073 435209 437009 437627 436884 435573 434773 434912 435554 436032 436054 435679 435047 434405
60771 434405 434124 434286 434403 433948 433038 432197 431584 431008 430633 431017 432322 434037 435662 437096 438244 438881 439209
60754 439209 439886 441107 442155 442268 441419 439894 437764 435374 433680 433346 433929 434711 435826 437590 439035 438385
60738 438385 435179 430954 427492 425121 423053 420659 417908 415054 412431 410353 408856 407716 406858 406474 406576
60723 406576 406830 407102 407823 409438 411668 413718 415140 416207 417445 419001 420530 421551 421867 421711 421569 421842
60707 421842 422639 423792 425021 426117 427037 427768 428183 428138 427754 427342 426990 426413 425379 424055 422783 421693 420778
60690 420778 420131 419876 419948 420175 420420 420500 420155 419423 418870 419197 420652 422972 425693 428359 430755 433242 436567
$$ packed form
60805D37082l655l805l590k893j785o34K00N78N90M52L74L30R4k88k87M98J653
60788D24914K299K153J816J891K136J800O18p43j311q00J39O42M78K2l75o32o42
60771D34405k81J62J17m55r10q41o13n76l75L84J305J715J625J434J148O37L28
60754D39209O77J221J048J13q49j525k130k390j694l34N83P82J115J764J445o50
60738D38385l206m225l462k371k068k394k751k854k623k078j497j140q58l84J02
60723D06576K54K72P21J615K230K050J422J067J238J556J529J021L16j56j42K73
60707D21842P97J153J229J096R20P31M15m5l84m12l52n77j034j324j272j090r15
60690D20778o47k55P2K27K45Q0l45p32n53L27J455K320K721K666K396K487L325
$$ plain form
60673 436567 440912 445441 449218 452355 455717 459618 463295 465554 465519 462998 458785 454492 451328 448903 445858
60658 445858 441793 437906 435494 434544 434227 434234 434943 436529 438499 440257 441784 443610 446163 449200 451981 454012
60642 454012 455431 456484 456905 456230 454535 452336 449759 446400 442187 437933 434760 433262 433357 434572 436236
60627 436236 437743 438934 440078 441337 442461 443127 443343 443375 443486 443855 444527 445304 445892 446246 446578 447027 447608
60610 447608 448512 450001 451870 453407 454187 454623 455383 456472 457206 457045 456219 455501 455475 456067 456769 457331 458074 459388
60592 459388 461132 462843 464398 466126 468236 470506 472570 474212 475411 476424 477770 479753 482003 483901
60578 483901 485344 486612 487620 488031 488203 489256 491834 495473 499519 504038 509374 515483 522327 530419 540232
60563 540232 551355 562909 574545 586367 597980 608318 616490 622245 625607 626602 625518 622981 619571
$$ packed form
60673D36567M345M529L777L137L362L901L677K259l5k521m213m293l164k425l045
60658D45858m065l887k412r50l17PP09J586J970J758J527J826K553L037K781K031
60642D54012J419J053M21o75j695k199k577l359m213m254l173j498R5J215J664
60627D36236J507J191J144J259J124O66K16L2J11L69O72P77N88L54L32M49N81
60610D47608R04J489J869J537P80M36P60J089P34j61q26p18k6N92P02N62P43J314
60592D59388J744J711J555J728K110K270K064J642J199J013J346J983K250J898
60578D83901J443J268J008M11J72J053K578L639M046M519N336O109O844Q092R813
60563E40232J1123J1554J1636J1822J1613J0338Q172N755L362R95j084k537l410
$$ plain form
60550 619571 615602 611389 607394 603980 601259 599336 598549 599381 602244 607344 614571 623494 633736 645452
60536 645452 659235 675459 693967 714573 737535 762967 789705 815277 837392 855260 869118
60525 869118 878747 883217 882202 876793 868527 858062 845406 831078 816368 802507 790089 779209
60513 779209 769564 760598 752193 745234 740829 738908 738308 738315 739346 741969 746212 752415 761939 776226 795515
60498 795515 819086 846354 877173 911428 949100 990568 1036116 1085052 1135680 1186072 1234591
60487 1234591 1279928 1321212 1358135 1390655 1418542 1441358 1458532 1469059 1471332 1463740 1445457 1416545
60475 1416545 1377668 1330138 1276015 1217606 1156932 1095929 1036808 981511 930823 884558 842546
60464 842546 804900 771397 741292 714006 689535 667923 648779 631588 616218 602806 591320
$$ packed form
60550F19571l969m213l995l414k721j923p87Q32K863N100P227Q923J0242J1716
60536F45452J3783J6224J8508K0606K2962K5432K6738K5572K2115J7868J3858
60525H69118R629M470j015n409q266j0465j2656j4328j4710j3861j2418j0880
60513G79209r645q966q405o959m405j921o00PJ031K623M243O203R524J4287J9289
60498G95515K3571K7268L0819L4255L7672M1468M5548M8936N0628N0392M8519
60487A234591M5337M1284L6923L2520K7887K2816J7174J0527K273p592j8283k8912
60475A416545l8877m7530n4123n8409o0674o1003n9121n5297n0688m6265m2012
60464H42546l7646l3503l0105k7286k4471k1612j9144j7191j5370j3412j1486
$$ plain form
60453 591320 581408 572573 564382 556699 549777 543982 539267 535120 531075 527176 523840 521374 519691 518399
60439 518399 517111 515733 514493 513599 512893 511968 510650 509220 508081 507227 506152 504321 501709 498795 496090
60424 496090 493861 492373 492080 493261 495616 498618 502049 505771 509081 511049 511632 511837 512465 513297 513886 514504
60408 514504 515700 517409 519144 520728 522165 523127 523380 523563 524693 526865 529181 531087 533016 535448 538086
60393 538086 540511 543113 546676 551156 555424 558450 560524 563123 567438 573028 578052 581001 582110 582938
60379 582938 584730 587488 590500 593247 595665 597885 600032 602131 604073 605705 607041 608219 609238 609946
60365 609946 610436 611277 613132 616089 619476 622469 624897 627399 630721 634947 639610 644478 649908 656356 663930
60350 663930 672583 682327 692886 703392 712850 720818 727299 732139 734903 735312 733432 729509 723911 717253
$$ packed form
60453E91320r912q835q191p683o922n795m715m147m045l899l336k466j683j292
60439E18399j288j378j240q94p06r25j318j430j139q54j075j831k612k914k705
60424D96090k229j488k93J181K355L002L431L722L310J968N83K05O28Q32N89O18
60408E14504J196J709J735J584J437R62K53J83J130K172K316J906J929K432K638
60393E38086K425K602L563M480M268L026K074K599M315N590N024K949J109Q28
60379E82938J792K758L012K747K418K220K147K099J942J632J336J178J019P08
60365F09946M90Q41J855K957L387K993K428K502L322M226M663M868N430O448P574
60350F63930Q653R744J0559J0506R458P968O481M840K764M09j880l923n598o658
$$ plain form
60336 717253 710218 703213 696367 689827 683781 678251 673122 668343 663853 659400 654732 649924 645252 640782
60322 640782 636335 631866 627642 624099 621725 620878 621411 622620 624001 626033 629848 636120 644624 654816
60308 654816 666329 678798 691622 704221 716334 728048 739659 751444 763195 773991 782776 789221
60296 789221 793634 795978 795390 790921 782524 771169 758182 744600 730939 717385 704306 692499 682724
60283 682724 675021 668751 663260 658150 652953 647047 640199 632861 625674 618874 612400 606302 600751 595729
60269 595729 590962 586143 581173 576283 571992 568821 566835 565467 563881 561621 559001 556826 555574 554833
60255 554833 553807 552465 551809 552675 554633 556567 558067 559578 561322 562827 563731 564317 564911 565279 565059 564362
60239 564362 563501 562452 561124 559935 559567 560128 560998 561621 562119 563065 564937 567961 572244 577729 583998 590412
$$ packed form
60336G17253p035p005o846o540o046n530n129m779m490m453m668m808m672m470
60322F40782m447m469m224l543k374q47N33J209J381K032L815O272Q504J0192
60308F54816J1513J2469J2824J2599J2113J1714J1611J1785J1751J0796Q785O445
60296G89221M413K344n88m469q397j1355j2987j3582j3661j3554j3079j1807r775
60283F82724p703o270n491n110n197n906o848p338p187o800o474o098n551n022
60269E95729m767m819m970m890m291l171j986j368j586k260k620k175j252p41
60255E54833j026j342o56Q66J958J934J500J511J744J505R04N86N94L68k20o97
60239E64362q61j049j328j189l68N61Q70O23M98R46J872L024M283N485O269O414
$$ plain form
60223 590412 596594 602716 609220 616350 624168 632921 642957 654158 665794 677239 688572 700197 712130
60210 712130 724079 735980 747903 759516 770214 779906 789183 798499 807495 815411 821903 827284 832117
60197 832117 836763 841201 845065 847858 849204 848969 847267 844385 840525 835476 828733 820150 810343 800289
60183 800289 790712 781980 774206 767097 760040 752820 745996 740153 735124 730559 726812 724397 722764 720620
60169 720620 717547 714352 711684 709278 706817 704513 702315 699464 695556 691369 687916 685213 682651 680039
60155 680039 677562 675216 673126 672085 672867 675132 677737 680018 682114 684169 686055 687897 690155 693020
60141 693020 696295 700013 704583 710103 716062 721984 727994 734506 741735 749736 758515 767735 776548 784117
60127 784117 790306 795649 800688 805527 810026 814224 818459 823014 827781 832511 837436 843327 850571 858347
$$ packed form
60223E90412O182O122O504P130P818Q753J0036J1201J1636J1445J1333J1625J1933
60210G12130J1949J1901J1923J1613J0698R692R277R316Q996P916O492N381M833
60197H32117M646M438L864K793J346k35j702k882l860n049o743q583r807j0054
60183H00289r577q732p774p109p057p220o824n843n029m565l747k415j633k144
60169G20620l073l195k668k406k461k304k198k851l908m187l453k703k562k612
60155F80039k477k346k090j041P82K265K605K281K096K055J886J842K258K865
60141F93020L275L718M570N520N959N922O010O512P229Q001Q779R220Q813P569
60127G84117O189N343N039M839M499M198M235M555M767M730M925N891P244P776
$$ plain form
60113 858347 865130 870069 873549 876368 878770 880500 881422 881670 881283 880098 878058 875394 872392 869147 865651
60098 865651 861980 858269 854542 850712 846801 843085 839977 837674 835848 833679 830369 825806 820604 815312
60084 815312 809731 803328 796294 789658 784148 779347 774326 768779 763026 757126 750651 743387 735728 728162
60070 728162 720764 713429 706257 699419 692851 686386 680097 674237 668871 663736 658582 653610 649469 646680
60056 646680 645066 643958 643014 642547 642873 643706 644573 645604 647424 650431 654652 660120 666755 673919 680824
60041 680824 687512 694788 702951 711211 718654 725070 730428 734185 735819 735599 734228 731977 728792 724949
60027 724949 720831 716116 709894 701809 692550 683061 673644 664063 654190 644296 634851 626228 618480 611286
60013 611286 604195 597031 590051 583665 578012 572854 567853 563014 558840 556047 555041 555599 556966 558243
$$ packed form
60113H58347O783M939L480K819K402J730R22K48l87j185k040k664l002l245l496
60098H65651l671l711l727l830l911l716l108k303j826k169l310m563n202n292
60084H15312n581o403p034o636n510m801n021n547n753n900o475p264p659p566
60070G28162p398p335p172o838o568o465o289n860n366n135n154m972m141k789
60056F46680j614j108r44m67L26Q33Q67J031J820L007M221N468O635P164O905
60041F80824O688P276Q163Q260P443O416N358L757J634k20j371k251l185l843
60027G24949m118m715o222q085r259r489r417r581r873r894r445q623p748p194
60013F11286p091p164o980o386n653n158n001m839m174k793j006N58J367J277
$$ plain form
59999 558243 558865 558961 559243 560371 562398 564904 567567 570441 573843 578196 583804 590398 597051 602981 608390
59984 608390 613995 619745 624587 627670 629195 629830 629754 628619 626041 621865 616352 610371 604957 600372 596051
59969 596051 591772 588176 585650 583299 579914 575619 571761 569273 567966 567417 567745 569294 572076 575793 580043
59954 580043 584301 588035 591000 593270 595031 596585 598412 600765 603196 604954 605928 606748 607811 608654 608590
59939 608590 607616 606390 605491 604990 604625 604163 603663 603537 604323 606350 609669 614298 620302 627471 635083 642197
59923 642197 648190 652895 656334 658550 659742 660424 661217 662480 664190 666190 668508 671399 675124 679695 684751
59908 684751 689565 693349 695740 697036 697790 698137 697646 695871 692962 689649 686640 684085 681639 679084 676779
59893 676779 675350 675060 675866 678074 682261 688152 694189 698908 702510 706366 711157 716346 721432 726776 732931
$$ packed form
59999E58243O22R6K82J128K027K506K663K874L402M353N608O594O653N930N409
59984F08390N605N750M842L083J525O35p6j135k578m176n513n981n414m585m321
59969E96051m279l596k526k351l385m295l858k488j307n49L28J549K782L717M250
59954E80043M258L734K965K270J761J554J827K353K431J758R74Q20J063Q43o4
59939F08590r74j226q99n01l65m62n00j26P86K027L319M629O004P169P612P114
59923F42197N993M705L439K216J192O82P93J263J710K000K318K891L725M571N056
59908F84751M814L784K391J296P54L47m91j775k909l313l009k555k446k555k305
59893F76779j429k90Q06K208M187N891O037M719L602L856M791N189N086N344O155
$$ plain form
59878 732931 739878 747329 755117 762947 770319 777077 783445 789137 793111 794748 794777 794365 793744 792377 790081
59863 790081 787209 783975 780383 776770 773690 771130 768359 764773 760560 756504 753385 751460 750249 748881
59849 748881 746992 745250 744696 745739 748130 751704 756597 762636 769031 774866 779713 783609 786614 788553
59835 788553 789260 789068 789008 790274 793384 797864 802664 806634 808784 808691 806837 804129 800864 796605 791197 785323
59819 785323 779698 774291 768863 763793 759769 756976 755086 753740 752550 751012 749009 747121 745871 744929
59805 744929 743559 741511 738898 735598 731499 727030 722718 718443 713844 709167 704934 701021 696967 692949
59791 692949 689429 685964 681596 676519 672152 669177 666642 663552 660290 657675 655521 653102 650490 648418
59777 648418 647121 646211 645637 645935 647422 649734 652358 655195 658476 662429 667151 672536 678218 683820 689425
$$ packed form
59878G32931O947P451P788P830P372O758O368N692L974J637K9m12o21j367k296
59863G90081k872l234l592l613l080k560k771l586m213m056l119j925j211j368
59849G48881j889j742n54J043K391L574M893O039O395N835M847L896L005J939
59835G88553P07j92o0J266L110M480M800L970K150r3j854k708l265m259n408n874
59819G85323n625n407n428n070m024k793j890j346j190j538k003j888j250r42
59805G44929j370k048k613l300m099m469m312m275m599m677m233l913m054m018
59791F92949l520l465m368n077m367k975k535l090l262k615k154k419k612k072
59777F48418j297r10n74K98J487K312K624K837L281L953M722N385N682N602N605
$$ plain form
59762 689425 695589 702731 710641 718815 727172 736186 746183 756811 767448 777980 788773 799817 810260
59749 810260 819008 825650 830648 834830 838746 842276 844712 845494 844941 844003 843151 841941 839840 837035 834100
59734 834100 831299 828661 826423 824910 824227 824374 825348 826733 827666 827748 827695 828480 830136 831977 833717 835610
59718 835610 837740 839932 842307 845176 848313 851100 853505 856322 860245 865204 870755 876685 883058 890031
59704 890031 897731 906126 915057 924581 934961 945997 956782 966667 976121 985931 995862 1004918 1012714
59691 1012714 1019640 1025753 1030478 1033593 1035593 1036884 1037363 1037090 1036599 1036191 1035461 1033778 1030744 1026054 1019533
59676 1019533 1011487 1002465 992589 981726 970466 960093 951297 943591 936307 929567 923945 919841 917513
59663 917513 917186 918706 921593 925714 931379 938528 946455 954699 963651 973876 985300 997371 1009447
$$ packed form
59762F89425O164P142P910Q174Q357R014R997J0628J0637J0532J0793J1044J0443
59749H10260Q748O642M998M182L916L530K436P82n53r38q52j210k101k805k935
59734H34100k801k638k238j513o83J47R74J385R33Q2n3P85J656J841J740J893
59718H35610K130K192K375K869L137K787K405K817L923M959N551N930O373O973
59704H90031P700Q395Q931R524J0380J1036J0785R885R454R810R931R056P796
59691A012714O926O113M725L115K000J291M79k73m91m08p30j683l034m690o521
59676A019533q046r022r876j0863j1260j0373q796p706p284o740n622m104k328
59663I17513l27J520K887M121N665P149P927Q244Q952J0225J1424J2071J2076
$$ plain form
59650 1009447 1020669 1029982 1036713 1040722 1041715 1038991 1032288 1022306 1009941 995464 978959 961116 943017
59637 943017 925399 908571 892811 878394 865362 853540 842672 832499 822983 814428 806921 799623
59625 799623 791219 781191 770124 758709 747279 736445 727150 719491 712272 704421 696145 688103 680246
59612 680246 672378 665262 660079 657019 655292 654376 654407 655401 656862 658238 659191 659428 658874 658095 657985 658827 660020
59595 660020 660842 661221 661631 662451 663514 664186 663944 662951 661911 661236 660519 659007 656441 653233 649965 646877
59579 646877 643816 640527 637021 633580 630366 627188 623918 620901 618571 616785 615039 613238 611724 610569
59565 610569 609490 608501 607995 608044 608239 608353 608535 608714 608564 608301 608744 610205 611936 613099 613714 614288 615122 616358
59547 616358 618201 620661 623557 627082 631864 638208 645870 654781 665314 677623 691590 707720 726955
$$ packed form
59650A009447J1222R313O731M009R93k724o703r982j2365j4477j6505j7843j8099
59637I43017j7618j6828j5760j4417j3032j1822j0868j0173r516q555p507p298
59625G99623q404j0028j1067j1415j1430j0834r295p659p219p851q276q042p857
59612F80246p868p116n183l060j727r16L1R94J461J376R53K37n54p79j10Q42J193
59595F60020Q22L79M10Q20J063O72k42r93j040o75p17j512k566l208l268l088
59579F46877l061l289l506l441l214l178l270l017k330j786j746j801j514j155
59565F10569j079r89n06M9J95J14J82J79j50k63M43J461J731J163O15N74Q34J236
59547F16358J843K460K896L525M782O344P662Q911J0533J2309J3967J6130J9235
$$ plain form
59534 726955 748797 770345 787997 799702 805269 805555 802255 797693 793652 790551 788229 786883 786553 786463
59520 786463 785828 784781 783591 781547 777670 772145 765990 759547 752303 744055 735356 726827 718768 711352
59506 711352 704506 697695 690473 683213 676769 671545 667345 663824 660631 657511 654837 653624 654393 656490
59492 656490 659070 662215 666331 671121 676083 681518 687948 694900 701357 707165 712965 718845 724067 728076
59478 728076 730957 733009 734699 736817 739819 743132 745897 748096 750138 751773 752488 752629 752934 753157 752421
59463 752421 750820 749377 748484 747792 747718 749561 753699 758972 764436 770505 777761 785730 793634 801472 809466
59448 809466 817065 823208 827188 828755 827898 825004 820771 815443 808525 799660 789493 779340 770296 762874
59434 762874 757096 752589 748861 745707 743251 741711 741390 742692 745608 749298 752869 756608 761880 769774
$$ packed form
59534G26955K1842K1548J7652J1705N567K86l300m562m041l101k322j346l30r0
59520G86463o35j047j190k044l877n525o155o443p244q248q699q529q059p416
59506G11352o846o811p222p260o444n224m200l521l193l120k674j213P69K097
59492F56490K580L145M116M790M962N435O430O952O457N808N800N880N222M009
59478G28076K881K052J690K118L002L313K765K199K042J635P15J41L05K23p36
59463G52421j601j443q93o92p4J843M138N273N464O069P256P969P904P838P994
59448H09466P599O143L980J567q57k894m233n328o918q865j0167j0153r044p422
59434G62874n778m507l728l154k456j540l21J302K916L690L571L739N272P894
$$ plain form
59420 769774 780305 792880 806930 822094 838433 856462 876557 898576 922613 949478 979103
59409 979103 1008480 1032471 1047129 1051660 1047532 1037134 1023541 1009991 998592 990282 986421 989127
59397 989127 998944 1012751 1024933 1030537 1027397 1016392 1000525 983094 965795 948600 931519 915624
59385 915624 901959 890414 880510 872514 866811 862739 859128 855800 853583 852885 853007 852929 852256 851311 850746
59370 850746 851102 852417 854165 855728 856894 857889 859169 861249 864464 868722 873732 879476 886163 893786 902285
59355 902285 912095 923837 937292 951417 965740 981118 998690 1018628 1040248 1062767 1085476 1107742
59343 1107742 1129370 1150503 1170669 1188401 1202403 1212675 1219977 1224567 1226119 1224507 1219979 1212615
59331 1212615 1202240 1188911 1173141 1155655 1137128 1117979 1098208 1077660 1056638 1035977 1016240
$$ packed form
59420G69774J0531J2575J4050J5164J6339J8029K0095K2019K4037K6865K9625
59409I79103K9377K3991J4658M531m128j0398j3593j3550j1399q310l861K706
59397I89127R817J3807J2182N604l140j1005j5867j7431j7299j7195j7081j5895
59385I15624j3665j1545r904p996n703m072l611l328k217o98J22p8o73r45n65
59370H50746L56J315J748J563J166R95J280K080L215M258N010N744O687P623Q499
59355I02285R810J1742J3455J4125J4323J5378J7572J9938K1620K2519K2709K2266
59343A107742K1628K1133K0166J7732J4002J0272P302M590J552j612m528p364
59331A212615j0375j3329j5770j7486j8527j9149j9771k0548k1022k0661j9737
$$ plain form
59320 1016240 997258 978766 961108 944811 929753 915268 900963 887031 873795 861279 849215
59309 849215 837312 825606 814619 804988 796806 789567 782882 776967 772389 769650 769139 771098 775448 781985
59295 781985 790786 801908 814423 826225 835147 840045 840772 837734 831771 823965 815143 805861 797020 789897
59281 789897 785215 782675 781871 783157 787156 793871 802809 813602 826032 839745 854444 870099 886527
59268 886527 903090 919207 934821 949887 963770 975691 985464 993200 998467 1000454 998985 994958 989723
59255 989723 984243 978693 972525 965051 956272 947033 938273 930400 923585 918167 914268 911386 908978 907296
59241 907296 907120 908707 911457 914565 917589 920377 922769 924458 924993 923964 921307 917257 911889 905024 896792
59226 896792 887881 878832 869371 858960 847773 836571 825704 814849 803861 793316 783924 775746
$$ packed form
59320A016240j8982j8492j7658j6297j5058j4485j4305j3932j3236j2516j2064
59309H49215j1903j1706j0987r631q182p239o685n915m578k739n11J959M350O537
59295G81985Q801J1122J2515J1802Q922M898P27l038n963p806q822r282q841p123
59281G89897m682k540q04J286L999O715Q938J0793J2430J3713J4699J5655J6428
59268H86527J6563J6117J5614J5066J3883J1921R773P736N267J987j469m027n235
59255I89723n480n550o168p474q779r239q760p873o815n418l899k882k408j682
59241I07296j76J587K750L108L024K788K392J689N35j029k657m050n368o865q232
59226H96792q911r049r461j0411j1187j1202j0867j0855j0988j0545r392q178
$$ plain form
59214 775746 768395 761836 756589 753040 750846 749295 748093 747444 747355 747358 747163 747200 748069 749727 751762 754291 757984
59197 757984 763184 769469 776154 782778 789109 795148 801225 807690 814488 821347 828231 835109 841446 846635
59183 846635 850916 855176 859737 863950 867038 868663 868651 866928 863873 860061 855565 850341 845262 841703 839784
59168 839784 838049 835348 832070 829048 826297 823600 821339 819760 817990 814765 809814 803800 797280 790353
59154 790353 783017 775292 767218 759119 751433 743938 735772 726636 717379 708845 700842 692885 685256 678521
59140 678521 672508 666642 660893 655611 650747 646004 641551 637941 635533 634485 634936 636631 638729 640596
59126 640596 642504 645089 648552 652900 658446 665381 673320 681996 692007 704157 718317 733562 749043
59113 749043 764181 778432 791568 803818 815140 824802 832328 838325 843647 848251 851607 853649 854430
$$ packed form
59214G75746p351o559n247l549k194j551j202o49q9Lj95L7Q69J658K035K529L693
59197G57984N200O285O685O624O331O039O077O465O798O859O884O878O337N189
59183H46635M281M260M561M213L088J625j2j723l055l812m496n224n079l559j919
59168H39784j735k701l278l022k751k697k261j579j770l225m951o014o520o927
59154G90353p336p725q074q099p686p495q166r136r257q534q003p957p629o735
59140F78521o013n866n749n282m864m743m453l610k408j048M51J695K098J867
59126F40596J908K585L463M348N546O935P939Q676J0011J2150J4160J5245J5481
59113G49043J5138J4251J3136J2250J1322R662P526N997N322M604L356K042P81
$$ plain form
59100 854430 853341 849766 844276 838252 832557 827309 822491 817864 812693 806706 801041 797175 795058 793374
59086 793374 791425 789546 787779 785415 782108 778390 774709 770867 766656 762273 757859 753338 748826 744563
59072 744563 740332 735722 731047 727152 724128 721037 717207 713037 709132 705331 701107 696467 692016 688305
59058 688305 685400 682868 680088 676785 673292 670141 667510 665313 663594 662419 661582 660858 660467 660824 661908
59043 661908 663166 663924 663694 662432 660787 659633 659010 658101 656676 655756 656137 657131 657795 658704 661130 664863
59027 664863 668367 671139 674580 680325 688799 699607 712177 725502 738147 749067 758012 765038 770291
59014 770291 774288 777555 779791 780152 778547 775934 773110 769998 766429 762952 760453 759466 760133 762378 765872
58999 765872 770131 774763 779365 783375 786571 789524 792956 796718 800015 802514 804524 806194 807363 808193
$$ packed form
59100H54430j089l575n490o024n695n248m818m627n171n987n665l866k117j684
59086G93374j949j879j767k364l307l718l681l842m211m383m414m521m512m263
59072G44563m231m610m675l895l024l091l830m170l905l801m224m640m451l711
59058F88305k905k532k780l303l493l151k631k197j719j175q37p24l91L57J084
59043F61908J258P58k30j262j645j154o23r09j425r20L81R94O64R09K426L733
59027F64863L504K772L441N745Q474J0808J2570J3325J2645J0920Q945P026N253
59014G70291L997L267K236L61j605k613k824l112l569l477k499r87O67K245L494
58999G65872M259M632M602M010L196K953L432L762L297K499K010J670J169Q30
$$ plain form
58985 808193 809204 810567 812045 813680 815895 818951 823018 828675 836515 846225 856844 867992 880029
58972 880029 893022 906469 920177 934449 949166 963529 977081 990163 1003071 1015438 1026772
58961 1026772 1036933 1045767 1052830 1057779 1060505 1060717 1057941 1052059 1043277 1031475 1016295 998099 978279
58948 978279 958353 939120 920683 902787 885159 868049 852361 838717 826687 815613 805848 798179
58936 798179 792328 787291 783128 781084 781598 783401 785050 786291 787403 788188 788326 787993 787462 786607 785276 783719
58920 783719 782324 781345 780991 781235 781434 780848 779691 779019 779462 780820 782941 786091 790235 794853 799833 805791
58904 805791 813271 822364 833299 846566 862117 879201 897212 915944 934848 952972 969953 986241
58892 986241 1002124 1017498 1032901 1049700 1068662 1089138 1110138 1131389 1152784 1173531 1192514
$$ packed form
58985H08193J011J363J478J635K215L056M067N657P840R710J0619J1148J2037
58972H80029J2993J3447J3708J4272J4717J4363J3552J3082J2908J2367J1334
58961A026772J0161Q834P063M949K726K12k776n882q782j1802j5180j8196j9820
58948I78279j9926j9233j8437j7896j7628j7110j5688j3644j2030j1074r765p669
58936G98179n851n037m163k044N14J803J649J241J112P85J38l33n31q55j331j557
58920G83719j395r79l54K44J99n86j157o72M43J358K121L150M144M618M980N958
58904H05791P480R093J0935J3267J5551J7084J8011J8732J8904J8124J6981J6288
58892I86241J5883J5374J5403J6799J8962K0476K1000K1251K1395K0747J8983
$$ plain form
58881 1192514 1208999 1222681 1233572 1242116 1248767 1253282 1255060 1254243 1251650 1247601 1241808 1234534 1226712
58868 1226712 1218602 1209513 1199255 1188726 1178528 1168136 1157066 1145764 1134592 1122927 1110041 1096114
58856 1096114 1081683 1066863 1051700 1036509 1021282 1005623 989801 974908 961263 947623 932771
58845 932771 917136 902046 888133 875111 862410 849330 835322 820829 807203 795229 784451
58834 784451 774439 765708 758660 752610 746765 741471 737656 735723 735650 737351 740186 742951 745242 748087
58820 748087 752458 757931 763617 769492 775785 781853 786802 790692 794072 796803 798305 798567 798076 797075 795654
58805 795654 794078 792330 789838 786320 782368 778562 774638 770220 765622 761154 756332 750638 744526 738927
58791 738927 734396 731324 730154 730618 731635 732793 735070 739233 744544 750112 756526 764846 774822 785420
$$ packed form
58881A192514J6485J3682J0891Q544O651M515J778q17k593m049n793p274p822
58868A226712q110r089j0258j0529j0198j0392j1070j1302j1172j1665j2886j3927
58856A096114j4431j4820j5163j5191j5227j5659j5822j4893j3645j3640j4852
58845I32771j5635j5090j3913j3022j2701j3080j4008j4493j3626j1974j0778
58834G84451j0012q731p048o050n845n294l815j933p3J701K835K765K291K845
58820G48087M371N473N686N875O293O068M949L890L380K731J502K62m91j001j421
58805G95654j576j748k492l518l952l806l924m418m598m468m822n694o112n599
58791G38927m531l072j170M64J017J158K277M163N311N568O414Q320R976J0598
$$ plain form
58777 785420 796361 807719 818674 828143 836134 842950 847467 847826 843708 836564 827713 817478 806061
58764 806061 793870 780892 766990 752872 739727 727870 716833 706744 698475 692268 687350 683111
58752 683111 679694 677195 675154 673207 671535 670413 669897 670176 671781 675236 680710 687880 695869 703658 710969
58737 710969 718452 726601 734987 742971 750570 757951 764674 770253 774978 779416 783537 787112 790393 793617
58723 793617 796334 798201 799922 802421 805557 808672 811954 816125 821115 826255 831548 837498 843745 848981
58709 848981 852299 853681 853178 850549 845723 838772 829391 817202 802556 786339 769018 750588 731285
58696 731285 711660 692137 673187 655690 640307 626703 614168 602777 593132 585206 578336 572160
58684 572160 566674 561547 556289 551072 546547 542888 539785 537249 535645 534933 534623 534471 534692 535509 537088
$$ packed form
58777G85420J0941J1358J0955R469P991O816M517L59m118p144q851j0235j1417
58764H06061j2191j2978j3902j4118j3145j1857j1037j0089q269o207m918m239
58752F83111l417k499k041j947j672j122n16K79J605L455N474P170P989P789P311
58737G10969P483Q149Q386P984P599P381O723N579M725M438M121L575L281L224
58723G93617K717J867J721K499L136L115L282M171M990N140N293N950O247N236
58709H48981L318J382n03k629m826o951r381j2189j4646j6217j7321j8430j9303
58696G31285j9625j9523j8950j7497j5383j3604j2535j1391r645p926o870o176
58684E72160n486n127n258n217m525l659l103k536j604p12l10j52K21Q17J579
$$ plain form
58669 537088 539730 543656 548768 555070 563035 573040 584732 597321 609980 621510 630302 635356 636844
58656 636844 635205 630431 622870 613839 604501 594860 584723 574793 565766 557153 548272 539698 532551 526958
58642 526958 522450 519209 517530 516643 515506 514403 514391 515518 516946 518519 520786 523628 526170 527892 528701
58627 528701 528174 525966 522817 520019 518131 517135 517289 518598 520049 520828 521894 524876 529756 535131 540429
58612 540429 546204 552438 558232 563264 568070 572836 577241 581503 586251 591326 595949 599971 603685 606649
58598 606649 608110 608491 608997 609814 610147 609975 610292 611613 613687 616767 621694 628578 636758 646153 657354
58583 657354 670263 683885 697499 710877 723438 734514 744417 753978 763130 771195 778353 785548 793241
58570 793241 801622 811649 824323 839288 855843 874962 898469 926437 957306 990299 1025521 1061664
$$ packed form
58669E37088K642L926N112O302P965J0005J1692J2589J2659J1530Q792N054J488
58656F36844j639m774p561r031r338r641j0137r930r027q613q881q574p147n593
58642E26958m508l241j679q87j137j103j2J127J428J573K267K842K542J722Q09
58627E28701n27k208l149k798j888r96J54J309J451P79J066K982M880N375N298
58612E40429N775O234N794N032M806M766M405M262M748N075M623M022L714K964
58598F06649J461L81N06Q17L33j72L17J321K074L080M927O884Q180R395J1201
58583F57354J2909J3622J3614J3378J2561J1076R903R561R152Q065P158P195P693
58570G93241Q381J0027J2674J4965J6555J9119K3507K7968L0869L2993L5222L6143
$$ plain form
58558 1061664 1095896 1126390 1152943 1174723 1189604 1196516 1196811 1192730 1186043 1178422 1171260 1164469 1157038
58545 1157038 1149201 1142428 1136893 1130636 1121657 1109138 1092292 1069995 1042425 1011528 979193 946335
58533 946335 914042 883875 856414 831041 807612 786873 768916 752980 739099 728100 719571 711781
58521 711781 704182 697949 693400 688861 683037 676635 670733 665310 660403 656931 655229 654186 652889 651757
58507 651757 651178 650443 648954 647206 645777 644560 643624 643464 643800 643546 642574 642085 642738 643934 645415 647873
58491 647873 651393 654994 658412 662686 668404 675088 682912 693217 706562 722059 739294 759070 781429
58478 781429 804928 828705 853340 878624 902241 921701 935960 944388 946103 941403 932153 919817
58466 919817 904798 888439 873473 861353 851072 841849 835094 832515 834127 839361 848362 860902 875744
$$ packed form
58558A061664L4232L0494K6553K1780J4881O912K95m081o687p621p162o791p431
58545A157038p837o773n535o257q979j2519j6846k2297k7570l0897l2335l2858
58533I46335l2293l0167k7461k5373k3429k0739j7957j5936j3881j0999q529p790
58521G11781p599o233m549m539n824o402n902n423m907l472j702j043j297j132
58507F51757n79p35j489j748j429j217r36j60L36k54r72m89O53J196J481K458
58491F47873L520L601L418M274N718O684P824J0305J3345J5497J7235J9776K2359
58478G81429K3499K3777K4635K5284K3617J9460J4259Q428J715m700r250j2336
58466I19817j5019j6359j4966j2120j0281r223o755k579J612N234R001J2540J4842
$$ plain form
58453 875744 892256 910902 930948 949474 963825 973319 977523 974995 965243 950161 932074 911924
58441 911924 890511 869648 850713 833685 818727 806862 797980 790250 782838 777274 774852 774816 776422
58428 776422 780525 787496 795707 803880 812985 824070 836011 847026 856492 863678 866770 864977 859780
58415 859780 852451 842398 829584 816333 804674 793842 782483 771388 761964 753823 745970 738711
58403 738711 732405 726039 719031 712793 708720 706335 705056 705766 708777 712331 715083 718042 722080 725756
58389 725756 727759 729296 731767 734239 735680 737519 741369 746166 750210 754210 759771 766620 773876 782204
58375 782204 792123 801946 809977 817054 824584 831996 838697 846415 856759 868364 879294 890440 903653
58362 903653 918364 933031 948177 964885 981855 996917 1009951 1021428 1029845 1033728 1034697 1035470 1036130
$$ packed form
58453H75744J6512J8646K0046J8526J4351R494M204k528r752j5082j8087k0150
58441I11924k1413k0863j8935j7028j4958j1865q882p730p412n564k422l6J606
58428G76422M103O971Q211Q173R105J1085J1941J1015R466P186L092j793n197
58415H59780p329j0053j2814j3251j1659j0832j1359j1095r424q141p853p259
58403G38711o306o366p008o238m073k385j279P10L011L554K752K959M038L676
58389G25756K003J537K471K472J441J839L850M797M044M000N561O849P256Q328
58375G82204R919R823Q031P077P530P412O701P718J0344J1605J0930J1146J3213
58362I03653J4711J4667J5146J6708J6970J5062J3034J1477Q417L883R69P73O60
$$ plain form
58349 1036130 1035166 1032751 1030169 1027498 1024638 1023118 1024223 1026932 1030176 1035160 1042831 1051386 1059305 1068586
58335 1068586 1081737 1097740 1114305 1131799 1151399 1171571 1190075 1207361 1224263 1238477 1247254
58324 1247254 1251639 1254239 1254907 1252607 1249338 1247843 1247341 1245783 1244421 1245763 1248925 1251643 1255106 1262111
58310 1262111 1271949 1281737 1291357 1302503 1314409 1325187 1335963 1349055 1363496 1376930 1390322 1406093
58298 1406093 1423204 1439019 1454445 1472224 1491660 1510031 1527663 1546471 1565099 1580844 1594956
58287 1594956 1610756 1627994 1644410 1661176 1681199 1703652 1725911 1749328 1777281 1809135 1842057
58276 1842057 1877122 1917476 1962287 2008963 2059559 2118127 2183172 2249545 2316253 2385335 2454697
58265 2454697 2519833 2581582 2644623 2709208 2771902 2833373 2897460 2963339 3026596 3087429 3149850
$$ packed form
58349A036130r64k415k582k671k860j520J105K709L244M984P671Q555P919R281
58335A068586J3151J6003J6565J7494J9600K0172J8504J7286J6902J4214Q777
58324A247254M385K600O68k300l269j495n02j558j362J342L162K718L463P005
58310A262111R838R788R620J1146J1906J0778J0776J3092J4441J3434J3392J5771
58298A406093J7111J5815J5426J7779J9436J8371J7632J8808J8628J5745J4112
58287A594956J5800J7238J6416J6766K0023K2453K2259K3417K7953L1854L2922
58276A842057L5065M0354M4811M6676N0596N8568O5045O6373O6708O9082O9362
58265B454697O5136O1749O3041O4585O2694O1471O4087O5879O3257O0833O2421
$$ plain form
58254 3149850 3213578 3274923 3335017 3398835 3466791 3535686 3607038 3685637 3770724 3857742 3948015
58243 3948015 4047262 4155330 4267312 4384120 4511662 4649997 4793889 4943740 5105176 5278104
58233 5278104 5457352 5644017 5844729 6059906 6284579 6520603 6775732 7050897 7341263
58224 7341263 7649507 7984515 8347363 8732923 9144925 9594309 10083147 10606498 11169888
58215 11169888 11787792 12465218 13199535 14000610 14889364 15876471 16964303 18170894 19529590
58206 19529590 21065353 22797771 24769977 27049269 29700937 32795135 36444201 40802591
58198 40802591 46031207 52300678 59829179 68872470 79684676 92559936 107931065 126377591
58190 126377591 148563091 175260864 207312072 245027445 287015940 329404549 366529872
$$ packed form
58254C149850O3728O1345O0094O3818O7956O8895P1352P8599Q5087Q7018R0273
58243C948015R9247J08068J11982J16808J27542J38335J43892J49851J61436J72928
58233E278104J79248J86665K00712K15177K24673K36024K55129K75165K90366
58224G341263L08244L35008L62848L85560M12002M49384M88838N23351N63390
58215A1169888O17904O77426P34317Q01075Q88754R87107J087832J206591J358696
58206A9529590J535763J732418J972206K279292K651668L094198L649066M358390
58198D0802591N228616O269471P528501R043291J0812206J2875260J5371129J8446526
58190A26377591K2185500K6697773L2051208L7715373M1988495M2388609L7125323
$$ plain form
58183 366529872 392956502 405450123 403708042 389824713 367207419 339499058 309735027
58176 309735027 279917458 251104048 223794883 198251442 174618729 152973296 133373140
58169 133373140 115857111 100394932 86878706 75172880 65139438 56612375 49390817
58162 49390817 43278007 38107787 33730990 30007487 26825005 24104552 21777177 19772222
58154 19772222 18032691 16521439 15203863 14040530 13002166 12075105 11245480 10492637
58146 10492637 9803058 9175783 8608103 8088929 7611019 7176431 6784408 6425850 6094756
58137 6094756 5793680 5522898 5274658 5042616 4826809 4625329 4431193 4241842 4062364
58128 4062364 3895253 3735953 3582094 3438043 3306269 3182682 3064385 2953885 2852020
$$ packed form
58183C66529872K6426630J2493621j742081j3883329k2617294k7708361k9764031
58176C09735027k9817569k8813410k7309165k5543441k3632713k1645433j9600156
58169A33373140j7516029j5462179j3516226j1705826j0033442q527063p221558
58162D9390817o112810n170220m376797l723503l182482k720453k327375k004955
58154A9772222j739531j511252j317576j163333j038364r27061q29625p52843
58146A0492637o89579o27275n67680n19174m77910m34588l92023l58558l31094
58137F094756l01076k70782k48240k32042k15807k01480j94136j89351j79478
58128D062364j67111j59300j53859j44051j31774j23587j18297j10500j01865
$$ plain form
58119 2852020 2754628 2659921 2571645 2491397 2415128 2340585 2270941 2207672 2146817 2085723 2026758
58108 2026758 1971046 1915111 1857082 1799920 1745312 1690625 1635208 1583710 1539861 1502478 1470431
58097 1470431 1445624 1427987 1413212 1398734 1386651 1377817 1368550 1356366 1343713 1332784 1321586 1308325
58085 1308325 1294801 1282239 1268217 1250849 1231727 1211975 1189785 1164624 1139525 1116426 1093472
58074 1093472 1069558 1047092 1027471 1008213 987628 968200 952196 937781 922590 907544 894143
58063 894143 881448 868650 857346 848475 840107 830795 821944 814528 806726 797215 787560 778999 770156
58050 770156 760260 751272 744372 737612 729541 721884 716176 710972 704960 699589 695859 691626 684929 677218
58036 677218 670570 664370 657392 650482 644506 638150 630280 622098 614617 606531 596894 587312 579059 570647
$$ packed form
58119B852020r7392r4707q8276q0248p6269p4543o9644o3269o0855o1094n8965
58108B026758n5712n5935n8029n7162n4608n4687n5417n1498m3849l7383l2047
58097A470431k4807j7637j4775j4478j2083q834r267j2184j2653j0929j1198j3261
58085A308325j3524j2562j4022j7368j9122j9752k2190k5161k5099k3099k2954
58074A093472k3914k2466j9621j9258k0585j9428j6004j4415j5191j5046j3401
58063H94143j2695j2798j1304q871q368r312q851p416p802r511r655q561q843
58050G70156r896q988o900o760q071p657n708n204o012n371l730m233o697p711
58036F77218o648o200o978o910n976o356p870q182p481q086r637r582q253q412
$$ plain form
58022 570647 560796 551296 544282 538995 533743 528777 524698 520334 514817 509641 506125 502896 498369 493688
58008 493688 490669 488773 486619 484615 483646 482885 481380 480096 480116 480454 479886 479277 479904 481120 481790 482368 483520
57991 483520 484509 485036 486801 490892 495311 497445 497514 497393 497539 497238 496433 495204 492860 489489 486908 486143
57975 486143 485618 483776 481754 481383 482320 483391 485039 488002 491118 492893 493931 495493 496950 496939 495779
57960 495779 494456 492517 489242 485626 482848 479921 475244 469397 464116 459527 454701 449979 446406 443731
57946 443731 441201 439553 439984 441952 444117 446716 450888 456449 462520 469643 479051 490329 501870 513174
57932 513174 524725 536113 546240 554938 562483 567886 569535 567288 562334 555343 546304 535683 524301
57919 524301 512379 500057 488165 477252 466668 455969 446266 438677 432487 426498 421223 417941 416511
$$ packed form
58022E70647r851r500p014n287n252m966m079m364n517n176l516l229m527m681
58008D93688l019j896k154k004r69p61j505j284K0L38n68o09O27J216O70N78J152
57991D83520R89N27J765M091M419K134O9j21J46l01q05j229k344l371k581p65
57975D86143n25j842k022l71R37J071J648K963L116J775J038J562J457j1j160
57960D95779j323j939l275l616k778k927m677n847n281m589m826m722l573k675
57946D43731k530j648M31J968K165K599M172N561O071P123R408J1278J1541J1304
57932E13174J1551J1388J0127Q698P545N403J649k247m954o991r039j0621j1382
57919E24301j1922j2322j1892j0913j0584j0699r703p589o190n989n275l282j430
$$ plain form
57906 416511 415940 416262 417858 419657 420024 418896 417279 415282 412487 409639 407956 407240 406568 406304 407509 409797
57890 409797 411905 414145 418163 424227 430604 435849 440038 443626 446639 449335 452395 456044 459744 462745
57876 462745 464348 464114 462574 461143 460488 459681 457841 455629 454154 453471 453414 454686 457571 460630 462369 463320
57860 463320 464873 467029 469146 471897 476354 481765 486344 489897 493700 498078 501958 504612 506105 506270
57846 506270 504878 502596 500218 497318 493208 488698 485204 482541 479388 475592 472243 469804 467913 466702
57832 466702 466563 466891 466887 467298 469517 473179 476528 479029 481733 485123 488451 491277 493837 495767 496092 494630
57816 494630 492018 488475 484030 479650 476350 473376 469053 463309 457464 451628 444350 435021 424695 414299
57802 414299 403924 394166 386247 380247 374860 369367 364381 360339 356878 354053 352628 352717 353533 354788 356902
$$ packed form
57906D16511n71L22J596J799L67j128j617j997k795k848j683p16o72k64J205K288
57890D09797K108K240M018O064O377N245M189L588L013K696L060L649L700L001
57876D62745J603k34j540j431o55q07j840k212j475o83n7J272K885L059J739R51
57860D63320J553K156K117K751M457N411M579L553L803M378L880K654J493J65
57846E06270j392k282k378k900m110m510l494k663l153l796l349k439j891j211
57832D66702j39L28mM11K219L662L349K501K704L390L328K826K560J930L25j462
57816D94630k612l543m445m380l300k974m323n744n845n836p278r329j0326j0396
57802D14299j0375r758p919o000n387n493m986m042l461k825j425Q9Q16J255K114
$$ plain form
57787 356902 359635 362137 364588 368177 373048 377911 382192 386931 392968 399744 406582 413743 421437 428949
57773 428949 435449 440730 444663 446892 447407 446517 444122 440093 435307 431022 427092 422218 416050 409589 403409
57758 403409 397109 390884 385919 382647 380185 378170 377641 379250 381923 384240 386112 388351 391463 395511
57744 395511 400288 405088 409067 412198 415072 417669 419336 420084 420656 421072 420406 418395 416013 414095 412575
57729 412575 411468 411268 411843 412090 411304 409903 408422 406878 405473 404777 404774 404823 404836 405366 406253 406519 405951 405485
57711 405485 405593 405607 405100 404585 404314 403705 402535 401412 400532 399280 397670 396771 397055 397687 398142 399125 400994
57694 400994 402663 403131 402930 402975 403025 402328 400965 399519 398109 396564 394900 393090 391152 389953 390951 394557
57678 394557 399798 406209 414944 427337 443561 463697 489058 521354 561326 609310 666691 735732
$$ packed form
57787C56902K733K502K451L589M871M863M281M739O037O776O838P161P694P512
57773D28949O500N281L933K229N15q90k395m029m786m285l930m874o168o461o180
57758D03409o300o225m965l272k462k015n29J609K673K317J872K239L112M048
57744C95511M777M800L979L131K874K597J667P48N72M16o66k011k382j918j520
57729D12575j107k00N75K47p86j401j481j544j405o96lM9J3N30Q87K66n68m66
57711D05485J08J4n07n15k71o09j170j123q80j252j610q99K84O32M55R83J869
57694D00994J669M68k01M5N0o97j363j446j410j545j664j810j938j199R98L606
57678C94557N241O411Q735J2393J6224K0136K5361L2296L9972M7984N7381O9041
$$ plain form
57666 735732 817642 910171 1005711 1091507 1153768 1183733 1180542 1148981 1095817 1028234 953413 877446
57654 877446 804552 737492 677891 625874 580630 541898 509938 483865 461599 442070 425973
57643 425973 413673 403981 395837 389464 384712 379974 374176 368430 364174 361029 358000 355469 354139 353111
57629 353111 350976 348080 345868 344524 343040 341139 339447 338018 336365 334780 334086 334076 333524 331752 329099
57614 329099 325924 322274 318510 315276 312802 310979 309841 309259 308573 307411 306444 306409 306828 306671 305858 305047
57598 305047 304337 303306 302110 301416 301325 301230 300609 299242 296972 294104 291678 290471 289967 289112 287769 286637
57582 286637 286172 286416 287435 288962 289960 289547 288031 286208 284011 280782 276480 271707 266926 262542 259269
57567 259269 257370 255918 253911 251714 250313 249596 248604 247177 246033 245414 244897 244523 244783 245475 245749 245472
$$ packed form
57666G35732Q1910R2529R5540Q5796O2261K9965l191l1561n3164o7583p4821p5967
57654H77446p2894o7060n9601n2017m5244l8732l1960k6073k2266j9529j6097
57643D25973j2300r692q144o373m752m738n798n746m256l145l029k531j330j028
57629C53111k135k896k212j344j484j901j692j429j653j585o94j0n52j772k653
57614C29099l175l650l764l234k474j823j138n82o86j162r67l5M19j57q13q11
57598C05047p10j031j196o94r1r5o21j367k270k868k426j207n04q55j343j132
57582B86637m65K44J019J527R98m13j516j823k197l229m302m773m781m384l273
57567B59269j899j452k007k197j401p17r92j427j144o19n17l74K60O92K74k77
$$ plain form
57551 245472 245481 246338 247822 249809 252679 256557 260867 264817 267760 269138 268862 267726 266798 266468 266665 267612
57535 267612 269395 271000 270933 268934 266252 264156 262947 262403 262333 262543 262931 263716 265049 266519 267557 268089
57519 268089 268234 267855 267204 267438 269377 272044 273655 273893 274083 275258 277250 279654 282378 285054 287083 288554
57503 288554 290130 291838 292933 293210 293421 294134 295116 296107 297216 298194 298267 297197 295798 294941 294699 294716 294690 294126
57485 294126 292369 289417 286230 283836 282465 281708 281045 280059 278693 277432 276815 276707 276502 276001 275453 274769
57469 274769 273389 271081 268271 265525 263263 261992 262114 263389 265104 266823 268433 269625 270123 270404 271356
57454 271356 273175 275319 277574 280350 283772 287262 290262 292683 294568 295995 297403 299308 301538 303441
57440 303441 304988 306955 309966 313947 318557 323373 327687 330961 333565 336253 338961 341071 342833 345322
$$ packed form
57551B45472RQ57J484J987K870L878M310L950K943J378k76j136r28l30J97R47
57535B67612J783J605o7j999k682k096j209n44p0K10L88P85J333J470J038N32
57519B68089J45l79o51K34J939K667J611K38J90J175J992K404K724K676K029J471
57503B88554J576J708J095K77K11P13R82R91J109R78P3j070j399q57k42J7k6n64
57485B94126j757k952l187k394j371p57o63r86j366j261o17j08k05n01n48o84
57469B74769j380k308k810k746k262j271J22J275J715J719J610J192M98K81R52
57454B71356J819K144K255K776L422L490L000K421J885J427J408J905K230J903
57440C03441J547J967L011L981M610M816M314L274K604K688K708K110J762K489
$$ plain form
57426 345322 348768 352069 354409 356203 357913 358979 358753 357692 356846 356689 357069 357770 358559 359162 359736 361027
57410 361027 363606 367281 371531 376117 380978 385968 390900 395424 398829 400564 401069 401376 401708 401275 399713
57395 399713 397877 396816 396817 397902 400414 404397 409022 413407 417543 421824 426146 430203 434353 439430 445696
57380 445696 452453 458770 464267 469167 473737 477787 480911 483299 485949 489670 494137 498435 502158 505360
57366 505360 507819 509339 510602 512631 515433 518215 520963 524560 529155 533739 537802 542199 547714 553859
57352 553859 559798 565504 571236 576802 582144 587894 594497 601464 608216 614916 621701 627870 632831 637250
57338 637250 642295 648134 654051 659673 665206 670791 676482 682682 689851 697844 706073 714184 722126 729826
57324 729826 737259 744627 752100 759667 767439 775643 784052 792057 799669 807752 816771 826059 834886 843518
$$ packed form
57426C45322L446L301K340J794J710J066k26j061q46j57L80P01P89O03N74J291
57410C61027K579L675M250M586M861M990M932M524L405J735N05L07L32m33j562
57395C99713j836j061JJ085K512L983M625M385M136M281M322M057M150N077O266
57380D45696O757O317N497M900M570M050L124K388K650L721M467M298L723L202
57366E05360K459J520J263K029K802K782K748L597M595M584M063M397N515O145
57352E53859N939N706N732N566N342N750O603O967O752O700O785O169M961M419
57338F37250N045N839N917N622N533N585N691O200P169P993Q229Q111P942P700
57324G29826P433P368P473P567P772Q204Q409Q005P612Q083R019R288Q827Q632
$$ plain form
57310 843518 852436 861301 869613 877886 887136 897545 908462 919450 930548 941752 953032 964643
57298 964643 976757 989029 1001094 1013192 1025693 1038405 1051042 1063914 1077421 1091251 1104947
57287 1104947 1118906 1133918 1149879 1165811 1181061 1195759 1210181 1224353 1238219 1251698 1264817
57276 1264817 1278241 1293199 1310202 1328267 1346170 1363994 1382596 1402064 1421806 1441867 1462946
57265 1462946 1485212 1508140 1531501 1555496 1579860 1603903 1627572 1651543 1676135 1701000 1726029
57254 1726029 1751662 1778140 1805308 1833320 1862688 1893330 1924434 1955518 1986893 2018860 2051311
57243 2051311 2084440 2118983 2155213 2192352 2229583 2267132 2305856 2346161 2387850 2430783 2475256
57232 2475256 2521771 2570619 2621575 2674011 2727457 2781869 2837154 2892768 2948365 3004560 3062295
$$ packed form
57310H43518Q918Q865Q312Q273R250J0409J0917J0988J1098J1204J1280J1611
57298I64643J2114J2272J2065J2098J2501J2712J2637J2872J3507J3830J3696
57287A104947J3959J5012J5961J5932J5250J4698J4422J4172J3866J3479J3119
57276A264817J3424J4958J7003J8065J7903J7824J8602J9468J9742K0061K1079
57265A462946K2266K2928K3361K3995K4364K4043K3669K3971K4592K4865K5029
57254A726029K5633K6478K7168K8012K9368L0642L1104L1084L1375L1967L2451
57243B051311L3129L4543L6230L7139L7231L7549L8724M0305M1689M2933M4473
57232B475256M6515M8848N0956N2436N3446N4412N5285N5614N5597N6195N7735
$$ plain form
57221 3062295 3121570 3181535 3241794 3302814 3365022 3428380 3492996 3559261 3626976 3695135 3763020
57210 3763020 3830995 3899843 3969818 4040604 4111696 4182578 4253013 4323338 4393961 4464361 4533128
57199 4533128 4599144 4662169 4722155 4778747 4831756 4881436 4927959 4971250 5011718 5050563 5088924
57188 5088924 5127151 5165277 5203721 5243220 5284449 5327909 5373696 5421272 5469969 5519716 5570554
57177 5570554 5621427 5670481 5716870 5761348 5804705 5846582 5886243 5923524 5958292 5989896 6017890
57166 6017890 6042588 6064301 6082824 6098374 6112153 6125177 6137327 6148317 6158649 6168739 6178001
57155 6178001 6185999 6193751 6202742 6213272 6224904 6237855 6252646 6268944 6286053 6304094 6323278 6342361
57143 6342361 6359098 6371958 6380141 6382360 6377108 6363997 6343541 6315992 6281890 6243483 6204074 6166128
$$ packed form
57221C062295N9275N9965O0259O1020O2208O3358O4616O6265O7715O8159O7885
57210C763020O7975O8848O9975P0786P1092P0882P0435P0325P0623P0400O8767
57199D533128O6016O3025N9986N6592N3009M9680M6523M3291M0468L8845L8361
57188E088924L8227L8126L8444L9499M1229M3460M5787M7576M8697M9747N0838
57177E570554N0873M9054M6389M4478M3357M1877L9661L7281L4768L1604K7994
57166F017890K4698K1713J8523J5550J3779J3024J2150J0990J0332J0090R262
57155F178001P998P752Q991J0530J1632J2951J4791J6298J7109J8041J9184J9083
57143F342361J6737J2860Q183K219n252j3111k0456k7549l4102l8407l9409l7946
$$ plain form
57131 6166128 6131615 6103877 6087035 6083120 6091255 6109614 6136412 6168908 6203574 6237907 6270552 6299579
57119 6299579 6322792 6340399 6355497 6371354 6390052 6414184 6447460 6492492 6549816 6619962 6704694
57108 6704694 6805690 6924377 7064183 7231059 7431534 7673192 7968133 8333464 8788179
57099 8788179 9353833 10060369 10948531 12066220 13467253 15214389 17375978 20013827 23175865
57090 23175865 26898420 31204378 36094116 41545334 47513987 53892981 60428440 66690931
57082 66690931 72194485 76599538 79814319 81906220 82943833 82944023 81941933 80057873 77474196
57073 77474196 74362765 70842509 66986122 62846478 58480221 53961300 49378088 44816841
57065 44816841 40349577 36037303 31937069 28099776 24564143 21356797 18494495 15981050
$$ packed form
57131F166128l4513k7738j6842l915Q135J8359K6798L2496L4666L4333L2645K9027
57119F299579K3213J7607J5098J5857J8698K4132L3276M5032N7324P0146Q4732
57108F704694J00996J18687J39806J66876K00475K41658K94941L65331M54715
57099H788179N65654P06536Q88162J117689J401033J747136K161589K637849L162038
57090B3175865L722555M305958M889738N451218N968653O378994O535459O262491
57082F6690931N503554M405053L214781K091901J037613J90j002090j884060k583677
57073G7474196l111431l520256l856387m139644m366257m518921m583212m561247
57065D4816841m467264m312274m100234l837293l535633l207346k862302k513445
$$ plain form
57057 15981050 13803940 11938346 10354253 9018706 7895923 6951475 6157135 5489831
57049 5489831 4927725 4450429 4041872 3689896 3383631 3113564 2873300 2658788 2466255
57040 2466255 2292592 2136521 1997142 1871997 1758358 1655409 1563211 1480580 1406054 1339919
57030 1339919 1283135 1235121 1194739 1162568 1140015 1127176 1124339 1134945 1163657 1210148 1266001
57019 1266001 1317811 1352423 1360701 1339953 1294422 1232204 1160635 1084580 1007883 934133 865548
57008 865548 802518 744732 691912 643627 599530 559768 524209 491613 460699 431641 405213
56997 405213 380935 357636 335575 316324 300584 287706 277440 270602 267706 268360 272438 280641 293516
56984 293516 310768 331566 354403 376552 394749 406793 411938 410149 402095 389587 374720 358590
$$ packed form
57057A5981050k177110j865594j584093j335547j122783r44448p94340o67304
57049E489831n62106m77296m08557l51976l06265k70067k40264k14512j92533
57040B466255j73663j56071j39379j25145j13639j02949r2198q2631p4526o6135
57030A339919n6784m8014m0382l2171k2553j2839k837J0606K8712M6491N5853
57019A266001N1810L4612Q278k0748m5531o2218p1569p6055p6697p3750o8585
57008H65548o3030n7786n2820m8285m4097l9762l5559l2596l0914k9058k6428
56997D05213k4278k3299k2061j9251j5740j2878j0266o838k896O54M078Q203J2875
56984B93516J7252K0798K2837K2149J8197J2044N145j789q054j2508j4867j6130
$$ plain form
56972 358590 341838 325974 312598 301518 291341 281960 274851 270767 268919 268887 271687 278218 288182
56959 288182 301406 318956 341729 368461 395707 419257 435462 442253 439727 429513 413516 393690
56947 393690 372534 352433 334296 317831 303217 291429 282837 276815 273065 272206 274710 280439 289653
56934 289653 303432 322660 347407 377351 411435 446591 477858 500417 511160 508765 493885 469584
56922 469584 440047 408117 374971 342145 312064 285965 262933 241914 223270 207466 193713
56911 193713 181216 170515 162332 155980 150192 144767 140213 136507 133347 131050 130018 129763 129448 129063
56897 129063 129211 130215 132342 136436 143321 152811 164137 177266 193156 212889 236984 265091 295666
56884 295666 326074 353475 375575 390611 397517 396703 390163 380196 368335 355740 343902 334322 327886
$$ packed form
56972C58590j6752j5864j3376j1080j0177r381p109m084j848l2K800O531R964
56959B88182J3224J7550K2773K6732K7246K3550J6205O791k526j0214j5997j9826
56947C93690k1156k0101j8137j6465j4614j1788q592o022l750q59K504N729R214
56934B89653J3779J9228K4747K9944L4084L5156L1267K2559J0743k395j4880k4301
56922D69584k9537l1930l3146l2826l0081k6099k3032k1019j8644j5804j3753
56911A93713j2497j0701q183o352n788n425m554l706l160k297j032k55l15l85
56897A29063J48J004K127M094O885R490J1326J3129J5890J9733K4095K8107L0575
56884B95666L0408K7401K2100J5036O906q14o540r967j1861j2595j1838r580o436
$$ plain form
56871 327886 324944 325502 329070 335014 343619 356277 374277 397938 427275 462860 505601 556058 613721
56858 613721 675621 735193 783865 815071 826665 819780 797006 762442 721719 679979 640013 603141
56846 603141 571069 545722 527902 517455 514512 519634 533105 555064 586173 627534 680457 746863
56834 746863 828798 925632 1031049 1133272 1218547 1275278 1297155 1284712 1244270 1184390 1112595
56823 1112595 1034798 956169 881111 812603 752434 701828 661237 630214 608399 596262 594228
56812 594228 601788 618489 645307 684007 735369 798353 869564 941855 1004293 1045965 1061090 1050314
56800 1050314 1017861 968807 908666 843268 777557 714781 656993 605641 561451 524453 494503
56789 494503 471501 455137 445036 441229 444058 453746 470556 495079 527426 565703 605457 640644
$$ packed form
56871C27886k942N58L568N944Q605J2658J8000K3661K9337L5585M2741N0457N7663
56858F13721O1900N9572M8672L1206J1594o885k2774l4564m0723m1740l9966l6872
56846F03141l2072k5347j7820j0447k943N122J3471K1959L1109M1361N2923O6406
56834G46863Q1935R6834J05417J02223Q5275N6731K1877j2443m0442n9880p1795
56823A112595p7797p8629p5058o8508o0169n0606m0591l1023k1815j2137k034
56812E94228P560J6701K6818L8700N1362O2984P1211P2291O2438M1672J5125j0776
56800A050314l2453m9054o0141o5398o5711o2776n7788n1352m4190l6998k9950
56789D94503k3002j6364j0101l807K829R688J6810K4523L2347L8277L9754L5187
$$ plain form
56777 640644 665286 675166 669178 649358 619306 582525 542127 501066 461582 424566 390104 358453
56765 358453 329996 304689 282264 262769 246270 232316 220274 209919 201211 193903 187884 183430
56753 183430 180497 178263 175978 173707 171659 169495 167063 164999 163651 162154 159741 157281 156185 156279 156183
56738 156183 155463 154934 154986 155102 155104 155476 156165 156208 154998 153023 151074 149547 148711 148893 150121 152033 154214 156233
56720 156233 157629 158469 159545 161319 163094 164038 164531 165471 166721 167453 167712 168303 169269 169823 169830 170127 171159
56703 171159 172389 173234 173670 173828 173923 174521 175903 177258 177541 177059 177083 177980 178925 179451 179999 180810 181530 182105
56685 182105 182861 183510 183310 182472 182179 182888 183771 184230 184752 185786 186799 187038 186369 184954 182933 180717 178801
56668 178801 177019 174838 172529 171075 170799 171110 171732 173016 174769 176026 176423 176676 177236 177545 177139 176430
$$ packed form
56777F40644K4642R880n988j9820l0052l6781m0398m1061l9484l7016l4462l1651
56765C58453k8457k5307k2425j9495j6499j3954j2042j0355q708p308o019m454
56753A83430k933k234k285k271k048k164k432k064j348j497k413k460j096R4r6
56738A56183p20n29N2J16KL72O89M3j210j975j949j527q36J82J228J912K181K019
56720A56233J396Q40J076J774J775R44M93R40J250P32K59N91R66N54PK97J032
56703A71159J230Q45M36J58R5N98J382J355K83m82K4Q97R45N26N48Q11P20N75
56685A82105P56O49k00q38k93P09Q83M59N22J034J013K39o69j415k021k216j916
56668A78801j782k181k309j454k76L11O22J284J753J257L97K53N60L09m06p09
$$ plain form
56652 176430 175946 175704 175801 176671 178310 180152 182037 184342 186884 188822 190000 191201 192660 193595 193720 193945
56636 193945 194821 195520 195131 193925 192590 191294 190278 190199 190936 191084 189660 187476 185823 184643 183033 180783
56620 180783 178345 175913 173589 171977 171558 171824 171807 171186 170258 169261 168395 168065 168394 168833 168799 168355 167855 167426
56602 167426 167237 167604 168351 168700 168364 168114 168699 169862 170965 171869 172576 172779 172569 172940 174720 177437 179985
56585 179985 181924 183406 184295 184250 183480 182751 182701 183533 185095 186926 188530 189886 191370 193020 194468 195791
56569 195791 197696 200487 203522 206150 208657 211941 216843 223961 233415 244469 256074 267970 280411
56556 280411 292684 303001 310215 314594 316561 315927 313012 309224 305588 301683 296886 291723 287061 282846
56542 282846 278581 274354 270547 267204 264396 262436 261050 259227 256663 254426 253317 252500 250732 248092
$$ packed form
56652A76430m84k42R7Q70J639J842J885K305K542J938J178J201J459R35J25K25
56636A93945Q76O99l89j206j335j296j016p9P37J48j424k184j653j180j610k250
56620A80783k438k432k324j612m19K66j7o21r28r97q66l30L29M39l4m44n00m29
56602A67426j89L67P47L49l36k50N85J163J103R04P07K03k10L71J780K717K548
56585A79985J939J482Q89m5p70p29n0Q32J562J831J604J356J484J650J448J323
56569A95791J905K791L035K628K507L284M902P118R454J1054J1605J1896J2441
56556B80411J2273J0317P214M379J967o34k915l788l636l905m797n163m662m215
56542B82846m265m227l807l343k808j960j386j823k564k237j109q17j768k640
$$ plain form
56528 248092 245421 242877 240144 237470 235401 233965 232994 232729 233232 233778 233622 232869 231972 231022 230081 229312 228219
56511 228219 225811 222279 219298 217745 216394 213998 211311 209652 208660 207197 205503 204698 204836 205223 206020
56496 206020 207750 209600 210024 208902 207536 206672 206051 205771 206487 208132 209793 211055 212351 213911 215382
56481 215382 216536 217449 218061 218372 218813 219554 219847 219062 217902 217473 217571 217112 215946 214935 214439 214017 213560 213552
56463 213552 214180 215143 216264 217436 218221 218400 218566 219260 219981 220026 219744 219851 220142 220185 220619 222258 224390 225651
56445 225651 226242 227586 229934 232013 233110 233852 234682 235074 234609 233621 232509 231443 230788 230754 230646 229603 227996
56428 227996 226902 226410 225798 225204 225545 226706 227351 226791 225697 224794 224215 224358 225933 228706 231384 233125
56412 233125 234144 234739 234938 235281 236604 238610 239796 239267 237754 236609 236654 238050 240209 241747 241595 240335
$$ packed form
56528B48092k671k544k733k674k069j436r71k65N03N46j56p53q97r50r41p69j093
56511B28219k408l532k981j553j351k396k687j659r92j463j694q05J38L87P97
56496B06020J730J850M24j122j366q64o21k80P16J645J661J262J296J560J471
56481B15382J154R13O12L11M41P41K93p85j160m29R8m59j166j011m96m22m57q
56463B13552O28R63J121J172P85J79J66O94P21M5k82J07K91M3M34J639K132J261
56445B25651N91J344K348K079J097P42Q30L92m65r88j112j066o55l4j08j043j607
56428B27996j094m92o12n94L41J161O45n60j094r03n79J43J575K773K678J741
56412B33125J019N95J99L43J323K006J186n29j513j145M5J396K159J538j52j260
$$ plain form
56396 240335 239542 239928 241154 243155 246137 249293 251119 251372 251382 252197 253591 255101 256680 258034 258613 258589
56380 258589 258722 259053 258965 258584 258750 259449 259761 259620 260106 261614 263233 264353 265396 266490 267015 267129 268235
56363 268235 271041 274406 276896 278333 279099 279173 278697 278467 278973 279854 280936 282864 285972 289459 292410 294807
56347 294807 296839 298094 298193 297589 296986 296512 296043 295876 296577 298416 301168 304197 306855 309241 312294 316541
56331 316541 321190 325235 328875 332711 336279 338889 341400 345305 350254 354380 357041 359278 361463 362666
56317 362666 362791 363242 364731 366342 367585 369491 372623 375739 377631 378806 380258 381929 383540 385694 388930
56302 388930 392706 396392 400396 405381 411304 417986 425639 433961 441677 447905 453233 458772 464953 471800
56288 471800 479460 487798 496287 504832 513971 523912 534240 544827 556058 567954 580123 592654 605875
$$ packed form
56396B40335p93L86J226K001K982L156J826K53J0Q15J394J510J579J354N79k4
56380B58589J33L31q8l81J66O99L12j41M86J508J619J120J043J094N25J14J106
56363B68235K806L365K490J437P66P4m76k30N06Q81J082J928L108L487K951K397
56347B94807K032J255R9o04o03m74m69j67P01J839K752L029K658K386L053M247
56331C16541M649M045L640L836L568K610K511L905M949M126K661K237K185J203
56317C62666J25M51J489J611J243J906L132L116J892J175J452J671J611K154L236
56302C88930L776L686M004M985N923O682P653Q322P716O228N328N539O181O847
56288D71800P660Q338Q489Q545R139R941J0328J0587J1231J1896J2169J2531J3221
$$ plain form
56275 605875 619237 631932 644707 659384 676306 694079 712235 732260 755324 780842 808083
56264 808083 837458 869355 903443 940140 981264 1028217 1081001 1139830 1206142 1281126 1364860
56253 1364860 1457902 1562109 1678822 1807652 1948099 2100811 2266153 2442894 2629307 2824092
56243 2824092 3025208 3229177 3432452 3631986 3823522 4000951 4158459 4291998 4398003
56234 4398003 4472630 4513556 4521001 4495992 4439382 4353631 4243596 4114073 3968031 3808293 3638987
56223 3638987 3463954 3285500 3106143 2929768 2759476 2595954 2439391 2291203 2152339
56214 2152339 2021818 1898764 1784203 1679085 1582224 1492112 1409114 1333959 1265533 1202182
56204 1202182 1143831 1090972 1042873 998610 958554 923034 890893 861082 834254 811037 790211
$$ packed form
56275F05875J3362J2695J2775J4677J6922J7773J8156K0025K3064K5518K7241
56264H08083K9375L1897L4088L6697M1124M6953N2784N8829O6312P4984Q3734
56253A364860R3042J04207J16713J28830J40447J52712J65342J76741J86413J94785
56243B824092K01116K03969K03275J99534J91536J77429J57508J33539J06005
56234D398003P4627M0926P445k5009n6610q5751j10035j29523j46042j59738j69306
56223C638987j75033j78454j79357j76375j70292j63522j56563j48188j38864
56214B152339j30521j23054j14561j05118r6861r0112q2998p5155o8426o3351
56204A202182n8351n2859m8099m4263m0056l5520l2141k9811k6828k3217k0826
$$ plain form
56193 790211 770453 752359 736914 723483 711266 701112 693724 687569 680779 673844 668272 663916 659841
56180 659841 656494 654732 653813 652522 651205 650660 650240 649150 648325 648890 650061 650772 652104 655783 661488 667903
56164 667903 675195 684094 693759 702927 712131 722480 733447 744238 756137 771030 788730 808144
56152 808144 829882 855181 883448 913553 946572 984706 1028539 1077938 1134628 1201305 1279194
56141 1279194 1369024 1473193 1593949 1730004 1877187 2031264 2187498 2338813 2477825 2600638
56131 2600638 2706805 2797076 2873901 2942467 3007410 3068592 3122363 3165818 3197247 3214250 3215400
56120 3215400 3203260 3182393 3154586 3118430 3072230 3013950 2939383 2844369 2729079 2597606 2454315
56109 2454315 2303642 2152222 2007159 1872048 1747495 1634810 1535866 1450079 1375119 1310357
$$ packed form
56193G90211j9758j8094j5445j3431j2217j0154p388o155o790o935n572m356m075
56180F59841l347j762r19j291j317n45m20j090q25N65J171P11J332L679N705O415
56164F67903P292Q899R665R168R204J0349J0967J0791J1899J4893J7700J9414
56152H08144K1738K5299K8267L0105L3019L8134M3833M9399N6690O6677P7889
56141A279194Q9830J04169J20756J36055J47183J54077J56234J51315J39012J22813
56131B600638J06167R0271P6825O8566O4943O1182N3771M3455L1429J7003J150
56120C215400j2140k0867k7807l6156m6200n8280p4567r5014j15290j31473j43291
56109B454315j50673j51420j45063j35111j24553j12685r8944q5787p4960o4762
$$ plain form
56099 1310357 1256402 1211765 1173411 1140329 1113399 1092131 1074674 1060601 1050517 1043453 1037671 1033416
56087 1033416 1031860 1032211 1032956 1034779 1038910 1043867 1047460 1050721 1056086 1063101 1070060 1078344 1090507 1105253
56073 1105253 1119132 1132254 1147304 1163803 1178615 1191779 1206514 1223491 1240257 1256387 1274108
56062 1274108 1293561 1312323 1329804 1347350 1363998 1377214 1387937 1399718 1412599 1423092 1430606
56051 1430606 1438584 1448702 1459138 1469249 1480850 1494075 1506902 1519509 1534437 1552021 1570422
56040 1570422 1590249 1614223 1642358 1672691 1706480 1747024 1793610 1842637 1894513 1953047 2017980
56029 2017980 2084758 2151695 2220337 2288492 2350486 2405355 2457568 2508674 2555636 2598586 2642610
56018 2642610 2690238 2739489 2790689 2847575 2910099 2973876 3038456 3108472 3185106 3264513 3346235
$$ packed form
56099A310357n3955m4637l8354l3082k6930k1268j7457j4073j0084p064n782m255
56087A033416j556L51P45J823M131M957L593L261N365P015O959Q284J2163J4746
56073A105253J3879J3122J5050J6499J4812J3164J4735J6977J6766J6130J7721
56062A274108J9453J8762J7481J7546J6648J3216J0723J1781J2881J0493P514
56051A430606P978J0118J0436J0111J1601J3225J2827J2607J4928J7584J8401
56040A570422J9827K3974K8135L0333L3789M0544M6586M9027N1876N8534O4933
56029B017980O6778O6937O8642O8155O1994N4869N2213N1106M6962M2950M4024
56018B642610M7628M9251N1200N6886O2524O3777O4580P0016P6634P9407Q1722
$$ plain form
56007 3346235 3434707 3530576 3629220 3729854 3837269 3952505 4071021 4192383 4322256 4462299
55997 4462299 4607802 4757914 4918101 5089710 5267616 5451330 5647691 5859331 6081643
55988 6081643 6314581 6565737 6838029 7126425 7430791 7759343 8115347 8493815 8895887
55979 8895887 9332331 9808062 10318157 10864638 11461476 12117214 12829522 13603610 14458535
55970 14458535 15408400 16456507 17616274 18918411 20389954 22049219 23932098 26101330
55962 26101330 28622430 31560513 35015951 39137025 44087625 50037571 57197785 65823682
55954 65823682 76171073 88508892 103210952 120790474 141843560 167064416 197287854
55947 197287854 233090974 273706503 315966748 354493708 383451503 398747569 399233371
$$ packed form
56007C346235Q8472R5869R8644J00634J07415J15236J18516J21362J29873J40043
55997D462299J45503J50112J60187J71609J77906J83714J96361K11640K22312
55988F081643K32938K51156K72292K88396L04366L28552L56004L78468M02072
55979H895887M36444M75731N10095N46481N96838O55738P12308P74088Q54925
55970A4458535R49865J048107J159767J302137J471543J659265J882879K169232
55962B6101330K521100K938083L455438M121074M950600N949946P160214Q625897
55954F5823682J0347391J2337819J4702060J7579522K1053086K5220856L0223438
55947A97287854L5803120M0615529M2260245L8526960K8957795J5296066M85802
$$ plain form
55940 399233371 386453729 363554933 334135500 301434015 267948478 235434301 205073706
55933 205073706 177585122 153249472 131995064 113575272 97710078 84118571 72517610
55926 72517610 62649929 54300231 47268370 41350587 36361859 32154414 28600737 25579186
55918 25579186 22989478 20763096 18844493 17176303 15711805 14424302 13291865 12285610
55910 12285610 11381638 10570240 9843308 9184714 8581516 8032473 7536634 7084246 6666605
55901 6666605 6284053 5936416 5615680 5315600 5038899 4787586 4555283 4336141 4132460
55892 4132460 3946525 3773298 3608058 3453402 3311995 3179901 3053543 2936061 2830491
55883 2830491 2733339 2640914 2555523 2479648 2410280 2344455 2284045 2229514 2175133 2116003 2054155
$$ packed form
55940C99233371j2779642k2898796k9419433l2701485l3485537l2514177l0360595
55933B05073706k7488584k4335650k1254408j8419792j5865194j3591507j1600961
55926G2517610r867681q349698p031861n917783m988728m207445l553677l021551
55918B5579186k589708k226382j918603j668190j464498j287503j132437j006255
55910A2285610r03972q11398p26932o58594o03198n49043m95839m52388m17641
55901F666605l82552l47637l20736l00080k76701k51313k32303k19142k03681
55892D132460j85935j73227j65240j54656j41407j32094j26358j17482j05570
55883B830491r7152r2425q5391p5875o9368o5825o0410n4531n4381n9130o1848
$$ plain form
55872 2054155 1992490 1928571 1859946 1789959 1722611 1656669 1590200 1525991 1467133 1411906 1358340
55861 1358340 1309527 1269333 1236826 1209608 1188523 1174305 1163528 1152626 1142439 1134626 1127296 1118277
55849 1118277 1108797 1099739 1088055 1071183 1051415 1031719 1010883 986969 961964 938565 915593 890916
55837 890916 865954 843180 822065 801390 782665 767357 753596 739410 726394 716489 708121 699289
55825 699289 691460 686374 681808 674617 665471 656642 647604 636856 625835 616930 609530 601725 594068 588125
55811 588125 583266 578377 574711 573604 573392 572157 571554 574319 579771 585320 590721 597240 604164 609675 613852
55796 613852 617456 618984 616189 609425 600613 590134 577523 563868 550678 537750 524813 513791
55784 513791 506607 502119 497932 493655 489718 484702 477029 468020 460379 454798 450597 448237 448514 450813
$$ packed form
55872B054155o1665o3919o8625o9987o7348o5942o6469o4209n8858n5227n3566
55861A358340m8813m0194l2507k7218k1085j4218j0777j0902j0187p813p330r019
55849A118277r480r058j1684j6872j9768j9696k0836k3914k5005k3399k2972k4677
55837H90916k4962k2774k1115k0675j8725j5308j3761j4186j3016r905q368q832
55825F99289p829n086m566p191r146q829r038j0748j1021q905p400p805p657n943
55811E88125m859m889l666j107k12j235o03K765N452N549N401O519O924N511M177
55796F13852L604J528k795o764q812j0479j2611j3655j3190j2928j2937j1022
55784E13791p184m488m187m277l937n016p673r009p641n581m201k360K77K299
$$ plain form
55770 450813 454921 462848 475709 490143 500867 505629 505041 499291 488421 474580 460528 446559 431727
55757 431727 417048 404460 393670 383168 373502 366427 361548 356887 352093 348092 344237 338942 332749
55744 332749 327732 324121 320279 315702 311323 307192 302629 298435 296186 295404 294004 291468 289150 287586
55730 287586 285887 283752 281748 279644 276625 273038 269881 266823 262754 257935 253509 249351 244631 240070
55716 240070 237260 236039 234872 233651 233822 235869 238903 242635 247493 252837 257282 260831 264640 268628
55702 268628 271299 271938 271052 268735 264569 259072 253344 247379 240587 233760 228449 224546 220652 216844 214905
55687 214905 215582 217608 219731 221898 224176 226286 228502 231497 235102 238620 242257 246668 251132 253864
55673 253864 254222 253159 251622 249965 248686 248081 247258 245071 241920 239210 237384 236043 235531 236550 238546
$$ packed form
55770D50813M108P927J2861J4434J0724M762n88n750j0870j3841j4052j3969j4832
55757D31727j4679j2588j0790j0502r666p075m879m661m794m001l855n295o193
55744C32749n017l611l842m577m379m131m563m194k249p82j400k536k318j564
55730B87586j699k135k004k104l019l587l157l058m069m819m426m158m720m561
55716B40070k810j221j167j221J71K047L034L732M858N344M445L549L809L988
55702B68628K671O39q86k317m166n497n728n965o792o827n311l903l894l808j939
55687B14905O77K026K123K167K278K110K216K995L605L518L637M411M464K732
55673B53864L58j063j537j657j279o05q23k187l151k710j826j341n12J019J996
$$ plain form
55658 238546 240382 242348 245627 249959 253870 257084 260723 264994 268601 270522 270716 269141 265810 261736
55644 261736 257949 253740 247750 240607 234406 229631 224794 219189 213772 209037 204244 199260 195100 192059
55630 192059 189198 186264 184264 183520 182939 181869 181056 181062 181255 180993 180383 179358 177363 174485 171628 169213
55614 169213 166943 164986 163903 163232 161683 159046 156435 154502 152948 151894 151953 152654 152589 151510 150568 150136
55598 150136 149198 147361 145595 144376 142918 140988 139693 139609 139759 139353 138982 139171 139197 138341 137041 135905 134852
55581 134852 134024 134350 136209 138597 140420 141704 142955 144394 146370 149420 153278 156934 160214 164180 169442
55566 169442 175189 180409 184822 188127 189685 189650 189168 188702 187285 184169 180097 176213 172755 169509 166522
55551 166522 163672 160528 157258 154746 153279 152135 150891 150016 149726 149492 149236 149680 150885 151789 151973 152553
$$ packed form
55658B38546J836J966L279M332L911L214L639M271L607J921J94j575l331m074
55644B61736l787m209n990p143o201m775m837n605n417m735m793m984m160l041
55630A92059k861k934k000p44n81j070q13OJ93k62o10j025j995k878k857k415
55614A69213k270j957j083o71j549k637k611j933j554j054N9P01o5j079r42m32
55598A50136r38j837j766j219j458j930j295q4J50m06l71J89K6q56j300j136j053
55581A34852q28L26J859K388J823J284J251J439J976L050L858L656L280L966N262
55566A69442N747N220M413L305J558l5m82m66j417l116m072l884l458l246k987
55551A66522k850l144l270k512j467j144j244q75k90k34k56M44J205R04J84N80
$$ plain form
55535 152553 154339 156321 157051 156524 155629 154669 153442 152060 150684 149033 146888 144527 142062 139030 135181
55520 135181 131007 126978 123090 119602 117288 116346 115879 115042 113969 113131 112669 112783 113765 115127 115641 114817
55504 114817 113469 112341 111204 109804 108622 108055 107829 107824 108482 109845 111197 112201 113277 114331 114345 113007
55488 113007 111495 110837 110655 110392 110533 111503 112525 112827 113074 114335 116307 117753 118179 118063 117879 117773 117795
55471 117795 117753 117325 116864 117364 118975 120365 120269 118908 117174 115293 113185 111341 110301 109786 109199 108493 107906
55454 107906 107414 107097 107374 108211 108762 108433 107610 106796 105859 104787 104235 104549 105156 105652 106563 108135 109375 109397
55436 109397 108878 109029 109811 110278 110087 109613 109025 108299 107651 107122 106208 104774 103745 103990 105031 105728 105670 105097
55418 105097 104101 102904 102294 102781 103776 104551 105443 107105 109072 110157 109977 109115 108067 106924 105828 104927
$$ packed form
55535A52553J786J982P30n27q95r60j227j382j376j651k145k361k465l032l849
55520A35181m174m029l888l488k314r42m67q37j073q38m62J14R82J362N14q24
55504A14817j348j128j137j400j182n67k26nO58J363J352J004J076J054J4j338
55488A13007j512o58j82k63J41R70J022L02K47J261J972J446M26j16j84j06K2
55471A17795m2m28m61N00J611J390r6j361j734j881k108j844j040n15n87p06n87
55454A07906m92l17K77Q37N51l29q23q14r37j072n52L14O07M96R11J572J240K2
55436A09397n19J51P82M67j91m74n88p26o48n29r14j434j029K45J041O97n8n73
55418A05097r96j197o10M87R95P75Q92J662J967J085j80q62j048j143j096r01
$$ plain form
55402 104927 104081 103194 102482 101924 101098 100174 100260 101916 104061 105301 105669 106121 106940 107687 108129 108140 107300 105654
55384 105654 104386 104615 105948 107228 108130 108959 109492 109382 109250 110002 111283 111899 111580 111079 110684 109865 108435
55367 108435 106961 105934 105406 105346 105521 105274 104336 103544 103714 104202 103782 102668 102269 103054 104046 104530 104841 105201
55349 105201 105114 104438 103964 104318 105113 105677 105883 105814 105283 104181 102847 101747 101110 101035 101513 102245 102834 103217 103561
55330 103561 103760 103508 102818 102008 101260 100579 100096 99955 100098 100559 101713 103671 105764 107196 107935 108401 108634
55313 108634 108468 108190 108154 108020 107225 106056 105351 105227 104946 104021 102738 101600 101007 101299 102383 103429 103747
55296 103747 103820 104625 106120 107392 108238 109450 111368 113238 114372 115042 115697 116020 115348 113568 111189 108815
55280 108815 106863 105496 104665 104306 104468 105003 105343 105043 104414 104125 104354 104713 104864 104674 104005 102989 102344 102759
$$ packed form
55402A04927q46q87p12n58q26r24Q6J656K145J240L68M52Q19P47M42J1q40j646
55384A05654j268K29J333J280R02Q29N33j10j32P52J281O16l19n01l95q19j430
55367A08435j474j027n28o0J75k47r38p92J70M88m20j114l99P85R92M84L11L60
55349A05201q7o76m74L54P95N64K06o9n31j102j334j100o37p5M78P32N89L83L44
55330A03561J99k52o90q10p48o81m83j41J43M61J154J958K093J432P39M66K33
55313A08634j66k78l6j34p95j169p05j24k81r25j283j138n93K92J084J046L18
55296A03747P3Q05J495J272Q46J212J918J870J134O70O55L23o72j780k379k374
55280A08815j952j367q31l59J62N35L40l00o29k89K29L59J51j90o69j016o45M15
$$ plain form
55262 102759 104057 105565 107140 109080 111157 112600 113103 113119 112982 112453 111368 110186 109560 109721 110373 110945
55246 110945 110923 110245 109355 108666 108201 107957 108149 108625 108512 107196 105353 104298 104510 105478 106675 107849 108549
55229 108549 108289 107273 106264 105706 105576 105999 107209 108802 109740 109326 107812 106040 104831 104624 105213 105934
55213 105934 106407 106862 107427 107597 106949 105872 104988 104367 104025 104521 106131 107957 108960 109393 110108 110867 110710
55196 110710 109718 108957 108729 108278 107435 107172 108126 109703 111046 111925 112372 112387 112346 112849 113895 114966 116010 117420
55178 117420 118957 119829 119994 120255 120710 120357 118771 117129 116818 117917 119657 121557 123382 124657 125079 125053
55162 125053 125233 125757 126257 126275 125442 123668 121363 119025 116524 113390 109913 107248 106149 106201 106506 106586 106424
55145 106424 106222 106371 107112 108053 108524 108476 108439 108642 108800 108837 109013 109292 109386 109487 110091 110959 111179 110498 109775 109853
$$ packed form
55262A02759J298J508J575J940K077J443N03J6j37n29j085j182o26J61O52N72
55246A10945k2o78q90o89m65k44J92M76j13j316j843j055K12R68J197J174P00
55229A08549k60j016j009n58j30M23J210J593R38m14j514j772j209k07N89P21
55213A05934M73M55N65J70o48j077q84o21l42M96J610J826J003M33P15P59j57
55196A10710r92p61k28m51q43k63R54J577J343Q79M47J5m1N03J046J071J044J410
55178A17420J537Q72J65K61M55l53j586j642l11J099J740J900J825J275M22k6
55162A25053J80N24N00J8q33j774k305k338k501l134l477k665j099N2L05Q0j62
55145A06424k02J49P41R41M71m8l7K03J58L7J76K79R4J01O04Q68K20o81p23P8
$$ plain form
55125 109853 110744 112045 113349 114116 114046 113771 114237 115235 115554 114781 113812 113381 113263 113338 114098 115442 116227 115846
55107 115846 115206 115283 115678 115535 115038 115025 115757 116970 118539 120249 121452 121774 121715 121932 122426 123018 123993 125536
55089 125536 127093 127989 128250 128223 127974 127630 127706 128370 128987 129051 128999 129409 130042 130428 130798 131559 132377 132641 132427 132143
55069 132143 131661 130711 129732 129385 129448 129140 128404 128017 128506 129672 131129 132561 133430 133110 131546 129429 127647
55052 127647 126709 126468 126193 125207 123699 122600 122440 122779 122991 122960 122633 121672 120196 119193 119425 120413 121226 121764
55034 121764 122444 123177 123575 123818 124300 124665 124196 123130 122612 123218 124302 124950 124932 124515 123927 123272 122668 122279
55016 122279 122347 123060 124207 125171 125575 125755 126258 127134 127964 128337 127986 126879 125563 125053 125873 127485 129002
54999 129002 130090 130798 131046 130854 130665 130871 131315 131816 132688 134135 135562 136267 136454 136771 137120 136781 135587
$$ packed form
55125A09853Q91J301J304P67p0k75M66R98L19p73r69m31j18P5P60J344P85l81
55107A15846o40P7L95j43m97j3P32J213J569J710J203L22n9K17M94N92R75J543
55089A25536J557Q96K61k7k49l44P6O64O17O4n2M10O33L86L70P61Q18K64k14k84
55069A32143m82r50r79l47O3l08p36l87M89J166J457J432Q69l20j564k117j782
55052A27647r38k41k75r86j508j099j60L39K12l1l27r61j476j003K32R88Q13N38
55034A21764O80P33L98K43M82L65m69j066n18O06J084O48j8m17n88o55o04l89
55016A22279O8P13J147R64M04J80N03Q76Q30L73l51j107j316n10Q20J612J517
54999A29002J088P08K48j92j89K06M44N01Q72J447J427P05J87L17L49l39j194
$$ plain form
54982 135587 134148 132953 131933 130992 130294 129912 129666 129396 129095 128889 129180 130545 133067 135969 138316 139816
54966 139816 140610 140753 140470 140431 141077 141989 142630 143274 144424 145677 146119 145664 145052 144637 144093 143332 142729 142342
54948 142342 141736 140811 140023 139603 139264 138903 138878 139313 139783 139991 140214 140761 141441 141923 142263 142817 143903 145661
54930 145661 147934 150206 152069 153855 156523 160824 166854 174386 183132 192551 201781 210067 217132 223130
54916 223130 228357 232901 236260 237428 235673 231238 225077 218088 210831 203644 196531 189129 181338 173919
54902 173919 168003 164066 161758 160538 159960 159475 158589 157342 156203 155506 155305 155593 156171 156526 156444 156632 158077
54885 158077 160850 164198 167732 171785 176595 181991 188102 195521 204313 213517 222044 229580 236177 241437
54871 241437 244649 245461 243964 240334 234855 228143 220960 213722 206365 198721 190897 183285 176306 170150
$$ packed form
54982A35587j439j195j020r41o98l82k46k70l01k06K91J365K522K902K347J500
54966A39816P94J43k83l9O46R12O41O44J150J253M42m55o12m15n44p61o03l87
54948A42342o06r25p88m20l39l61k5M35M70K08K23N47O80M82L40N54J086J758
54930A45661K273K272J863J786K668M301O030P532Q746R419R230Q286P065N998
54916B23130N227M544L359J168j755m435o161o989p257p187p113p402p791p419
54902A73919n916l937k308j220n78m85q86j247j139o97k01K88N78L55q2J88J445
54885A58077K773L348L534M053M810N396O111P419Q792R204Q527P536O597N260
54871B41437L212Q12j497l630n479o712p183p238p357p644p824p612o979o156
$$ plain form
54857 170150 164832 160485 157430 155767 154982 154128 152456 149812 146572 143298 140369 137790 135475 133654 132692
54842 132692 132425 132123 131401 130760 130869 131679 132633 133402 133897 133876 133169 132191 131705 132077 133089 134293 135218 135528
54824 135528 135436 135701 136723 137884 138316 138074 137901 138080 138219 138062 137778 137436 136880 136172 135619 135343 135298 135648 136488
54805 136488 137316 137440 136976 136743 137125 137630 137691 137280 136610 135898 135615 136316 137878 139352 139845 139271 138162 137151
54787 137151 136739 137105 137983 139011 140187 141637 143095 144200 145282 147160 150074 153415 156660 159925 163433
54772 163433 167098 171010 175772 181956 189516 197998 206955 215887 224177 231431 237687 243061 247339 250023
54758 250023 250566 248543 243918 237276 229568 221546 213625 206168 199588 194087 189565 185695 181871 177394
54744 177394 172207 167333 163999 162360 161528 160774 160162 160042 160526 161565 163040 164710 166437 168481 171140
$$ packed form
54857A70150n318m347l055j663p85q54j672k644l240l274k929k579k315j821r62
54842A32692k67l02p22o41J09Q10R54P69M95k1p07r78m86L72J012J204R25L10
54824A35528r2K65J022J161M32k42j73J79J39j57k84l42n56p08n53k76m5L50Q40
54805A36488Q28J24m64k33L82N05O1m11o70p12k83P01J562J474M93n74j109j011
54787A37151m12L66Q78J028J176J450J458J105J082J878K914L341L245L265L508
54772A63433L665L912M762O184P560Q482Q957Q932Q290P254O256N374M278K684
54758B50023N43k023m625o642p708q022p921p457o580n501m522l870l824m477
54744A77394n187m874l334j639q32p54o12j20M84J039J475J670J727K044K659
$$ plain form
54729 171140 174230 177430 180974 185420 190847 196908 203552 210910 218527 225532 231641 237151 241849 244740
54715 244740 245084 242957 238629 232234 224337 215978 207752 199499 191259 183753 177562 172529 168379 165236
54701 165236 163014 160995 158617 156193 154373 153330 152907 152982 153220 152948 151853 150396 149123 147975 146745
54686 146745 145696 145172 144967 144683 144392 144427 144743 144961 144885 144500 143709 142523 141381 140874 141107 141532 141421 140447
54668 140447 138988 137858 137506 137537 137313 136896 136847 137183 137249 136739 136086 135604 134960 133924 132939 132492 132457 132543 132891
54649 132891 133737 134919 136127 137187 137786 137513 136651 136372 137513 139591 141517 142812 143553 143671 143086 142258
54633 142258 141815 141705 141312 140364 139216 138234 137309 136078 134422 132789 132068 132835 134624 136289 137192 137654 138101
54616 138101 138410 138372 138205 138142 138047 137899 138160 139138 140361 141103 141174 140761 139987 139084 138582 138715 139015 138957 138613 138217
$$ packed form
54729A71140L090L200L544M446N427O061O644P358P617P005O109N510M698K891
54715B44740L44k127m328o395p897q359q226q253q240p506o191n033m150l143
54701A65236k222k019k378k424j820j043m23P5K38k72j095j457j273j148j230
54686A46745j049n24k05k84k91L5L16K18p6l85p91j186j142n07K33M25j11r74
54668A40447j459j130l52L1k24m17m9L36O6n10o53m82o44j036r85m47l5Q6L48
54649A32891Q46J182J208J060N99k73q62k79J141K078J926J295P41J18n85q28
54633A42258m43j10l93r48j148r82r25j231j656j633p21P67J789J665R03M62M47
54616A38101L09l8j67o3r5j48K61R78J223P42P1m13p74r03n02J33L00n8l44l96
$$ plain form
54596 138217 137582 136617 135942 136239 137282 138300 139042 139807 140636 141197 141363 141322 141206 141090 141162 141383 141227 140336 139177
54577 139177 138476 138267 138139 138156 138747 139854 140936 141812 142793 143903 144642 144639 144065 143356 142927 143112 143877 144644 144892
54558 144892 144892 145352 146398 147393 147820 147834 147881 148185 148662 149011 148947 148621 148730 149835 151703 153629 155183 156314
54540 156314 157050 157599 158446 159757 160926 161323 161216 161234 161199 160358 158704 157131 156168 155446 154664 154229 154539 155273
54522 155273 155855 156122 156135 155833 155307 155070 155532 156302 156431 155374 153613 152295 152189 152918 153382 153125 152988 154005
54504 154005 155933 157458 157762 157264 156778 156627 156774 157205 157830 158345 158499 158232 157486 156234 154822 153868 153647
54487 153647 153910 154395 155087 155799 156064 155766 155498 155925 157082 158625 160404 162392 164269 165620 166474 167316 168498
54470 168498 169939 171362 172576 173474 173999 174225 174354 174556 174902 175451 176248 177145 177753 177730 177125 176270 175338 174220
$$ packed form
54596A38217o35r65o75K97J043J018P42P65Q29N61J66m1j16j16P2K21j56q91j159
54577A39177p01k09j28J7N91J107J082Q76R81J110P39ln74p09m29J85P65P67K48
54558A44892%M60J046R95M27J4M7L04M77L49o4l26J09J105J868J926J554J131
54540A56314P36N49Q47J311J169L97j07J8l5q41j654j573r63p22p82m35L10P34
54522A55273N82K67J3l02n26k37M62P70J29j057j761j318j06P29M64k57j37J017
54504A54005J928J525L04m98m86j51J47M31O25N15J54k67p46j252j412r54k21
54487A53647K63M85O92P12K65k98k68M27J157J543J779J988J877J351Q54Q42J182
54470A68498J441J423J214Q98N25K26J29K02L46N49P97Q97O08k3o05q55r32j118
$$ plain form
54452 174220 172897 171680 170840 170178 169314 168290 167500 167076 166760 166445 166350 166521 166638 166577 166717 167282 167758 167401
54434 167401 166164 164693 163552 162817 162348 162125 162280 162958 164134 165475 166574 167387 168207 169085 169615 169457 168776
54417 168776 167973 167321 167061 167414 168194 168807 168959 168994 169211 169292 168827 168020 167337 166843 166325 165766 165241 164714 164457
54398 164457 165199 167237 169750 171679 172958 174210 175583 176689 177438 177999 177999 176708 174185 171544 169921 169706
54382 169706 170798 172906 175455 177723 179279 179992 179783 178878 178105 178264 179260 180484 181923 184116 187103 190256
54366 190256 193312 196677 200509 204282 207514 210202 212246 213188 212947 212146 211280 210106 208323 206314 204672
54351 204672 203365 201885 200005 197960 196020 194171 192180 189807 187101 184564 182827 182122 182264 183024 184144
54336 184144 185063 185183 184529 183725 183222 182892 182473 181945 181396 180901 180649 180732 180770 180195 179080 178205 178184 178896 179866
$$ packed form
54452A74220j323j217q40o62q64j024p90m24l16l15r5J71J17o1J40N65M76l57
54434A67401j237j471j141p35m69k23J55O78J176J341J099Q13Q20Q78N30j58o81
54417A68776q03o52k60L53P80O13J52L5K17Q1m65q07o83m94n18n59n25n27k57
54398A64457P42K038K513J929J279J252J373J106P49N61%j291k523k641j623k15
54382A69706J092K108K549K268J556P13k09r05p73J59R96J224J439K193K987L153
54366A90256L056L365L832L773L232K688K044R42k41q01q66j174j783k009j642
54351B04672j307j480j880k045j940j849j991k373k706k537j737p05J42P60J120
54336A84144R19J20o54q04n03l30m19n28n49m95k52Q3L8n75j115q75k1P12R70
$$ plain form
54317 179866 180749 181294 181278 180647 179438 177611 175369 173506 172733 172630 172041 170662 169475 169373 170146 171254 172774
54300 172774 174886 177000 178245 178571 178742 179307 180118 180805 181293 181754 182270 182628 182456 181686 180843 180595 181031 181699
54282 181699 182359 183215 184296 185089 185117 184583 184209 184606 185902 187654 189052 189491 189121 188593 188311 188236 188292 188460
54264 188460 188526 188344 188300 188815 189346 188741 186871 185115 184770 185696 186969 188174 189345 190239 190538 190496 190659 191033
54246 191033 191098 190569 189697 188856 188253 188004 188142 188505 188839 188974 188784 188106 186942 185634 184719 184597 185307 186448
54228 186448 187408 187934 188461 189568 191175 192631 193504 193810 193564 192748 191719 190991 190448 189427 187785 186191
54212 186191 185116 184248 183288 182642 182805 183590 184463 185216 185838 186173 186163 186048 185942 185610 185086 184973 185645 186556 186883
54193 186883 186523 185931 185315 184522 183502 182400 181378 180641 180380 180427 180320 180073 180428 181961 184337 186829 189183
$$ packed form
54317A79866Q83N45j6o31j209j827k242j863p73j03n89j379j187j02P73J108J520
54300A72774K112K114J245L26J71N65Q11O87M88M61N16L58j72p70q43k48M36O68
54282A81699O60Q56J081P93K8n34l74L97J296J752J398M39l70n28k82p5N6J68
54264A88460O6j82m4N15N31o05j870j756l45R26J273J205J171Q94K99m2J63L74
54246A91033O5n29q72q41o03k49J38L63L34J35j90o78j164j308r15j22P10J141
54228A86448R60N26N27J107J607J456Q73L06k46q16j029p28n43j021j642j594
54212A86191j075q68r60o46J63P85Q73P53O22L35j0j15j06l32n24j13O72R11L27
54193A86883l60n92o16p93j020j102j022p37k61M7j07k47L55J533K376K492K354
$$ plain form
54176 189183 191480 193609 195383 196820 197855 198187 197890 197693 198040 198281 197537 196042 194863 194449 194176 193286
54160 193286 191580 189209 186412 183620 181403 180118 179771 180126 180778 181318 181693 182203 182874 183175 182662 181579
54144 181579 180421 179295 178170 177375 177223 177354 177057 176128 174961 173925 173230 173287 174602 177183 180383 183396
54128 183396 185725 187316 188485 189578 190497 190785 190415 190126 190626 191805 193138 194505 196153 198150 200380
54113 200380 202910 205881 209168 212529 215980 219696 223739 228061 232491 236501 239383 240959 241624 241469 240015
54098 240015 237269 234308 232138 230502 228515 225948 223132 220180 217154 214575 212886 211729 210591 209699
54084 209699 209324 208683 206755 204004 202063 201689 202199 202981 204309 206300 208188 209272 209844 210646 211922 213398
54068 213398 214742 215707 216213 216478 216777 217018 216934 216615 216364 216104 215559 214952 214869 215390 216041 216635 217464 218569 219542
$$ packed form
54176A89183K297K129J774J437J035L32k97j97L47K41p44j495j179m14k73q90
54160A93286j706k371k797k792k217j285l47L55O52N40L75N10O71L01n13j083
54144A81579j158j126j125p95j52J31k97r29j167j036o95N7J315K581L200L013
54128A83396K329J591J169J093R19K88l70k89N00J179J333J367J648J997K230
54113B00380K530K971L287L361L451L716M043M322M430M010K882J576O65j55j454
54098B40015k746k961k170j636j987k567k816k952l026k579j689j157j138q92
54084B09699l75o41j928k751j941l74N10P82J328J991J888J084N72Q02J276J476
54068B13398J344R65N06K65K99K41q4l19k51k60n45o07q3N21O51N94Q29J105R73
$$ plain form
54049 219542 220276 221240 222763 224602 226464 228449 230750 233366 236274 239472 242800 246163 249955 254736 260510
54034 260510 266828 273531 280722 288042 294795 300877 306841 312864 318406 323099 327188 330846 333819 336122
54020 336122 338351 340837 343043 344233 344282 343476 342051 340237 338297 336205 333683 330709 327469 323701 318787
54005 318787 312825 306894 301832 297366 292832 288109 283372 278576 273799 269647 266653 264634 263127 262091
53991 262091 261604 261214 260212 258458 256477 254818 253608 252607 251414 249811 248120 247000 246685 246703 246517 246145
53975 246145 245947 246181 247080 249054 252514 257602 264209 271955 280142 288085 295550 302432 307960 310921 310876
53960 310876 308619 305195 301094 296637 292369 288564 284922 281247 277918 275250 273016 271111 270039 270096 270626
53945 270626 270890 271238 272653 275470 279282 283797 288949 294359 299525 304454 309423 314184 318127 321220 324038
$$ packed form
54049B19542P34R64J523J839J862J985K301K616K908L198L328L363L792M781N774
54034B60510O318O703P191P320O753O082N964O023N542M693M089L658K973K303
54020C36122K229K486K206J190M9q06j425j814j940k092k522k974l240l768m914
54005C18787n962n931n062m466m534m723m737m796m777m152k994k019j507j036
53991B62091m87l90j002j754j981j659j210j001j193j603j691j120l15J8j86l72
53975B46145j98K34Q99J974L460N088O607P746Q187P943P465O882N528K961m5
53960C10876k257l424m101m457m268l805l642l675l329k668k234j905j072N7N30
53945B70626K64L48J415K817L812M515N152N410N166M929M969M761L943L093K818
$$ plain form
53930 324038 326851 329369 331492 333609 335937 338156 340053 342056 344795 348408 352528 356752 360976 365480
53916 365480 370802 377313 384768 392459 399853 407041 414529 422725 431543 440296 447981 453857 457769 459889
53902 459889 460372 459477 457760 455785 453686 451341 448892 446706 444784 442522 439174 434380 428253 421166 413545
53887 413545 405623 397291 388344 378925 369651 361264 354186 348336 343227 338264 333164 328087 323325 318910
53873 318910 314664 310541 306728 303355 300276 297200 293933 290461 286847 283156 279497 276069 273015 270217
53859 270217 267367 264355 261428 258800 256325 253833 251638 250267 249700 249307 248662 247982 247595 247390 247065 246633
53843 246633 246335 246229 246138 245865 245308 244511 243781 243491 243552 243329 242371 241083 240301 240265 240361 239967 239308 239251 240286 241886
53823 241886 242997 243149 242872 242964 243605 244428 245218 246122 247297 248798 250771 253301 255979 258102 259498 260804
$$ packed form
53930C24038K813K518K123K117K328K219J897K003K739L613M120M224M224M504
53916C65480N322O511P455P691P394P188P488Q196Q818Q753P685N876L912K120
53902D59889M83q95j717j975k099k345k449k186j922k262l348m794o127p087p621
53887D13545p922q332q947r419r274q387p078n850n109m963n100n077m762m415
53873C18910m246m123l813l373l079l076l267l472l614l691l659l428l054k798
53859B70217k850l012k927k628k475k492k195j371n67l93o45o80l87k05l25m32
53843B46633k98j06r1k73n57p97p30k90O1k23r58j288p82l6R6l94o59n7J035J600
53823B41886J111J52k77R2O41Q23P90R04J175J501J973K530K678K123J396J306
$$ plain form
53807 260804 262794 265753 269578 274022 278652 282994 287022 291251 296155 301736 307803 314268 320959 327501
53793 327501 333623 339289 344374 348636 352219 355741 359555 363233 366116 368023 369106 369391 368867 367746 366194
53778 366194 363884 360194 354809 348033 340717 333964 328510 324103 319745 314750 309303 303872 298596 293550
53764 293550 289098 285470 282259 278827 275075 271492 268620 266688 265537 264640 263498 262216 261369 261098 260857
53749 260857 260274 259719 259537 259287 258348 256873 255517 254569 253954 253697 253682 253249 251874 250135 249241 249590 250471 251181
53731 251181 251731 252347 252914 253254 253477 253824 254422 255324 256527 257880 259183 260418 261704 263048 264417 265961
53715 265961 267906 270234 272650 274776 276269 277036 277565 278720 280847 283326 285384 287080 289050 291588 294558
53700 294558 298028 302339 307521 313119 318610 323561 327486 330070 331654 333038 334720 336600 338342 339677
$$ packed form
53807B60804J990K959L825M444M630M342M028M229M904N581O067O465O691O542
53793C27501O122N666N085M262L583L522L814L678K883J907J083K85n24j121j552
53778C66194k310l690n385o776p316o753n454m407m358m995n447n431n276n046
53764B93550m452l628l211l432l752l583k872j932j151q97j142j282q47k71k41
53749B60857n83n55j82k50r39j475j356r48o15k57j5m33j375j739q94L49Q81P10
53731B51181N50O16N67L40K23L47N98R02J203J353J303J235J286J344J369J544
53715B65961J945K328K416K126J493P67N29J155K127K479K058J696J970K538K970
53700B94558L470M311N182N598N491M951L925K584J584J384J682J880J742J335
$$ plain form
53686 339677 340407 340527 340356 340192 339899 339205 338271 337534 337046 336475 335809 335545 336043 337059 338039 338600 338643 338279 337751
53667 337751 337239 336775 336463 336549 337020 337291 336754 335523 334254 333314 332503 331558 330580 329918 329924 330775 332294 334041
53649 334041 335752 337481 339099 340080 340180 339936 339935 339985 339667 339462 340424 342778 345578 347857 349439 350578 351485
53632 351485 352464 353959 356159 358902 362034 365487 368995 372184 375044 377873 380733 383355 385573 387406
53618 387406 388801 389868 391272 393705 396829 399436 400864 401668 402687 404086 405665 407583 410299 413986
53604 413986 418345 422790 426759 430095 433218 436624 440259 443685 446762 449620 451946 452995 452562 451465
53590 451465 450788 451005 451884 452827 453141 452510 451386 450520 449984 449100 447444 445334 443127 440688 437884 435081
53574 435081 432717 430800 429209 428079 427456 426869 425757 424185 422768 421934 421526 421120 420600 420388 421006 422304
$$ packed form
53686C39677P30J20j71j64k93o94r34p37m88n71o66k64M98J016R80N61M3l64n28
53667C37751n12m64l12Q6M71K71n37j231j269r40q11r45r78o62OQ51J519J747
53649C34041J711J729J618R81J00k44jN0l18k05R62K354K800K279J582J139R07
53632C51485R79J495K200K743L132L453L508L189K860K829K860K622K218J833
53618C87406J395J067J404K433L124K607J428Q04J019J399J579J918K716L687
53604D13986M359M445L969L336L123L406L635L426L077K858K326J049m33j097
53590D51465o77K17Q79R43L14o31j124q66n36q84j656k110k207k439k804k803
53574D35081k364j917j591j130o23n87j112j572j417q34m08m06n20k12O18J298
$$ plain form
53558 422304 423322 423215 422217 421306 421087 421466 422269 423508 424977 426271 427369 428695 430430 432330 434279 436409
53542 436409 438492 439928 440664 441532 443301 445925 449070 452834 457498 463018 469179 475873 482869 489761 496490
53527 496490 503552 511303 519466 527685 536160 545425 555819 567550 580794 595312 610337 625260 640214
53514 640214 655748 672296 690224 709840 730923 752632 774354 796306 818905 841997 865222
53503 865222 888734 912960 937806 962575 986533 1009217 1030473 1050587 1070132 1089325 1107785
53492 1107785 1125261 1142237 1159346 1176559 1193504 1210385 1228004 1246908 1266892 1287226 1307074
53481 1307074 1325931 1344045 1362275 1381189 1400453 1419284 1437146 1453691 1468384 1480795 1491084
53470 1491084 1499736 1506893 1512217 1515204 1515346 1512308 1506334 1498264 1488805 1478046 1466005 1453201 1440238
$$ packed form
53558D22304J018j07r98r11k19L79Q03J239J469J294J098J326J735J900J949K130
53542D36409K083J436P36Q68J769K624L145L764M664N520O161O694O996O892O729
53527D96490P062P751Q163Q219Q475R265J0394J1731J3244J4518J5025J4923J4954
53514F40214J5534J6548J7928J9616K1083K1709K1722K1952K2599K3092K3225
53503H65222K3512K4226K4846K4769K3958K2684K1256K0114J9545J9193J8460
53492A107785J7476J6976J7109J7213J6945J6881J7619J8904J9984K0334J9848
53481A307074J8857J8114J8230J8914J9264J8831J7862J6545J4693J2411J0289
53470A491084Q652P157N324K987J42l038n974q070r459j0759j2041j2804j2963
$$ plain form
53457 1440238 1427204 1414004 1400900 1388065 1374903 1360565 1344983 1328725 1311935 1294139 1275180
53446 1275180 1255716 1236627 1218364 1200949 1184194 1167835 1151914 1137162 1124691 1115181 1108479 1103901
53434 1103901 1100686 1098344 1096855 1096426 1096834 1097324 1097505 1097999 1099695 1102663 1106404 1110867 1116464 1123208 1130715
53419 1130715 1139206 1149700 1162908 1178480 1195602 1213852 1233155 1253435 1274731 1297382 1321630
53408 1321630 1347177 1373433 1400147 1427628 1456377 1486639 1518245 1550901 1584703 1620365 1658744
53397 1658744 1700155 1744234 1790379 1838126 1887149 1937193 1988096 2039784 2092215 2145406 2199377
53386 2199377 2253867 2308162 2361371 2412915 2462691 2510861 2557540 2602583 2645566 2686073 2723946
53375 2723946 2758984 2790428 2817174 2838677 2855209 2867023 2873743 2874900 2870622 2861312 2846960 2827257
$$ packed form
53457A440238j3034j3200j3104j2835j3162j4338j5582j6258j6790j7796j8959
53446A275180j9464j9089j8263j7415j6755j6359j5921j4752j2471r510o702m578
53434A103901l215k342j489m29M08M90J81M94J696K968L741M463N597O744P507
53419A130715Q491J0494J3208J5572J7122J8250J9303K0280K1296K2651K4248
53408A321630K5547K6256K6714K7481K8749L0262L1606L2656L3802L5662L8379
53397A658744M1411M4079M6145M7747M9023N0044N0903N1688N2431N3191N3971
53386B199377N4490N4295N3209N1544M9776M8170M6679M5043M2983M0507L7873
53375B723946L5038L1444K6746K1503J6532J1814O720J157m278r310j4352j9703
$$ plain form
53363 2827257 2802072 2771415 2735362 2694691 2651243 2606836 2561790 2515156 2466439 2416582 2367183
53352 2367183 2319248 2272853 2227670 2183697 2141593 2102103 2064946 2028650 1991943 1955001 1918797
53341 1918797 1883592 1848862 1814506 1781207 1749444 1719023 1689828 1662346 1637018 1613624 1591778
53330 1591778 1571645 1553762 1538317 1524917 1512949 1501905 1491277 1480262 1467788 1453191 1436934
53319 1436934 1420261 1403896 1387477 1370586 1353758 1337906 1323212 1309384 1296678 1285750 1276634
53308 1276634 1268797 1262192 1257303 1254072 1251739 1250051 1249700 1251187 1254049 1257749 1262585 1269168 1277570 1287646
53294 1287646 1299815 1314836 1332913 1353341 1374919 1396579 1417979 1439693 1462473 1486113 1509448
53283 1509448 1531594 1552640 1572792 1591462 1607765 1621584 1633532 1644035 1652872 1659492 1663389 1664229
$$ packed form
53363B827257k5185l0657l6053m0671m3448m4407m5046m6634m8717m9857m9399
53352B367183m7935m6395m5183m3973m2104l9490l7157l6296l6707l6942l6204
53341A918797l5205l4730l4356l3299l1763l0421k9195k7482k5328k3394k1846
53330A591778k0133j7883j5445j3400j1968j1044j0628j1015j2474j4597j6257
53319A436934j6673j6365j6419j6891j6828j5852j4694j3828j2706j0928r116
53308A276634p837o605m889l231k333j688l51J487K862L700M836O583Q402J0076
53294A287646J2169J5021J8077K0428K1578K1660K1400K1714K2780K3640K3335
53283A509448K2146K1046K0152J8670J6303J3819J1948J0503Q837O620L897Q40
$$ plain form
53271 1664229 1661964 1656815 1649028 1638666 1625654 1609850 1591145 1569832 1546870 1523328 1499500 1475018
53259 1475018 1449887 1424796 1400144 1375406 1349880 1323608 1297156 1270900 1245004 1219730 1195277
53248 1195277 1171520 1148226 1125238 1102198 1078571 1054413 1030681 1008270 987031 966273 945894
53237 945894 926373 907875 890075 872908 856868 842519 830110 819635 810818 802954 795212 787205
53225 787205 779027 770774 762367 753789 745064 735852 725439 713281 699460 684533 669140 653780 638740
53212 638740 624052 609544 594977 580257 565713 552186 540478 530475 521089 511347 501313 491630
53200 491630 482416 473093 463184 452749 442044 431222 420537 410441 401247 392884 385142 377958 371324
53187 371324 365097 359101 353367 348134 343551 339385 335064 330173 325003 320470 317291 315232 313347 310908
$$ packed form
53271A664229k265n149p787j0362j3012j5804j8705k1313k2962k3542k3828k4482
53259A475018k5131k5091k4652k4738k5526k6272k6452k6256k5896k5274k4453
53248A195277k3757k3294k2988k3040k3627k4158k3732k2411k1239k0758k0379
53237I45894j9521j8498j7800j7167j6040j4349j2409j0475q817p864p742q007
53225G87205q178q253q407q578q725r212j0413j2158j3821j4927j5393j5360j5040
53212F38740j4688j4508j4567j4720j4544j3527j1708j0003r386r742j0034r683
53200D91630r214r323r909j0435j0705j0822j0685j0096r194q363p742p184o634
53187C71324o227n996n734n233m583m166m321m891n170m533l179k059j885k439
$$ plain form
53173 310908 307950 304941 302223 299889 298042 296910 296609 296902 297324 297591 297731 297699 297101 295633 293734 292399
53157 292399 292103 292200 291581 289759 287137 284527 282668 281971 282298 283038 283659 284131 284579 284720 284091 282779 281432
53140 281432 280420 279444 278251 277330 277447 278635 280117 281248 282183 283442 285178 287095 288845 290180 290906
53125 290906 291120 291480 292742 294824 296752 297827 298527 299848 302020 304385 306350 307940 309293 310168 310190 309357
53109 309357 308153 307280 307300 308225 309414 310051 309747 308527 306482 303862 301358 299594 298242 296244 293207 290054
53093 290054 287931 286912 286166 285016 283389 281519 279714 278269 277245 276427 275748 275535 275986 276702 277144 277356
53077 277356 277732 278192 278136 277304 276176 275386 275062 274920 274685 274187 273257 271878 270369 269238 268724 268608 268508 268295
53059 268295 268117 268060 267948 267592 267062 266603 266408 266591 267228 268223 269298 270325 271470 272732 273654 273948 274101 274824
$$ packed form
53173C10908k958l009k718k334j847j132l01K93M22K67J40l2n98j468j899j335
53157B92399k96R7o19j822k622k610j859o97L27P40O21M72M48J41o29j312j347
53140B81432j012r76j193r21J17J188J482J131R35J259J736J917J750J335P26
53125B90906K14L60J262K082J928J075P00J321K172K365J965J590J353Q75K2q33
53109C09357j204q73K0R25J189O37l04j220k045k620k504j764j352j998l037l153
53093B90054k123j019p46j150j627j870j805j445j024q18o79k13M51P16M42K12
53077B77356L76M60n6q32j128p90l24j42k35m98r30j379j509j131n14j16j00k13
53059B68295j78n7j12l56n30m59j95J83O37R95J075J027J145J262R22K94J53P23
$$ plain form
53041 274824 275970 276722 276765 276568 276473 276323 276181 276487 277106 277098 276058 275004 275171 276442 277694 278257 278240 277805 276959
53022 276959 276001 275476 275662 276520 277927 279496 280470 280486 280242 280707 281783 282448 282175 281476 280998 280824 280837 281121
53004 281121 281658 282124 282332 282611 283501 285101 286827 287764 287504 286800 287017 288549 290172 290572 290189 290757 293132
52987 293132 296400 299207 301120 302520 303931 305769 308076 310131 310925 310401 309691 309695 309981 309594 308481 307495
52971 307495 307267 307668 308311 309047 309956 311167 312723 314437 315902 316897 317725 318952 320782 322784 324229 324628
52955 324628 324044 322912 321568 320024 318258 316526 315126 314007 312927 311954 311441 311458 311635 311586 311141 310105
52939 310105 308276 305874 303533 301645 300079 298725 297895 297844 298266 298716 299293 300433 302083 303494 303945 303489
52923 303489 302879 302831 303400 304061 304404 304560 304828 305057 304770 303862 302812 302173 302228 303113 304722 306328 306819 305759
$$ packed form
53041B74824J146P52M3j97r5j50j42L06O19qj040j054J67J271J252N63j7m35q46
53022B76959r58n25J86Q58J407J569R74J6k44M65J076O65k73o99m78j74J3K84
53004B81121N37M66K08K79Q90J600J726R37k60p04K17J532J623M00l83N68K375
52987B93132L268K807J913J400J411J838K307K055P94n24p10MK86l87j113r86
52971C07495k28M01O43P36R09J211J556J714J465R95Q28J227J830K002J445L99
52955C24628n84j132j344j544j766j732j400j119j080r73n13J7J77m9m45j036
52939C10105j829k402k341j888j566j354q30n1M22M50N77J140J650J411M51m56
52923C03489o10m8N69O61L43J56K68K29k87r08j050o39N5Q85J609J606M91j060
$$ plain form
52905 305759 303875 302189 301024 300165 299609 299566 299926 300245 300229 299855 299109 298085 297302 297446 298628 300204 301523
52888 301523 302627 304050 306043 308107 309308 309035 307591 306064 305531 306306 307889 309529 310844 312021 313553
52873 313553 315708 318219 320578 322717 325208 328573 332440 335578 336938 336608 335665 335027 334527 333290 331048
52858 331048 328735 327507 327390 327258 326047 323542 320088 316188 312546 309851 308060 306248 303594 300283 297098
52843 297098 294418 292053 289837 287879 286230 284708 283092 281259 279195 277089 275348 274255 273716 273565 273920
52828 273920 274918 276235 277287 277843 278100 278169 277951 277483 276987 276491 275843 275232 275247 276125 277306 278053 278302 278524
52810 278524 278955 279404 279741 280122 280569 280648 279879 278359 276722 275436 274325 272866 270851 268585 266502 264769
52794 264769 263337 262210 261535 261416 261738 262171 262334 262038 261464 261013 260952 261156 261268 261079 260741 260667 261146 262044 262910
$$ packed form
52905C05759j884j686j165q59n56m3L60L19j6l74p46j024p83J44J182J576J319
52888C01523J104J423J993K064J201k73j444j527n33P75J583J640J315J177J532
52873C13553K155K511K359K139K491L365L867L138J360l30r43o38n00j237k242
52858C31048k313j228j17j32j211k505l454l900l642k695j791j812k654l311l185
52843B97098k680k365k216j958j649j522j616j833k064k106j741j093n39j51L55
52828B73920R98J317J052N56K57O9k18m68m96m96o48o11J5Q78J181P47K49K22
52810B78524M31M49L37L81M47P9p69j520j637j286j111j459k015k266k083j733
52794B64769j432j127o75j19L22M33J63k96n74m51o1K04J12j89l38p4M79Q98Q66
$$ plain form
52775 262910 263486 263981 264627 265119 264900 264003 263129 262724 262490 262161 262250 263400 265297 266896 267670 267951 268015 267596
52757 267596 266604 265692 265600 266306 267251 268142 269077 270106 271182 272415 273921 275444 276601 277571 279095 281573
52741 281573 284533 287180 289186 290697 291849 292629 293060 293179 292919 292323 291846 292073 293047 294183 295001 295652 296489
52724 296489 297385 297802 297436 296473 295197 293728 292278 291386 291587 292876 294643 296123 296822 296611 295649 294300
52708 294300 292970 291923 291246 290975 291113 291421 291358 290531 289244 288366 288434 289037 289289 288826 288100 287715 287794 288085 288400
52689 288400 288745 289143 289603 290163 290847 291603 292398 293233 293921 293995 293093 291408 289645 288533 288433 289204 290206 290614
52671 290614 290077 289069 288405 288472 289145 290274 291803 293457 294750 295513 296110 296982 298224 299688 301255 302887
52655 302887 304679 306898 309713 312757 315329 317120 318455 319625 320395 320395 319613 318204 316194 313830 311912
$$ packed form
52775B62910N76M95O46M92k19q97q74m05k34l29Q9J150J897J599P74K81O4m19
52757B67596r92r12r2P06R45Q91R35J029J076J233J506J523J157R70J524K478
52741B81573K960K647K006J511J152P80M31J19k60n96m77K27R74J136Q18O51Q37
52724B96489Q96M17l66r63j276j469j450q92K01J289J767J480O99k11r62j349
52708B94300j330j047o77k71J38L08o3q27j287q78O8O03K52m63p26l85P9K91L15
52689B88400L45L98M60N60O84P56P95Q35O88P4r02j685j763j112j00P71J002M08
52671B90614n37j008o64O7O73J129J529J654J293P63N97Q72J242J464J567J632
52655C02887J792K219K815L044K572J791J335J170P70%p82j409k010k364j918
$$ plain form
52640 311912 311226 311709 312543 312990 312805 312039 310967 310237 310518 311845 313647 315575 317942 321173 325103 329006
52624 329006 332098 333851 334084 332987 331010 328578 326004 323649 321956 321108 320758 320280 319252 317671 315846
52609 315846 314176 312970 312348 312294 312706 313270 313366 312480 310893 309697 309880 311408 313381 314950 315887 316388 316647
52592 316647 316729 316664 316549 316543 316749 317092 317479 318207 319991 323182 326996 329916 331075 330952 330555 330233 329688 328903
52574 328903 328508 329062 330297 331327 331509 330922 330097 329407 328742 327737 326243 324491 322809 321331 320106 319243
52558 319243 318702 318160 317483 317154 317663 318484 318309 316565 314096 311956 310158 308242 306537 305927 306549 307605
52542 307605 308548 309564 310706 311401 311352 311236 311845 312987 313939 314687 315948 317946 319876 320855 320985 321162 322032
52525 322032 323396 324565 325148 325478 326268 327855 329793 331223 331657 331336 330936 331013 331748 333102 335103 337931
$$ packed form
52640C11912o86M83Q34M47j85p66j072p30K81J327J802J928K367L231L930L903
52624C29006L092J753K33j097j977k432k574k355j693q48l50m78j028j581j825
52609C15846j670j206o22n4M12N64R6q86j587j196J83J528J973J569R37N01K59
52592C16647Q2o5j15oK06L43L87P28J784L191L814K920J159j23l97l22n45p85
52574C28903l95N54J235J030J82n87q25o90o65j005j494j752j682j478j225q63
52558C19243n41n42o77l29N09Q21j75j744k469k140j798j916j705o10O22J056
52542C07605R43J016J142O95m9j16O09J142R52P48J261J998J930R79J30J77Q70
52525C22032J364J169N83L30P90J587J938J430M34l21m00P7P35J354K001K828
$$ plain form
52509 337931 341679 346106 350747 355233 359370 362883 365307 366280 365780 363927 360680 355938 349925 343324 336950
52494 336950 331371 326792 323191 320473 318464 316906 315651 314889 314952 315701 316391 316477 316422 317197 319001 320957 322216
52477 322216 322801 323064 322923 322246 321631 322011 323469 325134 326461 328005 330559 333941 337221 339976 342733 346095
52461 346095 349899 353559 356812 359666 361760 362423 361446 359323 356494 352815 348175 343190 338766 335177 332133
52446 332133 329524 327424 325449 322887 319681 316661 314519 313136 312138 311572 311595 311986 312430 312936 313552 313960
52430 313960 313827 313324 312940 312916 313136 313369 313437 313416 313818 315112 316828 317792 317629 317406 318201 319658 320737 321365
52412 321365 322406 324290 326719 329605 333327 338024 343521 350026 357975 367039 376164 384771 392993 400438
52398 400438 405678 407548 406250 402623 397067 389898 382162 375193 369520 364809 360706 357205 354338 352026
$$ packed form
52509C37931L748M427M641M486M137L513K424R73n00j853l247m742o013o601o374
52494C36950n579m579l601k718k009j558j255p62O3P49O90Q6n5P75J804J956J259
52477C22216N85K63j41o77o15L80J458J665J327J544K554L382L280K755K757L362
52461C46095L804L660L253K854K094O63r77k123k829l679m640m985m424l589l044
52446C32133k609k100j975k562l206l020k142j383r98n66K3L91M44N06O16M08
52430C13960j33n03l84k4K20K33O8k1M02J294J716R64j63k23P95J457J079O28
52412C21365J041J884K429K886L722M697N497O505P949R064R125Q607Q222P445
52398D00438N240J870j298l627n556p169p736o969n673m711m103l501k867k312
$$ plain form
52384 352026 350278 349221 348918 349282 350059 350870 351564 352608 354702 357811 361100 364082 367316 371584 376895
52369 376895 382832 389268 396012 402137 406516 408901 409849 409760 408759 407351 406240 405371 403996 401979 400287
52354 400287 399813 400363 401265 402390 403975 405881 407669 409328 411379 414235 417780 421560 425110 428136 430674
52339 430674 433076 435630 438310 441141 444744 450127 457761 467049 476847 486485 496289 507199 519895 534276
52325 534276 549817 566391 584416 603997 624195 643661 662011 680054 698565 717395 736179
52314 736179 755357 775786 797482 819604 841816 864993 890165 917267 945385 973886 1002725
52303 1002725 1031875 1061047 1089934 1118157 1144975 1169607 1192005 1212762 1231974 1248678 1261808
52292 1261808 1271340 1278054 1282434 1284346 1283707 1280962 1276737 1271332 1264701 1256757 1247604 1237634 1227484 1217789
$$ packed form
52384C52026j748j057l03L64P77Q11O94J044K094L109L289K982L234M268N311
52369C76895N937O436O744O125M379K385R48q9j001j408j111q69j375k017j692
52354D00287m74N50R02J125J585J906J788J659K051K856L545L780L550L026K538
52339D30674K402K554K680K831L603N383P634R288R798R638R804J0910J2696J4381
52325E34276J5541J6574J8025J9581K0198J9466J8350J8043J8511J8830J8784
52314G36179J9178K0429K1696K2122K2212K3177K5172K7102K8118K8501K8839
52303A002725K9150K9172K8887K8223K6818K4632K2398K0757J9212J6704J3130
52292A261808R532O714M380J912o39k745m225n405o631p944r153r970j0150r695
$$ plain form
52278 1217789 1208905 1200900 1193751 1187459 1182007 1177356 1173505 1170539 1168739 1168705 1171125 1176157 1183128 1191154
52264 1191154 1200007 1210201 1222292 1236409 1252391 1269932 1288456 1307272 1326185 1345790 1366944
52253 1366944 1389968 1414409 1439249 1463156 1484825 1503450 1518855 1531005 1539568 1544253 1545450 1544121
52241 1544121 1540989 1536068 1529006 1519582 1507818 1493912 1478257 1461373 1443664 1425334 1406578 1387611
52229 1387611 1368448 1348948 1329260 1309951 1291413 1273372 1255391 1237758 1221426 1206994 1194112
52218 1194112 1182088 1170818 1160829 1152559 1145898 1140432 1135941 1132556 1130556 1130055 1130824 1132346 1134135 1136041
52204 1136041 1138262 1140994 1144115 1147375 1150845 1154956 1159925 1165402 1171002 1177047 1184302 1192886 1201941 1210658
52190 1210658 1219177 1227988 1236673 1243876 1248513 1250516 1250319 1248117 1243957 1238176 1231329 1223700 1215181 1205648
$$ packed form
52278A217789q884q005p149o292n452m651l851k966j800l4K420N032O971Q026
52264A191154Q853J0194J2091J4117J5982J7541J8524J8816J8913J9605K1154
52253A366944K3024K4441K4840K3907K1669J8625J5405J2150Q563M685J197j329
52241A544121l132m921p062r424j1764j3906j5655j6884j7709j8330j8756j8967
52229A387611j9163j9500j9688j9309j8538j8041j7981j7633j6332j4432j2882
52218A194112j2024j1270r989q270o661n466m491l385k000n01P69J522J789J906
52204A136041K221K732L121L260L470M111M969N477N600O045P255Q584R055Q717
52190A210658Q519Q811Q685P203M637K003j97k202m160n781o847p629q519r533
$$ plain form
52176 1205648 1195351 1184858 1174706 1165190 1156530 1149073 1143026 1138031 1133474 1129415 1126737 1125939 1126251 1126612
52162 1126612 1127158 1128858 1131893 1135424 1139059 1143315 1148152 1152122 1153898 1153878 1153391 1152878 1151949 1150863 1150731 1152152
52146 1152152 1154619 1157467 1160617 1164035 1167160 1169345 1170528 1171124 1171590 1172291 1173547 1175485 1177990 1180940 1184414
52131 1184414 1188759 1194541 1202340 1212273 1223831 1236605 1251098 1268438 1289277 1313338 1340036 1368967
52119 1368967 1399690 1431517 1463826 1496276 1528518 1560013 1590377 1619732 1648466 1676799 1704613
52108 1704613 1731476 1756776 1780146 1801929 1823049 1844267 1865629 1886582 1906306 1923951 1938871
52097 1938871 1950817 1959693 1965148 1966664 1964059 1957570 1947432 1933765 1916939 1897598 1876147 1852643
52085 1852643 1827437 1801554 1776084 1751435 1727472 1704292 1682584 1663248 1646689 1632480 1619756
$$ packed form
52176A205648j0297j0493j0152r516q660p457o047m995m557m059k678p98L12L61
52162A126612N46J700L035L531L635M256M837L970J776k0m87n13r29j086j32J421
52146A152152K467K848L150L418L125K185J183N96M66P01J256J938K505K950L474
52131A184414M345N782P799R933J1558J2774J4493J7340K0839K4061K6698K8931
52119A368967L0723L1827L2309L2450L2242L1495L0364K9355K8734K8333K7814
52108A704613K6863K5300K3370K1783K1120K1218K1362K0953J9724J7645J4920
52097A938871J1946Q876N455J516k605o489j0138j3667j6826j9341k1451k3504
52085A852643k5206k5883k5470k4649k3963k3180k1708j9336j6559j4209j2724
$$ plain form
52074 1619756 1608092 1597903 1589842 1584129 1580794 1580238 1582849 1588209 1595497 1604749 1616857 1632073 1649350
52061 1649350 1667595 1686815 1707534 1729771 1753289 1778152 1804135 1829900 1853680 1874725 1893437
52050 1893437 1910124 1924210 1934678 1940747 1942123 1939064 1932315 1922676 1910585 1896243 1879913 1861859
52038 1861859 1842216 1821241 1799400 1776899 1753522 1729390 1705427 1682388 1659829 1636841 1613535
52027 1613535 1590860 1568985 1546930 1524040 1500886 1478261 1456061 1433807 1411684 1390422 1370438
52016 1370438 1351687 1334154 1317913 1302823 1288578 1275068 1262343 1250186 1237976 1224967 1210622
52005 1210622 1194804 1177829 1160257 1142385 1124022 1104998 1085775 1067248 1049908 1033603 1018243
51994 1018243 1004367 992528 982137 971394 958704 943994 928361 912522 895997 877913 858277
$$ packed form
52074A619756j1664j0189q061n713l335n56K611N360P288R252J2108J5216J7277
52061A649350J8245J9220K0719K2237K3518K4863K5983K5765K3780K1045J8712
52050A893437J6687J4086J0468O069J376l059o749r639j2091j4342j6330j8054
52038A861859j9643k0975k1841k2501k3377k4132k3963k3039k2559k2988k3306
52027A613535k2675k1875k2055k2890k3154k2625k2200k2254k2123k1262j9984
52016A370438j8751j7533j6241j5090j4245j3510j2725j2157j2210j3009j4345
52005A210622j5818j6975j7572j7872j8363j9024j9223j8527j7340j6305j5360
51994A018243j3876j1839j0391j0743j2690j4710j5633j5839j6525j8084j9636
$$ plain form
51983 858277 838112 818446 799418 780446 761133 741869 723517 706568 690846 676166 663007
51972 663007 652150 643735 637169 632089 628925 628296 630281 634588 640940 648782 656928 664151 670025 674696
51958 674696 677928 678983 677501 673975 669141 663344 656774 650004 643953 639434 636901 636517 638315 642354
51944 642354 648889 658432 671563 688577 709194 732638 758159 785397 813930 842360 868255 889325
51932 889325 904448 913330 915588 910792 899326 882601 862213 839159 813889 786751 758280 729326
51920 729326 701057 674665 650949 630218 612352 596800 582750 569789 558382 549334 542807 538218
51908 538218 535096 533641 534326 537278 542117 548043 554002 559107 563058 565989 567841 568113 566196 561691 554419
51893 554419 544566 532931 520726 508981 498235 488709 480407 473115 466756 461855 459226 459108 460963
$$ packed form
51983H58277k0165j9666j9028j8972j9313j9264j8352j6949j5722j4680j3159
51972F63007j0857q415o566n080l164o29J985M307O352P842Q146P223N874M671
51958F74696L232J055j482l526m834n797o570o770o051m519k533l84J798M039
51944F42354O535R543J3131J7014K0617K3444K5521K7238K8533K8430K5895K1070
51932H89325J5123Q882K258m796j1466j6725k0388k3054k5270k7138k8471k8954
51920G29326k8269k6392k3716k0731j7866j5552j4050j2961j1407r048o527m589
51908E38218l122j455O85K952M839N926N959N105L951K931J852K72j917m505p272
51893E54419r853j1635j2205j1745j0746r526q302p292o359m901k629j18J855
$$ plain form
51880 460963 464147 468373 473439 479128 485638 493515 502777 512479 521461 529145 535264 539343 541035 540718
51866 540718 539184 536896 534073 531303 529456 528897 529237 529943 530893 532333 534655 538211 542869 547628 551086
51851 551086 552590 552657 551991 550395 546946 541092 533209 524142 514591 505023 495844 487323 479532 472577 466795
51836 466795 462468 459427 457224 455691 455048 455366 456262 457244 458081 458655 458732 458190 457229 456096 454789 453306 451944
51819 451944 450969 450137 448985 447541 446378 446005 446554 447938 449846 451578 452427 452339 451874 451447 451012 450517 450170
51802 450170 450037 449847 449495 449446 450377 452562 455664 458856 461116 461823 461251 460182 458999 457540 455831 454308
51786 454308 453098 451715 449897 448172 447117 446567 446148 446181 447353 449678 452448 455114 457642 460131 462813
51771 462813 466467 472067 479672 488185 496526 504653 513046 521501 528965 534467 537763 538987 538043 534655
$$ packed form
51880D60963L184M226N066N689O510P877R262R702Q982P684O119M079J692l17
51866E40718j534k288k823k770j847n59L40P06R50J440K322L556M658M759L458
51851E51086J504O7o66j596l449n854p883r067r551r568r179q521p791o955n782
51836D66795m327l041k203j533o43L18Q96R82Q37N74P7n42r61j133j307j483j362
51819D51944r75q32j152j444j163l73N49J384J908J732Q49q8m65m27m35m95l47
51802D50170j33j90l52m9R31K185L102L192K260P07n72j069j183j459j709j523
51786D54308j210j383j818j725j055n50m19L3J172K325K770K666K528K489K682
51771D62813L654N600P605Q513Q341Q127Q393Q455P464N502L296J224r44l388
$$ plain form
51757 534655 528906 521448 513087 504294 495193 485890 476585 467425 458480 450011 442582 436752 432677 430090
51743 430090 428622 428098 428521 429862 431949 434651 438098 442523 447789 453354 458840 464339 469818 474519 477509
51728 477509 478757 479156 479526 480195 481627 484689 489732 495719 500759 503448 503554 501717 498835 495600 492335
51713 492335 489169 486284 483829 481652 479456 477158 474780 472048 468743 465535 463807 464274 466200 468273
51699 468273 469740 470429 470316 469641 468978 468508 467644 466002 464432 464293 465788 467676 468625 468244 466843 464792
51683 464792 462311 459459 456145 452407 448734 445864 444248 443833 444212 444779 444967 444755 444822 445855 447849 450433
51667 450433 453652 458028 464046 472015 482135 493986 505955 515831 522204 525003 524737 521784 516515 509629
51653 509629 502175 495437 490731 488901 489987 493544 498998 505247 510350 512564 511812 509453 506513 502853
$$ packed form
51757E34655n749p458q361q793r101r303r305r160q945q469p429n830m075k587
51743D30090j468n24M23J341K087K702L447M425N266N565N486N499N479M701K990
51728D77509J248L99L70O69J432L062N043N987N040K689J06j837k882l235l265
51713D92335l166k885k455k177k196k298k378k732l305l208j728M67J926K073
51699D68273J467O89j13o75o63m70q64j642j570j39J495J888R49l81j401k051
51683D64792k481k852l314l738l673k870j616m15L79N67J88k12O7J033J994K584
51667D50433L219M376O018P969J0120J1851J1969R876O373K799k66k953n269o886
51653E09629p454o738m706j830J086L557N454O249N103K214p52k359k940l660
$$ plain form
51639 502853 498159 492866 487653 482726 478072 473842 469923 465614 460376 454673 449585 445791 443275 441733
51625 441733 440804 440063 439266 438490 437706 436434 434229 431373 428618 426244 423815 420895 417657 414646 412184
51610 412184 410173 408340 406540 404873 403539 402603 401950 401541 401636 402614 404549 407051 409650 412429 416263 422235
51594 422235 430706 441046 452295 463733 474508 483133 488106 489175 487482 484342 480395 476058 472050
51581 472050 468951 466731 465347 465505 468215 473687 481238 490239 500579 512191 524719 537907 551945
51568 551945 567107 583294 600080 616962 633411 649021 664036 679612 697276 718080 742373
51557 742373 770051 800585 832728 864582 894126 919554 939224 951838 957020 955438 948016 935241
51545 935241 917537 895973 872017 846715 820695 794885 770435 747727 726170 705373 685822
$$ packed form
51639E02853m694n293n213m927m654m230l919m309n238n703n088l794k516j542
51625D41733r29p41p97p76p84j272k205k856k755k374k429k920l238l011k462
51610D12184k011j833j800j667j334r36o53m09R5R78J935K502K599K779L834N972
51594D22235Q471J0340J1249J1438J0775Q625M973J069j693l140l947m337m008
51581D72050l099k220j384J58K710N472P551R001J0340J1612J2528J3188J4038
51568E51945J5162J6187J6786J6882J6449J5610J5015J5576J7664K0804K4293
51557G42373K7678L0534L2143L1854K9544K5428J9670J2614N182j582p422j2775
51545I35241j7704k1564k3956k5302k6020k5810k4450k2708k1557k0797j9551
$$ plain form
51534 685822 667916 650990 634069 617219 601301 586675 573002 560188 548561 538021 527885
51523 527885 517940 508873 501245 494627 488206 481773 475639 469947 464571 459498 454869 450787 447317 444549
51509 444549 442416 440642 439066 437763 436689 435539 434147 432728 431440 430110 428795 428229 429145 431244 433388
51494 433388 434871 436070 437736 439952 442020 443238 443691 444211 445508 447439 449251 450476 451190 451357 450469
51479 450469 448223 445192 442352 440097 438052 435634 432445 428366 423757 419423 415936 413055 410232 407505
51465 407505 405335 403649 401729 399186 396415 393846 391367 388887 386952 386185 386390 386749 386910 387417 389050
51450 389050 392041 396015 400422 404981 409891 415736 423072 432074 442669 454841 468522 483080 497237
51437 497237 509748 520077 528271 534359 538183 539813 539726 538345 535484 530499 522954 513133 501989 490727
$$ packed form
51534F85822j7906j6926j6921j6850j5918j4626j3673j2814j1627j0540j0136
51523E27885r945r067p628o618o421o433o134n692n376n073m629m082l470k768
51509D44549k133j774j576j303j074j150j392j419j288j330j315n66R16K099K144
51494D33388J483J199J666K216K068J218M53N20J297J931J812J225P14J67q88
51479D50469k246l031k840k255k045k418l189m079m609m334l487k881k823k727
51465D07505k170j686j920k543k771k569k479k480j935p67K05L59J61N07J633
51450C89050K991L974M407M559M910N845P336R002J0595J2172J3681J4558J4157
51437D97237J2511J0329Q194O088L824J630q7j381k861m985p545r821j1144j1262
$$ plain form
51423 490727 480288 470970 462563 454991 448705 444186 441078 438288 435167 432253 430493 429930 429607 428724 427478
51408 427478 426574 426328 426566 427149 428122 429344 430439 431375 432820 435579 439731 444593 449532 454514 459817 465548
51392 465548 471637 478069 484913 492233 500192 509172 519641 531991 546608 563946 584377 608107 635434
51379 635434 666862 702716 742799 786667 833964 883914 934466 982385 1024408 1058257 1082713
51368 1082713 1097162 1101260 1094870 1078300 1052714 1020070 982313 940770 896616 851558 807290 764378
51356 764378 722488 681931 644251 610988 582439 557976 536886 518463 501908 486869 473817
51345 473817 463340 455304 449115 444459 441253 439139 437604 436397 435392 434310 433079 432184 431976 431839 430765
51330 430765 428739 426760 425419 424147 422154 419515 416893 414558 412142 409246 406005 403037 400897 399604
$$ packed form
51423D90727j0439r318q407p572o286m519l108k790l121k914j760n63l23q83j246
51408D27478r04k46K38N83R73J222J095R36J445K759M152M862M939M982N303N731
51392D65548O089O432O844P320P959Q980J0469J2350J4617J7338K0431K3730K7327
51379F35434L1428L5854M0083M3868M7297M9950N0552M7919M2023L3849K4456
51368A082713J4449M098o390j6570k5586l2644l7757m1543m4154m5058m4268m2912
51356G64378m1890m0557l7680l3263k8549k4463k1090j8423j6555j5039j3052
51345D73817j0477q036o189m656l206k114j535j207j005j082j231q95k08j37j074
51330D30765k026j979j341j272j993k639k622k335k416k896l241k968k140j293
$$ plain form
51316 399604 398789 398350 398748 400419 403082 406002 408767 411398 413802 415650 416823 417531 417916 417989 418007 418387 418969
51299 418969 418852 417301 414537 411397 408527 406202 404562 403577 402889 402094 401226 400723 400856 401407 401941 402340 403022
51282 403022 404635 407551 411635 416519 421975 427923 434188 440444 446330 451370 454873 456289 455840 454537
51268 454537 453405 452793 452530 452560 453169 454637 456739 458679 459549 458947 457151 454670 451787 448616 445419 442559
51252 442559 440195 438213 436362 434264 431519 428179 424941 422408 420273 417768 414918 412671 411631 411374
51238 411374 411352 411841 413372 415634 417563 418429 418366 417943 417589 417326 416719 415222 412940 410874 409995 410124 410190 409542
51220 409542 408553 407892 407730 407907 408453 409555 411132 412753 413974 414701 415292 416379 418408 421191 424000 426281
51204 426281 428266 430788 434470 439124 443920 448064 451280 453756 455739 457279 458223 458314 457345 455426 453139
$$ packed form
51316C99604q15m39L98J671K663K920K765K631K404J848J173P08L85P3J8L80N82
51299D18969j17j551k764l140k870k325j640r85o88p95q68n03J33N51N34L99O82
51282D03022J613K916M084M884N456N948O265O256N886N040L503J416m49j303
51268D54537j132o12k63L0O09J468K102J940Q70o02j796k481k883l171l197k860
51252D42559k364j982j851k098k745l340l238k533k135k505k850k247j040k57
51238D11374k2M89J531K262J929Q66o3m23l54k63o07j497k282k066q79J29O6o48
51220D09542r89o61j62J77N46J102J577J621J221P27N91J087K029K783K809K281
51204D26281J985K522L682M654M796M144L216K476J983J540R44R1r69j919k287
$$ plain form
51189 453139 451192 449772 448416 446666 444714 443158 442346 442217 442668 443626 444707 445293 445170 444852 444969 445522
51173 445522 446042 446369 446860 447719 448421 448086 446358 443766 441209 439236 437857 436930 436567 437089 438653 440940
51157 440940 443275 445078 446294 447390 448838 450541 451824 452165 451847 451715 452163 452567 451905 449859 447095 444532
51141 444532 442661 441634 441573 442415 443607 444470 444957 445693 447111 448805 449951 450177 449792 449328 449157 449501 450471
51124 450471 451976 453746 455584 457527 459671 461904 463963 465752 467556 469803 472535 475219 477230 478614
51110 478614 480200 482838 486557 490503 493581 495155 495366 494992 494945 495710 497246 499424 502330 505917 509580
51095 509580 512432 514024 514628 514867 515238 515858 516302 515757 513764 510998 508966 508722 509945 511413 512168 512071 511461
51078 511461 510584 509476 508254 507411 507593 508985 511005 512831 514223 515641 517617 520302 523665 527797 532886
$$ packed form
51189D53139j947j420j356j750j952j556q12j29M51R58J081N86j23l18J17N53
51173D45522N20L27M91Q59P02l35j728k592k557j973j379r27l63N22J564K287
51157D40940K335J803J216J096J448J703J283L41l18j32M48M04o62k046k764k563
51141D44532j871j027o1Q42J192Q63M87P36J418J694J146K26l85m64j71L44R70
51124D50471J505J770J838J943K144K233K059J789J804K247K732K684K011J384
51110D78614J586K638L719L946L078J574K11l74m7P65J536K178K906L587L663
51095E09580K852J592O04K39L71O20M44n45j993k766k032k44J223J468P55r7o10
51078E11461q77j108j222q43J82J392K020J826J392J418J976K685L363M132N089
$$ plain form
51063 532886 539207 547290 557783 570904 586220 603224 621898 642313 663641 683837 700493 712164
51051 712164 719226 723702 728111 734033 741425 749164 756119 761749 766012 768949 770296 769371 765463 758547
51037 758547 749540 739724 730090 721327 714065 708519 703882 698522 691066 681233 669691 657502 645817
51024 645817 635649 627506 621251 616554 613475 612452 613840 617626 623507 631042 639693 648985 658687 668779
51010 668779 679165 689581 699796 709666 718855 726702 732712 737146 740789 743956 745981 745928 743707 740277
50996 740277 736838 734080 732168 731133 731082 732174 734523 738075 742615 748076 754927 764001 775747 789811
50982 789811 805627 823293 843550 866863 892863 920764 949944 979907 1010031 1039932 1070188
50971 1070188 1102253 1137464 1176380 1219288 1267001 1320692 1381002 1447738 1520468 1598915 1682591
$$ packed form
51063E32886O321Q083J0493J3121J5316J7004J8674K0415K1328K0196J6656J1671
51051G12164P062M476M409N922P392P739O955N630M263K937J347r25l908o916
51037G58547r007r816r634q763p262n546m637n360p456r833j1542j2189j1685
51024F45817j0168q143o255m697l079j023J388L786N881P535Q651R292R702J0092
51010F68779J0386J0416J0215R870R189P847O010M434L643L167K025n3k221l430
50996G40277l439k758j912j035n1J092K349L552M540N461O851R074J1746J4064
50982G89811J5816J7666K0257K3313K6000K7901K9180K9963L0124K9901L0256
50971A070188L2065L5211L8916M2908M7713N3691O0310O6736P2730P8447Q3676
$$ plain form
50960 1682591 1770468 1861440 1954820 2049945 2145343 2238691 2327614 2410227 2485020 2550697 2606459
50949 2606459 2652134 2687817 2713518 2729330 2735783 2733823 2724595 2709522 2690509 2669604 2648146 2626209
50937 2626209 2602975 2577701 2550342 2521399 2491436 2460852 2429878 2398367 2365545 2330339 2292104
50926 2292104 2250788 2206229 2157681 2104517 2047184 1986928 1924619 1860369 1794457 1728142 1663241
50915 1663241 1601131 1542382 1487089 1435300 1387187 1343042 1303053 1266993 1234184 1203843 1175437
50904 1175437 1148831 1124301 1102363 1083212 1066206 1050184 1034488 1019563 1006437 995826 987758
50893 987758 981727 976989 972930 969395 966600 964706 963696 963663 964799 966947 969558 972432 976164 981559 988846
50878 988846 997772 1008093 1019535 1031588 1043926 1056927 1071313 1087303 1104572 1122920 1142493 1163362
$$ packed form
50960A682591Q7877R0972R3380R5125R5398R3348Q8923Q2613P4793O5677N5762
50949B606459M5675L5683K5701J5812O453j960r228j5073j9013k0905k1458k1937
50937B626209k3234k5274k7359k8943k9963l0584l0974l1511l2822l5206l8235
50926B292104m1316m4559m8548n3164n7333o0256o2309o4250o5912o6315o4901
50915A663241o2110n8749n5293n1789m8113m4145l9989l6060l2809l0341k8406
50904A175437k6606k4530k1938j9151j7006j6022j5696j4925j3126j0611q068
50893I87758o031m738m059l535k795j894j010l3J136K148K611K874L732N395P287
50878I88846Q926J0321J1442J2053J2338J3001J4386J5990J7269J8348J9573K0869
$$ plain form
50866 1163362 1185458 1209118 1235267 1264776 1297922 1334564 1374593 1418055 1465213 1516840 1574325
50855 1574325 1639265 1712942 1796221 1889772 1994275 2110489 2239191 2380942 2535804 2703262
50845 2703262 2882394 3072077 3271158 3478493 3692584 3910903 4129648 4344327 4550368
50836 4550368 4742864 4916166 5064689 5184609 5274492 5334230 5363976 5364506 5338137 5288711 5220795
50825 5220795 5139224 5049091 4955466 4862850 4774992 4694941 4624712 4564677 4513519 4468804 4427363
50814 4427363 4385369 4338818 4284517 4220466 4145149 4056866 3954333 3837755 3708752 3569201
50804 3569201 3420693 3265286 3106193 2947179 2791402 2641123 2498214 2364328 2240504
50795 2240504 2127058 2023999 1931233 1848325 1774573 1709618 1653676 1606836 1568320 1536688 1510582
$$ packed form
50866A163362K2096K3660K6149K9509L3146L6642M0029M3462M7158N1627N7485
50855A574325O4940P3677Q3279R3551J04503J16214J28702J41751J54862J67458
50845B703262J79132J89683J99081K07335K14091K18319K18745K14679K06041
50836D550368J92496J73302J48523J19920Q9883N9738K9746N30k6369m9426o7916
50825E220795q1571r0133r3625r2616q7858q0051p0229o0035n1158m4715m1441
50814D427363m1994m6551n4301o4051p5317q8283j02533j16578j29003j39551
50804C569201j48508j55407j59093j59014j55777j50279j42909j33886j23824
50795B240504j13446j03059r2766q2908p3752o4955n5942m6840l8516l1632k6106
$$ plain form
50784 1510582 1489040 1471330 1456904 1445436 1436578 1429661 1423842 1418505 1413275 1407749 1401493 1394305 1386225
50771 1386225 1377360 1367890 1358154 1348316 1337989 1326553 1313934 1300783 1287749 1274843 1261634 1247842
50759 1247842 1233663 1219725 1206805 1195315 1185096 1176014 1168814 1164902 1165068 1168794 1175169 1184094 1196256
50746 1196256 1212157 1231741 1254943 1282120 1313737 1349867 1390197 1434500 1483106 1536893 1596702
50735 1596702 1662690 1734421 1811659 1894823 1984353 2079859 2180292 2284846 2393232 2504956
50725 2504956 2618688 2732545 2844777 2953979 3058753 3157308 3247274 3325760 3389680 3436186
50715 3436186 3462955 3468455 3452443 3416510 3363987 3299121 3226261 3149572 3072966 2999862 2932974
50704 2932974 2874293 2824974 2785001 2753259 2728289 2708869 2693506 2679542 2663302 2641309 2611273
$$ packed form
50784A510582k1542j7710j4426j1468q858o917n819n337n230n526o256p188q080
50771A386225q865r470r736r838j0327j1436j2619j3151j3034j2906j3209j3792
50759A247842j4179j3938j2920j1490j0219r082p200l912J66L726O375Q925J2162
50746A196256J5901J9584K3202K7177L1617L6130M0330M4303M8606N3787N9809
50735A596702O5988P1731P7238Q3164Q9530R5506J00433J04554J08386J11724
50725B504956J13732J13857J12232J09202J04774R8555Q9966P8486O3920M6506
50715C436186K6769N500j6012l5933n2523o4866p2860p6689p6606p3104o6888
50704B932974n8681m9319l9973l1742k4970j9420j5363j3964j6240k1993l0036
$$ plain form
50693 2611273 2572056 2523226 2464758 2396838 2319880 2235146 2145411 2054346 1964854 1878323 1795721
50682 1795721 1718685 1648847 1586618 1531593 1483955 1444450 1412863 1387633 1367448 1352448 1343283
50671 1343283 1339714 1340917 1346568 1356558 1369773 1384244 1398775 1413617 1429173 1444777 1459361 1472819
50659 1472819 1485954 1499285 1512718 1526445 1541368 1558110 1576072 1594060 1611707 1629794 1649305
50648 1649305 1670708 1694248 1720254 1748847 1779772 1812967 1849047 1888793 1932342 1979259 2029082
50637 2029082 2081387 2135545 2190982 2247517 2304750 2361205 2414877 2464847 2511800 2556885 2600816
50626 2600816 2644134 2687125 2728490 2764570 2790806 2804053 2803406 2789677 2765151 2733653 2699700 2666910
50614 2666910 2637246 2611569 2590429 2574266 2563235 2556956 2554401 2554277 2555694 2558031 2559807 2558171 2550129
$$ packed form
50693B611273l9217m8830n8468o7920p6958q4734q9735r1065q9492q6531q2602
50682A795721p7036o9838o2229n5025m7638l9505l1587k5230k0185j5000r165
50671A343283l569J203N651R990J3215J4471J4531J4842J5556J5604J4584J3458
50659A472819J3135J3331J3433J3727J4923J6742J7962J7988J7647J8087J9511
50648A649305K1403K3540K6006K8593L0925L3195L6080L9746M3549M6917M9823
50637B029082N2305N4158N5437N6535N7233N6455N3672M9970M6953M5085M3931
50626B600816M3318M2991M1365L6080K6236J3247o47j3729k4526l1498l3953l2790
50614B666910k9664k5677k1140j6163j1031o279k555j24J417K337J776j636q042
$$ plain form
50601 2550129 2533993 2509110 2474778 2430487 2377105 2316789 2251450 2182029 2109346 2034820 1959951
50590 1959951 1885768 1813085 1742796 1675607 1611951 1552367 1497428 1447091 1400797 1358493 1320880
50579 1320880 1288239 1259692 1234261 1212086 1193878 1179551 1168228 1159541 1154183 1153023 1156068 1162411
50567 1162411 1170953 1181066 1192767 1206343 1221824 1238932 1257411 1277108 1297687 1318698 1340090
50556 1340090 1362269 1385480 1409500 1434212 1459958 1486895 1514407 1541659 1568463 1595123 1621710
50545 1621710 1648042 1674191 1700436 1726783 1753175 1780311 1809757 1843043 1880884 1923433 1970992
50534 1970992 2024241 2083725 2149185 2219460 2293284 2370345 2451506 2538042 2630978 2731139 2839161
50523 2839161 2954801 3076462 3201878 3329222 3457086 3583599 3706079 3821625 3927623
$$ packed form
50601B550129j6136k4883l4332m4291n3382o0316o5339o9421p2683p4526p4869
50590A959951p4183p2683p0289o7189o3656n9584n4939n0337m6294m2304l7613
50579A320880l2641k8547k5431k2175j8208j4327j1323q687n358j160L045O343
50567A162411Q542J0113J1701J3576J5481J7108J8479J9697K0579K1011K1392
50556A340090K2179K3211K4020K4712K5746K6937K7512K7252K6804K6660K6587
50545A621710K6332K6149K6245K6347K6392K7136K9446L3286L7841M2549M7559
50534A970992N3249N9484O5460P0275P3824P7061Q1161Q6536R2936J00161J08022
50523B839161J15640J21661J25416J27344J27864J26513J22480J15546J05998
$$ plain form
50514 3927623 4021582 4100972 4163521 4207567 4232055 4236418 4220621 4185275 4131724 4062068 3979009
50503 3979009 3885614 3785286 3681928 3579749 3482605 3393680 3315878 3252060 3204442 3173868 3159964
50492 3159964 3161734 3177670 3205618 3242933 3286408 3331447 3371627 3400072 3411563 3403137 3373135 3320834
50480 3320834 3247302 3155651 3049725 2932909 2808527 2680636 2553428 2429713 2310478 2196003
50470 2196003 2087075 1984970 1890540 1803681 1723880 1651136 1586062 1528946 1479041 1435115 1396502
50459 1396502 1363245 1335452 1313081 1296296 1285342 1279810 1278561 1280706 1286317 1295894 1309473 1326592
50447 1326592 1346852 1370203 1396824 1427015 1461050 1498822 1539484 1581310 1621720 1657633 1686427
50436 1686427 1706962 1719617 1725414 1725480 1721232 1714243 1705439 1694951 1683247 1671910 1662599 1655560 1649867
$$ packed form
50514C927623R3959P9390O2549M4046K4488M363j5797l5346n3551o9656q3059
50503C979009r3395j00328j03358j02179r7144q8925p7802o3818m7618l0574j3904
50492C159964J770J5936K7948L7315M3475M5039M0180K8445J1491q426l0002n2301
50480C320834p3532r1651j05926j16816j24382j27891j27208j23715j19235j14475
50470B196003j08928j02105r4430q6859p9801p2744o5074n7116m9905m3926l8613
50459A396502l3257k7793k2371j6785j0954n532j249K145N611R577J3579J7119
50447A326592K0260K3351K6621L0191L4035L7772M0662M1826M0410L5913K8794
50436A686427K0535J2655N797O6m248o989q804j0488j1704j1337r311p039n693
$$ plain form
50423 1649867 1644990 1641440 1639907 1640549 1643411 1648974 1657934 1670743 1687686 1709208 1735914 1768339 1806804
50410 1806804 1851278 1901244 1955823 2014097 2075152 2137819 2200752 2262957 2323994 2383397 2440064
50399 2440064 2492464 2539318 2579722 2612577 2636221 2648824 2649059 2636350 2610680 2572420 2522452 2462381
50387 2462381 2394576 2321908 2247284 2173211 2101646 2034264 1972751 1918692 1873153 1836533 1808951
50376 1808951 1790604 1781608 1781532 1789265 1803211 1821416 1841547 1860975 1876978 1886889 1888427 1880440 1863297
50363 1863297 1838233 1806257 1768112 1725253 1680143 1635176 1591727 1550539 1512421 1477817 1445952
50352 1445952 1415084 1383534 1350040 1313531 1273709 1232021 1191177 1153146 1118137 1085867 1057064
50341 1057064 1032937 1013638 998172 985795 976710 971264 969114 969517 971927 975939 981000 986615 992740
$$ packed form
50423A649867m877l550j533O42K862N563Q960J2809J6943K1522K6706L2425L8465
50410A806804M4474M9966N4579N8274O1055O2667O2933O2205O1037N9403N6667
50399B440064N2400M6854M0404L2855K3644J2603K35j2709k5670l8260m9968o0071
50387B462381o7805p2668p4624p4073p1565o7382o1513n4059m5539l6620k7582
50376A808951j8347q996p6P733J3946J8205K0131J9428J6003R911J538p987j7143
50363A863297k5064l1976l8145m2859m5110m4967m3449m1188l8118l4604l1865
50352A445952l0868l1550l3494l6509l9822m1688m0844l8031l5009l2270k8803
50341A057064k4127j9299j5466j2377r085n446k150M03K410M012N061N615O125
$$ plain form
50328 992740 999605 1007162 1014980 1022721 1030504 1038672 1047292 1056041 1064606 1073157 1082394 1093049 1105259 1118281
50314 1118281 1130779 1141512 1150051 1156993 1163318 1169449 1175083 1180116 1185446 1192466 1201828 1213207 1226344
50301 1226344 1241832 1260583 1282971 1308958 1338914 1373940 1415469 1464587 1521034 1581751 1640115
50290 1640115 1687355 1715863 1722036 1706929 1674902 1631566 1581998 1529903 1477935 1428412 1383283
50279 1383283 1343461 1308801 1279101 1254732 1235991 1222237 1212238 1205168 1200782 1198742 1198328 1198925 1200403
50266 1200403 1202909 1206616 1211758 1218545 1226856 1236259 1246386 1257092 1268145 1279199 1290244 1301730
50254 1301730 1313869 1326072 1337504 1348056 1358209 1367915 1376108 1381620 1384224 1384419 1382477 1378165 1371373
50241 1371373 1362524 1352254 1341130 1329968 1320060 1312604 1307977 1305840 1305812 1307476 1309613 1309965 1306229 1297292
$$ packed form
50328I92740O865P557P818P741P783Q168Q620Q749Q565Q551R237J0655J2210J3022
50314A118281J2498J0733Q539O942O325O131N634N033N330P020R362J1379J3137
50301A226344J5488J8751K2388K5987K9956L5026M1529M9118N6447O0717N8364
50290A640115M7240K8508O173j5107l2027m3336m9568n2095n1968m9523m5129
50279A383283l9822l4660k9700k4369j8741j3754r999p070m386k040m14N97J478
50266A200403K506L707N142O787Q311R403J0127J0706J1053J1054J1045J1486
50254A301730J2139J2203J1432J0552J0153R706Q193N512K604J95j942m312o792
50241A371373q849j0270j1124j1162r908p456m627k137k8J664K137L52l736q937
$$ plain form
50227 1297292 1283446 1265717 1245284 1223306 1200791 1178357 1156205 1134395 1113135 1092814 1073809
50216 1073809 1056231 1039872 1024475 1010060 996835 984738 973282 962065 951319 941777 933978 927801
50204 927801 922618 917747 912737 907316 901208 894190 886415 878499 871010 863965 857142 850834 845789 842214
50190 842214 839246 835703 831070 825553 819583 813630 808184 803409 798936 794393 789990 786213 783103 780206
50176 780206 777115 773643 769688 765417 761530 758785 757182 755982 754565 752911 751270 749823 748715 748016
50162 748016 747554 747146 747024 747674 749281 751715 755096 759877 766326 774355 784065 795940 810251 826590
50148 826590 844232 862709 881970 902266 923997 947259 971412 995376 1018458 1040641 1062217
50137 1062217 1083615 1105550 1128689 1152978 1177833 1203014 1228592 1253788 1276525 1294526 1306382
$$ packed form
50227A297292j3846j7729k0433k1978k2515k2434k2152k1810k1260k0321j9005
50216A073809j7578j6359j5397j4415j3225j2097j1456j1217j0746r542p799o177
50204I27801n183m871n010n421o108p018p775p916p489p045o823o308n045l575
50190H42214k968l543m633n517n970n953n446m775m473m543m403l777l110k897
50176G80206l091l472l955m271l887k745j603j200j417j654j641j447j108o99
50162G48016m62m08j22O50J607K434L381M781O449Q029R710J1875J4311J6339
50148H26590J7642J8477J9261K0296K1731K3262K4153K3964K3082K2183K1576
50137A062217K1398K1935K3139K4289K4855K5181K5578K5196K2737J8001J1856
$$ plain form
50126 1306382 1311369 1309141 1300191 1285895 1267478 1245469 1220725 1195142 1170425 1146714 1123458 1101208
50114 1101208 1081454 1064887 1050979 1039168 1029261 1020534 1011647 1001990 992260 983275 974991 967172 960227
50101 960227 954636 950044 945611 940923 935990 930687 924899 919078 913981 909829 906217 902918 900245 898469
50087 898469 897240 895974 894611 893720 893860 895093 897210 900184 904139 908889 913907 918946 924544 931571 940253
50072 940253 949834 959214 967817 975905 984127 992664 1000689 1006870 1010664 1012918 1014934 1017100 1018807 1019441
50058 1019441 1018838 1016897 1013501 1009057 1004449 1000092 995544 990385 984925 979614 974340 969049 964637 962342
50044 962342 962285 963453 965216 968175 973277 980736 990181 1001296 1013819 1027326 1041514 1056471 1072297
50031 1072297 1088715 1105564 1123397 1142916 1163868 1185088 1205712 1225734 1245243 1263846 1281207
$$ packed form
50126A306382M987k228q950j4296j8417k2009k4744k5583k4717k3711k3256k2250
50114A101208j9754j6567j3908j1811r907q727q887r657r730q985q284p819o945
50101I60227n591m592m433m688m933n303n788n821n097m152l612l299k673j776
50087H98469j229j266j363q91J40J233K117K974L955M750N018N039N598P027Q682
50072I40253R581R380Q603Q088Q222Q537Q025O181L794K254K016K166J707O34
50058A019441o03j941l396m444m608m357m548n159n460n311n274n291m412k295
50044I62342n7J168J763K959N102P459R445J1115J2523J3507J4188J4957J5826
50031A072297J6418J6849J7833J9519K0952K1220K0624K0022J9509J8603J7361
$$ plain form
50020 1281207 1297577 1313182 1327552 1340098 1350970 1360506 1367966 1371762 1371217 1367357 1361536 1353816 1343208
50007 1343208 1329047 1311464 1290656 1266438 1238797 1208663 1177913 1148630 1122250 1099197 1079202
49996 1079202 1061885 1047026 1034421 1023827 1015033 1007713 1001046 993855 985388 975799 965604 954840
49984 954840 942980 929561 914723 899214 883996 869649 855988 842441 828944 816209 805010
49973 805010 795538 787689 781523 776942 773223 769429 765221 760808 756195 751021 745166 739158 733872 730087
49959 730087 728235 728229 729516 731567 734361 738181 743186 749404 756836 765044 772902 779441 784857 790037 795130
49944 795130 799367 802391 804907 807585 809978 811005 810121 807615 804152 800360 796468 791938 785775 777554
49930 777554 767848 757374 746262 734666 723664 714705 708209 703249 698633 693902 689344 685616 683502
$$ packed form
50020A281207J6370J5605J4370J2546J0872R536P460L796n45l860n821p720j0608
50007A343208j4161j7583k0808k4218k7641l0134l0750k9283k6380k3053j9995
49996A079202j7317j4859j2605j0594q794p320o667p191q467r589j0195j0764
49984I54840j1860j3419j4838j5509j5218j4347j3661j3547j3497j2735j1199
49973H05010r472p849o166m581l719l794m208m413m613n174n855o008n286l785
49959G30087j852oJ287K051K794L820N005O218P432Q208P858O539N416N180N093
49944G95130M237L024K516K678K393J027q84k506l463l792l892m530o163q221
49930G77554r706j0474j1112j1596j1002q959o496m960m616m731m558l728k114
$$ plain form
49917 683502 683543 685553 688609 691732 694522 697140 699818 702567 705387 708712 713454 720321 729115 738989 749438
49902 749438 760604 772362 783651 793349 801594 809545 817723 825187 830637 833876 835683 836440 835460 831808
$$ packed form
49917F83502M1K010L056L123K790K618K678K749K820L325M742O867Q794R874J0449
49902G49438J1166J1758J1289R698Q245P951Q178P464N450L239J807P57r80l652
$$ [...]
##END NTUPLES=NMR SPECTRUM
##END=
