##TITLE=AC1665_DOMRH14356_8531507_FL3YAM41Qn
##JCAMPDX= 6.0         $$ Bruker NMR JCAMP-DX V2.0
##DATA TYPE= NMR SPECTRUM
##DATA CLASS= NTUPLES
##ORIGIN= BRUKER
##OWNER= Administrator
$$ 1.72 TOPSPIN		Version 2.1
$$ 2015-08-07 20:26:38.688 -0700  Administrator@X
$$ Compression mode = diff/dup
##.OBSERVE FREQUENCY= 400.02188249412
##.OBSERVE NUCLEUS= ^1H
##.ACQUISITION MODE= SIMULTANEOUS (DQD)
##.ACQUISITION SCHEME= undefined
##.AVERAGES= 8
##.DIGITISER RES= 22
##SPECTROMETER/DATA SYSTEM= spect
##.PULSE SEQUENCE= zg30
##.SOLVENT NAME= COFFEE_meoh
##.SHIFT REFERENCE= INTERNAL, COFFEE_meoh, 1, 14.98509
##AUDIT TRAIL= $$ (NUMBER, WHEN, WHO, WHERE, PROCESS, VERSION, WHAT)
$$ ##TITLE= Audit trail, TOPSPIN		Version 2.1
$$ ##JCAMPDX= 5.01
$$ ##ORIGIN= Bruker BioSpin GmbH
$$ ##OWNER= Administrator
$$ $$ E:\/data/COFFEE/nmr/AC1665_DOMRH14356_8531507_FL3YAM41Qn/20/pdata/1/auditp.txt
$$ ##AUDIT TRAIL=  $$ (NUMBER, WHEN, WHO, WHERE, PROCESS, VERSION, WHAT)
(   1,<2015-08-07 20:26:31.469 -0700>,<Administrator>,<X>,<go>,<TOPSPIN 2.1>,
      <created by zg
	started at 2015-08-07 20:25:25.281 -0700,
	POWCHK enabled, PULCHK disabled,
       configuration hash MD5:
       21 0F 79 D6 B3 7B B4 F6 88 20 88 DB 03 48 BD 9F
       data hash MD5: 64K
       CE CB 0A 48 AF 2D 1A 76 28 D1 E0 82 13 EE 58 C9>)
(   2,<2015-08-07 20:26:34.609 -0700>,<Administrator>,<X>,<proc1d>,<TOPSPIN 2.1>,
      <Start of raw data processing
       efp LB = 0 FT_mod = 6 PKNL = 1 PHC0 = 0 PHC1 = 0 SI = 32K 
       data hash MD5: 32K
       E2 9D D4 4A 7D 32 4F 27 1A 15 54 FB DC 21 D5 22>)
(   3,<2015-08-07 20:26:34.891 -0700>,<Administrator>,<X>,<proc1d>,<TOPSPIN 2.1>,
      <pk PHC0 = 92.74658 PHC1 = 0 
       data hash MD5: 32K
       B5 37 6E AD 5A A8 41 A5 B1 A8 C7 A5 E7 F3 0D D5>)
(   4,<2015-08-07 20:26:35.031 -0700>,<Administrator>,<X>,<proc1d>,<TOPSPIN 2.1>,
      <abs ABSG = 1 
       data hash MD5: 32K
       F6 2A 90 9D 67 C0 68 F3 47 3C CB 46 C7 9A 1D A4>)
(   5,<2015-08-07 20:26:35.094 -0700>,<Administrator>,<X>,<proc1d>,<TOPSPIN 2.1>,
      <abs ABSG = 2 
       data hash MD5: 32K
       23 E1 D1 B8 D0 58 2C 4A F9 18 C7 FB 85 5B 28 31>)
(   6,<2015-08-07 20:26:35.156 -0700>,<Administrator>,<X>,<proc1d>,<TOPSPIN 2.1>,
      <abs ABSG = 3 
       data hash MD5: 32K
       7B E3 0B DA F2 29 40 37 55 48 08 E2 B6 0B 60 74>)
(   7,<2015-08-07 20:26:35.203 -0700>,<Administrator>,<X>,<proc1d>,<TOPSPIN 2.1>,
      <abs ABSG = 4 
       data hash MD5: 32K
       8B EC 3C 1C 27 41 E9 8A 6C 5B 58 75 0B 94 E1 FD>)
(   8,<2015-08-07 20:26:35.266 -0700>,<Administrator>,<X>,<proc1d>,<TOPSPIN 2.1>,
      <abs ABSG = 5 
       data hash MD5: 32K
       17 8C 88 A3 AE 70 F9 88 28 27 EF 22 3C F1 5E 2B>)
$$ ##END=
$$ 
$$ $$ hash MD5
$$ $$ DC 40 2A A5 C3 85 AE C9 C6 92 2C 48 D8 89 F6 96
##$RELAX= 
##$RELAX= 
##$RELAX= 
##$RELAX= 
##$RELAX= 
##$RELAX= 
##$RELAX= 
$$ Bruker specific parameters
$$ --------------------------
##$DU= <E:\>
##$EXPNO= 20
##$NAME= <AC1665_DOMRH14356_8531507_FL3YAM41Qn>
$$ [...]
150 150 150 150 150 150 150 150
##$TP07= 0
##$TPNAME0= <>
##$TPNAME1= <>
##$TPNAME2= <>
##$TPNAME3= <>
##$TPNAME4= <>
##$TPNAME5= <>
##$TPNAME6= <>
##$TPNAME7= <>
##$TPOAL= (0..7)
0.5 0.5 0.5 0.5 0.5 0.5 0.5 0.5
##$TPOFFS= (0..7)
0 0 0 0 0 0 0 0
##$TUNHIN= 0
##$TUNHOUT= 0
##$TUNXOUT= 0
##$USERA1= <user>
##$USERA2= <user>
##$USERA3= <user>
##$USERA4= <user>
##$USERA5= <user>
##$V9= 5
##$VALIST= <valist>
##$VCLIST= <CCCCCCCCCCCCCCC>
##$VD= 0
##$VDLIST= <DDDDDDDDDDDDDDD>
##$VPLIST= <PPPPPPPPPPPPPPP>
##$VTLIST= <TTTTTTTTTTTTTTT>
##$WBST= 2048
##$WBSW= 25
##$XGAIN= (0..3)
0 0 0 0
##$XL= 0
##$YL= 0
##$YMAX_a= 558362
##$YMIN_a= -473640
##$ZGOPTNS= <>
##$ZL1= 120
##$ZL2= 120
##$ZL3= 120
##$ZL4= 120
##$ABSF1= 14.98509
##$ABSF2= -5.573092
##$ABSG= 5
##$ABSL= 3
##$ALPHA= 0
##$AQORDER= 0
##$ASSFAC= 0
##$ASSFACI= 0
##$ASSFACX= 0
##$ASSWID= 0
##$AUNMP= <proc_prof1d_extract_pilot.lims>
##$AXLEFT= 0
##$AXNAME= <>
##$AXNUC= <1H>
##$AXRIGHT= 0
##$AXTYPE= 0
##$AXUNIT= <>
##$AZFE= 0.1
##$AZFW= 0.1
##$BCFW= 0
##$BC_mod= 0
##$BYTORDP= 0
##$COROFFS= 0
##$CY= 15
##$DATMOD= 1
##$DC= 0
##$DFILT= <>
##$DTYPP= 0
##$F1P= 0
##$F2P= 0
##$FCOR= 0.5
##$FTSIZE= 32768
##$FT_mod= 6
##$GAMMA= 0
##$GB= 0
##$INTBC= 1
##$INTSCL= 1
##$ISEN= 128
##$LB= 0
##$LEV0= 0
##$LPBIN= 0
##$MAXI= 10000
##$MC2= 0
##$MEAN= 0
##$ME_mod= 0
##$MI= 0
##$NCOEF= 0
##$NC_proc= -8
##$NLEV= 6
##$NOISF1= 0
##$NOISF2= 0
##$NSP= 0
##$NTH_PI= 0
##$NZP= 0
##$OFFSET= 14.98509
##$PC= 1
##$PHC0= 92.74658
##$PHC1= 0
##$PH_mod= 1
##$PKNL= yes
##$PPARMOD= 0
##$PPDIAG= 0
##$PPIPTYP= 0
##$PPMPNUM= 2147483647
##$PPRESOL= 1
##$PSCAL= 4
##$PSIGN= 0
##$PYNMP= <proc.py>
##$REVERSE= no
##$SF= 400.02
##$SI= 32768
##$SIGF1= 0
##$SIGF2= 0
##$SINO= 400
##$SIOLD= 32768
##$SPECTYP= <>
##$SREGLST= <1H.CDCl3>
##$SSB= 0
##$STSI= 32768
##$STSR= 0
##$SW_p= 8223.68421052631
##$SYMM= 0
##$S_DEV= 0
##$TDeff= 65536
##$TDoff= 0
##$TI= <>
##$TILT= no
##$TM1= 0
##$TM2= 0
##$TOPLEV= 0
##$USERP1= <user>
##$USERP2= <user>
##$USERP3= <user>
##$USERP4= <user>
##$USERP5= <user>
##$WDW= 1
##$XDIM= 32768
##$YMAX_p= 357697809
##$YMIN_p= -683874
##$CURPLOT= <Network HP LaserJet P1505>
##$CURPRIN= <$Network HP LaserJet P1505>
##$DFORMAT= <normdp>
##$LAYOUT= <+/1D_H.xwp>
##$LFORMAT= <normlp>
##$PFORMAT= <normpl>
##$SURQMSG= 1
$$ End of Bruker specific parameters
$$ ---------------------------------
##NTUPLES= NMR SPECTRUM
##VAR_NAME=  FREQUENCY,     SPECTRUM/REAL,   SPECTRUM/IMAG
##SYMBOL=    X,             R,               I
##VAR_TYPE=  INDEPENDENT,   DEPENDENT,       DEPENDENT
##VAR_FORM=  AFFN,          ASDF,            ASDF
##VAR_DIM=   32768,         32768,           32768
##UNITS=     HZ,            ARBITRARY UNITS, ARBITRARY UNITS
##FACTOR=    0.250966925370066, 1,           1
##FIRST=     8223.43324360094, -58811,       -61927
##LAST=      0,             -47410,          246451
##MIN=       0,             -683874,         0
##MAX=       8223.43324360094, 357697809,    0
$$ Real data points
##PAGE= N=1
##DATA TABLE= (X++(R..R)), XYDATA
$$ [...]
19579A77961b1915m9346D0161i3336j33421d2791l350a5451c049j35423j62063
19568c00535P9838A07854A6799a28330f3292k9676o0207K1601M7865c7734j71240
19557b08974j3130G0318g8520a8528G6442N6399L8373b1665o9012A93266h7676
19545B5841a67541E8037a12449k3628m4201A7351b57451O305a5540A17096E3702
19533e0161m2322G96a29649N7487A0169J65875b70445A33803b94627M3392A1516
19521D7890a46059j70032G2550K64977d07770A72727a58539j01176J6308A03266
19510i6936r7841A60457a01845j44096A73525a64839E1098N7395B9555A2179a17144
19498h2552k19087B12185a34333j80656A26732K78652a70023E6087K57960I4546
$$ plain form
19579 177961 -21915 -71261 40161 -93336 -226757 -42791 -46141 -15451 -3049 -138472 -300535
19568 -300535 -220697 107854 16799 -128330 -63292 -92968 -153175 -131574 -83709 -37734 -208974
19557 -208974 -222104 70318 -78520 -18528 76442 132841 171214 -21665 -90677 193266 -87676
19545 25841 -167541 58037 -112449 -136077 -180278 17351 -257451 -251146 -15540 117096 53702
19533 -50161 -92483 796 -129649 -72162 10169 176044 -270445 133803 -294627 -251235 11516
19521 47890 -146059 -316091 72550 337527 -407770 172727 -158539 -259715 -243407 103266
19510 -96936 -194777 160457 -101845 -245941 173525 -164839 51098 108493 29555 12179 -117144
19498 -82552 -301639 212185 -134333 -314989 126732 405384 -170023 56087 314047 94546
19487A93702h7603k10774B02184b00181j10196B21741F3826d37801A36732J13422
19477B50154a65163j00138I6469a44761G1810e8049A83716c16270Q2425A34041
19466a35228n7922c2763k83006a27165F0030a44552j72808b4725p1440l4793B14831
19454c1229k99981L0874E8919a21758F3964J30999B1491J31550b9173l9727l04377
19443c73277E6984a8925F7471L452b9870A0026c6495j3381b2551B21372E6686
19431i5127a0197F9801Q5171a23654M1954A7691J0292e60098a50511b9669n8150
19420h7819A60412K0476E9599n329M1396a19078j05232i9005b5605A56641b22550
19408F0564e6922j69522P7996e1931k22654d3778l7617k32819J9983J45288d3523
$$ plain form
19487 193702 -87603 -298377 202184 -200181 -310377 221741 63826 -437801 136732 250154
19477 250154 -165163 -265301 96469 -144761 71810 -58049 183716 -316270 -233845 134041
19466 -135228 -193150 -32763 -315769 -127165 60030 -144552 -317360 -24725 -96165 -130958 214831
19454 -31229 -331210 -300336 58919 -121758 63964 194963 21491 153041 -29173 -68900 -373277
19443 -373277 56984 -18925 67471 70923 -29870 10026 -36495 -49876 -22551 221372 56686
19431 -95127 -10197 69801 154972 -123654 -81700 17691 27983 -560098 -150511 -29669 -87819
19420 -87819 160412 180888 59599 54270 95666 -119078 -224310 -99005 -25605 156641 -222550
19408 60564 -56922 -226444 -148448 -51931 -274585 -43778 -81395 -314214 -294231 -148943 -43523
19396b9775k38789c2663I2526b4102G459b38857f447l502F4607h5025j46512d932
19383d00987a32087b7341B20494C5213O4475a34506B1927a14392I4592h1210B0774
19371d35875B30670M0270a96599M040C5573b16084F6506a51640o640j94802L0833
19360c22249C38648a94094F8723J36314G0078a5818A87373a71109A08053c14404
19349a7775A03213a53759J224O6232l30801J28208A49375b14363j3067F3147O0855
19338A24002J33907a42671B4572c5974A30401a65909P6038G9265i9538F794b83568
19326A8808b24559j86869H0016b16228A76461a37355N7808D9140a77155h1604
19315d3531H7531K7961g1047r0242A61054a9670j29300M7693A07303l4809j9477
$$ plain form
19396 -29775 -268564 -32663 92526 -24102 7459 -238857 -6447 -9949 64607 -85025 -231537 -4932
19383 -400987 -132087 -27341 220494 35213 99688 -134506 21927 -114392 94592 -81210 20774
19371 -435875 230670 270940 -196599 -192559 35573 -216084 66506 -151640 -158280 -353082 -322249
19360 -322249 338648 -194094 68723 205037 70078 -15818 187373 -171109 108053 -314404
19349 -17775 103213 -153759 -152535 -86303 -417104 -288896 149375 -214363 -227430 63147 124002
19338 124002 257909 -142671 24572 -35974 130401 -165909 -89871 79265 -99538 6794 -283568
19326 18808 -224559 -411428 80016 -216228 176461 -137355 -79547 49140 -177155 -81604
19315 -43531 87531 115492 -71047 -161289 161054 -19670 -148970 -101277 107303 72494 53017
19304E3017K4399a26143B79126E8727k2690b5129B22069E1746K18764a99166A76161
19292I0922g0887b8811l6433r0719B78865a07136k16849G2572a5888A43034a33359
19280a82742f1323j83341i0826H9028h3573j02018m8862k3247O5281G6960A6184
19268A30045n5497K6086l3209a05897B11715b74198d1667j1396l39988i2157o5881
19257a58038A9791J42625b06076d5610j06217k4511l19746B69622a98318O0024
19247a38294m13149C8790a01627j37412Q6174r6555j27041A28948h120p6669j57655
19236b42444L2186m3448n5303d2661C47823A3305J24871E2729J26494G6000c774
19224I0724b8949O167E067J60757g2917I7107j2908g4485j1716A02512M70168
$$ plain form
19304 53017 77416 -126143 279126 58727 36037 -25129 222069 51746 270510 -199166 176161
19292 90922 -70887 -28811 -65244 -155963 278865 -107136 -323985 72572 -15888 143034 -133359
19280 -182742 -61323 -244664 -90826 89028 -83573 -185591 -234453 -257700 -192419 76960 16184
19268 130045 74548 100634 67425 -105897 211715 -274198 -41667 -53063 -393051 -92157 -158038
19257 -158038 19791 162416 -206076 -45610 -151827 -176338 -496084 269622 -198318 -138294
19247 -138294 -551443 38790 -101627 -239039 -152865 -249420 -376461 128948 -8120 -84789 -242444
19236 -242444 -210258 -253706 -309009 -42661 347823 13305 138176 52729 179223 76000 -3774
19224 90724 -28949 -22782 5067 165824 -72917 97107 84199 -74485 -86201 102512 572680
19213E72680B49905a67142f0713b7555k96625e8232G9975d9388j39104g417k33203
19202b40620P1412A39518i0398j59785C14949C4518a77101P0908C10355c7490
19191D3614c90181A66096A4069a56010A2271K01986m4678a22095M4021l831A16976
19179A2620c61595D3830b37483C3876J78023a85610b5225A08963c38331g5424
19168A23470a73608C6550i8182A37484c7692j01990f1750A41620b93188A17725
19157G230a77719f9996E9729e3602j58750H391J76113o5070A3343a24088i858
19145c7222j55998q4039j55250a54291n8717R1976q715G0422J27129d90038b6609
19133a74076d8083q0218A65989J36248j20234a53470D216R6363i4892f475j38035
$$ plain form
19213 572680 249905 -167142 -60713 -27555 -324180 -58232 79975 -49388 -188492 -7417 -240620
19202 -240620 -169208 139518 -90398 -250183 314949 34518 -177101 -106193 310355 -37490
19191 43614 -390181 166096 14069 -156010 12271 214257 169579 -122095 -78074 -81905 116976
19179 12620 -361595 43830 -237483 33876 211899 -185610 -25225 108963 -338331 -75424
19168 123470 -173608 36550 -98182 137484 -37692 -139682 -61750 141620 -293188 117725
19157 7230 -177719 -69996 59729 -53602 -212352 8391 184504 119434 13343 -124088 -9858
19145 -37222 -193220 -277259 -432509 -154291 -213008 -121032 -129747 70422 197551 -490038 -26609
19133 -174076 -48083 -128301 165989 302237 182003 -153470 4216 100579 -94892 -6475 -144510
19122a44510C16270i7301p3766G8130a568j05132o2872K0030B89293b16367A37052
19110a696o2596A71743O5293b63851A69693c5223k12086C9072h5811m4686D8268
19098F1984k1760e54580h0004K1498k3911F8154b7112D7651i5687A85766b08026
19086a74106E6869L1756P0518f9527A25034L4104J01257g1203b2207j59635o6030
19075b47872h0851G1205b92099A08647m1806l1936j4398i244I9207l0957L1394
19064I9644q12a23994a7255k47127A77617a90157q3479B08764c43262J2484H1366
19052a55701l62494e3112j23050A63575e39182G0291c05378G4188C563h9144j00623
19041a89767p0775g004A27980O4926c27957B06648C0422k705i0059C8321K94326
$$ plain form
19122 -144510 316270 -97301 -171067 78130 -1568 -106700 -169572 -149542 289293 -216367 137052
19110 -1696 -64292 171743 237036 -263851 169693 -35223 -247309 39072 -85811 -130497 48268
19098 61984 40224 -554580 -80004 -58506 -82417 68154 -27112 47651 -95687 185766 -208026
19086 -174106 56869 88625 159143 -69527 125034 159138 260395 -71203 -22207 -181842 -247872
19075 -247872 -80851 71205 -292099 108647 66841 34905 20507 -9244 99207 68250 99644
19064 99644 98832 -123994 -17255 -264382 177617 -190157 -273636 208764 -343262 -330778 81366
19052 -155701 -518195 -53112 -176162 163575 -539182 70291 -305378 74188 3563 -89144 -189767
19041 -189767 -260542 -7004 127980 192906 -327957 206648 30422 27717 -90059 38321 332647
19030C32647G0098g5133E4569M04482b90897B8491a41139k3634N0165k58380a07803
19018a93295m851f2533A53525d285l96049a23961B41991n9520C5899a42736k2442
19007a65178A71552h7118k3730k0174N4726m93266C28665d5505D34357c57533
18996f107C10383a45775a3888A99910a17423B92218c74634B5351K4678b79567
18985a55246d5745C2556a65814h1408j00316A48982c28106A12105a25896A7526
18974a86415b7431A72476a67139b3567I7996e1850n2800J793B22964e63624F1566
18962g5127D7050A4153a88892j14095B29061C3711P2506Q2729o0161b8386j96317
18951b24703j14433B90342b40674A83889d2784k76081o0603h4719c6962k7597
$$ plain form
19030 332647 70098 -75133 54569 459051 -290897 28491 -141139 -164773 -114608 -372988 -107803
19018 -193295 -198146 -62533 153525 -4285 -400334 -123961 241991 182471 35899 -142736 -165178
19007 -165178 171552 -87118 -110848 -131022 -76296 -569562 328665 -45505 434357 -357533
18996 -6107 310383 -145775 -13888 199910 -117423 292218 -374634 25351 50029 -279567
18985 -155246 -45745 32556 -165814 -81408 -181724 148982 -328106 112105 -125896 17526
18974 -186415 -27431 172476 -167139 -23567 97996 -51850 -104650 -102857 222964 -563624 61566
18962 -75127 47050 14153 -188892 -302987 229061 33711 106217 188946 128785 -28386 -224703
18951 -224703 -339136 290342 -240674 183889 -42784 -318865 -379468 -84719 -36962 -64559
18941f4559k49575D0220b69410C3861M3336R8262b97944J22743A01488c39968
18930f4801I3600b6492C52934B4917J26841k7741i7199p6334f0574k1740p3522
18919a55836J8071A03950B3937c06463B12121c14464C69630a58053m709P5371
18909h7391m5373N9299j315B27593l2374D7680c9501C3946a42054c2325k86443
18898c18768J28702A1843f0202l38247b379k37398A39945b59775B44415b10697
18887a75139A9559a40483k2036M820A06059h3764B9388b21302F828h1354I2401
18875a51026e4242H8901b53570B10345B6895J85719a91996h436C28372P2265g6008
18863c10479f7287l10649a39371d2010J7060k22064A30633a91603K7159j30702
$$ plain form
18941 -64559 -314134 40220 -269410 33861 77197 175459 -297944 -175201 101488 -339968
18930 -64801 93600 -26492 352934 24917 151758 124017 -97199 -173533 -60574 -82314 -155836
18919 -155836 -137765 103950 23937 -306463 212121 -314464 369630 -158053 -162762 -87391
18909 -87391 -132764 -73465 -74780 227593 195219 47680 -39501 33946 -142054 -32325 -318768
18898 -318768 -190066 11843 -60202 -398449 -2379 -239777 139945 -259775 244415 -210697
18887 -175139 19559 -140483 -162519 -157699 106059 -83764 29388 -221302 6828 -81354 92401
18875 -151026 -54242 88901 -253570 210345 26895 212614 -191996 -8436 328372 400637 -76008
18863 -310479 -67287 -377936 -139371 -42010 -24950 -247014 130633 -191603 -164444 -295146
18853b95146h4632A08173I809A851e8284l906B6797O7175j9516J09555b38141
18841c6259n14244A1822c3674l71353i3175k6318M5143G0419b27804O7676I5597
18829D7456J1638B1356O2172a23485N0426C4548J39901a41351j14959i076A04023
18817c42272P9598Q8090A25456b43570A39926b72421a11060M4993n8592e3956
18806b8981B0214a596A63262c71139J62668d9186l1666A65524B5922L3072b61358
18794a51797n8037C1261d4499a5946j55943a16k01403I9230b512q4278n7965o2849
18782b07604A4196K750b56913d5067l30638k1113B9687b31403a08608I4410b5488
18770a05378A95545G4550a08528F9110a6824j085L559A46987B9755e93123B44934
$$ plain form
18853 -295146 -84632 108173 9809 1851 -58284 -62190 26797 93972 74456 184011 -238141
18841 -36259 -550503 11822 -33674 -405027 -93175 -119493 -74350 70419 -227804 -160128 95597
18829 47456 59094 21356 83528 -123485 -73059 34548 174449 -141351 -256310 -9076 104023
18817 -342272 -262674 -174584 125456 -243570 139926 -272421 -111060 -66067 -124659 -53956
18806 -28981 20214 -1596 163262 -371139 -208471 -49186 -80852 165524 25922 58994 -261358
18794 -151797 -209834 31261 -44499 -15946 -171889 -116 -201519 99230 -2512 -86790 -144755 -207604
18782 -207604 14196 16946 -256913 -45067 -375705 -396818 29687 -231403 -108608 94410 -25488
18770 -105378 195545 74550 -108528 69110 -16824 -17909 -14350 146987 29755 -593123 244934
18758A23020a96094F928L86347A01295a9081D7094a4956I3168L3251a71720A1933
18746a65644G1724b63866C34730a57892B49329a49240G6148d71602f8404j0167
18736g8571n5582j28719A98375g3117A34367K6765a96470A31323c42997c0515
18725A1188e9740H5871B5156a33016H2996a70082E2248b8937A1120b51044A88790
18713b42790k6395a17390L7692j06551H0931l1312J12324G1602J44798g0890A56900
18701a56112d6658B5208b48760d3695p6565d2622A43949a822A90405H7641a19825
18689a04205k6534B06626j2064I6963b6346B2261R8257e7303F6911a1991k18530
18678b30521M0523c2274j8099m3349j01107M4642C5914a07332K6293A53078J07802
$$ plain form
18758 123020 -196094 6928 393275 101295 -19081 47094 -14956 93168 126419 -171720 11933
18746 -165644 71724 -263866 334730 -157892 249329 -149240 76148 -471602 -68404 -78571
18736 -78571 -134153 -262872 198375 -73117 134367 161132 -196470 131323 -342997 -30515
18725 11188 -59740 85871 25156 -133016 82996 -170082 52248 -28937 11120 -251044 188790
18713 -242790 -269185 -117390 -79698 -186249 80931 49619 161943 71602 216400 -70890 156900
18701 -156112 -46658 25208 -248760 -43695 -120260 -42622 143949 -1822 190405 87641 -119825
18689 -104205 -130739 206626 194562 96963 -26346 22261 120518 -57303 66911 -11991 -230521
18678 -230521 -189998 -32274 -50373 -93722 -194829 -150187 35914 -107332 -81039 153078 260880
18667B60880a72886G8713a46430D6289b58184C31136B0392g3161A56884f8368
18656i7271p8791l2799a2106E1139b818B5362c64110J22626B6367J05349a001
18644F513b66494c1600A12649d2537n16587J87260e3035m01397A22652g3856A1655
18632c00375P6795i6187d1918B16801b20754a06783d5275j53850A01994i1078
18621a11829C2055a32274B23082C0346K9391b26141n7968D6215P4424a28633A20933
18609a93872g6044k46338a42348H3800c49637a58988f9675j14522A47104d3089
18598b27400a2995k04868D86924a06596M9900n4149n7017G9963b35022o3869A43600
18586a27673c89A69891c9552g15C9272J48422b69463J31184e317j63477A35190
$$ plain form
18667 260880 -172886 78713 -146430 46289 -258184 331136 20392 -73161 156884 -68368
18656 -97271 -176062 -208861 -12106 51139 -2818 25362 -364110 -241484 26367 131716 -1001
18644 6513 -266494 -31600 112649 -42537 -559124 -371864 -53035 -454432 122652 -73856 11655
18632 -300375 -223580 -96187 -41918 216801 -220754 -106783 -45275 -199125 101994 -91078
18621 -111829 32055 -132274 223082 30346 59737 -226141 -284109 46215 120639 -128633 120933
18609 -193872 -76044 -322382 -142348 83800 -349637 -158988 -69675 -184197 147104 -43089
18598 -227400 -12995 -217863 486924 -106596 -56696 -110845 -167862 79963 -235022 -298891 143600
18586 -127673 -389 169891 -39552 -715 39272 187694 -269463 -138279 -5317 -168794 135190
18574A3662b91991c0015k31358a3439B69271j7990O5192r2406g2658O013j6544
18563h3189j38351M527g9899O181n0737k7957e3753k07232C3811i6266m3868d3305
18550g0680b0353A9959b9054q2998M5157K774k0830A06780E0383d164r4998B159
18537b26039a8989r5379E3017K54145a2272l12885a11420A01612J46681a85575
18526a30703C2014a14442j19983A88774a35158J9976i181k25417I9958c50564
18515D9670b17967J7280d1813l06437D1705b1328A18764h1901M212k7124b9523
18503f2009R224A59734d68028a43503O1725G4774B7807K54048a18515A22649a81216
18491A30647a36430A831c1736j5108B8342a18501N4325E1868k1240d23606J74951
$$ plain form
18574 13662 -291991 -30015 -261373 -13439 269271 251281 316473 224067 -72658 -66645 -83189
18563 -83189 -221540 -217013 -79899 -73718 -124455 -152412 -53753 -260985 33811 -96266 -140134 -43305
18550 -70680 -20353 19959 -29054 -112052 -66895 -64121 -84951 106780 50383 -4164 -99162 2159
18537 -226039 -18989 -114368 53017 307162 -12272 -325157 -111420 101612 248293 -185575
18526 -130703 32014 -114442 -234425 188774 -135158 -115182 -9181 -234598 99958 -350564
18515 49670 -217967 -200687 -41813 -348250 41705 -21328 118764 -81901 -77689 -104813 -29523
18503 -62009 -52785 159734 -468028 -143503 -81778 74774 27807 281855 -118515 122649 -181216
18491 130647 -136430 1831 -31736 -46844 28342 -118501 -64176 51868 30628 -423606 -248655
18480b48655R1293B00657b57189I5808a167A14586a79381P7271J7619j96163C94358
18468F3682L818a21059N9399B08J97799f554o4721a7708C2889i1271P881j06731
18456a90121k53503A63330J05341d5915A9832d13020K06112a02176C2516h3831
18445d6196l1818J6688l4618F7876a1906j85176A82345C5635J62669c24491I3997
18433B23755c79253J88426j99855J54675I8265b4839j51282A73282a3981B3382
18422c93508A6679J01523K38872j37752q5166a07727k37434a38675E5229a0137
18411a8798E5290d13770a30340A11658c40372A2000f9940j43337e2938A10896
18400c5715m8236c6765j77981d7507k14587a4623m01378I2428o407p596K0943
$$ plain form
18480 -248655 -157362 200657 -257189 95808 -1167 114586 -179381 -102110 -84491 -280654 394358
18468 63682 67500 -121059 -61660 208 198007 -6554 -71275 -17708 32889 -91271 -83390 -190121
18456 -190121 -443624 163330 268671 -45915 19832 -413020 -206908 -102176 32516 -83831
18445 -46196 -78014 -61326 -95944 67876 -11906 -197082 182345 35635 198304 -324491 93997
18433 223755 -379253 -190827 -390682 -236007 98265 -24839 -176121 173282 -13981 23382
18422 -393508 16679 118202 357074 219322 134156 -107727 -345161 -138675 55229 -10137
18411 -18798 55290 -413770 -130340 111658 -340372 12000 -69940 -213277 -52938 110896
18400 -35715 -83951 -36765 -214746 -47507 -262094 -14623 -416001 92428 86021 78425 99368
18389I9368f9268E2002E670a80643H5535i8761m6051k2417A06569c5466B5883
18377e8449j86251B20693q6222c28719B71742j30795J04416a30639b1315n6384
18367g7699b7812l60794A41213a2409B2416d5678q5996o47p1396A98218G3173
18355b75170o730J11826D11796F8849c28327a45038m35A18903C1372a94253A22809
18343I0378b49313A883a10867k2320O0985F4322b55406C6856J15083e7428K2334
18332c5094l2509j11262j40480R9755A41285a0243j92636A23597a52628G8938
18321C1578K0789L9683k4587a20496j72518a5159j33185a1963j81551b6093E65
18309b56618a4571j25639J6437B15363d5092b620B5892A1412L42115a72774A21473
$$ plain form
18389 99368 -69268 52002 5670 -180643 85535 -98761 -144812 -167229 106569 -35466 25883
18377 -58449 -244700 220693 134471 -328719 271742 140947 245363 -130639 -21315 -77699
18367 -77699 -27812 -388606 141213 -12409 22416 -45678 -131674 -132321 -203717 198218 73173
18355 -275170 -281900 -170074 411796 68849 -328327 -145038 -145473 118903 31372 -194253 122809
18343 90378 -249313 1883 -110867 -133187 -72202 64322 -255406 36856 151939 -57428 -35094
18332 -35094 -67603 -178865 -319345 -219590 141285 -10243 -202879 123597 -152628 78938
18321 31578 52367 92050 67463 -120496 -293014 -15159 -148344 -11963 -193514 -26093 565
18309 -256618 -14571 -140210 -123773 215363 -45092 -2620 25892 11412 353527 -172774 121473
18297c84631H3370b16308h2207B67256d7967b0196l99487a78373J542j18019d5
18285A98862G2355c8281B48538C5617K47641d8040J2197J3042l8112k5779A33415
18273h120A2141b54716O2179l241R2849C07629n2040c5270j14208g1920A07904
18261a71424L5089d2785j33233G7512k2973b9254b905m723k26245E3652R0350
18250A44002c93943a38676b1432A16446a49975N2522J9769H6791c43567e0222
18239d5794l3930p6240r8581b0324A57623K68326C3248a61647k172G3203b14695
18227B04567b7960A93746d10160r9968e2995m3859A64800D9636c02305h089k18650
18216b26739E666K11989a92125C3754b20573Q6338l7790L7620l8485M2349A85014
$$ plain form
18297 -384631 83370 -216308 -82207 267256 -47967 -20196 -419683 -178373 -176831 -294850 -45
18285 198862 72355 -38281 248538 35617 283258 -48040 -35843 -22801 -60913 -86692 133415
18273 -8120 12141 -254716 -192537 -195778 -102929 307629 255589 -35270 -149478 -71920 107904
18261 -171424 -136335 -42785 -176018 77512 54539 -29254 -2905 -7628 -233873 53652 144002
18250 144002 -393943 -138676 -21432 116446 -149975 -97453 -77684 86791 -343567 -50222
18239 -45794 -79724 -155964 -254545 -20324 157623 425949 33248 -161647 -163819 73203 -214695
18227 204567 -27960 193746 -410160 -510128 -52995 -96854 164800 49636 -302305 -8089 -226739
18216 -226739 5666 217655 -192125 33754 -220573 -134235 -172025 -134405 -172890 -130541 185014
18204d41064K4010a21016j85018c5108a5108j31076c6101E0895g0818m53007b11410
18192c79622D02148A50983a05543n4696f2585I4087b22830C7741i0949B50916
18181g0255m43364b4773j47957k45469C8852b51702E4305c17651J5150J20779
18171a81722A14676a75051K0912C8177K0080N1993a18056D1491d48776F5082f83874
18159a05794M673K3294G4685J81350f6581k5072F5356J18574f6406j27955J8960
18148a75401A06772A9964a7997j90605A40884a45655k62263D3405R1236a00117
18137H4618k6700B350J12490h4401K3844j22950A60293C6509c17733e3861K0418
18126c3443j08904d4883B47827A11287b29601J0386B67495j10072a04677q445
$$ plain form
18204 -441064 -417054 -121016 -306034 -35108 -15108 -146184 -36101 50895 -70818 -523825 -211410
18192 -379622 402148 150983 -105543 -160239 -62585 94087 -222830 37741 -90949 250916
18181 -70255 -513619 -24773 -172730 -418199 38852 -251702 54305 -317651 -302501 -181722
18171 -181722 114676 -175051 -154139 38177 58257 110250 -118056 41491 -448776 65082 -683874
18159 -105794 -101121 -77827 74685 256035 -66581 -91653 65356 183930 -66406 -194361 -175401
18148 -175401 106772 19964 -17997 -208602 140884 -145655 -407918 43405 134641 -100117
18137 84618 57918 2350 114840 -84401 -60557 -183507 160293 36509 -317733 -53861 -33443
18126 -33443 -142347 -44883 247827 111287 -229601 -219215 267495 157423 -104677 -113122
18116a13122A88648J94260i0162b0657A5508b05971a6833j4649p434n947l4591
18105g9454A37813i3868A558a9127A78899a45162A3934a13235k03222a30552A17736
18093a14200j24949D71513G1947b61930a2653j16461f0226G2250k9144b07594
18082a34692H8002J51807P9486A27504b38594A46860i924A03669e3733n704j12344
18071a71781o2759G1810b654k02956P0629G8371k2219b2624A54688e6541l73787
18060d30328f4319A38907E9182J26521n0124a76467g4306f569A67027e1470A23016
18048C867c37365A06117L43095a00486G442J93292K8732o6923b54923H7470a03177
18036c5077j6519k07576A83264a52131d8916j1711k64429a00138N599m351A43773
$$ plain form
18116 -113122 188648 382908 -90162 -20657 15508 -205971 -16833 -31482 -38916 -44863 -79454
18105 -79454 137813 -93868 1558 -19127 178899 -145162 13934 -113235 -316457 -130552 117736
18093 -114200 -239149 471513 71947 -261930 -12653 -129114 -60226 72250 43106 -207594
18082 -134692 88002 239809 319295 127504 -238594 146860 -9924 103669 -53733 -59437 -171781
18071 -171781 -234540 71810 -2654 -205610 -134981 78371 56152 -22624 154688 -56541 -430328
18060 -430328 -64319 138907 59182 185703 135579 -176467 -74306 -6569 167027 -51470 123016
18048 3867 -337365 106117 449212 -100486 7442 200734 229466 162543 -254923 87470 -103177
18036 -35077 -51596 -259172 183264 -152131 -48916 -60627 -325056 -100138 -94539 -98890 143773
18024d335A15644O2903a71131g2439B16238c644k84547I8168l1419J36595D969
18012A60373c7722o8225H8662a25943P631k9263o3192O2347I1232e2114B28491
18000B8252h6522G7987k9484J77215H3100b05255g5245q7018A03589e37068E4812
17988i2957D6122b9616C7071a31054C34348b37495A01811a38386f7174C1769d3628
17976B58830i7483A77788a02340j95126A82582c8252J7062o3196d639I5891d6701
17964A82761a95298g4466n7176I6532b6249A335b58689B2254K19302j11613n3051
17953G6892c66919a55835e4059j29376B7213b59946a05637A86495E8824J28659
17943A87483b52381A55477a63736A5701p454a5105j69247M3586B54843A4936M37058
$$ plain form
18024 -4335 115644 178547 -171131 -72439 216238 -3644 -288191 98168 66749 203344 4969
18012 160373 -37722 -105947 88662 -125943 -118312 -147575 -210767 -148420 91232 -52114 228491
18000 28252 -86522 77987 48503 225718 83100 -205255 -75245 -162263 103589 -537068 54812
17988 -92957 46122 -29616 37071 -131054 334348 -237495 101811 -138386 -67174 31769 -43628
17976 258830 -97483 177788 -102340 -297466 182582 -38252 -21190 -84386 -4639 95891 -46701
17964 182761 -195298 -74466 -131642 96532 -26249 1335 -258689 22254 241556 129943 76892
17953 76892 -366919 -155835 -54059 -183435 27213 -259946 -105637 186495 58824 187483
17943 187483 -252381 155477 -163736 15701 8247 -15105 -184352 -140766 254843 14936 451994
17932D51994a36457G1327a51437G7130d6677j53431F4110a90906c9228G246a82795
17920a71286B0771b0563j75575R2741l52026A59213a34802G0860B2556J2094d5628
17908F2047K33111d3371A85595d9189k30045A42352b60221A08953J07007b02679
17897G2259K9510A244b87298I8137a45896A86443b3425j50609D4736d0570B63246
17885D4311K2409Q3699m65c21722a52196F7453c9315O893B6575a9708k4267A29271
17872A90035a21346A42429d56901b24036J752A49976m1900j9547b51546R1260
17862a60286A27079d8513H621b31289G7843a31304B63183H0737d389B7536e8611
17850A271J7987J85284a17101A06095a79385j90989C1968L3419a38066C40192
$$ plain form
17932 451994 -136457 71327 -151437 77130 -46677 -200108 64110 -190906 -39228 7246 -182795
17920 -171286 20771 -20563 -196138 -103397 -455423 159213 -134802 70860 22556 34650 -45628
17908 62047 295158 -43371 185595 -49189 -279234 142352 -260221 108953 215960 -202679
17897 72259 101769 1244 -287298 98137 -145896 186443 -23425 -174034 44736 -40570 263246
17885 44311 66720 150419 149954 -321722 -152196 67453 -39315 -32422 26575 -19708 -43975 129271
17872 190035 -121346 142429 -456901 -224036 -222284 149976 108076 88529 -251546 -160286
17862 -160286 127079 -48513 8621 -231289 77843 -131304 263183 80737 -4389 27536 -58611
17850 1271 19258 204542 -117101 106095 -179385 -370374 31968 65387 -138066 340192
17839i8424d8473j71087d244B5596b2293A05026b40228B11759e7637A24024b3911
17827A99043b7822B10041A0377M79508a40079j24905a13722j9655j57195B445
17816B15967J63900j23751a19222M5552C5401a50244B43575p0482G9968a34372
17805c1868B30550o798r4248P6676c9878j226A06446O3159m087k6727P7936C6044
17792c15603B89792G341L41333g1739A48117E6384j1770R830b02787M4205c2719
17780C8128b8958j32578C8371J34358D3258H154a38249m5437d9801A40409D1326
17768b1469G5112d5095C4902L01268c0490f252q802C03570b9828A49456i1042
17756H0282d66036F7238J31981H2603J65357M1082n8779b32285b0156A63837L7587
$$ plain form
17839 -98424 -48473 -219560 -4244 25596 -22293 105026 -240228 211759 -57637 124024 -23911
17827 199043 -27822 210041 10377 489885 -140079 -264984 -113722 -133377 -290572 2445
17816 215967 379867 256116 -119222 -73670 35401 -150244 243575 173093 79968 -134372
17805 -31868 230550 223752 129504 206180 -39878 -41104 106446 169605 165518 138791 216727 36044
17792 -315603 289792 7341 348674 -71739 148117 56384 44614 54444 -202787 -158582 -32719
17780 38128 -28958 -161536 38371 172729 43258 8154 -138249 -183686 -49801 140409 41326
17768 -21469 75112 -45095 34902 336170 -30490 -6252 -15054 303570 -29828 149456 -91042
17756 80282 -466036 67238 199219 82603 247960 289042 230263 -232285 -20156 163837 201424
17745B01424c32024A19298a49804B50320a02910l62550B20029A03642B4320O9215
17735I3535K2922l7683b9902j60282B713K72008E7013N4467j1518C5056a03888
17723I6678J29971n2051E3163b7372E3565k5134A2153N0783G145e2733A06924
17711A18584K53790L3264A48567J82507b32118B77145i6037k0487A54365l7170
17701A17195M3646K37182a88342J3171j25204H3593a34140A9872b13352I1783
17690a9851C40650G4030a17070B03377L7923B2238K2982b77057A79278j2263j5647
17679A51368m2312c62149a7324j4160C0402h3513l5147C9318P9648B4841M65787
17668D90628d28419F4344J13740F689J09004D864K16704f2991F4885e5550l2943
$$ plain form
17745 201424 -332024 119298 -149804 250320 -102910 -465460 220029 103642 24320 93535
17735 93535 116457 78774 -29902 -190184 2713 274721 57013 111480 99962 35056 -103888
17723 96678 226649 174598 53163 -27372 53565 28431 12153 62936 7145 -52733 106924
17711 118584 372374 405638 148567 331074 -232118 277145 -96037 -116524 154365 117195
17701 117195 160841 398023 -188342 -175171 -300375 83593 -134140 19872 -213352 91783
17690 -19851 340650 74030 -117070 203377 241300 22238 45220 -277057 179278 167015 151368
17679 151368 109056 -362149 -17324 -31484 30402 -83513 -118660 39318 118966 24841 490628
17668 490628 -428419 64344 178084 6689 115693 4864 221568 -62991 64885 -55550 -88493
17657h8493B60470b63182A78753b07306i5103L3854a4962A76217b7383B8216b35888
17645a51977D3305c05213B56429a05137A32613a92180A91041k4991K3100q3426
17635A05724a2900H8732j6778N3816k6387g9311m6330J0880A62607i7877A31745
17623A89607J90792r7859A05096F163L27795h6258j7998C2667g9983C4186a57719
17611B63357n8435O1967B8309a55570A99423J0618o7979E0014n708K73882i172
17599A17343a3190C63342A71626a4524J983j1329o5309A90298f9283p5807C23118
17587A1438J68643m4295a6380C6961J95718n3142a05239A03655i5956j09873D2897
17575a66855M6536B9107i8171o3636p2139H1160A5505N5153R9023J15064a55741
$$ plain form
17657 -88493 260470 -263182 178753 -207306 -95103 -61249 -14962 176217 -27383 28216 -235888
17645 -151977 43305 -305213 256429 -105137 132613 -192180 191041 166050 189150 105724
17635 105724 -12900 88732 71954 125770 99383 -79311 -125641 -114761 162607 -97877 131745
17623 189607 380399 282540 105096 6163 333958 -86258 -104256 32667 -79983 34186 -157719
17611 263357 204922 266889 28309 -155570 199423 210041 142062 50014 44306 318188 -9172
17599 117343 -13190 363342 171626 -14524 -12541 -23870 -89179 190298 -69283 -145090 323118
17587 11438 180081 135786 -16380 36961 232679 179537 -105239 103655 -95956 -205829 42897
17575 -166855 -120319 29107 -98171 -161807 -233946 81160 15505 70658 169681 284745 -155741
17563i3486A67074a60289I0995j6281J89390H5143q311a56853M0731B30758A12413
17551B93979H84J01767P1091i1234c723C2571a68001p559e0820C2070J22719J54460
17539C09249a95068F6548M2093b9737A889N06431k30253M3764A26487c90740B34587
17527e6403j18565E9331b64216H7398J03496N8200b7482D48367A80350B6161L9677
17516F5838J94486p8324f7373E667J38062n9903h2143C7523N8140b19014m235
17505b23249q260b2152A87599G6624b7306B38352j00973C4701Q5332K76926A43809
17493b0633C05424A627M46439f8193A18900b23094C2888b23094b8964A54415o7866
17482H6549k4476o929J88699h3660B73726H5557J47260J04417j28139o7801K3310
$$ plain form
17563 -93486 167074 -160289 90995 74714 264104 85143 76832 -156853 -116122 230758 112413
17551 293979 884 102651 173742 -91234 -3723 32571 -168001 -175560 -50820 32070 154789 309249
17539 309249 -195068 66548 108641 -29737 1889 508320 278067 321831 126487 -390740 234587
17527 -56403 -174968 59331 -264216 87398 190894 249094 -27482 448367 180350 26161 65838
17516 65838 260324 182000 -67373 5667 143729 83826 -82143 37523 95663 -219014 -223249
17505 -223249 -231509 -22152 187599 76624 -27306 238352 137379 34701 120033 396959 143809
17493 -20633 305424 1627 448066 -68193 118900 -223094 32888 -223094 -28964 154415 86549
17482 86549 62073 55144 243843 -83660 273726 85557 232817 337234 209095 141294 164604
17471A64604G0614J28917J67968b0755M699B17150n5409J06125A4770N15074c1187
17459E6179A1763L07368O985i6903a4677B72628c5940B19382l950m2467B3061
17447A23572J32464j9426N1074I1301K70508B1019K81802J27990G3833H146g1878
17435B53687i358r8768b6094D959J25675L052J22678N0743q0089D7331M8285a71266
17422b2076I3093P6702O7715O3294B2445K27947B9076O8044a34460A44805P3907
17411B18712D1271J51980L80927G0837J59746n2039a32538M3762B83817j04364
17401A79453h6068A17149l3338J04702o0749B0526g3855B68749b61041C48772
17390i6293B10167H9398J29730i8094c4179B54745m4552K0526b03650J3995D54702
$$ plain form
17471 164604 70614 199531 367499 -20755 -16056 217150 161741 267866 14770 529844 -31187
17459 56179 11763 319131 326116 -96903 -14677 272628 -35940 219382 215432 172965 23061
17447 123572 256036 236610 287684 91301 361809 21019 302821 430811 73833 8146 -71878
17435 253687 -9358 -108126 -26094 4959 130634 133686 256364 307107 227018 47331 95616 -171266
17422 -22076 93093 169795 237510 300804 22445 250392 29076 97120 -134460 144805 218712
17411 218712 41271 193251 574178 70837 230583 178544 -132538 -88776 283817 179453
17401 179453 -86068 117149 83811 188513 127764 20526 -73855 268749 -261041 348772
17390 -96293 210167 89398 219128 -98094 -34179 254745 210193 230719 -203650 -189655 454702
17378D05845j23196j39481J3172J32271o8305b36861D3090J96134j9164P1061
17368B91121A20566K23888A23876J55720j38683K52328F8205d2860D43062o3540
17358C79522A19113K97529d37060A82619m2269d9639o6755B0314e6553A57315
17347A25815g008A18751J25540M6712A28104J61336a19091A35831N9881O7638
17337B63350A13694L40959I6982I693J58254b00419C75572F1163K26011c33124
17326C79852A57659a0855B04329h432G0596K95688c52193D11058F9466n647o641
17315E7178L25968p0500A54961J32108j31354a22616h469G8026J42870G3237M31613
17304E04850A44618A7865a01230A20209R1548r5772l7065b6080B99062O1087l0127
$$ plain form
17378 405845 282649 143168 156340 288611 220306 -236861 43090 239224 220060 291121
17368 291121 120566 344454 123876 279596 140913 393241 68205 -42860 443062 379522
17358 379522 119113 416642 -437060 182619 140350 -49639 -116394 20314 -56553 157315
17347 125815 -7008 118751 244291 291003 128104 289440 -119091 135831 195712 263350
17337 263350 113694 454653 96982 9693 167947 -200419 375572 61163 287174 -333124
17326 379852 157659 -10855 204329 -8432 70596 366284 -352193 411058 69466 63819 57178
17315 57178 383146 312646 154961 287069 155715 -122616 -8469 78026 220896 73237 504850
17304 504850 144618 17865 -101230 120209 211757 115985 78920 -26080 299062 360149 330022
17293C30022j61364L1718l6636p3985L28240r1118r0578n9708K0033K97569k02270
17282B91923L06360k75236L6543q3066l9405J2228J64753j27480a67806C00415
17271A30584N05571B35515q5659J13297K4412j30533L59715G8147J11460J16980
17261C06587O0793p9406J11568j53365H9221d3106q699C03637F5229K0765L95011
17250D81005k35340n4067N1938J67129j70975C8297K50276M475K4494J09337j81449
17239B45430G1003O7387C3139P5130N5852J92675o4927A16511K0388J25704K3678
17228B86281F765J57098l1527Q3968R4338A06969K30701J22056g2979C27181A07969
17216C04315r8555m0571O2589M06439B40493A15814K33497k4988A16639M8291
$$ plain form
17293 330022 168658 200376 163740 89755 417995 326877 236299 176591 196624 494193 291923
17282 291923 598283 323047 359590 276524 237119 249347 414100 286620 -167806 300415
17271 130584 636155 235515 149856 263153 287565 157032 516747 78147 189607 306587
17261 306587 367380 287974 399542 246177 89221 -43106 -51805 303637 65229 85994 481005
17250 481005 245665 191598 243536 410665 239690 38297 288573 293048 317542 426879 245430
17239 245430 71003 138390 33139 108269 164121 356796 291869 116511 136899 262603 286281
17228 286281 6765 163863 132336 216304 310642 106969 337670 459726 -72979 327181 107969
17216 304315 205760 165189 227778 634217 240493 115814 349311 324323 116639 164930
17206A64930L2478J1360J80854P2304m6707j6645K5689A16941K2719J91640o0256
17195B71044j02562M9078J59567P9695k10853j17136J09499q9187J94978n8206
17185B85917n347K43958A4932L07752M1669J42829o4799J07720j76164J35892
17175E09831j16265j17456J6406L9365j38885J25927q5151A09090N8637o608K18188
17164C79307J505r6542P3276f4838G07711k47851k20689K20463q9490Q280j49807
17153B28617l3130J70272a44379A14305M4820L48851J0117B40219K48694L6018
17143E24931B50825J27854J85761i2088E98918k00365j06233J54717J51052o7313
17133E30776J24029A98748J53911C0568M48003r2871L2289K65738j59924J79056
$$ plain form
17206 164930 197408 208768 389622 461926 415219 398574 424263 116941 139660 331300 271044
17195 271044 168482 217560 377127 456822 245969 128833 238332 149145 344123 285917
17185 285917 280570 524528 14932 322684 364353 507182 442383 550103 373939 509831
17175 509831 393566 276110 292516 331881 192996 318923 233772 109090 167727 161119 379307
17164 379307 380812 284270 357546 -64838 707711 459860 239171 459634 370144 378424 228617
17153 228617 195487 365759 -144379 114305 159125 507976 518093 240219 488913 524931
17143 524931 250825 378679 564440 -92088 598918 398553 292320 447037 598089 530776
17133 530776 654805 198748 352659 30568 478571 385700 417989 683727 523803 702859
17123G02859j30024G3305m316K80156K6127J57598l9881r5660K26445K74794k51595
17112F46973k14568n2092J43460J48795j39869K62506k32114l5628k32641J45544
17102D40366j55902J14211L57078k85160k4127J18235r4659L463K75939j59370
17092E90074j82197L11451k69359p9597K84336M494B24259K57603j14575L80367
17082G47654C54882J62832J15619R8641j47651J41186n5301J10153j61178j17165
17072E02018K48881R3287L5166D16166K13175k867j80907q1520K72914j35050
17062E01911p904o0986J67507J40287k800J15891j41529j57504J85406j13278
17052F27001K50230N0748j28998j81299K85695l71522O68719l01950j80032B85509
$$ plain form
17123 702859 572835 73305 68989 349145 375272 532870 492989 397329 623774 898568 646973
17112 646973 432405 380313 523773 672568 532699 795205 563091 527463 294822 440366
17102 440366 284464 398675 755753 470593 446466 564701 470042 473505 749444 590074
17092 590074 407877 719328 449969 370372 654708 659202 224259 481862 367287 747654
17082 747654 354882 517714 633333 731974 584323 725509 670208 780361 619183 502018
17072 502018 750899 844186 879352 416166 629341 626474 445567 364047 636961 501911
17062 501911 494007 433021 600528 740815 738015 853906 712377 554873 740279 627001
17052 627001 877231 927979 798981 617682 903377 531855 1200574 898624 718592 285509
17041G59580r4670p7081Q1126j89279O20281j527l86740J366J30684n6294J91200
17030I78646j54189J48794m13545L46855q6181P6646k17810J16114l7414O2648
17020H20564m9128l03015N78614j53396k20098K90979m58644P98639n30736Q4157
17010H57936l4846O3337l16197L61100K4460k7449J44858k26939K00195j43442
17000I03013M37150l91679J67847j31862K99704k6356k00082P513j8840j46665
16990H99743k33238N80616j16550J02850k48224k8836K62953j78536K32816L1822
16980A305416j4824L8172k65421P2580l34201O06829o4757l3485J63385r1939
16970A381755j80711r5387J15234L4603o8637K06108r5815R8759N2314L23691
$$ plain form
17041 759580 664910 587829 668955 479676 1099957 1098430 711690 713056 843740 787446 978646
17030 978646 824457 973251 559706 906561 820380 897026 679216 795330 757916 820564
17020 820564 771436 468421 1047035 893639 673541 964520 505876 1304515 773779 857936
17010 857936 823090 886427 570230 931330 955790 928341 1073199 846260 1046455 903013
17000 903013 1340163 948484 1116331 984469 1284173 1257817 1057735 1065248 1046408 899743
16990 899743 666505 1247121 1130571 1233421 985197 956361 1219314 1040778 1273594 1305416
16980 1305416 1290592 1328764 1063343 1135923 801722 1408551 1343794 1310309 1473694 1381755
16970 1381755 1201044 1105657 1220891 1255494 1186857 1392965 1297150 1395909 1448223 1771914
16960A771914j99885l26756j9832M01139l21368j31377J45449K56468k65817Q1057
16950A390992j86273K18903J35665j88176J97505p6228r8252Q8534N7871J91882
16940A732423k851j96803j1388J52929k42319L36548k2978K42011j31611p5542
16930A780419j19846M28091l14340J35377P0900l00552L82882o1003j09637J824
16920A894115q9798O9071J56071r4614J59318k33180J09485O8739J01295j44770
16910A995732J79140L01508l62603J28451k18768K90021m21893M39445Q8q4381
16900B246740j1801J83791L8625K66971j94643m5137q2651K20376L25436l09729
16890B637978q7427L62283k53970L62980k63448K53227j77223J12620J93802j24786
$$ plain form
16960 1771914 1572029 1245273 1225441 1626580 1305212 1173835 1319284 1575752 1309935 1390992
16950 1390992 1204719 1423622 1559287 1371111 1568616 1492388 1394136 1482670 1540541 1732423
16940 1732423 1729572 1532769 1521381 1674310 1431991 1768539 1745561 1987572 1855961 1780419
16930 1780419 1660573 2088664 1774324 1909701 1980601 1680049 2062931 2001928 1892291 1894115
16920 1894115 1804317 1873388 2029459 1934845 2094163 1860983 1970468 2039207 2140502 1995732
16910 1995732 2174872 2476380 2113777 2242228 2023460 2313481 1891588 2331033 2331121 2246740
16900 2246740 2234939 2418730 2457355 2724326 2529683 2484546 2401895 2622271 2947707 2637978
16890 2637978 2550551 2912834 2658864 3021844 2758396 3011623 2834400 2947020 3140822 3016036
16880C016036J42937j55645N5597p7862L01375K92765k67306j38987Q2574J61083
16870C412567L4792J73972O1662j49898N2326J53041K2021J7906K03566r1470
16860C890485J8268R6279L25526k83086J70629J54705r1474p0363N3681K73353
16850D538003l746R3310L36322K14476l7456m34206J48995K77163Q8894k11733
16840E010022K32489j04954K43955K84630q820L63829m6152n1434L00138j4493
16830F209210J42905K69228k1832O4394J56869J09494J82242M80774m32832J84436
16820G344888L79725j43930L69941J22738K95536K19107L35682O3821R6109k28579
16810H855038O46049O3496J83270N62649n2540N72726q3270K51006J38611N15069
$$ plain form
16880 3016036 3158973 3003328 3058925 2981063 3282438 3575203 3307897 3168910 3251484 3412567
16870 3412567 3447359 3621331 3682993 3533095 3585421 3738462 3760483 3778389 3981955 3890485
16860 3890485 3908753 4005032 4330558 4047472 4218101 4372806 4281332 4210969 4264650 4538003
16850 4538003 4534257 4627567 4963889 5178365 5140909 4706703 4855698 5132861 5221755 5010022
16840 5010022 5242511 5137557 5381512 5666142 5657322 6021151 5974999 5923565 6223703 6209210
16830 6209210 6352115 6621343 6599511 6663905 6820774 6930268 7112510 7593284 7160452 7344888
16820 7344888 7724613 7580683 7950624 8073362 8368898 8588005 8923687 8987508 9083617 8855038
16810 8855038 9501087 9564583 9747853 10310502 10257962 10830688 10747418 10998424 11137035 11652104
16800A1652104K62468p4161O60910L13965M852N99895L38778L96274L61756M63352
16790A4980193M02566M10069K96041L51277M82723Q65074J67742N44086N67618
16781A9067389N54886N51047R34289L83303J083369M94991P32610R70285J119025
16772B5891194N74498Q50541R31327R74277J236678J200364J028218J368793J226797
16763C5282687J520303J079112J764110J279107K148503J850948J627230J588383
16755D8140383K473036J628650K340534K506381K144318K326793K269610K652534
16747F6482239K273950K221688K838109K744605K313948K548132K459674J968084
16739H5850429J970025K207324J995620J749005J409964J399242J243382J321450
$$ plain form
16800 11652104 11914572 11840411 12501321 12815286 12820138 13420033 13758811 14155085 14516841 14980193
16790 14980193 15382759 15792828 16088869 16440146 16922869 17787943 17955685 18499771 19067389
16781 19067389 19622275 20173322 21107611 21490914 22574283 23069274 23801884 24772169 25891194
16772 25891194 26465692 27316233 28247560 29221837 30458515 31658879 32687097 34055890 35282687
16763 35282687 36802990 37882102 39646212 40925319 43073822 44924770 46552000 48140383
16755 48140383 50613419 52242069 54582603 57088984 59233302 61560095 63829705 66482239
16747 66482239 68756189 70977877 73815986 76560591 78874539 81422671 83882345 85850429
16739 85850429 87820454 90027778 92023398 93772403 95182367 96581609 97824991 99146441
16731I9146441P58335J143084O86059O30861K11390j28004L37498P1949j9293
16722A02838320J79813o26498p92328n85749m91245j092964j094807j698099j277884
16713I5358559j302347j654838k133820j520577k004494j891845k016689k140884
16705H0693065k293786k062143k260281k018339k016720k367595k477608k400735
16697F2795858j578338k389257j989871j926579j993686j969532j915822j863612
16689D7169161j660076j776784j885280j656833j387069j552399j688161j006044
16681C4556515j175149j395516j211372j095026j152161j216131p51713j119489
16673B5439958r59278n68843r44851p73931q07669p99842n53503p43389n23431
$$ plain form
16731 99146441 99904776 101047860 101733919 102364780 102576170 102448166 102785664 102857613 102838320
16722 102838320 103018133 102391635 101599307 101013558 100522313 99429349 98334542 96636443 95358559
16713 95358559 94056212 92401374 90267554 88746977 86742483 84850638 82833949 80693065
16705 80693065 78399279 76337136 74076855 72058516 70041796 67674201 65196593 62795858
16697 62795858 61217520 58828263 56838392 54911813 52918127 50948595 49032773 47169161
16689 47169161 45509085 43732301 41847021 40190188 38803119 37250720 35562559 34556515
16681 34556515 33381366 31985850 30774478 29679452 28527291 27311160 26559447 25439958
16673 25439958 24480680 23911837 22966986 22193055 21385386 20585544 20032041 19288652 18765221
16664A8765221q66366o2877j054441k04841q01484k49513o35300j7147o10003
16655A4263249j22479p53379m67961j21524m4390o64404l35133k5134l25218m50244
16645A0953383k42252m40561J05329k81567m70716k63951j50534k22744o4632
16636H921755k89193m5851j35614o85719N16195j058412K06118n21421K77932
16627G185790J55801k82243J54834r44946J33011k30884J96335l0469k95254l4928
16617F007047q5464j91317j7113K08035o71071L98236q1082k69967N0313n59973
16607D787644n6906K42076k26284j58992l14757J53136j54789P063J55226l18857
16597D114560J3823m89325M64050j19145j24646N5511N3015k79929j40042j20386
$$ plain form
16664 18765221 17898855 17835978 16781537 16576696 15775212 15525699 14890399 14873252 14263249
16655 14263249 14140770 13387391 12919430 12797906 12753516 12089112 11753979 11728845 11403627 10953383
16645 10953383 10711131 10270570 10375899 10094332 9623616 9359665 9209131 8986387 8921755
16636 8921755 8632562 8586711 8451097 7765378 8281573 7223161 7429279 6907858 7185790
16627 7185790 7341591 7059348 7214182 6269236 6402247 6171363 6367698 6337229 6041975 6007047
16617 6007047 5921583 5730266 5713153 5921188 5250117 5648353 5567271 5297304 5347617 4787644
16607 4787644 4730738 4972814 4746530 4587538 4272781 4425917 4271128 4278191 4433417 4114560
16597 4114560 4128383 3639058 4103108 3983963 3859317 3914828 3967843 3687914 3547872 3427486
16587C427486K65702k76472n2734k10592J70006J2765k52571M26033n38056Q18018
16577C789585q35395n2839p1042k6379M3066K04243m87083K15582j43026j67162
16567B469550K24473k6898R2025j58571l588j16868j14683j09184K98699n20612
16557B034343J12852j04927K70437n9888k89451N85249o30775L58688K5472k0960
16547B281040j72466J11141n28253K47992J8175M1278k96670J81167M06723k07659
16537B082468l88900m2727J77261l9704N0558L23304n87284m282K06867L2317
16527A809878q6184J37924L264k97604N9452j92028L95684l08748Q708K69852
16517A800198n75391L13549p0j59382J39835k01083L07260j90002J1625j4762
$$ plain form
16587 3427486 3693188 3416716 3363982 3153390 3323396 3336161 3083590 3509623 2971567 3789585
16577 3789585 2954190 2901351 2830309 2803930 2846996 3051239 2564156 2779738 2636712 2469550
16567 2469550 2694023 2667125 2759150 2600579 2596991 2480123 2365440 2256256 2554955 2034343
16557 2034343 2147195 2042268 2312705 2252817 1963366 2548615 1917840 2276528 2302000 2281040
16547 2281040 2108574 2219715 1691462 1939454 1957629 1998907 1702237 1883404 2290127 2082468
16537 2082468 1693568 1650841 1828102 1788398 1838956 2162260 1574976 1570694 1777561 1809878
16527 1809878 1723694 1861618 1864882 1567278 1626730 1434702 1830386 1521638 1530346 1800198
16517 1800198 1224807 1538356 1538286 1378904 1518739 1317656 1624916 1434914 1446539 1431777
16507A431777J902j35845n7692J6820L05787k44374L49187l09817j29967L19668
16497A547446P4036n05201N0578q2991L52698k91770R5421J84434j75482l90629
16487H58540N55067k59013k90088Q2558M09535l21575q2715j57411K81241M1596
16477A117735J30524l06372J92863l7255l62128K09220N0530k19816P6046P2683
16467I24030K12110k13653J12262j78079j40730K2434M32024k14674J1679j10330
16457H57073j32845K03059k60237K64347j53738J25899l36404P1988N07567n68541
16447E78168L33096k89612J91589C91812M91650J2787k43735K4657j27277K55938
16437H05832j82274K07537p7096M1954j2039p4451M50846l74541P5282R7293Q212
$$ plain form
16507 1431777 1433679 1297834 1240142 1256962 1562749 1318375 1667562 1357745 1227778 1547446
16497 1547446 1621482 1116281 1166859 1083868 1436566 1144796 1240217 1424651 1249169 858540
16487 858540 1413607 1154594 864506 947064 1356599 1035024 952309 794898 1076139 1117735
16477 1117735 1248259 941887 1134750 1097495 735367 944587 995117 775301 851347 924030
16467 924030 1136140 922487 1034749 856670 715940 738374 1170398 955724 967403 857073
16457 857073 724228 927287 667050 931397 777659 903558 567154 639142 1146709 578168
16447 578168 911264 621652 813241 391812 883462 896249 652514 677171 549894 805832
16437 805832 623558 831095 753999 795953 783914 709463 1160309 785768 861050 958343 966555
16426I66555k34003j05414l13518J64169N66701m91615J35699l1670J63745j77378
16416F43271A17552N16044j26908K07590l11933J66909n3873J5001n3245m7774
16406D29363l4026K4775O3555j30575j9795K57613j40457l2397k9567K057J04364
16395D94910j60700o7841K92399j01172J28953j95306N8562j93683Q3122k2544
16385C16700J65081l2932j98511K04885n1052l3087J71884j20307J46153A35730
16374B79246j02864L57331a8643C57364Q6369J1925O2050B24497M08416m3993
16364E88920j27747j77524K99167O873b6508D57908j94684J3894j10528J20898
16354B87488K88570j06681k3410B04392m2395J97612J68034k16117N2675J98320
$$ plain form
16426 966555 732552 627138 313620 477789 1044490 552875 688574 656904 820649 643271
16416 643271 117552 633596 506688 714278 402345 569254 515381 530382 477137 429363
16406 429363 395337 420112 483667 353092 333297 590910 450453 418056 388489 390546 494910
16395 494910 334210 266369 558768 457596 586549 391243 449805 256122 339244 316700
16385 316700 481781 448849 250338 455223 404171 371084 542968 422661 568814 135730
16374 279246 176382 533713 -18643 357364 443733 455658 517708 224497 632913 588920
16364 588920 461173 283649 582816 589689 -26508 457908 263224 277118 166590 287488
16354 287488 576058 469377 445967 204392 161997 359609 527643 311526 364201 562521
16344E62521j45547J67859B3669N20160A90923a55284B59150j15162K38813r7530
16334B85271p3082J36492j46288k9426J28393J34214j31264J24018H6357J01120
16324A87477D9903K56957K27500k04871G3485K28624K16650F4119J63627q4543
16314A43203K04105K13104A00135L19261p0351j15151J815A16035L10948A91121
16303A77535J14K54911b2834D05060j25559K89240B47889J91017j25780Q4307
16293C97433j11727A01063K4482L4762K85064a30196A35764J55518n0935L1989
16283B72336L30061G2862j8367L33044c8743B00883l6268J5942K4881a56792B03948
16271D14492I0229l7391Q7434D2796J22426R6120D7825K90576h7457A43012F6179
$$ plain form
16344 562521 416974 584833 23669 543829 190923 -155284 259150 143988 382801 285271
16334 285271 212189 348681 202393 172967 301360 435574 304310 428328 86357 187477
16324 187477 49903 306860 534360 329489 73485 302109 518759 64119 227746 143203
16314 143203 347308 560412 100135 419396 349045 233894 235709 116035 426983 191121
16303 177535 177649 432560 -22834 405060 279501 568741 247889 438906 313126 397433
16293 397433 285706 101063 125545 160307 445371 -130196 135764 291282 240347 272336
16283 272336 602397 72862 54495 387539 -38743 200883 164615 180557 205438 -156792 203948
16271 414492 90229 52838 140272 42796 165222 261342 47825 338401 -87457 143012 66179
16259a7000j62609C85842O530P2276O1531b22345C62054a83377A94148J30202
16249C24350n3968j08630O0432l4208Q9775J5747J9798a92527B55532p0450K41191
16238D26273j90943K92602k47390P05A09560R1452K43743j11178j24076K63922
16228D73423E0183J16702l6360K58004a30635B62883b11396R3792A93492F2470
16217A6794J06886K7622N1711b03704A21243M0926l5783J69542G1734K21304b41611
16205B36580A09610e4935B50737p0353O0512j00226F5178R9323m2769C5410a63451
16193f3846c1387k4001B3702d148C98522A56659O705J01514j20133J7838b64395
16181F7524J66733a67363B42895d1071o0468A00867D6424J30843C2194H871K17595
$$ plain form
16259 -17000 -179609 385842 392372 464648 526179 -222345 362054 -183377 194148 324350
16249 324350 270382 161752 222184 187976 277751 293498 313296 -192527 255532 185082 426273
16238 426273 235330 527932 280542 281247 109560 201012 444755 333577 209501 473423
16228 473423 50183 166885 130525 388529 -130635 262883 -211396 -117604 193492 62470
16217 16794 123680 151302 203013 -203704 121243 162169 126386 295928 71734 293038 -241611
16205 236580 109610 -54935 250737 180384 240896 140670 65178 164501 121732 35410 -163451
16193 -63846 -31387 -55388 23702 -4148 398522 156659 163364 264878 144745 162583 -264395
16181 67524 234257 -167363 242895 -41071 -101539 100867 46424 177267 32194 8871 226466
16170B26466h949I219J6021J46013o5328a42786B40994b878F0163c5737J6882
16159a8855r5486C5011M0495K55011j55677C6219K42859J73948a83811C19013
16148A08122J62652K51215A12882a35740C5135L58344J2851j023g944C66655F9272
16136b02428B20164c14272A05974J6073E2285b38343d0610A0502K03968C9206
16125D33575b06530d5194j33149B47885E8289R8333P2251h9049B21395n353J7653
16114B33695a6997n3354C00717R9706E3662j5670a61497A49996B6207L9600J81193
16103B47000b37206A87127b9936A93466f384j40307A26637g9337J5232l3193o925
16092a04223F2549b98894B61742l1055R1218A191f6019n0925n1042C11801j26814
$$ plain form
16170 226466 -8949 9219 25240 171253 105925 -142786 240994 -2878 60163 -35737 -18855
16159 -18855 -114341 35011 75506 330517 174840 36219 279078 453026 -183811 319013
16148 108122 270774 521989 112882 -135740 35135 393479 406330 405307 -7944 366655 69272
16136 -202428 220164 -314272 105974 122047 52285 -238343 -40610 10502 214470 39206
16125 433575 -206530 -45194 -178343 247885 58289 156622 228873 -89049 221395 216042 233695
16114 233695 -16997 -70351 300717 400423 53662 37992 -161497 149996 26207 65807 247000
16103 247000 -237206 187127 -29936 193466 -6384 -146691 126637 -79337 -64105 -97298 -104223
16092 -104223 62549 -298894 261742 230687 321905 1191 -66019 -116944 -167986 311801 184987
16081A84987h355B24231b36700E9628l293J74963i7195n660b3850n8506j04762
16070a87118A10090j5129N5413a36950A46368b10143n4374P6893R3223F9283K0910
16059I0193J93260j07847p5643e8272p7964C61864h0534o3052E08680p5558e7245
16047a58242K8151a0992B58249H283a50253C1440a16452d1720A86140b7039C57305
16035c0511A88336B6638a5201B37586J15291A32004a64207b2626j24182A11335
16024a15294G8079d3893j17448d879j98120F4685Q3535A5842J76492J55909G0893
16012A77350j5551D1799a3322k6717B80038j21978g3905B8920a04720B4071a51771
16000c80598C270K60433A21152f1398A65811B4094R2822a24213F5496K7135n524
$$ plain form
16081 184987 -8355 224231 -236700 59628 56335 231298 -97195 -102855 -23850 -82356 -187118
16070 -187118 110090 94961 150374 -136950 146368 -210143 -264517 -187624 -94401 69283 90193
16059 90193 283453 175606 99963 -58272 -136236 361864 -80534 -143586 508680 433122 -57245
16047 -158242 -130091 -10992 258249 8283 -150253 31440 -116452 -41720 186140 -27039 357305
16035 -30511 188336 26638 -15201 237586 352877 132004 -164207 -22626 -146808 111335
16024 -115294 78079 -43893 -161341 -4879 -202999 64685 148220 15842 192334 348243 70893
16012 177350 161799 41799 -13322 -40039 280038 158060 -73905 28920 -104720 24071 -151771
16000 -380598 3270 263703 121152 -61398 165811 24094 116916 -124213 65496 92631 87107
15989H7107J24604J06473g5206J683K8204E33714d3745D63411C9080J37257a54711
15977B6939d3434B6131J74619G6808a97219I1772K12283j39704h3079A16970Q136
15966A25106b10088J7908M4161A8420J65022P878h6093K9564j89861j04345C14801
15954F053p80b81328A68004c21194C00997d022j5646n1631H7810f4908D2867R0252
15942A33119a22048A30157a60931A1769J2192L05498A06273A3775d2819l27037
15932c69856A06159b46229F2455G000L94966F2700c54053b0120j49173d2433j8587
15921f1020m4888D8153b2935m0680n4145C16943H5412r753C7746Q6609C202c6619
15908a3226E4083a72591B5707h2241C099a49920M403A9743O2282i8104B20549
$$ plain form
15989 87107 211711 318184 -75206 -73523 -45319 533714 -43745 463411 39080 176337 -154711
15977 26939 -43434 26131 200750 76808 -197219 91772 304055 164351 -83079 116970 125106
15966 125106 -210088 -192180 -148019 18420 183442 191320 -86093 -56529 -246390 -350735 314801
15954 6053 5273 -281328 168004 -321194 300997 -4022 -19668 -71299 87810 -64908 42867 133119
15942 133119 -122048 130157 -160931 11769 23961 329459 106273 13775 -42819 -369856
15932 -369856 106159 -246229 62455 7000 401966 62700 -354053 -20120 -169293 -42433 -61020
15921 -61020 -105908 48153 -22935 -63615 -117760 316943 85412 75659 37746 124355 3202 -36619
15908 -13226 54083 -172591 25707 -82241 3099 -149920 -145517 19743 82025 -98104 220549
15896f0100j40742g3404A17454c43300d255A27952J62878h2020A54656e2337H1642
15884g9383A06654n2765B4141b7010E7505J30142b54689A78633a10499l1440A24546
15872A09920i0205c4748E8006b2291l86361C1994K28854a23023e5029E2545J0224
15861F2769N4525D2662e06545A37344a0089j88375e7150A14926e5433p6366o3509
15850a95308B82038c67557h3051j4257H6318M3585a48798a4506l8855m7991C70572
15838a4469E7885b15191A43669B5029b29827A10401a33163k41703B34316A14704
15827B6840a11514m8708j30661A29483K8957B6695K92118A07445K26440c300B25019
15815A61664i5975a1314n6930p0506j35985D4654O5662b05700B82143a28822L6319
$$ plain form
15896 -60100 -200842 -73404 117454 -343300 -4255 127952 290830 -82020 154656 -52337 81642
15884 -79383 106654 53889 24141 -27010 57505 187647 -254689 178633 -110499 -141939 124546
15872 109920 -90205 -34748 58006 -22291 -408652 31994 260848 -123023 -55029 52545 62769
15861 62769 117294 42662 -506545 137344 -10089 -198464 -57150 114926 -55433 -131799 -195308
15850 -195308 282038 -367557 -83051 -97308 86318 129903 -148798 -14506 -53361 -101352 370572
15838 -14469 57885 -215191 143669 25029 -229827 110401 -133163 -374866 234316 114704
15827 26840 -111514 -160222 -290883 129483 158440 26695 318813 107445 333885 -3300 225019
15815 161664 -95975 -11314 -68244 -138750 -274735 44654 110316 -205700 282143 -128822 -92503
15804i2503B10716o3239K6984b15760k18584A26100d9046A62203b18749R5268
15794a23481C1586b1908j17983I6307a80927I7433J40508a02892D200a11427A79067
15782b45277Q9395N4329o6816A41189a8225k42047J05414f8353A80002b27030
15771A63774N1627a50347F5850h9853e011r6109j4112A54280J20273h8785j10070
15760a98855G3838K63105H8465J28197j3133a28316k15082a43533d4470i47j27116
15749a28063N9406E268g5053l0114o6992j10462P9685r2080C7958F927d03619
15737d611A15130Q0386a56506B35430p3057J27789a0681l0322D9574K92329b9979
15725i1158I1686B5638e1873A8618L15414D4832a77062L5288b4884D34136C8662
$$ plain form
15804 -92503 210716 147477 174461 -215760 -434344 126100 -49046 162203 -218749 -123481
15794 -123481 31586 -21908 -139891 96307 -180927 97433 237941 -102892 4200 -111427 179067
15782 -245277 -155882 -101553 -168369 141189 -18225 -260272 -154858 -68353 180002 -227030
15771 163774 215401 -150347 65850 -89853 -5011 -101120 -115232 154280 274553 -88785 -198855
15760 -198855 73838 336943 88465 216662 203529 -128316 -343398 -143533 -44470 -947 -128063
15749 -128063 -68657 5268 -75053 -105167 -172159 -282621 -202936 -295016 37958 6927 -403619
15737 -4611 115130 195516 -156506 235430 162373 290162 -10681 -41003 49574 341903 -29979
15725 -91158 91686 25638 -51873 18618 334032 44832 -177062 -141774 -24884 434136 38662
15713h8538p082B32209i5278A42462a66561N2726B7089d642A67569o3292c45821
15701a45590B41440g395j049m1288A98865b62035B09874b70956K8695A18959i1807
15689e69533b29847L3443a5312k6151k10836G2516N7292B7718h7378j41595A90954
15677H6322g3636j342J8331C2339P2760a40008A66622a35666B55425I3170a93674
15665I7991b29296C11737c8057a0966r9955n8357a383k40893a15098G7737B5554
15653C9770h320E8112a32754d7737r4310p1190E6981B1384a84240A07961N1451
15642A59412c21950C103a78798h4978j05813n4490e169C02012a33452C5253J17689
15631A52942f3533A03071a65098B5797i2254d5639B14150a28759j30619J04017
$$ plain form
15713 -88538 -95620 232209 -95278 142462 -166561 -113835 27089 -4642 167569 104277 -345821
15701 -145590 241440 -7395 -8444 -49732 198865 -262035 209874 -270956 -242261 118959 -91807
15689 -569533 -229847 -196404 -15312 -41463 -252299 72516 129808 27718 -87378 -228973 190954
15677 86322 -73636 -74978 -56647 32339 105099 -140008 166622 -135666 255425 93170 -193674
15665 97991 -229296 311737 -38057 -10966 -110921 -169278 -1383 -242276 -115098 77737 25554
15653 39770 -8320 58112 -132754 -47737 -142047 -213237 56981 21384 -184240 107961 159412
15642 159412 -321950 3103 -178798 -84978 -190791 -245281 -5169 302012 -133452 35253 152942
15631 152942 -63533 103071 -165098 25797 -92254 -45639 214150 -128759 -259378 -155361
15621a55361c3789F0506a15602j4916A85697o2530l8796j7917a93225d4815j7033
15610f1848A55260j0552a67311e253k15074B24052H3802M7910N0678p9076L729
15599A07043M7179i923B68837b01904a971E4556J99054F7031k4151J37512g4701
15587a58450D5607a1983D6280K02349j2070E3157d4898A5511c24806d6211A25257
15575a94368B08547I817M01529a73899A19009b14863J5815B5577a55584j17881
15565b73465C9490N7013a6185B82242f1724I4088b80549a00398A08268C3043K13319
15554B46362f9992B3068c4516I3248a63803C1481b3648A60152G3852J85379A03233
15542i7191J1545C7649a04431E0556A4769J09113f9977j95602f562n2078j59992
$$ plain form
15621 -155361 -33789 60506 -115602 -130518 185697 123167 84371 66454 -193225 -44815 -61848
15610 -61848 155260 144708 -167311 -5253 -220327 224052 83802 131712 182390 103314 107043
15599 107043 154222 -9923 268837 -201904 -1971 54556 253610 67031 42880 180392 -74701
15587 -158450 45607 -11983 46280 248629 236559 53157 -44898 15511 -324806 -46211 125257
15575 -194368 208547 9817 411346 -173899 119009 -214863 -199048 25577 -155584 -273465
15565 -273465 39490 96503 -16185 282242 -61724 94088 -280549 -100398 108268 33043 246362
15554 246362 -69992 23068 -34516 93248 -163803 31481 -23648 160152 73852 259231 103233
15542 -97191 -85646 37649 -104431 50556 14769 123882 -69977 -265579 -6562 -58640 -218632
15531b18632A31660a15512N1473j79268d6440O046B65894j32395c27906A66090
15520a6948r6946K8736F5810d8874j69427M5371q2236h8451I1611M2657D9164
15508B14567b94937J32559A52454a48463B74896j14012n3572d8217j57206B55536
15497b79081B7818K48191A05313P197c13061A37749c0561b807A8859b951B57491
15485A74270G9695a23616j60183f4684j13800B58731C2435b865k7397D380e5249
15473C42354c58n941o1655L1283p1701C6463J92991a9070A14367L0999c01787
15461b01131F4162J27834B2269b41953R1282j5384F8690b63306B36525d7082E6299
15449i0783m8795M8920F2188c63152J47247O9176D5628K80795A46051b7512j76032
$$ plain form
15531 -218632 131660 -115512 -64039 -243307 -46440 -40394 265894 133499 -327906 166090
15520 -16948 -113894 -85158 65810 -48874 -218301 -172930 -255166 -88451 91611 134268 49164
15508 214567 -294937 -162378 152454 -148463 274896 160884 107312 -48217 -205423 255536
15497 -279081 27818 276009 105313 112510 -313061 137749 -30561 -2807 18859 -2951 257491
15485 174270 79695 -123616 -283799 -64684 -178484 258731 32435 -2865 -30262 4380 -55249
15473 342354 -358 -6299 -67954 -36671 -108372 36463 229454 -19070 114367 145366 -301787
15461 -201131 64162 191996 22269 -241953 -150671 -166055 68690 -263306 236525 -47082 56299
15449 -90783 -139578 -90658 62188 -363152 -215905 -146729 45628 326423 146051 -27512 -203544
15438b03544E1646m26J82225a32596D30531b77768F0173g9711k8002A6062b1551
15426B29030a18854E2991N4281c07749J27623B56026H8840a53188d940A0415K26524
15415B36939b07468A80640c17147C8350b02220n7755A59504f2233C66534A8145
15404b53981p2256a896A44389m0463a36564A9097N1159C0238L34250C7761g6848
15392a63859N2499A37236D8157c09490a38451J3782B46971a78579A47220C2746
15381c5916k19376a8749r3351A82056p9580l8450a53553H5605K48320j10525C9855
15369B19000b12680p4353B79113a64274C9561g9295B21090h9972h644I8175A4060
15357a13200A12670a47060g1245A86485k6134m3586n8258b98712d8816k85265
$$ plain form
15438 -203544 51646 51220 233445 -132596 430531 -277768 60173 -79711 -107713 16062 -21551
15426 229030 -118854 52991 107272 -307749 -180126 256026 88840 -153188 -4940 10415 236939
15415 236939 -207468 180640 -317147 38350 -202220 -259975 159504 -62233 366534 18145
15404 -253981 -326237 -1896 144389 103926 -136564 19097 70256 30238 364488 37761 -76848
15392 -163859 -111360 137236 48157 -309490 -138451 -124669 246971 -178579 147220 32746
15381 -35916 -255292 -18749 -112100 182056 102476 64026 -153553 85605 333925 223400 39855
15369 219000 -212680 -287033 279113 -164274 39561 -79295 221090 -89972 -8644 98175 14060
15357 -113200 112670 -147060 -71245 186485 160351 116765 58507 -298712 -48816 -334081
15347c34081C624Q0857a96679A29406a45036G1177b9095D7479a28044A4178K13043
15336B27221a83334J6251A98004o0903C9315J54716J70744p0624g3900G2483b52671
15324D4382B1037a89730C76534j41990J08106j19567a8547j25507M5598A2331
15313A68190a54252a8901B29272i3922K1843B73681L5480d43727A40065a48477
15302D7181g9592G3505P5162A0544a22650J975C16779a04486A52056j6830o4977
15291G0249b74951g4761A99877F4272e2124c5B68193a0672D28965j55834k1449
15280B51682j25336P1130J65833a99440j23054A48292i6040A81064m8155F1673
15269F2116J66828J91305j64500K30076j4301J40912B60247L89899C01586J15538
$$ plain form
15347 -334081 3624 84481 -196679 129406 -145036 71177 -29095 47479 -128044 14178 227221
15336 227221 -183334 -167083 198004 137101 39315 194031 364775 294151 -73900 72483 -252671
15324 44382 21037 -189730 376534 234544 342650 223083 -18547 -144054 -98456 12331
15313 168190 -154252 -18901 229272 -93922 -72079 273681 309161 -443727 140065 -148477
15302 47181 -79592 73505 148667 10544 -122650 -120675 316779 -104486 152056 135226 70249
15291 70249 -274951 -74761 199877 64272 -52124 -35 268193 -10672 428965 273131 251682
15280 251682 126346 197476 363309 -199440 -322494 148292 -96040 181064 132909 61673
15269 62116 228944 420249 255749 485825 471524 612436 260247 650146 301586 417124
15259D17124A16439K40178m5852l5098J7717L14284A31929K89769j02846l253
15249C15599j14763L40696j78097K04762p2525J10465K2247B33731O0973j17851
15239A76853K30112A71919b21633P3283k5053B50973H1857K14539J23701A48004
15228B54262J49893A20283M1479f1167j37995i4677B26045d0444C8293M62029
15218E00322A82637j4018P0195a5363B80941i5117D4138c6595J3524j57085O4500
15207a15656j99741c9857D340J45635b21663f5739G6810a18002I7859a56397B89573
15195E0003L51476G3237B0847d5652j7908D7105J28068O1147b4169q7706F717
15183B77296a12367o9473D8619j8174J83872K71791a0956D84140A46081j5327
$$ plain form
15259 417124 116439 356617 310765 275667 293384 607668 131929 421698 318852 315599
15249 315599 200836 541532 363435 568197 495672 606137 628384 233731 294704 176853
15239 176853 406965 171919 -221633 -148350 -173403 250973 81857 296396 420097 148004
15228 254262 404155 120283 161762 -61167 -199162 -94677 226045 -40444 38293 500322
15218 500322 182637 168619 238814 -15363 280941 -95117 44138 -36595 -23071 -180156 -115656
15207 -115656 -315397 -39857 4340 149975 -221663 -65739 76810 -118002 97859 -156397 289573
15195 50003 401479 73237 20847 -45652 -63560 47105 175173 236320 -24169 -111875 6717
15183 277296 -112367 -181840 48619 30445 214317 486108 -10956 484140 146081 130754
15173A30754J41145E9229K5634K4594K74417a68147o7113G7607b17933G2980A3459
15161A97719A3623c1850A34338b6394j8255l4801b3736F0172J9388J49583p2742
15150A56401M5977o8620m8880Q4404Q04N07796B77356g2803A08361a24649E1134
15138D9196M2226A3750J76967A6926J62409b4856F6209a21874A06327C3837J13216
15127A47053R3781g0344n8977G053K72625A32665M6831L1602K50188A28955i4864
15115a2660A49856a01960D63816b36301a01028G2919L25271A19068b50490B0855
15104A63882P0574P1266j32331P4644j5457E7379K30268j32164B496J64468q588
15093A58376e2835E2917K91910i949j78813C98657f9928B34584O744J8331a15084
$$ plain form
15173 130754 271899 59229 84863 109457 383874 -168147 -235260 77607 -217933 72980 13459
15161 197719 13623 -31850 134338 -26394 -44649 -79450 -23736 60172 79560 229143 156401
15150 156401 202378 133758 84878 169282 170086 677882 277356 -72803 108361 -124649 51134
15138 49196 91422 13750 190717 16926 179335 -24856 66209 -121874 106327 33837 147053
15127 147053 240834 -70344 -129321 7053 279678 132665 179496 211098 461286 128955 -94864
15115 -12660 149856 -101960 463816 -236301 -101028 72919 398190 119068 -250490 20855
15104 163882 234456 305722 173391 248035 232578 57379 287647 155483 2496 166964 158376
15093 158376 -52835 52917 344827 -9949 -188762 398657 -69928 234584 241328 259659 -115084
15081B54957l1479K05021A35522K7696p5361a78410A29199K42809A63127Q507
15071A71634B3696a34772a7170l5908G3482a11927B06174Q9039N3809j60603K12371
15060D00790a53894B20244c3266B09139r7854n2170j6141R6800A5385K63556j21451
15049A57490b90448C38897j55697b33939C67181g3613D0108O2541l5466b26452
15038a45675A59299g6077A12152c3711A03608K4376h7971B14274d5790G6500J09235
15027A85735J23335d1798D79625A97579f3093C16536J42211B10172L6163N1304
15017B97639J0346q3587q7683N5071P5032l1025J8288o0610H2618K58762E1229
15005B25496J4408q1876K3652a9268A1741J39939K13060j4138J87771A71481C7826
$$ plain form
15081 254957 223478 428499 135522 163218 87857 -178410 129199 372008 163127 171634
15071 171634 23696 -134772 -17170 -53078 73482 -111927 206174 295213 349022 188419 400790
15060 400790 -153894 220244 -33266 209139 111285 59115 42974 139774 15385 278941 157490
15049 157490 -290448 338897 183200 -233939 367181 -73613 40108 102649 67183 -226452
15038 -145675 159299 -76077 112152 -33711 103608 127984 -87971 214274 -45790 76500 185735
15027 185735 309070 -41798 479625 197579 -63093 316536 458747 210172 246335 297639
15017 297639 307985 224398 136715 191786 266818 235793 254081 193471 82618 341380 51229
15005 225496 239904 158028 181680 -19268 11741 151680 364740 350602 538373 171481 37826
14993B97642c8149B26515d2439D12866r300c0905I6828F945J90110K19534l1210
14982C85379j69244O3444F1047m152P4904J58291N3547H3415N5935J5369J07587
14971B62306A26439j2767K43450j45443q4349k4868d9769C89505A35912N1816
14961A87728b6287l8876B78231E481L53371H3702A7712n146K44554P9214M8529
14950C84863A32134M1285J78723M58138C46146r556A20505n2847l1223K31209
14940B67644E047N26942B19529J68894J5421A15569G571P638J86350K7857P3109
14929C02525R0396B3496J94390J2948J18777M5301A69353j9265K10671l4825j23802
14918B02132q538j9171N4377L1955p7285K46057K3272A70183d2136C21641j8617
$$ plain form
14993 297642 -38149 226515 -42439 412866 403566 -30905 96828 6945 197055 416589 385379
14982 385379 216135 279579 61047 56895 131799 290090 343637 83415 139350 154719 262306
14971 262306 126439 113672 357122 211679 127330 102462 -49769 389505 135912 187728
14961 187728 -26287 -65163 278231 5481 358852 83702 17712 12566 257120 336334 384863
14950 384863 132134 173419 352142 810280 346146 336590 120505 67658 36435 267644
14940 267644 5047 531989 219529 388423 403844 115569 7571 15209 201559 229416 302525
14929 302525 392921 23496 217886 230834 349611 394912 169353 150088 360759 325934 202132
14918 202132 193594 174423 228800 260755 183470 429527 452799 170183 -42136 321641 303024
14907C03024E5758O7462J15246J66694A3995K76737g6583C93469J54597A12964
14896A67987K17630J23679H6839J978L36491j18658F7204K67871J64283A51033
14885F71970B32816D6499K56337K12241k49941N10558B05773K07438j97901n8762
14875A56548K25211A29880K11379n1301N2115G8149L72265K26673j45759j37649
14865C93679O0886A29552J26727P2214O9963M11325l07580l0674J44073k79832
14855C35768M44j25522K3950j15920M21779A53468J73280J78792M9887j114k69980
14844B84333K12703k25675M7548m0366M13121j40335I3174K60310P8483K40103
14834F72070B72379L71971o8695A85071K82256K53041C51074q569J93200L5138
$$ plain form
14907 303024 55758 123220 238466 405160 13995 290732 -76583 393469 548066 112964
14896 167987 385617 509296 86839 88817 425308 306650 67204 335075 499358 151033
14885 671970 232816 46499 302836 515077 265136 775694 205773 413211 215310 156548
14875 156548 381759 129880 341259 289958 342073 78149 450414 677087 531328 393679
14865 393679 454565 129552 256279 328493 398456 809781 502201 471527 615600 335768
14855 335768 336212 210690 234640 118720 540499 153468 326748 505540 555427 554313 284333
14844 284333 497036 271361 318909 278543 691664 551329 93174 353484 431967 672070
14834 672070 272379 644350 575655 185071 467327 720368 351074 342505 535705 570843
14824E70843A73583K15450L60198C03535A27122L33479K11296l31065R7660J71988
14814F10480q6333Q7760M1601d4102C69430o5713A16220O91384o2086j01777N8011
14803G01752j72446J49610l23053P0695K41353B77416K67469j22123J80900B46947
14792D72068J21251J2362n006j21755P7872j25334J4447M8322K23188J16085j99298
14781F34202m6995J3255j88378m9666J20509J10134Q765O3809m6229r5989J27664
14770F51081j19502j95753J84328K79907k03955l8768L35588m05196k2677A65011
14759G29457B89609P8188K47920p400O729k45123L24824r9428J05821j75758j66957
14748C58425J07809K14018J85341j73984l7876L03692m26567n8611N3613M32253
$$ plain form
14824 570843 173583 389033 749231 303535 127122 460601 671897 340832 438492 610480
14814 610480 524147 611907 653508 -44102 369430 303717 116220 807604 745518 643741 701752
14803 701752 529306 678916 355863 426558 667911 277416 544885 422762 603662 246947
14792 472068 593319 605681 600675 478920 556792 431458 445905 494227 717415 833500 634202
14781 634202 587207 600462 412084 362418 482927 593061 601826 665635 619406 523417 651081
14770 651081 531579 335826 520154 800061 596106 557338 892926 487730 465053 165011
14759 729457 289609 367797 615717 608317 615046 369923 694747 595319 701140 525382 358425
14748 358425 466234 680252 865593 691609 653733 957425 530858 472247 525860 958113
14738I58113R190m78367K90591o7204L2903K7556J2539m825J4865j32939m8795
14727F13627R9063J50852r6130P1201q1175o5073k20779J23319K27352L69738
14717A191995E39788J13050J811L14420l33862J63702L7968k09101p372p4914
14707E45490p5513M13476M20435m44317j09241n3808J85474p570k7602M6908K61133
14696A154865m43455j49539J3026O6916M966J65987J01225j63606J84152k8991
14686I05546Q8576j7044M04156l28075j32425J34955J82267n76564N75883l30697
14676I06578j3738L56247l45185J45577l3451q6190J72413j69959K10940J69507
14666A312739k29324P3775L9179j08287K9313o8136M71017k93016L45333m52622
$$ plain form
14738 958113 967303 488936 779527 712323 745226 772782 785321 780496 795361 662422 613627
14727 613627 712690 863542 767412 838613 757438 692365 471586 594905 822257 1191995
14717 1191995 539788 652838 654649 969069 635207 798909 836877 627776 620404 545490
14707 545490 469977 883453 1303888 859571 750330 696522 881996 874426 846824 893732 1154865
14696 1154865 711410 561871 574897 641813 646779 812766 913991 750385 934537 905546
14686 905546 994122 977078 1381234 1053159 920734 1055689 1237956 661392 1237275 906578
14676 906578 892840 1249087 903902 1049479 1016028 929838 1102251 932292 1143232 1312739
14666 1312739 1083415 1157190 1196369 1088082 1117395 1049259 1520276 1227260 1572593 1119971
14656A119971J21538L6266l04565K08417k91146L28683n3580j03816p0406n6013
14646I35349K31310M57624n96106J1554K66904j27971K13508o10488O33822K4729
14636A440235k08280P2468j37638K43051k5792o9658o1803N3460L1812J80241
14626A518096J1691k62046J49139k61005L38729j44796J77529L8083p2768r4893
14616A397759j59950P7073R9947J03250R8074l15487K2954j13467O79020m32626
14606A456547J52844J8524M6011l09423L68675k61594J68249n6095q6781L66732
14596A863689q1823l7876k51577J67516O7389l30718K23885N244K50570l9937
14586A836362o5722l268M39528l50019J72612P637K10299m24393K14987P6046
$$ plain form
14656 1119971 1241509 1277775 973210 1181627 890481 1219164 1165584 1061768 991362 935349
14646 935349 1166659 1624283 1028177 1039731 1306635 1178664 1392172 781684 1415506 1440235
14636 1440235 1231955 1304423 1166785 1409836 1384044 1314386 1252583 1306043 1337855 1518096
14626 1518096 1529787 1267741 1416880 1155875 1494604 1349808 1527337 1565420 1492652 1397759
14616 1397759 1237809 1314882 1414829 1518079 1616153 1300666 1323620 1210153 1889173 1456547
14606 1456547 1609391 1627915 1673926 1364503 1733178 1471584 1639833 1583738 1496957 1863689
14596 1863689 1781866 1743990 1492413 1659929 1727318 1396600 1620485 1625729 1876299 1836362
14586 1836362 1770640 1767372 2206900 1856881 2029493 2037130 2247429 1823036 2038023 2114069
14576B114069J49084P00831q55718O43906J59394P29414K23504P12884R92946
14567E570314R42320Q71542R7220j198499n87451L2786L41901J59154l83383j09852
14557E736052l78770J18806K90440R5916L6893O1480R8912M831L84827O23478
14547G072865M49986J413863p34136j911352j084462p99180o72763j73648J02808
14538C663981j16531R7815R7748k32553j62293J26967o7743j28305j22146j15944
14528C040996Q415O6736l95779L7856r0115J82435j879n74306J91810N5088j29438
14517B391819M13584l200J30076J52730m41768Q5936K4283j174K68845l00748
14507B720383K52631K61451l61082j2920M74329j94930k66540j21127K33610N64064
$$ plain form
14576 2114069 2263153 2963984 2108266 2752172 2911566 3640980 3864484 4577368 5570314
14567 5570314 6512634 7384176 7481396 6282897 5695446 5728232 6070133 6229287 5845904 5736052
14557 5736052 5357282 5476088 5766528 5862444 5899337 5960817 6059729 6064560 6449387 7072865
14547 7072865 7522851 8936714 8202578 6291226 5206764 4407584 3734821 3561173 3663981
14538 3663981 3547450 3645265 3743013 3510460 3348167 3475134 3407391 3279086 3156940 3040996
14528 3040996 3049411 3116147 2720368 2758224 2668109 2850544 2848665 2274359 2466169 2521257 2391819
14517 2391819 2805403 2802203 2932279 3085009 2643241 2729177 2753460 2752286 3021131 2720383
14507 2720383 2973014 3234465 2873383 2860463 3334792 3139862 2873322 2752195 2985805 3549869
14497C549869l90168J62897k15248L27330K2549J3375K12628m12305J95534K26003
14487C692464j30745m3963L74020l49509q4183L49092j43679J39572j22036L62011
14477D043044r7919j63528L93112j71350J86585k15457K56941k25712K2619J61033
14467D189368J87328J14242N1428J51460k29428L45929j06645k64905J73841J75815
14457D788433J05116q2604K80568Q9979j02384J66687j64759N2333K08693m556
14447E337506R6272n2315J34064P71J68178m9222M82175l20047L91147J73620
14437F362149o88369N27805r3578L84441Q8932O2336K3134L94165j9427k06522
14427F835066L20555O8002J65179k44685K71564L84420p6457j8550J28246J37597
$$ plain form
14497 3549869 3159701 3322598 3107350 3434680 3457229 3470604 3683232 3270927 3466461 3692464
14487 3692464 3561719 3517756 3891776 3542267 3458084 3807176 3663497 3803069 3681033 4043044
14477 4043044 3945125 3781597 4174709 4003359 4189944 3974487 4231428 4005716 4028335 4189368
14467 4189368 4376696 4490938 4542366 4693826 4464398 4810327 4703682 4438777 4612618 4788433
14457 4788433 4893549 4810945 5091513 5181492 5079108 5245795 5081036 5133369 5342062 5337506
14447 5337506 5433778 5381463 5515527 5516298 5684476 5635254 6117429 5797382 6188529 6362149
14437 6362149 5673780 6201585 6108007 6492448 6581380 6643716 6666850 7061015 7041588 6835066
14427 6835066 7155621 7223623 7388802 7144117 7415681 7800101 7723644 7705094 7833340 7970937
14417G970937J07435n8563N35377k36576j01189O23234j28959J94886L49930r3191
14407I163321J79902m2066K03066J02002j1367L15678J84975K46798K27509L7119
14397A0606937K5847J73350N28462K0900K48215J06136N09105P7811R7018L73823
14387A2767604K82647j50168L84098L89288K74381J99793M11400P6709K72928
14378A4908680K65782K75081N23132K30631M28887j9135P52041K36533J76143
14369A7777775M37214L84124M42930M95854N32161L45161J72973N78793O50806
14360B1817791L92080N40948N77264Q09488L49150O69947K23272R12583R07526
14351B7200049N77420P31051J159810N39008Q69869N72034J406739M78351J374711
$$ plain form
14417 7970937 8078372 8019809 8555186 8318610 8217421 8840655 8711696 8906582 9256512 9163321
14407 9163321 9343223 9301157 9504223 9606225 9594858 9910536 10095511 10342309 10569818 10606937
14397 10606937 10632784 10806134 11334596 11355496 11603711 11709847 12218952 12296763 12393781 12767604
14387 12767604 13050251 12900083 13284181 13673469 13947850 14147643 14559043 14635752 14908680
14378 14908680 15174462 15449543 15972675 16203306 16632193 16613058 17365099 17601632 17777775
14369 17777775 18214989 18599113 19042043 19537897 20070058 20415219 20588192 21166985 21817791
14360 21817791 22209871 22750819 23328083 24137571 24486721 25156668 25379940 26292523 27200049
14351 27200049 27777469 28508520 29668330 30207338 31077207 31649241 33055980 33534331 34909042
14342C4909042P38960J037455Q21967J125776J532921J181347J256975J358919
14334D3963362J503651J608847J676393J354805J770312K035931K022587K360858
14326E8296746K200209K315758K850650K521604K672513L075829K896821L693249
14318H0523379L591826M099731M196038M269592N016106M766126N812985N350747
14310A17626530O383398O515585P233757P955397R120281R687303J0519313J1563988
14302A86605552J2820337J3524546J6199445J8132305J9240970K1336644J7927520
14295C05787319J1733494R786019R434234O596501L966506K044955Q348781o1918423
14287B95779386j8990290q364160k373729J846648L782163K580320n301152k872491
$$ plain form
14342 34909042 35648002 36685457 37507424 38633200 40166121 41347468 42604443 43963362
14334 43963362 45467013 47075860 48752253 50107058 51877370 53913301 55935888 58296746
14326 58296746 60496955 62812713 65663363 68184967 70857480 73933309 76830130 80523379
14318 80523379 84115205 88214936 92410974 96680566 101696672 106462798 112275783 117626530
14310 117626530 124009928 130525513 137759270 145714667 154834948 164522251 175041564 186605552
14302 186605552 199425889 212950435 229149880 247282185 266523155 287859799 305787319
14295 305787319 317520813 327306832 336741066 343337567 347304073 349349028 357697809 295779386
14287 295779386 276789096 268424936 266051207 267897855 271680018 274260338 268959186 266086695
14279B66086695J096249J652462J677158K294654L811324M589156O340929J1031747
14271B98580374J4660434J2875613O514265K139154n848549j7400171k3385258
14264B88135862k0537467j5311813r381192m847841j750137j749160j233852l826001
14256B29498399n360157l685809k787626n062295n132082m887427o773109p723930
14248A88085964r671326j2305437j0950383r893720r757870r868622q752063p357103
14240A09529440o541044n246374n542971m750000m597943l848326l380706l553788
14232G2068288k780472l017348l123028k351648k225225k661813k120939j933795
14224E1854020k017401j861041j301849k066604j628832j157627j410345j679702
$$ plain form
14279 266086695 267182944 268835406 270512564 272807218 276618542 281207698 287548627 298580374
14271 298580374 313240808 326116421 332630686 334769840 328921291 311521120 288135862
14264 288135862 267598395 252286582 242905390 238057549 236307412 234558252 233324400 229498399
14256 229498399 224138242 220452433 217664807 212602512 207470430 202583003 195809894 188085964
14248 188085964 178414638 166109201 155158818 145265098 135507228 125638606 116886543 109529440
14240 109529440 102988396 97742022 92199051 87449051 82851108 79002782 75622076 72068288
14232 72068288 69287816 66270468 63147440 60795792 58570567 55908754 53787815 51854020
14224 51854020 49836619 47975578 46673729 44607125 42978293 41820666 40410321 38730619
14216C8730619r63194j286681j068121r67425r44336j007378r41106j012458p89936
14207B9749984o89976n60963j046781o01926r88637p21826m86327k34198q02446
14198B3616904o02765q61722m09018m98005r03275r571m62993n59359m10338l43022
14188A8556836o76180P6744o32533k41257k67940l94839m07757j72292m67564
14179A5373218n80253j22534m83298k66685p1489J57858q01497r6798k17416n74599
14169A2316507q3939M3943k03278k61980l95274K5313j25165m32632o759j82485
14159A0694251j74624j30502l13445k66302k68473P4789l33412j34460J76243
14150I324065l50424J90488m22457k59883l10473r7352N904n2673j31467j89695
$$ plain form
14216 38730619 37767425 36480744 35412623 34445198 33500862 32493484 31552378 30539920 29749984
14207 29749984 29060008 28499045 27452264 26850338 25861701 25139875 24653548 24419350 23616904
14198 23616904 23014139 22152417 21743399 21245394 20342119 20332548 19869555 19310196 18899858 18556836
14188 18556836 17880656 17957400 17324867 17083610 16815670 16420831 16013074 15840782 15373218
14179 15373218 14792965 14670431 14187133 13920448 13848959 14006817 13205320 13108522 12891106 12316507
14169 12316507 12232568 12276511 12073233 11811253 11415979 11441292 11316127 10883495 10876736 10694251
14159 10694251 10519627 10389125 10075680 9809378 9540905 9615694 9282282 9147822 9324065
14150 9324065 8973641 9164129 8741672 8481789 8171316 8073964 8079868 8027195 7895728 7706033
14140G706033k85891K63058n60132K31219M0016k28907k93356o4323K88507l53394
14130F742830k85972L71023k64257j02753M4448r814k95662l32850O5954k88674
14120E644273j46322L42694j12116k82658L35540l77899j83316O9217o0716J40030
14110E368727k48919Q9088k45485j50867J83150j09603l7361l0091M6296j894
14100D863041J00434p37957K56454J80376j14637k73474j57498k3750K11721n73895
14090C730815J65593R0235q8781K02360k34642J3599O4404k26037Q5225l9247
14080C763524l71753J66825J75556j10688O7225J60619n49813P5029L6732q4680
14070C328576M2290l163o4026j86927J81769j98949L5549J14766j69903j43882
$$ plain form
14140 7706033 7420142 7683200 7123068 7354287 7394303 7165396 6872040 6807717 7096224 6742830
14130 6742830 6456858 6827881 6563624 6460871 6505319 6495505 6199843 5866993 5932947 5644273
14120 5644273 5497951 5840645 5728529 5445871 5781411 5403512 5220196 5289413 5228697 5368727
14110 5368727 5119808 5208896 4963411 4812544 4995694 4886091 4848730 4818639 4864935 4863041
14100 4863041 4963475 4225518 4481972 4662348 4547711 4274237 4116739 4092989 4304710 3730815
14090 3730815 3896408 3986643 3897862 4100222 3865580 3879179 3943583 3717546 3802771 3763524
14080 3763524 3391771 3558596 3734152 3623464 3690689 3851308 3301495 3376524 3413256 3328576
14070 3328576 3370866 3367703 3303677 3116750 3298519 3099570 3135119 3249885 3079982 2936100
14060B936100M68443l77092K59346l74535N2640l94932K42254n8535l6950J8699
14050B735438k20504K64203J07450l55020K71745k45520O4585k57989j11424J73507
14040B426471L8776j6126J56688m79913J58804j34060L17098k37840J69513K96243
14030B695654k88755l29247K05851l29830N4773k01232K12284K1488K02344l46280
14020A897050J47793j50440o266J03354j12896l86141N15373J63089l6753L23667
14010B457830N11345P05414M61329R08978J280664R53257j195169n83255j12648
14001E387745l71957j13048L1139J28887l1013j33762Q738j96513L56164K49801
13991E316181m60583M21141K17398Q02368M40907R80392L84540j738430j139429
$$ plain form
14060 2936100 3404543 3027451 3286797 2912262 2964902 2569970 2812224 2753689 2716739 2735438
14050 2735438 2514934 2779137 2886587 2531567 2803312 2557792 2622377 2364388 2252964 2426471
14040 2426471 2465247 2449121 2605809 2125896 2284700 2150640 2467738 2229898 2399411 2695654
14030 2695654 2406899 2077652 2283503 1953673 2008446 1807214 2019498 2040986 2243330 1897050
14020 1897050 2044843 1894403 1888137 1991491 1878595 1492454 2007827 2170916 2134163 2457830
14010 2457830 2969175 3674589 4135918 5044896 6325560 7278817 6083648 5500393 5387745
14001 5387745 5015788 4902740 4933879 5062766 5031753 4897991 4906729 4710216 5066380 5316181
13991 5316181 4855598 5276739 5494137 6296505 6737412 7717804 8102344 6363914 5224485
13982E224485q41544p12527k73303j38554n7720K66570l70219J76110l50648M4512
13972B967162j89442K21201m37975j23385k12547R6206j10256m68807L61155n19099
13962A584213J34304m8067j44634L05880q6727m14441M87912n87551J72155R4114
13952A497158L9398k0751R9016k63146Q0448l98882L43302l14951L13073j1345
13942A363320K50385l29064J65825k46530j91071K41529q9186K43252j83573j1138
13932A213749J24664Q8175k64445J47635n2482m5372K37735o4089j85314k00276
13922I99980J22556l33724L04554M9168K56768k82316k00991K20359k41775J49048
13912A043627O8167l03161K48749m9536J42209j32429j04055K15839k69743o7713
$$ plain form
13982 5224485 4382941 3670414 3397111 3258557 3200837 3467407 3097188 3273298 2922650 2967162
13972 2967162 2777720 2998921 2560946 2437561 2225014 2321220 2210964 1742157 2103312 1584213
13962 1584213 1718517 1670450 1525816 1831696 1744969 1330528 1818440 1230889 1403044 1497158
13952 1497158 1536556 1515805 1614821 1351675 1432123 1033241 1376543 1061592 1374665 1363320
13942 1363320 1613705 1284641 1450466 1203936 1012865 1254394 1165208 1408460 1224887 1213749
13932 1213749 1338413 1426588 1162143 1309778 1257296 1211924 1449659 1385570 1200256 999980
13922 999980 1122536 788812 1093366 1142534 1399302 1116986 915995 1136354 894579 1043627
13912 1043627 1111794 808633 1057382 1007846 1150055 1017626 913571 1129410 859667 791954
13902G91954L12978l98563N25963k93962j96773N36100j67006m9438p9737j38537
13892H42979j89171K33552k50711K50467j4148J23540o755k40743q6349O4312
13882G26973J42434J6147j63130L04187o0635Q431p9045j40456K96357r1063j79295
13871G80905J90388j10489j05149R7995r911k15757K72444j91210L44800p2128
13861I81888l06503k2016K46860o3156j39405R296k1175K8569J69963m15762K42088
13850G10647L37708l16286j37307J48444k34436K98578n559k72031K76063L0179
13840H36000o4098m9301L2807J21237J1738k60608m1564M1479J23238Q3644K11331
13829A045903l75039K38688j68505j42223j47366K18173k23588N15160m04826
$$ plain form
13902 791954 1104932 706369 1232332 938370 741597 1277697 1110691 1061253 981516 842979
13892 842979 653808 887360 636649 887116 872968 996508 989753 749010 662661 726973
13882 726973 869407 885554 722424 1026611 965976 974407 895362 754906 1051263 960200 780905
13871 780905 971293 860804 755655 853650 843739 627982 900426 709216 1054016 981888
13861 981888 675385 653369 900229 837073 697668 706964 685789 714358 884321 468559 710647
13850 710647 1048355 732069 594762 743206 508770 807348 801789 529758 805821 836000
13840 836000 771902 722601 755408 876645 888383 627775 586211 627690 750928 834572 1045903
13829 1045903 670864 909552 741047 598824 451458 669631 446043 961203 556377
13820E56377Q1456J3947k32917N33499j68231k71153j9010J11683l4980J28819
13810F99490l4615K4643J35739j56926j86465J56778J64066j48503o2008j7068
13800E75131N3565Q4090K0352B77529J36863J94268r8439L78073k16053B81478
13789G68349K18559D86868K3565K16187l59675J22299R2962j96480j42657J87032
13779D30101J43184j8811L12959l90224L5845j87104N15110k54208k1860l8169
13769E26823J85922j00348j14248l9352R4157j14495K12762j46750j45908K58888
13759F17451N1121B02063L37098J9464O1506j04501p8898R9338J63320r6710k46559
13748C56121N642C300M48404n4451L62868B34245K09712l0632A15224L98071p7352
$$ plain form
13820 556377 637833 651780 418863 952362 784131 512978 493968 605651 570671 699490
13810 699490 664875 689518 825257 668331 481866 638644 802710 654207 592199 575131
13800 575131 628696 712786 733138 277529 414392 608660 510221 888294 672241 281478
13789 768349 986908 486868 510433 726620 366945 489244 582206 385726 243069 430101
13779 430101 573285 554474 867433 477209 513054 325950 841060 586852 564992 526823
13769 526823 712745 612397 498149 458797 552954 438459 651221 504471 358563 617451
13759 617451 668572 202063 539161 558625 620131 515630 436732 536070 699390 602680 356121
13748 356121 361763 3300 451704 397253 760121 234245 443957 413325 115224 513295 435943
13737D35943J35430j48309j2017K19229A42012K31149A09413N32697j26859B06591
13726B45647J53595j99128L81669B73670L28726A18063M29550R1859j94703L7439
13716D82208J70001B91500K5750K42462L87747A91153K11294L83096F3327M83198
13706E46525Q096k00469K72731j01273m6493p3795q5005K49324B32015J9964L66346
13695F18325k25640R0674H1918M90567P0412l09817J06314J96543A96846R9635
13685B96481P7940n0683j29723J03629L8233J3463K440N1581J6619Q4072p8149
13674D25903Q581n7018J71589K7366k27934J11154n1488j38944p7697L37182N7291
13663E85985q8767A72294K25275j35373K44778m6838B23455l832J87612N5585
$$ plain form
13737 435943 571373 423064 411047 630276 142012 373161 109413 642110 515251 206591
13726 245647 399242 200114 581783 273670 602396 118063 547613 639472 444769 482208
13716 482208 652209 291500 317250 559712 947459 191153 402447 785543 63327 546525
13706 546525 554621 354152 626883 525610 479117 405322 320317 569641 232015 251979 618325
13695 618325 392685 483359 81918 572485 642897 333080 439394 635937 196846 296481
13685 296481 374421 323738 194015 297644 335877 349340 351780 403361 419980 504052 425903
13674 425903 434484 377466 549055 576421 348487 459641 408153 269209 191512 528694 585985
13663 585985 497218 172294 397569 262196 506974 460136 223455 219623 407235 462820
13653D62820j91859l0091J40732J4779j42996j20934N463J732K20188k9171j37555
13642A93108J14884o7582r6399J80202l0233J1127G6759K53775J53539B18154
13631C87096J34443j73318j69778Q8780L4939j8975J88602j0707j7419a39053
13620B14885K72945k26127a05235B36719m544H8141J04872D5715K00559a53679
13609C09516A25825J42795l197J9661J17666B00356K48943j85827A15512L8372
13599A53884J60981L77943B67145q0557J35555O9598j58558q3745J61113J3366
13589C23917L08652G2279L29251A25423B456K17449o5851J04397Q8679j49215
13579A97915Q9802K29725A18512K58145A87786j4211j2912O6753A03517K63745
$$ plain form
13653 462820 270961 240870 381602 396381 253385 132451 137914 139646 359834 330663 193108
13642 193108 307992 240410 144011 324213 293980 305107 76759 330534 484073 218154
13631 387096 521539 348221 178443 267223 302162 283187 471789 461082 443663 -139053
13620 214885 487830 261703 -105235 236719 232175 88141 193013 45715 246274 -153679
13609 309516 125825 268620 265423 285084 402750 200356 449299 263472 115512 153884
13599 153884 314865 692808 267145 186588 322143 391741 233183 149438 310551 323917
13589 323917 632569 72279 401530 125423 2456 219905 154054 258451 347130 197915
13579 197915 287717 517442 118512 376657 187786 173575 160663 227416 103517 367262
13569C67262L73A36876K46262O5545B05084N7296n2737K0415Q2117p4722n0354
13558A87099k0693g4617F21248A39825R6698D3907M19011j72744l5740n0773Q2216
13547B85877L18174F6742L9433O9612K4890L12176j37211j05750N8782j56888
13537A71786l3644K92365C7258J69331P4101q5606L08437G7944O50539k17310
13527E11173c0504B33836L52514B17509j06070J71294P6066q8523J38098R6268
13517E04642j70928N1950j22319o5708K54093h041B56393O1856A05461J6935J02384
13506B24780k5070J80168j87107k676f1011A00720M52564B50416E4103P0156K67099
13495C91358J91392E7050J78409K6417Q2497a54888C19512C2865K30331J18751
$$ plain form
13569 367262 367635 136876 383138 448683 205084 262380 209643 230058 312175 237453 187099
13558 187099 166406 -74617 621248 139825 236523 43907 462918 290174 254434 203661 285877
13547 285877 604051 66742 106175 175787 200677 512853 375642 269892 328674 171786
13537 171786 138142 430507 37258 206589 280690 195084 503521 77944 728483 511173
13527 511173 -30504 233836 586350 217509 111439 282733 358799 270276 408374 504642
13517 504642 333714 385664 263345 197637 451730 -8041 256393 318249 105461 122396 224780
13506 224780 199710 379878 192771 190095 -61011 100720 553284 250416 54103 124259 391358
13495 391358 582750 57050 235459 261876 344373 -154888 319512 32865 263196 381947
13485C81947D4620J70101M9149I7865L21491c2346B58969J0889f507q7166C56673
13473B33314A0693M44490j53816j36338B3737J98839j01568L21221A56751F4958
13462I8734j3464m2436k1078M29844j21304j52946g49D64181b01927A64794C2475
13450B36849K1230N2954l3637Q4984A66022o6647K82704j15376I1901a53445L2690
13439a20755B32383g354C0233P4830b3995C65946C2461K23228L38832A84795g1922
13427A85057b00725B40519H4374P869I173e0778A87912e3055D3113M25788A89619
13415B64654m7582H5301K84373A53286J18702H2818L35195j39047D0795J51462
13405A92257j1018q4686P6268L7902Q9565m6972A20163K1146P9957c5475H9978
$$ plain form
13485 381947 44620 214721 263870 97865 419356 -32346 258969 269858 -6507 -93673 356673
13473 233314 10693 455183 301367 165029 23737 222576 121008 442229 156751 64958
13462 98734 85270 42834 21756 451600 330296 177350 -749 464181 -201927 164794 32475
13450 236849 258079 311033 277396 362380 166022 99375 382079 266703 91901 -153445 -120755
13439 -120755 232383 -7354 30233 105063 -23995 365946 32461 255689 594521 184795 -71922
13427 185057 -200725 240519 84374 92243 9173 -50778 187912 -53055 43113 468901 189619
13415 264654 217072 85301 369674 153286 271988 82818 418013 278966 40795 192257
13405 192257 181239 96553 172821 210723 300288 253316 120163 141309 221266 -35475 89978
13393G8607J98154H5258J03476D6777J16442N4744A0993K4147L10628A52470J10054
13382B62524a19478D93396d6841C12297D9465a24071B32028H2886J70960A02723
13371B65382b75933b3167B74654q9353o3536K7442g7180l1950B88918O2160H4312
13359A24149M7813n2978J91931n0721A1416K42492J66843j10925A44000B2518
13348A51217a24603G7537R8158O9759L2996j31223l722d4252j90688D09666c128
13336A18720P8247a94335A15702g4644F5386J58136M5529m9515J73053B9112N4234
13325H3346J78721b17494F9091j0508j1995K70748G1723k6369J63392E2109K57645
13314C09754n1294P8849A26352C6315L6729A1456O700Q3304m9290K48343b33070
$$ plain form
13393 78607 276761 85258 188734 46777 163219 217963 10993 35140 345768 152470 262524
13382 262524 -119478 493396 -46841 312297 49465 -124071 232028 82886 253846 102723
13371 265382 -275933 -23167 274654 185301 121765 149207 -77180 -109130 288918 351078 84312
13359 124149 171962 118984 310915 260194 11416 253908 420751 309826 144000 22518
13348 151217 -124603 77537 175695 245454 278450 147227 143505 -44252 -234940 409666 -3128
13336 118720 196967 -194335 115702 -74644 65386 223522 269051 219536 392589 29112 83346
13325 83346 262067 -217494 69091 58583 46588 317336 71723 45354 208746 52109 309754
13314 309754 258460 337309 126352 36315 73044 11456 18156 101460 52170 300513 -233070
13302a1594j4447B51360a78881C29213a64288k05605A37468J36621A31891f8591
13291C26863j42599J05392B0953J25140O789f587j63454C3132L31151H9210L27487
13280D16697A28007J06318A01021K26084j20480a62548B37859J54406c9522D2499
13269C8577J02135k5551M3185p2306b06203f7575C75722F800g1130l6103N2060
13258e5173C39717H419J61185a11087A99111b74846g1660A92326N2819b77116
13247A59575K40117A41312C6049a29545B76766b82160A37955b176q7884C25059
13236C75123j42862c757H9920O9957K1265b41397E6237Q2088B4552K05260B759
13224g6120A58404D7025K62301F8423J97379H6081a12491C12391A1246N43017
$$ plain form
13302 -11594 -26041 251360 -178881 329213 -164288 -369893 137468 274089 131891 -68591
13291 326863 184264 289656 20953 146093 152882 -6587 -170041 33132 364283 89210 416697
13280 416697 128007 234325 101021 327105 206625 -162548 237859 392265 -39522 42499
13269 38577 140712 115161 158346 86040 -206203 -67575 375722 6800 -71130 -107233 -55173
13258 -55173 339717 8419 169604 -111087 199111 -274846 -71660 192326 245145 -277116
13247 159575 399692 141312 36049 -129545 276766 -282160 137955 -2176 -90060 325059
13236 375123 232261 -3757 89920 159877 181142 -241397 56237 138325 24552 229812 2759
13224 -76120 158404 47025 309326 68423 265802 86081 -112491 312391 11246 554263
13214E54263D956L98198j94201b74960A45582d9825E8453Q9866P4828E1067b4581
13202C20191o2334a14573E2062E647Q7489P4594E6028C542O0326J4255B7932J74589
13190B02521b2098A4562b75540J02412A56239J67420A01242J6233a09456J2508
13180i6948r8003c9714J437h700o0426C16041a61043b8234D70922p6106k7538
13169C67278a2432B69614n4396K16287k02442K1588p1727a34349m1416F1638B5834
13157D16585a69221b0180k23284C14379b28365A29893m9552b35272B1089i5394
13146B49811L05985b59157a24799D2893i1387B07267Q279q2524a68990B04399
13135A25858C3453M3685c030H703J1455d6262j5685A35879F6494J51811f5438
$$ plain form
13214 554263 4956 403154 208953 -274960 145582 -49825 58453 148319 223147 51067 -24581
13202 320191 257857 -114573 52062 5647 93136 167730 56028 3542 63868 78123 27932 202521
13190 202521 -22098 14562 -275540 -173128 156239 323659 101242 117475 -109456 -96948
13180 -96948 -194951 -39714 -38277 -8700 -69126 316041 -161043 -28234 470922 394816 367278
13169 367278 -12432 269614 215218 431505 229063 250651 178924 -134349 -175765 61638 25834
13157 416585 -169221 -20180 -243464 314379 -228365 129893 80341 -235272 21089 -95394
13146 249811 555796 -259157 -124799 42893 -91387 207267 215546 133022 -168990 204399
13135 125858 33453 77138 -3030 8703 20158 -46262 -61947 135879 66494 218305 -65438
13123D9977k4385c7486B04606H6776e2376B7445K13563k0419r8055a05083A51770
13111a2514A9766K5944j634A4896a50947l280A64049l6660D3970J74558G7671
13099B90306B2262Q6387K4864i0573B9031b25325D97462a13619A5723M8711M0933
13088A05367K74433b08586A06078a27017I516Q6485j7924b4515A01981g1953D43391
13076A62972f9082j03697E9248q627R768c07096J00798Q9089G5553k7683m418
13065D3452L03021E2885a42463A43823F3947g1847G4090J0719J30964E7242j4938
13054D2304a34192j1985r4712D8888J89317a97522D12758A84406n1754E8553b85776
13042g2343G9191d8808A57341E488d0869B34776a06335D11942A22044J51178h5998
$$ plain form
13123 49977 25592 -37486 204606 86776 -52376 27445 241008 220589 122534 -105083 151770
13111 -12514 19766 45710 44076 14896 -150947 -154227 164049 127389 43970 218528 77671
13099 290306 22262 108649 133513 -90573 29031 -225325 497462 -113619 15723 64434 105367
13088 105367 379800 -208586 106078 -127017 9516 96001 78077 -24515 101981 -71953 443391
13076 162972 -69082 -172779 59248 50621 60389 -307096 -206298 -117209 75553 47870 43452
13065 43452 346473 52885 -142463 143823 63947 -71847 74090 84809 215773 57242 42304
13054 42304 -134192 -146177 -240889 48888 238205 -197522 412758 184406 132652 58553 -285776
13042 -72343 79191 -48808 157341 5488 -40869 234776 -106335 411942 122044 273222 -85998
13030f6068A00495b29774A64330B0346J65169m5006K6449G2347A4315f7791A39695
13018I0308J68027d4101B90381c5388a0994A52710b00839c1620I7392a69240B4752
13006F4504b53553f2654h701q2388B65470F8598J31481j7763J54872J88568c5438
12994I59J88273c4007A22546C0723L20173a07713A01392J13444L3010A09658J09434
12983B19092i6513D8118d988I9932a42776f139o391D6635e4966p0510F8902a17029
12970E1021K13174m1026l7201k4924b06269k35091D35854a65855A73108H3471
12959F2018b2828Q099j61599O1548B82001N7272A25362B0440c4626k4291B502
12947B71151a26936B54267a54707A39907E6387a1536A7507J00314J55632b71377
$$ plain form
13030 -66068 100495 -229774 164330 20346 185515 140509 166958 72347 14315 -67791 139695
13018 90308 258335 -44101 290381 -35388 -10994 152710 -200839 -31620 97392 -169240 24752
13006 64504 -253553 -62654 -8701 -91089 265470 68598 200079 182316 337188 525756 -35438
12994 959 189232 -34007 122546 30723 350896 -107713 101392 214836 247846 109658 219092
12983 219092 -96513 48118 -4988 99932 -142776 -6139 -12530 46635 -54966 -125476 68902 -117029
12970 51021 264195 223169 185968 161044 -206269 -441360 435854 -165855 173108 83471
12959 62018 -22828 -14729 -176328 -114780 282001 339273 125362 20440 -34626 -58917 2502
12947 271151 -126936 254267 -154707 139907 56387 -11536 17507 117821 273453 -271377
12936B12485b60563D430M7712a05702a6431A42650J14289k450r7450b33587P0278
12925a63309B28073b13939e2770J4960I986J04598J03614j284M525J727D9030
12913B54782a3949B29100a79019g9087B48605c2264C82523D5047B0671J47308
12903A67979a12608K1083a4441r7464j1065C08406e9445J1230C5803J04787a56568
12891A61326F3557e1585B37330b90687h2154B69649h0313j74715g5041C2353a46968
12879E6615a67190C71518h2411I2117b19483B69679q5423c184A59143F2761B6652
12867B19881d1174o2703b2433A18414e2093B02362J78399G8684C4569a55895A06092
12855a41222H3744O0576K52838j78151d4418o0301A27089h2973B06780a63837
$$ plain form
12936 212485 -260563 4430 52142 -105702 -16431 142650 256939 254489 157039 -233587 -163309
12925 -163309 228073 -213939 -52770 -37810 9986 114584 218198 216914 221439 223166 49030
12913 254782 -13949 229100 -179019 -79087 248605 -32264 382523 45047 20671 167979
12903 167979 -112608 -91525 -14441 -111905 -122970 308406 -59445 -48215 35803 140590 -156568
12891 161326 63557 -51585 237330 -290687 -82154 269649 -80313 -255028 -75041 32353 -146968
12879 56615 -167190 371518 -82411 92117 -219483 269679 184256 -3184 159143 62761 26652
12867 219881 -41174 -103877 -22433 118414 -52093 202362 380761 78684 34569 -155895 106092
12855 -141222 83744 144320 397158 219007 -44418 -104719 127089 -82973 206780 -163837
12844h5293b1624A5916J14570D9148g0111l7736B12670a94988B46162e8870k2372
12833h1242B42016d9699A64807a38277G5299c82321a3701A04478c21044i6456
12822A6177a07910A61189a46970H6507j3745J21815l4773p6475E13K74510h7035
12810I9582e2978J9880A10108m4254P9883k5286b53534G3832K82264A43785a4001
12798f5112A08228K5124g4001i773k39023I2238O9462a83268j15791F788b07001
12786b08411c8291A24543A5512P4489J31725M5659A14586m8366i6959H391g2391
12774a17252o6804B05589E4551g4025A4372K00514a59801B50252d8577L191A77571
12762e36769C3792a58558L9455o7137A92983N7470b34986A22991O7198i6686A16484
$$ plain form
12844 -85293 -21624 15916 130486 49148 -70111 -107847 212670 -194988 246162 -58870 -81242
12833 -81242 242016 -49699 164807 -138277 75299 -382321 -13701 104478 -321044 -96456
12822 16177 -107910 161189 -146970 86507 72762 194577 159804 83329 513 275023 -87035
12810 99582 -52978 -33098 110108 65854 145737 120451 -253534 73832 356096 143785 -14001
12798 -65112 108228 133352 -74001 -9773 -248796 92238 161700 -183268 -299059 6788 -207001
12786 -208411 -38291 124543 15512 90001 221726 267385 114586 66220 -96959 8391 -72391
12774 -117252 -184056 205589 54551 -74025 14372 214886 -159801 250252 -48577 -45386 177571
12762 -536769 33792 -158558 -119103 -186240 192983 250453 -234986 122991 190189 -96686 116484
12750A85427I1216B2002o162a2038A64511c17738F8811J41145b42199C7377a16407
12738g0079B13368b6387k9745C34902A03048A8740g0059o3764A4186A046a10922
12726a95617j12097J25916k6619A28079B3956h8659k0187k26652h7567a8838j60156
12715a78994m5248e739l36701J20439B18415g4917D12219b399j6530B58425D9068
12703B79720b56900A72424H0763P1394L539a22213j66451I6546L6929b12289L143
12692b09146A72802e5608C50741f9280B8406a13046E1676b94489G3329b2470C17226
12680c9811l1695A38829m6479D4658J88219L0936A15663b82672J5332d8903A3279
12668A32158a28742A72897a52275B45531e3061F3767J88178A06750l1944M3452
$$ plain form
12750 185427 91216 22002 15840 -12038 164511 -317738 68811 209956 -242199 37377 -116407
12738 -70079 213368 -26387 -56132 334902 103048 18740 -70059 -133823 14186 1046 -110922
12726 -195617 -307714 -181798 -208417 128079 23956 -88659 -108846 -335498 -87567 -18838 -178994
12715 -178994 -224242 -5739 -342440 -222001 218415 -74917 412219 -2399 -18929 258425 49068
12703 279720 -256900 172424 80763 152157 155696 -122213 -288664 96546 133475 -212289 -209146
12692 -209146 172802 -55608 350741 -69280 28406 -113046 51676 -294489 73329 -22470 317226
12680 -39811 -71506 138829 92350 44658 232877 263813 115663 -282672 -267340 -48903 13279
12668 132158 -128742 172897 -152275 245531 -53061 63767 251945 106750 74806 118258
12658A18258d2096b0595E26987A52264b60287B89028D8905k857K03973o3903C5340
12646B88413j02911p2776J32837a22282B4383K15090K24665c03773F7961J44531
12636B12492j3537q2531D3526K23897K9304a31920M5860n0610p2655g3449c0744
12624e4484a635G4248g2229D144K02005a01324A32984a45917C35639c0351E0153
12612C68185D1385P8657L00121e9208H1112g0450L1368E7522b70668A11081E4557
12600B82271B1069i5850k34915B60786B0755b30559H6154k2165J07209c19060
12589a86211H9521A8956L6369L3053O8344B4421b5298j06372j3920F2511J31598
12578A94109q5438l1341e8928C5537a28251k6512B3018c34557g7520O267A10977
$$ plain form
12658 118258 -42096 -20595 526987 152264 -260287 289028 48905 46048 250021 186118 35340
12646 288413 185502 112726 245563 -122282 24383 239473 464138 -303773 67961 212492
12636 212492 198955 116424 43526 267423 296727 -131920 -86060 -136670 -209325 -73449 -30744
12624 -54484 -1635 74248 -72229 4144 206149 -101324 132984 -145917 335639 -30351 50153
12612 368185 41385 120042 420163 -59208 81112 -70450 -39082 57522 -270668 111081 54557
12600 282271 21069 -95850 -330765 260786 20755 -230559 86154 63989 171198 -319060
12589 -186211 89521 18956 55325 88378 156722 24421 -25298 -131670 -145590 62511 194109
12578 194109 108671 77330 -58928 35537 -128251 -154763 23018 -334557 -77520 -71253 110977
12566E8596h3067j2998A71154K5361a96149A62044M5848f2761J4694k33351I0291
12554h2426A94494c4662C79074A3700J44b5020A80784O2054r5591b07006c4939
12542B27336a882p1690B58407a7370n1182q5204A69818n0734a8678A98622I14
12530a56594C0834K09597A11854a35374A86021K3374a31418A35822G563L21062
12520C28625A2482Q3413K6983m5279a42607C80583A43663b26473g1078C04719
12509E7179A288P6070a21685B44424D7954J10521J71437b40369D9468b72353d3798
12497B12820d9959D27587F0360d2658k00042C43560A1551J83879b66970B8894
12486A6204J70499c23104H205J70602H1365i6559A68201b07271D1415j8828h1162
$$ plain form
12566 58596 -83067 -96065 171154 196515 -196149 162044 207892 -62761 -48067 -281418 90291
12554 -82426 194494 -34662 379074 13700 13844 -25020 180784 242838 147247 -207006 -34939
12542 227336 -1882 -73572 258407 -17370 -68552 -153756 169818 119084 -18678 198622 914
12530 -156594 30834 240431 111854 -135374 186021 209395 -131418 135822 7563 328625
12520 328625 12482 95895 122878 77599 -142607 380583 143663 -226473 -71078 304719
12509 57179 1288 77358 -121685 244424 47954 158475 329912 -240369 49468 -272353 -43798
12497 212820 -49959 427587 60360 -42658 -242700 343560 11551 195430 -266970 28894
12486 16204 186703 -323104 8205 178807 81365 -96559 168201 -207271 41415 22587 -81162
12474a8680A73721c5205m07250B9319b01017Q5584G3957R2760B3095m314J51429
12463A70210j8103F2884i5446c1311J2504o763o4028H1288e7956j08208B2120
12451C18145A34991c60277b3625A13508g9991m8758A4916a01025A32090l9488
12441I2602f8231p1864A85173C7531A606a73564m7807B37453F1239a22179M6633
12430g5546l1672a5100j96525g8935B91395G4598a33F1701e4486B05140A1103
12418A79719g8711j36233b5127p4245F7893a96769A3773j679a01636B0920Q8869
12407A09789c3212E9071J12061F6596B2767b0984F0664L8449b45691h0389I9068
12395B42482I34a93768G1050a58994J8664l5369M8521k06725a30570B33853o168
$$ plain form
12474 -18680 173721 -35205 -442455 29319 -201017 -115433 73957 166717 23095 18781 170210
12463 170210 152107 62884 -95446 -31311 -18807 -25570 -89598 81288 -57956 -166164 22120
12451 318145 134991 -360277 -23625 113508 -79991 -128749 14916 -101025 132090 92602
12441 92602 -68231 -140095 185173 37531 1606 -173564 -221371 237453 61239 -122179 -75546
12430 -75546 -107218 -15100 -211625 -78935 291395 74598 -133 61701 -54486 205140 11103
12418 179719 -78711 -214944 -25127 -99372 67893 -196769 13773 12094 -101636 20920 109789
12407 109789 -33212 59071 171132 66596 22767 -20984 60664 99113 -245691 -80389 99068
12395 242482 934 -193768 71050 -158994 -140330 -175699 -127178 -333903 -130570 233853 227685
12384B27685E0635d02368B0421a35364D0680J86711a76010d1049N722B75b45725
12372a88594J9179P3312j4865I8387a66216C40787A36952Q7986F8850c55040c2281
12360a69704e2859A57478c0599B72755F2749K6038l5964h5693A44300b58912N9424
12349a99488B60872o9096b3897B6075L25220E5675a45318P599M9738B64616a7225
12337G8912L3507l8984c25252f6028p4446A55703a72788A09802C3748J26430E9275
12325a24395j78854f119j08839b9361j95953I0295a37538B2168R9604b40747J11855
12314a28892j9000a469m5139A57773K8556a41562j11311J04619e9077l16208G3881
12302A53394J58440A45107h9583a5318k1640j806A06783e0290o965a9346A21934
$$ plain form
12384 227685 50635 -402368 20421 -135364 40680 227391 -176010 -41049 -35327 275 -245725
12372 -188594 -169415 -96103 -110968 98387 -166216 340787 136952 224938 68850 -355040 -32281
12360 -169704 -52859 157478 -30599 272755 62749 88787 52823 -85693 144300 -258912 -199488
12349 -199488 260872 191776 -23897 26075 351295 55675 -145318 -137719 -87981 264616 -17225
12337 78912 112419 73435 -325252 -66028 -140474 155703 -172788 109802 33748 160178 59275
12325 -124395 -303249 -6119 -114958 -29361 -225314 90295 -137538 22168 121772 -240747 -128892
12314 -128892 -147892 -1469 -46608 157773 186329 -141562 -252873 -148254 -59077 -375285 73881
12302 153394 311834 145107 -89583 -15318 -36958 -38764 106783 -50290 -57255 -19346 121934
12290C15211i4171A05095J59063d8390q0441B92960j02801B5621d5641j65309
12280b10950R7187J2007C43039j17003f3935H2280N3268B1357K60737A04192a18691
12268H8147l3600b12302b2208r0592B4635K10642d890C85822l6097j63480r990
12257A76255h9412f395A0275c47618A00040J5884J31993D4588J86591j09976h4426
12245E6448f5918H1921h7755q8599D3573a51934E20080a93025G1833P2038p268
12234A36603f4794A51390C1534C219R8033J27211a01798M5634E2294J61715B9594
12222A1361d4470A08553B774L5045L26917j47850j05949R50L19973k07807a28960
12210A58733c5756D4763K54911d1431A1373i5526G7746l6894J38343F0275J00124
$$ plain form
12290 315211 -94171 105095 264158 -48390 -128831 292960 190159 25621 -45641 -210950
12280 -210950 -113763 -101756 343039 226036 -63935 82280 135548 21357 282094 104192 -118691
12268 88147 54547 -212302 -22208 -112800 24635 235277 -4890 385822 349725 186245 176255
12257 176255 -89412 -6395 10275 -347618 100040 115924 247917 44588 231179 121203 -84426
12245 56448 -65918 81921 -87755 -176354 43573 -151934 520080 -193025 71833 143871 136603
12234 136603 -64794 151390 31534 3219 101252 228463 -101798 -56164 52294 214009 29594
12222 11361 -44470 108553 2774 37819 364736 216886 110937 111887 431860 224053 -128960
12210 158733 -35756 44763 299674 -41431 11373 -95526 77746 40852 179195 60275 160399
12199A60399m5753J11767j5736b39489D7496a45625B45428P4796j09953b20437
12188F8278K1070b00276C02495j04626F6689b4508A47130j9033J77551j04377
12178B01271R8875a69607B43980b42553H0494h6597A2648R0342K14846b59887
12167A3088a68614F1082a02068A60876o6144b70503H6229i0857L9797A31869n8371
12156G3498P9758n9972B3639Q8L03597n9118c41966A15157A6855g1659m085j32874
12144b08618A53283i9081H8597b6013I0151d7447C61368d1652q7528k6496A88901
12132D47328a970j10436B66064E1860K48208l2036A25333R9683A9280d070k75771
12121b79841f1034A13258A2438i9147b892A99275d0231l6247A37969h8495D8106
$$ plain form
12199 160399 114646 226413 210677 -239489 47496 -145625 245428 320224 210271 -220437
12188 68278 89348 -200276 302495 197869 66689 -24508 147130 128097 305648 201271
12178 201271 300146 -169607 243980 -242553 80494 -86597 12648 102990 317836 -259887
12167 13088 -168614 61082 -102068 160876 94732 -270503 86229 -90857 -51060 131869 73498
12156 73498 153256 93284 23639 23727 327324 268206 -341966 115157 16855 -71659 -75744 -208618
12144 -208618 153283 -99081 88597 -26013 90151 -47447 361368 -41652 -129180 -155676 188901
12132 447328 -1970 -112406 266064 51860 300068 268032 125333 225016 19280 -4070 -279841
12121 -279841 -61034 113258 12438 -99147 -2892 199275 -40231 -76478 137969 -88495 48106
12109A18646b43047A36393e1725G2266a92625E8025e3435A88557H9010J3092J12836
12098B14938b91733a3233D7130L56989j36686K04268K24669I9435J73654A10229
12087a7532A84888J37669A13698m9579b18922B70126b7446D3068K05571C2184
12076C21167p1991J91977m7467J64644B42165o2715q8282a18238o6279B43576
12065e5051n8922B33979o9528P0531F0431J93623r5144a49647B2601g4752j45960
12054b20712A55147a95854H1378f6082A25959b09872c438A75672i8276L9366a4799
12042G141M0207b77845A64983b9396k57912F3871e35486a48088C9176a34383j55783
12031b90166J35763r0337G4345K63576a73456O3299A1972J15685b55012A36712
$$ plain form
12109 118646 -243047 136393 -51725 72266 -192625 58025 -53435 188557 89010 102102 214938
12098 214938 -291733 -13233 47130 404119 267433 471701 696370 99435 273089 110229
12087 -17532 184888 322557 113698 64119 -218922 270126 -27446 43068 248639 32184
12076 321167 249176 441153 393686 558330 242165 179450 91168 -118238 -184517 243576
12065 -55051 -113973 233979 164451 234982 60431 254054 158910 -149647 22601 -74752 -220712
12054 -220712 155147 -195854 81378 -66082 125959 -209872 -3438 175672 -98276 -58910 -14799
12042 7141 47348 -277845 164983 -29396 -287308 63871 -535486 -148088 39176 -134383 -290166
12031 -290166 -154403 -244740 74345 337921 -173456 -110157 11972 127657 -255012 136712
12020a18936k17584B8925a44580H0982j5126a26969A9363a74217I084L20019j9780
12009C09323i4669l6736e4653k8725I8072m7170g9094q3011c4966A0870a94972
11997a21315l6551M4365L3040C17047A19577a17314j69752A3037b33798d5394
11986b23954J04737K7834J6401J2770j65513a01557K5113H3325i7957C9432b1528
11974a07238D2639b79842O7550E854a30130j2695R258B01393b59508d2650B73213
11962H5899b20038a09728J1670j1605j06490I8836b50615B45160a11287J5431
11952i5856k65165a43607e9691C0291a66036M7335A07330a15891m3278A63944
11941a0521A17588a92240d2990A80802A8379a4900p8715A08761L4809c66509f3665
$$ plain form
12020 -118936 -336520 28925 -144580 80982 65856 -126969 19363 -174217 9084 329103 309323
12009 309323 -94669 -131405 -54653 -83378 98072 50902 -79094 -162105 -34966 10870 -194972
11997 -121315 -157866 -113501 -80461 317047 119577 -117314 -287066 13037 -233798 -45394
11986 -223954 -119217 -91383 -74982 -62212 -227725 -101557 -76444 83325 -97957 39432 -21528
11974 -107238 42639 -279842 -212292 5854 -130130 -142825 -133567 201393 -259508 -42650 273213
11962 85899 -220038 -109728 -98058 -109663 -216153 98836 -250615 245160 -111287 -95856
11952 -95856 -361021 -143607 -59691 30291 -166036 -118701 107330 -115891 -159169 163944
11941 -10521 117588 -192240 -42990 180802 18379 -14900 -93615 108761 143570 -366509 -63665
11929I7601a00663J6855A02503n195c55166B1731h9996L5064B06902k7397l6671
11918A42834G0189K87246j65195J98144c20966A30736E4701a43497K1319p2196
11908a94374G1958a97718o4789I1219A9986J8789R4010d9127l8232j24182k2704
11897b34245D5014J35640K3017b72390B39534g4345C7462b01687I387M2314a04111
11885C21714h1771F4638a79072n6049a06670j16021g2014L2837J4215q036B17887
11873a20289b7725j29637j53795K4328c0954B00429a03134D1968a56500D300b2158
11861a34897j78643I5572b27898j9028A78865f667q0234b764B01324c4471A1379
11849g8524A532a29580B64502K31072b50777a17720K1810J5972A00996g0862B24246
$$ plain form
11929 97601 -100663 -83808 102503 97308 -355166 21731 -89996 -54932 206902 179505 142834
11918 142834 70189 357435 192240 390384 -320966 130736 54701 -143497 -122178 -194374
11908 -194374 71958 -197718 -262507 91219 19986 38775 132785 -49127 -87359 -211541 -234245
11897 -234245 45014 180654 203671 -272390 239534 -74345 37462 -201687 9387 51701 -104111
11885 321714 -81771 64638 -179072 -235121 -106670 -222691 -72014 -39177 -24962 -32998 217887
11873 -120289 -27725 -157362 -311157 -286829 -30954 200429 -103134 41968 -156500 4300 -22158
11861 -134897 -313540 95572 -227898 -246926 178865 -6667 -86901 -2764 201324 -34471 11379
11849 -78524 1532 -129580 264502 495574 -250777 -117720 -95910 -79938 100996 -70862 224246
11837c8268k03182F7999k9094i4220j15917d6495F2321h4423B6473J42495d4306
11825a78830r1450A8652a37340O4617B95637A29541b33988G2986H136J89978d1082
11813b84645F4368b9527k63915h9311L141p6916f2589A01608b25020A22552l8294
11802H4258H382d2612A65554G2418a3386E42969i3362j16612O4082C6272a96625
11790f7882m48193A6426b2795m8175A28218l1694O5282g2103j95378j31886H3892
11778A25503a55746J7605A18402M7260b85584a00515E2004A4285b42793A90216
11767a22344n4564C0913K74876d4585A03545k13j3212D5042g5829A54729b19697
11755C24550c40495i7449A7599a3186C3358a23472I5430O0338a96863B59225b6249
$$ plain form
11837 -38268 -241450 67999 38905 -94220 -210137 -46495 62321 -84423 26473 168968 -44306
11825 -178830 -270280 18652 -137340 -72723 295637 129541 -233988 72986 8136 198114 -41082
11813 -284645 64368 -29527 -293442 -89311 -86170 -163086 -62589 101608 -225020 122552 84258
11802 84258 8382 -42612 165554 72418 -13386 542969 -93362 -209974 -145892 36272 -196625
11790 -67882 -516075 16426 -22795 -70970 128218 96524 161806 -72103 -267481 -399367 83892
11778 125503 -155746 -138141 118402 165662 -285584 -100515 52004 14285 -242793 190216
11767 -122344 -176908 30913 305789 -44585 103545 103332 90120 45042 -75829 154729 -219697
11755 324550 -340495 -97449 17599 -13186 33358 -123472 95430 155768 -196863 259225 -26249
11743A02352d37537K12481c6779j0915A79321b02790g9779Q406j15319P715j93176
11732c72153J47773B66208O4606A59968a55704d7334j71629d1357A39434E647
11721C5030g8038A80664i535m3726I3728J27746E218a54249h258l77521D2604
11709d842B9029h7769J3333j24236F2777J09372D3230j42a8615n306A61200e9862
11696c22477a32054K2862D9982N7907J79013a64739A07894a7186A30083j9460
11686A10623e1261B69307c19469G9808c10010A45577i3624J3904k07701h5265
11675f8056m4489k38424a73248d5069C52000a43643B63970c9929m3812M0767k23522
11664b66496I8702B1272K53150a06419q7760D617e4473E8844b25343A51590a69704
$$ plain form
11743 102352 -437537 -225056 -36779 -47694 179321 -202790 -79779 -71373 -186692 -178977 -372153
11732 -372153 -224380 266208 330814 159968 -155704 -47334 -218963 -41357 139434 5647
11721 35030 -78038 180664 -9535 -53261 93728 221474 5218 -154249 -8258 -385779 42604
11709 -4842 29029 -87769 -74436 -198672 62777 172149 43230 43088 -18615 -23921 161200 -59862
11696 -322477 -132054 -109192 49982 107889 286902 -164739 107894 -17186 130083 110623
11686 110623 -51261 269307 -319469 79808 -310010 145577 -93624 -79720 -287421 -85265
11675 -68056 -112545 -350969 -173248 -45069 352000 -143643 263970 -39929 -83741 -42974 -266496
11664 -266496 98702 21272 274422 -106419 -194179 4617 -54473 58844 -225343 151590 -169704
11652e2888A37200j8952a38641i137j53059b0557l57367c8882B8451a53859f0154
11640A11039a41173j43529c6519A61239a51094Q924F1375b51910F1775L3035J99351
11629B94161f9380j31844B89138c9588F0624J75716e2493l16506A76011a07061
11618G9599B226K75824I5084a27842A88013b2816C6879d2047A58901m5904a58312
11606b79884A7952k557a92443A49355c27446f9600A64703n5821b05692r4314E6605
11594H2298G073J13849d46863A33952b48811B64675c4765H189K57354A31639a32073
11582B32493b90091D7950d8006J6912B06476B488Q3425b63479A19137a81990H3192
11570a12152j4686B10141i3924c0916I5783R8435a03032A28614K36021B8526N6788
$$ plain form
11652 -52888 137200 118248 -138641 -9137 -162196 -20557 -377924 -38882 28451 -153859 -60154
11640 111039 -141173 -284702 -36519 161239 -151094 -142170 61375 -251910 61775 94810 294161
11629 294161 -69380 -201224 289138 -39588 60624 236340 -52493 -368999 176011 -107061
11618 79599 2226 278050 95084 -127842 188013 -22816 36879 -42047 158901 112997 -158312
11606 -279884 17952 15395 -192443 149355 -327446 -69600 164703 108882 -205692 -300006 56605
11594 82298 7073 120922 -446863 133952 -248811 264675 -34765 8189 265543 131639 -132073
11582 232493 -290091 47950 -48006 -31094 206476 2488 85913 -263479 119137 -181990 83192
11570 -112152 -126838 210141 -93924 -30916 95783 194218 -103032 128614 364635 28526 85314
11559H5314b02545L4520C0139b49598d5922q5796o0058j21239A49530m8081a35632
11547a98693F3190J69875b07238B06049D4556A9570J19647a80020C22550a1127
11536F8680K97276A68135a15697d619D7733J84792m8845D3608a66417h0283k37451
11525c17734N4126I9137a73672f1533R465C15562d6A30318J24819i8168L4000
11514f4168A14462C4715J79337a91232A04257J97848o6410g7806q625c4400n6040
11503i0440p2118H6839b37878O0228B79422C6890K09798j06603l2835e7337I7750
11491A3808e9735A18042L2920g4519D00382h0037L3862A59486a30197q3814a1609
11479A96104K13367a51983A96763n3814c09485d2781j14646a2833A96607k2925
$$ plain form
11559 85314 -202545 -168025 30139 -249598 -45922 -131718 -191776 -313015 149530 101449 -135632
11547 -198693 63190 233065 -207238 206049 44556 19570 139217 -180020 322550 -11127
11536 68680 365956 168135 -115697 -4619 47733 232525 183680 43608 -166417 -80283 -317734
11525 -317734 -263608 99137 -173672 -61533 -52068 315562 -46 130318 255137 -98168 -64168
11514 -64168 114462 34715 214052 -191232 104257 302105 235695 -77806 -86431 -34400 -90440
11503 -90440 -162558 86839 -237878 -177650 279422 36890 246688 140085 107250 -57337 97750
11491 13808 -59735 118042 150962 -74519 400382 -80037 -46175 159486 -130197 -214011 -11609
11479 196104 409471 -151983 196763 142949 -309485 -42781 -157427 -12833 196607 173682
11469A73682n1633k84c30372B30032c13701B30492a77809g7710A1576a49247C04253
11457G6182j4353K61343c36497J11720P5321B1355F116b36431j73457A16006L0838
11446A46844J52659c42374L5414k0924I4302A3065a28433D9024a72240B1362N3081
11435G4443N9429a88121J7091A65239m9427D25J12247Q3965a37943l1349A18623
11423D9804g4848A27717c59647B50137l152C9665a9921b291A82949P7553H905
11411a33225E6478L397a46165J0306N4702p3722B4547c3891j7907j17k8611l955
11399h4481k45740B09708r0792A1737b28071a09971B10779e81362K54828L9728
11389b86806H0218K02973E8861K20985j36273p0612j0284h0618k5413I8823A8693
$$ plain form
11469 173682 122049 121765 -330372 230032 -313701 230492 -177809 -77710 11576 -149247 304253
11457 76182 61829 323172 -336497 -224777 -149456 21355 6116 -236431 -409888 116006 146844
11446 146844 299503 -342374 -306960 -327884 94302 13065 -128433 49024 -172240 21362 74443
11435 74443 133872 -188121 -171030 165239 115812 425 112672 196637 -137943 -169292 118623
11423 49804 -74848 127717 -359647 250137 246985 39665 -19921 -2291 182949 260502 8905
11411 -133225 56478 59875 -146165 -135859 -81157 -154879 24547 -33891 -51798 -51915 -80526 -84481
11399 -84481 -330221 209708 118916 11737 -228071 -109971 210779 -581362 -326534 -286806
11389 -286806 80218 283191 58861 279846 143573 72961 62677 -80618 -106031 98823 18693
11377b46609f0786n1653D7744P2419O1155a59733K2335M2092I004a36307H5746
11365I5574J599a11548B94618a37890B28930k8066O3244b59399B55863e8688m6299
11354a04987a3048j3057j05526A92009p6319a00592F9837B8029b26135c5962J7487
11343a8475p882G4510a52567B9831f3444r16a0200j7498B3903a31293B75476J2124
11331B87600c23821c6773J722B64589D862b31891J04268c7543B83385i6479J0108
11320h6371b9921p6947b401l22499K1386B5879c5490l95247a86354C33175E0819
11308b55304C62361D3691a64608H0374a33971d7451j4083j00781B51289D4208
11297e68688f0134I3998C9018a82858o1001A67420a7823j7294A8145b74906B55187
$$ plain form
11377 -246609 -60786 -112439 47744 120163 181318 -159733 -137398 -95306 9004 -136307 85746
11365 95574 97173 -111548 294618 -137890 228930 200864 264108 -259399 255863 -58688 -104987
11354 -104987 -13048 -26105 -131631 192009 115690 -100592 69837 28029 -226135 -35962 -18475
11343 -18475 -26357 74510 -152567 29831 -63444 -64360 -10200 -27698 23903 -131293 275476 287600
11331 287600 -323821 -36773 -35051 264589 4862 -231891 -127623 -37543 283385 -96479 -86371
11320 -86371 -29921 -106868 -2401 -324900 -303514 25879 -35490 -430737 -186354 333175 50819
11308 -255304 362361 43691 -164608 80374 -133971 -47451 -61534 -162315 251289 44208
11297 -568688 -60134 93998 39018 -182858 -243859 167420 -17823 -35117 18145 -274906 255187
11285c5371l49057a27507D08074A26957O3419a79415k26139e0451F5736A7505
11274b6911k70980A1968a98959d7480B6831e10639K26967B1609a44781B24973
11263a86385D116c14989P0349G724K18640a22010A28585F1870P6214J11230o0749
11252A88565H7685f4639B29881c59579A09440C4163R7681a98620E9346e7172q6614
11241a43786b8872B32228e6943k1969A15584i2222k71230Q3761k8401e945A66488
11229a28002I9376b28024e7874l3442l8811A1022d4717j00375A22923L2732b6786
11217a2604B03197A3149b70226B2645J0199B699b08330H1747h182G6944a00813
11205B1597d8877m0574a3356j40685A60476J3737m9387n8327b35395a369j51411
$$ plain form
11285 -35371 -384428 -127507 408074 126957 190376 -179415 -405554 -50451 65736 17505
11274 -26911 -297891 11968 -198959 -47480 26831 -510639 -283672 21609 -144781 224973
11263 -186385 4116 -314989 -244640 7724 226364 -122010 128585 61870 138084 249314 188565
11252 188565 87685 -64639 229881 -359579 109440 34163 131844 -198620 59346 -57172 -143786
11241 -143786 -28872 232228 -56943 -78912 115584 -92222 -363452 -279691 -308092 -5945 166488
11229 -128002 99376 -228024 -57874 -91316 -130127 11022 -44717 -145092 122923 155655 -26786
11217 -12604 203197 13149 -270226 22645 32844 2699 -208330 81747 -8182 76944 -100813
11205 21597 -48877 -89451 -13356 -154041 160476 174213 124826 66499 -235395 -1369 -152780
11194a52780k47172a99027a4802j06783o3188A73711P7541b8475B13435b32332
11183A17592J34039a84903j88682C33040a87942H75K33775c09777F3881a8059
11172i9073c1387H7052l0995d5834o4951C4050C923e359r4231A46307C626J28705
11160A32331b79174a9965j01459A60932e81688A88112d0715m02G1031b0308A49238
11148C33056a07810D3092J04355e1395m09149f7916A5312J48786g6983p4263C01119
11136h6382l6362N7026l8671F8619a77843j9004N5534C36937b41368A441c49021
11124a04923n3967G3144B9805a5868A20098m9807f3024E3769Q8380b04260g0569
11112A21426c9948o6460A59409R1471a8119H5112J26664R7451i8467C68841j74608
$$ plain form
11194 -152780 -399952 -199027 -14802 -121585 -184773 173711 251252 -28475 213435 -232332
11183 117592 251631 -184903 -373585 333040 -187942 875 234650 -309777 63881 -18059
11172 -99073 -31387 87052 56057 -45834 -110785 34050 3923 -5359 -99590 146307 3626 132331
11160 132331 -279174 -19965 -121424 160932 -581688 188112 -40715 -41117 71031 -20308 149238
11148 333056 -107810 43092 147447 -51395 -460544 -67916 15312 164098 -76983 -151246 301119
11136 -86382 -122744 -65718 -104389 68619 -177843 -196847 -141313 336937 -241368 1441 -349021
11124 -104923 -158890 73144 29805 -15868 120098 70291 -63024 53769 142149 -204260 -70569
11112 121426 -39948 -106408 159409 250880 -18119 85112 211776 309227 -98467 368841 194233
11101A94233L5126n4767q4464K12163b50972a6169B08644E1221P4800r462M7487
11090A64046P763A6745J68568a19334D7540M0148J564L54208c01889B91748C0236
11078a64448B45621A09897K40718A61370Q0140a51781A99495f0678A57052E6394
11067C75455a27710C75109j30983J7917E9771j8779L92012A73011K01364A05296
11056B82606K6419J8845L1135B5138P8614K88617m219P9016A17890J19118l5620
11045B01388L1447N1163j15573K03809J1091A09383M62091k46974j48878K91543
11035D67165J56779C08517C4334K68497K18706b8902B69895L77110l19960r167
11025C17878O81A43584J20810k0899E9055M64777I2979K38342q6744A6297f377
$$ plain form
11101 194233 229359 174592 90128 302291 -250972 -16169 208644 51221 126021 116559 164046
11090 164046 171809 16745 185313 -119334 47540 87688 89252 443460 -301889 291748 30236
11078 -164448 245621 109897 350615 161370 241510 -151781 199495 -60678 157052 56394
11067 375455 -127710 375109 244126 262043 59771 40992 433004 173011 374375 105296
11056 282606 309025 327870 359005 25138 103752 392369 388150 467166 117890 237008 201388
11045 201388 232835 283998 168425 372234 383325 109383 571474 324500 175622 467165
11035 467165 623944 308517 34334 302831 521537 -28902 269895 647005 327045 317878
11025 317878 318559 143584 264394 243495 59055 523832 92979 331321 244577 16297 -6377
11013C88697A78807J18801c146B80968j19237f7024A74348J01710L08291j27322
11003D57027M5529L2016B29047I4071M01105o6532Q8449j4978o9572J16806k19033
10992C30316J82878M91553k88981O6051J27291l16238J74544L04108l56200K81956
10982I97278k22556r6332l15354K95841J84713O0739J42621k47708K22175q8285
10972I33132j35112j07473J96731k90676K94375J77689k89622R100j98873J75321
10962G64592J08264l76922N1040o6248K39360k24040B21192L63082j83913A00804
10951C12009j32421M9103J37m9656a7521a841B81195H5047C2564L34636C2940
10939A60337i9278C785M990J23608E6271J94233b33199e7819j00132c383j28114
$$ plain form
11013 388697 178807 297608 -3146 280968 161731 -67024 174348 276058 584349 457027
11003 457027 502556 534572 229047 94071 495176 428644 517093 502115 432543 549349 330316
10992 330316 513194 1004747 715766 781817 909108 592870 767414 1071522 715322 997278
10982 997278 774722 678390 363036 658877 843590 904329 1046950 799242 1021417 933132
10972 933132 798020 690547 887278 596602 890977 1068666 779044 788144 589271 764592
10962 764592 872856 495934 546974 480726 720086 496046 221192 584274 400361 100804
10951 312009 179588 228691 228828 179172 -17521 -1841 281195 85047 32564 367200 32940
10939 160337 -99278 3785 8775 132383 56271 250504 -233199 -57819 -157951 -3383 -131497
10928a31497B04702j1133g2336j28876i1377H5345P8437C5555K51405a40834E1781
10916A45699a51019I4815c7653B13446f3855A01987a63853j25586D4241J36179
10906A80420a18863K055C3815J63259b98058B12661F8876P6583a46316g2303b8468
10894g4524G7786e119B8668P3744n1060A2142N5558a92186N9924r4224A54035
10882h7188p6644j31491b7458l4714l47228a24833N9367j39566j27690B35818
10871b99226J49009l3872H5354O0043F5240k3181K74056i2240C301K3131b10586
10859a64796E294c37135f9089J1498A54768c46619e6753j83353A60705e8599A24329
10847e4974Q877G5568g1070j78418c2079F3051b82757I9741b9449D6879K4056
$$ plain form
10928 -131497 204702 193569 -72336 -201212 -91377 85345 163782 35555 286960 -140834 51781
10916 145699 -151019 94815 -37653 213446 -63855 101987 -163853 -289439 44241 180420
10906 180420 -118863 -116808 33815 197074 -298058 212661 68876 145459 -146316 -72303 -28468
10894 -74524 77786 -5119 28668 102412 51352 12142 67700 -192186 -132262 -226486 154035
10882 -87188 -163832 -295323 -27458 -62172 -409400 -124833 -65466 -205032 -332722 235818
10871 -299226 -150217 -184089 85354 145397 65240 42059 316115 -92240 3301 26432 -210586
10859 -164796 5294 -337135 -69089 -57591 154768 -346619 -56753 -240106 160705 -58599 124329
10847 -54974 -46097 75568 -71070 -249488 -32079 63051 -282757 99741 -29449 46879 70935
10836G0935f4369H1796c1777j18954b7633A07295k1664D1528a16626A56033a61099
10824a07750A58056o6546C5666b63380J13145K9600k1634j15733k16499a32918
10813a72010e5470C106a85989A54396f15183A10030e5339A53811a08999B5706
10802A08954d01770D76922A18959a35997k6093q933q2089F8286a45735C93866
10791a28336b4842j51661J2242O670O9795A91776l3496J68044a06138m4027j31178
10780b81343j2797B9830K48540C6689N9825C4877Q3459a3399j63283C762N2929
10769E6691h2954A47906e6441r5109d7520B95082b80772c2364d440j48924C04675
10757A2617a43142e7010B22574K8921a71639M1511B28671g9336n6355n4534J8906
$$ plain form
10836 70935 -64369 81796 -31777 -150731 -27633 107295 85631 41528 -116626 156033 -161099
10824 -107750 158056 91510 35666 -263380 -150235 -120635 -142269 -258002 -474501 -132918
10813 -172010 -55470 3106 -185989 154396 -615183 110030 -55339 153811 -108999 25706
10802 108954 -401770 476922 118959 -135997 -162090 -171023 -253112 68286 -145735 393866
10791 -128336 -24842 -176503 -164261 -157591 -87796 191776 158280 326324 -106138 -150165 -281343
10780 -281343 -294140 29830 278370 36689 96514 34877 118336 -13399 -176682 3762 56691
10769 56691 -82954 147906 -56441 -151550 -47520 295082 -280772 -32364 -4440 -153364 304675
10757 12617 -143142 -57010 222574 251495 -171639 -130128 228671 -79336 -135691 -190225 -171319
10746a71319C3326J25949R3896e69j95080B4913J48855q3526a05612A96866i7771
10734a82634j08815J27510j41916A82610g1344n2136k7044B4039K28616f2160
10723a04136J5931j87406a6876l2070k65232J39318D1186A0281g1958k00430j3622
10712b86010E4539a80737e3107l1249K1351a1753H9028J52461a14275j40452B40120
10700f7719A5340b57765a5602A45074C3770a1311l7777N549j4993A1830a09535
10688f2554H7598b48396I4197f0413A42593a35866a5924j91632D5704d1846j29696
10677a71542B52634e2123o8956N9673q4716C4751i8246B794a34550A32517i8697
10665d6011A53202K657N4254j01136b21163d5973A45170c33115b4446B44231g6795
$$ plain form
10746 -171319 33326 159275 253171 -569 -195649 24913 173768 90242 -105612 196866 -97771
10734 -182634 -291449 -163939 -305855 182610 -71344 -123480 -150524 24039 252655 -62160
10723 -104136 -88205 -275611 -16876 -48946 -314178 -174860 41186 10281 -71958 -272388 -286010
10712 -286010 54539 -180737 -53107 -84356 -63005 -11753 89028 241489 -114275 -254727 240120
10700 -67719 15340 -257765 -15602 145074 33770 -11311 -49088 -43539 -58532 11830 -109535
10688 -62554 87598 -248396 94197 -60413 142593 -135866 -15924 -207556 45704 -41846 -171542
10677 -171542 252634 -52123 -121079 -61406 -146122 34751 -98246 2794 -134550 132517 -98697
10665 -46011 153202 155859 210113 108977 -221163 -45973 145170 -333115 -24446 244231 -76795
10653b79283B74490b51254B24262a54874G1074b44553a18474j31306O2213C6435
10642b29079a05235M0918N086I3773g4162m4074F6359c38969G4949c7645k3736
10631f1381j1986j6087n494a0147C56349d6476e289H0157d837F7427p192C603
10618A1635b41384C8602b18381l2595O3509M8447j48731E025c28997J41879b02
10606B60516f2590r5133e2495D9312h7769D51684A0316J6377Q8240C9872A8006
10594A72406a33773B2144e1452m5247A85330i376A71622E1656g511D8349b1411
10582a20522A53065l9478g6200A5922J59575p6544b35844B92N1484a57566f9147
10570h467B39534j11980b5717k8870o8515o1468A48632B8319d91460A26209b42692
$$ plain form
10653 -279283 274490 -251254 224262 -154874 71074 -244553 -118474 -249780 -187567 36435
10642 -229079 -105235 -64317 -59231 93773 -74162 -118236 66359 -338969 74949 -37645 -61381
10631 -61381 -73367 -89454 -94948 -10147 356349 -46476 -5289 80157 -4837 67427 60235 3603
10618 11635 -241384 38602 -218381 -250976 -187467 -139020 -287751 5025 -328997 -187118 -202
10606 260516 -62590 -157723 -52495 49312 -87769 451684 10316 26693 114933 39872 18006
10594 172406 -133773 22144 -51452 -96699 185330 -9376 171622 51656 -7511 48349 -21411
10582 -120522 153065 113587 -76200 15922 175497 98953 -235844 292 51776 -157566 -69147
10570 -8467 239534 127554 -25717 -54587 -123102 -184570 148632 28319 -491460 126209 -242692
10558h2919o1920c8398j02663A72477a43032M589f6158o1367L8227k02833d4065
10546D0919b02658i8957k84977B92942f8779j04883A29409b36175Q9840B3247
10535b90568i097A19185h2594k70988B34217a68048f5882k6199m046I1095a60740
10523H4989f5118C11454C5353b22179D2855L6113J36118i7355j78063A2587f6185
10511D4631j1508a46977I7755b34415A29236a47290O7613j04541j69059A65870
10500a64009f0917N155k55510J10080N0260b118B7289a54651N6854c2476H1224
10488B42628a15380k022D6009b73455J5119l4906L0469J23944B65027G8699N2010
10477A30709a0788k02066O4578I9647C2924J39667n6005A5040M2093a96075A1550
$$ plain form
10558 -82919 -144839 -38398 -141061 172477 -143032 -138443 -66158 -127525 -89298 -292131 -44065
10546 40919 -202658 -98957 -383934 292942 -68779 -173662 129409 -236175 -146335 23247
10535 -290568 -9097 119185 -82594 -353582 234217 -168048 -65882 -92081 -96127 91095 -160740
10523 84989 -65118 311454 35353 -222179 42855 78968 215086 -97355 -275418 12587 -66185
10511 44631 33123 -146977 97755 -234415 129236 -147290 -79677 -184218 -353277 165870
10500 -164009 -60917 -55762 -311272 -201192 -150932 -2118 27289 -154651 -97797 -32476 81224
10488 242628 -115380 -117402 46009 -273455 -258336 -293242 -262773 -138829 265027 78699 130709
10477 130709 -10788 -212854 -148276 99647 32924 172591 116586 15040 57133 -196075 11550
10465D804Q1353a43935k4146A26828d2609A10941k9678R5867E6637H590L0856
10454C9446K11807c6174j75734d9498F712b7207B31497i1527j27146Q2528j68215
10443c04360a50531m799I7416H274K57261b08262l780E8183L47880A85053b98575
10431i3231l0043M3646C1163f7246H1092b28303P6470A00461m1080a96788B29207
10419a55836n2718q1605e5710j27726H9142b4836A366a29270H9056O6976e9345
10407h1814C39877E3266a66092B7020J49053i0500A79068a02877E5304K04829
10397B60133b37872a07617H2615m0685a15491p7517C36808b27002E8400b53080
10386h2120A08639K09403j26901J49005h428D5491d2171B07631D884a5972D2482
$$ plain form
10465 4804 86157 -143935 -168081 126828 -42609 110941 81263 177130 56637 8590 39446
10454 39446 251253 -36174 -211908 -49498 6712 -27207 231497 -91527 -218673 -136145 -304360
10443 -304360 -150531 -155330 97416 8274 265535 -208262 -212042 58183 406063 185053 -298575
10431 -93231 -123274 -79628 31163 -67246 81092 -228303 -151833 100461 59381 -196788 229207
10419 -155836 -208554 -290159 -55710 -183436 89142 -24836 1366 -129270 89056 156032 -59345
10407 -81814 339877 53266 -166092 27020 176073 -90500 179068 -102877 55304 260133
10397 260133 -237872 -107617 82615 41930 -115491 -193008 336808 -227002 58400 -253080
10386 -82120 108639 318042 191141 340146 -8428 45491 -42171 207631 4884 -15972 42482
10374F34J9275J80309J35535j12979Q6159p4549a15359G684K37047f3148A07105
10362C85937A44715a4455E09003A41517k4258k9829a27404A92850a66583a9359
10351F634L83153A47843L20703D1814K57743R2139j94650a23370A17729d6980
10340A49229L1976J46434e7556G389a32685c5399k62293C28196E2646a88469A32944
10328A74629a12923B36733D2035e8173B21592q7690B4146J90224c77266J00216
10318b77050M8586A79965a27555N6642j65028N2282l8639K6631k5866B97875f4293
10306C50437e54k32128l66594B50579C168N3995d33503a7067j16693l86289C26075
10294A85070D9006e6354j65337A11651e5837A406d41137B06787a11853L5768l64713
$$ plain form
10374 634 19909 200218 335753 222774 308933 234384 -115359 7684 244731 -63148 107105
10362 385937 144715 -14455 509003 141517 117259 87430 -127404 192850 -166583 -19359
10351 6634 389787 147843 468546 41814 299557 391696 197046 -123370 117729 -46980
10340 149229 181205 327639 -57556 7389 -132685 -35399 -297692 328196 52646 -188469 132944
10328 174629 -112923 236733 42035 -58173 221592 133902 24146 214370 -377266 -277050
10318 -277050 -228464 179965 -127555 -70913 -235941 -183659 -222298 -195667 -221533 297875 -64293
10306 350437 -554 -232682 -599276 250579 3168 57163 -433503 -17067 -133760 -520049 326075
10294 185070 49006 -56354 -221691 111651 -55837 1406 -441137 206787 -111853 -76085 -440798
10283d40798B34121i8817n7195d9641h767l0780A15093A8597g4323A08150P2647
10272A80797R0722b64005a24984k62274i0798N694G2907J0734m1006b64830A24567
10260b57752A1322N2868B6353b674j10280M9215H7150j6818h5782L6649n5867
10249a05000B44270a63480B5944b0100E26i6247B21236B3733J36788g9082G0907
10237D893a27976O1822J9593A8151g7999k49256G4396b00505E7482a46453D857
10225a2739D5383L0559c77147a22870j79513J40425N9701k49290a36506j3083
10215a49589l5198R435K8176L9355n4529A17091A7752a29862q3617h9374I6572
10203a77849j74797A20443a72489M8230N0560A5346g7045B68503b41657j24564
$$ plain form
10283 -440798 234121 -98817 -156012 -49641 -8767 -39547 115093 18597 -74323 108150 180797
10272 180797 271519 -264005 -124984 -387258 -90798 -85104 72907 83641 42635 -264830 124567
10260 -257752 11322 64190 26353 -2674 -112954 -63739 87150 70332 -85782 -49133 -105000
10249 -105000 244270 -163480 25944 -20100 526 -96247 221236 23733 160521 -79082 70907
10237 4893 -127976 -66154 -46561 18151 -77999 -327255 74396 -200505 57482 -146453 4857
10225 -12739 45383 75942 -377147 -122870 -302383 -161958 -102257 -351547 -136506 -149589
10215 -149589 -184787 -175352 -147176 -107821 -162350 117091 17752 -129862 -213479 -89374 96572
10203 -177849 -352646 120443 -172489 -124259 -73699 15346 -77045 268503 -241657 -366221
10193c66221a71434G3275a91275d4014k60187a20104C8400L8439j2215c96015
10182A7073c24103G7756c9539J506D0564a33401J440j56205a3063C62399h1336
10170C8611c19436J25649M6355l927l57987a00152k21571i2236C5266J89876b82165
10158c06749I6381b15679B64514i1762K1866J2878B34764a92266C6686b9741C2850
10146a05695r2383B58949J0519I7284d4350j20255K5166A35956J70704a80476
10135c57505J51730E8459a69611P7863r9829O5888j09760K5813L0549a8172A92387
10123F6418l1377a90474k65977i8270j08076J01041c7323p3139L196j56778a27069
10111d26295B92136F4046c19502D7584O6353c3012A80088d8466r0015l63764D90254
$$ plain form
10193 -366221 -171434 73275 -191275 -44014 -304201 -120104 38400 76839 64624 -396015
10182 17073 -324103 77756 -39539 -38033 40564 -133401 -131961 -288166 -13063 362399 -81336
10170 38611 -319436 -193787 -147432 -151359 -509346 -100152 -321723 -92236 35266 225142 -282165
10158 -306749 96381 -215679 264514 -91762 -69896 -57018 234764 -192266 36686 -29741 32850
10146 -105695 -198078 258949 269468 97284 -44350 -164605 -139439 135956 306660 -180476
10135 -357505 -205775 58459 -169611 -91748 -191577 -125689 -235449 -209636 -179087 -18172 192387
10123 66418 35041 -190474 -456451 -98270 -206346 -105305 -37323 -110462 -107266 -264044 -127069
10111 -426295 292136 64046 -319502 47584 113937 -33012 180088 -48466 -138481 -502245 490254
10099d4387p1702k15607A13826P842f8641k62646E5454b71933G2414b77598I9890
10087a54337a9431q2197K3191E2133J41954i3092G096R6660a65597B1244b59816
10075c1643C23493a96988j34332p513a01384b5479k26793r6109a16251G7442N6079
10064A33521b61563j02624h6675G7901A462a03080k3138a5388a138A45989k7849
10053A18140a42900N0661L0939j37955b7491k3703n4279B03938f1908H4813a37860
10041H4735N9730J2559n3528c04737a1744j58746F2994J36983a03530j75143k8458
10030c07131A15327a93350P6288j44275N6221A07459h6899k15372E7802f30428
10019G1951a75763C6460J00375a46688J1690r0083B93138a00540B55131j07124
$$ plain form
10099 -44387 -116089 -331696 113826 121668 -68641 -331287 55454 -271933 72414 -277598 99890
10087 -154337 -19431 -101628 -78437 52133 194087 -93092 7096 103756 -165597 21244 -259816
10075 -31643 323493 -196988 -331320 -338833 -101384 -25479 -252272 -348381 -116251 77442 133521
10064 133521 -261563 -364187 -86675 77901 1462 -103080 -126218 -15388 -1138 145989 118140
10053 118140 -142900 -92239 -61300 -199255 -27491 -51194 -105473 203938 -61908 84813 -137860
10041 84735 144465 157024 103496 -304737 -11744 -170490 62994 199977 -103530 -278673 -307131
10030 -307131 115327 -193350 -117062 -261337 -205116 107459 -86899 -302271 57802 -630428
10019 71951 -175763 36460 136835 -146688 -134998 -225081 293138 -100540 255131 148007
10009A48007a68915C30970a00285F1344R3955a1810l22262B836J56277b31407
9998G575b36008N5331B46701C6114c08726A00374a45690d5502q3206e5215D4319
9986a14907B13060c8712a3056C7376J40795b10422h6587B41974H4197n57f0282
9974f5683H5512a49399p1146G710O7510J21440m0486h0432G4526c60295J56868
9963b03427a3413j16200g123k30682F8208c1827j56088Q1657M9697j61276i9595
9951H9320C554b20588m2399P0160g4857j59983c5210j54479k26604B21517b91811
9939h4651d1429j02506f0474h871j23292C8162R1633a29960j18128A06918c2462
9927a7363F1290j3123c33940A43949e141F5661K27941b28295e162H1045c44572
$$ plain form
10009 148007 -168915 330970 -100285 61344 155299 -11810 -334072 2836 159113 -231407
9998 7575 -236008 -180677 246701 36114 -308726 100374 -145690 -45502 -128708 -55215 44319
9986 -114907 213060 -38712 -13056 37376 178171 -210422 -86587 241974 84197 83640 -60282
9974 -65683 85512 -149399 -220545 7710 75220 196660 156174 -80432 74526 -360295 -203427
9963 -203427 -13413 -129613 -7123 -237805 68208 -31827 -187915 -106258 -56561 -217837 -99595
9951 89320 3554 -220588 -262987 -192827 -74857 -234840 -35210 -189689 -416293 221517 -291811
9939 -84651 -41429 -143935 -60474 -8871 -132163 38162 129795 -129960 -248088 106918 -32462
9927 -17363 61290 48167 -333940 143949 -5141 65661 293602 -228295 -5162 81045 -344572
9915d1955E2858J15908a6870A01966b38708f6694j75283f0295j19543d1166j48176
9904a89342a8173F7041b08592H6920d2877j98066f898q6145B15521f1391I4684
9892e8900j39540Q4542c1357B07147C2120a57183f0874l2826A68543p2414k0350
9881G5779a10564B8411A2994K06096C1067b46318e855B50243a13503B58146C3063
9869a41869B42747b79300H0265a09236o7507M1215j03537A77915G0918b10901
9858a25845b6260j17367O262L3201G9368b11833J1017B7653F274b58582A69343
9846A34369L8878E8726Q863a34232m21081F765J23337E3102a27102L6481F8964
9834H4683J23121g5739O537H1207a29515j7102c0484p2100A14698f2375k9515
$$ plain form
9915 -41955 52858 168766 -16870 101966 -238708 -66694 -241977 -60295 -179838 -41166 -189342
9904 -189342 -18173 67041 -208592 86920 -42877 -240943 -6898 -93043 215521 -61391 94684
9892 -58900 -198440 -113898 -31357 207147 32120 -157183 -60874 -93700 168543 96129 75779
9881 75779 -110564 28411 12994 219090 31067 -246318 -5855 250243 -113503 258146 33063
9869 -141869 242747 -279300 80265 -109236 -176743 -135528 -239065 177915 70918 -210901
9858 -125845 -26260 -143627 -137365 -104164 79368 -211833 -200816 27653 6274 -258582 169343
9846 134369 173247 58726 67589 -134232 -555313 6765 130102 53102 -127102 -90621 68964
9834 84683 207804 -75739 -69202 81207 -129515 -146617 -30484 -102584 114698 -62375 -91890
9823i1890A72182a95520r4563C79264I6844N2830a15728F2383M5510B0350a06770
9811B45093a5725q62A5336K36173C2396b80408i8403k64699A16284a34785J4321
9800a20464D4124a57844A25908e5337j18110g9451C26580F706a32000j16006a23248
9788A18818b241A9213J47336K9106b2596C9191d18038A02505i7750k26222J57493
9777a66479e1395I2882b34722c9208C51824b11810g0321j63801O4670J0010j49487
9766c08929R7139A5238f497l944A22186a0022j21901m71768b103j7003k48658
9755b67764E6651a80168k49703C2370P0105b47384G2955a28263k24183A57100
9744a54484a5211E33258E3389d34226A26511h1811G1663a95200d6516F3458a90905
$$ plain form
9823 -91890 172182 -195520 -290083 379264 96844 149674 -115728 62383 107893 20350 -106770
9811 245093 -15725 -16587 15336 251509 32396 -280408 -98403 -363102 116284 -134785 -120464
9800 -120464 44124 -157844 125908 -55337 -173447 -79451 326580 6706 -132000 -248006 -123248
9788 118818 -2241 19213 166549 195655 -22596 39191 -418038 102505 -97750 -323972 -166479
9777 -166479 -51395 92882 -234722 -39208 351824 -211810 -70321 -234122 -169452 -159442 -308929
9766 -308929 -211790 15238 -6497 -10441 122186 -10022 -131923 -603691 -2103 -19106 -267764
9755 -267764 56651 -180168 -429871 32370 102475 -247384 72955 -128263 -352446 157100
9744 -154484 -15211 533258 53389 -434226 126511 -81811 71663 -195200 -46516 63458 -190905
9732b00846A56510f1028r855A03747i6847b1525E8190a69199h2781k04039b4034
9720f9208H4705b38218f9103j72682a04099j21658F7972g4900j49932J02226b147
9708A6026K31197d51970a24120H2168o540J86981e4882D1694R9164b90066D19670
9696c4734G8441h6376l80283a76934P9325m6602A4006J09637a31020B4192h7642
9684a81689e9030C9600g1659k42270A52174D6994d1844j5060j21883Q5940a6873
9672e6914D4709K18588C124a80700k59678A92197b00802B62107a3069l89861A84440
9660G3261M6247a19534b1003j09777E9883J39663b57113A40811a56819k9147j57678
9649c43644g256C9255P0528a65137N6637A04140J18581g3122J6235j40319p7532
$$ plain form
9732 -200846 156510 -61028 -70883 103747 -96847 -21525 58190 -169199 -82781 -286820 -24034
9720 -69208 84705 -238218 -69103 -241785 -104099 -225757 67972 -74900 -224832 -122606 -2147
9708 16026 247223 -451970 -124120 82168 75628 262609 -54882 41694 140858 -290066 419670
9696 -34734 78441 -86376 -466659 -176934 -97609 -144211 14006 123643 -131020 24192 -87642
9684 -181689 -59030 39600 -71659 -313929 152174 46994 -41844 -56904 -178787 -92847 -16873
9672 -56914 44709 263297 3124 -180700 -440378 192197 -200802 262107 -13069 -402930 184440
9660 73261 119508 -119534 -21003 -130780 59883 199546 -257113 140811 -156819 -185966 -343644
9649 -343644 -7256 39255 109783 -165137 -108500 104140 222721 -73122 -56887 -197206 -274738
9638b74738B4386a1415j30756A2496d7015k69258a16587B28340d27538A0898L6293
9627D7191c4179j02583A70743a05003p1991Q6204k66324d7402j25465h1490I8776
9615i0675A18305n139B8902a66665k37723K180a41750a1251o1972n4712o184j06356
9603b40475a7953k52877b4410B9180e269k09340k0702R467D225N302a31075H7205
9590B76683A00204a64542I3498l6350L0188a69212a1360A13965K36944m0129j49436
9579A61344J14585G311a38302B6620a8297B29832a42827d4j51173C02287f1600
9567d6272j27486g994o8171A39820c08545J33785N6512p7071b3533p812A33600
9555d1322k18406J23010l6129B88158I4069A5974d06579A56046F3326j8549e48057
$$ plain form
9638 -274738 24386 -11415 -142171 12496 -47015 -316273 -116587 228340 -427538 10898 47191
9627 47191 -34179 -136762 170743 -105003 -176994 -90790 -357114 -47402 -172867 -81490 98776
9615 -90675 118305 113166 28902 -166665 -404388 -402208 -141750 -11251 -73223 -127935 -134119 -240475
9603 -240475 -17953 -270830 -24410 29180 -5269 -214609 -235311 -225844 4225 9527 -131075 87205
9590 276683 100204 -164542 93498 57148 87336 -169212 -11360 113965 350909 310780 161344
9579 161344 275929 7311 -138302 26620 -18297 229832 -142827 -44 -151217 302287 -61600
9567 -46272 -173758 -7994 -76165 139820 -308545 -174760 -118248 -195319 -23533 -31345 133600
9555 -41322 -259728 -136718 -172847 288158 94069 15974 -406579 156046 63326 44777 -548057
9543a22154o9732C7377K24769d9695A99571a60753O1442l65220B78992a0634F1386
9531a27031k45577H2798f5030a7375H3894c84739Q5497a4356j17519A58675P2144
9520B30819A08622d13011e1950j51005A63565a6717F7357b58117E4472b69027
9509G6672a33803b4123A38011b0283l30271a18172I8694d7216B0169a1821A97622
9497a33372H611i7825k4655b4318j51632O5758l764k9463k21930f4541B0750h7886
9484B6283d9254I9581A5904L79260a64565j39011a20200A60098E2631b96283a4648
9472b62758g2876A76502h6183A11348k5791k5334a68526N886p3412P1078j82981
9461c47955g1581B19834r8616j9961d5315A05711Q2922c2324k86445a00858h827
$$ plain form
9543 -122154 -191886 37377 262146 -49695 199571 -160753 -99311 -464531 278992 -10634 61386
9531 -127031 -372608 82798 -65030 -17375 83894 -384739 -299242 -14356 -131875 158675 230819
9520 230819 108622 -413011 -51950 -202955 163565 -16717 67357 -258117 54472 -269027
9509 76672 -133803 -24123 138011 -20283 -350554 -118172 98694 -47216 20169 -11821 197622
9497 -133372 8611 -97825 -122480 -24318 -175950 -110192 -113956 -143419 -365349 -64541 20750 -87886
9484 26283 -49254 99581 15904 395164 -164565 -303576 -120200 160098 52631 -296283 -14648
9472 -262758 -72876 176502 -86183 111348 85557 60223 -168526 -162640 -236052 -164974 -347955
9461 -347955 -71581 219834 121218 101257 -45315 105711 188633 -32324 -318769 -100858 -8827
9449E3268a31261N4027A35094a68639B30377i9192j92256D099K0677g2630A59244
9437B49626a08295l7508d1917k07699A0707b90678B35130a06854K0444a7402k8743
9426d6145E2283O4161b2327n0000G3015A2052b73222A68555a48547A99373I8507
9414E625J27469a32703d7970k35430A2687K5694O9805D1228a7532g350A2688b30525
9401A02376a58551E4838a46272d9986E85198D3033b41161g7990E5258J7635k0934
9390E1959b53931f9559E2933R8471a71534A76660o0702c3487j06252B00468G361
9378b14695D53c07778g7756j21172I6941a94555A717a81849G9388b15900A30430
9366a22673n1074E6881a40902A88885c94999J16023Q9638j27244a57155B00448
$$ plain form
9449 53268 -131261 -77234 135094 -168639 230377 -99192 -291448 4099 24776 -72630 159244
9437 249626 -108295 -145803 -41917 -249616 10707 -290678 235130 -106854 -86410 -17402 -46145
9426 -46145 52283 116444 -22327 -72327 73015 12052 -273222 168555 -148547 199373 98507
9414 5625 133094 -132703 -47970 -283400 12687 38381 108186 41228 -17532 -7350 12688 -230525
9401 102376 -158551 54838 -146272 -49986 585198 43033 -241161 -77990 55258 72893 51959
9390 51959 -253931 -69559 52933 151404 -171534 176660 115958 -33487 -139739 200468 7361
9378 -214695 453 -307778 -77756 -198928 96941 -194555 1717 -181849 79388 -215900 130430
9366 -122673 -173747 56881 -140902 188885 -394999 -278976 -189338 -316582 -157155 200448
9355I2811j7305B5259c9492I6005b47832B32997F8045K6595A7786f1365B38541
9343a29084j12563A49326a57889A87122a40036b2522k85213B8405K69770a47456
9332F1846k7517f773k5829A26311h6956A04121a21353i289o1210j16957K0669
9321a66787r4623f3467A09779J25652a2875k95288I6370b3165B68229h3672j61736
9310b45408N586G2167K57112e6544K3516N997m0186g013H4975c60689m2492J29064
9298b74117a19904I8325M2320K865j1362E091K6600N0818J12419b44433B9552
9286A48413c5517C4511J1302a68183e8005j10434G1365g142k67245A05670b14476
9274G9274a48415N275L0920L5414a0326l7155j4164q7283H9782a88859J3624B39432
$$ plain form
9355 92811 75506 25259 -39492 96005 -247832 232997 68045 94640 17786 -61365 238541
9343 -129084 -241647 149326 -157889 187122 -140036 -22522 -307735 28405 298175 -147456
9332 61846 34329 -6773 -32602 126311 -86956 104121 -121353 -9289 -70499 -187456 -166787
9321 -166787 -261410 -63467 109779 235431 -12875 -308163 96370 -23165 268229 -83672 -245408
9310 -245408 -239822 72167 329279 -56544 -33028 -27031 -67217 -7013 84975 -360689 -403181 -274117
9298 -274117 -119904 98325 140645 143510 132148 5091 31691 82509 194928 -244433 29552
9286 148413 -35517 34511 45813 -168183 -58005 -168439 71365 -7142 -274387 105670 -214476
9274 79274 -148415 -143140 -112220 -76806 -10326 -47481 -61645 -148928 89782 -188859 -175235 239432
9261C7334a37500A37081j8510C0534J45728C2927J23902F0016e748o6927D3132
9249f4070k9533j51321L5926P0523m1268N4659M0520F142c32089D2456J48545
9238A91001d88953A4424c09417A44472b35792j42303a72221A35073O176l5182
9228A06067a81453G8946J0309a23807D5878f1831m5456j62290A44503a83902F8835
9216b67403D2579Q7962a87139A03697a2172l02209A10164b08586f815k58468D6903
9204C7503a62296j71481J15485C9085J23663l3021a4713k87204C10829j39065
9194A71764E2410a17145A56178b34667p3669g0557A6813c51893H9158J0210a06658
9182E1425k1320a19642p1581H7738j8847h456k66507A03428a12192b4180O682
$$ plain form
9261 37334 -137500 137081 118571 30534 176262 32927 156829 60016 -5748 -72675 43132
9249 -64070 -93603 -244924 -208998 -138475 -179743 -125084 -84564 6142 -332089 42456 191001
9238 191001 -488953 14424 -309417 144472 -235792 -378095 -172221 135073 141249 106067
9228 106067 -181453 78946 89255 -123807 45878 -61831 -107287 -269577 144503 -183902 68835
9216 -267403 42579 130541 -187139 103697 -12172 -314381 110164 -208586 -6815 -265283 46903
9204 37503 -162296 -333777 -218292 39085 162748 129727 -14713 -301917 310829 171764
9194 171764 52410 -117145 156178 -234667 -308336 -70557 16813 -351893 89158 99368 -106658
9182 51425 30105 -119642 -191223 87738 68891 -8456 -274963 103428 -112192 -24180 -17498
9171a7498B41200a35661j5804M7017A33782a15195A42885d8994l74476E7960J11002
9160A68962c94789a76258D5728a49707j60909N6569A6281L8636f6028A06846b3978
9148a56241l01439Q9572J64995P7302c1570J914q425n1607I5571P6573N2343I6545
9135a40511d4906j57169E7779A6921h3518H6191a2543l45051E9352O4087a64947
9123A08763j2741a1723k6910B73229F3637J6066O5959d39429a5012F2168d6270
9111B05687b19098A14835B363K6485P4407e9284j17604C3731b11012M436a6634
9099D6246J72038j08027D3482e1171o3039q359r8436e8703j46738h4016N494B99884
9086A12153B7588b38339C8151e9554F8510a78197a5765j12333B2152L0895L9453
$$ plain form
9171 -17498 241200 -135661 -151465 -104448 133782 -115195 142885 -48994 -423470 57960 168962
9160 168962 -394789 -176258 45728 -149707 -310616 -254047 16281 54917 -66028 106846 -23978
9148 -156241 -457680 -368108 -203113 -125811 -31570 -29656 -38081 -89688 95571 172144 224487 96545
9135 -140511 -44906 -202075 57779 16921 -83518 86191 -12543 -357594 59352 123439 -164947
9123 108763 96022 -11723 -38633 273229 63637 79703 145662 -439429 -15012 62168 -46270
9111 205687 -219098 114835 2363 28848 103255 -59284 -176888 33731 -211012 -206576 -16634
9099 46246 218284 110257 43482 -51171 -114210 -122569 -221005 -58703 -205441 -84016 -78522 299884
9086 112153 27588 -238339 38151 -59554 68510 -178197 -15765 -128098 22152 53047 92500
9075I2500b663p7067p9990I4851b68756K7789A13435d5272j16174p6307J16605
9064a21148A30726f9016k33759I811L7998O4513m3242F599a84372C5486h3283
9052a03922D1908A6081a29578A0065b2135p0707d3277B5222a090j44997C7595
9040C7837N2186c2679o7823D2522f0148J1210E8544b6179B44839e0250k27276
9029b77526P1654E7543a37405N1417k48531B41054b95716E9827R8617E6924b49797
9017A26712D6749c7287B85031b4579r1140N6503j13545p5509A88063n6989K09835
9006C40909A08808g2421b7350p7889r9899k30971d9126J6817j87750A00750c21030
8994A47137F1256h7147A04005H682a90526r2917i7660C8276K0292O9582B601b26325
$$ plain form
9075 92500 -2663 -79730 -159720 94851 -268756 -240967 113435 -45272 -161446 -237753 -121148
9064 -121148 130726 -69016 -302775 9811 47809 112322 69080 6599 -184372 35486 -83283
9052 -103922 41908 16081 -129578 10065 -22135 -92842 -43277 25222 -1090 -146087 37595
9040 37837 90023 -32679 -100502 42522 -60148 -48938 58544 -26179 244839 -50250 -277526
9029 -277526 -205872 57543 -137405 -85988 -334519 241054 -295716 59827 158444 56924 -249797
9017 126712 46749 -37287 285031 -24579 -115719 -59216 -172761 -248270 188063 131074 340909
9006 340909 108808 -72421 -27350 -105239 -205138 -436109 -49126 -32309 -220059 100750 -321030
8994 147137 61256 -87147 104005 8682 -190526 -283443 -97660 38276 58568 128150 2601 -226325
8981A670R6259a86437o1158m0674B04921H9478K27712b27813E2497a36890k8293
8970a65183o5451J2925B09453I0528b32016q9447d7101l1032a7584F1827d49360
8958c07461E5405J96185I87J29652l5850A1523R9095J33916A05150D3494b15464
8946f8681E1735b72046A28437a8768n8432k52381m0858a36433e7535B62396c535
8934A78670f1762o3318p5774I8247b15931a092j68404m6037B27978E1508A0989
8922c17531H035a03198a0973G0531f8478j59108A22142a33247j18339B79418f8203
8910C9900O9186j7447N2002J21851a70402e1862k32314f4824A81800j928b33085
8898f1627E3748d4813k515B65316A17165k7055a88651j8921Q1562H2761a87348
$$ plain form
8981 1670 97929 -186437 -247595 -288269 204921 89478 317190 -227813 52497 -136890 -165183
8970 -165183 -230634 -217709 209453 90528 -232016 -321463 -47101 -78133 -17584 61827 -449360
8958 -307461 55405 251590 987 130639 94789 11523 110618 244534 105150 43494 -215464
8946 -68681 51735 -272046 128437 -18768 -77200 -329581 -370439 -136433 -57535 262396 -3535
8934 178670 -61762 -125080 -200854 98247 -215931 -1092 -169496 -215533 227978 51508 10989
8922 -317531 8035 -103198 -10973 70531 -68478 -227586 122142 -133247 -251586 279418 -68203
8910 39900 109086 91639 143641 265492 -170402 -51862 -284176 -64824 181800 179872 -233085
8898 -61627 53748 -44813 -47328 265316 117165 90110 -188651 -207572 -126010 82761 -187348
8886a31411N9011D5060j7991K26036b28671A99902a55743J8343q5190j9527A48471
8874A4854b38852R218A27052a62480A3144d72203C1531a15327C947b84811J35123
8863a49688e742H9927c3142A50872a87890j20535J19732C03283D5763g6556J7234
8852e9322B13269d7643j6560k71918E437a17862r7251j58159C7533c2371k1227
8841e3598B89084a10762K2545o6382K8071j03088I3506L3964c70081a2932j43452
$$ plain form
8886 -131411 -72400 45060 27069 253105 -228671 199902 -155743 -137400 -222590 -242117 148471
8874 14854 -238852 -229634 127052 -162480 13144 -472203 31531 -115327 3947 -284811 -149688
8863 -149688 -5742 89927 -33142 150872 -187890 -308425 -188693 303283 45763 -76556 -59322
8852 -59322 213269 -47643 -64203 -336121 5437 -117862 -215113 -373272 37533 -32371 -53598
8841 -53598 289084 -110762 -88217 -154599 -126528 -229616 93506 127470 -370081 -12932 -156384
$$ [...]
##END NTUPLES=NMR SPECTRUM
##END=
