##TITLE=AC1665_DOMRH14356_8531507_FL3YAM41Qn
##JCAMPDX= 6.0         $$ Bruker NMR JCAMP-DX V2.0
##DATA TYPE= NMR SPECTRUM
##DATA CLASS= NTUPLES
##ORIGIN= BRUKER
##OWNER= Administrator
$$ 1.72 TOPSPIN		Version 2.1
$$ 2015-08-07 20:39:42.516 -0700  Administrator@X
$$ Compression mode = diff/dup
##.OBSERVE FREQUENCY= 400.02188249412
##.OBSERVE NUCLEUS= ^1H
##.ACQUISITION MODE= SIMULTANEOUS (DQD)
##.ACQUISITION SCHEME= undefined
##.AVERAGES= 64
##.DIGITISER RES= 22
##SPECTROMETER/DATA SYSTEM= spect
##.PULSE SEQUENCE= noesygpps1d.comp
##.SOLVENT NAME= COFFEE_meoh
##.SHIFT REFERENCE= INTERNAL, COFFEE_meoh, 1, 14.96171
##AUDIT TRAIL= $$ (NUMBER, WHEN, WHO, WHERE, PROCESS, VERSION, WHAT)
$$ ##TITLE= Audit trail, TOPSPIN		Version 2.1
$$ ##JCAMPDX= 5.01
$$ ##ORIGIN= Bruker BioSpin GmbH
$$ ##OWNER= Administrator
$$ $$ E:\/data/COFFEE/nmr/AC1665_DOMRH14356_8531507_FL3YAM41Qn/22/pdata/1/auditp.txt
$$ ##AUDIT TRAIL=  $$ (NUMBER, WHEN, WHO, WHERE, PROCESS, VERSION, WHAT)
(   1,<2015-08-07 20:39:37.188 -0700>,<Administrator>,<X>,<go>,<TOPSPIN 2.1>,
      <created by zg
	started at 2015-08-07 20:28:07.094 -0700,
	POWCHK enabled, PULCHK disabled,
       configuration hash MD5:
       21 0F 79 D6 B3 7B B4 F6 88 20 88 DB 03 48 BD 9F
       data hash MD5: 64K
       DA F4 A0 0C 3C 20 7B 84 3E 26 D1 49 4F BA F9 D5>)
(   2,<2015-08-07 20:39:40.422 -0700>,<Administrator>,<X>,<proc1d>,<TOPSPIN 2.1>,
      <Start of raw data processing
       efp LB = 0.3 FT_mod = 6 PKNL = 1 PHC0 = 0 PHC1 = 0 SI = 128K 
       data hash MD5: 128K
       00 2B 00 F4 1E AF 85 48 D2 40 00 85 29 56 9F 59>)
(   3,<2015-08-07 20:39:41.328 -0700>,<Administrator>,<X>,<proc1d>,<TOPSPIN 2.1>,
      <pk PHC0 = -85.1001 PHC1 = 0 
       data hash MD5: 128K
       F4 25 62 EB 22 B5 C4 A2 1B E7 0E E2 2C B6 DD 06>)
(   4,<2015-08-07 20:39:41.703 -0700>,<Administrator>,<X>,<proc1d>,<TOPSPIN 2.1>,
      <abs ABSG = 1 
       data hash MD5: 128K
       83 3B 45 C9 79 C6 AD E5 6D D1 94 73 25 DC 83 AD>)
(   5,<2015-08-07 20:39:41.797 -0700>,<Administrator>,<X>,<proc1d>,<TOPSPIN 2.1>,
      <abs ABSG = 2 
       data hash MD5: 128K
       2A DD CC D7 3D F0 47 DC 53 2E CC 57 8F C6 6B BB>)
(   6,<2015-08-07 20:39:41.875 -0700>,<Administrator>,<X>,<proc1d>,<TOPSPIN 2.1>,
      <abs ABSG = 3 
       data hash MD5: 128K
       C8 36 4F 09 C3 93 2A CD 83 D4 3E E5 73 52 59 F9>)
(   7,<2015-08-07 20:39:41.953 -0700>,<Administrator>,<X>,<proc1d>,<TOPSPIN 2.1>,
      <abs ABSG = 4 
       data hash MD5: 128K
       10 1B AF 6A E2 08 01 37 BA 0A 35 A5 27 87 D8 56>)
(   8,<2015-08-07 20:39:42.094 -0700>,<Administrator>,<X>,<proc1d>,<TOPSPIN 2.1>,
      <abs ABSG = 5 
       data hash MD5: 128K
       82 A2 C8 11 FE FA 2C 44 AB 6F EE 4F CF 91 BF FB>)
$$ ##END=
$$ 
$$ $$ hash MD5
$$ $$ B7 7F 0D 75 1C D2 54 F3 96 1F 9D 51 FA 0F 93 71
##$RELAX= 
##$RELAX= 
##$RELAX= 
##$RELAX= 
##$RELAX= 
##$RELAX= 
##$RELAX= 
##$RELAX= 
$$ Bruker specific parameters
$$ --------------------------
##$DU= <E:\>
##$EXPNO= 22
$$ [...]
##$TP07= 0
##$TPNAME0= <>
##$TPNAME1= <>
##$TPNAME2= <>
##$TPNAME3= <>
##$TPNAME4= <>
##$TPNAME5= <>
##$TPNAME6= <>
##$TPNAME7= <>
##$TPOAL= (0..7)
0.5 0.5 0.5 0.5 0.5 0.5 0.5 0.5
##$TPOFFS= (0..7)
0 0 0 0 0 0 0 0
##$TUNHIN= 0
##$TUNHOUT= 0
##$TUNXOUT= 0
##$USERA1= <user>
##$USERA2= <user>
##$USERA3= <user>
##$USERA4= <user>
##$USERA5= <user>
##$V9= 5
##$VALIST= <valist>
##$VCLIST= <CCCCCCCCCCCCCCC>
##$VD= 0
##$VDLIST= <DDDDDDDDDDDDDDD>
##$VPLIST= <PPPPPPPPPPPPPPP>
##$VTLIST= <TTTTTTTTTTTTTTT>
##$WBST= 2048
##$WBSW= 25
##$XGAIN= (0..3)
0 0 0 0
##$XL= 0
##$YL= 0
##$YMAX_a= 7759995
##$YMIN_a= -13267861
##$ZGOPTNS= <>
##$ZL1= 120
##$ZL2= 120
##$ZL3= 120
##$ZL4= 120
##$ABSF1= 14.96171
##$ABSF2= -5.596472
##$ABSG= 5
##$ABSL= 3
##$ALPHA= 0
##$AQORDER= 0
##$ASSFAC= 0
##$ASSFACI= 0
##$ASSFACX= 0
##$ASSWID= 0
##$AUNMP= <proc_prof1d_extract.lims>
##$AXLEFT= 0
##$AXNAME= <>
##$AXNUC= <1H>
##$AXRIGHT= 0
##$AXTYPE= 0
##$AXUNIT= <>
##$AZFE= 0.1
##$AZFW= 0.1
##$BCFW= 0
##$BC_mod= 0
##$BYTORDP= 0
##$COROFFS= 0
##$CY= 15
##$DATMOD= 1
##$DC= 0
##$DFILT= <>
##$DTYPP= 0
##$F1P= 0
##$F2P= 0
##$FCOR= 0.5
##$FTSIZE= 131072
##$FT_mod= 6
##$GAMMA= 0
##$GB= 0
##$INTBC= 1
##$INTSCL= 1
##$ISEN= 128
##$LB= 0.3
##$LEV0= 0
##$LPBIN= 0
##$MAXI= 10000
##$MC2= 0
##$MEAN= 0
##$ME_mod= 0
##$MI= 0
##$NCOEF= 0
##$NC_proc= -3
##$NLEV= 6
##$NOISF1= 0
##$NOISF2= 0
##$NSP= 0
##$NTH_PI= 0
##$NZP= 0
##$OFFSET= 14.96171
##$PC= 1
##$PHC0= -85.1001
##$PHC1= 0
##$PH_mod= 1
##$PKNL= yes
##$PPARMOD= 0
##$PPDIAG= 0
##$PPIPTYP= 0
##$PPMPNUM= 2147483647
##$PPRESOL= 1
##$PSCAL= 4
##$PSIGN= 0
##$PYNMP= <proc.py>
##$REVERSE= no
##$SF= 400.020009354396
##$SI= 131072
##$SIGF1= 0
##$SIGF2= 0
##$SINO= 400
##$SIOLD= 131072
##$SPECTYP= <>
##$SREGLST= <1H.CDCl3>
##$SSB= 0
##$STSI= 131072
##$STSR= 0
##$SW_p= 8223.68421052631
##$SYMM= 0
##$S_DEV= 0
##$TDeff= 65536
##$TDoff= 0
##$TI= <>
##$TILT= no
##$TM1= 0
##$TM2= 0
##$TOPLEV= 0
##$USERP1= <user>
##$USERP2= <user>
##$USERP3= <user>
##$USERP4= <user>
##$USERP5= <user>
##$WDW= 1
##$XDIM= 131072
##$YMAX_p= 360581361
##$YMIN_p= -22028
##$CURPLOT= <Network HP LaserJet P1505>
##$CURPRIN= <$Network HP LaserJet P1505>
##$DFORMAT= <normdp>
##$LAYOUT= <+/1D_H.xwp>
##$LFORMAT= <normlp>
##$PFORMAT= <normpl>
##$SURQMSG= 1
$$ End of Bruker specific parameters
$$ ---------------------------------
##NTUPLES= NMR SPECTRUM
##VAR_NAME=  FREQUENCY,     SPECTRUM/REAL,   SPECTRUM/IMAG
##SYMBOL=    X,             R,               I
##VAR_TYPE=  INDEPENDENT,   DEPENDENT,       DEPENDENT
##VAR_FORM=  AFFN,          ASDF,            ASDF
##VAR_DIM=   131072,        131072,          131072
##UNITS=     HZ,            ARBITRARY UNITS, ARBITRARY UNITS
##FACTOR=    0.0627417313425164, 1,          1
##FIRST=     8223.62146879497, -514,         -85268
##LAST=      0,             2201,            -86584
##MIN=       0,             -22028,          0
##MAX=       8223.62146879497, 360581361,    0
$$ Real data points
##PAGE= N=1
##DATA TABLE= (X++(R..R)), XYDATA
$$ [...]
$$ plain form
62515 1068739 1071880 1075467 1080811 1088922 1098538 1106976 1112950 1117627 1122711 1128369 1133468 1137226 1139993 1142636
62501 1142636 1145606 1148552 1150622 1151119 1149965 1147495 1143975 1139516 1134370 1128912 1123220 1116983 1109929 1102097
62487 1102097 1093689 1084932 1076102 1067438 1059015 1050976 1043726 1037368 1031004 1023346 1014285 1005225 997478 990944
62473 990944 984892 979486 975626 973533 972336 971206 970235 969966 970570 971885 973951 977174 981912 987976 994451
62458 994451 1000132 1004448 1008078 1012459 1018539 1026071 1034064 1041700 1048784 1055618 1062644 1070062 1077673 1085194
62444 1085194 1092795 1101061 1110228 1119688 1128599 1136842 1145001 1153366 1161416 1168517 1174799 1180899 1186845 1191575
62430 1191575 1193811 1193357 1191483 1189976 1189732 1190166 1189978 1188490 1186050 1183137 1179548 1174961 1170067 1166296 1164293
62415 1164293 1163335 1162608 1162230 1162293 1161676 1159069 1155049 1151876 1150890 1151159 1151107 1150434 1149660 1148783 1147625 1146993 1148028
$$ packed form
62515A068739L141L587N344Q111R616Q438N974M677N084N658N099L758K767K643
62501A142636K970K946K070M97j154k470l520m459n146n458n692o237p054p832
62487A102097q408q757q830q664q423q039p250o358o364p658r061r060p747o534
62473I90944o052n406l860k093j197j130r71k69O04J315K066L223M738O064O475
62458I94451N681M316L630M381O080P532P993P636P084O834P026P418P611P521
62444A085194P601Q266R167R460Q911Q243Q159Q365Q050P101O282O100N946M730
62430A191575K236m54j874j507k44M34j88j488k440k913l589m587m894l771k003
62415A164293r58p27l78O3o17k607m020l173r86K69n2o73p74q77j158o32J035
$$ plain form
62398 1148028 1150358 1152169 1152502 1152513 1153869 1156658 1159634 1162027 1164326 1167421 1171603 1176451 1181285 1185726 1189999
62383 1189999 1194580 1199299 1203087 1205025 1205467 1205688 1206586 1208254 1210760 1214559 1219853 1226043 1232245 1238167 1244172
62368 1244172 1250705 1257883 1265511 1273302 1281180 1289472 1298606 1308533 1318706 1328751 1338732 1348467 1356985
62355 1356985 1363264 1367393 1370452 1373222 1375583 1377390 1379450 1383067 1388724 1395555 1402218 1407973 1412814 1416836
62341 1416836 1419856 1421677 1422398 1422380 1422228 1422873 1425121 1428582 1431509 1432454 1431815 1430841 1429296 1425545 1419359 1413116
62325 1413116 1409040 1406314 1402413 1396689 1390962 1386667 1383120 1379053 1374501 1370405 1367310 1365148 1363649 1362325
62311 1362325 1360658 1358815 1357665 1357625 1358091 1358407 1358771 1359589 1360567 1361104 1361129 1360949 1360680 1360444 1360623 1361294 1361750 1361245
62293 1361245 1359892 1358282 1356674 1355211 1354412 1354602 1355124 1355054 1354535 1354663 1356149 1358849 1362413 1366535 1370608 1374050
$$ packed form
62398A148028K330J811L33J1J356K789K976K393K299L095M182M848M834M441M273
62383A189999M581M719L788J938M42K21Q98J668K506L799N294O190O202N922O005
62368A244172O533P178P628P791P878Q292R134R927J0173J0045R981R735Q518
62355A356985O279M129L059K770K361J807K060L617N657O831O663N755M841M022
62341A416836L020J821P21j8j52O45K248L461K927R45o39r74j545l751o186o243
62325A413116m076k726l901n724n727m295l547m067m552m096l095k162j499j324
62311A362325j667j843j150m0M66L16L64Q18R78N37K5j80k69k36J79O71M56n05
62293A361245j353j610j608j463p99J90N22p0n19J28J486K700L564M122M073L442
$$ plain form
62277 1374050 1377094 1380584 1384854 1389478 1394107 1398932 1404297 1410552 1418279 1427844 1438532 1448914 1458347
62264 1458347 1467493 1477173 1487451 1498100 1509251 1521053 1533166 1545001 1556156 1566359 1575326 1582921
62252 1582921 1589161 1593959 1597160 1598892 1599496 1599083 1597477 1594550 1590202 1584169 1576393 1567380 1557657 1547223
62238 1547223 1536312 1526224 1518161 1511404 1504076 1495803 1488085 1481742 1475786 1469597 1464455 1461494 1459515
62225 1459515 1456518 1452556 1449276 1447161 1445012 1442067 1439071 1436969 1435880 1435677 1436465 1438032 1439659 1440966
62211 1440966 1442272 1443804 1445080 1445450 1444812 1443595 1442401 1441819 1442166 1443212 1444450 1445738 1447476 1450203 1454189
62196 1454189 1459184 1464225 1468043 1470290 1472236 1475549 1480425 1485467 1489426 1492438 1495478 1499224 1503637 1508179
62182 1508179 1512178 1515233 1517414 1519006 1520257 1521604 1523756 1526978 1530569 1533681 1536474 1539746 1543607 1547430
$$ packed form
62277A374050L044L490M270M624M629M825N365O255P727R565J0688J0382R433
62264A458347R146R680J0278J0649J1151J1802J2113J1835J1155J0203Q967P595
62252A582921O240M798L201J732O04m13j606k927m348o033p776r013r723j0434
62238A547223j0911j0088q063o757p328q273p718o343n956o189n142k961j979
62225A459515k997l962l280k115k149k945k996k102j089k03P88J567J627J307
62211A440966J306J532J276L70o38j217j194n82L47J046J238J288J738K727L986
62196A454189M995N041L818K247J946L313M876N042L959L012L040L746M413M542
62182A508179L999L055K181J592J251J347K152L222L591L112K793L272L861L823
$$ plain form
62168 1547430 1551106 1555338 1560367 1565186 1568466 1569760 1569566 1568792 1568352 1568555 1568541 1566991 1563840 1560639 1558785
62153 1558785 1557992 1557024 1555275 1552901 1550041 1546844 1543972 1542133 1541102 1540002 1538515 1537039 1535540 1533097
62139 1533097 1529031 1523853 1518574 1513474 1508170 1502676 1497671 1493604 1490047 1486165 1481542 1476342 1471051 1466365
62125 1466365 1463017 1461127 1459815 1457924 1455116 1451795 1448031 1443289 1437409 1431110 1425182 1419875 1415580 1413252
62111 1413252 1413196 1413988 1413730 1412223 1410803 1410049 1408822 1405930 1401754 1397615 1394201 1391245 1388311 1385248 1382105
62096 1382105 1379052 1376320 1373857 1371109 1367352 1362345 1356677 1351561 1348071 1346346 1345607 1345174 1345161 1345794 1346417
62081 1346417 1345872 1343814 1341011 1338441 1336673 1335988 1336309 1336927 1337058 1336677 1336178 1335298 1333293 1330083 1326150 1321292
62065 1321292 1314795 1307075 1299673 1293064 1285904 1277260 1268116 1259517 1250599 1240024 1228438 1217756 1208552
$$ packed form
62168A547430L676M232N029M819L280J294j94p74m40K03j4j550l151l201j854
62153A558785p93r68j749k374k860l197k872j839j031j100j487j476j499k443
62139A533097m066n178n279n100n304n494n005m067l557l882m623n200n291m686
62125A466365l348j890j312j891k808l321l764m742n880o299n928n307m295k328
62111A413252n6P92k58j507j420p54j227k892m176m139l414k956k934l063l143
62096A382105l053k732k463k748l757n007n668n116l490j725p39m33j3O33O23
62081A346417n45k058k803k570j768o85L21O18J31l81m99q80k005l210l933m858
62065A321292o497p720p402o609p160q644r144q599q918j0575j1586j0682r204
$$ plain form
62052 1208552 1199822 1191063 1182947 1175880 1169265 1162438 1155314 1148015 1140755 1134067 1128255 1122844 1117594 1113619
62038 1113619 1112038 1111618 1109449 1104345 1098095 1092965 1089493 1087429 1087156 1088815 1091074 1092260 1092346 1092730 1094303
62023 1094303 1096634 1098895 1100804 1102636 1104754 1107155 1109368 1111098 1112943 1115748 1119139 1121625 1122607 1123272
62009 1123272 1124785 1126611 1127686 1128409 1130082 1132767 1135127 1136371 1137056 1137737 1138012 1137523 1137099 1138210 1141497
61994 1141497 1146150 1150545 1153346 1154299 1154118 1153634 1153194 1152895 1152859 1152859 1152194 1150588 1148818 1147681 1146740 1145037 1142797
61977 1142797 1141261 1140903 1141015 1141210 1141990 1143358 1144162 1143654 1142694 1142447 1142618 1141982 1140135 1137748 1135560 1134099
61961 1134099 1133985 1135416 1137453 1138812 1139469 1140732 1143750 1148700 1155315 1163189 1171430 1178970 1185603 1192078
61947 1192078 1198976 1206220 1213785 1221825 1229710 1236145 1241180 1247196 1256554 1268662 1280597 1290613 1299792
$$ packed form
62052A208552q730q759q116p067o615o827p124p299p260o688n812n411n250l975
62038A113619j581m20k169n104o250n130l472k064k73J659K259J186Q6L84J573
62023A094303K331K261J909J832K118K401K213J730J845K805L391K486R82O65
62009A123272J513J826J075P23J673K685K360J244O85O81K75m89m24J111L287
61994A141497M653M395K801R53j81m84m40k99l6%o65j606j770j137r41j703k240
61977A142797j536l58J12J95P80J368Q04n08r60k47J71o36j847k387k188j461
61961A134099j14J431K037J359O57J263L018M950O615P874Q241P540O633O475
61947A192078O898P244P565Q040P885O435N035O016R358J2108J1935J0016R179
$$ plain form
61934 1299792 1309958 1321075 1331495 1340171 1347745 1355456 1363573 1371140 1377145 1381692 1385882 1390524 1395277
61921 1395277 1399361 1402865 1406705 1411190 1415231 1417462 1417808 1417564 1418166 1420364 1424359 1429923 1436019 1440930 1443489
61906 1443489 1444199 1444689 1445912 1447244 1447492 1446309 1444221 1441561 1438116 1433879 1429455 1425271 1420881 1415658 1410059
61891 1410059 1405543 1403099 1402174 1401195 1398910 1395281 1391416 1388720 1387783 1387826 1387466 1386091 1384289 1382909 1382170 1381923
61875 1381923 1382299 1383582 1385561 1387507 1388902 1389922 1391172 1393143 1395942 1399419 1403468 1408176 1413516 1418878
61861 1418878 1423280 1426308 1428579 1430991 1433820 1437010 1440941 1446114 1452045 1457337 1461176 1464202 1467534 1471421
61847 1471421 1475147 1477821 1478896 1478481 1477617 1477658 1478700 1479028 1476923 1472673 1467928 1463420 1458480 1452742 1446848
61832 1446848 1441023 1434339 1426420 1418882 1413780 1411052 1408719 1405334 1401046 1396302 1390793 1384194 1377035 1370225
$$ packed form
61934A299792J0166J1117J0420Q676P574P711Q117P567O005M547M190M642M753
61921A395277M084L504L840M485M041K231L46k44O02K198L995N564O096M911K559
61906A443489P10M90J223J332K48j183k088k660l445m237m424m184m390n223n599
61891A410059m516k444r25r79k285l629l865k696r37M3l60j375j802j380p39k47
61875A381923L76J283J979J946J395J020J250J971K799L477M049M708N340N362
61861A418878M402L028K271K412K829L190L931N173N931N292L839L026L332L887
61847A471421L726K674J075m15q64M1J042L28k105m250m745m508m940n738n894
61832A446848n825o684p919p538n102k728k333l385m288m744n509o599p159o810
$$ plain form
61818 1370225 1364150 1358533 1352764 1346202 1338811 1331784 1326865 1324479 1322956 1320054 1314963 1308597 1302511 1297952
61804 1297952 1295283 1293580 1291153 1287247 1282990 1280006 1278422 1277080 1275444 1274184 1273685 1272979 1270713 1266638
61790 1266638 1261870 1258152 1257004 1258713 1261595 1262843 1260929 1256937 1253103 1250377 1248009 1245086 1241543 1237609
61776 1237609 1233286 1228897 1225551 1224287 1224844 1225740 1225587 1223987 1221137 1217164 1212303 1207440 1203805 1201868 1200855
61761 1200855 1199617 1197762 1195594 1193226 1190275 1186478 1182061 1177293 1172088 1166508 1161371 1157686 1155350 1152912
61747 1152912 1149070 1144202 1139992 1137516 1136112 1134260 1131144 1127020 1122487 1118049 1114299 1111775 1110347 1109237
61733 1109237 1107949 1106779 1106148 1105828 1105133 1103471 1100415 1095841 1090520 1086021 1083278 1081572 1079685 1077697 1076634
61718 1076634 1076504 1075801 1073212 1068994 1064296 1059904 1055990 1052491 1049300 1046506 1044613 1044000 1043992 1043168 1040799 1037258
$$ packed form
61818A370225o075n617n769o562p391p027m919k386j523k902n091o366o086m559
61804A297952k669j703k427l906m257k984j584j342j636j260m99p06k266m075
61790A266638m768l718j148J709K882J248j914l992l834k726k368k923l543l934
61776A237609m323m389l346j264N57Q96j53j600k850l973m861m863l635j937j013
61761A200855j238j855k168k368k951l797m417m768n205n580n137l685k336k438
61747A152912l842m868m210k476j404j852l116m124m533m438l750k524j428j110
61733A109237j288j170o31l20o95j662l056m574n321m499k743j706j887j988j063
61718A076634j30p03k589m218m698m392l914l499l191k794j893o13qq24k369l541
$$ plain form
61702 1037258 1032889 1027469 1021298 1015757 1011850 1008959 1005977 1003038 1000940 999218 996124 990678 983724 976669
61688 976669 969967 963357 957027 951936 948866 947301 945474 941883 936925 932614 930417 929791 929157 927687 925507
61673 925507 922774 919526 916176 913130 910012 906207 902206 899344 897957 896783 894627 891883 889833 889042
61659 889042 888972 888719 887581 885286 882244 879431 877597 876668 876054 875293 874116 872280 869720 866721 863612 860398
61643 860398 856922 853196 849333 845343 841351 837868 835496 834403 834345 835141 836680 838393 839136 837973 834997
61628 834997 831078 826801 821970 816385 810878 807115 806168 807438 809093 809491 808166 805753 803180 800855 798529
61613 798529 795923 793314 791182 789445 787613 785719 784341 783440 782046 779685 777356 776168 775586 774172 771731
61598 771731 769451 767939 766414 764203 761861 760150 758929 757872 757553 758783 761104 762926 763238 762588 762173
$$ packed form
61702A037258m369n420o171n541l907k891k982k939k098j722l094n446o954p055
61688I76669o702o610o330n091l070j565j827l591m958m311k197o26o34j470k180
61673I25507k733l248l350l046l118l805m001k862j387j174k156k744k050p91
61659H89042p0k53j138k295l042k813j834r29o14p61j177j836k560k999l109l214
61643H60398l476l726l863l990l992l483k372j093n8P96J539J713P43j163k976
61628H34997l919m277m831n585n507l763r47J270J655L98j325k413k573k325k326
61613G98529k606k609k132j737j832j894j378r01j394k361k329j188n82j414k441
61598G71731k280j512j525k211k342j711j221j057l19J230K321J822L12o50m15
$$ plain form
61583 762173 762444 762887 763003 763087 763783 765053 766089 766462 766806 767798 768834 768572 766703 764358 762707 761978 762008
61566 762008 762786 763976 764691 764427 763749 763560 764152 765377 767185 769409 771517 773158 774505 775515 775442 773869
61550 773869 771837 771036 772016 773951 775981 777925 779630 780486 780009 778513 777069 777070 779560 784263 789211 792114
61534 792114 792493 792043 792617 794310 795832 796312 796177 796464 797756 799873 802249 804430 806346 808127 809683 810520
61518 810520 810240 809302 809063 810775 814510 819324 824346 829270 833695 836699 837685 837265 836633 836338 836424 837502
61502 837502 840447 844768 848395 849785 849498 849076 849123 849307 849573 850224 851060 851463 851391 851495 852184 853231 854358
61485 854358 855552 856684 857441 857925 858847 860842 863749 866666 868491 868529 866970 864951 863913 864715 867320 871069
61469 871069 875115 878878 882422 886145 889829 892416 893214 893065 893681 895914 899100 901919 903380 903253 902275
$$ packed form
61583G62173K71M43J16Q4O96J270J036L73L44R92J036k62j869k345j651p29L0
61566G62008P78J190P15k64o78j89N92J225J808K224K108J641J347J010p3j573
61550G73869k032q01R80J935K030J944J705Q56m77j496j444JK490M703M948K903
61534G92114L79m50N74J693J522M80j35K87J292K117K376K181J916J781J556Q37
61518H10520k80r38k39J712L735M814N022M924M425L004R86m20o32k95Q6J078
61502H37502K945M321L627J390k87m22M7J84K66O51Q36M03p2J04O89J047J127
61485H54358J194J132P57M84R22J995K907K917J825L8j559k019j038Q02K605L749
61469H71069M046L763L544L723L684K587P98j49O16K233L186K819J461j27r78
$$ plain form
61454 902275 901898 903175 905848 909032 912637 917322 923123 929027 934233 939130 944609 950869 957227 962833
61440 962833 967386 971503 976314 982206 987962 991811 993460 994433 996272 999154 1002523 1006157 1010059 1013990
61426 1013990 1017838 1021930 1026282 1029903 1031557 1031027 1029061 1026351 1023312 1020763 1019967 1021577 1024803 1027993
61412 1027993 1030055 1031354 1033241 1036714 1041589 1047155 1053300 1060327 1067526 1072844 1074735 1074018 1073161 1073798 1075601
61397 1075601 1077547 1079541 1082404 1086647 1091752 1096596 1100344 1102917 1104797 1106539 1108420 1110492 1112893 1116168
61383 1116168 1121084 1127718 1134586 1139279 1140714 1140610 1142068 1146560 1152850 1158719 1162973 1165648 1167379 1169269
61369 1169269 1172577 1177571 1183065 1187874 1192336 1197526 1203243 1207888 1210467 1211797 1213456 1216303 1220422 1225700
61355 1225700 1231762 1237746 1242840 1247033 1250964 1255111 1259480 1264058 1269139 1274985 1281268 1286993 1291053 1293038
$$ packed form
61454I02275l77J277K673L184L605M685N801N904N206M897N479O260O358N606
61440I62833M553M117M811N892N756L849J649R73J839K882L369L634L902L931
61426A013990L848M092M352L621J654n30j966k710l039k549p96J610L226L190
61412A027993K062J299J887L473M875N566O145P027P199N318J891p17q57O37J803
61397A075601J946J994K863M243N105M844L748K573J880J742J881K072K401L275
61383A116168M916O634O868M693J435j04J458M492O290N869M254K675J731J890
61369A169269L308M994N494M809M462N190N717M645K579J330J659K847M119N278
61355A225700O062N984N094M193L931M147M369M578N081N846O283N725M060J985
$$ plain form
61341 1293038 1293575 1293854 1294662 1295917 1297119 1298100 1299143 1300492 1302083 1303898 1306276 1309520 1313247 1316465 1318459
61326 1318459 1319409 1320018 1320734 1321464 1321846 1321574 1320709 1319955 1320360 1322300 1324962 1327400 1330003 1334099 1339859 1345369
61310 1345369 1348514 1349451 1350541 1353824 1359068 1364442 1368716 1372421 1376924 1382677 1388677 1393623 1397162 1399675
61296 1399675 1401199 1401319 1400215 1399184 1399708 1402281 1406322 1410804 1414747 1417606 1419699 1422072 1425567 1430123
61282 1430123 1435128 1440076 1444626 1448504 1451790 1455038 1458692 1462752 1467447 1473667 1481908 1490915 1498263 1502423
61268 1502423 1503797 1503745 1503264 1502743 1502316 1501998 1501735 1501617 1501811 1502131 1501878 1500359 1497555 1494214 1491170 1488447 1485162
61251 1485162 1480620 1475489 1471258 1468331 1465411 1461356 1456907 1453708 1452220 1451649 1451492 1451713 1451612 1450254 1448391
61236 1448391 1448269 1450554 1452867 1452637 1450447 1449071 1449886 1451880 1453920 1456216 1459118 1461956 1463918 1465112 1465930
$$ packed form
61341A293038N37K79Q08J255J202R81J043J349J591J815K378L244L727L218J994
61326A318459R50O09P16P30L82k72q65p54M05J940K662K438K603M096N760N510
61310A345369L145R37J090L283N244N374M274L705M503N753O000M946L539K513
61296A399675J524J20j104j031N24K573M041M482L943K859K093K373L495M556
61282A430123N005M948M550L878L286L248L654M060M695O220Q241R007P348M160
61268A502423J374n2m81n21m27l18k63j18J94L20k53j519k804l341l044k723l285
61251A485162m542n131m231k927k920m055m449l199j488n71j57K21j01j358j863
61236A448391j22K285K313k30k190j376Q15J994K040K296K902K838J962J194Q18
$$ plain form
61221 1465930 1466143 1465594 1465325 1466850 1470241 1473858 1476264 1477740 1479496 1482032 1484912 1487858 1491210 1495252 1499787
61206 1499787 1504684 1510311 1516863 1523544 1528968 1532407 1534419 1536398 1539728 1545037 1551657 1557899 1562337 1564807
61192 1564807 1565798 1565226 1562619 1558459 1554294 1551004 1547779 1543426 1538066 1532804 1528192 1523898 1519697 1515894
61178 1515894 1512536 1508781 1503390 1495691 1486146 1476236 1467652 1461128 1456029 1451364 1447040 1443737 1441729 1440509
61164 1440509 1439737 1439916 1441729 1444997 1448652 1451625 1453596 1455040 1456721 1459099 1462147 1465778 1470206 1475600
61150 1475600 1481477 1486986 1491822 1496365 1500702 1504224 1506764 1509641 1514658 1522046 1530075 1537012 1542973 1549498
61136 1549498 1557658 1567080 1576757 1586299 1596148 1606807 1618254 1630203 1642674 1655941 1669886 1683707
61124 1683707 1696592 1708573 1720411 1732711 1745550 1759082 1774002 1790910 1809384 1828177 1846441
$$ packed form
61221A465930K13n49k69J525L391L617K406J476J756K536K880K946L352M042M535
61206A499787M897N627O552O681N424L439K012J979L330N309O620O242M438K470
61192A564807R91n72k607m160m165l290l225m353n360n262m612m294m201l803
61178A515894l358l755n391p699r545r910q584o524n099m665m324l303k008j220
61164A440509p72J79J813L268L655K973J971J444J681K378L048L631M428N394
61150A475600N877N509M836M543M337L522K540K877N017P388Q029O937N961O525
61136A549498Q160R422R677R542R849J0659J1447J1949J2471J3267J3945J3821
61124A683707J2885J1981J1838J2300J2839J3532J4920J6908J8474J8793J8264
$$ plain form
61113 1846441 1864419 1882904 1902392 1922947 1944583 1967437 1991718 2017796 2046295 2077938 2113258
61102 2113258 2152564 2196135 2244480 2298572 2359926 2430193 2510578 2601861 2705034 2821471 2952241
61091 2952241 3097702 3258156 3434421 3627203 3836379 4061749 4304307 4565929 4848138
61082 4848138 5152332 5481165 5838049 6224461 6638865 7079241 7545679 8039253 8559118
61073 8559118 9102378 9666557 10250422 10851695 11464913 12081754 12691655 13280560 13829923
61064 13829923 14319848 14736030 15075427 15346128 15562051 15736994 15881334 16000578 16093466
61055 16093466 16150394 16156023 16097086 15970408 15784942 15557535 15307444 15053067 14809938 14588763
61045 14588763 14394716 14229007 14090951 13978639 13888860 13817796 13761935 13718097 13683172 13654684
$$ packed form
61113A846441J7978J8485J9488K0555K1636K2854K4281K6078K8499L1643L5320
61102B113258L9306M3571M8345N4092O1354P0267Q0385R1283J03173J16437J30770
61091B952241J45461J60454J76265J92782K09176K25370K42558K61622K82209
61082D848138L04194L28833L56884L86412M14404M40376M66438M93574N19865
61073H559118N43260N64179N83865O01273O13218O16841O09901N88905N49363
61064A3829923M89925M16182L39397K70701K15923J74943J44340J19244R2888
61055A6093466N6928N629n8937j26678j85466k27407k50091k54377k43129k21175
61045A4588763j94047j65709j38056j12312q9779p1064n5861m3838l4925k8488
$$ plain form
61035 13654684 13631330 13612278 13596247 13582223 13570850 13563829 13561396 13561102 13559562 13554909 13547285 13537753 13527628
61022 13527628 13518546 13512274 13510226 13513532 13523504 13541398 13567530 13601012 13640721 13686339 13738230 13796578
61010 13796578 13860986 13930834 14005800 14086229 14173481 14269986 14378535 14501158 14638854 14792519
61000 14792519 14963795 15154633 15366249 15598957 15852866 16128111 16424174 16739517 17072591
60991 17072591 17423284 17792813 18180883 18580873 18975522 19336447 19629416 19823940 19902670
60982 19902670 19866150 19731207 19524203 19271764 18992045 18689156 18352249 17959670 17487683
60973 17487683 16921464 16263499 15534361 14765346 13988105 13227417 12499284 11812613 11172138
60964 11172138 10581030 10042110 9557462 9127753 8752385 8429859 8157316 7929996 7742120
$$ packed form
61035A3654684k3354j9052j6031j4024j1373p021k433k94j540m653p624r532j0125
61022A3527628r082o272k048L306R972J7894K6132L3482L9709M5618N1891N8348
61010A3796578O4408O9848P4966Q0429Q7252R6505J08549J22623J37696J53665
61000A4792519J71276J90838K11616K32708K53909K75245K96063L15343L33074
60991A7072591L50693L69529L88070L99990L94649L60925K92969J94524P8730
60982A9902670l6520j34943k07004k52439k79719l02889l36907l92579m71987
60973A7487683n66219o57965p29138p69015p77241p60688p28133o86671o40475
60964A1172138n91108n38920m84648m29709l75368l22526k72543k27320j87876
$$ plain form
60955 7742120 7588485 7464737 7366125 7286897 7221301 7164575 7112755 7062533 7012330 6963108 6916909
60944 6916909 6874116 6832493 6788908 6741290 6688433 6628562 6559318 6479719 6391648 6298678 6203396
60933 6203396 6106271 6006958 5905772 5803431 5700147 5595953 5491736 5388952 5288217 5188996
60923 5188996 5091001 4995059 4901948 4810921 4720159 4628575 4536492 4444516 4352408 4259455 4165657
60912 4165657 4072051 3979738 3888877 3798863 3709279 3620224 3531657 3443069 3354291 3266174 3179680
60901 3179680 3094410 3008876 2922449 2836341 2752304 2671024 2592289 2516143 2442971 2372535 2303668
60890 2303668 2235341 2167895 2102990 2042221 1985748 1932461 1881601 1833770 1789695 1748347 1707421
60879 1707421 1665939 1625375 1587673 1553131 1521003 1491120 1463599 1437518 1411404 1385081 1359767
$$ packed form
60955G742120j53635j23748r8612p9228o5596n6726n1820n0222n0203m9222m6199
60944F916909m2793m1623m3585m7618n2857n9871o9244p9599q8071r2970r5282
60933F203396r7125r9313j01186j02341j03284j04194j04217j02784j00735r9221
60923E188996r7995r5942r3111r1027r0762r1584r2083r1976r2108r2953r3798
60912D165657r3606r2313r0861r0014q9584q9055q8567q8588q8778q8117q6494
60901C179680q5270q5534q6427q6108q4037q1280p8735p6146p3172p0436o8867
60890B303668o8327o7446o4905o0769n6473n3287n0860m7831m4075m1348m0926
60879A707421m1482m0564l7702l4542l2128k9883k7521k6081k6114k6323k5314
$$ plain form
60868 1359767 1336262 1314232 1293573 1275174 1259652 1246314 1234196 1223346 1214155 1205971 1197455 1188217
60856 1188217 1179179 1171207 1163996 1156614 1148718 1141045 1134794 1130587 1127853 1125264 1121848 1117625 1113153 1108788
60842 1108788 1104590 1100593 1096713 1092666 1088444 1084670 1081849 1079334 1075798 1070936 1065965 1062078 1059058 1056084
60828 1056084 1053228 1051139 1049434 1046593 1041827 1036169 1031180 1027263 1023851 1020531 1017149 1013374 1009256 1005901
60814 1005901 1004242 1003041 999526 992598 984324 977458 972425 967753 962670 957924 954313 951675 949516 947585
60800 947585 945617 943228 940411 937566 934892 932273 929814 927835 926230 924537 922823 921680 921018 919713
60786 919713 917048 913917 911863 911290 911278 910894 909994 908884 907921 907558 908214 909830 911831 913685 915277 916675
60770 916675 917864 919008 920722 923607 927360 930773 932943 934253 935730 937616 939255 940391 941653 943298
$$ packed form
60868A359767k3505k2030k0659j8399j5522j3338j2118j0850r191q184q516r238
60856A188217r038p972p211p382p896p673o251m207k734k589l416m223m472m365
60842A108788m198l997l880m047m222l774k821k515l536m862m971l887l020k974
60828A056084k856k089j705k841m766n658m989l917l412l320l382l775m118l355
60814A005901j659j201l515o928q274o866n033m672n083m746l611k638k159j931
60800I47585j968k389k817k845k674k619k459j979j605j693j714j143o62j305
60786I19713k665l131k054n73j2l84r00j110r63l63O56J616K001J854J592J398
60770I16675J189J144J714K885L753L413K170J310J477J886J639J136J262J645
$$ plain form
60756 943298 944386 944031 942911 942575 943592 945266 946738 947186 945370 940577 934224 928947 925593 922472 918226
60741 918226 913963 911464 910513 909436 907499 905319 903395 901610 899993 898733 897575 896263 895410 895807 896985
60726 896985 897737 898036 899013 900778 901735 900775 898886 897567 896584 894683 892030 890503 891323 893456 894915 895026
60710 895026 894770 895161 896065 896806 897363 898358 899926 901146 900930 899209 897029 895618 895561 896714 898642 901110
60694 901110 904182 907796 911349 914097 915956 917510 919115 920517 921526 922415 923322 923919 924166 924721 925920
60679 925920 926958 927042 926878 927910 930250 932427 933271 933094 932818 932792 932811 932648 932213 931637 931309 931366 931198 930066
60661 930066 928284 927046 927022 927877 929367 932034 936285 941391 946024 949491 952132 954694 957551 960349 962465
60646 962465 964103 966674 971446 977972 984678 990951 997594 1005021 1012151 1017676 1021553 1024648 1027706 1031335
$$ packed form
60756I43298J088l55j120l36J017J674J472M48j816m793o353n277l354l121m246
60741I18226m263k499r51j077j937k180j924j785j617j260j158j312q53L97J178
60726H96985P52K99R77J765R57r60j889j319r83j901k653j527Q20K133J459J11
60710H95026k56L91R04P41N57R95J568J220k16j721k180j411n7J153J928K468
60694I01110L072L614L553K748J859J554J605J402J009Q89R07N97K47N55J199
60679I25920J038Q4j64J032K340K177Q44j77k76k6J9j63m35n76l28N7j68j132
60661I30066j782j238k4Q55J490K667M251N106M633L467K641K562K857K798K116
60646I62465J638K571M772O526O706O273O643P427P130N525L877L095L058L629
$$ plain form
60632 1031335 1036156 1042076 1048000 1053236 1058726 1065938 1074761 1083479 1090866 1097572 1105285 1115100 1126836 1139550
60618 1139550 1152502 1165661 1179242 1192823 1205386 1216458 1226749 1237397 1249009 1261716 1275509
60607 1275509 1289928 1303871 1316368 1327246 1336512 1343609 1348051 1350582 1352902 1356338 1361323 1367905 1375875
60594 1375875 1384472 1392788 1400792 1409479 1419885 1432251 1446040 1460340 1474395 1488324 1503339 1520730
60582 1520730 1540591 1561948 1584031 1606816 1630336 1654189 1678072 1702398 1728037 1755543 1784669
60571 1784669 1814456 1843890 1872694 1901325 1929913 1957476 1982656 2005025 2025177 2043705 2060756
60560 2060756 2076492 2091178 2104534 2115584 2123478 2128179 2130266 2130380 2128965 2126138 2121669 2115389 2107706
60547 2107706 2099474 2091362 2083572 2076048 2068697 2061648 2055682 2052057 2051317 2052550 2054537 2057360 2061974 2068395
$$ packed form
60632A031335M821N920N924N236N490P212Q823Q718P387O706P713R815J1736J2714
60618A139550J2952J3159J3581J3581J2563J1072J0291J0648J1612J2707J3793
60607A275509J4419J3943J2497J0878R266P097M442K531K320L436M985O582P970
60594A375875Q597Q316Q004Q687J0406J2366J3789J4300J4055J3929J5015J7391
60582A520730J9861K1357K2083K2785K3520K3853K3883K4326K5639K7506K9126
60571A784669K9787K9434K8804K8631K8588K7563K5180K2369K0152J8528J7051
60560B060756J5736J4686J3356J1050P894M701K087J14j415k827m469o280p683
60547B107706q232q112p790p524p351p049n966l625p40J233J987K823M614O421
$$ plain form
60533 2068395 2075396 2082094 2088703 2095434 2101768 2107254 2111962 2115476 2116475 2114246 2109812 2104580 2098423 2090190
60519 2090190 2079731 2068356 2057341 2046905 2036702 2026635 2017094 2008920 2003003 1999373 1996871 1994334
60507 1994334 1991956 1990740 1990824 1991340 1992002 1993741 1997269 2001992 2007133 2013340 2022071 2033532 2046176 2058491
60493 2058491 2070493 2082901 2095326 2106251 2114850 2121962 2128700 2134643 2138233 2138658 2136294 2131323 2123262
60480 2123262 2112455 2100690 2089061 2075969 2058809 2037303 2013512 1988496 1960857 1929386 1895506
60469 1895506 1861721 1828688 1795444 1761995 1729860 1700037 1672000 1645289 1620779 1599421 1580593
60458 1580593 1562736 1545349 1529482 1516304 1505853 1497220 1489410 1481883 1474622 1467811 1461275 1454305 1446361
60445 1446361 1437950 1430503 1425285 1422501 1421240 1419872 1416705 1411113 1404389 1398932 1396024 1394621 1392743 1389694
$$ packed form
60533B068395P001O698O609O731O334N486M708L514R99k229m434n232o157q233
60519B090190j0459j1375j1015j0436j0203j0067r541q174n917l630k502k537
60507A994334k378j216Q4N16O62J739L528M723N141O207Q731J1461J2644J2315
60493B058491J2002J2408J2425J0925Q599P112O738N943L590M25k364m971q061
60480B123262j0807j1765j1629j3092j7160k1506k3791k5016k7639l1471l3880
60469A895506l3785l3033l3244l3449l2135k9823k8037k6711k4510k1358j8828
60458A580593j7857j7387j5867j3178j0451q633p810p527p261o811o536o970p944
60445A446361q411p447n218k784j261j368l167n592o724n457k908j403j878l049
$$ plain form
60431 1389694 1386422 1383912 1382030 1380049 1377552 1374387 1370303 1365286 1360008 1355314 1351214 1346888 1341798 1336254
60417 1336254 1330647 1324724 1318256 1312066 1307472 1304540 1301725 1297737 1293126 1289196 1285816 1281437 1275434 1269354
60403 1269354 1265211 1263252 1262184 1261119 1260325 1260161 1260246 1260081 1259821 1259899 1260117 1259539 1257251 1253185 1248388 1244574
60387 1244574 1243024 1243509 1244390 1244119 1242706 1241550 1241879 1243541 1245310 1246081 1245608 1244278 1242499 1240431 1238164
60372 1238164 1235914 1233977 1232537 1231578 1230906 1230221 1229229 1227771 1225880 1223763 1221850 1220770 1220936 1221946 1222706
60357 1222706 1222544 1222084 1222608 1224582 1227269 1229858 1232307 1234663 1236108 1235578 1233383 1231414 1231318 1232948 1235031
60342 1235031 1236980 1239244 1242011 1244351 1245006 1243443 1239835 1234586 1228548 1223238 1219964 1218634 1218109 1217732 1217921
60327 1217921 1219217 1221545 1224550 1227821 1230414 1231139 1230136 1229377 1230489 1232481 1232868 1230977 1228938 1229073 1231439
$$ packed form
60431A389694l272k510j882j981k497l165m084n017n278m694m100m326n090n544
60417A336254n607n923o468o190m594k932k815l988m611l930l380m379o003o080
60403A269354m143j959j068j065p94j64Q5j65k60P8K18n78k288m066m797l814
60387A244574j550M85Q81k71j413j156L29J662J769P71m73j330j779k068k267
60372A238164k250j937j440r59o72o85r92j458j891k117j913j080J66J010P60
60357A222706j62m60N24J974K687K589K449K356J445n30k195j969r6J630K083
60342A235031J949K264K767K340O55j563l608n249o038n310l274j330n25l77J89
60327A217921J296K328L005L271K593P25j003p59J112J992L87j891k039J35K366
$$ plain form
60312 1231439 1234583 1237811 1241628 1246269 1250831 1254173 1256191 1257872 1260276 1263662 1267477 1270894 1273149 1273533
60298 1273533 1271586 1267756 1263659 1261113 1260606 1260888 1260169 1257604 1253647 1249353 1245544 1242403 1239595 1236779 1234009
60283 1234009 1231618 1229769 1228393 1227535 1227415 1227950 1228483 1228276 1227210 1225828 1224722 1224018 1223494 1223015 1222690 1222529
60267 1222529 1222122 1220952 1219010 1216888 1215197 1214241 1214377 1216170 1219717 1224060 1227840 1230455 1232229 1233592 1234611
60252 1234611 1235241 1235522 1235469 1235194 1235133 1235694 1236710 1237658 1238387 1239088 1239654 1239740 1239500 1239540 1240020 1240578 1241337 1243038 1245697
60233 1245697 1247961 1248598 1248087 1248003 1249201 1251246 1253247 1254531 1254797 1254413 1254486 1255948 1258589 1261516 1264448 1267859
60217 1267859 1271827 1275546 1278250 1280126 1281923 1283997 1286056 1287694 1288904 1290100 1291752 1293904 1295989 1297146
60203 1297146 1296827 1295251 1293460 1292819 1294110 1296977 1300410 1303743 1306823 1309352 1310910 1311953 1313899 1317433
$$ packed form
60312A231439L144L228L817M641M562L342K018J681K404L386L815L417K255L84
60298A273533j947l830m097k546n07K82p19k565l957m294l809l141k808k816k770
60283A234009k391j849j376q58j20N35N33k07j066j382j106p04n24m79l25j61
60267A222529m07j170j942k122j691r56J36J793L547M343L780K615J774J363J019
60252A234611O30K81n3k75o1N61J016R48P29P01N66Q6k40M0M80N58P59J701K659
60233A245697K264O37n11q4J198K045K001J284K66l84P3J462K641K927K932L411
60217A267859L968L719K704J876J797K074K059J638J210J196J652K152K085J157
60203A297146l19j576j791o41J291K867L433L333L080K529J558J043J946L534
$$ plain form
60189 1317433 1321294 1323758 1325021 1327005 1330851 1335653 1339944 1343347 1346245 1348827 1351390 1354923 1360169 1366167
60175 1366167 1370771 1372930 1373741 1374852 1376477 1377746 1378623 1380358 1383657 1387141 1388473 1386812 1383467 1380130
60161 1380130 1377219 1374321 1371623 1370095 1370246 1371218 1371341 1369547 1366251 1362972 1361007 1360447 1360479 1360477 1360425 1360361 1360036
60144 1360036 1359422 1359023 1359219 1359629 1359615 1359134 1358657 1358462 1358519 1358813 1359237 1359331 1358788 1358149 1358360 1359592 1360983 1361564 1360954
60125 1360954 1359198 1356616 1353947 1351873 1350137 1347744 1344414 1341279 1339627 1339431 1339659 1339663 1339607 1339653 1339420 1338466 1336928
60108 1336928 1335437 1334556 1334379 1334576 1334735 1334713 1334661 1334678 1334465 1333368 1330787 1326600 1321400 1316360 1312538 1309991 1307588
60091 1307588 1304101 1299701 1296027 1294404 1294075 1292786 1289278 1284627 1280602 1277268 1273217 1268051 1263403 1260832
60077 1260832 1259585 1257391 1253129 1247758 1242728 1238341 1233932 1229040 1224069 1219997 1217539 1216384 1215304 1213304
$$ packed form
60189A317433L861K464J263J984L846M802M291L403K898K582K563L533N246N998
60175A366167M604K159Q11J111J625J269Q77J735L299L484J332j661l345l337
60161A380130k911k898k698j528J51R72J23j794l296l279j965n60L2kn2o4l25
60144A360036o14l99J96M10j4m81m77j95N7K94M24R4n43o39K11J232J391N81o10
60125A360954j756k582k669k074j736k393l330l135j652j96K28Mn6M6k33r54j538
60108A336928j491q81j77J97J59k2n2J7k13j097k581m187n200n040l822k547k403
60091A307588l487m400l674j623l29j289l508m651m025l334m051n166m648k571
60077A260832j247k194m262n371n030m387m409m892m971m072k458j155j080k000
$$ plain form
60063 1213304 1210535 1207784 1205316 1202800 1200208 1197912 1195755 1192810 1188598 1184071 1180762 1179045 1177717 1175352
60049 1175352 1171846 1168527 1166773 1166647 1166999 1166863 1166351 1166068 1166080 1165947 1165455 1164826 1164286 1163843 1163275 1162007 1159362
60032 1159362 1155466 1151528 1148550 1146240 1144118 1143108 1144569 1147841 1150390 1150815 1150213 1149974 1149818 1149131 1148937
60017 1148937 1150891 1154875 1158948 1161485 1162339 1162261 1162263 1163354 1165817 1168721 1170871 1172150 1173209 1174202 1174843 1175489
60001 1175489 1177075 1179818 1182877 1185445 1187395 1188829 1189927 1191346 1193802 1196901 1199253 1200155 1200493 1201620
59987 1201620 1203936 1206939 1210002 1212698 1214938 1217214 1220206 1223791 1226959 1228963 1230008 1230519 1230500 1230126 1230282
59972 1230282 1231717 1234097 1236552 1238893 1241729 1245592 1250394 1255393 1259350 1261317 1261893 1263111 1266277 1270406
59958 1270406 1273692 1276001 1278661 1282086 1285154 1287188 1288974 1291086 1292560 1292422 1291680 1292369 1294964 1298022 1300375
$$ packed form
60063A213304k769k751k468k516k592k296k157k945m212m527l309j717j328k365
60049A175352l506l319j754j26L52j36n12k83J2j33m92o29n40m43n68j268k645
60032A159362l896l938k978k310k122j010J461L272K549M25o02k39j56o87j94
60017A148937J954L984M073K537Q54p8KJ091K463K904K150J279J059R93O41O46
60001A175489J586K743L059K568J950J434J098J419K456L099K352R02L38J127
59987A201620K316L003L063K696K240K276K992L585L168K004J045N11j9l74J56
59972A230282J435K380K455K341K836L863M802M999L957J967N76J218L166M129
59958A270406L286K309K660L425L068K034J786K112J474j38p42O89K595L058K353
$$ plain form
59943 1300375 1302445 1305038 1307929 1310371 1312313 1314285 1316481 1318760 1321410 1325080 1329873 1335213 1340809 1346942
59929 1346942 1353381 1358870 1362607 1365737 1370215 1376326 1382494 1387700 1392710 1398334 1403798 1408070 1411806 1416354
59915 1416354 1421286 1424691 1426056 1427180 1429580 1432504 1434504 1435803 1437681 1440191 1441948 1442016 1440779 1438847
59901 1438847 1436329 1433494 1431108 1429503 1427989 1425922 1423873 1422988 1423374 1423853 1423420 1422328 1421371 1420627 1419663 1418858
59885 1418858 1419553 1422227 1425217 1426352 1425827 1426226 1429222 1433267 1435439 1434841 1433114 1431954 1431381 1430507 1428953
59870 1428953 1427091 1425481 1424362 1423276 1421189 1417493 1412918 1408891 1406080 1404206 1403041 1402529 1401866 1399739
59856 1399739 1396045 1392454 1390594 1390513 1391484 1393352 1396159 1399168 1401406 1402867 1404295 1405976 1407508 1408570 1409293
59841 1409293 1410055 1411445 1414049 1417653 1421065 1423411 1425134 1426984 1428609 1429205 1429060 1429158 1429466 1429010 1427655 1426347
$$ packed form
59943A300375K070K593K891K442J942J972K196K279K650L670M793N340N596O133
59929A346942O439N489L737L130M478O111O168N206N010N624N464M272L736M548
59915A416354M932L405J365J124K400K924K000J299J878K510J757O8j237j932
59901A438847k518k835k386j605j514k067k049q85L86M79m33j092r57p44r64q05
59885A418858O95K674K990J135n25L99K996M045K172n98j727j160n73q74j554
59870A428953j862j610j119j086k087l696m575m027k811j874j165n12o63k127
59856A399739l694l591j860q1R71J868K807L009K238J461J428J681J532J062P23
59841A409293P62J390K604L604L412K346J723J850J625N96j45R8L08m56j355j308
$$ plain form
59825 1426347 1425175 1422543 1417092 1409590 1402162 1396189 1391411 1386582 1380622 1373750 1367729 1364262 1362778 1360660
59811 1360660 1356250 1350789 1346604 1344172 1342044 1339229 1336373 1334424 1333159 1331600 1329433 1327418 1326366 1325987
59797 1325987 1325096 1323081 1320876 1320028 1320826 1321853 1321484 1319363 1316383 1313790 1312549 1312960 1314445 1316001 1317120
59782 1317120 1317866 1318065 1317220 1315602 1314570 1315078 1316515 1317853 1319322 1321872 1325268 1327888 1328612 1327878 1326534
59767 1326534 1324558 1321609 1318326 1316191 1316045 1317196 1318178 1318031 1316641 1314204 1310986 1307770 1305869 1306128 1308108
59752 1308108 1310747 1313504 1316174 1317958 1317874 1316279 1314780 1314156 1313397 1311573 1309608 1309044 1309720 1310080 1309519 1309021
59736 1309021 1309273 1309361 1307997 1305255 1302404 1300344 1298793 1296947 1294540 1292125 1290450 1289829 1290203 1291526 1293586
59721 1293586 1295556 1296408 1295956 1294874 1293502 1291470 1288899 1286933 1286186 1285578 1283863 1281652 1280512 1280512 1280285 1279496
$$ packed form
59825A426347j172k632n451p502p428n973m778m829n960o872o021l467j484k118
59811A360660m410n461m185k432k128k815k856j949j265j559k167k015j052l79
59797A325987q91k015k205q48P98J027l69k121k980k593j241M11J485J556J119
59782A317120P46J99q45j618j032N08J437J338J469K550L396K620P24p34j344
59767A326534j976k949l283k135j46J151R82j47j390k437l218l216j901K59J980
59752A308108K639K757K670J784q4j595j499o24p59j824j965n64O76L60n61m98
59736A309021K52Q8j364k742k851k060j551j846k407k415j675o21L74J323K060
59721A293586J970Q52m52j082j372k032k571j966p47o08j715k211j140%k27p89
$$ plain form
59705 1279496 1279482 1280968 1282653 1282921 1281824 1280470 1279344 1278266 1277400 1277235 1277702 1278024 1277346 1275189 1271677 1267785
59689 1267785 1264881 1263395 1262291 1260425 1258019 1256151 1255156 1254512 1254148 1254717 1256171 1256986 1255617 1252457 1249606
59674 1249606 1248617 1248910 1248641 1246890 1244523 1242879 1242068 1241039 1239156 1237040 1235694 1235385 1235792 1236785 1238315 1239759
59658 1239759 1240152 1239295 1238020 1236984 1235641 1232923 1228702 1224041 1219994 1216725 1213954 1211776 1210599 1210464 1210821
59643 1210821 1210949 1210403 1209258 1208208 1208217 1209490 1210888 1210986 1209893 1209372 1210757 1213282 1214945 1214732 1213475 1212761
59627 1212761 1213550 1215716 1218334 1220234 1220683 1219894 1218926 1218976 1220463 1222490 1223393 1222351 1220425 1219402 1219677 1220166
59611 1220166 1220427 1221511 1223954 1226245 1226636 1225680 1225440 1226683 1228370 1229603 1230315 1230048 1227928 1224456 1221677
59596 1221677 1220709 1220267 1218396 1214631 1209792 1204878 1201064 1199626 1200704 1202900 1205042 1207409 1210218 1212139
$$ packed form
59705A279496j4J486J685K68j097j354j126j078q66j65M67L22o78k157l512l892
59689A267785k904j486j104j866k406j868r95o44l64N69J454Q15j369l160k851
59674A249606r89K93k69j751k367j644q11j029j883k116j346l09M07R93J530J444
59658A239759L93q57j275j036j343k718m221m661m047l269k771k178j177j35L57
59643A210821J28n46j145j050RJ273J398R8j093n21J385K525J663k13j257p14
59627A212761P89K166K618J900M49p89r68N0J487K027R03j042j926j023K75M89
59611A220166K61J084K443K291L91r56k40J243J687J233P12k67k120l472k779
59596A221677r68m42j871l765m839m914l814j438J078K196K142K367K809J921
$$ plain form
59582 1212139 1211920 1210718 1210859 1212602 1214018 1214110 1214059 1214824 1215365 1214415 1212767 1212376 1213784 1215707 1216921 1217525 1218316
59565 1218316 1219750 1221774 1224084 1226253 1227882 1228938 1229764 1230633 1231404 1231859 1232324 1233700 1236638 1240731 1244708
59550 1244708 1247454 1248787 1249417 1250513 1253295 1258441 1265405 1272517 1278196 1282207 1285594 1289457 1293841 1297702
59536 1297702 1299945 1300721 1301605 1303945 1306982 1308405 1307127 1304708 1303261 1302813 1301851 1299971 1298418 1298000 1298048 1297987
59520 1297987 1298575 1300610 1303365 1305433 1306565 1307573 1308734 1309462 1309563 1309875 1311424 1314612 1319446 1325836 1333360
59505 1333360 1341241 1348876 1356040 1362412 1367438 1371054 1374047 1377299 1380966 1384737 1388411 1391711 1394058 1395350
59491 1395350 1396739 1399627 1403869 1407850 1410594 1412865 1415792 1419340 1422897 1426579 1430950 1435931 1441010 1446250
59477 1446250 1451931 1457296 1460903 1462567 1463811 1465887 1468339 1470219 1471754 1473745 1475913 1477164 1477399 1477979
$$ packed form
59582A212139k19j202J41J743J416R2n1P65N41r50j648l91J408J923J214O04P91
59565A218316J434K024K310K169J629J056Q26Q69P71M55M65J376K938M093L977
59550A244708K746J333O30J096K782N146O964P112N679M011L387L863M384L861
59536A297702K243P76Q84K340L037J423j278k419j447m48r62j880j553m18M8o1
59520A297987N88K035K755K068J132J008J161P28J01L12J549L188M834O390P524
59505A333360P881P635P164O372N026L616K993L252L667L771L674L300K347J292
59491A395350J389K888M242L981K744K271K927L548L557L682M371M981N079N240
59477A446250N681N365L607J664J244K076K452J880J535J991K168J251K35N80
$$ plain form
59463 1477979 1480064 1483311 1486644 1489781 1493484 1498505 1504607 1510614 1515372 1518791 1521902 1525722 1530071 1533815
59449 1533815 1536291 1538157 1540662 1544322 1548573 1552603 1556212 1559822 1563848 1568290 1572894 1577489 1582086 1586911
59435 1586911 1592472 1599262 1607030 1614614 1621078 1626877 1633154 1639946 1646133 1651508 1657694 1666033 1675412 1683487
59421 1683487 1689670 1695418 1701578 1706997 1710339 1711970 1713160 1714319 1715063 1715428 1715796 1715817 1714552 1711918 1709165
59406 1709165 1707501 1706722 1705545 1702970 1698987 1694193 1689034 1683501 1677566 1671871 1667587 1665144 1663268 1660054
59392 1660054 1655223 1650691 1648475 1648520 1649179 1649376 1649488 1650197 1651397 1652564 1653553 1654610 1656057 1658376 1662130 1667130
59376 1667130 1671914 1674766 1675440 1675482 1676735 1679821 1684098 1688693 1693294 1698071 1703028 1707603 1711131 1713804 1716759
59361 1716759 1720731 1724868 1727631 1728910 1730458 1733831 1738582 1743105 1746697 1749842 1752588 1753769 1752452 1749593
$$ packed form
59463A477979K085L247L333L137L703N021O102O007M758L419L111L820M349L744
59449A533815K476J866K505L660M251M030L609L610M026M442M604M595M597M825
59435A586911N561O790P768P584O464N799O277O792O187N375O186Q339R379Q075
59421A683487O183N748O160N419L342J631J190J159P44L65L68K1j265k634k753
59406A709165j664p79j177k575l983m794n159n533n935n695m284k443j876l214
59392A660054m831m532k216M5O59J97J12P09J200J167R89J057J447K319L754N000
59376A667130M784K852O74M2J253L086M277M595M601M777M957M575L528K673K955
59361A716759L972M137K763J279J548L373M751M523L592L145K746J181j317k859
$$ plain form
59347 1749593 1747442 1747369 1748834 1750548 1751979 1753158 1753484 1751724 1747557 1742419 1738137 1734999 1731784 1727571 1722899
59332 1722899 1719072 1716830 1715813 1714890 1712909 1709624 1706091 1703740 1702890 1702613 1702154 1701852 1702209 1702727 1702337 1700738
59316 1700738 1698641 1696770 1695193 1693652 1692089 1690663 1689581 1689089 1689393 1690427 1691759 1692880 1693597 1694122 1694698
59301 1694698 1695158 1695035 1694262 1693473 1693365 1693954 1694945 1696603 1699616 1704017 1708866 1713163 1716569 1719213 1721484 1724132
59285 1724132 1727691 1731480 1734035 1735038 1735910 1737782 1739741 1740042 1738391 1735899 1733293 1730430 1727490 1725404
59271 1725404 1724898 1725960 1728305 1731451 1734212 1735096 1733718 1731318 1729558 1729254 1730338 1732385 1734732 1736496 1736896
59256 1736896 1735615 1732945 1729724 1726814 1724246 1721255 1717680 1714847 1714143 1714961 1715166 1713623 1711269 1709564 1709000
59241 1709000 1709423 1710620 1711939 1712248 1711024 1708829 1706078 1702201 1696862 1691287 1687240 1684972 1683199 1681067
$$ packed form
59347A749593k151p3J465J714J431J179L26j760m167n138m282l138l215m213m672
59332A722899l827k242j017r23j981l285l533k351q50k77m59l02L57N18l90j599
59316A700738k097j871j577j541j563j426j082m92L04J034J332J121P17N25N76
59301A694698M60j23p73p89j08N89R91J658L013M401M849M297L406K644K271K648
59285A724132L559L789K555J003Q72J872J959L01j651k492k606k863k940k086
59271A725404n06J062K345L146K761Q84j378k400j760l04J084K047K347J764M00
59256A736896j281k670l221k910k568k991l575k833p04Q18K05j543k354j705n64
59241A709000M23J197J319L09j224k195k751l877n339n575m047k268j773k132
$$ plain form
59227 1681067 1679119 1678067 1677379 1675545 1671522 1665681 1659549 1654874 1652739 1653193 1655340 1657738 1659097 1659024 1658045
59212 1658045 1656627 1654471 1651296 1648062 1646500 1647265 1649319 1651419 1653423 1655661 1657895 1659765 1661795 1665025
59198 1665025 1669657 1674707 1679032 1682338 1685216 1688479 1692371 1696227 1699018 1700411 1701047 1701658 1702269 1702510 1702313
59183 1702313 1702018 1702121 1703118 1705082 1707164 1708110 1707729 1707206 1707465 1707931 1707659 1706963 1706806 1707012 1706353 1704368 1701941
59166 1701941 1699870 1697887 1695401 1692375 1689004 1685313 1681476 1677971 1674942 1672014 1669218 1667568 1667975 1669802
59152 1669802 1671100 1670287 1667341 1663460 1660013 1657850 1657195 1657838 1659328 1661121 1662765 1664061 1664933 1665084 1664112
59137 1664112 1662301 1660991 1661571 1664028 1667038 1669620 1672192 1675666 1679999 1684171 1687474 1690312 1693607 1697657
59123 1697657 1701796 1705176 1707825 1710838 1715447 1721932 1729393 1736453 1742112 1746231 1749480 1752707 1756111 1759200
$$ packed form
59227A681067j948j052o88j834m023n841o132m675k135M54K147K398J359p3r79
59212A658045j418k156l175l234j562P65K054K100K004K238K234J870K030L230
59198A665025M632N050M325L306K878L263L892L856K791J393O36O11O11K41j97
59183A702313k95J03R97J964K082R46l81n23K59M66k72o96j57K06o59j985k427
59166A701941k071j983k486l026l371l691l837l505l029k928k796j650M07J827
59152A669802J298q13k946l881l447k163o55O43J490J793J644J296Q72J51r72
59137A664112j811j310N80K457L010K582K572L474M333M172L303K838L295M050
59123A697657M139L380K649L013M609O485P461P060N659M119L249L227L404L089
$$ plain form
59109 1759200 1761746 1764387 1767770 1771400 1774114 1775564 1776384 1776785 1775924 1773073 1768644 1763579 1758484 1753965 1751021
59094 1751021 1750139 1750450 1750753 1751077 1752289 1754362 1756202 1757294 1758395 1760202 1762225 1763513 1763833 1763606 1763379 1763850
59078 1763850 1765758 1769001 1772329 1774670 1776376 1778356 1780370 1781181 1780363 1778991 1778435 1779264 1781528 1785173 1789724
59063 1789724 1794271 1798286 1801912 1805129 1807464 1809246 1812332 1818392 1826724 1834897 1841507 1847137 1852389 1856361
59049 1856361 1858063 1858490 1859897 1863169 1867053 1870255 1873229 1877247 1882397 1887445 1891451 1894574 1897182 1899053
59035 1899053 1899979 1900542 1901659 1903648 1906354 1909851 1914272 1918998 1922824 1925158 1926509 1927628 1928847 1930423
59021 1930423 1932738 1935591 1937903 1938735 1938255 1937222 1936111 1935405 1936169 1939213 1943670 1947429 1949260 1949966 1951232
59006 1951232 1953952 1957900 1962478 1967258 1972029 1976669 1981061 1985111 1988847 1992414 1995919 1999484 2003479 2008244
$$ packed form
59109A759200K546K641L383L630K714J450Q20M01q61k851m429n065n095m519k944
59094A751021q82L11L03L24J212K073J840J092J101J807K023J288L20k27k27M71
59078A763850J908L243L328K341J706J980K014Q11q18j372n56Q29K264L645M551
59063A789724M547M015L626L217K335J782L086O060Q332Q173O610N630N252L972
59049A856361J702M27J407L272L884L202K974M018N150N048M006L123K608J871
59035A899053R26N63J117J989K706L497M421M726L826K334J351J119J219J576
59021A930423K315K853K312Q32m80j033j111p06P64L044M457L759J831P06J266
59006A951232K720L948M578M780M771M640M392M050L736L567L505L565L995M765
$$ plain form
58992 2008244 2013375 2017880 2021547 2025547 2030956 2037271 2043338 2049324 2056522 2065314 2074637 2083542 2092002 2099896
58978 2099896 2106677 2112788 2120092 2129784 2140620 2150266 2157834 2164171 2170257 2176492 2183329 2191343 2200375 2209314
58964 2209314 2217040 2223167 2227702 2230314 2230282 2227389 2222999 2219858 2219957 2222279 2223360 2220595 2214614 2208136 2203175
58949 2203175 2199874 2197260 2194176 2189871 2184633 2179797 2176460 2174307 2172136 2169198 2165355 2160451 2154566 2148838
58935 2148838 2145013 2143748 2143790 2143033 2140257 2136104 2132709 2132048 2134028 2136302 2136378 2133660 2129207 2124308 2120135
58920 2120135 2118031 2118667 2120963 2123031 2124262 2125578 2127655 2130069 2132275 2134225 2135703 2136295 2136534 2137814 2140399
58905 2140399 2142533 2142548 2141157 2140581 2141824 2143722 2144541 2143691 2141966 2140751 2141095 2143002 2145412 2147050 2147267 2146130
58889 2146130 2144009 2141331 2138366 2134971 2130844 2126217 2121969 2118730 2116167 2113421 2109880 2105300 2099632 2093250
$$ packed form
58992B008244N131M505L667M000N409O315O067N986P198Q792R323Q905Q460P894
58978B099896O781O111P304R692J0836R646P568O337O086O235O837Q014R032Q939
58964B209314P726O127M535K612l2k893m390l141R9K322J081k765n981o478m961
58949B203175l301k614l084m305n238m836l337k153k171k938l843m904n885n728
58935B148838l825j265M2p57k776m153l395o61J980K274P6k718m453m899m173
58920B120135k104O36K296K068J231J316K077K414K206J950J478N92K39J280K585
58905B140399K134J5j391n76J243J898Q19q50j725j215L44J907K410J638K17j137
58889B146130k121k678k965l395m127m627m248l239k563k746l541m580n668o382
$$ plain form
58875 2093250 2087043 2081658 2076754 2071411 2065206 2058568 2052152 2046224 2040615 2035017 2029279 2023504 2017817 2012153
58861 2012153 2006572 2001759 1998565 1996770 1994824 1991341 1986574 1981966 1978464 1975644 1972301 1967522 1961391 1955014
58847 1955014 1949691 1945770 1942524 1939327 1936476 1934485 1933140 1931938 1930967 1930534 1930282 1929685 1929240 1930049 1932015
58832 1932015 1933583 1933712 1933253 1933779 1935799 1938749 1942049 1945343 1948148 1950235 1952216 1954938 1958302 1961372 1963680
58817 1963680 1965686 1967817 1969817 1971405 1972843 1974271 1974997 1974337 1972970 1972632 1974228 1976851 1978978 1980088 1980543
58802 1980543 1980306 1978691 1975578 1972151 1969817 1968673 1967627 1965998 1964382 1963774 1964375 1965628 1966898 1967494 1966436
58787 1966436 1963192 1958857 1955753 1955264 1956478 1957353 1956700 1954591 1951469 1947914 1944981 1943589 1943248 1942303 1939877
58772 1939877 1936994 1935277 1935099 1935448 1935123 1933524 1930752 1927631 1925378 1924559 1924511 1924378 1924514 1926081 1929277 1932762
$$ packed form
58875B093250o207n385m904n343o205o638o416n928n609n598n738n775n687n664
58861B012153n581m813l194j795j946l483m767m608l502k820l343m779o131o377
58847A955014n323l921l246l197k851j991j345j202r71m33k52n97m45Q09J966
58832A932015J568J29m59N26K020K950L300L294K805K087J981K722L364L070K308
58817A963680K006K131K000J588J438J428P26o60j367l38J596K623K127J110M55
58802A980543k37j615l113l427k334j144j046j629j616o08O01J253J270N96j058
58787A966436l244m335l104m89J214Q75o53k109l122l555k933j392l41r45k426
58772A939877k883j717j78L49l25j599k772l121k253q19m8j33J36J567L196L485
$$ plain form
58756 1932762 1935130 1936349 1937409 1938984 1940948 1942952 1944987 1947299 1950005 1952985 1956179 1959861 1964382 1969544
58742 1969544 1974473 1978415 1981586 1984908 1988827 1992512 1994335 1993226 1989881 1986706 1986083 1988298 1991409 1993547
58728 1993547 1994891 1996747 1999068 2000012 1998152 1994217 1990179 1987190 1984967 1982745 1980175 1977505 1975366 1974349
58714 1974349 1974346 1974316 1973093 1970566 1967868 1966322 1966290 1967071 1967674 1967439 1966035 1963317 1959572 1955786 1953139 1952019
58698 1952019 1951799 1951734 1951735 1952039 1952583 1953199 1954101 1955581 1957349 1958797 1959950 1961597 1964334 1967862 1971379 1974380
58682 1974380 1977028 1979998 1983979 1989086 1994743 2000333 2005786 2011377 2017284 2023738 2031056 2038872 2045768 2050667
58668 2050667 2054508 2059560 2066912 2075459 2083332 2089441 2093580 2096254 2098781 2102446 2106916 2110473 2112475 2114564
58654 2114564 2118522 2123864 2128696 2132343 2135856 2140275 2145691 2151989 2159223 2166897 2173828 2179280 2183756 2188268
$$ packed form
58756A932762K368J219J060J575J964K004K035K312K706K980L194L682M521N162
58742A969544M929L942L171L322L919L685J823j109l345l175o23K215L111K138
58728A993547J344J856K321R44j860l935m038k989k223k222k570k670k139j017
58714A974349ll0j223k527k698j546l2P81O03k35j404k718l745l786k647j120
58698A952019k20o5JL04N44O16R02J480J768J448J153J647K737L528L517L001
58682A974380K648K970L981N107N657N590N453N591N907O454P318P816O896M899
58668B050667L841N052P352Q547P873O109M139K674K527L665M470L557K002K089
58654B114564L958N342M832L647L513M419N416O298P234P674O931N452M476M512
$$ plain form
58640 2188268 2193239 2198407 2203524 2208794 2214608 2220960 2227225 2232638 2236988 2240552 2243337 2244981 2245681 2246657
58626 2246657 2249031 2252601 2256362 2259993 2264111 2269135 2274574 2279541 2283406 2285996 2287721 2289650 2292822 2297233
58612 2297233 2301823 2305610 2308522 2311172 2314335 2318713 2324562 2331207 2337409 2342603 2347431 2352675 2358072 2362713
58598 2362713 2366424 2370091 2374516 2379462 2384163 2388524 2393349 2399386 2406453 2413674 2420389 2426557 2432362 2437829
58584 2437829 2442983 2448130 2453625 2459424 2465167 2470812 2476868 2483688 2490680 2496774 2501907 2507545 2515120 2524206
58570 2524206 2533071 2541110 2549740 2560295 2571920 2582490 2591005 2597905 2603415 2607014 2608696 2609436 2610018 2610495
58556 2610495 2611249 2613237 2616334 2618583 2618331 2616464 2615401 2616340 2618624 2621324 2624048 2626253 2627215 2627149 2627403 2628989
58540 2628989 2631607 2634522 2637753 2641770 2646419 2650776 2654072 2656450 2658753 2661736 2665570 2670077 2675208 2680961
$$ packed form
58640B188268M971N168N117N270N814O352O265N413M350L564K785J644P00R76
58626B246657K374L570L761L631M118N024N439M967L865K590J725J929L172M411
58612B297233M590L787K912K650L163M378N849O645O202N194M828N244N397M641
58598B362713L711L667M425M946M701M361M825O037P067P221O715O168N805N467
58584B437829N154N147N495N799N743N645O056O820O992O094N133N638P575R086
58570B524206Q865Q039Q630J0555J1625J0570Q515O900N510L599J682P40N82M77
58556B610495P54J988L097K249k52j867j063R39K284K700K724K205R62o6K54J586
58540B628989K618K915L231M017M649M357L296K378K303K983L834M507N131N753
$$ plain form
58526 2680961 2686856 2692067 2696360 2700441 2704922 2709407 2713250 2716854 2721378 2727148 2733179 2738511 2743325 2748326
58512 2748326 2753441 2757680 2760262 2761663 2763451 2767022 2772383 2778131 2782640 2785315 2786903 2788977 2793027 2799432
58498 2799432 2806993 2813891 2819373 2824125 2829012 2834253 2840144 2847392 2855651 2862645 2866286 2867558 2870017 2876216
58484 2876216 2885552 2895597 2904417 2911419 2917060 2922356 2928013 2933676 2938563 2942922 2948042 2954570 2961670 2968216
58470 2968216 2973948 2979080 2983707 2988282 2993900 3001274 3009945 3019168 3029004 3039697 3050464 3059884 3067536
58457 3067536 3074575 3082610 3092371 3103242 3113753 3122761 3130614 3138860 3148430 3158516 3167847 3176519 3185588
58444 3185588 3195126 3203900 3211242 3218182 3226208 3235655 3245958 3256845 3268413 3280232 3291329 3301339
58432 3301339 3311131 3321933 3334122 3347229 3360947 3375519 3390851 3405716 3418603 3429483 3440101
$$ packed form
58526B680961N895N211M293M081M481M485L843L604M524N770O031N332M814N001
58512B748326N115M239K582J401J788L571N361N748M509K675J588K074M050O405
58498B799432P561O898N482M752M887N241N891P248Q259O994L641J272K459O199
58484B876216R336J0045Q820P002N641N296N657N663M887M359N120O528P100O546
58470B968216N732N132M627M575N618P374Q671R223R836J0693J0767R420P652
58457C067536P039Q035R761J0871J0511R008P853Q246R570J0086R331Q672R069
58444C185588R538Q774P342O940Q026R447J0303J0887J1568J1819J1097J0010
58432C301339R792J0802J2189J3107J3718J4572J5332J4865J2887J0880J0618
$$ plain form
58421 3440101 3452021 3464796 3476726 3487138 3496952 3506942 3516571 3525273 3534020 3544548 3557307 3571189
58409 3571189 3585084 3598639 3611442 3622866 3633306 3644489 3657668 3672288 3687321 3703103 3720590
58398 3720590 3739333 3757666 3774859 3791780 3809285 3827228 3845370 3863956 3882796 3900902 3917873
58387 3917873 3934812 3953054 3972679 3992952 4013522 4034382 4055277 4076144 4097720 4120801 4145187
58376 4145187 4170119 4195426 4221404 4247914 4274559 4301651 4330130 4360371 4391614 4422619 4452590
58365 4452590 4481734 4511260 4542433 4575187 4608215 4640978 4674794 4710957 4748472 4784961 4819566
58354 4819566 4853747 4889407 4927449 4968017 5010736 5054414 5097764 5140921 5185368 5232052 5280426
58343 5280426 5329583 5379367 5429975 5481323 5533312 5586148 5640122 5695691 5753880 5815792 5881375
$$ packed form
58421C440101J1920J2775J1930J0412R814R990R629Q702Q747J0528J2759J3882
58409C571189J3895J3555J2803J1424J0440J1183J3179J4620J5033J5782J7487
58398C720590J8743J8333J7193J6921J7505J7943J8142J8586J8840J8106J6971
58387C917873J6939J8242J9625K0273K0570K0860K0895K0867K1576K3081K4386
58376D145187K4932K5307K5978K6510K6645K7092K8479L0241L1243L1005K9971
58365D452590K9144K9526L1173L2754L3028L2763L3816L6163L7515L6489L4605
58354D819566L4181L5660L8042M0568M2719M3678M3350M3157M4447M6684M8374
58343E280426M9157M9784N0608N1348N1989N2836N3974N5569N8189O1912O5583
$$ plain form
58332 5881375 5949368 6018718 6089494 6162410 6238327 6318370 6403528 6493752 6588155 6686422 6789250
58321 6789250 6897185 7010013 7127677 7250895 7380333 7515983 7658010 7807739 7967359
58312 7967359 8139022 8324314 8523962 8738014 8967077 9213399 9479916 9768561 10081029
58303 10081029 10421495 10797094 11215364 11682878 12207334 12799703 13473456 14243011 15123744
58294 15123744 16131538 17280009 18578272 20032263 21646920 23424979 25363742 27454605
58286 27454605 29686448 32049707 34539181 37156418 39912438 42829790 45942064 49289021
58278 49289021 52907663 56823808 61049230 65582806 70409129 75493422 80779202 86191914
58270 86191914 91643384 97034142 102258007 107207320 111764921 115779531 119053214 121377587
$$ packed form
58332E881375O7993O9350P0776P2916P5917Q0043Q5158R0224R4403R8267J02828
58321F789250J07935J12828J17664J23218J29438J35650J42027J49729J59620
58312G967359J71663J85292J99648K14052K29063K46322K66517K88645L12468
58303A0081029L40466L75599M18270M67514N24456N92369O73753P69555Q80733
58294A5123744J007794J148471J298263J453991J614657J778059J938763K090863
58286B7454605K231843K363259K489474K617237K756020K917352L112274L346957
58278D9289021L618642L916145M225422M533576M826323N084293N285780N412712
58270H6191914N451470N390758N223865M949313M557601M014610L273683K324373
$$ plain form
58262 121377587 122614158 122765267 121984036 120521856 118653747 116620548 114600956 112707832
58254 112707832 110998790 109492120 108181826 107049086 106069105 105213118 104449020 103747120
58246 103747120 103091798 102489498 101963167 101535729 101215100 100989227 100829709 100698947 100558070
58237 100558070 100373901 100123034 99793156 99384108 98909681 98398055 97888702 97426061 97051695
58228 97051695 96796845 96677491 96693085 96827838 97052915 97330364 97620352 97889791 98117769
58219 98117769 98296312 98429502 98533226 98633773 98763435 98954911 99237360 99634103 100160525
58210 100160525 100822466 101615991 102527891 103536635 104616015 105742901 106905759 108108943
58202 108108943 109372221 110728738 112222469 113903582 115821878 118020214 120527497 123350247
$$ packed form
58262A21377587J236571J51109p81231j462180j868109k033199k019592j893124
58254A12707832j709042j506670j310294j132740r79981q55987p64098p01900
58246A03747120o55322o02300n26331m27438l20629k25873j59518j30762j40877
58237A00558070j84169k50867l29878m09048m74427n11626n09353m62641l74366
58228I7051695k54850j19354J5594J34753K25077K77449K89988K69439K27978
58219I8117769J78543J33190J03724J00547J29662J91476K82449L96743N26422
58210A00160525O61941P93525R11900J008744J079380J126886J162858J203184
58202A08108943J263278J356517J493731J681113J918296K198336K507283K822750
$$ plain form
58194 123350247 126466949 129831673 133385733 137069198 140828699 144622097 148408488 152102351
58186 152102351 155497984 158222024 159783061 159723015 157789185 154024586 148734713 142367812
58178 142367812 135380863 128148321 120934229 113914140 107214332 100939129 95175942 89983854
58170 89983854 85376431 81310409 77692574 74408958 71362778 68498671 65802707 63286561
58162 63286561 60969951 58868448 56988006 55326358 53878594 52640918 51609187 50775146
58154 50775146 50124047 49633034 49268679 48986278 48734913 48467504 48150143 47765615 47310719
58145 47310719 46790771 46215163 45595143 44942119 44265364 43570904 42863444 42149036 41434692
58136 41434692 40725497 40023513 39329561 38644393 37967412 37295869 36626656 35958163 35289451
$$ packed form
58194A23350247L116702L364724L554060L683465L759501L793398L786391L693863
58186A52102351L395633K724040J561037o0046j933830l764599n289873o366901
58178A42367812o986949p232542p214092p020089o699808o275203n763187n192088
58170H9983854m607423m066022l617835l283616l046180k864107k695964k516146
58162F3286561k316610k101503j880442j661648j447764j237676j031731q34041
58154E0775146o51099m91013l64355k82401k51365k67409l17361l84528m54896
58145D7310719n19948n75608o20020o53024o76755o94460p07460p14408p14344
58136D1434692p09195p01984o93952o85168o76981o71543o69213o68493o68712
$$ plain form
58127 35289451 34618380 33941611 33256092 32560001 31853243 31138306 30420340 29705204 28997152
58118 28997152 28298352 27609617 26930382 26258302 25589938 24922098 24252175 23577897 22898006
58109 22898006 22213435 21527050 20841953 20160268 19483375 18812501 18148802 17493185 16846313
58100 16846313 16208884 15582167 14968484 14371002 13792984 13237593 12708339 12208668 11740216
58091 11740216 11301746 10890200 10502364 10135158 9785370 9450568 9130201 8824850 8534396
58082 8534396 8257746 7994362 7745071 7511169 7293420 7092100 6907237 6738362 6584471
58073 6584471 6444483 6317460 6202396 6098258 6004266 5919734 5843722 5775398 5714458 5660355
58063 5660355 5611136 5564232 5518815 5476411 5438610 5405020 5374226 5345855 5320550 5298198 5277348
$$ packed form
58127C5289451o71071o76769o85519o96091p06758p14937p17966p15136p08052
58118B8997152o98800o88735o79235o72080o68364o67840o69923o74278o79891
58109B2898006o84571o86385o85097o81685o76893o70874o63699o55617o46872
58100A6846313o37429o26717o13683n97482n78018n55391n29254m99671m68452
58091A1740216m38470m11546l87836l67206l49788l34802l20367l05351k90454
58082H534396k76650k63384k49291k33902k17749k01320j84863j68875j53891
58073F584471j39988j27023j15064j04138r3992q4532p6012o8324o0940n4103
58063E660355m9219m6904m5417m2404l7801l3590l0794k8371k5305k2352k0850
$$ plain form
58052 5277348 5256613 5236009 5216774 5200253 5186851 5175570 5164623 5153015 5141477 5131397 5123012
58041 5123012 5115382 5108111 5102092 5098183 5095938 5094406 5093607 5094295 5096356 5098360 5099070 5098868 5099216 5100992 5103817
58026 5103817 5106951 5110332 5114404 5119308 5124724 5130476 5136691 5143190 5149399 5155385 5162480 5171990 5183415 5194812
58012 5194812 5204952 5214267 5223518 5232593 5241143 5249447 5257803 5265837 5273274 5280725 5288575 5295706 5300752 5304460
57998 5304460 5309385 5317098 5326950 5337700 5348883 5360022 5369989 5378239 5385688 5393271 5400337 5405652 5409545
57985 5409545 5413998 5420742 5430018 5440882 5451901 5461737 5469962 5477427 5485342 5494107 5503455 5513454 5524680
57972 5524680 5537547 5551982 5567535 5583325 5598228 5611812 5624905 5638641 5653207 5668025 5682650
57961 5682650 5696735 5709728 5721771 5734464 5749366 5765718 5781025 5794082 5806129 5818716 5831856
$$ packed form
58052E277348k0735k0604j9235j6521j3402j1281j0947j1608j1538j0080q385
58041E123012p630p271o019l909k245j532p99O88K061K004P10k02L48J776K825
58026E103817L134L381M072M904N416N752O215O499O209N986P095R510J1425J1397
58012E194812J0140R315R251R075Q550Q304Q356Q034P437P451P850P131N046L708
57998E304460M925P713R852J0750J1183J1139R967Q250P449P583P066N315L893
57985E409545M453O744R276J0864J1019R836Q225P465P915Q765R348R999J1226
57972E524680J2867J4435J5553J5790J4903J3584J3093J3736J4566J4818J4625
57961E682650J4085J2993J2043J2693J4902J6352J5307J3057J2047J2587J3140
$$ plain form
57950 5831856 5845015 5858688 5873902 5890857 5908985 5927822 5946917 5965339 5982197 5997494 6011867
57939 6011867 6025772 6039682 6054747 6072152 6091646 6111508 6130416 6148722 6167386 6186059 6203134
57928 6203134 6217766 6231068 6244682 6258591 6271272 6282023 6292133 6303160 6314911 6326062 6336380
57917 6336380 6347221 6359799 6373929 6388715 6403686 6418838 6434168 6449647 6465375 6481435 6497746
57906 6497746 6514061 6529904 6544658 6558257 6571733 6586477 6602801 6619768 6636532 6653233 6670372
57895 6670372 6687946 6705606 6723265 6741103 6759181 6777317 6795254 6812868 6830353 6848175 6866624
57884 6866624 6885544 6904694 6924117 6943798 6963355 6982624 7002123 7022166 7041876 7060117 7077237
57873 7077237 7094779 7113449 7132479 7151055 7169148 7186674 7203148 7218752 7234651 7251525 7268772
$$ packed form
57950E831856J3159J3673J5214J6955J8128J8837J9095J8422J6858J5297J4373
57939F011867J3905J3910J5065J7405J9494J9862J8908J8306J8664J8673J7075
57928F203134J4632J3302J3614J3909J2681J0751J0110J1027J1751J1151J0318
57917F336380J0841J2578J4130J4786J4971J5152J5330J5479J5728J6060J6311
57906F497746J6315J5843J4754J3599J3476J4744J6324J6967J6764J6701J7139
57895F670372J7574J7660J7659J7838J8078J8136J7937J7614J7485J7822J8449
57884F866624J8920J9150J9423J9681J9557J9269J9499K0043J9710J8241J7120
57873G077237J7542J8670J9030J8576J8093J7526J6474J5604J5899J6874J7247
$$ plain form
57862 7268772 7285827 7303319 7322062 7341760 7361549 7381174 7400753 7419995 7438530 7456531 7474330
57851 7474330 7491941 7509636 7528258 7548089 7568104 7587319 7606390 7626714 7648299 7669570 7689077
57840 7689077 7706489 7722255 7737546 7754462 7774901 7798630 7823195 7846172 7867070 7886936 7906787
57829 7906787 7926845 7946924 7967110 7988060 8010477 8034154 8057749 8079960 8100900 8121905 8144026
57818 8144026 8167066 8190080 8212419 8234182 8255893 8277900 8300095 8322295 8344797 8368225 8392704
57807 8392704 8417605 8442275 8466670 8491025 8515289 8539212 8562625 8585424 8607706 8630221 8654192
57796 8654192 8680211 8707602 8735202 8762392 8789085 8815283 8841133 8866958 8892710 8917779 8941846
57785 8941846 8965535 8989712 9014518 9039571 9064764 9090381 9116819 9144584 9174016 9204513 9234582
$$ packed form
57862G268772J7055J7492J8743J9698J9789J9625J9579J9242J8535J8001J7799
57851G474330J7611J7695J8622J9831K0015J9215J9071K0324K1585K1271J9507
57840G689077J7412J5766J5291J6916K0439K3729K4565K2977K0898J9866J9851
57829G906787K0058K0079K0186K0950K2417K3677K3595K2211K0940K1005K2121
57818H144026K3040K3014K2339K1763K1711K2007K2195K2200K2502K3428K4479
57807H392704K4901K4670K4395K4355K4264K3923K3413K2799K2282K2515K3971
57796H654192K6019K7391K7600K7190K6693K6198K5850K5825K5752K5069K4067
57785H941846K3689K4177K4806K5053K5193K5617K6438K7765K9432L0497L0069
$$ plain form
57774 9234582 9263292 9291222 9319486 9348448 9377954 9407994 9438297 9468036 9497012 9526502 9557790
57763 9557790 9590357 9622685 9654408 9686277 9718411 9750218 9782143 9815925 9852657 9891761 9932205
57752 9932205 9973594 10015596 10057394 10098407 10138771 10178602 10217529 10255428 10292729 10329219 10363182
57741 10363182 10392651 10417355 10438854 10458881 10478097 10496430 10514117 10532014 10550821 10570300 10589764
57730 10589764 10609465 10630889 10655158 10681674 10709015 10736691 10765076 10793908 10822173 10849622 10877357
57719 10877357 10906507 10937248 10969420 11003082 11037734 11071790 11103769 11133793 11163319 11193600 11224845
57708 11224845 11256670 11288841 11321567 11355312 11390225 11425715 11460870 11495489 11530349 11566215 11602850
57697 11602850 11639358 11675300 11711111 11747454 11784403 11821337 11857533 11892851 11927813 11962990 11998385
$$ packed form
57774I234582K8710K7930K8264K8962K9506L0040L0303K9739K8976K9490L1288
57763I557790L2567L2328L1723L1869L2134L1807L1925L3782L6732L9104M0444
57752I932205M1389M2002M1798M1013M0364L9831L8927L7899L7301L6490L3963
57741A0363182K9469K4704K1499K0027J9216J8333J7687J7897J8807J9479J9464
57730A0589764J9701K1424K4269K6516K7341K7676K8385K8832K8265K7449K7735
57719A0877357K9150L0741L2172L3662L4652L4056L1979L0024K9526L0281L1245
57708A1224845L1825L2171L2726L3745L4913L5490L5155L4619L4860L5866L6635
57697A1602850L6508L5942L5811L6343L6949L6934L6196L5318L4962L5177L5395
$$ plain form
57686 11998385 12033526 12068072 12102247 12136769 12172531 12210161 12249698 12290720 12332905 12376331 12421077
57675 12421077 12466741 12512536 12557784 12602315 12646690 12692002 12738885 12786480 12832930 12877183 12919618
57664 12919618 12960381 12997864 13029802 13055601 13076888 13096017 13114729 13133903 13153713 13173966 13194784
57653 13194784 13216757 13239984 13263526 13286736 13310731 13337547 13367888 13400656 13434635 13469690 13506183
57642 13506183 13544075 13582745 13621121 13658127 13693822 13730003 13768774 13810420 13853517 13897033 13941283
57631 13941283 13986682 14032585 14077737 14121208 14162849 14203640 14245487 14289578 14334802 14378924 14421470
57620 14421470 14464144 14508111 14552406 14595814 14638921 14683098 14728398 14773779 14818807 14863909 14909257
57609 14909257 14954540 14999710 15045012 15090277 15135039 15179515 15224822 15271863 15320311 15368901 15416564
$$ packed form
57686A1998385L5141L4546L4175L4522L5762L7630L9537M1022M2185M3426M4746
57675A2421077M5664M5795M5248M4531M4375M5312M6883M7595M6450M4253M2435
57664A2919618M0763L7483L1938K5799K1287J9129J8712J9174J9810K0253K0818
57653A3194784K1973K3227K3542K3210K3995K6816L0341L2768L3979L5055L6493
57642A3506183L7892L8670L8376L7006L5695L6181L8771M1646M3097M3516M4250
57631A3941283M5399M5903M5152M3471M1641M0791M1847M4091M5224M4122M2546
57620A4421470M2674M3967M4295M3408M3107M4177M5300M5381M5028M5102M5348
57609A4909257M5283M5170M5302M5265M4762M4476M5307M7041M8448M8590M7663
$$ plain form
57598 15416564 15463130 15509043 15554592 15599759 15644891 15691062 15739106 15788419 15837333 15884835 15931386
57587 15931386 15978024 16025270 16073123 16121512 16170367 16219528 16268773 16317696 16365692 16412615 16459396
57576 16459396 16507327 16556634 16606439 16656156 16706094 16756410 16806353 16855033 16902364 16948952 16995596
57565 16995596 17043090 17091675 17140326 17187468 17232995 17278868 17327077 17377676 17429385 17481272 17532995
57554 17532995 17584112 17634385 17684514 17735508 17787245 17838407 17887966 17936119 17983769 18031627 18079876
57543 18079876 18128200 18176074 18223389 18270786 18318928 18367447 18415085 18461094 18506187 18551939 18599471
57532 18599471 18648818 18699244 18749878 18800101 18849554 18898006 18945283 18991466 19037182 19083488 19131145
57521 19131145 19179860 19228568 19276719 19325065 19374745 19425771 19477093 19528199 19579864 19633018 19687498
$$ packed form
57598A5416564M6566M5913M5549M5167M5132M6171M8044M9313M8914M7502M6551
57587A5931386M6638M7246M7853M8389M8855M9161M9245M8923M7996M6923M6781
57576A6459396M7931M9307M9805M9717M9938N0316M9943M8680M7331M6588M6644
57565A6995596M7494M8585M8651M7142M5527M5873M8209N0599N1709N1887N1723
57554A7532995N1117N0273N0129N0994N1737N1162M9559M8153M7650M7858M8249
57543A8079876M8324M7874M7315M7397M8142M8519M7638M6009M5093M5752M7532
57532A8599471M9347N0426N0634N0223M9453M8452M7277M6183M5716M6306M7657
57521A9131145M8715M8708M8151M8346M9680N1026N1322N1106N1665N3154N4480
$$ plain form
57510 19687498 19742398 19797083 19851396 19905407 19959466 20014007 20068760 20122791 20175966 20229588 20284743
57499 20284743 20340722 20396179 20451337 20507657 20565605 20624046 20681773 20738493 20794312 20849624 20905695
57488 20905695 20964132 21025157 21087153 21148202 21207487 21265283 21322497 21380265 21439071 21498063 21556027
57477 21556027 21612930 21669582 21725926 21781013 21834847 21888970 21944743 22001976 22059549 22116436 22171920
57466 22171920 22225957 22279721 22334782 22391340 22448087 22504033 22559491 22615100 22671002 22727250 22783860
57455 22783860 22840154 22895239 22949507 23004366 23060076 23115288 23169420 23224156 23281554 23341527 23401997
57444 23401997 23460811 23517007 23571178 23625234 23680948 23738071 23794634 23849386 23902979 23956516 24010297
57433 24010297 24064513 24119729 24175818 24231566 24286163 24339978 24393253 24445374 24496363 24547733 24600718
$$ packed form
57510A9687498N4900N4685N4313N4011N4059N4541N4753N4031N3175N3622N5155
57499B0284743N5979N5457N5158N6320N7948N8441N7727N6720N5819N5312N6071
57488B0905695N8437O1025O1996O1049N9285N7796N7214N7768N8806N8992N7964
57477B1556027N6903N6652N6344N5087N3834N4123N5773N7233N7573N6887N5484
57466B2171920N4037N3764N5061N6558N6747N5946N5458N5609N5902N6248N6610
57455B2783860N6294N5085N4268N4859N5710N5212N4132N4736N7398N9973O0470
57444B3401997N8814N6196N4171N4056N5714N7123N6563N4752N3593N3537N3781
57433B4010297N4216N5216N6089N5748N4597N3815N3275N2121N0989N1370N2985
$$ plain form
57422 24600718 24654747 24708671 24762350 24815776 24867761 24917006 24963858 25009743 25055392 25100677 25145633
57411 25145633 25190558 25235463 25280202 25324645 25368210 25410019 25450164 25489925 25529905 25568851 25605158
57400 25605158 25638703 25670373 25700831 25730615 25760470 25790466 25819675 25847731 25875850 25905269 25935564
57389 25935564 25965552 25994916 26023814 26051837 26078603 26104660 26130627 26156157 26180851 26205361 26230437
57378 26230437 26255706 26280599 26305734 26332043 26359238 26386354 26413134 26439698 26465650 26490904 26516751
57367 26516751 26544696 26574703 26605808 26637922 26671664 26706905 26742817 26779135 26816220 26854207 26893108
57356 26893108 26933405 26975466 27018709 27062247 27106034 27150507 27195497 27240354 27284740 27328560 27371531
57345 27371531 27413411 27454195 27493770 27532109 27570005 27608393 27646695 27683404 27718860 27755543 27794544
$$ packed form
57422B4600718N4029N3924N3679N3426N1985M9245M6852M5885M5649M5285M4956
57411B5145633M4925M4905M4739M4443M3565M1809M0145L9761L9980L8946L6307
57400B5605158L3545L1670L0458K9784K9855K9996K9209K8056K8119K9419L0295
57389B5935564K9988K9364K8898K8023K6766K6057K5967K5530K4694K4510K5076
57378B6230437K5269K4893K5135K6309K7195K7116K6780K6564K5952K5254K5847
57367B6516751K7945L0007L1105L2114L3742L5241L5912L6318L7085L7987L8901
57356B6893108M0297M2061M3243M3538M3787M4473M4990M4857M4386M3820M2971
57345B7371531M1880M0784L9575L8339L7896L8388L8302L6709L5456L6683L9001
$$ plain form
57334 27794544 27833631 27870238 27904653 27938612 27972328 28004867 28036217 28066991 28097025 28126030 28154782
57323 28154782 28184073 28213371 28241897 28269971 28297894 28324884 28350781 28377378 28406196 28436193 28465656
57312 28465656 28495080 28526005 28558181 28590130 28621611 28653316 28684895 28715444 28745232 28774984 28804193
57301 28804193 28831866 28857999 28882594 28904553 28923538 28941543 28960394 28979144 28996478 29014256 29035838
57290 29035838 29061951 29091030 29122472 29156416 29191229 29224678 29257347 29291939 29329439 29368829 29410326
57279 29410326 29456019 29507464 29565249 29630634 29704817 29786776 29874498 29968143 30069341 30177612 30290180
57268 30290180 30405132 30522077 30639756 30755588 30867510 30973979 31072524 31160822 31239120 31309672
57258 31309672 31374445 31435331 31495255 31556496 31619079 31683284 31751926 31827130 31906817 31988234 32073320
$$ packed form
57334B7794544L9087L6607L4415L3959L3716L2539L1350L0774L0034K9005K8752
57323B8154782K9291K9298K8526K8074K7923K6990K5897K6597K8818K9997K9463
57312B8465656K9424L0925L2176L1949L1481L1705L1579L0549K9788K9752K9209
57301B8804193K7673K6133K4595K1959J8985J8005J8851J8750J7334J7778K1582
57290B9035838K6113K9079L1442L3944L4813L3449L2669L4592L7500L9390M1497
57279B9410326M5693N1445N7785O5385P4183Q1959Q7722R3645J01198J08271J12568
57268C0290180J14952J16945J17679J15832J11922J06469R8545Q8298P8298P0552
57258C1309672O4773O0886N9924O1241O2583O4205O8642P5204P9687Q1417Q5086
$$ plain form
57247 32073320 32166393 32267920 32375053 32487019 32605155 32728357 32853459 32979703 33108015
57238 33108015 33236180 33359797 33478050 33593813 33708151 33819689 33929380 34040676 34154676
57229 34154676 34270136 34388529 34513916 34647636 34788590 34939157 35105065 35288572 35487338
57220 35487338 35700844 35932235 36182883 36451076 36737356 37045395 37376278 37727735 38100490
57211 38100490 38499764 38929308 39389690 39883523 40416318 40991292 41609773 42277675 43004830
57202 43004830 43797270 44657762 45595145 46625676 47764968 49028156 50440253 52038321
57194 52038321 53863656 55963148 58399708 61248657 64579208 68444985 72879210 77863734
57186 77863734 83290534 88990406 94845787 100885985 107259075 114107196 121464052 129239811
$$ packed form
57247C2073320R3073J01527J07133J11966J18136J23202J25102J26244J28312
57238C3108015J28165J23617J18253J15763J14338J11538J09691J11296J14000
57229C4154676J15460J18393J25387J33720J40954J50567J65908J83507J98766
57220C5487338K13506K31391K50648K68193K86280L08039L30883L51457L72755
57211C8100490L99274M29544M60382M93833N32795N74974O18481O67902P27155
57202D3004830P92440Q60492R37383J030531J139292J263188J412097J598068
57194E2038321J825335K099492K436560K848949L330551L865777M434225M984524
57186G7863734N426800N699872N855381O040198O373090O848121P356856P775759
$$ plain form
57178 129239811 137263043 145335245 153291173 161064561 168737202 176545712 184835842 193973328
57170 193973328 204245561 215801387 228647254 242675194 257696956 273476529 289733457
57163 289733457 306075199 321887356 336293160 348241998 356657827 360581361 359362704
57156 359362704 352939849 342023418 327938532 312158962 295881565 279910587 264769383
57149 264769383 250800335 238178404 226927268 216977483 208209369 200456444 193515309
57142 193515309 187181142 181271290 175620946 170082218 164539888 158916899 153159227 147226906
57134 147226906 141104784 134812281 128397849 121929586 115488704 109157591 103006292 97093084
57126 97093084 91474155 86199855 81298169 76770824 72608663 68804173 65349841 62236057
$$ packed form
57178A29239811Q023232Q072202P955928P773388P672641P808510Q290130R137486
57170A93973328J0272233J1555826J2845867J4027940J5021762J5779573J6256928
57163B89733457J6341742J5812157J4405804J1948838Q415829L923534j218657
57156C59362704o422855j0916431j4084886j5779570j6277397j5970978j5141204
57149B64769383j3969048j2621931j1251136r949785q768114p752925o941135
57142A93515309o334167n909852n650344n538728n542330n622989n757672n932321
57134A47226906o122122o292503o414432o468263o440882o331113o151299n913208
57126I7093084n618929n274300m901686m527345m162161l804490l454332l113784
$$ plain form
57118 62236057 59454698 56994172 54822363 52877168 51077017 49339586 47596811 45809170
57110 45809170 43977859 42140851 40349575 38644153 37041923 35535444 34095048 32680592
57102 32680592 31260017 29818665 28351889 26853551 25312080 23709471 22018186 20203902
57094 20203902 18240562 16129550 13912323 11675698 9548924 7683943 6216962 5227688
57086 5227688 4716360 4604924 4758372 5021764 5264075 5411722 5457746 5447355 5450908 5535827
57076 5535827 5747234 6103256 6600767 7220224 7925535 8666541 9389411 10048854 10614177
57067 10614177 11069880 11415705 11666906 11852919 12013980 12195052 12436464 12764614 13188229
57058 13188229 13700127 14279552 14894296 15506988 16085986 16615455 17101281 17573346 18081844
$$ packed form
57118F2236057k781359k460526k171809j945195j800151j737431j742775j787641
57110D5809170j831311j837008j791276j705422j602230j506479j440396j414456
57102C2680592j420575j441352j466776j498338j541471j602609j691285j814284
57094B0203902j963340k111012k217227k236625k126774j864981j466981r89274
57086E227688n11328j11436J53448K63392K42311J47647M6024j0391L553Q4919
57076E535827K11407L56022M97511O19457P05311P41006P22870O59443N65323
57067A0614177M55703L45825K51201J86013J61061J81072K41412L28150M23615
57058A3188229N11898N79425O14744O12692N78998N29469M85826M72065N08498
$$ plain form
57049 18081844 18683985 19425905 20331282 21400732 22615530 23941534 25336446 26760327
57041 26760327 28181738 29575899 30921095 32198615 33393112 34490502 35477531 36346290
57033 36346290 37099030 37748092 38312836 38817265 39287504 39747685 40216719 40707771 41227933
57024 41227933 41776440 42344216 42916496 43475844 44003606 44481785 44896273 45238849 45506991
57015 45506991 45703798 45837715 45918618 45951366 45933154 45856369 45711234 45485184 45163479 44733724
57005 44733724 44189437 43528889 42753015 41866051 40875864 39791061 38618608 37365564 36041239
56996 36041239 34655456 33215897 31729544 30206706 28662802 27117537 25593881 24116165
56988 24116165 22705708 21376231 20132534 18971784 17884841 16857670 15874270 14920163
$$ packed form
57049A8081844O02141P41920R05377J069450J214798J326004J394912J423881
57041B6760327J421411J394161J345196J277520J194497J097390R87029Q68759
57033C6346290P52740O49062N64744N04429M70239M60181M69034M91052N20162
57024D1227933N48507N67776N72280N59348N27762M78179M14488L42576K68142
57015D5506991J96807J33917Q0903L2748j8212p6785j45135k26050l21705m29755
57005D4733724n44287o60548p75874q86964r90187j084803j172453j253044j324325
56996C6041239j385783j439559j486353j522838j543904j545265j523656j477716
56988B4116165j410457j329477j243697j160750j086943j027171r83400r54107
$$ plain form
56980 14920163 13984651 13061831 12150657 11253489 10374175 9518189 8694195 7913088 7184109
56971 7184109 6512685 5902105 5354895 4871093 4446872 4076709 3755899 3479783 3242027
56962 3242027 3035614 2854983 2696063 2555223 2429625 2317857 2218750 2130090 2049476 1975588
56952 1975588 1907458 1843350 1781685 1722442 1666513 1614327 1566113 1522523 1483637 1448034 1414194
56941 1414194 1382248 1353122 1326591 1301421 1276906 1252990 1229381 1205852 1183206 1162662 1144424
56930 1144424 1127659 1111579 1095604 1078835 1060438 1040511 1019973 999865 981165 964578 949806
56919 949806 935674 921736 909027 898444 889191 879803 869946 860135 850423 840616 831182 822595 814063
56906 814063 804208 792845 781125 770141 760526 753156 749004 748009 748833 749859 750050 749284 748641 750104 755045
$$ packed form
56980A4920163r35512r22820r11174q97168q79314q55986q23994p81107p28979
56971G184109o71424o10580n47210m83802m24221l70163l20810k76116k37756
56962C242027k06413j80631j58920j40840j25598j11768r9107q8660q0614p3888
56952A975588o8130o4108o1665n9243n5929n2186m8214m3590l8886l5603l3840
56941A414194l1946k9126k6531k5170k4515k3916k3609k3529k2646k0544j8238
56930A144424j6765j6080j5975j6769j8397j9927k0538k0108j8700j6587j4772
56919I49806j4132j3938j2709j0583r253r388r857r811r712r807r434q587q532
56906H14063r855j1363j1720j0984r615p370m152r95Q24J026J91p66o43J463M941
$$ plain form
56891 755045 762890 771739 780115 787694 794761 801636 808373 814373 818545 820328 820250 819050 816806 813429 809329
56876 809329 804838 799589 793375 787178 782454 779688 778375 777961 778081 778416 779399 782647 789475 799041 808962
56861 808962 817753 825719 833450 840505 845971 849512 851242 850882 847595 840794 831097 820337 810533 802815
56847 802815 797403 794125 792311 790583 787960 785463 785621 789813 796891 804820 812778 821078 829974 839346
56833 839346 848888 857719 864317 867444 866736 862090 853319 840930 826298 810386 793187 775106 757816
56820 757816 742736 729640 717805 707650 700092 695112 692241 691635 693262 695730 697551 699161 702106
56807 702106 706458 710490 712710 712691 709959 703799 694621 684175 673768 663147 651492 638631 624924
56794 624924 610733 596519 582983 570794 560440 552271 546267 541906 538705 536678 535744 535067 533724
$$ packed form
56891G55045P845Q849Q376P579P067O875O737O000M172J783p8j200k244l377m100
56876H09329m491n249o214o197m724k766j313m14J20L35R83L248O828R566R921
56861H08962Q791P966P731P055N466L541J730l60l287o801r697j0760r804p718
56847H02815n412l278j814j728k623k497J58M192P078P929P958Q300Q896R372
56833H39346R542Q831O598L127p08m646q771j2389j4632j5912j7199j8081j7290
56820G57816j5080j3096j1835j0155p558m980k871o06J627K468J821J610K945
56807G02106M352M032K220j9k732o160r178j0446j0407j0621j1655j2861j3707
56794F24924j4191j4214j3536j2189j0354q169o004m361l201k027r34o77j343
$$ plain form
56781 533724 531763 529817 527933 525561 522418 518375 512678 504341 493538 481856 470929 461241 452135
56768 452135 442458 431458 419657 408530 398759 389353 379388 369989 363166 358936 355032 349662 343184
56755 343184 336757 330714 325038 320378 317505 316038 314427 311229 306281 300780 296295 293440 291532 289674
56741 289674 287787 286172 284523 282163 279021 275561 271870 267663 263204 259381 256632 254447 252155 249686
56727 249686 247406 245641 244423 243366 241795 239293 236023 232313 228292 224215 220517 217010 212743 207539
56713 207539 203114 201570 203065 205836 208023 208508 206682 202997 199472 197907 197509 195900 192642 189973 189500
56698 189500 189982 189498 188247 187739 188170 188225 187134 185598 184626 184419 184509 184315 183532 182446 181936 182741 184628 186645
56680 186645 188233 189823 192139 195129 197917 199965 201923 204778 208176 210361 210185 208546 207139 206304 204988
$$ packed form
56781E33724j961j946j884k372l143m043n697q337j0803j1682j0927r688r106
56768D52135r677j1000j1801j1127r771r406r965r399o823m230l904n370o478
56755C43184o427o043n676m660k873j467j611l198m948n501m485k855j908j858
56741B89674j887j615j649k360l142l460l691m207m459l823k749k185k292k469
56727B49686k280j765j218j057j571k502l270l710m021m077l698l507m267n204
56713B07539m425j544J495K771K187M85j826l685l525j565l98j609l258k669m73
56698A89500M82m84j251n08M31N5j091j536r72k07R0j94p83j086n10Q05J887K017
56680A86645J588J590K316K990K788K048J958K855L398K185j76j639j407q35j316
$$ plain form
56665 204988 202643 200175 198891 199146 200211 201054 201242 201405 202666 205256 208059 209991 211309 212787 214233
56650 214233 214917 215136 216023 217773 219352 220181 220993 222665 225252 228571 232650 236992 240357 242079 243011 244426
56634 244426 246483 248422 249954 251720 254315 257291 259348 259635 258916 259140 261519 265254 268498 270263 270940
56619 270940 271479 272836 275739 279833 283162 283718 281660 279118 277703 277320 277520 278709 281278 284469 286861
56604 286861 287530 286335 283742 280828 278893 278484 279017 279548 279552 278940 277907 276892 276201 275587 274730 274010 274098 274797
56586 274797 275103 274490 273399 272536 272424 273507 275639 277598 278288 278455 279892 282813 285437 286483 286623 286946
56570 286946 287571 288577 290829 294568 298248 300034 299974 299837 301371 305348 311392 317906 322842 325429 326586
56555 326586 327247 327217 326373 325797 326615 328508 330441 332058 333365 333924 333711 334013 335939 338413 339159 337614 335569
$$ packed form
56665B04988k345k468j284K55J065Q43J88J63J261K590K803J932J318J478J446
56650B14233O84K19Q87J750J579Q29Q12J672K587L319M079M342L365J722R32J415
56634B44426K057J939J532J766K595K976K057K87p19K24K379L735L244J765O77
56619B70940N39J357K903M094L329N56k058k542j415l83K00J189K569L191K392
56604B86861O69j195k593k914j935m09N33N31Mo12j033j015o91o14q57p20Q8O99
56586B74797L06o13j091q63j12J083K132J959O90J67J437K921K624J046J40L23
56570B86946O25J006K252L739L680J786o0j37J534L977O044O514M936K587J157
56555C26586O61l0q44n76Q18J893J933J617J307N59k13L02J926K474P46j545k045
$$ plain form
56538 335569 334756 334964 334834 333673 332002 330758 330223 329724 328487 326745 325440 324781 324009 322946 322600 323498
56522 323498 324417 323949 322466 321301 320697 320001 319358 319602 320573 321089 320748 320421 320638 320707 319961 318894 318471 319009
56504 319009 320278 322130 324452 326702 327959 327586 325907 324176 323480 323505 322865 321015 319293 319518 322010 325592
56488 325592 329038 331723 333276 333583 333058 332207 331073 329740 329035 329813 331592 332757 332196 330271 328350 327955
56472 327955 330003 333958 337735 339285 338540 337364 337631 339610 341936 342782 341516 339730 340096 343570 348274
56457 348274 351734 353339 353721 352908 350790 348633 348098 348768 348493 346399 343953 342841 343449 345790 350086 355617
56441 355617 360481 363497 365238 366456 366875 366456 366457 367808 369380 369472 368497 368733 371487 375719 379541 382103
56425 382103 383788 385334 387229 389612 392378 395255 397785 399497 400452 401483 403307 405507 407151 408474
$$ packed form
56538C35569q13K08j30j161j671j244n35m99j237j742j305o59p72j063l46Q98
56522C23498R19m68j483j165o04o96o43K44R71N16l41l27K17O9p46j067m23N38
56504C19009J269J852K322K250J257l73j679j731o96K5o40j850j722K25K492L582
56488C25592L446K685J553L07n25q51j134j333p05P78J779J165n61j925j921l95
56472C27955K048L955L777J550p45j176K67J979K326Q46j266j786L66L474M704
56457C48274L460J605L82q13k118k157n35O70k75k094k446j112O08K341M296N531
56441C55617M864L016J741J218M19m19JJ351J572R2r75K36K754M232L822K562
56425C82103J685J546J895K383K766K877K530J712R55J031J824K200J644J323
$$ plain form
56411 408474 410903 414962 419139 421546 422024 421749 421451 421058 420732 421160 422689 424975 427678 430968 435103 439816
56395 439816 444256 447428 448898 449361 450326 452753 455983 458308 458769 458283 458922 462040 467052 472145 476277
56380 476277 480164 484989 490540 495419 498981 502091 505759 510028 514646 519822 525525 530853 535197 539453
56366 539453 544902 551093 556051 558768 560515 563377 568290 574843 582181 589411 595665 600736 605807 612964
56352 612964 623514 636750 650573 663486 675796 688724 702491 715885 728033 740070 754415
56341 754415 772420 793282 815257 837327 859391 881505 903740 926684 951265 977675 1004855
56330 1004855 1031560 1057784 1084583 1112392 1140025 1165824 1189502 1212346 1235538 1258662 1280099
56319 1280099 1298755 1315043 1330047 1343896 1355505 1364124 1370612 1376390 1381453 1384572 1385709 1386931 1389999
$$ packed form
56411D08474K429M059M177K407M78k75k98l93l26M28J529K286K703L290M135M713
56395D39816M440L172J470M63R65K427L230K325M61m86O39L118N012N093M132
56380D76277L887M825N551M879L562L110L668M269M618N176N703N328M344M256
56366E39453N449O191M958K717J747K862M913O553P338P230O254N071N071P157
56352F12964J0550J3236J3823J2913J2310J2928J3767J3394J2148J2037J4345
56341G54415J8005K0862K1975K2070K2064K2114K2235K2944K4581K6410K7180
56330A004855K6705K6224K6799K7809K7633K5799K3678K2844K3192K3124K1437
56319A280099J8656J6288J5004J3849J1609Q619O488N778N063L119J137J222L068
$$ plain form
56306 1389999 1394020 1396647 1397005 1396152 1395135 1394187 1393753 1394634 1396683 1398746 1400394 1402459 1405307 1407904 1409449
56291 1409449 1410684 1412528 1414599 1416401 1419100 1424482 1432457 1440944 1447987 1452919 1455798 1457131 1458150 1460028
56277 1460028 1462715 1465657 1469572 1475954 1484535 1492916 1499604 1506077 1514685 1525500 1536608 1546808 1556547
56264 1556547 1566429 1576416 1586855 1598943 1613316 1628884 1644052 1658860 1675086 1694064 1714985 1735768
56252 1735768 1755268 1774147 1793612 1813828 1833924 1853104 1871125 1887766 1902566 1915405 1926750
56241 1926750 1936741 1944379 1948375 1948792 1947238 1945254 1943027 1939831 1935044 1928156 1918421 1905454 1890292 1875139
56227 1875139 1861762 1850506 1841008 1833306 1827813 1824528 1822912 1822618 1824107 1828438 1836454 1848118 1862673
56214 1862673 1879584 1899079 1921281 1944900 1967575 1987880 2006389 2024369 2042181 2059670 2077371
$$ packed form
56306A389999M021K627L58q53j017r48m34Q81K049K063J648K065K848K597J545
56291A409449J235J844K071J802K699N382P975Q487P043M932K879J333J019J878
56277A460028K687K942L915O382Q581Q381O688O473Q608J0815J1108J0200R739
56264A556547R882R987J0439J2088J4373J5568J5168J4808J6226J8978K0921K0783
56252A735768J9500J8879J9465K0216K0096J9180J8021J6641J4800J2839J1345
56241A926750R991P638L996M17j554j984k227l196m787o888r735j2967j5162j5153
56227A875139j3377j1256r498p702n493l285j616k94J489M331Q016J1664J4555
56214A862673J6911J9495K2202K3619K2675K0305J8509J7980J7812J7489J7701
$$ plain form
56203 2077371 2096109 2115532 2134082 2150447 2164197 2175001 2182414 2186851 2189978 2193566 2198393 2204320
56191 2204320 2210587 2215782 2218378 2217893 2214928 2209779 2202043 2192289 2183152 2177564 2176177 2177313 2179001 2180185
56177 2180185 2180392 2179618 2178869 2179822 2183342 2188609 2193926 2198151 2201314 2204301 2208214 2213895 2221700 2231336 2241618
56162 2241618 2250800 2257932 2263996 2270907 2279211 2287706 2295757 2304679 2315815 2328297 2340241 2351602 2364210
56149 2364210 2379148 2395757 2413458 2432849 2454241 2476314 2497308 2517037 2537007 2558951 2583718
56138 2583718 2611192 2640728 2671716 2703861 2736835 2769965 2802806 2835739 2869062 2901534 2931026
56127 2931026 2956999 2981286 3005730 3029773 3051085 3068082 3081286 3092721 3104438 3117089 3129428
56116 3129428 3139586 3147119 3153306 3159293 3164904 3169767 3174544 3180037 3185804 3190699 3194454 3197992 3202674 3209949
$$ packed form
56203B077371J8738J9423J8550J6365J3750J0804P413M437L127L588M827N927
56191B204320O267N195K596m85k965n149p736r754r137n588j387J136J688J184
56177B180185K07p74p49R53L520N267N317M225L163K987L913N681P805R636J0282
56162B241618R182P132O064O911Q304Q495Q051Q922J1136J2482J1944J1361J2608
56149B364210J4938J6609J7701J9391K1392K2073K0994J9729J9970K1944K4767
56138B583718K7474K9536L0988L2145L2974L3130L2841L2933L3323L2472K9492
56127B931026K5973K4287K4444K4043K1312J6997J3204J1435J1717J2651J2339
56116C129428J0158P533O187N987N611M863M777N493N767M895L755L538M682P275
$$ plain form
56102 3209949 3221105 3236244 3253892 3272668 3293181 3317426 3346619 3380502 3418472 3460177 3505111
56091 3505111 3552724 3603175 3657205 3715214 3777152 3843125 3913291 3987288 4064698 4145918 4231596
56080 4231596 4321394 4414478 4511190 4613006 4720827 4834618 4954822 5082660 5218617 5362135
56070 5362135 5513515 5674915 5848822 6036840 6240825 6463907 6709334 6979352 7276564
56061 7276564 7605762 7973594 8387339 8855187 9387214 9995177 10692019 11492208 12411044
56052 12411044 13461482 14651517 15985385 17466386 19096757 20874989 22794879 24847950
56044 24847950 27026994 29329339 31760063 34333837 37073102 40003187 43147536 46525045
56036 46525045 50149348 54029180 58167829 62558677 67177375 71975861 76881885 81802473
$$ packed form
56102C209949J1156J5139J7648J8776K0513K4245K9193L3883L7970M1705M4934
56091C505111M7613N0451N4030N8009O1938O5973P0166P3997P7410Q1220Q5678
56080D231596Q9798R3084R6712J01816J07821J13791J20204J27838J35957J43518
56070E362135J51380J61400J73907J88018K03985K23082K45427K70018K97212
56061G276564L29198L67832M13745M67848N32027O07963O96842Q00189R18836
56052A2411044J050438J190035J333868J481001J630371J778232J919890K053071
56044B4847950K179044K302345K430724K573774K739265K930085L144349L377509
56036D6525045L624303L879832M138649M390848M618698M798486M906024M920588
$$ plain form
56028 81802473 86630306 91254192 95566738 99453454 102764004 105300688 106862551 107333026
56020 107333026 106746954 105284828 103206121 100775097 98215452 95693040 93314024 91133784
56012 91133784 89173381 87435210 85912326 84594085 83471370 82539784 81799197 81251361
56004 81251361 80896463 80727367 80723560 80850453 81065587 81326243 81593308 81832076 82012932 82112743
55994 82112743 82117194 82024446 81847818 81613535 81353956 81101588 80886856 80736709 80671410 80701612
55984 80701612 80828116 81043051 81330901 81670980 82042388 82428697 82819698 83211441 83606250
55975 83606250 84011323 84434849 84882685 85358979 85869438 86423690 87035871 87724120 88508336
55966 88508336 89406035 90429232 91584978 92877937 94312396 95894389 97634929 99551375
$$ packed form
56028H1802473M827833M623886M312546L886716L310550K536684J561863M70475
56020A07333026n86072j462126k078707k431024k559645k522412k379016k180240
56012I1133784j960403j738171j522884j318241j122715r31586p40587n47836
56004H1251361l54898j69096l807J26893K15134K60656K67065K38768J80856R9811
55994H2112743M451r2748j76628k34283k59579k52368k14732j50147o5299L0202
55984H0701612J26504K14935K87850L40079L71408L86309L91001L91743L94809
55975H3606250M05073M23526M47836M76294N10459N54252O12181O88249P84216
55966H8508336Q97699J023197J155746J292959J434459J581993J740540J916446
$$ plain form
55958 99551375 101663730 103988475 106535009 109305064 112292048 115480447 118847495 122365940
55950 122365940 126005671 129735543 133521641 137303747 140935878 144118247 146389811 147230631
55942 147230631 146239892 143285878 138540181 132392444 125312846 117736048 110001677 102348205
55934 102348205 94938825 87894171 81312545 75272407 69825796 64993765 60767681 57114480
55926 57114480 53984497 51320985 49068195 47174774 45593618 44282271 43204960 42333537
55918 42333537 41645657 41122290 40747043 40506706 40390218 40384344 40467357 40604759 40751349 40859902
55908 40859902 40891395 40821072 40639294 40349519 39964428 39499968 38969872 38384532 37753541 37087009
55898 37087009 36393935 35681448 34957199 34231180 33513482 32810738 32125712 31459228 30810644
$$ packed form
55958I9551375K112355K324745K546534K770055K986984L188399L367048L518445
55950A22365940L639731L729872L786098L782106L632131L182369K271564Q40820
55942A47230631r90739k954014m745697o147737p079598p576798p734371p653472
55934A02348205p409380p044654o581626o040138n446611m832031m226084l653201
55926E7114480l129983k663512k252790j893421j581156j311347j077311q71423
55918D2333537o87880n23367l75247k40337j16488n874Q3013J37402J46590J08553
55908D0859902L1493p0323j81778k89775l85091m64460n30096n85340o30991o66532
55898C7087009o93074p12487p24249p26019p17698p02744o85026o66484o48584
$$ plain form
55889 30810644 30176851 29552812 28933722 28315899 27695943 27070744 26439012 25801972 25162135
55880 25162135 24521965 23883734 23249402 22619666 21993401 21368356 20742158 20112691 19478299
55871 19478299 18838186 18192396 17541283 16885398 16226102 15565818 14907262 14252509 13602829
55862 13602829 12959173 12322637 11694612 11076690 10470771 9879823 9308764 8763815 8250014
55853 8250014 7769218 7320622 6902612 6513418 6150711 5811945 5495093 5198034 4917408
55844 4917408 4649595 4393175 4149114 3918084 3699044 3491321 3296561 3117039 2952853
55835 2952853 2802316 2664605 2540133 2428312 2326809 2233796 2149528 2074589 2007500 1945373
55825 1945373 1886613 1831736 1781455 1735113 1691449 1650010 1611007 1574216 1538973 1505216 1473738
$$ packed form
55889C0810644o33793o24039o19090o17823o19956o25199o31732o37040o39837
55880B5162135o40170o38231o34332o29736o26265o25045o26198o29467o34392
55871A9478299o40113o45790o51113o55885o59296o60284o58556o54753o49680
55862A3602829o43656o36536o28025o17922o05919n90948n71059n44949n13801
55853H250014m80796m48596m18010l89194l62707l38766l16852k97059k80626
55844D917408k67813k56420k44061k31030k19040k07723j94760j79522j64186
55835B952853j50537j37711j24472j11821j01503r3013q4268p4939o7089o2127
55825A945373n8760n4877n0281m6342m3664m1439l9003l6791l5243l3757l1478
$$ plain form
55814 1473738 1445091 1418710 1393443 1368604 1344276 1320934 1299020 1278544 1258691 1238163 1216383
55803 1216383 1194152 1172704 1152324 1132418 1112736 1093771 1075853 1058548 1041312 1024368 1008505
55792 1008505 994182 981050 968301 955356 942252 929444 917299 905851 894955 884349 873451
55781 873451 861609 848929 836542 825485 815509 805388 794287 782443 770743 760048 750645 741834
55769 741834 732384 722034 712199 704385 698259 692294 685972 680044 674572 668324 660724 653086 646991 642434
55755 642434 638478 634798 631452 627785 622833 616582 609851 603127 596512 590532 585829 581966 577596 572270
55741 572270 567283 564245 563136 562129 559090 553236 545767 539063 534802 532573 530462 526988 522154 516717
55727 516717 511120 505570 500626 496940 494385 491959 488835 485241 481987 479303 476572 473274 469655 466198
$$ packed form
55814A473738k8647k6381k5267k4839k4328k3342k1914k0476j9853k0528k1780
55803A216383k2231k1448k0380j9906j9682j8965j7918j7305j7236j6944j5863
55792A008505j4323j3132j2749j2945j3104j2808j2145j1448j0896j0606j0898
55781H73451j1842j2680j2387j1057r976j0121j1101j1844j1700j0695r403q811
55769G41834r450j0350r835p814o126n965o322n928n472o248p600p638o095m557
55755F42434l956l680l346l667m952o251o731o724o615n980m703l863m370n326
55741E72270m987l038j109j007l039n854p469o704m261k229k111l474m834n437
55727E16717n597n550m944l686k555k426l124l594l254k684k731l298l619l457
$$ plain form
55713 466198 462895 459751 457671 457781 459523 460299 457802 452391 446543 442247 439523 437271 434666 431451 427466
55698 427466 422507 416670 410609 405285 401324 398549 396241 394003 392298 391912 392895 394137 394003 391505 387083
55683 387083 382310 378678 376559 375358 374462 373733 373211 372911 372926 373168 372912 371337 368806 366863 366454 366827 366764
55666 366764 366250 366084 366395 366549 366248 365709 364939 363829 362993 363473 365356 367511 368940 369597 369658 368833 366860
55649 366860 364013 360712 357262 354348 353055 353673 355015 355532 354803 353465 352209 351490 351659 352503 352832 351462
55633 351462 348679 346015 344430 343328 341605 339137 336923 336036 336668 337958 338606 337866 336010 333715 331117
55618 331117 327887 324128 320545 317547 314790 312015 309790 308823 308893 309133 309218 309546 310256 310843 310955 310835 310535
55601 310535 309385 306866 303632 300889 298937 297081 294905 292838 291318 290208 289436 289462 290516 291887 292722
$$ packed form
55713D66198l303l144k080J10J742P76k497n411n848m296k724k252k605l215l985
55698D27466m959n837o061n324l961k775k308k238j705l86R83J242j34k498m422
55683C87083m773l632k119j201q96p29n22l00J5K42k56j575k531j943m09L73o3
55666C66764n14j66L11J54l01n39p70j110q36M80J883K155J429O57O1q25j973
55649C66860k847l301l450k914j293O18J342N17p29j338j256p19J69Q44L29j370
55633C51462k783k664j585j102j723k468k214q87O32J290O48p40j856k295k598
55618C31117l230l759l583k998k757k775k225r67P0K40Q5L28P10N87J12j20l00
55601C10535j150k519l234k743j952j856k176k067j520j110p72K6J054J371Q35
$$ plain form
55586 292722 293200 294177 295794 297196 297648 297271 296545 295745 295163 295223 295899 296522 296752 297445 299881 304120 308628
55569 308628 311641 312555 311962 310724 309205 307134 303962 299457 294068 288665 283889 279918 276712 274072 271319
55554 271319 267473 262264 256789 252651 250449 249505 249017 248913 249405 250319 251324 252467 253952 255580 256871
55539 256871 257649 258021 257848 256762 254789 252465 250174 247805 245336 243382 242790 243742 245427 246507 245902 243464
55523 243464 240113 237117 235031 233513 232221 231558 232253 234421 237263 239494 239996 238528 236134 234484 234369
55508 234369 235061 235491 235601 235948 236408 236271 235612 235605 237028 239139 240522 240651 240144 239800 239772 239518 238249 235639
55490 235639 232491 230444 230586 232323 233891 233945 232471 230350 228449 227166 226480 226230 226377 226982 227915 228835
55474 228835 229652 230721 232225 233502 233576 232353 230721 229356 228026 226465 225327 225585 227151 228726 229037
$$ packed form
55586B92722M78R77J617J402M52l77p26q00n82O0O76O23K30O93K436M239M508
55569C08628L013R14n93j238j519k071l172m505n389n403m776l971l206k640k753
55554B71319l846n209n475m138k202r44m88j04M92R14J005J143J485J628J291
55539B56871P78L72j73j086j973k324k291k369k469j954n92R52J685J080o05k438
55523B43464l351k996k086j518j292o63O95K168K842K231N02j468k394j650j15
55508B34369O92M30J10L47M60j37o59pJ423K111J383J29n07l44k8k54j269k610
55490B35639l148k047J42J737J568N4j474k121j901j283o86k50J47O05R33R20
55474B28835Q17J069J504J277P4j223j632j365j330j561j138K58J566J575L11
$$ plain form
55459 229037 227807 225588 223244 221736 221815 223436 225598 227046 227154 226264 225312 225066 225383 225220 223700 221114
55443 221114 218479 216288 214344 212749 212133 212632 213586 214719 216657 219597 222419 224117 225311 227090 229055
55428 229055 229928 229669 229329 229052 228013 226518 226291 228038 230461 232433 234487 237029 238708 238193 236413 235358
55412 235358 235360 235239 234492 233621 232610 230882 228729 227141 225972 223870 220495 217378 215906 215589 215083 213936
55396 213936 212543 211097 209381 207256 204833 202470 200819 200326 200519 200500 200352 201111 202852 203890 202862 200943
55380 200943 200763 203315 206936 209372 210035 210049 210831 212964 215974 218683 219932 219251 216986 213828 210382 207233
55364 207233 205186 205054 206933 209744 211885 212618 212645 213132 214350 215653 216531 217153 217858 218598 219024 218714 217201
55347 217201 214260 210448 207087 205380 205588 207045 208811 210293 211474 212620 213649 214016 213496 212799 212901
$$ packed form
55459B29037j230k219k344j508P9J621K162J448J08q90r52k46L17j63j520k586
55443B21114k635k191j944j595o16M99R54J133J938K940K822J698J194J779J965
55428B29055Q73k59l40k77j039j495k27J747K423J972K054K542J679n15j780j055
55412B35358Kj21p47q71j011j728k153j588j169k102l375l117j472l17n06j147
55396B13936j393j446j716k125k423k363j651m93J93j9j48P59J741J038j028j919
55380B00943j80K552L621K436O63J4P82K133L010K709J249o81k265l158l446l149
55364B07233k047j32J879K811K141P33K7M87J218J303Q78O22P05P40M26l10j513
55347B17201k941l812l361j707K08J457J766J482J181J146J029L67n20o97J02
$$ plain form
55332 212901 213947 215375 216868 218419 219504 219175 217228 214547 211974 209588 207373 205859 205583 206511 208316
55317 208316 210488 211775 210560 206828 203191 202780 206095 210628 213537 214035 213247 212533 212299 212085 211413 210428
55301 210428 209685 209479 209717 210301 211058 211287 210192 208155 206799 207183 208477 208964 207902 205864 203845 202748
55285 202748 203195 204956 206823 207778 207972 207929 207331 205635 203555 202758 203993 206507 209336 212135 214503 215596
55269 215596 215049 213668 212574 211979 211245 209922 208403 207587 207932 208726 208485 206427 203480 201494 201538 203268
55253 203268 205577 207294 207553 206406 205113 205024 205980 206438 205423 203675 202693 203241 205023 207219 208966 209832
55237 209832 210176 210718 211550 211950 211346 210017 208632 207541 206738 206046 205195 204181 203783 205123 208331 212057
55221 212057 214698 215718 215534 214707 213726 213147 213279 213810 214103 213726 212560 210794 209141 208621 209567 211078 211827
$$ packed form
55332B12901J046J428J493J551J085l29j947k681k573k386k215j514k76R28J805
55317B08316K172J287j215l732l637m11L315M533K909M98p88p14k34k14o72r85
55301B10428p43k06K38N84P57K29j095k037j356L84J294M87j062k038k019j097
55285B02748M47J761J867R55J94m3n98j696k080p97J235K514K829K799K368J093
55269B15596n47j381j094n95p34j323j519q16L45P94k41k058k947j986M4J730
55253B03268K309J717K59j147j293q9R56M58j015j748r82N48J782K196J747Q66
55237B09832L44N42Q32M00o04j329j385j091q03o92q51j014l98J340L208L726
55221B12057K641J020j84q27r81n79J32N31K93l77j166j766j653n20R46J511P49
$$ plain form
55204 211827 211183 209218 206133 202420 199348 198317 199353 200811 200964 199648 198146 197769 198871 200977 203366
55189 203366 205476 207151 208754 210797 213188 215026 215549 215194 215251 216395 218041 219276 219808 219699 218856 217341
55173 217341 215683 214198 212494 210389 208944 209598 212372 215817 218563 220042 219941 218295 216334 216040 218247
55158 218247 221954 225751 228931 230920 230918 228969 226502 224964 224513 224658 225294 226321 227035 226912 226371 225846 224763
55141 224763 222471 219617 217416 215966 214587 213584 214289 217231 221425 225741 229847 233315 234777 232879
55127 232879 227943 222217 218352 217458 218383 219077 218886 219155 221249 224565 227256 228446 228805 229117 229376 229375 229219
55110 229219 228994 228672 228488 228796 229395 229742 229884 230370 231055 230923 229483 227582 226298 225660 225033 224346 224336 225659
55092 225659 227992 229992 230302 229041 228139 229462 232514 234715 234139 231258 227807 224871 222664 221318 221034
$$ packed form
55204B11827o44j965l085l713l072j031J036J458J53j316j502l77J102K106K389
55189B03366K110J675J603K043K391J838N23l55N7J144J646J235N32j09q43j515
55173B17341j658j485j704k105j445O54K774L445K746J479j01j646j961k94K207
55158B18247L707L797L180J989kj949k467j538m51J45O36J027P14j23n41n25j083
55141B24763k292k854k201j450j379j003P05K942M194M316M106L468J462j898
55127B32879m936n726l865q94R25O94j91K69K094L316K691J190L59L12K59jj56
55110B29219k25l22j84L08N99L47J42M86O85j32j440j901j284o38o27o87j0J323
55092B25659K333K000L10j261r02J323L052K201n76k881l451k936k207j346k84
$$ plain form
55077 221034 221698 223052 225040 227619 230456 233129 235362 236862 237316 236830 235950 234937 233502 231551 229694
55062 229694 228596 228325 228782 230215 232605 234921 235721 234469 231819 228765 225901 223392 221270 219739 219220
55047 219220 219863 221041 221961 222851 224789 227938 230859 232252 232620 233317 234641 235997 237454 239711 242480
55032 242480 244239 244099 242970 242371 242663 243063 242928 242569 242920 244763 248129 252253 256062 258758 260119 260547
55016 260547 260919 262005 263716 265287 266453 267859 269882 271683 272245 271889 271785 272190 272229 271346 269974 268594
55000 268594 267111 265512 264346 264152 264952 266463 268199 269252 268874 267614 267094 268163 269928 271012 271043 270423
54984 270423 269468 268594 268760 270684 273750 276487 278156 279348 281043 283507 286202 288485 290352 292509 295537
54969 295537 298931 301368 302110 301707 301075 300409 299429 298263 297510 297591 298451 299704 300892 301925 303442 306140
$$ packed form
55077B21034O64J354J988K579K837K673K233J500M54m86q80j013j435j951j857
55062B29694j098k71M57J433K390K316Q00j252k650l054k864k509k122j531n19
55047B19220O43J178R20Q90J938L149K921J393L68O97J324J356J457K257K769
55032B42480J759j40j129n99K92M00j35l59L51J843L366M124L809K696J361M28
55016B60547L72J086J711J571J166J406K023J801N62l56j04M05L9q83j372j380
55000B68594j483j599j166j94Q00J511J736J053l78j260n20J069J765J084L1o20
54984B70423r55q74J66J924L066K737J669J192J695K464K695K283J867K157L028
54969B95537L394K437P42m03o32o66r80j166p53Q1Q60J253J188J033J517K698
$$ plain form
54953 306140 309427 311495 311384 310242 309678 309579 308819 307700 308096 310915 314837 318139 320589 322696 324029 323611
54937 323611 321746 320331 320990 323354 325459 325601 323673 320932 318765 317706 317386 317110 316413 315314 314197
54922 314197 313254 311938 309389 305684 302165 299870 298062 295280 291739 289526 289983 291801 292450 290906 288235
54907 288235 285851 284050 282297 280355 278884 279017 281260 284683 287474 288616 288881 289877 292404 296020 299894
54892 299894 303485 306485 308686 310038 310503 309836 307931 305392 303403 302864 303859 305793 307615 307965 305969
54877 305969 302275 298828 297095 296796 296779 296688 297156 298584 300511 302258 303533 304222 304208 303872 304292 306323 309590
54860 309590 312780 314904 315948 316463 316975 317813 319037 320411 321764 323521 326450 330590 334723 337364 338192
54845 338192 338204 338528 339460 340671 341901 343100 344042 344271 343672 342889 342843 343712 344620 344493 343073 340934 338754
$$ packed form
54953C06140L287K068j11j142n64r9p60j119L96K819L922L302K450K107J333m18
54937C23611j865j415O59K364K105J42j928k741k167j059l20k76o97j099j117
54922C14197r43j316k549l705l519k295j808k782l541k213M57J818O49j544k671
54907B88235k384j801j753j942j471J33K243L423K791J142K65R96K527L616L874
54892B99894L591L000K201J352M65o67j905k539j989n39R95J934J822L50j996
54877C05969l694l447j733k99j7r1M68J428J927J747J275O89j4l36M20K031L267
54860C09590L190K124J044N15N12Q38J224J374J353J757K929M140M133K641Q28
54845C38192J2L24R32J211J230J199R42K29n99p83m6Q69R08j27j420k139k180
$$ plain form
54828 338754 336892 335548 334870 334914 335849 338121 341857 346129 349579 351991 354417 357271 359175 358561 355827
54813 355827 352804 350469 348442 346702 346410 348424 351914 355054 356520 355996 353963 351653 350567 351241 352726
54798 352726 353739 353892 353378 352224 350688 349809 350424 351868 352769 353053 353923 355671 356902 356622 355966 356756 359057
54781 359057 361353 362821 364176 366218 368668 370878 372853 374948 377078 378816 379974 380566 380511 379922 379428
54766 379428 379585 379975 379490 377605 374939 372436 370486 368879 367130 364646 361156 357307 354333 352689 351453
54751 351453 349420 346349 342688 338710 334691 331405 329392 327933 325883 323554 322602 323740 325601 326487 326379
54736 326379 326565 328000 330749 334358 337756 339239 337684 333851 329750 326638 324238 321914 319758 318185
54722 318185 316994 315350 312569 308688 304376 300413 297198 294594 292184 289600 286775 284167 282720 283140
$$ packed form
54828C38754j862j344o78M4R35K272L736M272L450K412K426K854J904o14k734
54813C55827l023k335k027j740k92K014L490L140J466n24k033k310j086O74J485
54798C52726J013J53n14j154j536q79O15J444R01K84Q70J748J231k80o56P90K301
54781C59057K296J468J355K042K450K210J975K095K130J738J158N92n5n89m94
54766C79428J57L90m85j885k666k503j950j607j749k484l490l849k974j644j236
54751C51453k033l071l661l978m019l286k013j459k050k329r52J138J861Q86j08
54736C26379J86J435K749L609L398J483j555l833m101l112k400k324k156j573
54722C18185j191j644k781l881m312l963l215k604k410k584k825k608j447M20
$$ plain form
54708 283140 284969 286662 286839 285238 282448 279339 277031 276635 278219 280302 281075 279958 277553 274588 271592
54693 271592 269188 267705 266634 265431 264726 265790 268730 272229 275159 277447 279057 279322 277938 275821 274169
54678 274169 273165 272242 271109 269882 268521 266788 264715 262739 261399 260876 260527 258966 255344 250631 246884
54663 246884 245034 244289 243964 244696 247031 249923 251877 252906 254110 255769 257166 258034 258809 259468 259473 259062 259340
54646 259340 260547 261378 260750 259401 258873 259430 259869 259259 258084 257531 257995 258605 258197 256678 255226 255066 256289
54629 256289 258112 259968 261827 263681 265279 266364 266638 265629 263256 260471 258519 257432 256069 253946
54615 253946 252176 252117 253648 255325 255767 254531 252183 250122 249822 251522 253763 254748 254077 252903 252661 253853
54599 253853 255710 256710 255889 254015 252965 253531 254480 254367 253541 253357 254036 254635 254934 255862 257735 259398 259822
$$ packed form
54708B83140J829J693J77j601k790l109k308l96J584K083P73j117k405k965k996
54693B71592k404j483j071j203p05J064K940L499K930K288J610K65j384k117j652
54678B74169j004r23j133j227j361j733k073j976j340n23l49j561l622m713l747
54663B46884j850p45l25P32K335K892J954J029J204J659J397Q68P75O59Nm11K78
54646B59340J207Q31o28j349n28N57M39o10j175n53M64O10m08j519j452j60J223
54629B56289J823J856J859J854J598J085K74j009k373k785j952j087j363k123
54615B53946j770n9J531J677M42j236k348k061l00J700K241R85o71j174k42J192
54599B53853J857J000q21j874j050N66R49j13q26j84O79N99K99R28J873J663M24
$$ plain form
54582 259822 259559 259815 260760 261638 262090 262430 262819 263041 263079 263162 262960 261467 258242 254558 252754 254218 258094
54565 258094 262014 264010 263677 261817 259516 257789 257622 259594 263239 267099 269736 270626 270149 268968 267569
54550 267569 266284 265577 266155 268405 271531 273669 273561 272059 271162 271472 271467 269715 267011 265500 266135 267903
54534 267903 269324 269801 269489 268791 268332 268690 269695 270424 270317 269799 269383 268650 266856 264372 262727 263047 264973
54517 264973 267319 269297 270751 271624 271777 271240 270254 269048 267915 267432 268114 269711 271261 272114 272536 273071
54501 273071 273722 274220 274750 275640 276400 275858 273607 270769 268915 268617 269485 271197 273792 276950 279588 280533
54485 280533 279464 277065 274379 272145 270724 270413 271510 273866 276670 279062 280864 282286 283075 282820 282212
54470 282212 282926 285458 287935 288182 286510 285176 285206 285252 283955 282066 281320 282101 283336 284108 284323 283983 283013
$$ packed form
54582B59822k63K56R45Q78M52L40L89K22L8Q3k02j493l225l684j804J464L876
54565B58094L920J996l33j860k301j727j67J972L645L860K637Q90m77j181j399
54550B67569j285p07N78K250L126K138j08j502q97L10nj752k704j511O35J768
54534B67903J421M77l12o98m59L58J005P29j07n18m16p33j794k484j645L20J926
54517B64973K346J978J454Q73J53n37r86j206j133m83O82J597J550Q53M22N35
54501B73071O51M98N30Q90P60n42k251k838j854k98Q68J712K595L158K638R45
54485B80533j069k399k686k234j421l11J097K356K804K392J802J422P89k55o08
54470B82212P14K532K477K47j672j334L0M6j297j889p46P81J235P72K15l40r70
$$ plain form
54453 283013 281970 281989 283496 285493 286657 286846 287009 287777 288668 288902 288472 287936 287385 286413 285355 285712 288448
54436 288448 292328 295074 296225 297643 300758 304489 306787 307306 307212 306785 304847 300883 296509 293975 293739
54421 293739 294192 293589 291823 290326 290476 292188 294075 295011 295213 295575 296311 296850 296928 297075 297907 299490 301433
54404 301433 303053 303441 302133 299958 298365 297608 296473 294389 292864 293730 296562 299085 299992 300100 300529 300918
54388 300918 300103 297870 295279 293532 292962 292958 292572 291379 290007 289577 290359 291339 291436 290871 290817 291830 293196 293815
54370 293815 293246 291771 290005 288834 289305 291918 295895 299493 301217 300746 298818 296560 294824 293816 293161
54355 293161 292536 292249 292912 294518 296338 298011 300199 303544 307242 309436 309106 307002 304634 302935 302090
54340 302090 301962 302164 302139 301756 301595 302197 303255 304019 304260 304281 304118 303399 302127 300999 300692 301146 301780 302097
$$ packed form
54453B83013j043J9J507J997J164J89J63P68Q91K34m30n36n51r72j058L57K736
54436B88448L880K746J151J418L115L731K298N19r4m27j938l964m374k534k36
54421B93739M53o03j766j497J50J712J887R36K02L62P36N39P8J47Q32J583J943
54404C01433J620L88j308k175j593p57j135k084j525Q66K832K523R07J08M29L89
54388C00918q15k233k591j747n70ml86j193j372m30P82R80R7n65n4J013J366O19
54370B93815n69j475j766j171M71K613L977L598J724m71j928k258j736j008o55
54355B93161o25k87O63J606J820J673K188L345L698K194l30k104k368j699q45
54340C02090j28K02k5l83j61O02J058P64K41K1j63p19j272j128l07M54O34L17
$$ plain form
54322 302097 301889 301112 299862 298400 297055 296129 295802 295913 295850 295022 293573 292367 292092 292606 293265 293604 293450
54305 293450 292777 291863 291483 292451 294831 297809 300353 301870 302270 301699 300380 298593 296665 295001 294050 294126
54289 294126 295260 297233 299658 301921 303251 303240 302265 301092 300043 298923 297825 297435 298142 299254 299682 299188
54273 299188 298360 297547 296617 295873 296199 297693 298926 298479 296876 296057 297007 298825 300188 300795 300977 300748 299868
54256 299868 298345 296262 293568 290673 288876 289382 292004 295442 298650 301220 302641 302291 300464 298560 297564
54241 297564 296956 295718 293995 292985 293288 294149 294487 294133 293648 293309 292769 291780 290850 290968 292676 295537 298376
54224 298376 299958 299643 297843 295892 295058 295396 295846 295677 295410 295990 297489 299254 300975 302761 304256 304655
54208 304655 303885 302966 302740 302857 302502 301583 300714 300405 300704 301225 301187 300046 298649 299139 302769 308028 311804
$$ packed form
54322C02097k08p77j250j462j345r26l27J11o3q28j449j206k75N14O59L39j54
54305B93450o73r14l80R68K380K978K544J517M00n71j319j787j928j664r51P6
54289B94126J134J973K425K263J330j1r75j173j049j120j098l90P07J112M28m94
54273B99188q28q13r30p44L26J494J233m47j603q19R50J818J363O07J82k29q80
54256B99868j523k083k694k895j797N06K622L438L208K570J421l50j827j904r96
54241B97564o08j238j723j010L03Q61L38l54m85l39n40r89r30J18J708K861K839
54224B98376J582l15j800j951q34L38M50j69k67N80J499J765J721J786J495L99
54208C04655p70r19k26J17l55r19q69l09K99N21l8j141j397M90L630N259L776
$$ plain form
54191 311804 312368 310609 308539 307398 307220 307400 307379 307248 307782 309423 311347 312297 312291 312651 314099 315742 316387
54174 316387 316123 316052 317084 319534 323303 327681 331341 333283 333722 333708 334132 335481 338035 341534 344828 346577
54158 346577 346341 344683 342465 340584 340003 341165 343165 344159 342853 339422 335150 331643 330130 330779 332541
54143 332541 334236 335804 337908 340346 341706 340967 338886 337408 338053 340997 345080 348445 349812 349608 349487
54128 349487 350470 352076 353467 354657 355981 357102 357457 357307 357552 358661 360551 363160 366288 369033 370441
54113 370441 370821 371498 372941 374024 373575 372030 370986 371662 374289 378517 383617 388433 391892 393799 394846
54098 394846 395715 396329 396049 394559 392584 391645 392827 395638 398381 399871 400587 401859 404126 406393 407388 406927
54082 406927 406019 405779 406350 406868 406431 405032 403442 402260 401378 400412 399302 398266 397493 397240 397887 399347 400492
$$ packed form
54191C11804N64j759k070j141j78J80k1j31N34J641J924R50oL60J448J643O45
54174C16387k64p1J032K450L769M378L660J942M39j4M24J349K554L499L294J749
54158C46577k36j658k218j881n81J162K000R94j306l431m272l507j513O49J762
54143C32541J695J568K104K438J360p39k081j478O45K944M083L365J367k04j21
54128C49487R83J606J391J190J324J121L55j50K45J109J890K609L128K745J408
54113C70441L80O77J443J083m49j545j044O76K627M228N100M816L459J907J047
54098C94846Q69O14k80j490j975r39J182K811K743J490P16J272K267K267R95m61
54082D06927r08k40N71N18m37j399j590j182q82r66j110j036p73k53O47J460J145
$$ plain form
54065 400492 399780 396739 392568 389113 387503 387825 389687 392545 395555 397523 397467 395481 393093 392425 394558
54050 394558 398541 402250 404309 404956 405109 405170 405128 405322 406371 408428 411078 413945 416801 419049 419932 419703
54034 419703 419895 421793 425076 428611 432097 435952 439790 442294 442984 443191 444601 447552 451364 455596 459962
54019 459962 463419 464680 464011 463728 466327 472407 480504 488489 494887 499336 502365 504661 506375 507197 507224
54004 507224 507379 508690 511289 514418 517326 519845 522195 524676 527641 531395 535686 539385 541140 540600 538858
53989 538858 537495 537318 538133 539430 540778 541705 541874 541591 541662 542464 543574 544521 545283 545718 545188 543556 542092
53972 542092 542492 545057 548414 550817 551158 549212 545905 543170 542486 543473 544695 545607 546684 547925 548764 549484
53956 549484 551017 552856 552983 550867 548923 549646 552579 555618 558130 560970 564139 566483 567498 567691 567174
$$ packed form
54065D00492p12l041m171l455j610L22J862K858L010J968n6j986k388o68K133
54050C94558L983L709K059O47J53O1m2J94J049K057K650K867K856K248Q83k29
54034D19703J92J898L283L535L486L855L838K504O90K07J410K951L812M232M366
54019D59962L457J261o69k83K599O080Q097P985O398M449L029K296J714Q22K7
54004E07224J55J311K599L129K908K519K350K481K965L754M291L699J755n40j742
53989E38858j363j77Q15J297J348R27J69k83P1Q02J110R47P62M35n30j632j464
53972E42092M00K565L357K403L41j946l307k735o84R87J222R12J077J241Q39P20
53956E49484J533J839J27k116j944P23K933L039K512K840L169K344J015J93n17
$$ plain form
53941 567174 565508 563112 561396 561193 562222 563996 565963 566920 566102 565160 567123 572691 579169 583884 586858
53926 586858 589040 589881 588573 586257 584701 583490 580741 576282 571816 567851 562934 556749 551812 550493
53912 550493 551813 552841 552339 551223 549978 547674 543869 539750 536595 534316 532429 531398 531765 532624 532434
53897 532434 531146 530081 529521 527903 524085 519237 515494 513475 512144 510494 508307 505736 503335 502245
53883 502245 503098 504659 504757 502723 499784 496842 493220 488229 482727 478138 474782 472309 471139 472120 474908
53868 474908 477916 480133 482089 484498 486628 486748 484167 480359 477731 477325 477949 477665 475829 473404 471602
53853 471602 470861 471043 471898 473023 473849 473850 472511 469268 464266 459145 456038 455315 455123 453614 450846 447995
53837 447995 445744 444261 443867 444535 445255 444986 443865 442560 441061 439305 438399 439516 441614 441944 439198 434764
$$ packed form
53941E67174j666k396j716k03J029J774J967R57q18r42J963N568O478M715K974
53926E86858K182Q41j308k316j556j211k749m459m466l965m917o185m937j319
53912E50493J320J028n02j116j245k304l805m119l155k279j887j031L67Q59j90
53897E32434j288j065n60j618l818m848l743k019j331j650k187k571k401j090
53883E02245Q53J561R8k034k939k942l622m991n502m589l356k473j170R81K788
53868D74908L008K217J956K409K130J20k581l808k628m06O24k84j836k425j802
53853D71602p41J82Q55J125Q26Jj339l243n002n121l107p23j92j509k768k851
53837D47995k251j483l94O68P20k69j121j305j499j756r06J117K098L30k746m434
$$ plain form
53821 434764 430421 426346 422303 419397 419106 421099 423366 424456 424592 424640 424948 425573 426838 428951 431242 432417
53805 432417 431915 430717 430326 430890 430820 428619 424769 421403 420419 422259 426053 430191 433031 433962 433852 433957
53789 433957 434542 435249 436288 437983 439339 438716 436316 434391 434198 434327 433132 431290 430257 429457 427220 424077
53773 424077 422777 424739 428318 431111 432263 431774 429330 425194 421128 418907 418385 418141 417490 416704 415641
53758 415641 413567 410435 407292 405215 404599 405528 407864 410689 412605 413074 412835 412639 412308 411475 410506 409907
53742 409907 409390 408395 407239 406936 407969 409897 411952 413388 413464 412041 410183 409210 408945 407844 405303 402986
53726 402986 403135 406159 410441 414036 415895 415940 414898 413920 413637 413610 413229 412771 412775 412695 411346 408801 406722 406348
53708 406348 407191 408364 410195 413471 417793 421906 425406 428771 431626 432374 430262 426825 424317 423299 422718
$$ packed form
53821D34764m343m075m043k906k91J993K267J090J36M8L08O25J265K113K291J175
53805D32417n02j198l91N64p0k201l850l366r84J840L794M138K840R31j10J05
53789D33957N85P07J039J695J356o23k400j925j93J29j195j842j033q00k237l143
53773D24077j300J962L579K793J152m89k444m136m066k221n22k44o51p86j063
53758D15641k074l132l143k077o16R29K336K825J916M69k39j96l31q33r69n99
53742D09907n17r95j156l03J033J928K055J436P6j423j858r73k65j101k541k317
53726D02986J49L024M282L595J859M5j042r78k83k7l81m58Mq0j349k545k079l74
53708D06348Q43J173J831L276M322M113L500L365K855P48k112l437k508j018n81
$$ plain form
53693 422718 421970 421724 422683 424635 427096 429933 432708 434224 433771 432499 432565 434768 437723 439573 439909 439800
53677 439800 440453 442226 444551 446448 447320 447536 448091 449520 451356 452827 453845 455056 457007 459458 461445
53662 461445 462093 461471 460491 459755 458889 457603 456991 458634 462236 465352 466031 464737 462954 461069 458757 456582
53646 456582 455571 455580 455639 455922 457820 461701 465964 468980 470825 472413 473936 475133 476314 477991 479889 481307
53630 481307 482307 483629 485413 486838 487212 486831 486526 486817 487721 488938 489914 490151 489934 490563 493223 497499
53614 497499 501485 503796 505123 507300 510954 514819 517530 519398 521833 525447 529396 532458 534196 535129
53600 535129 536351 539051 543868 550498 558171 566444 575177 583827 591404 597343 602007 606154 610256 614451
53586 614451 618730 622932 626808 630309 633677 637248 641390 646481 652580 659152 665570 671877 678624 686053
$$ packed form
53693D22718p48k46R59J952K461K837K775J516m53j272O6K203K955J850L36j09
53677D39800O53J773K325J897Q72K16N55J429J836J471J018J211J951K451J987
53662D61445O48o22r80p36q66j286o12J643L602L116O79j294j783j885k312k175
53646D56582j011RN9K83J898L881M263L016J845J588J523J197J181J677J898J418
53630D81307J000J322J784J425L74l81l05K91R04J217R76K37k17O29K660M276
53614D97499L986K311J327K177L654L865K711J868K435L614L949L062J738R33
53600E35129J222K700M817O630P673Q273Q733Q650P577N939M664M147M102M195
53586F14451M279M202L876L501L368L571M142N091O099O572O418O307O747P429
$$ plain form
53572 686053 693929 702143 710751 719354 727179 734062 740709 747645 754612 761361 768389 776263 784693 792939
53558 792939 800812 808732 816934 825094 832613 838993 844259 849326 855616 863765 872851 881271 888274 894359
53544 894359 900420 906867 913387 919291 924255 928963 934671 941781 949119 954947 958473 960109 960832 961825 964306
53529 964306 968800 974523 980025 984479 987917 990441 991969 992892 994304 997098 1001118 1005516 1009714 1013732
53515 1013732 1017758 1021789 1025827 1030122 1034924 1040010 1044837 1049286 1053903 1059081 1064432 1069516 1074913 1081762
53501 1081762 1090272 1099584 1109178 1119344 1129849 1139348 1147074 1154264 1162697 1172278 1181339 1189073 1196264
53488 1196264 1203468 1209916 1215138 1220743 1229443 1242377 1258132 1274407 1289960 1304705 1318588 1331239
53476 1331239 1342800 1354328 1366806 1380049 1393205 1406138 1419585 1433940 1448702 1463370 1478120
$$ packed form
53572F86053P876Q214Q608Q603P825O883O647O936O967O749P028P874Q430Q246
53558G92939P873P920Q202Q160P519O380N266N067O290Q149R086Q420P003O085
53544H94359O061O447O520N904M964M708N708P110P338N828L526J636P23R93K481
53529I64306M494N723N502M454L438K524J528R23J412K794M020M398M198M018
53515A013732M026M031M038M295M802N086M827M449M617N178N351N084N397O849
53501A081762Q510R312R594J0166J0505R499P726P190Q433R581R061P734P191
53488A196264P204O448N222N605Q700J2934J5755J6275J5553J4745J3883J2651
53476A331239J1561J1528J2478J3243J3156J2933J3447J4355J4762J4668J4750
$$ plain form
53465 1478120 1493117 1507908 1522114 1536194 1550855 1565989 1580695 1593971 1604964 1613229 1619635 1626495
53453 1626495 1635748 1647054 1658440 1668643 1677933 1686839 1695206 1702807 1709936 1716862 1723231 1728464 1732415
53440 1732415 1735386 1737732 1739518 1740303 1739406 1736898 1734326 1733737 1735692 1738613 1740318 1739884 1737961 1735819 1734396
53425 1734396 1733933 1734123 1734542 1734883 1734743 1733575 1731275 1728690 1727019 1726690 1727235 1728112 1729055 1729700 1729683 1729424 1730125
53408 1730125 1732467 1735662 1738300 1739877 1741018 1742267 1743295 1743684 1744159 1746328 1750885 1756510 1761187 1764368
53394 1764368 1767165 1770570 1774536 1778989 1784531 1791339 1798373 1804550 1809978 1815051 1819274 1822358 1825779 1831473
53380 1831473 1839086 1846167 1851224 1855018 1858599 1861781 1864264 1866770 1869987 1873385 1876062 1877927 1879144 1879196
53366 1879196 1877628 1875158 1872962 1871082 1868469 1864428 1859208 1853193 1846359 1838753 1830920 1823453 1816160 1807868
$$ packed form
53465A478120J4997J4791J4206J4080J4661J5134J4706J3276J0993Q265O406O860
53453A626495R253J1306J1386J0203R290Q906Q367P601P129O926O369N233L951
53440A732415K971K346J786P85q97k508k572n89J955K921J705m34j923k142j423
53425A734396m63J90M19L41j40j168k300k585j671l29N45Q77R43O45j7k59P01
53408A730125K342L195K638J577J141J249J028L89M75K169M557N625M677L181
53394A764368K797L405L966M453N542O808P034O177N428N073M223L084L421N694
53380A831473P613P081N057L794L581L182K483K506L217L398K677J865J217N2
53366A879196j568k470k196j880k613m041n220o015o834p606p833p467p293q292
$$ plain form
53352 1807868 1797277 1784306 1770583 1758194 1747893 1738750 1729463 1719409 1708462 1696624 1684213 1671842
53340 1671842 1659840 1648205 1637302 1627821 1619573 1611083 1601148 1590241 1579568 1569120 1557636 1544483
53328 1544483 1530752 1518141 1507163 1496750 1485507 1473153 1460650 1448969 1438059 1427352 1416946
53317 1416946 1407601 1399539 1392024 1384354 1376649 1369368 1362605 1356256 1350192 1343847 1336268 1327272 1318206 1310828
53303 1310828 1305524 1300981 1295504 1288354 1280091 1271992 1265020 1259170 1253887 1248992 1244728 1240941 1236963 1232525
53289 1232525 1228046 1223631 1218500 1212006 1204705 1197824 1192129 1187691 1184231 1181059 1177170 1172078 1166376 1160924
53275 1160924 1155745 1150147 1143622 1136228 1128311 1120262 1112289 1104186 1095547 1086288 1076497 1065793 1053591
53262 1053591 1040127 1026316 1012443 998120 983924 971669 962107 953557 943950 933232 922487 911729
$$ packed form
53352A807868j0591j2971j3723j2389j0301r143r287j0054j0947j1838j2411j2371
53340A671842j2002j1635j0903r481q248q490r935j0907j0673j0448j1484j3153
53328A544483j3731j2611j0978j0413j1243j2354j2503j1681j0910j0707j0406
53317A416946r345q062p515p670p705p281o763o349o064o345p579q996r066p378
53303A310828n304m543n477p150q263q099o972n850n283m895m264l787l978m438
53289A232525m479m415n131o494p301o881n695m438l460l172l889n092n702n452
53275A160924n179n598o525p394p917q049p973q103q639r259r791j0704j2202
53262A053591j3464j3811j3873j4323j4196j2255r562q550r607j0718j0745j0758
$$ plain form
53250 911729 900162 887984 876198 864833 852931 840213 827469 815368 804160 794361 786225 778569
53238 778569 769684 759653 750315 742562 735211 727090 718751 711202 704178 696937 689953 684511 680801 677280
53224 677280 672048 664519 655935 648498 643629 640645 637317 631976 624876 617472 610813 604840 598835 592219
53210 592219 585125 578425 572974 568721 564789 560519 556191 552605 550078 547879 544617 539529 533621 529104
53196 529104 527174 526630 525283 522394 519037 516254 513764 510513 505767 499507 492402 485546 479738 474961
53182 474961 470959 468028 466561 465979 465034 463214 461087 459188 457347 455201 452624 449509 445927 442595 440436
53167 440436 439500 439023 438624 438615 439001 439018 437885 435307 431210 425916 420676 416988 415052 413821 412785 412585 413490
53150 413490 414477 414495 413597 412105 409743 406523 403607 402092 401520 400598 399067 397937 398047 399086 399934 399442
$$ packed form
53250I11729j1567j2178j1786j1365j1902j2718j2744j2101j1208r799q136p656
53238G78569q885j0031r338p753p351q121q339p549p024p241o984n442l710l521
53224F77280n232p529q584p437m869k984l328n341p100p404o659n973o005o616
53210E92219p094o700n451m253l932m270m328l586k527k199l262n088n908m517
53196E29104j930n44j347k889l357k783k490l251m746o260p105o856n808m777
53182D74961m002k931j467n82r45j820k127j899j841k146k577l115l582l332k159
53167D40436r36m77l99rL86J7j133k578m097n294n240l688j936j231j036k00R05
53150D13490R87J8q98j492k362l220k916j515n72r22j531j130J10J039Q48m92
$$ plain form
53134 399442 397132 393617 390120 387329 385117 383473 382896 383442 384204 384423 384406 384631 384652 383821 382515 381625 381176
53117 381176 380556 379909 380241 381950 384147 385759 386691 387468 388034 387396 384675 380481 376913 375732 376605 377624
53101 377624 377456 376365 375214 374396 373988 374032 374202 373997 373651 373927 374564 374016 371510 368365 366278 365258 364399
53084 364399 363863 364628 366623 368495 369239 369073 368714 368633 368929 369124 368225 365742 362537 360059 358955 358940 359463
53067 359463 359795 359067 357255 355633 355202 355201 354300 352774 352074 352588 353348 353787 354157 354137 352823 350694 350012 352324
53049 352324 356535 360146 361574 360691 358105 354878 352339 351375 351907 353254 354589 355083 354400 353266 352794 353045
53033 353045 353001 352147 351122 350467 349739 348382 346683 345237 344255 343965 344874 346931 349073 350307 350669 350575 349905
53016 349905 348494 346957 346168 346255 346735 347179 347185 346297 344827 344271 345896 349068 351792 352753 352137 350740 349224
$$ packed form
53134C99442k310l515l497k791k212j644n77N46P62K19j7K25K1q31j306q90m49
53117C81176o20o47L32J709K197J612R32P77N66o38k721m194l568j181Q73J019
53101C77624j68j091j151q18m08M4J70k05l46K76O37n48k506l145k087j020q59
53084C64399n36P65J995J872P44j66l59q1K96J95q99k483l205k478j104j5N23
53067C59463L32p28j812j622m31jr01j526p00N14P60M39L70k0j314k129o82K312
53049C52324M211L611J428q83k586l227k539r64N32J347J335M94o83j134m72K51
53033C53045m4q54j025o55p28j357j699j446r82k90R09K057K142J234L62r4o70
53016C49905j411j537p89Q7M80M44Oq88j470n56J625L172K724R61o16j397j516
$$ plain form
52999 349224 348154 347760 347537 346840 345994 345902 346375 345930 343845 341527 340845 341609 341849 340632 339450 340235 342714
52982 342714 344605 344260 342356 340889 341136 342823 344681 345402 344504 342770 341600 341554 341859 341690 341348 341476 341595
52965 341595 340510 338099 335755 334929 336055 338876 342769 346427 348322 348122 347019 346176 345537 344520 343136
52950 343136 341824 340955 341118 343014 346166 348377 347667 344560 341547 340353 340527 340594 339791 338517 337729 338107
52934 338107 339535 341434 343703 346854 350766 353820 354222 352022 349075 347059 346315 346615 348019 350443 353040
52919 353040 354672 354889 354192 353429 353108 353163 353240 353168 353093 353161 353301 353364 353132 352086 349801 346975 345358 345868 347172
52900 347172 347164 345698 344865 346501 350381 355061 359492 363257 366033 367605 368103 367710 366437 364517 362689 361646
52884 361646 361436 361763 362584 364016 365821 367344 367932 367296 365624 363482 361417 359546 357720 356047 354873
$$ packed form
52999C49224j070l94k23o97q46r2M73m45k085k318o82P64K40j217j182P85K479
52982C42714J891l45j904j467K47J687J858P21q98j734j170m6L05j69l42J28J19
52965C41595j085k411k344q26J126K821L893L658J895k00j103q43o39j017j384
52950C43136j312q69J63J896L152K211p10l107l013j194J74O7q03j274p88L78
52934C38107J428J899K269L151L912L054M02k200k947k016p44L00J404K424K597
52919C53040J632K17o97p63l21N5P7p2p5O8J40O3k32j046k285k826j617N10J304
52900C47172qj466q33J636L880M680M431L765K776J572M98l93j273j920j828j043
52884C61646k10L27Q21J432J805J523N88o36j672k142k065j871j826j673j174
$$ plain form
52869 354873 354325 354404 355485 357826 360372 361178 359795 358321 358916 360946 361908 360806 359010 357698 356179 353475
52853 353475 350177 347616 346158 345485 345796 347308 348918 348928 347294 345957 346533 348675 351149 353430 355495
52838 355495 356917 357238 356888 356722 356730 355984 353929 351010 347999 345320 343241 342139 342289 343609 345673 347636
52822 347636 348262 346785 344044 342262 343210 346657 350747 353588 354398 353594 352147 350628 348756 346113 343318
52807 343318 341807 342203 343535 344542 345054 345430 345326 344122 342238 340784 339780 337936 334665 331450 330461
52792 330461 332335 335909 339676 342751 344618 344841 343405 341071 339074 338380 339125 340668 342261 343717 345377
52777 345377 347411 349464 351082 352134 352549 352000 350409 348775 348819 351341 355005 357182 356272 353235 350605
52762 350605 349940 350318 349577 346879 343687 342094 342660 344236 345574 346504 347531 348847 350103 350869 351017 350763
$$ packed form
52869C54873n48P9J081K341K546Q06j383j474N95K030R62j102j796j312j519k704
52853C53475l298k561j458o73L11J512J610J0j634j337N76K142K474K281K065
52838C55495J422L21l50j66Qp46k055k919l011k679k079j102J50J320K064J963
52822C47636O26j477k741j782R48L447M090K841Q10q04j447j519j872k643k795
52807C43318j511L96J332J007N12L76j04j204j884j454j004j844l271l215r89
52792C30461J874L574L767L075J867K23j436k334j997o94P45J543J593J456J660
52777C45377K034K053J618J052M15n49j591j634M4K522L664K177r10l037k630
52762C50605o65L78p41k698l192j593N66J576J338R30J027J316J256P66J48k54
$$ plain form
52746 350763 350528 350694 351313 352067 352546 352513 351936 351092 350774 351897 354348 356398 355977 352814 348879 346527 346578
52729 346578 348333 350733 352855 353818 353290 352156 351863 352794 353938 354429 354639 355263 356028 356288 356410 357480 359516
52712 359516 361048 360919 359728 358844 358573 358178 357443 357260 358381 360172 361125 360399 358567 356940 356345 356494 356351
52695 356351 355143 353085 351167 350244 350422 351279 352375 353466 354552 356010 358347 361400 363953 364761 363961
52680 363961 362900 362494 362377 361979 361686 362235 363374 364048 363870 363627 364082 364922 365307 365087 365012 365751 366994 367626
52662 367626 366865 365297 364601 365961 368771 371188 371970 371481 371014 371572 373313 375661 377687 378724 378898 378880
52646 378880 379127 379663 380630 382442 385133 387964 389976 390623 389674 387149 383756 380826 379118 377916 375911
52631 375911 372799 369515 367134 366089 366327 367480 368855 369743 369907 369510 368681 367605 366854 366972 367671 368038
$$ packed form
52746C50763k35J66O19P54M79l3n77q44l18J123K451K050m21l163l935k352N1
52729C46578J755K400K122R63n28j134k93R31J144M91K10O24P65K60J22J070K036
52712C59516J532j29j191q84k71l95p35j83J121J791R53p26j832j627n95J49j43
52695C56351j208k058j918r23J78Q57J096J091J086J458K337L053K553Q08q00
52680C63961j061m06j17l98k93N49J139O74j78k43M55Q40L85k20p5P39J243O32
52662C67626p61j568o96J360K810K417P82m89m67N58J741K348K026J037J74j8
52646C78880K47N36R67J812K691K831K012O47r49k525l393k930j708j202k005
52631C75911l112l284k381j045K38J153J375Q88J64l97q29j076p51J18O99L67
$$ plain form
52615 368038 367676 367219 367592 369176 371738 374617 376791 377360 376373 374854 373712 372947 372188 371585 371689 372639 373942
52598 373942 375007 375642 376034 376534 377432 378639 379597 379779 379479 379891 381952 384963 386770 385850 383153 381246
52582 381246 381433 382469 382619 382170 382769 384683 386237 386289 385909 386711 388523 389872 390208 390386 390991 391488 391451 391601
52564 391601 392820 394610 395399 394398 392563 391530 392030 393682 395917 398481 400964 402614 403248 403998 406326
52549 406326 410143 413571 414882 414189 412853 411762 410845 409925 409170 408568 407576 405662 402888 399804 397168 395924
52533 395924 396903 399906 403205 404631 403458 401017 399245 398846 399075 399082 398996 399577 401167 403238 404839 405235 404315
52516 404315 402747 401748 402298 404190 405935 405850 403504 400235 398265 399029 401994 405045 406322 405864 405427 406625
52500 406625 409358 412093 413501 413598 413387 413651 414293 414748 414775 414621 414602 414880 415641 417027 418631 419604 419679 419743 420753
$$ packed form
52615C68038l62m57L73J584K562K879K174N69r87j519j142p65p59o03J04R50J303
52598C73942J065O35L92N00Q98J207R58J82l00M12K061L011J807r20k697j907
52582C81246J87J036J50m49N99J914J554N2l80Q02J812J349L36J78O05M97l7J50
52564C91601J219J790P89j001j835j033N00J652K235K564K483J650O34P50K328
52549D06326L817L428J311o93j336j091r17r20p55o02r92j914k774l084k636j244
52533C95924R79L003L299J426j173k441j772l99K29Pq6N81J590K071J601L96r20
52516D04315j568r99N50J892J745q5k346l269j970P64K965L051J277m58m37J198
52500D06625K733K735J408R7k11K64O42M55K7j54j9K78P61J386J604R73P5O4J010
$$ plain form
52481 420753 422342 423229 422967 422461 422554 422961 422964 422493 421971 421604 421427 421669 422519 423858 425710 428511 432199 435330
52463 435330 436022 433934 430700 428276 427332 427271 427229 426765 425931 424991 424086 423298 423119 424366 427045 429686 430775
52446 430775 430793 431769 434464 437009 437039 434433 431154 428978 428284 428780 430252 432443 434881 437144 438909 439715
52430 439715 439189 437684 436261 435873 436791 438743 441085 442824 443127 442221 441430 442055 444490 448506 453734 459406
52414 459406 464246 467392 469268 470925 472769 474691 477314 481926 488646 495394 499487 500005 498051 495103
52400 495103 491955 489213 487753 487983 489008 489288 488223 486725 486143 486886 488347 489930 491721 494111 497027
52385 497027 499820 501935 503590 505729 509259 514169 519381 523547 525999 526831 526301 524635 522588 521650 523069
52370 523069 526795 531641 536225 539419 540365 539101 537272 537320 540454 545799 551702 557265 562329 566779 570465
$$ packed form
52481D20753J589Q87k62n06R3M07Lm71n22l67j77K42Q50J339J852K801L688L131
52463D35330O92k088l234k424r44o1m2m64q34r40r05p88j79J247K679K641J089
52446D30775J8R76K695K545L0k606l279k176o94M96J472K191K438K263J765Q06
52430D39715n26j505j423l88R18J952K342J739L03r06p91O25K435M016N228N672
52414D59406M840L146J876J657J844J922K623M612O720O748M093N18j954k948
52400D95103l148k742j460K30J025K80j065j498n82P43J461J583J791K390K916
52385D97027K793K115J655K139L530M910N212M166K452Q32n30j666k047r38J419
52370E23069L726M846M584L194R46j264j829M8L134N345N903N563N064M450L686
$$ plain form
52355 570465 573338 575138 575469 574835 575016 577469 581595 585464 588096 590221 592890 596326 600228 604265 607966
52340 607966 610929 613581 617092 622130 628147 634115 639413 643683 646516 647882 648488 649201 650355 651935 654090
52325 654090 656998 660532 664416 668524 672817 677318 682351 688364 695101 701464 706670 711115 715513 719605
52311 719605 722622 724978 728576 734880 742978 750088 754186 756117 758855 764524 772372 779930 785796 790584
52297 790584 795430 800823 807156 815030 823952 831679 836216 838167 840053 843563 848437 853689 858650 862792
52283 862792 865907 868871 873298 879837 887453 894681 900876 905970 909806 912322 913917 915214 916843 919547
52269 919547 923710 928439 931949 933574 934811 937698 942542 947954 952735 956975 961462 966710 972546 978115
52255 978115 982347 984954 986936 989638 993330 997193 1000634 1004040 1008113 1013039 1018577 1024515 1030621 1036348
$$ packed form
52355E70465K873J800L31o34J81K453M126L869K632K125K669L436L902M037L701
52340F07966K963K652L511N038O017N968N298M270K833J366O06P13J154J580K155
52325F54090K908L534L884M108M293M501N033O013O737O363N206M445M398M092
52311G19605L017K356L598O304Q098P110M098J931K738N669P848P558N866M788
52297G90584M846N393O333P874Q922P727M537J951J886L510M874N252M961M142
52283H62792L115K964M427O539P616P228O195N094L836K516J595J297J629K704
52269I19547M163M729L510J625J237K887M844N412M781M240M487N248N836N569
52255I78115M232K607J982K702L692L863L441L406M073M926N538N938O106N727
$$ plain form
52241 1036348 1041067 1044653 1047683 1050964 1054973 1059793 1065391 1071628 1077870 1082917 1085814 1086803 1087140 1087906 1089327
52226 1089327 1091297 1093951 1097338 1101005 1104570 1108514 1113790 1120568 1127837 1134373 1139788 1144554 1149326 1154277
52212 1154277 1158877 1162344 1164645 1166911 1170453 1175340 1180409 1184736 1188561 1192605 1197094 1201717 1206044 1209574
52198 1209574 1211927 1213511 1215473 1218329 1221077 1222503 1222965 1223807 1225189 1225862 1225398 1225307 1227083 1230132 1232672
52183 1232672 1233943 1234399 1234293 1233489 1232509 1232346 1232920 1232944 1231913 1231320 1233160 1237755 1243564 1248636 1251786 1252893
52167 1252893 1252758 1252554 1253015 1254272 1256379 1259370 1262609 1264866 1265672 1266017 1267188 1269385 1271941 1274182 1275421
52152 1275421 1274842 1272414 1269485 1267539 1266722 1266453 1266965 1268969 1272060 1274763 1276200 1276562 1275969 1274272 1272305
52137 1272305 1272049 1274743 1279565 1284635 1288647 1291351 1293294 1295418 1298052 1300119 1300344 1299504 1300077 1303003 1306207
$$ packed form
52241A036348M719L586L030L281M009M820N598O237O242N047K897R89L37P66J421
52226A089327J970K654L387L667L565L944N276O778P269O536N415M766M772M951
52212A154277M600L467K301K266L542M887N069M327L825M044M489M623M327L530
52198A209574K353J584J962K856K748J426M62Q42J382O73m64r1J776L049K540
52183A232672J271M56j06q04r80j63N74K4j031n93J840M595N809N072L150J107
52167A252893j35k04M61J257K107K991L239K257Q06L45J171K197K556K241J239
52152A275421n79k428k929j946q17k69N12K004L091K703J437L62n93j697j967
52137A272305k56K694M822N070M012K704J943K124K634K067K25q40N73K926L204
$$ plain form
52122 1306207 1307386 1307114 1307765 1310132 1312582 1313253 1311710 1308521 1304398 1300080 1296310 1293602 1292157 1291725 1291281
52107 1291281 1289487 1286189 1282924 1281260 1281101 1281425 1282115 1283903 1286821 1289786 1291718 1292225 1291284 1289223 1286898
52092 1286898 1285089 1283775 1282785 1282769 1284359 1286548 1287218 1285500 1282506 1279585 1277053 1274928 1273630 1273222 1272826
52077 1272826 1271323 1268028 1262505 1254835 1246514 1239934 1236116 1233737 1230996 1227621 1224258 1220792 1216399 1210781
52063 1210781 1204434 1198028 1192324 1188279 1186324 1185793 1185764 1186144 1187085 1187713 1186557 1183334 1179322 1175703 1172235
52048 1172235 1167927 1162516 1156828 1151855 1147733 1143676 1138880 1133474 1128387 1124288 1120956 1117784 1114462 1110993
52034 1110993 1107509 1104381 1102001 1100117 1098008 1095804 1094965 1096561 1099465 1101117 1099990 1096661 1092658 1089033
52020 1089033 1086001 1083169 1080127 1077240 1075689 1076024 1076974 1076592 1074499 1072094 1070550 1069681 1068917 1068323 1068185 1068478
$$ packed form
52122A306207J179k72O51K367K450O71j543l189m123m318l770k708j445m32m44
52107A291281j794l298l265j664j59L24O90J788K918K965J932N07r41k061k325
52092A286898j809j314r90j6J590K189O70j718k994k921k532k125j298m08l96
52077A272826j503l295n523p670q321o580l818k379k741l375l363l466m393n618
52063A210781o347o406n704m045j955n31k9L80R41O28j156l223m012l619l468
52048A172235m308n411n688m973m122m057m796n406n087m099l332l172l322l469
52034A110993l484l128k380j884k109k204q39J596K904J652j127l329m003l625
52020A089033l032k832l042k887j551L35R50l82k093k405j544q69p64n94j38K93
$$ plain form
52004 1068478 1069210 1070476 1071651 1071410 1069280 1066492 1064530 1063372 1062065 1060559 1059844 1060206 1060324 1058473 1054192
51989 1054192 1048412 1042173 1035493 1027596 1018342 1009194 1002278 998246 995512 991961 986995 981494 976233 971129
51975 971129 965960 960958 956412 952175 947934 943714 939873 936732 934319 932362 930450 928298 925937 923555
51961 923555 921237 918959 916799 914956 913534 912383 911160 909578 907742 906203 905363 904715 903070 899869 895952
51946 895952 892609 890127 887822 885340 883268 882289 882223 882135 881093 878659 875028 870905 867090 863977 861545
51931 861545 859720 858371 857031 855150 852841 850866 849555 848193 846061 843778 842967 844558 847894 851574
51917 851574 854682 856985 858471 859303 860086 861476 863138 863443 860759 855086 847997 840754 832917 823144 811109
51902 811109 798103 785908 775536 766978 759491 751974 743744 735396 728527 724202 721966 720672 719881 719939
$$ packed form
52004A068478P32J266J175k41k130k788j962j158j307j506p15L62J18j851m281
51989A054192n780o239o680p897r254r148o916m032k734l551m966n501n261n104
51975I71129n169n002m546m237m241m220l841l141k413j957j912k152k361k382
51961I23555k318k278k160j843j422j151j223j582j836j539q40o48j645l201l917
51946H95952l343k482k305k482k072r79o6q8j042k434l631m123l815l113k432
51931H61545j825j349j340j881k309j975j311j362k132k283q11J591L336L680
51917H51574L108K303J486Q32P83J390J662L05k684n673p089p243p837r773j2035
51902H11109j3006j2195j0372q558p487p517q230q348o869m325k236j294p91N8
$$ plain form
51888 719939 720994 722612 724273 725636 726212 725299 722498 718133 713156 708789 706074 705267 705537 705572 704574 702485
51872 702485 699444 695532 691082 686714 682839 679498 676819 675203 674728 674630 673629 670784 666210 661350 658301
51857 658301 658112 659531 660057 658475 655707 652943 649986 646204 642294 639873 639566 640498 641514 641965 641404 639713
51841 639713 637721 636723 636971 637443 637460 637636 638732 640344 641342 641021 639202 635933 631947 628907 628163 629397
51825 629397 631211 632722 633692 633418 630942 626754 623204 622416 624245 626738 628076 627589 625499 622577 619978
51810 619978 618661 618694 619293 619544 618896 617206 614733 612212 610628 610757 612788 616146 619594 621871 622707 623130
51794 623130 624447 627009 630233 633434 636044 637164 635867 632339 628130 624785 622549 620741 618950 617403
51780 617403 616520 616621 617791 619505 620650 620558 619859 619614 619739 619125 617343 615291 613896 613150 612940 613900 616472
$$ packed form
51888G19939J055J618J661J363N76r13k801m365m977m367k715q07K70L5r98k089
51872G02485l041l912m450m368l875l341k679j616m75r8j001k845m574m860l049
51857F58301j89J419N26j582k768k764k957l782l910k421l07R32J016M51n61j691
51841F39713j992r98K48M72J7J76J096J612R98l21j819l269l986l040p44J234
51825F29397J814J511R70k74k476m188l550p88J829K493J338m87k090k922k599
51810F19978j317L3N99K51o48j690k473k521j584J29K031L358L448K277Q36M23
51794F23130J317K562L224L201K610J120j297l528m209l345k236j808j791j547
51780F17403q83J01J170J714J145r2o99k45J25o14j782k052j395p46k10R60K572
$$ plain form
51763 616472 619682 621764 621818 620082 616975 612873 608752 605888 604508 603511 601934 600126 599090 599203 600025
51748 600025 600920 601490 601762 602341 603980 606501 608489 608626 607191 605760 605506 606305 607474 608802 610495 612365
51732 612365 613553 613372 612337 611961 613160 615061 615863 614839 612950 611446 610693 610650 611608 613612 615680 616514
51716 616514 615922 614777 613644 612214 610153 607850 606101 605525 606424 608631 611250 613029 613453 613256 613661 615280
51700 615280 617819 620517 622503 622953 621463 618602 615927 614912 615432 615585 613704 610544 608659 609319 611014
51685 611014 611682 611463 612054 613975 616090 617689 619418 621768 624024 625435 626350 627412 628621 629943 631910
51670 631910 634644 637043 638100 638516 639848 642353 644854 646668 648494 651083 653937 655900 656713 657560 660080
51655 660080 664793 670419 674953 677566 679164 681035 683574 686653 690406 694822 699200 703018 706980 712186
$$ packed form
51763F16472L210K082N4j736l107m102m121k864j380r97j577j808j036J13Q22
51748F00025Q95N70K72N79J639K521J988J37j435j431k54P99J169J328J693J870
51732F12365J188j81j035l76J199J901Q02j024j889j504p53m3R58K004K068Q34
51716F16514n92j145j133j430k061k303j749n76Q99K207K619J779M24j97M05J619
51700F15280K539K698J986M50j490k861k675j015N20J53j881l160j885O60J695
51685F11014O68k19N91J921K115J599J729K350K256J411R15J062J209J322J967
51670F31910K734K399J057M16J332K505K501J814J826K589K854J963Q13Q47K520
51655F60080M713N626M534K613J598J871K539L079L753M416M378L818L962N206
$$ plain form
51641 712186 718432 724294 728695 731418 732379 731750 730773 730914 731800 731392 728887 726141 725258 725887 726107 725194 724070
51624 724070 723403 722681 721343 719783 718827 718841 719626 720762 721827 722504 722600 721855 719961 717122 714453 713381 714505
51607 714505 717144 719901 721615 722055 722043 722623 723875 724874 725171 725820 728229 732270 736296 739054 740780 742242
51591 742242 743531 744329 744790 745365 745852 745367 743612 741801 741679 743475 745343 745293 743469 741851 741773 742565 742907
51574 742907 742576 742043 741111 739202 736860 735748 736817 739318 741985 744411 746825 749252 751529 753701 755717
51559 755717 757028 757199 756759 756720 757156 756893 754944 751820 748922 746760 744286 740207 734615 728879 723948 719302
51543 719302 713884 707686 701893 697610 694997 693619 693014 692600 691643 689819 687624 685756 684223 682452 680258
51528 680258 678267 677124 676508 675214 672406 668784 666313 666495 668826 671151 671647 670324 668615 667797 668001
$$ packed form
51641G12186O246N862M401K723R61o29r77J41Q86m08k505k746q83O29K20r13j124
51624G24070o67p22j338j560r56J4P85J136J065O77R6p45j894k839k669j072J124
51607G14505K639K757J714M40j2N80J252R99K97O49K409M041M026K758J726J462
51591G42242J289P98M61N75M87m85j755j811j22J796J868n0j824j618p8P92L42
51574G42907l31n33r32j909k342j112J069K501K667K426K414K427K277K172K016
51559G55717J311J71m40l9M36k63j949l124k898k162k474m079n592n736m931m646
51543G19302n418o198n793m283k613j378o05m14r57j824k195j868j533j771k194
51528F80258j991j143o16j294k808l622k471J82K331K325M96j323j709q18K04
$$ plain form
51513 668001 668493 668548 668014 667220 666439 665550 664406 663407 663256 663948 664403 663550 661530 659392 657730 656199 654386
51496 654386 652572 651335 650773 650451 649841 648481 646039 642739 639668 638051 637951 638116 637478 636476 636383 637560
51480 637560 639100 640388 642182 645529 650106 654565 658430 662732 668479 675331 682338 689314 696572 703647
51466 703647 709336 713233 716419 720208 724752 729393 733952 739001 744970 751657 758709 765980 773061 778950
51452 778950 782778 784793 786083 787201 787425 785568 781268 775314 769023 763642 760045 758319 757441 755780 752388
51437 752388 747809 743522 740570 738756 737018 734444 730993 727400 724510 722759 722094 722097 722046 721267 719836 718748
51421 718748 718908 719998 720857 720951 720796 720775 720402 719378 718671 719559 721708 723083 722048 719077 716233 715342 716716
51404 716716 719165 721069 721799 722322 724119 727509 731412 734784 737510 739612 740405 739327 737279 736115 736821
$$ packed form
51513F68001M92N5n34p94p81q89j144r99j51O92M55q53k020k138j662j531j813
51496F54386j814j237n62l22o10j360k442l300l071j617j00J65o38j002r3J177
51480F37560J540J288J794L347M577M459L865M302N747O852P007O976P258P075
51466G03647N689L897L186L789M544M641M559N049N969O687P052P271P081N889
51452G78950L828K015J290J118K24j857m300n954o291n381l597j726q78j661l392
51437G52388m579m287k952j814j738k574l451l593k890j751o65Ln1p79j431j088
51421G18748J60J090Q59R4j55k1l73j024p07Q88K149J375j035k971k844q91J374
51404G16716K449J904P30N23J797L390L903L372K726K102P93j078k048j164P06
$$ plain form
51389 736821 738937 741873 745783 750634 755263 758406 760385 762824 766639 771126 775254 778989 782752 786168
51375 786168 788119 787845 785429 781404 776555 771910 768054 764263 759140 752435 745545 739753 734648 728830
51361 728830 721547 712882 702996 692352 682473 675143 670514 667011 663534 660803 659860 660195 660392 660170 660516
51346 660516 661735 662495 661300 658263 654864 652313 650746 649810 649408 649608 650168 650541 650359 649702 648766 647371
51330 647371 645079 641881 638557 636084 634721 633842 632690 631073 629260 627458 625703 624282 624013 625767 629504
51315 629504 633770 636398 636043 633246 629970 628022 627879 628813 629741 629793 628459 625898 623266 622226 623606 626552
51299 626552 629304 630749 631015 630679 629929 628683 627055 625343 623779 622662 622499 623587 625441 627102 628059
51284 628059 628510 628651 628244 627263 626532 627100 628988 630926 631433 629932 626931 623622 621382 621168 622846 625159
$$ packed form
51389G36821K116K936L910M851M629L143J979K439L815M487M128L735L763L416
51375G86168J951k74k416m025m849m645l856l791n123o705o890n792n105n818
51361G28830p283q665r886j0644r879p330m629l503l477k731r43L35J97k22L46
51346F60516J219P60j195l037l399k551j567r36m02K00N60L73j82o57r36j395
51330F47371k292l198l324k473j363q79j152j617j813j802j755j421k69J754L737
51315F29504M266K628l55k797l276j948j43R34R28N2j334k561k632j040J380K946
51299F26552K752J445K66l36p50j246j628j712j564j117j63J088J854J661R57
51284F28059M51J41m07r81p31N68J888J938N07j501l001l309k240k14J678K313
$$ [...]
##END NTUPLES=NMR SPECTRUM
##END=
