##TITLE=AC1666_DOMRH14357_8570712_2nxr0FZYMF
##JCAMPDX= 6.0         $$ Bruker NMR JCAMP-DX V2.0
##DATA TYPE= NMR SPECTRUM
##DATA CLASS= NTUPLES
##ORIGIN= BRUKER
##OWNER= Administrator
$$ 1.72 TOPSPIN		Version 2.1
$$ 2014-04-11 21:07:27.694 -0700  Administrator@X
$$ Compression mode = diff/dup
##.OBSERVE FREQUENCY= 400.02188249412
##.OBSERVE NUCLEUS= ^1H
##.ACQUISITION MODE= SIMULTANEOUS (DQD)
##.ACQUISITION SCHEME= undefined
##.AVERAGES= 8
##.DIGITISER RES= 22
##SPECTROMETER/DATA SYSTEM= spect
##.PULSE SEQUENCE= zg30
##.SOLVENT NAME= COFFEE_meoh
##.SHIFT REFERENCE= INTERNAL, COFFEE_meoh, 1, 14.98509
##AUDIT TRAIL= $$ (NUMBER, WHEN, WHO, WHERE, PROCESS, VERSION, WHAT)
$$ ##TITLE= Audit trail, TOPSPIN		Version 2.1
$$ ##JCAMPDX= 5.01
$$ ##ORIGIN= Bruker BioSpin GmbH
$$ ##OWNER= Administrator
$$ $$ E:\/data/COFFEE/nmr/AC1666_DOMRH14357_8570712_2nxr0FZYMF/10/pdata/1/auditp.txt
$$ ##AUDIT TRAIL=  $$ (NUMBER, WHEN, WHO, WHERE, PROCESS, VERSION, WHAT)
(   1,<2014-04-11 21:07:20.163 -0700>,<Administrator>,<X>,<go>,<TOPSPIN 2.1>,
      <created by zg
	started at 2014-04-11 21:06:14.006 -0700,
	POWCHK enabled, PULCHK disabled,
       configuration hash MD5:
       C8 4E 4E 5D D3 5C D8 9E 9F 52 82 E0 59 8A DE 15
       data hash MD5: 64K
       6B 07 F9 D2 47 40 1F 9E 6A B2 B1 CA D3 45 F2 C7>)
(   2,<2014-04-11 21:07:23.272 -0700>,<Administrator>,<X>,<proc1d>,<TOPSPIN 2.1>,
      <Start of raw data processing
       efp LB = 0 FT_mod = 6 PKNL = 1 PHC0 = 0 PHC1 = 0 SI = 32K 
       data hash MD5: 32K
       36 F8 4C C0 B2 FA 0D 2A 96 AE CA 2C CB 7B D6 02>)
(   3,<2014-04-11 21:07:23.631 -0700>,<Administrator>,<X>,<proc1d>,<TOPSPIN 2.1>,
      <pk PHC0 = 96.02051 PHC1 = 0 
       data hash MD5: 32K
       3F 09 74 09 4C F3 8B A0 E6 6B 11 7D D2 EF 6C 84>)
(   4,<2014-04-11 21:07:23.725 -0700>,<Administrator>,<X>,<proc1d>,<TOPSPIN 2.1>,
      <abs ABSG = 1 
       data hash MD5: 32K
       55 05 CA 89 1F 14 D3 1C FE 7D D5 E5 D5 5C D9 7F>)
(   5,<2014-04-11 21:07:23.788 -0700>,<Administrator>,<X>,<proc1d>,<TOPSPIN 2.1>,
      <abs ABSG = 2 
       data hash MD5: 32K
       D0 B0 38 2C BC F6 2C 46 EB 14 7F 63 CA 05 9D 07>)
(   6,<2014-04-11 21:07:23.897 -0700>,<Administrator>,<X>,<proc1d>,<TOPSPIN 2.1>,
      <abs ABSG = 3 
       data hash MD5: 32K
       44 2E 56 05 90 79 C8 92 CE 6F C1 9E 41 53 1E 6D>)
(   7,<2014-04-11 21:07:23.960 -0700>,<Administrator>,<X>,<proc1d>,<TOPSPIN 2.1>,
      <abs ABSG = 4 
       data hash MD5: 32K
       D4 85 FD 72 7B A3 B4 77 A6 BA 93 90 29 82 E0 97>)
(   8,<2014-04-11 21:07:24.241 -0700>,<Administrator>,<X>,<proc1d>,<TOPSPIN 2.1>,
      <abs ABSG = 5 
       data hash MD5: 32K
       86 1A 45 32 A6 F4 7A 53 3A 01 98 0D 23 69 13 81>)
$$ ##END=
$$ 
$$ $$ hash MD5
$$ $$ E1 6E F3 13 BF 47 27 02 A2 F3 3D 67 3D 99 EF 3B
##$RELAX= 
##$RELAX= 
##$RELAX= 
##$RELAX= 
##$RELAX= 
##$RELAX= 
##$RELAX= 
$$ Bruker specific parameters
$$ --------------------------
##$DU= <E:\>
##$EXPNO= 10
##$NAME= <AC1666_DOMRH14357_8570712_2nxr0FZYMF>
$$ [...]
##$TP= (0..7)
150 150 150 150 150 150 150 150
##$TP07= 0
##$TPNAME0= <>
##$TPNAME1= <>
##$TPNAME2= <>
##$TPNAME3= <>
##$TPNAME4= <>
##$TPNAME5= <>
##$TPNAME6= <>
##$TPNAME7= <>
##$TPOAL= (0..7)
0.5 0.5 0.5 0.5 0.5 0.5 0.5 0.5
##$TPOFFS= (0..7)
0 0 0 0 0 0 0 0
##$TUNHIN= 0
##$TUNHOUT= 0
##$TUNXOUT= 0
##$USERA1= <user>
##$USERA2= <user>
##$USERA3= <user>
##$USERA4= <user>
##$USERA5= <user>
##$V9= 5
##$VALIST= <valist>
##$VCLIST= <CCCCCCCCCCCCCCC>
##$VD= 0
##$VDLIST= <DDDDDDDDDDDDDDD>
##$VPLIST= <PPPPPPPPPPPPPPP>
##$VTLIST= <TTTTTTTTTTTTTTT>
##$WBST= 1024
##$WBSW= 4
##$XGAIN= (0..3)
0 0 0 0
##$XL= 0
##$YL= 0
##$YMAX_a= 645642
##$YMIN_a= -548491
##$ZGOPTNS= <>
##$ZL1= 120
##$ZL2= 120
##$ZL3= 120
##$ZL4= 120
##$ABSF1= 14.98509
##$ABSF2= -5.573092
##$ABSG= 5
##$ABSL= 3
##$ALPHA= 0
##$AQORDER= 0
##$ASSFAC= 0
##$ASSFACI= 0
##$ASSFACX= 0
##$ASSWID= 0
##$AUNMP= <proc_prof1d_extract_pilot.lims>
##$AXLEFT= 0
##$AXNAME= <>
##$AXNUC= <1H>
##$AXRIGHT= 0
##$AXTYPE= 0
##$AXUNIT= <>
##$AZFE= 0.1
##$AZFW= 0.1
##$BCFW= 0
##$BC_mod= 0
##$BYTORDP= 0
##$COROFFS= 0
##$CY= 15
##$DATMOD= 1
##$DC= 0
##$DFILT= <>
##$DTYPP= 0
##$F1P= 0
##$F2P= 0
##$FCOR= 0.5
##$FTSIZE= 32768
##$FT_mod= 6
##$GAMMA= 0
##$GB= 0
##$INTBC= 1
##$INTSCL= 1
##$ISEN= 128
##$LB= 0
##$LEV0= 0
##$LPBIN= 0
##$MAXI= 10000
##$MC2= 0
##$MEAN= 0
##$ME_mod= 0
##$MI= 0
##$NCOEF= 0
##$NC_proc= -8
##$NLEV= 6
##$NOISF1= 0
##$NOISF2= 0
##$NSP= 0
##$NTH_PI= 0
##$NZP= 0
##$OFFSET= 14.98509
##$PC= 1
##$PHC0= 96.02051
##$PHC1= 0
##$PH_mod= 1
##$PKNL= yes
##$PPARMOD= 0
##$PPDIAG= 0
##$PPIPTYP= 0
##$PPMPNUM= 2147483647
##$PPRESOL= 1
##$PSCAL= 4
##$PSIGN= 0
##$PYNMP= <proc.py>
##$REVERSE= no
##$SF= 400.02
##$SI= 32768
##$SIGF1= 0
##$SIGF2= 0
##$SINO= 400
##$SIOLD= 32768
##$SPECTYP= <>
##$SREGLST= <1H.CDCl3>
##$SSB= 0
##$STSI= 32768
##$STSR= 0
##$SW_p= 8223.68421052631
##$SYMM= 0
##$S_DEV= 0
##$TDeff= 65536
##$TDoff= 0
##$TI= <>
##$TILT= no
##$TM1= 0
##$TM2= 0
##$TOPLEV= 0
##$USERP1= <user>
##$USERP2= <user>
##$USERP3= <user>
##$USERP4= <user>
##$USERP5= <user>
##$WDW= 1
##$XDIM= 32768
##$YMAX_p= 462887229
##$YMIN_p= -696268
##$CURPLOT= <Network HP LaserJet P1505>
##$CURPRIN= <$Network HP LaserJet P1505>
##$DFORMAT= <normdp>
##$LAYOUT= <+/1D_H.xwp>
##$LFORMAT= <normlp>
##$PFORMAT= <normpl>
##$SURQMSG= 1
$$ End of Bruker specific parameters
$$ ---------------------------------
##NTUPLES= NMR SPECTRUM
##VAR_NAME=  FREQUENCY,     SPECTRUM/REAL,   SPECTRUM/IMAG
##SYMBOL=    X,             R,               I
##VAR_TYPE=  INDEPENDENT,   DEPENDENT,       DEPENDENT
##VAR_FORM=  AFFN,          ASDF,            ASDF
##VAR_DIM=   32768,         32768,           32768
##UNITS=     HZ,            ARBITRARY UNITS, ARBITRARY UNITS
##FACTOR=    0.250966925370066, 1,           1
##FIRST=     8223.43324360094, -23618,       -11465
##LAST=      0,             3178,            90592
##MIN=       0,             -696268,         0
##MAX=       8223.43324360094, 462887229,    0
$$ Real data points
##PAGE= N=1
##DATA TABLE= (X++(R..R)), XYDATA
$$ [...]
$$ plain form
19540 13682 -353815 270160 81568 -3027 -24114 169645 53300 12923 -81285 -306339 -128189
19528 -336926 -189616 -159595 181442 158287 -9814 43385 -194851 -6531 -106312 78784 -155855
19516 -85924 105238 367217 -31586 -240630 145859 -199771 117899 70114 -205613 -183801
19506 -183801 -103040 -128757 -100233 66071 -84070 -239139 163923 82350 43253 54962 137412
19495 137412 -206028 227877 206367 -277713 181158 324956 350184 -377453 -205107 4440
19484 -119411 -151464 -111939 7386 -226069 -56495 -27644 128013 -102418 69958 -19050 120574
19472 79003 299551 -369442 50160 123682 -54983 -59329 -30001 62697 -138266 -14388 69898
19460 -92460 224157 -32869 -106050 -218606 -243099 -27758 -54954 -334147 -163019 -279123 -151657
$$ packed form
19540A3682c53815B70160H1568c027k1087A69645E3300A2923h1285k25054a28189
19528c36926J47310L0021A81442k3155i814D3385a94851f531r9781G8784a55855
19516h5924A05238K61979c1586k09044A45859a99771A17899m7785b05613K1812
19506a83801Q0761k5717K8524F6071h4070j55069A63923q1573l9097J1709Q2450
19495A37412b06028B27877k1510b77713A81158J43798K5228c77453J72346D440
19484a19411l2053L9525G386b26069e6495b7644A28013a02418F9958a9050A20574
19472G9003K20548c69442E0160P3522e4983m346K9328F2697a38266a4388F9898
19460i2460B24157c2869p3181j12556k4493b7758k7196k79193a63019j16104J27466
$$ plain form
19449 -151657 -82335 205155 15068 -67932 146358 -88931 -312098 -91271 93406 -122952 -56934
19437 54567 33238 -41194 -207654 -195841 -95149 -151606 -329848 -9658 -182798 -297939 -56455
19425 -35287 -2236 -427497 -234090 -152686 130461 -32266 -235541 -7010 -146369 -348252 -126427
19413 -7646 114454 269255 26612 115320 67678 -207095 -159888 -113820 -7805 124099 -382665
19401 65937 223527 187616 -2150 -198401 -72639 307742 -45772 -19161 130178 -50875 -154756
19390 -154756 -72949 26975 34050 -27246 134549 102514 57329 -244723 -192485 92963 -42782
19378 -71633 42160 81372 141234 -181877 -132352 -12101 -178835 -219771 -139630 -99575 126438
19366 36449 55980 -87282 -251213 -136731 -188078 81835 -79036 -83285 -205574 -294817 208502
$$ packed form
19449a51657O9322B05155A5068f7932A46358h8931k23167i1271I3406a22952e6934
19437E4567k1329d1194j66460J1813i5149n6457j78242i658j73140j15141e6455
19425c5287b236m25261J93407Q1404A30461c2266k03275g010j39359k01883a26427
19413g646A14454J54801B6612Q8708m7642b07095M7207M6068g805A24099c82665
19401F5937J57590l5911b150j96251g2639C07742d5772a9161A30178e0875j03881
19390a54756g2949B6975P075b7246A34549l2035m5185b44723N2238I2963d2782
19378g1633D2160L9212N9862a81877M9525a2101j66734m0936Q0141M0055A26438
19366C6449J9531h7282j63931J14482n1347H1835g9036m249j22289q9243B08502
$$ plain form
19354 -10105 -16834 -128336 36918 -8603 -348396 -263021 70764 66999 211718 -371442 -292917
19343 -292917 -54194 -41133 8183 -2785 -217471 179983 -158713 16535 -315904 24494 -3351
19331 -86802 147446 -140386 -150482 -199116 -189729 -67559 331458 -26298 184538 -93294 -232975
19320 -232975 -210934 101113 244917 -47717 76849 265766 -578287 -120979 43810 -14384
19309 130736 -182481 -21173 -223428 -87828 -246026 219594 183140 -221875 -263585 36532
19298 -209806 -453565 -37336 147609 111183 153201 -189349 -34630 -139234 -37331 174876
19287 -18614 -264202 -411007 -119666 -141576 -99946 -158400 -62406 -3892 204557 -25408 97369
19275 -40266 -44753 -55951 -55941 -36941 267821 156568 -191175 -239098 -103125 23727 -205181
$$ packed form
19354a0105o729j11502C6918h603l39793Q5375G0764l765J44719c71442P8525
19343b92917e4194J3061H183b785k14686A79983a58713A6535c15904B4494c351
19331h6802A47446a40386j0096m8634R387f7559C31458b6298A84538i3294j39681
19320b32975K2041A01113J43804d7717G6849J88917e78287a20979D3810a4384
19309A30736a82481b1173k02255h7828j58198B19594l6454b21875m1710C6532
19298b09806k43759c7336A47609l6426M2018a89349c4630j04604c7331A74876
19287a8614k45588j46805a19666k1910M1630n8454f2406c892B04557b5408I7369
19275d0266m487j1198J0J9000B67821j11253a91175m7923a03125B3727b05181
$$ plain form
19263 14531 -67780 -60077 -57012 -125915 129024 -21797 -42365 -175471 -17601 -145267 233811
19251 74955 -151575 -268096 211767 -19022 -249321 90759 30852 -203831 -155279 -144505 273444
19239 -31999 -249326 -352936 -220430 56903 -366450 65148 -41496 -130936 -251810 -218631 -101655
19227 34096 138582 -30481 -90486 -156553 102155 77077 84249 51314 154708 -195426 42676
19215 -200366 -12731 292141 -93546 29619 -299384 135505 -133947 -11529 141613 -151578
19204 -164618 -131319 -377774 -10261 112146 -215319 -161027 -70260 45476 144715 -114024 173915
19192 -171407 -393714 177544 28977 70978 -78302 -26322 102206 -4702 4817 147085 40650
19180 21923 -350054 -225180 68016 -30698 18652 -48400 164758 -290098 -26158 -40936 152368
$$ packed form
19263A4531f7780P703L065o8903A29024b1797k0568j33106a7601j27666B33811
19251G4955a51575j16521B11767a9022k30299I0759C0852b03831M8552J0774B73444
19239c1999k17327j03610J32506E6903c66450F5148d1496q9440j20874L3179a01655
19227C4096J04486c0481o0005o6067A02155k5078P172l2935J03394a95426D2676
19215b00366a2731B92141i3546B9619b99384A35505a33947a1529A41613a51578
19204a64618L3299k46455a0261A12146b15319N4292g0260D5476R9239a14024A73915
19192a71407k22307A77544B8977M2001g8302b6322A02206d702D817J42268D0650
19180B1923c50054J24874F8016c0698A8652d8400A64758b90098b6158j4778A52368
$$ plain form
19168 -193138 -21758 -95364 -213970 -138728 -379475 -261750 148063 -227692 -38536 75642
19157 -47965 -14529 -166685 173841 -47931 187301 36985 -147049 -282907 -208607 7968 53001
19146 53001 -107487 -47040 -48526 -169504 -83240 -16103 -112679 -101308 -104202 174810 -179629
19134 -202747 -165823 173427 -34488 75869 91127 174775 -148234 98507 188648 -49780 -184538
19123 -184538 -9019 -71442 -173997 -56938 -102081 -160684 -7093 59462 157733 -14975 219615
19111 -83556 -93903 -659 -373520 -58978 -97290 255857 -243895 20537 5721 314355 -53336
19099 192666 -10946 102613 -200801 38571 -77577 -10563 195877 75588 -357603 171451
19088 -62631 -152240 4921 -38854 -155690 -32156 -221648 185441 29442 79998 -97887 73031
$$ packed form
19168a93138b1758p3606j18606P5242k40747J17725A48063b27692c8536G5642
19157d7965a4529j52156A73841d7931A87301C6985a47049j35858P4300G968M5033
19146E3001a07487d7040j486j20978h3240a6103r6576J1371k894A74810a79629
19134b02747L6924A73427c4488G5869J5258Q3648a48234I8507R0141d9780j34758
19123a84538i019o2423j02555e6938m5143n8603g093E9462R8271a4975B19615
19111h3556j0347f59l72861e8978l8312B55857b43895B0537E721L08634e3336
19099A92666a0946A02613b00801C8571g7577a0563A95877G5588c57603A71451
19088f2631q9609D921c8854j16836c2156j89492A85441B9442N0556i7887G3031
$$ plain form
19076 -20396 88908 -205522 -74308 122937 -285646 69547 48669 -44331 56747 -95857 -23468
19064 -87326 -445114 -9378 -208655 -201370 106842 -95113 -102694 -22496 277469 -162606 -119518
19053 -119518 -156624 112745 60372 -133997 257778 -344174 -173525 68686 401468 -163440
19042 -236082 -157604 -168380 -83713 65847 -9347 132337 122881 -182108 -260002 -219848 -148224
19031 -148224 248076 -64405 86062 -355670 -264972 -158578 83311 40973 -126252 67861 -230743
19019 15871 155734 -29282 225471 194177 52093 -228470 7483 -239519 -260232 117928 -58209
19007 193671 -206241 44660 -10292 -95207 -175266 -90304 -221703 -15619 -343577 321528 -189025
18995 129043 -287388 -331879 112291 112085 -46022 -185028 -71660 -41818 -191721 -28030 -3416
$$ packed form
19076b0396H8908b05522g4308A22937b85646F9547k0878d4331E6747i5857b3468
19064h7326l57788i378j99277P285A06842i5113p581b2496B77469a62606M3088
19053a19518l7106A12745n2373a33997B57778c44174J70649F8686L32782a63440
19042b36082P8478j0776h3713F5847i347A32337r456a82108p7894M0154P1624
19031a48224B48076f4405H6062c55670R0698J06394H3311D0973a26252F7861b30743
19019A5871J39863b9282B25471l1294E2093b28470G483b39519k0713A17928e8209
19007A93671b06241D4660a0292q4915q0059Q4962j31399a5619l27958C21528a89025
18995A29043b87388m4491A12291k06d6022j39006g1660K9842j49903b8030c416
$$ plain form
18983 -187283 201130 -46618 -154216 -88922 -226459 -186168 -315029 -23736 235951 67587
18972 8846 -237834 219697 -264949 -181938 40459 -267255 -73348 13609 -275797 -155576 -156842
18961 -156842 104232 -80589 257505 -364448 78921 121406 -104674 -154954 -29844 -103117 56619
18949 28919 -148954 -38542 -80261 103903 197409 242983 -79681 -118536 -100951 -203064 -223393
18938 -223393 155248 113353 88159 -112527 -198746 153193 -274136 39543 26349 197793
18928 197793 -220445 240512 198289 71327 180556 -79551 231208 -27457 -156293 -256905
18918 -256905 116180 167598 336247 -12621 -66438 -247722 -248823 -405621 26418 94727 -231866
18906 -388849 334482 -74266 -203223 -35870 -53393 -146997 147042 -54801 54412 41566 -218308
$$ packed form
18983a87283B01130d6618j07598O5294j37537M0291j28861b3736B35951F7587
18972H846b37834B19697b64949Q3011D0459b67255g3348A3609b75797J20221j266
18961a56842A04232h0589B57505c64448G8921M2485a04674n0280b9844p3273E6619
18949B8919a48954c8542m1719A03903R3506M5574g9681l8855J7585j02113k0329
18938b23393A55248m1895k5194a12527q6219A53193b74136C9543j3194J71444
18928A97793b20445B40512m2223G1327J09229g9551B31208b7457j28836j00612
18918b56905A16180N1418J68649a2621n3817j81284j101j56798B6418O8309b31866
18906c88849C34482g4266j28957c5870j7523r3604A47042e4801E4412j2846b18308
$$ plain form
18894 -46503 70079 -213832 -119948 -199512 -76135 -48145 -252544 -67832 27711 65823 45048
18883 45048 -149778 138030 19485 -253165 -173571 -16168 28167 144759 -61441 9084 -128584
18871 116247 -91363 -44750 -37609 -41553 244320 201774 -8802 -137247 -259906 -274706 -69613
18859 -452856 -281527 -12138 -35309 87571 -91413 -41695 142613 -172498 -19991 19168 -198773
18847 -49151 397422 -76799 82540 -34887 -335443 128452 -305800 -139001 10250 -304754
18836 -225898 -26977 -364190 -209409 -20260 93780 -68550 -90182 -211175 -24813 196432 -133535
18824 157608 -21806 27805 -232089 9617 114400 44208 -319366 -51493 165115 -128805 -37596
18812 -212331 -298786 -64229 357 -218836 -164469 23990 -266949 -430151 -46645 -297639 -146669
$$ packed form
18894d6503G0079b13832R3884p9564g6135K7990k04399f7832B7711L8112k0775
18883D5048a49778A38030A9485b53165P9594a6168B8167J16592f1441I084a28584
18871A16247i1363d4750P141l944B44320m2546h802j28445j22659j4800f9613
18859d52856J71329a2138k3171H7571i1413d1695A42613a72498a9991A9168a98773
18847d9151C97422g6799H2540c4887l00556A28452c05800a39001A0250c04754
18836b25898b6977l37213J54781b0260I3780f8550k1632j20993b4813A96432a33535
18824A57608b1806B7805b32089I617J04783D4208c19366e1493A65115a28805c7596
18812b12331q6455f4229C57b18836N4367B3990b66949j63202d6645k50994a46669
$$ plain form
18800 15867 -221071 46172 -174234 -183511 -177804 58025 -175485 186608 73634 38323 189266
18789 189266 -256705 158179 -144678 -75461 -116791 68878 -382926 -112230 -261135 45102
18778 -100017 -124908 -92910 -51737 -64432 -186216 60098 4159 140431 139325 311975 -90255
18766 -68063 135344 -134847 -23562 -229293 -151002 -210421 -297164 -327742 -89195 -12556 -85218
18755 -85218 18970 98148 -215291 -171903 162443 -62973 87140 -74486 -169220 -72665 -47981
18744 -47981 -237250 -70059 -233243 -8223 -89310 139677 -48222 37759 152409 -335819 -157353
18732 -7796 158019 232235 103786 176260 -61065 -159625 74155 183995 -169649 171541 -258347
18720 1180 285649 123396 -150954 -259352 -30861 -220372 -114212 -35712 244478 291818
$$ packed form
18800A5867b21071D6172a74234r277N707E8025a75485A86608G3634l5311J50943
18789A89266b56705A58179a44678O9217m1330F8878c82926a12230j48905D5102
18778a00017k4891L1998M1173j2695j21784F0098D159J36272j106J72650i0255
18766f8063A35344a34847b3562k05731P8291n9419q6743l0578h9195a2556p2662
18755h5218A8970P9178b15291M3388A62443f2973H7140g4486r4734g2665K4684
18744d7981j89269g0059j63184h223q1087A39677d8222C7759J14650c35819a57353
18732g796A58019P4216A03786P2474f1065r8560G4155J09840a69649A71541b58347
18720A180K84469A23396a50954j08398c0861j89511J06160c5712B44478M7340
$$ plain form
18710 291818 249440 -23861 -132339 213304 112273 197961 -142604 -184846 143433 -120095
18699 50940 -86975 66577 489 -140348 -68862 -41738 -205241 375434 -115776 70026 337410
18688 337410 177107 106703 -240011 -210634 -152178 -195957 124473 -42268 -315720 -53436 -47301
18677 -47301 -165541 -51809 -175419 9157 -35625 -52952 -196263 191555 -141474 25816 70153
18666 70153 -277578 66662 -182396 -211845 -248910 -56842 -371900 452368 184261 -203986
18655 -1002 317554 -52221 209925 -119035 -138000 -187414 -141477 -6222 105909 -87674 68849
18643 -51245 -78799 -219811 214935 -571244 -103999 9396 -37978 -198890 -3551 -333571 -95773
18631 -192913 -48635 -290981 88950 -233842 -238785 -151417 52793 59569 -61269 219803 94529
$$ packed form
18710B91818m2378b3861j08478B13304j01031Q5688a42604m2242A43433a20095
18699E0940h6975F6577D89a40348f8862K7124j63503C75434a15776G0026K67384
18688C37410j60303p0404b40011K9377N8456m3779A24473d2268k73452e3436O135
18677d7301j18240e1809j23610I157c5625j7327j43311A91555a41474B5816M4337
18666G0153b77578F6662a82396k9449l7065e6842l15058D52368A84261b03986
18655a002C17554e2221B09925a19035j8965m9414M5937f222A05909h7674F8849
18643e1245k7554j41012B14935e71244a03999I396c7978j60912c551l30020i5773
18631a92913d8635k42346H8950b33842m943Q7368E2793O776f1269B19803I4529
$$ plain form
18619 -50498 188628 -144094 -59066 -206100 -463357 -235605 -127970 -511413 112381 -40824
18608 -378808 12094 -181750 -144891 50755 160339 -476675 6169 317142 119268 75649 124605
18597 124605 -345503 -33457 -195395 100016 -29367 -313301 291235 -95984 -9426 -61550 63153
18585 -164687 13772 40876 -173161 166036 -87699 -105553 -54224 8904 238050 137226 -330496
18573 100084 -137178 -95905 -61763 -49458 -84792 -7243 55266 -12085 -58691 -356394 259486
18561 175514 303662 -234509 41730 -73014 41034 -178223 -123579 -214315 -18936 231771 -28082
18549 -63492 32898 -161360 -105072 -32106 -70004 -23041 -109972 146407 90243 15550 163020
18538 163020 -128715 184058 -120050 9741 121656 24978 -397153 -302162 -243408 -198871 -337159
$$ packed form
18619e0498A88628a44094e9066j47034k57257K27752J07635l83443A12381d0824
18608c78808A2094a81750L6859E0755J09584d76675F169L10973A19268m3619M8956
18597A24605c45503c3457j61938A00016b9367k83934B91235i5984i426n2124F3153
18585a64687A3772K7104a73161A66036h7699j7854N1329H904K29146j00824c30496
18573A00084a37178M1273L4142J2305l5334g243E5266a2085m6606k97703B59486
18561A75514J28148b34509D1730g3014D1034a78223N4644r0736a8936B31771b8082
18549f3492C2898a61360N6288c2106l7898b3041q6931A46407n6164A5550J47470
18538A63020a28715A84058a20050I741J11915B4978c97153R4991N8754M4537j38288
$$ plain form
18527 -337159 -6168 -72603 -9303 217800 80087 7166 -138918 -38838 -192703 3622 -139691
18515 -39850 270871 337006 216168 -174795 -75690 -243618 102770 18614 -185980 -206893
18505 -206893 -37950 70008 -275663 -249418 -218511 259280 -11035 -130041 11128 178222 41539
18493 71744 -89517 -400704 142851 -170289 -83059 -278648 -134026 60399 58065 266988 -233251
18481 249291 149194 258417 94983 -277408 -343757 33536 -120596 -199924 4765 -125389 3298
18469 -54221 -395371 -18866 -374779 244341 -75243 12003 5354 -403793 -29209 -127711 -166448
18458 -166448 -144736 295134 82607 -378477 66602 -15227 305010 -297640 -2589 -283655 -133818
18446 45929 -139634 176106 -37975 -220576 32351 -49704 215005 -47807 55706 -370385 81643
$$ packed form
18527c37159f168o6435i303B17800H0087G166a38918c8838j53865C622a39691
18515c9850B70871O6135j20838a74795g5690j67928A02770A8614a85980k0913
18505b06893c7950G0008b75663K6245L0907B59280a1035j19006A1128J67094D1539
18493G1744h9517l11187A42851a70289h3059j95589a34026F0399k334K08923b33251
18481B49291j00097J09223I4983b77408o6349C3536a20596p9328D765a25389C298
18469e4221l41150a8866l55913B44341g5243A2003E354d03793b9209r8502l8737
18458a66448K1712B95134H2607c78477F6602a5227C05010b97640b589k81066a33818
18446D5929a39634A76106c7975j82601C2351d9704B15005d7807E5706c70385H1643
$$ plain form
18434 -248879 -286495 -73367 139946 34364 -4196 -54510 200368 80725 -332243 -67242 192983
18422 195914 -48137 -19542 -348655 -79879 152019 105239 -157337 -1518 -371904 42567 -102
18410 111804 13865 31632 -141538 -168511 173568 106555 275798 -595 43982 -399868 -393328
18399 -393328 60106 -329587 56730 -192163 -69493 26399 285245 -39204 157998 -440405
18388 116318 -208030 140215 59605 -222432 -106246 -233090 34780 -257731 169844 10407
18377 -140895 349667 -239259 182752 -35462 -330552 -30938 -181188 -110339 -49198 -54039 115000
18365 -160968 -287484 -172289 -364059 204113 215312 297625 -66771 12610 -57421 107819
18354 -94299 91250 -12912 172185 -61012 -86310 -97613 -357928 -404791 -37371 223822 59366
$$ packed form
18434b48879l7616g3367A39946C4364d196n0314B00368H0725c32243f7242A92983
18422A95914d8137a9542l29113g9879A52019m6780a57337a518l70386D2567a02
18410A11804A3865J7767a41538k6973A73568o7013J69243e95D3982c99868O540
18399c93328F0106c29587E6730a92163f9493B6399K58846c9204A57998d40405
18388A16318b08030A40215E9605b22432a06246j26844C4780b57731A69844A0407
18377a40895C49667b39259A82752c5462k95090c0938j50250P0849d9198m841A15000
18365a60968j26516J15195j91770B04113J1199Q2313f6771A2610e7421A07819
18354i4299I1250a2912A72185f1012k5298j1303k60315m6863c7371B23822E9366
$$ plain form
18342 -280394 63944 -42630 -158667 608187 -28808 -40041 -202395 -342976 131921 -151819
18331 -107859 106503 176715 254694 17843 -115666 -65603 -252614 -106270 50934 -450834
18320 -13120 -419405 -56555 6328 -208621 154147 -24286 -524390 -238752 -49419 544425 182523
18308 396003 236372 11416 92254 -339924 88360 -295723 -131187 136189 138717 -91268 -135557
18297 -135557 182619 -160763 -86845 32245 -122707 140047 4528 -279003 147578 -42727
18286 225330 115536 -128292 -10347 253430 195892 -31668 -301699 250000 19487 200264
18276 200264 -110545 36550 40062 -62391 -42850 -73519 -93014 -155073 -62820 -53841 -226759
18265 -226759 86847 -113885 -161210 -76438 492106 75990 -97028 89510 98103 -419616 -306500
$$ packed form
18342b80394F3944d2630j16037F08187b8808j1233j62354j40581A31921a51819
18331a07859A06503P0212P7979A7843a15666N0063j87011a06270E0934d50834
18320a3120m06285e6555F328b08621A54147b4286n00104b38752d9419E44425A82523
18308C96003j59631A1416Q0838c39924H8360b95723a31187A36189K528i1268m4289
18297a35557A82619a60763P3918C2245a22707A40047D528b79003A47578d2727
18286B25330j09794a28292a0347B53430n7538c1668k70031B50000A9487J80777
18276B00264a10545C6550L512f2391J9541l0669j9495o2059f2820Q979j72918
18265b26759H6847a13885m7325g6438D92106G5990i7028H9510Q593d19616J13116
$$ plain form
18254 -306500 -366634 28162 50430 356458 119981 124002 74483 -311257 -118058 -61857 -31093
18243 -31093 -80454 131724 -33572 -93834 53297 21668 -170204 132152 318000 -88241 -141867
18232 -141867 169352 108299 161518 -61437 -322041 97437 -109906 -23681 20096 -18958 79719
18220 -43874 -349366 194416 305573 -147019 -368475 -10187 36587 -121197 287141 -88764
18209 -170070 -103827 -261818 80825 -50842 -28573 -56142 171288 -78980 -101706 253131 48005
18197 -99211 187735 -59420 -177365 78304 -103913 34534 95413 -128055 121774 157920 -284175
18185 -139897 -13632 294424 -99331 -417959 -235848 -53745 65690 -56920 229166 44016 140436
18174 140436 -86683 83830 -61503 -179795 -28724 -156851 -121318 121796 83214 -142026 -113896
$$ packed form
18254c06500o0134B8162K2268L06028A19981M021m9519c11257a18058N6201L0764
18243c1093m9361A31724c3572o0262E3297B1668a70204A32152J85848h8241n3626
18232a41867A69352o1053N3219f1437k60604I7437a09906b3681B0096a8958G9719
18220d3874l05492A94416J11157a47019k21456a0187C6587a21197B87141h8764
18209a70070O6243j57991H0825e0842K2269k7569A71288g8980k2726B53131D8005
18197i9211A87735e9420j17945G8304a03913C4534O0879a28055A21774L6146b84175
18185a39897a3632B94424i9331l18628J82111e3745F5690e6920B29166D4016R6420
18174A40436h6683H3830f1503j18292b8724j28127L5533A21796l8582a42026K8130
$$ plain form
18163 -113896 143328 -15466 111639 -278269 -104988 -75429 -18106 -69810 186478 300246
18153 300246 -24560 78811 -14030 -160838 18019 -236276 -89483 -265498 -286832 -477038 -172297
18141 103440 -29863 -206375 -52110 -186990 103943 -167015 -7393 428525 -259187 -91761
18130 115420 75720 53590 161989 81382 -125128 -80125 -187263 118022 219112 114755
18120 114755 129216 373319 123454 115268 -215815 -268041 334115 178404 -228346 -208374
18110 -208374 89941 116725 163443 -10175 304335 97515 -132939 -127701 -31712 -134852 29086
18098 -290673 59729 96925 -66874 -66745 -153896 -187954 33866 71277 -62745 -226477 -45551 23641
18085 91285 -162439 -100054 -567 -85347 -519544 58612 -153140 -29255 101937 -157864 -118447
$$ packed form
18163a13896A43328a5466A11639b78269a04988K9559a8106n1704A86478J13768
18153C00246b4560G8811a4030j46808A8019b36276h9483j76015k1334j90206a72297
18141A03440b9863j76512e2110j34880A03943a67015g393D28525b59187i1761
18130A15420l9700k2130J08399q0607a25128M5003j07138A18022J01090j04357
18120A14755J4461K44103A23454q186b15815n2226C34115j55711b28346J9972
18110b08374H9941K6784M6718a0175C04335I7515a32939N238c1712j03140B9086
18098b90673E9729L7196f6874J29q7151l4058C3866L7411f2745j63732d5551B3641
18085I1285a62439O2385e67q4780m34197E8612a53140b9255A01937a57864L9417
$$ plain form
18074 -118447 144831 -48417 -268466 164437 15257 -111360 -290488 260439 45470 -335759
18063 89707 89969 -81291 -251965 -152652 19705 152191 -82568 -126574 49763 138459 -144112
18051 25478 -209563 309887 -90830 -327684 -338656 -273724 140302 48460 394628 -450861
18040 -485067 308942 101092 -152723 68794 192124 -69486 -282806 -185934 57541 -312390
18029 329794 -134898 255570 -40876 195901 -191037 -142080 -162962 -24283 -56221 133360
18018 -4641 173724 -186939 -99694 -159272 -147507 17964 -19986 210272 -169615 3201 65506
18007 65506 -118357 -104271 16991 -205673 259884 -27477 -11949 -78644 131024 138913 58898
17995 -42197 41478 153943 -195512 45917 -40217 -66163 -182162 -179405 53041 150456 -62920
$$ packed form
18074a18447A44831d8417k20049A64437A5257a11360j79128B60439D5470c35759
18063H9707K62h1291j70674R9313A9705J32486h2568m4006D9763Q8696a44112
18051B5478b09563C09887i0830k36854j0972O4932A40302D8460L46168d50861
18040d85067C08942A01092a52723F8794J23330f9486k13320R6872E7541c12390
18029C29794a34898B55570d0876A95901a91037M8957k0882b4283l1938A33360
18018d641A73724a86939Q7245n9578J1765A7964a9986B10272a69615C201O2305
18007F5506a18357J4086A6991b05673B59884b7477a1949o6695A31024P889E8898
17995d2197D1478J12465a95512D5917d0217k5946j15999K757E3041R7415f2920
$$ plain form
17983 163495 -21497 -132533 22254 -146631 103314 -41460 237127 -109456 -294486 -146832
17972 -253414 -104208 -193987 111731 103099 195618 -191321 -157852 -110937 -159816 -54534 -62050
17961 -62050 264731 195725 -45164 -184304 -11079 137804 190119 77883 -115593 -241787 -178221
17950 -178221 -198063 -179458 264961 -204691 -27737 -403358 -125189 171625 17287 3336 35271
17939 35271 -125711 40680 -406803 47181 188387 -18803 151829 420082 176330 32183
17928 -57352 170442 -195790 -46480 33347 -176498 -35253 19222 -175859 -79444 -172226 62052
17916 13131 107056 -27358 98993 172394 113120 43053 278534 -153892 137806 334157 -99405
17904 -8129 92092 -169864 -24368 268233 74374 -165941 -16135 169593 35046 221940 211122
$$ packed form
17983A63495b1497j11036B2254a46631A03314d1460B37127a09456j85030a46832
17972b53414a04208q9779A11731q632R2519a91321L3469M6915m8879e4534p516
17961f2050B64731o9006d5164j39140a1079A37804N2315G7883a15593j26194O3566
17950a78221j9842J8605B64961b04691b7737l75621a25189A71625A7287C336L1935
17939C5271a25711D0680d06803D7181J41206a8803A51829K68253A76330C2183
17928e7352A70442a95790d6480C3347a76498c5253A9222a75859g9444r2782F2052
17916A3131R3925b7358I8993P3401n9274D3053K35481a53892A37806J96351i9405
17904h129I2092a69864b4368B68233G4374a65941a6135A69593C5046J86894j0818
$$ plain form
17893 211122 31289 273673 174006 171058 172165 -38125 -114315 202293 -230566 -72248 -250957
17882 -250957 51508 -483739 16591 14950 -35092 -58410 62424 63425 -216147 144675 364778
17871 364778 29637 -97896 -131491 -103081 -11318 -123594 -41365 6596 180838 16467 -82797
17859 -44747 -7902 -267034 -91783 -91005 108384 -175502 -151507 363381 42482 59025 15383
17847 147064 -191997 -220232 -17445 146532 -31905 -190906 -52011 248621 320013 109122
17836 -705 299871 18225 -82998 -9089 -285139 -46461 -69234 330331 184268 -188195 -24335
17824 27348 -384300 288636 95193 -73989 141705 -39066 9322 -114214 -40739 -151073 255247
17812 16227 34309 200842 -121633 -118892 207392 186028 -6599 -99008 101344 -179744 -57422
$$ packed form
17893B11122C1289K42384r9667k948J107c8125p6190B02293b30566g2248j78709
17882b50957E1508d83739A6591j641c5092k3318F2424J001b16147A44675K20103
17871C64778B9637i7896l3595K8410a1318j12276d1365F596J74242A6467h2797
17859d4747g902k59132i1783P78A08384a75502K3995C63381D2482J6543A5383
17847A47064a91997k8235a7445A46532c1905j59001e2011B48621P1392A09122
17836g05B99871A8225h2998i089k76050d6461k2773C30331j46063a88195b4335
17824B7348c84300B88636I5193g3989A41705c9066I322a14214d0739j10334B55247
17812A6227J8082J66533a21633K741B07392k1364f599r2409A01344a79744e7422
$$ plain form
17800 -203367 -271442 42162 128357 170463 129428 -95540 22970 -145115 268475 -168978 212770
17788 51931 -181538 51320 17718 -70884 25051 -4370 -94934 45912 -10833 -9612 16818 -142343
17775 -206411 189188 -45076 -149570 122432 -176972 -69078 34244 96744 216898 440 166957
17764 166957 394604 160297 -97293 150885 -25973 56143 93028 -283935 -209254 46354 511211
17753 511211 -178637 -151184 -31667 5314 -139085 339754 117315 -183209 106773 106460 157709
17742 157709 -16597 -4592 249221 -158807 -73589 -7759 90683 6121 291967 179088 117809
17731 117809 -186591 320350 -49627 -156714 344831 135253 -174518 302266 15945 -255934
17720 311191 -165114 -51607 70206 -22656 -169780 -203645 -125108 -170901 -251830 -15951 197452
$$ packed form
17800b03367o8075D2162Q6195M2106m1035i5540B2970a45115B68475a68978B12770
17788E1931a81538E1320A7718g0884B5051d370r0564D5912a0833J221A6818a42343
17775b06411A89188d5076j04494A22432a76972f9078C4244O2500J20154D40J66517
17764A66957K27647A60297i7293A50885b5973E6143L6885b83935P4681D6354M64857
17753E11211a78637K7453c1667E314a39085C39754A17315a83209A06773l13N1249
17742A57709a6597d592B49221a58807g3589g759I0683F121K85846j12879o1279
17731A17809a86591C20350d9627j07087C44831A35253a74518C02266A5945b55934
17720C11191a65114e1607G0206b2656j47124l3865P8537m5793q0929a5951A97452
$$ plain form
17708 46350 103813 -268794 177301 -149636 -425324 -332316 120948 -141874 -83023 -57820
17698 -57820 -311582 -76288 341703 286329 -79149 231838 -122514 -30971 186284 -55556 187
17686 214168 -254448 230945 -72564 51032 21852 328 -71145 42652 -107593 103822 -142954
17674 -101547 44490 -17365 -200184 -341213 168766 -148773 -38952 159078 -126484 36936
17663 117349 -328713 -151695 -50485 -33315 21369 -71174 46590 113808 153022 -39583 11979
17651 -152327 -123514 20291 -237683 60499 -222727 350489 -6166 -48753 132879 -55739 128851
17639 -118269 -64917 -54947 345825 115304 200561 -49462 -142605 -103550 142722 66956 77133
17628 77133 -21906 -77661 184197 -32421 -128366 18561 168553 14951 39366 -201962 67765
$$ packed form
17708D6350N7463b68794A77301a49636k75688R3008A20948a41874N8851K5203
17698e7820k53762g6288C41703n5374g9149B31838a22514c0971A86284e5556A87
17686B14168b54448B30945g2564E1032B1852C28g1145D2652a07593A03822a42954
17674a01547D4490a7365j82819j41029A68766a48773c8952A59078a26484C6936
17663A17349c28713a51695e0485J7170B1369g1174D6590O7218L9214c9583A1979
17651a52327K8813B0291b37683F0499b22727C50489f166m2587A32879e5739A28851
17639a18269N3352R970C45825A15304Q5257d9462r3143L9055A42722F6956J0177
17628G7133b1906n5755A84197c2421r5945A8561J49992A4951K4415b01962F7765
$$ plain form
17616 73225 -128342 100942 -81920 220121 335888 64824 -164877 -296604 -68310 7334 -25593
17604 259622 93075 144799 -206567 -133910 -22 402628 194379 -26065 -283335 74669 199214
17593 199214 172159 312144 84657 78380 77635 227726 -205682 -80545 -91401 51071 -48053
17581 -63940 43263 -245206 342685 -130770 110235 -235511 -111095 81142 -123546 210122
17570 103894 208795 135722 -83729 -145785 -217497 216518 -145718 43618 267295 118043
17559 97338 -156859 -105710 233422 55576 117211 55929 441034 61462 371792 280575 257608
17548 257608 357505 5356 267496 239383 258163 -62850 59207 173977 -227619 97468 -21200
17536 71988 174834 201094 -20929 14044 372253 355570 155014 296316 -37316 236238 107522
$$ packed form
17616G3225a28342A00942h1920B20121J15767F4824a64877j31727f8310G334b5593
17604B59622I3075N1724b06567P2657b2D02628A94379b6065k57270G4669J24545
17593A99214k7055J39985H4657o277p45J50091b05682h0545j0856E1071d8053
17581f3940D3263b45206C42685a30770A10235b35511a11095H1142a23546B10122
17570A03894J04901p3073h3729o2056p1712B16518a45718D3618K23677A18043
17559I7338a56859N1149B33422E5576O1635E5929L85105F1462L10330r1217k2967
17548B57608R9897E356K62140k8113J8780f2850E9207J14770b27619I7468b1200
17536G1988J02846K6260b0929A4044L58209j6683A55014J41302c7316B36238A07522
$$ plain form
17524 -83118 -192536 81589 -110081 -11002 295473 -138951 -5284 155164 309622 83628 -35479
17512 288732 34225 -99468 318617 -123567 92486 -145832 143859 -321558 -182302 345862
17501 -109919 471107 -27433 234193 116538 4385 233093 -435386 -59071 157482 -62829
17490 74231 266577 102262 386184 107655 -56742 161447 379789 41404 23593 -89351
17479 -16714 150544 -85251 263925 37 163116 391750 58573 53233 23594 181513 398924
17468 398924 261357 111694 -2485 497329 -23779 76411 64627 219666 -92637 -50107 106804
17456 42880 210287 288256 -8685 165950 98317 82487 155492 21179 255149 79595 86558
17445 86558 -70262 304546 272464 -25329 -67579 -125928 -103553 -2764 475261 143842 85307
$$ packed form
17524h3118j09418H1589a10081a1002B95473a38951e284A55164J54458H3628c5479
17512B88732C4225i9468C18617a23567I2486a45832A43859c21558J39256C45862
17501a09919D71107b7433B34193A16538D385K28708d35386e9071A57482f2829
17490G4231J92346A02262K83922A07655e6742A61447K18342D1404j7811h9351
17479a6714A50544h5251B63925C7J63079K28634E8573n340B3594J57919K17411
17468C98924j37567A11694b485D97329b3779G6411j1784J55039i2637M2530A06804
17456D2880J67407P7969h685A65950o7633j5830P3005B1179K33970G9595O963
17445H6558g0262C04546l2082b5329m2250n8349K2375b764D75261A43842n8535
$$ plain form
17434 85307 50231 181275 -123526 335416 350669 177990 346043 -12739 170475 191807
17424 191807 208176 -144903 8947 256933 150889 391209 419808 124579 51492 383270
17414 383270 187204 178329 565689 167903 254534 183265 108832 -84254 216094 297624 190916
17403 190916 -109333 -14350 149743 115038 -161327 26937 496817 189025 94015 -89460
17392 154863 158077 489418 -77320 273416 177189 17990 -23616 380683 -37586 33122 362465
17381 362465 215263 316182 249977 -91667 55287 105835 121377 174894 277582 -99693 131439
17369 -22910 212460 172662 262256 308994 272778 -196030 107498 336864 14270 377307 115544
17357 398376 -26884 -37509 98287 353543 76349 -151412 251970 306461 111805 126626 115119
$$ packed form
17434H5307l5076J31044a23526C35416J5253j72679J68053a2739A70475K1332
17424A91807J6369a44903H947K47986j06044K40320K8599A24579E1492L31778
17414C83270A87204q875L87360A67903Q6631p1269p4433h4254B16094Q1530j06708
17403A90916a09333a4350A49743l4705a61327B6937M69880A89025I4015h9460
17392A54863L214L31341g7320B73416r6227A7990b3616C80683c7586C3122L29343
17381C62465j47202J00919o6205i1667E5287N0548J5542N3517J02688i9693A31439
17369b2910B12460l9798Q9594M6738l6216a96030A07498K29366A4270L63037A15544
17357C98376b6884j0625I8287K55256G6349a51412B51970N4491A11805J4821j1507
$$ plain form
17346 115119 156768 -88673 55499 532788 -18143 94971 -143844 245700 -223820 192682
17335 286907 566431 -124842 44651 -33312 -129178 -171713 148330 81352 180804 127091 246875
17324 246875 -33951 260671 -98557 94704 -342663 96063 80778 340829 37010 -156630 -111781
17313 -111781 68269 196849 352266 88520 245280 -132809 -60904 313133 117678 47471
17302 -592 62516 374262 88522 -120206 -31614 -17374 -91957 211140 350751 182242 613005
17291 613005 445078 73659 27680 -150109 270634 -156063 -30769 323816 -134057 359690
17280 219992 205951 23907 177558 597196 278018 -35950 237178 137875 166946 179987 263841
17269 263841 20522 247062 378706 235233 103129 -25733 365643 -80478 364566 -433 69698
$$ packed form
17346A15119M1649h8673E5499M77289a8143I4971a43844B45700b23820A92682
17335B86907K79524a24842D4651c3312r5866m2535A48330o6978R9452n3713J19784
17324B46875c3951B60671i8557I4704c42663I6063j5285K60051C7010a56630M4849
17313a11781F8269J28580J55417H8520J56760a32809f0904C13133A17678D7471
17302e92F2516L11746H8522a20206c1614J4240p4583B11140J39611j68509M30763
17291F13005j67927G3659B7680a50109B70634a56063c0769C23816a34057C59690
17280B19992j4041B3907J53651M19638B78018c5950B37178r9303K9071J3041Q3854
17269B63841B0522K26540J31644j43473A03129b5733C65643h0478C64566d33F9698
$$ plain form
17257 353963 144127 331219 216981 -46649 138798 399523 224456 127964 46189 347619
17247 347619 253725 266321 -264434 139749 106556 27075 237220 20085 355508 -23226 215232
17235 402294 190770 176025 278449 7039 161301 83714 -200731 -76355 121171 269649
17225 269649 204184 186387 46471 160488 212273 182535 296282 210620 398711 225331 372079
17214 372079 134381 568296 319964 -84729 -42469 239468 365161 444387 -17657 407270
17203 251636 86274 307525 269118 112710 169382 69922 232359 204785 264686 134574 -22657
17191 78804 377152 257308 611474 434737 170538 148239 463177 116318 403836 405594
17181 405594 714042 -55397 236997 213277 419917 28503 40378 449072 330223 494363
$$ packed form
17257C53963A44127J87092j14238d6649A38798K60725j75067r6492D6189L01430
17247C47619r3894J2596b64434A39749l3193B7075K10145B0085L35423b3226B15232
17235D02294A90770j4745J02424G039J54262p7587b00731g6355A21171J48478
17225B69649o5465j7797D6471J14017N1785k9738J13747q5662J88091j73380J46748
17214C72079A34381M33915k48332h4729M2260B39468J25693P9226a7657D07270
17203B51636H6274K21251l8407A12710N6672F9922J62437k7574N9901j30112b2657
17191G8804K98348j19844L54166j76737A70538k2299L14938A16318K87518J758
17181D05594L08448e5397B36997k3720K06640B8503J1875M08694j18849J64140
$$ plain form
17171 494363 71670 447880 451945 199410 285474 -160462 554141 166846 168098 296735 321361
17160 321361 401378 -61187 424214 198525 6218 235445 312868 456571 43947 476500 457128
17149 457128 382527 378998 333309 109804 418084 174173 191886 -32682 43656 147866 519022
17138 519022 397523 241885 571665 608755 197872 311246 182039 308165 367803 457289
17128 457289 415641 592483 314015 199546 331739 339588 93912 551449 115543 -200345
17117 154435 318532 592948 223477 154822 135265 311189 505213 167639 512602 299059
17107 299059 173776 615491 485384 579292 233545 358925 341141 375470 656076 489731
17097 489731 257035 337841 166585 206511 358872 246882 357698 613869 708112 296256
$$ packed form
17171D94363G1670L76210M065A99410Q6064a60462E54141A66846J252J28637K4626
17160C21361Q0017f1187D24214A98525F218K29227P7423J43703D3947M32553j9372
17149D57128p4601l529m5689A09804L08280A74173J7713c2682D3656J04210L71156
17138E19022j21499j55638L29780L7090A97872J13374j29207J26126N9638Q9486
17128D57289m1648J76842k78468j14469J32193P849I3912M57537A15543b00345
17117A54435J64097K74416B23477o8655j9557J75924J94024A67639L44963k13543
17107B99059j25283M41715j30107R3908B33545J25380j7784L4329K80606j66345
17097D89731k32696Q0806A66585L9926J52361j11990J10816K56171R4243B96256
$$ plain form
17086 227809 125926 497796 293195 477015 413797 775904 332479 630705 129173 365455
17076 365455 299972 356794 362938 372771 489659 420498 824550 534019 423895 680923 642145
17065 642145 755910 168295 625018 278068 617250 605995 290430 437810 616109 491051
17055 491051 360461 391179 756350 459254 666022 548482 446772 194394 652645 515036
17045 515036 485306 573783 477574 415311 650808 392807 223518 599421 1010836 736527
17035 736527 326748 269280 346341 447889 541561 485877 621986 613499 743115 370438 498718
17024 498718 652499 825616 522822 568474 783228 782788 600701 500667 573709 715015
17014 715015 981881 595593 518321 707750 703122 780043 827127 316840 699884 785987 685225
$$ packed form
17086B27809j01883L71870k04601J83820o3218L62107C32479K98226A29173K36282
17076C65455o5483N6822O144R833J16888o9161M04052k90531j10124K57028l8778
17065F42145J13765A68295M56723B78068L39182j1255B90430J47380J78299j25058
17055D91051j30590L0718L65171k97096K06768j17540j01710A94394M58251j37609
17045E15036k9730Q8477r6209o2263K35497k58001j69289L75903M11415k74309
17035G36527C26748n7468P7061J01548R3672n5684J36109q487J29616C70438J28280
17024D98718J53781J73117l02794M5652K14754m40j82087j00034P3042J41306
17014G15015K66866l86288p7272J89429m628P6921M7084C16840L83044Q6103j00762
$$ plain form
17003 685225 653352 646682 850538 786835 809142 803679 780148 727439 657190 1272262 677102
16992 677102 673808 906563 858935 631120 697709 1104726 693459 863845 636100 841294
16982 841294 1096264 866817 882597 784097 660714 581217 735556 544820 906582 744898
16972 744898 920334 591542 890976 814895 1058325 848406 1009490 866960 1002749 1036905
16962 1036905 875905 1215004 742043 922416 1278782 1090525 744578 1136846 1018202
16953 1018202 1349633 1295968 772436 763681 1186899 1217795 1025934 818023 1155939 1049023
16943 1049023 993596 1059927 1252991 1318922 1404797 1458867 1042029 1186641 1374382 1379072 805308
16932 805308 1134016 1232888 1081143 1376240 1282581 1265440 1197189 1516416 1318921 1399182
$$ packed form
17003F85225l1873o670K03856o3703K2307n463k3531n2709p0249O15072n95160
16992F77102l294K32755m7628k27815O6589M07017m11267J70386k27745K05194
16982H41294K54970k29447J5780r8500j23383p9497J54339j90736L61762j61684
16972G44898J75436l28792K99434p6081K43430k09919J61084j42530J35789L4156
16962A036905j61000L39099m72961J80373L56366j88257l45947L92268j18644
16953A018202L31431n3665n23532q755M23218L0896j91861k07911L37916j06916
16943A049023n5427O6331J93064O5931Q5875N4070m16838J44612J87741M690n73764
16932H05308L28708R8872j51745K95097r3659j7141o8251L19227j97495Q0261
$$ plain form
16922 1399182 1301289 1568324 1250993 1323731 1713603 1565497 1724240 1717707 1646082 1714474
16912 1714474 1693439 1602500 1599816 1533378 1639819 1747563 1376328 1721300 1753399 1738084 2080435
16901 2080435 1903372 1797663 1650052 1652808 2039537 1965861 1979128 1768339 1871081 1733658
16891 1733658 1994148 2112644 1952176 2092653 2113488 2145653 2301811 2075968 2147309 2049603
16881 2049603 2028377 2170451 2141236 2330820 2221868 2643770 2396477 2250435 2551922 2479497
16871 2479497 2320489 2630123 2581637 2428553 2431720 2790605 2837682 2424152 2752554 2668048
16861 2668048 2765840 2889999 3036408 3090504 2709905 2799642 3240560 3393430 2902880 3032878
16851 3032878 3029154 3519460 3158752 3447674 3423505 3547583 3494573 3717514 3657857 3745697
$$ packed form
16922A399182r7893K67035l17331P2738L89872j48106J58743o533p1625O8392
16912A714474k1035r0939k684o6438J06441J07744l71235L44972L2099j5315L42351
16901B080435j77063j05709j47611K756L86729p3676J3267k10789J02742j37423
16891A733658K60490J18496j60468J40477K0835L2165J56158k25843P1341r7706
16881B049603k1226J42074k9215J89584j08952M21902k47293j46042L01487p2425
16871B479497j59008L09634m8486j53084L167L58885M7077m13530L28402q4506
16861B668048R7792J24159J46409N4096l80599Q9737M40918J52870m90550J29998
16851C032878l724M90306l60708K88922k4169J24078n3010K22941n9657Q7840
$$ plain form
16841 3745697 3974580 3694602 3791788 3569729 4031063 3846997 4021550 4439615 4298091 4514021
16831 4514021 4521414 4819827 4670736 4750973 4806418 5158553 5083401 5128094 5478205 5149676
16821 5149676 5739401 5596010 5692168 5700159 5713555 5995712 5786745 5953582 5969081 6159325
16811 6159325 6446561 6761681 6956846 7025294 7385844 6948224 6990462 7367543 7719786 8042914
16801 8042914 8124870 8292824 8476885 8679477 8704277 9254288 9428893 9812235 9594682 10193485
16791 10193485 10208389 10490691 10847096 11173723 11630960 11947660 12411265 12431934 12887985 13447725
16781 13447725 13525789 13972131 14453688 14539589 15357048 15813587 16249281 16857145 17421526 18446065
16771 18446065 18761697 19154738 20142327 20582385 21348432 22117484 22696906 23951233 24848391
$$ packed form
16841C745697K28883k79978R7186k22059M61334j84066J74553M18065j41524K15930
16831D514021P393K98413j49091Q0237N5445L52135p5152M4693L50111l28529
16821E149676N89725j43391R6158P991J3396K82157k08967J66837J5499J90244
16811F159325K87236L15120J95165O8448L60550m37620M2238L77081L52243L23128
16801H042914Q1956J67954J84061K02592K4800N50011J74605L83342k17553N98803
16791A0193485J4904K82302L56405L26627M57237L16700M63605K0669M56051N59740
16781A3447725P8064M46342M81557Q5901Q17459M56539M35694O07864N64381J024539
16771A8446065L15632L93041R87589M40058P66047P69052N79422J254327Q97158
$$ plain form
16762 24848391 26014291 27219087 27776998 28982453 30495635 31109894 32915920 34151567
16754 34151567 35852122 37463424 39355420 41141928 42898128 44941883 47463609 49756605
16746 49756605 52460848 55255000 58106307 60933452 64336291 67757255 71211626 75043967
16738 75043967 79588869 84113567 89021761 93688429 98962195 104251983 110067800 116663065
16730 116663065 122504250 128838496 135263557 141968749 148212022 154675178 160191119 165677462
16722 165677462 170428326 174620164 177764361 180028195 181367096 181234173 180800720 178661463
16714 178661463 175673972 171590271 167075045 161984412 156164328 149818962 143406946 136742471
16706 136742471 130373522 123776087 117309591 111341946 105308650 99400771 94262101 88935690
$$ packed form
16762B4848391J165900J204796N57911J205455J513182O14259J806026J235647
16754C4151567J700555J611302J891996J786508J756200K043755K521726K292996
16746D9756605K704243K794152K851307K827145L402839L420964L454371L832341
16738G5043967M544902M524698M908194M666668N273766N289788N815817O595265
16730A16663065N841185O334246O425061O705192O243273O463156N515941N486343
16722A65677462M750864M191838L144197K263834J338901j32923m33453k139257
16714A78661463k987491m083701m515226n090633n820084o345366o412016o664475
16706A36742471o368949o597435o466496n967645o033296n907879n138670n326411
$$ plain form
16698 88935690 84195922 79445048 75310018 71301453 67708022 63822175 60677380 57677949
16690 57677949 54370675 51497108 49489762 46938398 44539292 42566062 40663505 38766543
16682 38766543 37233551 35405171 33826347 32741369 31044791 29727298 28587601 27523497
16674 27523497 26468541 25340398 24470507 23319264 22518588 21607591 21089237 20310335 19320774
16665 19320774 18789852 18137346 17320180 16870049 16146859 15952714 15411301 14922044 14388386
16656 14388386 13937294 13666095 13149599 12571313 12219245 11752389 11698551 11498099 10970108
16647 10970108 10447617 10515216 10100032 9995212 9868733 9385147 9319019 9074747 8752605 8171506
16637 8171506 8217718 7989129 7875185 7613450 7590804 7545595 7216151 6867666 6826305 6859904
$$ packed form
16698H8935690m739768m750874m135030m008565l593431l885847l144795k999431
16690E7677949l307274k873567k007346k551364k399106j973230j902557j896962
16682C8766543j532992j828380j578824j084978j696578j317493j139697j064104
16674B7523497j054956j128143q69891j151243q00676r10997n18354p78902r89561
16665A9320774n30922o52506q17166m50131p23190j94145n41413m89257n33658
16656A4388386m51092k71199n16496n78286l52068m66856n3838k00452n27991
16647A0970108n22491O7599m15184j04820j26479m83586o6128k44272l22142n81099
16637H171506M6212k28589j13944k61735k2646m5209l29444l48485m1361L3599
$$ plain form
16627 6859904 6257810 6241122 6127177 6212828 6085787 5989599 6124326 5435473 5659194 5706047
16617 5706047 5063086 5190436 5369013 4982448 4812887 5086909 4875236 4797583 4817478 4665689
16607 4665689 4327295 4390298 4394890 4346363 4280300 4116839 4031590 4058351 3571197 4090944 4062406
16596 4062406 3612527 3417772 3440105 3886423 3298419 3390999 3420695 3316540 3659908 3252469
16586 3252469 3241708 3061199 2951781 3482074 2663741 2900650 3129842 2907676 2946655 2651698
16576 2651698 2518569 2506942 2471577 2496773 2757718 2552913 2409264 2531758 2418963 2309736
16566 2309736 2771284 2141308 2218363 2142077 2336325 2308700 2080602 2421043 2436529 2424422
16556 2424422 1981195 1545774 2021484 2094892 2142804 2333573 1830775 1718540 1878765 2021718
$$ packed form
16627F859904o02094j6688j13945Q5651j27041r6188J34727o88853K23721M6853
16617E706047o42961J27350J78577l86565j69561K74022k11673p7653J9895j51789
16607D665689l38394O3003M592m8527o6063j63461q5249K6761m87154N19747k8538
16596D062406m49879j94755K2333M46318n88004R2580K9696j04155L43368m07439
16586C252469j0761j80509j09418N30293q18333K36909K29192k22166L8979k94957
16576B651698j33129j1627l5365K5196K60945k04805j43649J22494j12795j09227
16566B309736M61548o29976P7055p6286J94248k7625k28098L40441J5486j2107
16556B424422m43227m35421M75710P3408M7912J90769n02798j12235J60225J42953
$$ plain form
16546 2021718 1897908 1814655 1873380 1648173 1781288 1479143 1339188 1626882 1792045 1499638
16536 1499638 1578718 1427632 2005884 1698576 1530772 1456319 1555053 1672710 1549164 1552053
16526 1552053 999014 1451519 1632106 1270868 1519726 1114302 1429634 1358312 1396183 1577190
16516 1577190 1627649 1346030 1491608 1098521 1144035 1421554 1494660 1254915 1106132 1114298
16506 1114298 1074748 1315500 1074842 986069 1089519 932400 908898 947075 881200 1019134
16496 1019134 997511 757663 1082402 1088427 813419 1297279 1044800 1080057 994093 1463696
16486 1463696 1133304 1282674 830818 825877 969541 786331 772255 1130467 918824 901795
16476 901795 622328 843098 865940 749782 861666 889475 895599 1198492 1014970 735913
$$ packed form
16546B021718j23810q3253N8725k25207J33115l02145j39955K87694J65163k92407
16536A499638P9080j51086N78252l07308j67804p4453R8734J17657j23546K889
16526A552053n53039M52505J80587l61238K48858m05424L15332p1322L7871J81007
16516A577190N0459k81619J45578l93087M5514K77519P3106k39745j48783Q166
16506A114298l9550K40752k40658q8773J03450j57119k3502L8177o5875J37934
16496A019134k1623k39848L24739O025k75008M83860k52479L5257q5964M69603
16486A463696l30392J49370m51856m941J43664j83210j4076L58212k11643j7029
16476I01795k79467K20770K2842j16158J11884K7809O124L02893j83522k79057
$$ plain form
16466 735913 1008920 869954 836742 826631 660271 905737 746981 943978 850838 710198
16456 710198 1052366 703215 747373 631702 687208 910520 777359 618432 722629 827143
16446 827143 667610 669267 690918 881909 632922 577371 870630 454344 512452 676753
16436 676753 415211 659803 868464 859638 426099 598269 372711 345850 608207 329041
16426 329041 424248 164388 1070121 611699 503235 532006 854214 518660 520510 448878
16416 448878 755974 648638 668701 441210 424440 783153 497999 530492 652816 290777
16405 381437 666410 432910 409002 678087 718312 476330 553096 428087 766606 625100
16395 625100 447324 755205 645731 968313 225385 158952 806543 292903 259348 459380
$$ packed form
16466G35913K73007j38966l3212j0111j66360K45466j58756J96997r3140j40640
16456G10198L42168l49151M4158j15671N5506K23312j33161j58927J04197J04514
16446H27143j59533J657K1651J90991k48987n5551K93259m16286N8108J64301
16436F76753k61542K44592K08661q826D26099J72170k25558k6861K62357k79166
16426C29041R5207A64388R05733m58422j08464K8771L22208l35554J850p1632
16416D48878L07096j07336K0063k27491j6770L58713k85154L2493J22324B90777
16405C81437K84973k33500k3908K69085M0225k41982P6766j25009L38519j41506
16395F25100j77776L07881j09474L22582B25385o6433O47591B92903l3555K00032
$$ plain form
16385 459380 584903 723196 311191 361362 489157 331951 583487 621342 806599 617707
16375 617707 457310 528385 225172 306373 314123 490090 712271 291472 239208 533462
16365 533462 524467 467888 631081 477693 463000 503724 334200 356048 172877 371891 414881
16354 414881 367894 331596 76013 516475 219504 319680 262045 236091 506407 463981 460281
16343 460281 628848 536239 -78300 441435 510598 152779 412614 498880 251380 154487
16333 154487 338295 190702 140305 396898 263330 253803 86260 124411 452967 19822 227627
16322 227627 469531 737769 408620 381072 378678 343395 166398 442120 421682 -65159 54601
16310 285740 699248 441870 67718 170622 76745 442658 270505 807886 610017 203446
$$ packed form
16385D59380J25523J38293C11191N0171J27795j57206K51536L7855J85257j88892
16375F17707j60397P1075B25172Q1201P750J75967K22181B91472n2264K94254
16365E33462q995n6579J63193j53388j4693M0724j69524K1848A72877J99014M2990
16354D14881m6987l6298G6013M40462B19504J00176n7635k5954K70316m2426l700
16343D60281J68567r2609g8300D41435O9163A52779K59835Q6266k47500r6893
16333A54487J83808j47593n0397K56593j33568r527H6260L8151L28556A9822K07805
16322B27627K41904K68238l29149k7548k394l5283A66398K75722k0438f5159E4601
16310B85740M13508k57378F7718J02904G6745L65913j72153N37381j97869B03446
$$ plain form
16299 281011 220152 159388 627952 389859 134006 75204 200797 397229 221208 204252
16289 204252 243703 411163 262492 330858 182705 143688 349041 174393 17161 367051
16279 367051 490086 165668 330722 247288 415977 -5383 306949 -41792 369402 188104
16269 188104 279624 292877 49154 379205 116567 -86427 197868 198128 43209 312645 626574
16258 626574 -171828 135340 113707 201641 289602 267075 -7931 219283 139399 290382 386528
16247 386528 -46369 229237 6178 490803 218294 158990 -17580 249035 326413 205592 144435
16236 144435 93486 211674 7592 150917 500110 211661 391873 -106988 62714 114763
16226 114763 571929 -4523 428814 28899 472857 112971 279206 315908 364851 203818
$$ packed form
16299B81011o0859o0764M68564k38093A34006n8802J25593J96432j76021j6956
16289B04252L9451J67460j48671O8366j48153l9017K05353A74393A7161L49890
16279C67051J23035A65668J65054q3434J68689e383C06949d1792C69402j81298
16269A88104R1520J3253D9154L30051A16567h6427A97868K60D3209K69436L13929
16258F26574a71828A35340k1633Q7934Q7961k2527g931B19283p9884J50983R6146
16247C86528d6369B29237F178M84625B18294n9304a7580B49035P7378j20821o1157
16236A44435n0949J18188G592J43325L49193B11661J80212a06988F2714N2049
16226A14763M57166d523D28814B8899M43958A12971J66235L6702M8943j61033
$$ plain form
16216 203818 -142653 292892 250214 115769 -20841 282893 -100983 319134 -47499 159651
16205 -332841 123157 -49433 314833 -362439 324290 82019 87935 242685 265430 -121896
16194 207844 -6582 185533 120908 -10922 405413 107189 127488 464435 35626 45200 204032
16183 204032 211754 79357 119423 234648 237461 42510 -92309 -119303 270274 327082 -162804
16171 70487 -92037 185153 49634 289663 -33119 51722 -99024 -43073 110415 -168294 15498
16159 180067 217137 -117264 48508 -130241 287472 -199362 158602 198438 -44556 336 -92114
16147 -93748 218450 379210 179044 138742 269723 120534 67848 179236 98732 -20446
16136 408176 187097 -85813 135524 -7224 -122438 604260 134792 3833 42580 -22944 14584
$$ packed form
16216B03818a42653B92892m2678A15769b0841B82893a00983C19134d7499A59651
16205c32841A23157d9433C14833c62439C24290H2019N916J54750K2745a21896
16194B07844f582A85533o4625a0922D05413A07189K0299L36947C5626R574J58832
16183B04032P722G9357M0066J15225K813D2510i2309k6994B70274N6808a62804
16171G0487i2037A85153D9634K40029c3119E1722i9024d3073A10415a68294A5498
16159A80067L7070a17264D8508a30241B87472a99362A58602L9836d4556C36i2114
16147i3748B18450J60760A79044m0302J30981A20534n2686J11388q0504b0446
16136D08176A87097h5813A35524g224j15214F04260A34792C833L8747b2944A4584
$$ plain form
16124 -59851 -26239 136733 480409 -223581 28926 244202 -74447 314726 -218997 150699
16113 22489 438572 294906 126244 -46469 27937 333843 110129 100692 279497 28536 358190
16102 358190 -121264 171794 206975 196408 231658 89810 -122705 21885 -188136 -369545
16092 -369545 103194 39945 165782 -26021 -103036 195842 -131070 154991 -141169 -245260
16082 -245260 234742 -357455 173971 -87871 -196726 43777 -135555 320975 -210342 -168586
16072 -168586 -172414 -10715 14141 261096 -54308 25575 149565 11965 20503 -104996 63929
16060 -362912 -53942 105492 36540 19439 -21949 147016 70218 32966 -4917 -229248 240965
16048 367219 265607 -129801 -102490 68667 98179 312586 -257440 -254897 -142674 352946
$$ packed form
16124e9851b6239A36733L43676b23581B8926K15276g4447C14726b18997A50699
16113B2489M16083j43666A26244d6469B7937L05906A10129r437J78805B8536L29654
16102C58190a21264A71794L5181j0567L5250H9810a22705B1885a88136j81409
16092c69545A03194C9945J25837b6021p7015A95842a31070A54991a41169j04091
16082b45260B34742c57455A73971h7871j08855D3777a35555C20975b10342M1756
16072a68586l828a0715A4141K46955e4308B5575J23990A1965Q538a04996F3929
16060c62912e3942A05492C6540j7101b1949A47016G0218C2966d917k24331B40965
16048C67219j01612a29801K7311F8667K9512K14407b57440K543J12223C52946
$$ plain form
16037 173710 -45698 -87015 -265853 -33710 272294 307423 -141344 -337245 -90631 131122
16026 219179 -134455 23740 -27077 152307 321078 -22765 59080 223869 129007 -202306
16015 -334840 -104452 -96000 104381 28437 189655 -368112 97863 47309 -178464 -16191 -57137
16004 -57137 -183417 119938 176028 -149910 186190 64687 -312041 202910 104604 -133669
15993 -67952 273076 -15575 -77590 40418 -219498 151502 88911 -128535 184404 -204190
15982 93776 160438 -33845 642862 103376 273271 105679 -54533 120163 62900 173535
15972 173535 209966 -34976 155569 173274 133841 -256113 -307330 -14189 79525 386264 84828
15960 -215284 -48909 -301057 -94280 -125954 -101451 37516 249170 175606 18455 -99398 -173829
$$ packed form
16037A73710d5698m1317j78838c3710B72294L5129a41344j95901i0631A31122
16026B19179a34455B3740b7077A52307J68771b2765E9080J64789r4862b02306
16015c34840a04452Q452A04381B8437J61218c68112I7863D7309a78464a6191m0946
16004e7137j26280A19938N6090a49910A86190F4687c12041B02910r8306a33669
15993f7952B73076a5575o2015D0418b19498A51502o2591a28535A84404b04190
15982I3776O6662c3845F42862A03376J69895A05679e4533A20163n7263J10635
15972A73535L6431c4976A55569J7705l9433b56113n1217a4189G9525L06739H4828
15960b15284d8909k52148i4280l1674K4503C7516K11654p3564A8455i9398p4431
$$ plain form
15949 -173829 53339 93639 -117172 -168830 -89554 232955 -501646 47889 -49473 -52058 111242
15937 -42281 -284871 -293976 -148205 10706 -258316 -316168 -41856 -94201 138645 265859 -487646
15925 -158987 -149138 -63180 164218 -91788 82216 -145257 -188085 105314 -311029 -369999 199480
15913 -78192 -243905 -219326 -67406 -91094 -200069 220302 -167788 -198134 -42834 319236 -108849
15901 -55091 -242803 83437 325395 74790 166276 12252 -92501 -228565 -103203 206989 -15751
15889 -193713 370597 -140254 -92494 -218546 -175524 35515 -212594 -115803 62064 5769 -123330
15877 -151935 -225831 -161808 202437 -363525 9078 -159144 335149 96124 70663 -46587 -176493
15866 -176493 201773 -205555 -296543 -150903 263792 -50732 -123475 63538 -198958 201728
$$ packed form
15949a73829E3339M0300a17172n1658P9276B32955e01646D7889d9473k585A11242
15937d2281k42590r105J45771A0706b58316n7852d1856n2345A38645J27214d87646
15925a58987R849f3180A64218i1788H2216a45257m2828A05314c11029n8970A99480
15913g8192j65713K4579f7406k3688j08975B20302a67788l0346d2834C19236a08849
15901e5091j87712H3437K41958G4790R1486A2252i2501j36064a03203B06989a5751
15889a93713C70597a40254M7760j26052M3022C5515b12594R6791F2064E769a23330
15877a51935p3896O4023B02437c63525I078a59144C35149I6124k5461d6587j29906
15866a76493B01773b05555r0988J45640B63792e0732p2743F3538a98958B01728
$$ plain form
15855 -74098 304325 103327 -176 -41755 249901 163214 -53066 -90992 51405 62397 30558
15843 46797 -37316 80330 47636 -156514 373888 58681 244445 89694 123861 55252 80125
15832 80125 -200101 -33913 -110561 -261491 -319169 221635 -94068 126304 -138915 88737 -157388
15820 30668 -42894 -114553 -109214 -70581 -203592 -435719 13505 299503 270929 70064 -224465
15808 64824 -42961 -67634 -213276 -202771 -216867 -241125 174524 -249365 33486 -180378 -144700
15797 -144700 -18383 58237 -128087 179355 80972 46865 128235 128772 118760 76305 -177566
15785 -135365 -15718 -192410 65209 -160007 25649 573219 -255958 33768 -134139 -168788
15775 -168788 -43086 -124690 69532 122398 26229 -22545 -58141 107028 -498201 103847 -302390
$$ packed form
15855g4098C04325A03327a76m1579B49901q6687e3066l7926E1405J0992C0558
15843D6797c7316H0330l2694a56514C73888E8681J85764H9694L4167E5252K4873
15832H0125b00101c3913p6648j50930n7678B21635i4068A26304a38915H8737a57388
15820C0668d2894p1659N339L8633j33011k32127A3505K85998k8574G0064b24465
15808F4824d2961k4673j45642J0505j4096k4258A74524b49365C3486a80378L5678
15797a44700a8383E8237a28087A79355H0972l4107Q1370N37j0012m2455a77566
15785a35365a5718j76692F5209a60007B5649N47570b55958C3768a34139l4649
15775a68788d3086q1604F9532N2866B6229b2545l5596A07028d98201A03847c02390
$$ plain form
15763 -17010 232067 47545 593 14618 94092 -190134 -74704 44068 -245047 -401740 -106279
15751 71450 -386045 -229964 -59635 168667 -80587 86510 -60133 168146 22850 203954 99443
15739 -21489 188427 -52767 -30496 370031 -56680 -47029 -298041 -134335 323279 -13326 -55334
15728 -55334 -155728 304383 -605383 -70106 -230492 -185787 -48611 -509185 222723 -2801 -140464
15717 -140464 358805 -51401 -346175 -213100 2988 -233369 93133 111011 37968 -217110 -105519
15705 -102693 -320173 43770 -126774 -89930 -24916 124447 18030 -214938 -41677 52049 -54030
15693 136905 -132009 123174 -125996 140893 -454985 -197548 55063 359437 119292 -240207
15682 -136182 141684 -80661 -219433 292129 -80198 -107262 -9098 186289 476968 -72229 -143293
$$ packed form
15763a7010B32067D7545E93J4025P9474a90134g4704D4068b45047j56693a06279
15751G1450c86045J56081e9635A68667h0587H6510f0133A68146B2850J81104I9443
15739b1489A88427e2767K2271C70031e6680R651k51012a34335C23279a3326m2008
15728e5334j00394C04383f05383g0106j60386M4705d8611m60574B22723b801j37663
15717a40464C58805e1401k94774J33075B988b33369I3133J7878C7968b17110a05519
15705a02693k17480D3770a26774L6844b4916A24447A8030b14938d1677E2049e4030
15693A36905a32009A23174a25996A40893d54985a97548E5063L04374A19292b40207
15682a36182A41684h0661j38772B92129h0198k7064i098A86289K90679g2229p1064
$$ plain form
15671 -143293 118384 39761 -23795 181205 39617 -24148 -346453 119984 20032 -146871
15660 -27189 26555 -10440 -60777 -249035 -234109 -397567 373754 -169637 -85838 120933 -403003
15648 15620 -24042 325593 -42823 -207543 31851 -12385 -237850 -91655 -283684 -43674 -58038
15637 -58038 36178 94531 -148216 -227758 -49254 -2289 63001 -261686 -136810 -78187 -163149
15626 -163149 -276149 -335083 28849 51580 25964 -41422 -65214 -467160 56449 230779 -86896
15614 92323 -374523 114565 125387 -31085 -173135 -552942 77265 -295357 -31362 -56416 -499133
15603 -499133 -292667 -183375 285817 160783 -175855 233817 -55098 -240630 -163534 -59321
15592 -85285 9815 52420 -271195 -117219 153886 -24251 423688 333609 104527 35650 -25338
$$ packed form
15671a43293A18384C9761b3795A81205C9617b4148l22305A19984B0032a46871
15660b7189B6555a0440n0337j88258J4926j63458C73754a69637Q3799A20933d03003
15648A5620b4042C25593d2823j64720C1851a2385k25465i1655j92029d3674j4364
15637e8038C6178N8353a48216p9542d9254b289F3001b61686J24876N8623q4962
15626a63149j13000n8934B8849K2731k5616d1422k3792m01946E6449J74330h6896
15614I2323c74523A14565J0822c1085j42050l79807G7265b95357c1362k5054m42717
15603d99133K06466J09292B85817j25034a75855B33817e5098j85532P7096e9321
15592h5285I815M2605b71195a17219A53886b4251D23688r0079A04527C5650b5338
$$ plain form
15580 -10419 -21596 -327558 -136633 132759 -173236 -83124 104854 8176 101199 -80123 81887
15568 -256288 -432605 95987 -126554 -167448 -325629 -191143 371772 339151 139241 107271
15558 107271 118335 -70176 253635 17525 -306380 -40162 228825 155190 -210305 -392848
15548 -392848 489833 -73861 -229800 74885 103185 73079 -237307 -91827 142505 206632 -6459
15536 2343 187801 -178653 6557 2287 269890 -65674 -32908 -62473 -127944 -112398 53080 -162718
15523 -77924 -43728 188512 106208 92518 48147 68826 -189400 68293 -37534 227618 246364
15512 246364 -116086 99261 227522 -25342 -14563 45730 -70588 -223745 80487 -29581 54769
15500 229786 -338091 136329 40599 -152622 -172789 177278 301166 517359 -364864 -34067
$$ packed form
15580a0419j1177l05962a36633A32759a73236h3124A04854H176R3023h0123H1887
15568b56288j76317I5987a26554m0894j58181J34486C71772l2621A39241l1970
15558A07271J1064g0176B53635A7525c06380d0162B28825p3635b10305j82543
15548c92848D89833g3861j55939G4885K8300l0106b37307i1827A42505O4127f459
15536B343J85458a78653F557B287K67603f5674L2766k9565o5471J5546E3080a62718
15523g7924L4196A88512q2304j3690m4371K0679a89400F8293c7534B27618J8746
15512B46364a16086I9261J28261b5342J0779D5730g0588j53157H0487b9581E4769
15500B29786c38091A36329D0599a52622k0167A77278J23888K16193c64864c4067
$$ plain form
15489 -200281 220937 48524 107053 -238601 -251562 -627 -27247 29795 -249866 102692 -387155
15477 1638 90228 123739 -245573 146203 -113607 -235052 -39329 23853 -348901 -44771 -401077
15466 -401077 -64540 181747 -216074 5246 167397 -59023 518113 -165433 369850 -352142
15455 26788 14338 -187906 -166709 65944 314599 -54831 165534 -150953 49327 17098 192227
15444 192227 293739 -111781 -347079 111894 -236281 36871 33900 -58116 -200898 43134
15433 -158294 -42373 126362 703771 -196327 -272176 -116251 28149 -132838 103901 350238
15423 350238 170418 86159 -177173 280477 -165679 -157769 -357685 164263 61273 122917
15413 122917 6984 -198241 -315959 -122236 233388 165115 -34999 86944 -68988 29976 58208
$$ packed form
15489b00281B20937D8524N8529b38601j2961f27k6620B9795b49866A02692c87155
15477A638Q8590L3511b45573A46203a13607j21445c9329B3853c48901d4771l56306
15466d01077f4540A81747b16074E246J62151e9023E18113a65433C69850c52142
15455B6788j2450a87906K1197F5944K48655e4831A65534a50953D9327A7098J75129
15444A92227J01512a11781k35298A11894b36281C6871k971e8116j42782D3134
15433a58294d2373A26362N77409a96327p5849a16251B8149a32838A03901K46337
15423C50238A70418q4259a77173B80477a65679P910j99916A64263F1273O1644
15413A22917F984a98241j17718a22236B33388o8273c4999H6944f8988B9976K8232
$$ plain form
15402 58208 -130981 -52974 -389077 -116119 -28580 -3315 3995 206706 -49011 166382 -343789
15390 -28472 8918 -151327 -131553 47548 143664 -56731 159623 248358 211070 -41208 -37664 -54756
15378 -54756 -427663 -69578 48279 -52796 -56756 16324 -79840 -146254 72659 228872 -48046
15366 -168132 -6946 85565 -274226 384719 180533 139823 65744 19782 -387511 129096 53660
15354 57755 209385 -25582 -105591 -119611 -411561 -30847 231119 -160858 -306456 -57156 -164157
15343 -164157 80981 -57876 -82530 -20958 -96296 106615 86012 -207818 288624 -55939 -64122
15332 -64122 101806 -183405 -66491 -42575 26030 -204085 -54230 -84906 -122127 20844 -223567
15320 -83141 -154199 -150809 84904 -98844 9332 112868 226007 -158435 71005 -309484 57348
$$ packed form
15402E8208a30981e2974l36103a16119b8580c315C995K02711d9011A66382c43789
15390b8472H918a51327J9774D7548R6116e6731A59623Q8735l7288d1208L544j7092
15378e4756l72907f9578D8279e2796l960A6324g9840o6414G2659J56213d8046
15366a68132f946H5565b74226C84719A80533m0710F5744A9782c87511A29096E3660
15354E7755J51630b5582q0009j4020k91950c0847B31119a60858j45598e7156j07001
15343a64157H0981e7876k4654b0958p5338A06615k0603b07818B88624e5939q183
15332f4122A01806a83405f6491K3916B6030b04085e4230l0676l7221B0844b23567
15320h3141p1058L390H4904i8844I332J03536J13139a58435G1005c09484E7348
$$ plain form
15308 86040 -11736 -180669 -201571 -215905 237979 225983 269636 164845 94358 220611 166485
15297 166485 99248 313439 256499 192710 155257 353759 74432 150916 -151210 -269298 -9973
15285 226674 298909 -278661 300054 123749 -106657 96730 -262791 175278 28044 55464
15275 55464 44440 59210 -318696 169630 -15692 14798 27961 64898 59721 243161 -106609
15263 -35103 162564 196103 16895 175983 174777 -119359 -57776 -65654 -8119 -111944 -2017 79194
15250 -119747 258550 217691 180092 613250 830166 2432905 2191044 1892135 2773899 735367
15239 760777 643539 302384 -103846 70438 212303 -71186 59794 53722 197562 124399 -8704
15227 -285972 11120 -286832 26453 106021 -121635 74626 65474 -203014 216908 -117537 229581
$$ packed form
15308H6040a1736j68933k0902j4334B37979j1996M3653j04791p0487J26253n4126
15297A66485o7237K14191n6940o3789l7453J98502G4432P6484a51210j18088i973
15285B26674P2235b78661C00054A23749a06657I6730b62791A75278B8044K7420
15275E5464j1024J4770c18696A69630a5692A4798J3163L6937n177J83440a06609
15263c5103A62564L3539A6895J59088j206a19359e7776p878h119j03825b017G9194
15250a19747B58550m0859l7599M33158K16916J602739k41861k98909Q81764G35367
15239G60777j17238C02384a03846G0438J41865g1186E9794o072J43840p3163h704
15227b85972A1120b86832B6453P9568a21635G4626r152b03014B16908a17537B29581
$$ plain form
15215 427684 -84189 15678 -25506 12233 43512 274971 -91236 -167664 -2509 138078 -61316
15203 151740 208284 164471 -34524 -173150 263743 -44413 14057 104284 50604 -107875 -47050
15191 456462 65618 154163 -96833 42451 -198599 -253636 281616 -88891 148530 -98136 157485
15179 285019 163998 62640 13527 153587 12210 203537 441936 300621 -126563 -92514
15169 -92514 150150 203428 111657 -108528 186638 -220678 44359 141904 -40229 94515 300582
15158 300582 -138159 10502 60248 198976 -244473 -3482 -130287 75581 -98177 -10557 250073
15146 106338 21050 209584 405413 236849 124019 -3751 30701 -139492 242554 239293 -18711
15134 396504 244470 338771 -86658 187878 94270 315196 413528 375578 310862 118528 59215
$$ packed form
15215D27684h4189A5678b5506A2233L1279K31459i1236p6428b509A38078f1316
15203A51740N6544m3813c4524j38626B63743d4413A4057R0227E0604a07875d7050
15191D56462F5618Q8545i6833D2451a98599n5037B81616h8891A48530i8136A57485
15179B85019j21021F2640A3527J40060A2210J91327K38399j41315a26563L4049
15169i2514A50150N3278r1771a08528A86638b20678D4359R7545d0229I4515K06067
15158C00582a38159A0502M9746J38728b44473c482j26805G5581i8177a0557B50073
15146A06338B1050J88534J95829j68564j12830c751C0701a39492B42554l261a8711
15134C96504j52034R4301h6658A87878r3608K20926R8332l7950o4716A18528E9215
$$ plain form
15122 93627 155974 88429 262483 18420 34405 -93188 348729 -121234 165307 315125 117715
15110 140197 105084 257744 177566 -60759 445596 209826 91889 296532 90025 -58286 16857
15098 98086 86493 209258 44130 113843 -52706 -183169 360699 -14421 -208024 -107802 -18104
15086 262851 122567 136980 -209787 12657 109471 -105531 374916 146851 32298 184718
15076 184718 275451 -40324 367588 -212187 153769 165421 281681 112796 441216 158103
15065 77140 288 -169878 192663 187014 300270 408769 133030 -27100 180753 -36378 122810
15053 150392 40291 47466 -103796 381315 42729 -9508 73835 390196 264485 -74241 170845
15041 589013 -149030 356933 488329 -76222 74710 -55663 356418 102571 -116834 549213
$$ packed form
15122I3627O2347o7545J74054A8420J5985i3188C48729a21234A65307J49818A17715
15110A40197l5113J52660q0178f0759D45596B09826I1889K04643I0025e8286A6857
15098I8086j1593J22765D4130O9713e2706j30463C60699a4421j93603J00222a8104
15086B62851A22567J4413b09787A2657R6814a05531C74916A46851C2298J52420
15076A84718R0733d0324C67588b12187A53769J1652J16260A12796L28420A58103
15065G7140B88a69878A92663n649J13256J08499A33030b7100A80753c6378A22810
15053A50392D0291P175a03796C81315D2729i508G3835L16361j25711g4241A70845
15041E89013a49030C56933J31396g6222G4710e5663C56418A02571a16834E49213
$$ plain form
15030 19446 88082 104995 219790 155734 593869 136784 54095 404959 460369 180757 450481
15019 450481 273317 391033 -156488 158120 344168 -26489 -131130 608018 16508 76495
15009 76495 -32039 33835 112981 221336 -28488 138996 398336 225518 245130 189783 523107
14998 523107 512075 203255 279839 48953 71197 327670 166499 -79970 41855 392192 305417
14987 305417 81044 -118210 201820 429625 37428 69899 -52483 -93352 -2130 349259 321577
14976 321577 110563 362571 199307 -172305 480556 -76602 -150341 389493 352117 402577
14966 402577 370142 208402 270573 452326 105209 63781 650194 428965 373239 232337
14956 232337 -85599 246438 79261 423591 118678 -10704 536948 -44241 407383 461209
$$ packed form
15030A9446O8636J6913J14795o4056M38135A36784E4095L50864N5410A80757K69724
15019D50481j77164J17716a56488A58120J86048b6489j04641F08018A6508N9987
15009G6495c2039C3835P9146J08355b8488A38996K59340j72818J9612n5347L33324
14998E23107j1032B03255P6584D8953K2244K56473j61171g9970D1855L50337q6775
14987C05417H1044a18210B01820K27805C7428L2471e2483m0869b130C49259k7682
14976C21577A10563K52008j63264a72305D80556g6602p3739C89493l7376N0460
14966D02577l2435j61740O2171J81753A05209m1428N86413k21229n5726j40902
14956B32337h5599B46438G9261L44330A18678a0704E36948d4241D07383N3826
$$ plain form
14946 461209 311452 300267 319461 149595 544399 27531 494656 28883 176665 503290
14936 503290 247261 330941 190972 208936 97124 581739 268438 311366 206781 328894
14926 328894 56320 227536 126137 -26860 347350 276871 489444 379542 404224 254407
14916 254407 228455 234973 139170 469023 76868 222383 -3021 369739 364010 476434 212874
14904 133946 535984 14127 182021 329762 227876 281753 215700 381165 391519 298605
14894 298605 234652 361739 660027 369863 506832 161868 346698 154194 393898 366870
14884 366870 499555 420968 296336 232861 318850 440738 411601 383362 206757 68933 526143
14873 526143 12837 636607 520391 386788 493064 608929 684118 835957 460707 818289
$$ packed form
14946D61209j49757j1185J9194A49595L94804B7531M67125B8883J47782L26625
14936E03290B47261Q3680j39969J7964I7124M84615B68438M2928j04585J22113
14926C28894E6320J71216j01399b6860C47350p0479K12573j09902K4682j49817
14916B54407k5952O518r5803L29853G6868J45515c021C69739n729J12424B12874
14904A33946M02038A4127J67894J47741j01886N3877o6053J65465J0354r2914
14894B98605o3953J27087K98288k90164J36969A61868J84830A54194K39704k7028
14884C66870J32685p8587j24632o3475Q5989J21888k9137k8239j76605F8933M57210
14873E26143A2837O23770j16216j33603J06276J15865P5189J51839l75250L57582
$$ plain form
14863 818289 634076 523102 596009 545689 166813 251230 272145 372518 301674 240061 389101
14852 389101 637863 400159 313799 514855 491710 687961 366426 133345 239450 263151
14842 263151 557176 282933 342248 348036 338965 317055 189129 293378 492361 486537 521509
14831 521509 549209 590361 273195 22439 211286 646868 645658 596121 487341 418983 653412
14820 653412 1025001 390272 692512 196674 615306 454186 719970 394714 902475 226952
14809 251866 425939 617489 417230 610299 571972 571715 398043 321641 671377 393905
14799 393905 757972 387052 473755 499171 528249 207893 564258 582121 514130 249222
14788 750202 270696 204708 673022 452115 762484 504931 351493 667997 591396 605212
$$ packed form
14863H18289j84213j10974P2907n0320A66813Q4417K0915J00373p0844o1613J49040
14852C89101K48762k37704q6360K01056k3145J96251l21535A33345J06105K3701
14842B63151K94025k74243N9315N788r071k1910j27926J04249J98983n824L4972
14831E21509K7700M1152B73195B2439J88847M35582j210m9537j08780o8358K34429
14820F53412L71589C90272L02240A96674M18632j61120K65784l25256N07761B26952
14809B51866J74073J91550k00259J93069l8327k57j73672p6402L49736k77472
14799C93905L64067l70920Q6703K5416K9078B07893L56365J7863o7991B49222
14788G50202B70696o5988M68314k20907L10369k57553j53438L16504p6601J3816
$$ plain form
14778 605212 937227 440086 198351 553110 211634 474649 434029 361336 552858 449787
14768 449787 412049 477913 410815 663700 318680 298683 744605 261912 610113 771915
14758 771915 605425 656160 437770 660757 476764 513433 660699 695264 799671 566711
14748 566711 837638 844853 454208 679336 736336 801591 720349 575209 765195 619460
14738 619460 432257 901279 490306 769350 481377 606473 660370 1005983 476159 531365
14728 531365 873268 912088 700646 651313 851543 855137 798960 903117 963198 1129277 738705
14717 738705 1089070 665724 950960 748973 747505 489876 739577 921813 738323 1146854
14707 1146854 818083 850062 1072533 971218 1054739 1053366 404085 743823 836506 527807
$$ packed form
14778F05212L32015D40086A98351L54759B11634K63015m0620p2693J91522j03071
14768D49787l7738O5864o7098K52885C18680j9997M45922B61912L48201J61802
14758G71915j66490N0735k18390K22987j83993L6669J47266L4565J04407k32960
14748E66711K70927P215l90645K25128N7000O5255q1242j45140J89986j45735
14738F19460j87203M69022m10973K79044k87973J25096N3897L45613D76159N5206
14728E31365L41903L8820k11442m9333K00230L594n6177J04157O0081J66079l90572
14717G38705L50365m23346K85236k01987j468k57629K49701J82236j83490M08531
14707A146854l28771L1979K22471j01315Q3521j373D04085L39738R2683l08699
$$ plain form
14697 527807 634566 1038440 1072486 929731 1029843 798626 718817 968229 680900 983544
14687 983544 850010 926742 831487 1075880 951270 659119 949902 964782 667834 826412
14677 826412 876554 997166 821489 739681 930954 1026643 1015330 1001895 1185180 978637
14667 978637 1009050 1264380 901461 989855 987193 1207476 976432 1281934 924440 997999
14657 997999 1480095 1472052 816622 916868 1040449 1375874 905555 1011642 759104 1025278
14647 1025278 1146509 1377899 1142237 1060964 869021 1120284 946302 1440403 1390527 1433122
14637 1433122 1124054 1168141 1274243 1233938 1238841 1031245 1579255 1236505 1109542 1410009
14627 1410009 1487879 1262805 1497379 1226463 1086847 1378686 1487085 1133820 1617060 1558384
$$ packed form
14697E27807J06759M03874L4046j42755J00112k31217p9809K49412k87329L02644
14687I83544j33534P6732r5255K44393j24610k92151K90783J4880k96948J58578
14677H26412N0142J20612j75677q1808J91273R5689j1313j3435J83285k06543
14667I78637L0413K55330l62919Q8394k662K20283k31044L05502l57494P3559
14657I97999M82096q043o55430J00246J23581L35425m70319J06087k52538K66174
14647A025278J21231K31390k35662q1273j91943K51263j73982M94101m9876M2595
14637A433122l09068M4087J06102m0305M903k07596N48010l42750j26963L00467
14627A410009P7870k25074K34574k70916j39616K91839J08399l53265M83240n8676
$$ plain form
14617 1558384 1296160 1737487 1341846 1289513 1645548 1695831 1319297 1545268 1375416 1285051
14607 1285051 1644740 1357950 1660439 1600024 1481150 1824614 1601053 1803499 1757683 1667117
14597 1667117 1612950 1847265 1926387 1662817 1512670 1580988 1591596 1796052 1674416 1773289
14587 1773289 1911783 1694877 1554285 1958297 2060569 1526783 1810268 2181103 1483082
14578 1483082 1907871 2050981 2140694 1734042 2110339 2001144 1947590 2239547 2017761 2294773
14568 2294773 2336275 2023166 2259882 2243453 2513298 2353355 2583996 2566274 2578899 2840887
14558 2840887 3007948 2972633 3170408 3357114 3655334 4056083 3970217 4722967 5908527 7395482
14548 7395482 11027120 18896609 41113207 41607823 18977350 9142784 5495136 5820321
$$ packed form
14617A558384k62224M41327l95641n2333L56035N0283l76534K25971j69852r0365
14607A285051L59689k86790L02489o0415j18874L43464k23561K02446m5816r0566
14597A667117n4167K34315P9122k63570j50147O8318J0608K04456j21636R8873
14587A773289J38494k16906j40592M04012J02272n33786K83485L70835o98021
14578A483082M24789J43110Q9713m06652L76297j09195n3554K91957k21786K77012
14568B294773M1502l13109K36716j6429K69845j59943K30641j7722J2625K61988
14558B840887J67061l5315J97775J86706K98220M00749q5866P52750J185560J486955
14548G395482L631638P869489K2216598M94616A8977350I142784l647648L25185
$$ plain form
14540 5820321 7849228 3919236 2474401 2548401 1914463 2229128 1952333 1998219 2091178
14531 2091178 2273591 2207681 2084739 2506618 2163415 2166911 2495346 2155312 2108971 2453505
14521 2453505 2499984 2082094 2317321 2652057 2614078 2628001 3157950 2797022 2614564 2270694
14511 2270694 2793150 2718644 2932660 2526083 2794764 3179536 2528376 2905877 3071218 2700830
14501 2700830 3281468 2877541 3205678 3238124 2938654 3359349 3248539 3183272 3666849 3381574
14491 3381574 3435006 3346889 3652045 3426273 3601365 3609117 3470963 3706532 3816200 3696151
14481 3696151 3799032 3948596 3777940 3753216 3988479 3764748 4119592 4037071 4223817 4334923
14471 4334923 4133601 4428817 4151547 4004492 4343272 4425949 4335166 4550761 4892389 4669609
$$ packed form
14540E820321K028907C919236j444835P4000o33938L14665k76795M5886R2959
14531B091178J82413o5910j22942M21879l43203L496L28435l40034m6341L44534
14521B453505M6479m17890K35227L34736l7979J3923N29949l60928j82458l43870
14511B270694N22456p4506K14016m06577K68681L84772o51160L77501J65341l70388
14501B700830N80638m03927L28137L2446k99470M20695j10810o5267M83577k85275
14491C381574N3432q8117L05156k25772J75092P752j38154K35569J09668j20049
14481C696151J02881J49564j70656k4724K35263k23731L54844q2521J86746J11106
14471D334923k01322K95216k77270j47055L38780Q2677r0783K15595L41628k22780
$$ plain form
14461 4669609 4544841 4456800 4957380 4876844 5082480 4863851 4793104 4976116 5160306 5071273
14451 5071273 5381668 5303893 5235202 5926393 5583521 5737461 5942189 5888738 5705448 5918526
14441 5918526 5947993 5893797 6044983 6101161 6333669 6276203 6588226 6485621 6498483 7075339
14431 7075339 7050764 6565615 6660436 6860471 7011233 7054559 7269617 7330505 7355728 7831343
14421 7831343 7876254 7767719 7600360 8177000 8005116 8386105 8958186 8685319 8587005 8349292
14411 8349292 8841708 8930920 9019277 9193548 9680801 9491081 9550797 9497680 9886377 10246013
14401 10246013 10358550 10295746 10919595 10780188 11046161 11075431 11304928 11548071 12034616 11758290
14391 11758290 12438582 12304109 12566403 12608528 12943653 13134830 13599684 13462411 13839517
$$ packed form
14461D669609j24768q8041N00580q0536K05636k18629p0747J83012J84190q9033
14451E071273L10395p7775o8691O91191l42872J53940K04728n3451j83290K13078
14441E918526K9467n4196J51186N6178K32508n7466L12023j02605J2862N76856
14431G075339k4575m85149R4821K00035J50762M3326K15058O0888K5223M75615
14421G831343M4911j08535j67359N76640j71884L80989N72081k72867r8314k37713
14411H349292M92416Q9212Q8357J74271M87253j89720N9716n3117L88697L59636
14401A0246013J12537o2804O23849j39407K65973K9270K29497K43143M86545k76326
14391A1758290O80292j34473K62294M2125L35125J91177M64854j37273L77106
$$ plain form
14382 13839517 14210520 14366263 14648292 14861108 15033401 15367593 15714529 16192763 16503742
14373 16503742 16509254 17333978 17151041 17432248 17980596 18234517 18879024 19154355 19848008 19958925
14363 19958925 20150344 20746107 21421167 21968077 21968584 22594605 23204016 23936964 24377833 25070820
14353 25070820 25364347 26164478 26957724 27434127 28034486 28945636 29320989 30589070 30825687
14344 30825687 31824902 32830132 33694194 34513705 35286713 36042618 37386858 37997841 39399220
14335 39399220 40628048 41551304 43139757 44463411 45871964 46935673 48554334 50181779
14327 50181779 52021285 53381674 54946233 56865108 58594193 60805015 63224160 64987930
14319 64987930 67475864 69832567 72547854 75188853 78066300 81113480 84296964 87333676
$$ packed form
14382A3839517L71003J55743K82029K12816J72293L34192L46936M78234L10979
14373A6503742N512Q24724j82937K81207N48348K53921O44507K75331O93653J10917
14363A9958925J91419N95763O75060N46910N07O26021O09411P32948M40869O92987
14353B5070820K93527Q00131P93246M76403O00359R11150L75353J268081K36617
14344C0825687R99215J005230Q64062Q19511P73008P55905J344240O10983J401379
14335C9399220J228828R23256J588453J323654J408553J063709J618661J627445
14327E0181779J839506J360389J564559J918875J729085K210822K419145J763770
14319F4987930K487934K356703K715287K640999K877447L047180L183484L036712
$$ plain form
14311 87333676 91127513 94860512 98873511 102818977 107591994 112004729 116921931 122011388
14303 122011388 127714874 133264286 139901378 146473385 153407132 160983949 168771715 177309660
14295 177309660 185793355 195398245 205168832 215657418 226105576 237722586 249630094
14288 249630094 262044119 274666825 288110222 301802103 315658428 330275820 344901994
14281 344901994 359550400 374120429 388397716 401955246 415180029 427199636 438338765
14274 438338765 447537491 454844569 459939271 462227084 462887229 460093888 455749774 452293349
14266 452293349 447587930 439866142 430065097 418037124 404995288 390645413 375390436
14259 375390436 360248579 344670500 329239525 314192098 299299074 284499568 270659814
$$ packed form
14311H7333676L793837L732999M012999L945466M773017M412735M917202N089457
14303A22011388N703486N549412O637092O572007O933747P576817P787766Q537945
14295A77309660Q483695R604890R770587J0488586J0448158J1617010J1907508
14288B49630094J2414025J2622706J3443397J3691881J3856325J4617392J4626174
14281C44901994J4648406J4570029J4277287J3557530J3224783J2019607J1139129
14274D38338765R198726P307078N094702K287813O60145k793341m344114l456425
14266D52293349m705419p721788r801045j2027973j3041836j4349875j5254977
14259C75390436j5141857j5578079j5430975j5047427j4893024j4799506j3839754
$$ plain form
14252 270659814 256918442 246290107 234527465 222812818 211741902 201464155 191456105
14245 191456105 182548631 173737252 165547302 157807375 150750967 143759524 137139257 131645811
14237 131645811 125802618 120162405 114839963 110294270 105476142 101230311 97547910 93765738
14229 93765738 89884885 86321125 82924037 79782084 76867529 74102349 71516868 68822306
14221 68822306 66338262 63958380 62226262 60166673 57975253 56196797 53902463 52454757
14213 52454757 51443663 49381753 47940888 46110681 44802667 43731122 43597754 41778614
14205 41778614 40725586 39388283 38273472 36999192 36083672 35815083 35037334 33475383
14197 33475383 32531646 31636531 31272121 30545463 29918429 28472971 28236303 27306038 26576577
$$ packed form
14252B70659814j3741372j0628335j1762642j1714647j1070916j0277747j0008050
14245A91456105q907474q811379q189950p739927p056408o991443o620267n493446
14237A31645811n843193n640213n322442m545693m818128m245831l682401l782172
14229I3765738l880853l563760l397088l141953k914555k765180k585481k694562
14221F8822306k484044k379882j732118k059589k191420j778456k294334j447706
14213E2454757j011094k061910j440865j830207j308014j071545j33368j819140
14205D1778614j053028j337303j114811j274280r15520k68589p77749j561951
14197C3475383r43737q95115l64410p26658o27034j445458k36668r30265p29461
$$ plain form
14188 26576577 25868191 25667936 24836087 24357794 23708770 23084245 22514320 22347402 21749202
14179 21749202 21333144 21043222 20783314 20010953 19418751 19274234 19048734 18940080 17914850
14170 17914850 17642523 17690045 16640259 16578785 16702877 16361889 15903261 15564290 15151203
14161 15151203 15147823 14874568 14346217 14214931 14101868 13807517 13831687 13413198 13301507 13207693
14151 13207693 12426161 12420312 12358797 12081346 11775211 11719590 11573746 11493351 11328405 10962681
14141 10962681 10702623 10685501 10382929 10520537 10291935 10135311 9642197 9944176 9665895
14132 9665895 9605197 9558376 9374475 8877496 9226386 8857640 8730075 8403104 8335613 8426147
14122 8426147 8137952 8165566 8042568 7992195 7726121 7830855 7698753 7202379 7508200 7428301
$$ packed form
14188B6576577p08386k00255q31849m78293o49024o24525n69925j66918n98200
14179B1749202m16058k89922k59908p72361n92202j44517k25500j08654j025230
14170A7914850k72327M7522j049786o1474J24092l40988m58628l38971m13087
14161A5151203l380k73255n28351j31286j13063k94351K4170m18489j11691r3814
14151A3207693p81532n849o1515k77451l06135n5621j45844q0395j64946l65724
14141A0962681k60058j7122l02572J37608k28602j56624m93114L01979k78281
14132I665895o0698m6821j83901m96979L48890l68746j27565l26971o7491R0534
14122H426147k88195K7614j22998n0373k66074J04734j32102m96374L05821p9899
$$ plain form
14112 7428301 7305911 7326405 7289520 6949918 6843721 7052316 6792874 6263028 6510428 6503129
14102 6503129 6675777 6071559 6057747 6169262 5844400 6168545 6015510 5540653 6131824 5367107
14092 5367107 6030514 5670047 5849980 5656476 5537272 5566593 5733753 5408166 4914522 5379323
14082 5379323 4952839 4910243 5257571 4834397 5014053 4845279 4680368 4877647 4870159 4718315
14072 4718315 4682731 4456217 4586138 4564936 4633073 4467186 4531233 4228602 4407776 4185698
14062 4185698 4638276 3782642 4167827 4204742 3798574 4157229 4205222 3751258 4259737 3879398
14052 3879398 3937382 3327456 3733094 3485635 3100747 3556149 3835341 3487878 3471089 3020977
14042 3020977 3252076 3400740 3512558 2785931 3189253 3174609 3183137 3154748 3416277 2980233
$$ packed form
14112G428301j22390K0494l6885l39602j06197K08595k59442n29846K47400p299
14102F503129J72648o04218j3812J11515l24862L24145j53035m74857N91171p64717
14092E367107O63407l60467J79933j93504j19204K9321J67160l25587m93644M64801
14082E379323m26484m2596L47328m23174J79656j68774j64911J97279p488j51844
14072D718315l5584k26514J29921k1202O8137j65887O4047l02631J79174k22078
14062D185698M52578q55634L85185L6915m06168L58655M7993m53964N08479l80339
14052C879398N7984o09926M05638k47459l84888M55402K79192l47463j6789m50112
14042C020977K31099J48664J11818p26627M03322j4644Q528k8389K61529m36044
$$ plain form
14032 2980233 2985965 3268757 3330168 3101493 3035059 3240041 2900483 3135237 2834846 2909827
14022 2909827 2805655 3129800 2716226 2785688 2750182 2806584 2477621 2782828 2821410 2622326
14012 2622326 2360664 2524794 2637044 2241625 2015101 2336387 2583655 2418067 2537347
14003 2537347 2605334 2419735 2117442 2486494 2437276 2490200 2082517 2312254 2126264 2224632
13993 2224632 2187718 2289694 2599647 2590841 3342173 5958057 12617129 33234226 45578120
13984 45578120 25089427 14352936 9066825 5967634 4719673 4482644 3879621 3282459
13976 3282459 3283250 3190074 2920903 2814857 2721826 2655700 2471455 2597569 2708862 2632717 2868271
13965 2868271 2457353 2754685 2009494 2119700 1884840 1940216 2145320 2243257 1973019 2286011
$$ packed form
14032B980233N732K82792O1411k28675o6434K04982l39558K34754l00391P4981
14022B909827j04172L24145m13574O9462l5506N6402l28963L05207L8582j99084
14012B622326k61662J64130J12250l95419k26524L21286K47268j65588J19280
14003B537347O7987j85599l02293L69052m9218N2924m07683K29737j85990R8368
13993B224632l6914J01976L09953q806P51332K615884O659072K0617097J2343894
13984D5578120k0488693j0736491n286111l099191j247961k37029o03023n97162
13976C282459P91r3176k69171j06046r3031o6126j84245J26114J11293p6145K35554
13965B868271m10918K97332p45191J10206k34860N5376K05104R7937k70238L12992
$$ plain form
13955 2286011 2463499 2431326 2140282 2137069 1993069 2274469 1920285 1854583 1925654 1821443
13945 1821443 2222876 2007375 1579008 1733431 2113762 1883043 1628100 2110706 1688170
13936 1688170 1648632 2028567 1781371 1782161 1801592 1761321 1656450 1745997 1445369 1796720 1528691
13925 1528691 1938146 1576173 1669905 1877011 1451820 1364638 1816031 1632425 1327356 1571754
13915 1571754 1483087 1734466 1530974 1735014 1506832 1471527 1465786 1537161 1803381 1211618
13905 1211618 1344109 1453737 1577180 1251563 1750085 1640273 1596297 1285699 1250643 1438736
13895 1438736 939455 1593145 973660 1433811 945230 1572584 1086781 1590390 1145813
13886 1145813 1477583 1179920 1513126 1182354 1369177 1275702 1463213 844414 976655 1198102
$$ packed form
13955B286011J77488l2173k91044l213j44000K81400l54184o5702P1071j04211
13945A821443M01433k15501m28367J54423L80331k30719k54943M82606m22536
13936A688170l9538L79935k47196P90J9431m0271j04871Q9547l00628L51351k68029
13925A528691M09455l61973R3732K07106m25191q7182M51393j83606l05069K44398
13915A571754q8667K51379k03492K04040k28182l5305n741P1375K66220n91763
13905A211618J32491J09628J23443l25617M98522j09812m3976l10598l5056J88093
13895A438736m99281O53690o19485M60151m88581O27354m85803N03609m44577
13886A145813L31770k97663L33206l30772J86823r3475J87511o18799J32241K21447
$$ plain form
13876 1198102 1313595 1318822 1216860 1347612 1257189 918712 1283630 1089972 994652 1322662
13866 1322662 1060472 1368317 1216522 1247489 963319 907158 834635 1364420 1164233 993738
13856 993738 1422858 1158056 1504241 1062046 1043389 1168028 886249 1126297 1217794 630573
13846 630573 1072799 1094458 959314 1014074 801606 1206433 708898 764155 1025043 720890
13836 720890 1045520 836917 1176910 889967 856488 985983 1114187 911530 1047646 883443
13826 883443 723489 966883 1124268 670273 1151070 969350 1129279 1030591 989264 1180771
13816 1180771 985709 905750 952065 1141076 912640 837528 962035 1229505 984130 725515
13806 725515 864218 1127765 728355 919170 736359 947059 762398 736686 877395 688382
$$ packed form
13876A198102J15493N227j01962J30752r0423l38477L64918j93658r5320L28010
13866A322662k62190L07845j51795L0967k84170n6161p2523N29785k00187j70495
13856I93738M29120k64802L46185m42195j8657J24639k81779K40048R1497n87221
13846F30573M42226K1659j35144N4760k12468M04827m97535N5257K60888l04153
13836G20890L24630k08603L39993k86943l3479J29495J28204k02657J36116j64203
13826H83443j59954K43394J57385m53995M80797j81720J59929r8688m1327J91507
13816A180771j95062p9959M6315J89011k28436p5112J24507K67470k45375k58615
13806G25515J38703K63547l99410J90815j82811K10700j84661k5712J40709j89013
$$ plain form
13796 688382 1046491 951499 1004831 888221 711096 874287 421822 835019 655543 1083003
13786 1083003 743242 917134 725568 497581 825259 838366 751113 752545 538407 275120
13776 275120 633127 655044 812316 700322 675775 740758 952108 801316 712797 694868
13766 694868 847009 704761 662751 706929 856389 1022086 1020960 775880 745378 815560 692668
13755 692668 628028 850508 697350 618776 836350 529009 838295 824943 810302 606099
13745 606099 526174 414996 461001 648817 731738 680728 704127 616937 757284 612832 517062
13734 517062 635556 859442 406363 367193 695906 673206 583294 785828 730750 633911
13724 633911 771212 854389 651573 494196 291802 518440 863612 485963 671055 357761
$$ packed form
13796F88382L58109r4992N3332j16610j77125J63191D21822M13197j79476M27460
13786A083003l39761J73892j91566k27987L27678J3107q7253J432k14138k63287
13776B75120L58007K1917J57272j11994k4547O4983K11350j50792q8519j7929
13766F94868J52141j42248m2010M4178J49460J65697j126k45080l0502P0182j22892
13755F92668o4640K22480j53158p8574K17574l07341L09286j3352j4641k04203
13745F06099p9925j11178M6005J87816Q2921n1010K3399q7190J40347j44452r5770
13734E17062J18494K23886D06363l9170L28713k2700q9912K02534n5078r6839
13724F33911J37301Q3177k02816j57377k02394K26638L45172l77649J85092l13294
$$ plain form
13714 357761 934078 781504 712600 386758 180592 682782 422804 868437 516968 565866
13704 565866 658925 663858 457809 346934 352904 547923 684795 712294 455133 530080 339368
13693 339368 611135 663245 510102 326769 484986 500604 456210 522115 390842 696410
13683 696410 565536 658030 666998 734065 434281 267132 702136 680048 587959 374371 255180
13672 255180 462414 328902 411823 541637 315353 376282 806627 419130 524443 658038
13662 658038 235949 750097 529248 485309 385969 462762 324981 419744 333025 445262
13652 445262 629564 420885 468260 455441 311973 441320 570477 287982 503177 438499
13642 438499 576649 429551 595927 461746 621959 189760 408545 372993 281794 603730
$$ packed form
13714C57761N76317j52574o8904l25842A80592N02190k59978M45633l51469M8898
13704E65866R3059M933k06049j10875N970J95019J36872K7499k57161P4947j90712
13693C39368K71767N2110j53143j83333J58217J5618m4394O5905j31273L05568
13683F96410j30874R2494Q968O7067k99784j67149M35004k2088r2089k13588j19191
13672B55180K07234j33512Q2921J29814k26284O0929M30345l87497J05313J33595
13662F58038B35949N14148k20849m3939r9340P6793j37781R4763q6719J12237
13652D45262J84302k08679M7375j2819j43468J29347J29157k82495K15195o4678
13642D38499J38150j47098J66376j34181J60213A89760K18785l5552r1199L21936
$$ plain form
13632 603730 599260 164965 273954 253971 157487 765094 614753 332653 432606 207530
13621 427600 422588 530458 514194 368168 622232 612133 458553 391837 141390 371319
13611 371319 571160 288853 397914 330245 468981 524113 541712 406928 194403 649441
13601 649441 355648 534156 416166 721910 304698 597798 645640 424423 299138 524750
13591 524750 294574 442474 309009 209904 266076 360888 408462 732165 278561 234470
13581 234470 322884 392338 220095 597946 477179 394961 -90624 383948 341648 102148
13570 321804 48057 409903 556518 170684 367134 341339 101614 486526 533196 346951
13560 346951 718191 214217 482780 168800 326203 74135 247915 125229 210097 442814
$$ packed form
13632F03730m470A64965J08989j9983r6484O07607j50341k82100R9953B07530
13621D27600n012J07870j6264j46026K54064j0099j53580o6716A41390K29929
13611C71319J99841k82307J09061o7669J38736N5132J7599j34784A94403M55038
13601F49441k93793J78508j17990L05744C04698K93100M7842k21217j25285K25612
13591E24750k30176J47900j33465r9105N6172R4812M7574L23703B78561m4091
13581B34470Q8414O9454j72243L77851j20767q2218i0624C83948m2300A02148
13570C21804D8057L61846J46615A70684J96450k5795A01614L84912M6670j86245
13560C46951L71240B14217K68563A68800J57403G4135J73780j22686Q4868K32717
$$ plain form
13550 442814 599611 720987 145643 329979 58723 197484 259005 417751 290835 218389
13540 218389 188085 120922 182728 449666 429286 546545 477130 207805 125201 270178 292160
13529 292160 359132 93702 391172 268468 372414 340298 40241 216703 86106 152797 98154
13518 98154 142971 194634 330359 406569 331217 195016 395803 181584 57840 267248 219711
13507 219711 156117 27366 161425 170425 209617 247351 260676 280107 293233 190349 87634
13495 294765 201345 709829 482692 264588 525070 530838 293590 359763 217826 364532
13485 364532 -26905 250739 312402 149028 -116907 326833 108007 194537 168326 437379
13475 437379 421688 388809 377312 294088 313708 80905 410019 100291 231271 120866 -78544
$$ packed form
13550D42814J56797J21376A45643J84336E8723J38761O1521J58746j26916p2446
13540B18389l0304o7163O1806K66938k0380J17259o9415B07805q2604J44977K1982
13529B92160O6972I3702K97470j22704J03946l2116D0241J76462H6106O6691n4643
13518I8154M4817N1663J35725P6210p5352j36201K00787A81584E7840K09408m7537
13507B19711o3594B7366J34059R000L9192L7734J3325J9431J3126j02884H7634
13495B94765r3420N08484k27137k18104K60482N768k37248O6173j41937J46706
13485C64532b6905B50739O1663A49028a16907C26833A08007Q6530k6211K69053
13475D37379j5691l2879j1497q3224J9620H0905L29114A00291J30980j10405g8544
$$ plain form
13463 234377 569781 338077 257305 51538 457367 69136 229770 152511 195668 -16334 494087
13451 424276 219707 -46416 371376 -5821 261733 297426 242092 347130 134559 240695
13441 240695 198790 -4803 262241 200087 106831 277692 -89926 459905 364489 182125 -4964
13429 475464 -52512 479942 15212 399343 175297 543048 629049 527563 231963 161523
13419 161523 228602 170694 456254 272440 295763 11528 260989 76972 282269 -99092 455259
13407 235072 144722 181536 561479 249350 216039 547392 162896 245144 269809 86223 278106
13396 278106 118223 304180 309484 223935 70140 202622 217910 455876 -28708 225822 413931
13385 413931 263464 291334 225843 490418 212547 25537 329733 375654 128287 393269
$$ packed form
13463B34377L35404k31704q0772E1538M05829F9136J60634p7259M3157a6334D94087
13451D24276k04569d6416C71376e821B61733L5693n5334J05038A34559J06136
13441B40695m1905d803B62241o2154r3256J70861h9926D59905r5416A82125d964
13429D75464e2512D79942A5212L84131A75297L67751Q6001j01486B31963p0440
13419A61523O7079n7908K85560j83814K3323A1528K49461G6972K05297i9092D55259
13407B35072r0350L6814L79943B49350l3311L31353A62896Q2248K4665H6223J91883
13396B78106A18223J85957N304q5549G0140J32482J5288K37966b8708B25822J88109
13385D13931j50467K7870o5491K64575B12547B5537L04196M5921A28287K64982
$$ plain form
13375 393269 43024 195066 340394 310878 23866 156555 173483 303492 516505 -200089
13364 48309 47587 349096 13460 605355 45575 351358 233224 344049 28267 -172442 310475
13352 207349 146438 346940 258344 109494 208324 2465 440660 248592 257554 305067 398385
13341 398385 253402 121872 342347 581118 333822 -93954 123098 238194 126914 325408
13331 325408 325355 248847 151879 78674 -20004 -111093 392287 383408 -39463 251855 172271 174029
13319 174029 257570 35908 189883 225994 172712 138763 -170665 84596 542881 -109246 374671
13307 143075 -239679 13172 234608 456276 86655 295800 260825 -13182 191106 -46589
13296 -156456 -70486 494078 184328 352953 48197 73910 420073 65514 177683 432705
$$ packed form
13375C93269D3024J52042J45328k9516B3866J32689J6928J30009K13013b00089
13364D8309p22L01509A3460N91895D5575L05783j18134J10825B8267a72442C10475
13352B07349o0911K00502q8596A09494R8830B465M38195j92068Q962M7513R3318
13341C98385j44983A21872K20475K38771k47296i3954A23098J15096j11280J98494
13331C25408n3p6508r6968p3205b0004r1089C92287q879c9463B51855p9584J758
13319A74029Q3541C5908J53975L6111n3282l3949a70665H4596M58285a09246C74671
13307A43075b39679A3172K21436K21668H6655K09145l4975a3182A91106d6589
13296a56456g0486D94078A84328J68625D8197K5713L46163F5514J12169K55022
$$ plain form
13286 432705 64879 14148 -37616 93524 150872 128078 240798 243416 224873 142260 -54042
13274 -137780 31779 638 251653 75878 39582 158163 -54120 -149376 59783 -161063 -31056
13262 162440 399020 377051 -29885 176626 214837 314369 97345 -117396 476725 269756
13252 269756 10048 -133769 388900 267578 19110 10134 204538 357041 28315 153011
13242 153011 28470 100946 167464 -175930 56219 51135 511530 284442 -129161 269960 1528
13230 -141397 124207 -57786 281498 219488 -309689 -271020 373311 39134 -31348 271394
13219 235237 197634 418327 28560 -85072 -90354 -92813 -11018 -26046 285177 -233446 131899
13207 222045 377069 22757 334896 303733 61599 20659 181202 384072 -226656 56057
$$ packed form
13286D32705F4879A4148c7616I3524N7348k2794J12720K618j8543q2613e4042
13274a37780C1779F38K51015G5878l6296J18581e4120r5256E9783a61063c1056
13262A62440K36580k1969b9885A76626L8211R9532I7345a17396D76725k06969
13252B69756A0048a33769C88900j21322A9110q976J94404J52503B8315J24696
13242A53011B8470P2476O6518a75930E6219n084M60395k27088a29161B69960A528
13230a41397A24207e7786B81498o2010c09689L8669C73311C9134c1348B71394
13219B35237l7603K20693B8560h5072n282k459a1018j5028B85177b33446A31899
13207B22045J55024B2757L12139l1163F1599B0659J60543K02870b26656E6057
$$ plain form
13196 348898 102645 16213 58138 -127617 -215397 321685 200456 342289 305376 119575
13185 -186342 99018 271656 284125 184174 355414 227288 16370 -429475 107693 231646
13175 231646 671973 214922 97612 138700 -113262 140335 308414 130263 115099 89674
13165 89674 162068 174809 365014 170946 -112350 270967 314647 132779 167896 -4567 -297674
13154 -297674 322 196393 -163480 -26737 -18891 132642 267143 109432 28359 -115187 203380
13142 299717 72496 -122207 143679 -67702 401260 -184312 -123034 216346 270289 23451
13131 204012 -44411 -188587 46478 -288710 336375 440862 30885 200409 141094 229786
13121 229786 -86314 75709 33460 -287487 431880 57026 -45247 196715 -76933 390989 54024
$$ packed form
13196C48898A02645A6213M1925a27617q7780C21685j21229J41833l6913A19575
13185a86342I9018J72638J2469r9951J71240j28126A6370d29475A07693J23953
13175B31646M40327B14922I7612M1088a13262A40335J68079A30263j5164k5425
13165H9674P2394J2741J90205A70946a12350B70967M3680A32779L5117d567k93107
13154b97674C22J96071a63480b6737P846A32642J34501A09432B8359a15187B03380
13142B99717G2496a22207A43679f7702D01260a84312O1278B16346N3943B3451
13131B04012d4411j44176D6478b88710C36375J04487C0885J69524n9315Q8692
13121B29786h6314G5709C3460b87487D31880E7026d5247A96715g6933C90989E4024
$$ plain form
13109 -132050 168013 123438 159687 -24461 182780 -114269 -157319 -23621 124985 212997 222715
13098 222715 248728 -22912 23733 1414 -13212 365492 -175869 202249 36275 -13159 10241
13086 214923 -65976 267702 418688 320751 18054 -102559 -35003 -155853 148630 -49095
13075 231729 357176 162761 -6817 -82006 133025 -17316 148371 237743 133215 230797 -54835
13063 30058 40017 -33348 261751 334184 -146693 -6060 134696 223948 20837 178507 396108
13052 396108 -116214 265448 17137 -222822 211115 -15820 352422 265384 274328 89670 28380
13040 113312 -29013 132342 -54041 -279776 116828 218609 323901 70595 36039 124602
13030 124602 172000 -208145 2719 361009 180958 63459 168410 -104309 153114 81571
$$ packed form
13109a32050A68013m4575L6249b4461A82780a14269m3050b3621A24985Q8012R718
13098B22715K6013b2912B3733A414a3212C65492a75869B02249C6275a3159A0241
13086B14923f5976B67702J50986r7937A8054a02559c5003j20850A48630d9095
13075B31729J25447A62761f817p5189A33025a7316A48371Q9372j04528R7582e4835
13063C0058R959c3348B61751P2433a46693f060A34696Q9252B0837J57670K17601
13052C96108a16214B65448A7137b22822B11115a5820C52422q7038Q944H9670B8380
13040A13312b9013A32342e4041k25735A16828J01781J05292G0595l4556Q8563
13030A24602M7398b08145B719L58290j80051F3459J04951a04309A53114p1543
$$ plain form
13020 81571 278957 160910 1694 186499 -42618 1096 340988 -24683 149056 5348 -76402
13008 163313 122156 211949 252319 278006 -49271 95394 -148461 345359 88633 -303975 -17225
12996 217613 199056 -19848 91158 -58360 34370 -144342 -83846 33142 136679 345901 100972
12984 -43481 84872 308920 116623 -256105 -69311 309800 169455 11815 209934 -258210
12973 -251107 206630 -26143 128446 145272 24175 59805 124414 216720 54215 -169253 264704
12961 257201 179005 -120359 523202 48139 -394214 249275 158772 -9841 109001 291545
12951 291545 19521 55716 135729 9478 -16923 -36660 -28444 -136155 31547 336687 146861
12939 175088 81914 156134 51640 -202491 63663 -53318 98682 -2788 47559 -72435 454469
$$ packed form
13020H1571J97386j18047A694J84805d2618A096L39892b4683A49056E348g6402
13008A63313m1157Q9793M0370K5687d9271I5394a48461C45359H8633c03975a7225
12996B17613j8557a9848I1158e8360C4370a44342O0496C3142J03537K09222A00972
12984d3481H4872K24048A16623b56105f9311C09800j40345A1815J98119b58210
12973b51107B06630b6143A28446J6826B4175L5630O4609R2306E4215a69253B64704
12961B57201p8196a20359E23202D8139c94214B49275r0503i841A09001J82544
12951B91545A9521L6195Q0013I478a6923j9737Q216j07711C1547L05140A46861
12939A75088H1914P4220E1640b02491F3663e3318I8682b788D7559g2435D54469
$$ plain form
12927 250611 274246 -71247 277433 176303 -34762 358329 -100015 -84553 -297450 248168
12916 47790 -250931 111794 244539 34419 -106677 197907 -132988 149411 136867 -89659
12905 -159760 -351003 60157 52913 48933 213379 -96379 128794 277507 293186 302737 -5216
12893 -289413 -123262 20133 356159 -201622 -152645 298565 142392 -62996 83405 67057
12883 67057 -81287 95481 129611 -8931 198923 -36864 468 166263 -20417 -186661 473030
12871 -219667 154782 -44104 131288 139334 -171518 101089 304550 -169877 -217747 -446469
12861 -446469 268771 328601 27751 -182429 206058 2444 338708 51602 295973 144239
12850 44138 14265 144905 4109 96140 142972 70201 -196463 342762 -85911 -66688 155047
$$ packed form
12927B50611K3635g1247B77433j01130c4762C58329a00015J5462k12897B48168
12916D7790b50931A11794J32745C4419a06677A97907a32988A49411j2544h9659
12905a59760j91243F0157p244l980J64446i6379A28794J48713J5679R551e216
12893b89413a23262B0133L36026b01622M8977B98565A42392f2996H3405j6348
12883F7057h1287I5481L4130h931A98923c6864D68J65795b0417j66244D73030
12871b19667A54782d4104A31288Q046a71518A01089K03461a69877m7870k28722
12861d46469B68771N9830B7751a82429B06058B444L36264E1602K44371A44239
12850D4138A4265J30640D109R2031M6832G0201a96463C42762h5911J9223A55047
$$ plain form
12838 405565 71714 -454254 338871 -30285 66997 272298 -4652 40203 99563 85984 -85767
12826 -455131 52379 316878 12585 43909 128924 -229146 -225856 -150147 -38967 67263 -122058
12814 4031 55015 -140759 -130366 218280 206081 149338 -47881 -133507 342362 223780 -181806
12802 -268028 178249 6680 215213 169836 158736 169435 -33313 -44858 -228924 262045 67508
12790 173489 319925 104924 -59315 -218719 -78778 255490 -134212 -147507 -319562 -6155
12779 252647 177460 -47070 -126256 49040 -86277 -92126 -111158 -30596 325154 249990 -349519
12767 -255038 -87769 -247340 -23471 56264 389425 175935 -62830 89847 90116 118813 -212850
12755 226228 -335723 -195419 56174 -311598 91657 71571 -109529 -164525 -31486 46561 -26402
$$ packed form
12838D05565G1714d54254C38871c0285F6997K05301d652D0203N9360j3579h5767
12826d55131E2379K64499A2585L1324Q5015b29146L290P5709c8967F7263a22058
12814D031N0984a40759J0393B18280j2199n6743d7881q5626C42362j18582a81806
12802b68028A78249F680K08533m5377j1100J0699c3313j1545j84066B62045F7508
12790A73489J46436A04924e9315j59404g8778B55490a34212j3295j72055f155
12779B52647p5187d7070p9186D9040h6277n849j9032c0596C25154p5164c49519
12767b55038h7769j59571b3471E6264L33161A75935f2830H9847K69K8697b12850
12755B26228c35723J40304E6174c11598I1657k0086a09529n4996c1486D6561b6402
$$ plain form
12743 149014 -120343 -147938 53355 14643 312094 250261 398664 -15823 424310 416230 252034
12732 252034 -221904 126607 75711 -34960 125409 -183933 -103881 -231322 179237 -127728
12721 124320 291740 140510 -90453 -208812 -142213 217900 97037 -76437 -64044 168842
12710 130729 254196 -18670 -32822 -40065 115878 -94853 -162189 60855 308057 230385 461653
12699 461653 75975 -221932 189975 58559 22435 -77342 -108012 85942 -246534 222059 33364
12687 -54096 -303802 329361 236790 135545 244360 203009 27108 204146 118323 142792 -14432
12675 -187153 97804 24856 293446 190829 244169 302564 -8426 -14990 -217124 65194 50565
12664 50565 36273 -178428 17185 361478 -142982 212694 113562 240087 -194644 -130224
$$ packed form
12743A49014a20343k7595E3355A4643K97451o1833J48403a5823D24310q080j64196
12732B52034b21904A26607n0896c4960A25409a83933Q0052j27441A79237a27728
12721A24320J67420A40510i0453j18359O6599B17900I7037g6437J2393A68842
12710A30729J23467a8670j4152p243A15878i4853o7336F0855K47202p7672K31268
12699D61653G5975b21932A89975E8559B2435g7342l0670H5942b46534B22059C3364
12687e4096k49706C29361r2571j01245J08815m1351B7108J77038q5823K4469a4432
12675a87153I7804B4856K68590j02617N3340N8395h426o564k02134F5194j4629
12664E0565j4292a78428A7185L44293a42982B12694r9132J26525a94644O4420
$$ plain form
12654 -130224 -87836 53055 69582 320447 131005 127815 261750 217411 20513 -65967 -89754
12643 -89754 61251 421925 45491 254304 -151471 192912 236380 -176468 120590 -73944
12632 176494 134446 197730 273942 67628 315879 -65034 1753 262055 118549 1565 -270007
12620 302577 238469 -86163 -104801 -239502 -24139 283855 49916 103160 9523 164916 -135842
12608 205586 36944 -181306 205015 297752 -50744 -61518 207418 242250 -40150 220092 266879
12597 266879 34072 -122115 120006 -48452 59189 -240837 253364 -83215 -284469 -181257
12587 -181257 -239941 117020 34138 -42038 -229640 -134793 220983 -85521 -9265 156440 -180249
12575 -169830 -147390 -5536 611894 -49024 121935 -24911 -97279 -8656 44103 -176264 -189907
$$ packed form
12654a30224M2388E3055J6527K50865A31005l190J33935m4339B0513f5967k3787
12643h9754F1251L60674D5491K08813a51471A92912M3468a76468A20590g3944
12632A76494m2048O3284P6212F7628K48251f5034A753K60302A18549A565b70007
12620C02577o4108h6163j8638j34701b4139B83855D9916N3244I523J55393a35842
12608B05586C6944a81306B05015R2737e0744j0774B07418L4832d0150B20092M6787
12597B66879C4072a22115A20006d8452E9189b40837B53364h3215k01254J03212
12587a81257n8684A17020C4138d2038j87602R4847B20983h5521i265A56440a80249
12575a69830K2440e536F11894d9024A21935b4911p2368h656D4103a76264j3643
$$ plain form
12564 -189907 -168117 36101 106302 14208 320465 -284856 -37026 292691 -54961 136224 98084
12553 98084 133607 -185206 13362 99895 110059 -54246 152443 137338 173638 -253043 20908
12541 275652 257584 -41811 -9476 -84496 89517 237507 51421 68775 -147108 -292461 -126682
12529 232945 -21168 156919 -207642 275856 106539 180541 90151 405708 63948 -242950
12518 69630 -136342 12055 146239 45766 148487 -261414 163221 105912 -9110 -23115 145563
12506 -252190 -130128 432832 137122 515192 59048 72479 -194574 62049 -145616 -47291
12495 127194 -373385 330614 -86823 -127157 -95830 -187265 300044 223614 -212447 54217 -174245
12483 -26323 98096 -8669 -185427 105785 106135 -122495 259787 99676 318442 56310 228403
$$ packed form
12564a89907K1790C6101P0201A4208L06257b84856c7026B92691e4961A36224l8140
12553I8084L5523a85206A3362Q6533J0164e4246A52443j5105L6300b53043B0908
12541B75652j8068d1811i476p5020H9517J47990E1421J7354a47108j45353a26682
12529B32945b1168A56919b07642B75856A06539P4002I0151L15557F3948b42950
12518F9630a36342A2055J34184D5766J02721b61414A63221n7309i110j4005A45563
12506b52190J22062D32832A37122L78070E9048J3431a94574F2049a45616d7291
12495A27194c73385C30614h6823m0334L1327r1435C00044p6430b12447E4217a74245
12483b6323I8096h669j76758A05785L50a22495B59787I9676K18766E6310J72093
$$ plain form
12472 228403 -106525 -208142 79151 -82478 -71418 -89734 216185 100047 151881 -79020 181943
12460 247342 220870 -45949 393438 -223098 73315 -304995 319887 -163051 22102 -153940
12449 -52238 -71265 166255 62207 195917 76696 31309 144836 136434 140659 134543 37432 389140
12437 389140 39464 -155985 280950 -167763 91558 -94360 -81391 -149886 -208495 -204253 15442
12425 302564 236181 -297593 -44941 1753 -102006 115269 -120930 65459 95725 -131423 309103
12413 -64519 -91242 -192499 -536339 -65375 144552 -104229 -182500 250340 -63844 200986
12402 -46881 -199983 268711 -135624 -84232 77931 122152 -75035 -271404 180122 -52871 16920
12390 181288 -139236 -222668 -160471 -20576 179093 87092 182267 -15987 -146765 -141662 -9146
$$ packed form
12472B28403a06525j01617G9151h2478J1060j8316B16185A00047N1834g9020A81943
12460B47342k6472d5949C93438b23098G3315c04995C19887a63051B2102a53940
12449e2238j9027A66255F2207J33710G6696C1309J13527q402M225o116C7432L51708
12437C89140C9464a55985B80950a67763I1558i4360J2969o8495n8609M242A5442
12425C02564o6383b97593d4941A753a02006A15269a20930F5459L0266a31423C09103
12413f4519k6723j01257l43840f5375A44552a04229p8271B50340f3844B00986
12402d6881j53102B68711a35624N1392G7931M4221g5035j96369A80122e2871A6920
12390A81288a39236q3432O2197b0576A79093H7092R5175a5987j30778N103i146
$$ plain form
12378 -212106 107717 -87075 -95055 109109 -125703 74662 285702 -227045 -176142 -64707 96307
12366 -64772 -148979 13973 101541 -43445 10429 155882 -68322 352518 -29590 -30718 216616
12354 -265211 -108768 188323 -189720 135040 -90174 -255035 -254396 -96627 -132138 -70071 18170
12342 16422 63265 -217375 -77861 328744 -282806 -34577 4386 -16356 -140594 463868 -50975
12330 -92473 -7364 128507 -27352 82031 -16653 86591 -70279 29081 -311754 -207282 329638
12318 19995 160428 258132 -38871 -108893 169459 328939 410654 -58320 -78516 97352 -77412
12306 146176 98090 -126259 9431 -173216 14020 141468 162346 -196655 -38271 -41520 -87201
12295 -87201 4892 -119177 -317908 8496 -250775 -186697 451948 360064 -18180 304213 464664
$$ packed form
12378b12106A07717h7075p980A09109a25703G4662K11040b27045N0903f4707I6307
12366f4772q4207A3973Q7568d3445A0429J45453f8322C52518b9590j128B16616
12354b65211a08768A88323a89720A35040i0174j64861O39i6627l5511O2067A8170
12342A6422M6843b17375g7861C28744b82806c4577D386a6356j24238D63868e0975
12330i2473g364A28507b7352H2031a6653H6591g0279B9081c11754J04472C29638
12318A9995J40433R7704c8871p0022A69459J59480Q1715e8320k0196I7352g7412
12306A46176m8086a26259I431a73216A4020J27448K0878a96655c8271l249m5681
12295h7201D892a19177j98731H496b50775O4078D51948r1884a8180C04213J60451
$$ plain form
12284 464664 151716 -67339 -26038 -29409 291776 214577 54707 39447 52096 -150003 -136026
12273 -136026 103219 81608 93256 150158 214840 84582 -61562 -117743 -346679 102457 255505
12262 255505 464065 -156226 -64611 358680 93344 -208463 74312 196827 -162981 211676
12251 -162126 233062 -164849 -183801 357726 -22155 449809 262791 204985 36373 -106920
12240 92665 -203697 -96891 649657 -64308 98962 -55769 49505 -118307 318736 97454 -133960
12228 -44408 99675 287172 375889 34587 156754 319143 200352 315447 210041 71788
12217 502133 325640 176268 114969 271497 24401 6445 331580 21439 -4085 100321 168886
12206 168886 -90336 235599 214663 -84562 168833 110848 221039 307357 116933 263193
$$ packed form
12284D64664A51716f7339b6038l371B91776p7199E4707j5260J2649a50003J3977
12273a36026A03219k1611J1648N6902O4682H4582f1562n6181k28936A02457J53048
12262B55505K08560a56226f4611C58680I3344b08463G4312J22515a62981B11676
12251a62126B33062a64849j8952C57726b2155D49809j87018n7806C6373a06920
12240I2665b03697i6891F49657f4308I8962e5769D9505a18307C18736I7454a33960
12228d4408I9675J87497Q8717C4587J22167J62389j18791J15095j05406G1788
12217E02133j76493j49372o1299J56528B4401F445L25135B1439d085A00321O8565
12206A68886i0336B35599k0936h4562A68833n7985J10191Q6318A16933J46260
$$ plain form
12196 263193 347221 145777 262503 -195368 213386 119949 -73419 286690 269441 145997
12186 145997 110010 88984 162840 -34366 162447 35268 6434 94344 177063 89168 -59457
12174 51566 435317 -20269 10109 266504 76846 2380 379140 154276 153973 100667 195336
12163 195336 -449238 -89960 39480 -91211 341802 109700 294048 178784 186726 -79013 169869
12151 15260 59287 -109999 131068 -108258 141148 28502 441926 231587 -108818 197233
12140 111997 95531 -354216 302481 211410 -32483 -153058 386319 -138470 155147 330854
12130 330854 38812 82253 -20297 -185708 -160076 -453799 -296222 -44576 119403 235035
12120 235035 102162 111817 417241 -80968 -122602 -390839 165176 324763 50809 201081
$$ packed form
12196B63193Q4028A45777J16726a95368B13386r3437g3419B86690j7249j23444
12186A45997l5987k1026P3856c4366A62447C5268F434Q7910Q2719q7895e9457
12174E1566L83751b0269A0109K56395G6846B380L76760A54276l03n3306R4669
12163A95336d49238h9960C9480i1211C41802A09700J84348j15264P942g9013A69869
12151A5260M4027a09999A31068a08258A41148B8502M13424k10339a08818A97233
12140A11997j6466c54216C02481r1071c2483j20575C86319a38470A55147J75707
12130C30854C8812M3441b0297j65411K5632k93723J57577d4576A19403J15632
12120B35035A02162R655L05424h0968m1634k68237A65176J59587E0809J50272
$$ plain form
12110 201081 180620 -738 61989 94278 144048 271586 226937 173392 -66578 -99102 -6339 47205
12097 276561 230854 -274247 -108594 -40994 -152575 -41835 227142 47880 165805 -32045
12086 145206 -4427 226977 -35292 -93549 203231 -294627 -143216 5311 -134608 238525 -88839
12074 115408 10146 -3306 -41409 173022 70463 -139983 205530 68285 57842 -61483 -320508
12063 -320508 142339 -31646 -148529 12641 274123 1396088 1099242 386562 63129 -363587
12052 -47038 15607 -199482 353151 358533 -240166 378752 -51077 197828 -197984 223119
12041 111542 43880 -206141 539905 142386 -150628 -9074 75791 -22924 -174577 -342278
12031 -342278 -58247 -21306 23750 -424334 265083 122563 -103803 -19415 -204933 -137053
$$ packed form
12110B01081k0461g38F1989L2289M9770J27538m4649n3545f6578l2524f339D7205
12097B76561m5707b74247a08594d0994j11581d1835B27142D7880J17925c2045
12086A45206d427B26977c5292n8257B03231b94627a43216E311a34608B38525h8839
12074A15408A0146c306l8103A73022G0463a39983B05530F8285j0443f1483k59025
12063c20508A42339c1646j16883A2641K61482J121965k96846C86562F3129c63587
12052d7038A5607a99482C53151N382b40166C78752e1077A97828a97984B23119
12041A11542D3880b06141E39905A42386a50628i074G5791b2924j51653j67701
12031c42278e8247b1306B3750d24334B65083A22563a03803a9415j85518O7880
$$ plain form
12021 -137053 190246 -211297 40086 58939 -13653 -127101 -438407 142156 -170422 -279552
12011 -279552 6443 144510 -209832 49573 154199 -229346 47654 -11492 291047 141449
12000 80156 -203447 -176864 98761 112781 48744 -173883 98687 167125 192875 -291635 -78647
11988 -107215 -147764 -330963 -194813 -89551 178875 -106700 -140645 19529 15986 -37121 148022
11976 -5583 -139901 -271562 -235557 -208355 -35441 -160315 58172 232806 83395 -38498 271265
11964 -371605 -142941 -9720 -139220 290171 -23177 -62203 299613 -87756 98388 99104 -129854
11952 83761 178376 180088 -138008 -43222 31329 -26207 -195043 -137758 117343 -105624 292043
11940 -143225 -70881 203326 19477 -233363 -114211 27793 390757 -148010 -7180 -312565
$$ packed form
12021a37053A90246b11297D0086J8853a3653j13448l11306A42156a70422j09130
12011b79552F443J38067b09832D9573J04626b29346D7654a1492B91047A41449
12000H0156b03447K6583I8761J4020D8744a73883I8687O8438K5750b91635g8647
11988a07215m0549j83199J36150h9551A78875a06700l3945A9529l543c7121A48022
11976e583j34318j31661L6005K7202c5441j24874E8172J74634H3395c8498B71265
11964c71605a42941i720j29500B90171b3177l9026B99613h7756I8388P16a29854
11952H3761R4615J712a38008d3222C1329b6207j68836N7285A17343a05624B92043
11940a43225g0881B03326A9477b33363a14211B7793L62964a48010g180l05385
$$ plain form
11930 -312565 4095 -108551 74305 -19449 48318 -46419 -103688 -299248 -257371 260955 -248814
11918 -63194 -103920 28593 -200972 -128607 186305 31373 164564 117132 163310 118036 -152412
11906 -45951 -120677 149745 -231893 166949 31533 265721 -150184 23928 66324 -158781
11895 -258142 -247517 -133225 -68076 20458 116712 84372 -118495 -23833 -270378 93096 171544
11884 171544 -10065 -14092 -113573 39082 -276391 -137857 124273 242228 63771 -152844 115411
11872 -248423 139892 61716 132378 -74420 147421 -82849 -28458 48588 -64811 -140850 -177191
11861 -177191 -178125 -386001 6143 -98580 153990 -21839 -83107 -80571 -275918 -126378 183500
11849 -51023 -550178 -84465 -409462 -122082 -6991 -8119 -30715 15035 -242753 143574 172497
$$ packed form
11930c12565D095a08551G4305a9449D8318d6419n7269j95560M1877B60955b48814
11918f3194m0726B8593b00972P2365A86305C1373J33191m7432M6178m5274a52412
11906d5951p4726A49745b31893A66949C1533K34188a50184B3928M2396a58781
11895b58142J0625J14292O5149B0458R6254l2340a18495b3833k46545I3096P8448
11884A71544a0065m027r9481C9082b76391a37857A24273J17955F3771a52844A15411
11872b48423A39892F1716P0662g4420A47421h2849b8458D8588f4811p6039l6341
11861a77191r34k07876F143i8580A53990b1839o1268K536j95347a26378A83500
11849e1023m99155h4465l24997a22082f991j128k2596A5035b42753A43574K8923
$$ plain form
11838 172497 -237802 -25509 -244961 -273200 -180732 -254728 -145897 -82820 25621 10028 -29554
11826 144577 326325 -284997 53800 -94273 -305555 -148827 -21662 71717 36550 -266121
11815 17703 -85790 -293987 -154556 -341672 -116476 -101572 -199889 21456 130840 -132235
11804 89460 -316648 -150106 -12415 -125091 117561 123891 -176674 323726 299395 164203
11794 164203 84560 101272 110185 -184025 -3611 38945 42505 -156121 -55154 67944 148668 241805
11782 241805 -141660 73676 50428 178560 103358 87832 -90721 -77240 -27392 -40539 -196618
11771 -196618 -200052 -18175 -26637 -75705 -84503 104148 81318 195629 304271 105241 212377
11760 212377 56475 -172004 -55304 -19644 -162933 -91402 -126284 64611 66056 -92032 164181
$$ packed form
11838A72497b37802b5509k19452k8239R2468p3996J08831O3077B5621A0028b9554
11826A44577J81748b84997E3800i4273k11282a48827b1662G1717l5167b66121
11815A7703h5790k08197J39431j87116a16476J4904r8317B1456J09384a32235
11804H9460c16648a50106a2415j12676A17561O330a76674C23726k4331j35192
11794A64203p9643J6712Q913a84025c611C8945L560a56121e5154F7944Q0724R3137
11782B41805a41660G3676k3248J28132p5202j5526i0721J3481b7392j3147j56079
11771a96618l434a8175q462m9068q798A04148k2830J14311J08642A05241J07136
11760B12377E6475a72004e5304a9644j43289P1531l4882F4611J445i2032A64181
$$ plain form
11748 198484 -279752 -122801 -194391 271143 -173618 -63692 201943 -63792 -76692 -10294
11737 10574 -42002 -104146 -150455 2676 330896 4416 -76059 -103792 54009 -46918 19122 151238
11725 151238 218713 -237509 162996 8671 107478 66082 -7994 14559 109257 5631 30885 -17808
11712 -311816 -141132 -246208 41192 -101722 23300 88093 71436 10244 196123 -270117
11701 168903 97246 -61012 -72908 -415 -240778 -100159 -18337 88038 195450 188436 130542
11690 130542 -305073 -163849 -50661 45020 144852 -169750 -7882 52364 145498 95829 308551
11679 308551 -60620 -104437 -87327 69520 6891 -424488 -53028 -66161 68159 26530 261197
11668 261197 -29636 39243 -268101 -16800 7979 -346162 -8532 226132 135804 -89966 40363
$$ packed form
11748A98484b79752a22801p1590B71143a73618f3692B01943f3792j2900a0294
11737A0574d2002o2144m6309B676L28220D416g6059k7733E4009d6918A9122J32116
11725A51238O7475b37509A62996H671R8807m1396g994A4559R4698E631K5254a7808
11712c11816a41132j05076D1192a01722B3300O4793j6657A0244J85879b70117
11701A68903p1657f1012j1896d15k40363a00159a8337H8038J07412p014n7894
11690A30542c05073J41224e0661D5020R9832a69750g882E2364R3134m9669K12722
11679C08551f0620m3817J7110F9520F891d24488e3028j3133F8159B6530K34667
11668B61197b9636C9243b68101a6800G979c46162h532B26132r0328h9966D0363
$$ plain form
11656 -28334 -341849 319380 280009 175496 1595 -125377 -21935 218081 216920 -136620 -217175
11645 -217175 -17580 211654 -138608 -5300 294385 57396 20927 -142895 225485 197874 23436
11633 135853 121026 -104484 -172763 -31048 99020 235614 -61374 88410 57730 -454334 204466
11621 160247 -271470 -122127 -297348 -136644 169594 -213902 142363 173925 120925 74316
11611 74316 -70190 205194 113476 310863 23124 79607 -193403 168509 233127 57517 -144535
11599 -61081 -166495 -109835 -63609 219202 178965 187862 -97518 -179120 202104 129141 -134802
11587 79262 69695 89932 -122547 90784 -29187 -21611 71062 -344606 -141178 89453 176487
11576 176487 332343 229631 29548 291281 120497 139649 244704 -101601 91945 165031
$$ packed form
11656b8334l13515C19380l9371j04513A595a25377b1935B18081j161a36620q0555
11645b17175a7580B11654a38608e300B94385E7396B0927a42895B25485k7611B3436
11633A35853j4827a04484o8279c1048I9020J36594f1374H8410l0680d54334B04466
11621A60247b71470a22127j75221a36644A69594b13902A42363L1562n3000m6609
11611G4316g0190B05194r1718J97387B3124N6483a93403A68509O4618E7517a44535
11599f1081j05414N6660M6226B19202m0237Q897i7518q1602B02104p2963a34802
11587G9262r567K0237a22547I0784b9187P576G1062c44606a41178H9453Q7034
11576A76487J55856j02712B9548K61733A20497J9152J05055a01601I1945P3086
$$ plain form
11566 165031 52509 51811 -51308 15273 -39768 161438 59691 282185 179350 125185 104251
11555 104251 -200942 -155246 8756 -151820 153717 114980 151416 5295 20050 142333 46808
11543 66895 244235 299821 18056 -138935 -15184 -68792 77667 66105 -307192 2919 -270921
11531 -112818 -39914 -162642 192295 -220788 198420 292461 302873 38575 178784 161812
11521 161812 156559 101757 32306 61911 -73944 230254 -246128 129576 95126 -106327 -217808
11510 -217808 -179156 -44085 48528 -281015 -76279 185793 -18358 192773 -91849 105400 -9986
11498 -147913 449731 197156 159717 -281138 -138470 269870 363464 -223438 190964 -352
11487 33991 -8163 -213792 209594 -74014 -72008 -92122 -45999 84842 86762 194655 -131697
$$ packed form
11566A65031E2509o98e1308A5273c9768A61438E9691K22494j02835n4165k0934
11555A04251b00942M5696H756a51820A53717l8737L6436E295J4755J22283D6808
11543F6895J77340N5586A8056a38935a5184n3608G7667j1562c07192B919b70921
11531a12818c9914j22728A92295b20788A98420R4041J0412C8575J40209j6972
11521A61812n253n4802C2306K9605g3944B30254b46128A29576l4450a06327j11481
11510b17808L8652d4085D8528b81015g6279A85793a8358A92773i1849A05400i986
11498a47913D49731A97156l7439b81138a38470B69870R3594b23438A90964c52
11487C3991h163k05629B09594g4014K006k0114d5999H4842J920J07893a31697
$$ plain form
11475 7729 -84056 39513 63793 134841 -13959 86309 215722 301302 145844 12901 -31241
11463 78276 87158 -8620 312528 -114953 -225923 -347825 135662 79896 -67133 121278 34262
11451 -489348 285217 -113015 321378 236995 24033 65313 -94825 32814 -65917 11107 32551
11440 32551 19490 62584 -196846 -1314 231514 100081 15708 87366 163073 -225869 188828
11428 -174083 203813 349445 1614 6729 284508 -55848 -259 295592 -45527 333341 9100
11416 22462 -133265 -119549 -86232 86418 108882 -86222 25707 234431 -365 -172579 -255772
11405 -255772 -127567 -183867 192253 51301 -47355 206950 500429 105019 -17146 -9834 -288290
11394 -288290 317864 124877 -239208 256649 293465 84151 -239151 -132814 -244971 10488
$$ packed form
11475G729h4056C9513K4280P1048a3959H6309J29413Q5580A45844A2901c1241
11463G8276Q882h620C12528a14953j10970j21902A35662n5766f7133A21278C4262
11451d89348B85217a13015C21378q4383B4033M1280i4825C2814f5917A1107K1444
11440C2551j3061M3094a96846a314B31514A00081A5708P1658P5707b25869A88828
11428a74083B03813J45632A614N115K77779e5848b59B95592d5527C33341I100
11416B2462a33265J3716L3317H6418K2464h6222B5707K08724c65j72214q3193
11405b55772a27567n6300A92253E1301d7355B06950K93479A05019a7146P312k78456
11394b88290C17864A24877b39208B56649L6816H4151b39151J06337j12157A0488
$$ plain form
11383 288582 252388 311975 76161 -134199 61928 -22907 116678 78420 -37046 -77860 171326
11371 -52314 212157 423470 -107181 -58196 71730 136990 32744 -281606 -21391 -324845 -189261
11360 -189261 53041 219 17048 173321 189535 202267 -316788 57688 -321814 -187118 128665
11348 10422 -342809 -95656 204473 60143 24275 -18274 184300 76734 -47369 -250476 -168270
11337 -168270 -154627 88707 85510 -142970 -18545 259233 -112300 114574 277774 -80523 -93798
11326 -93798 20977 244798 -120365 101547 -229785 156682 -97353 216376 69398 -235430
11315 -8819 52448 111717 -28978 -84658 180886 -356039 219394 167368 56673 -27741 30729
11303 -24236 -60266 -60647 -343297 -135287 16131 206291 102196 -1485 -98383 65534 -107228
$$ packed form
11383B88582l6194N9587G6161a34199F1928b2907A16678l8258c7046m0814A71326
11371e2314B12157K11313a07181M8985G1730O5260C2744b81606b1391l03454J35584
11360a89261E3041B19J6829J56273J6214J2732c16788E7688c21814J34696A28665
11348A0422c42809i5656B04473F0143B4275a8274A84300G6734d7369k03107Q2206
11337a68270J3643H8707l197a42970a8545B59233a12300A14574J63200h0523j3275
11326i3798B0977K23821a20365A01547b29785A56682i7353B16376F9398b35430
11315h819E2448N9269b8978n5680A80886c56039B19394n2026E6673b7741C0729
11303b4236l6030l81k82650a35287A6131J90160A02196a485r6898F5534a07228
$$ plain form
11291 -370566 -63445 146326 201766 -314705 -18138 343187 -312956 -69847 -146975 15873 141697
11280 141697 115062 -21107 34768 -139351 -329493 -324912 424237 156485 -93989 -72454 -130805
11269 -130805 73195 70084 7566 -322923 108843 -87063 -98383 49937 -435872 -276151 -180199
11258 -180199 93839 342490 -38290 -81421 -135397 -177232 -93147 -66776 258513 -4694 -225105
11247 -225105 153085 -67671 121904 -184295 -84653 -71368 107198 15765 225303 74780
11236 -214820 -24572 4317 -280809 253359 132417 -111411 352797 -169046 17036 -310278
11225 -57358 163078 164164 -166853 135576 -158929 -63977 302454 35715 -85156 -86269 -325224
11214 -325224 -306874 -98994 -48990 150977 75200 -193929 -65333 -62168 34288 -66037 -31643
$$ packed form
11291c70566f3445A46326N5440c14705a8138C43187c12956f9847p7128A5873J25824
11280A41697k6635b1107C4768a39351j90142M581D24237A56485i3989K1535n8351
11269a30805G3195l111G566c22923A08843h7063j1320D9937d35872J59721R5952
11258a80199I3839K48651c8290m3131n3976m1835Q4085K6371B58513d694k20411
11247b25105A53085f7671A21904a84295h4653J3285A07198A5765K09538G4780
11236b14820b4572D317b80809B53359j20942a11411C52797a69046A7036c10278
11225e7358A63078J086a66853A35576a58929f3977C02454C5715h5156j113k38955
11214c25224J8350i8994d8990A50977G5200a93929f5333L165C4288f6037c1643
$$ plain form
11202 -30913 -185603 111351 -39110 1294 -12008 -230767 -297892 427624 184141 -81171 -195777
11191 -195777 -168860 194934 194369 133956 -221625 218854 -128576 55118 40209 8817 -102318
11179 -21096 -48431 451161 -238146 -180802 229147 -175564 -156060 -208290 -118304 -302822 63880
11167 31166 -53941 -15893 -102623 -539239 21857 -114700 144735 -232160 400522 -108099
11156 -38521 -44508 40840 84024 -356628 -87899 78475 139476 5091 -77636 -365939 -321766 -223658
11144 -223658 65674 385674 -127598 -160700 45021 -195161 60591 -181781 -15135 203422
11133 -73490 -26666 -295597 181558 -74610 81383 -19908 -123497 -219484 -212278 52451 72231
11122 72231 -152678 -155429 -210648 -38088 44856 -24020 237019 181558 -145004 49507 287720
$$ packed form
11202c0913j54690A11351c9110A294a2008k18759o7125D27624A84141h1171j14606
11191a95777K6917A94934n65o0413b21625B18854a28576E5118j4909H817a02318
11179b1096k7335D51161b38146N7344B29147a75564J9504n2230Q9986j84518F3880
11167C1166e3941a5893q6730m36616B1857a14700A44735b32160D00522a08099
11156c8521n987D0840M3184c56628h7899G8475O1001E091g7636k88303M4173R8108
11144b23658F5674L20000a27598l3102D5021a95161F0591a81781a5135B03422
11133g3490b6666k68931A81558g4610H1383a9908j03589r5987P206E2451J9780
11122G2231a52678k751n5219c8088D4856b4020B37019n5461a45004D9507K38213
$$ plain form
11111 287720 -99672 102756 -49199 -7370 -121295 -4656 21289 -148594 117323 305068 276395
11100 276395 2616 246799 237233 324617 282382 83726 332 -91118 248578 3312 568006 -237289
11087 -8807 332077 78231 -177894 168129 217086 245633 103657 140369 -314608 160467 131303
11076 131303 18715 360565 276701 702065 110754 413323 225729 210022 216011 76268 258168
11065 258168 379310 598559 425763 112563 239789 -2701 149895 492381 417305 109097
11054 682514 604227 248596 435066 414489 493665 628696 676230 57049 494749 539678 472682
11043 472682 302651 443894 251208 440323 881725 405752 483955 699023 484381 823340
11033 823340 353278 58037 567197 373550 682185 421082 368763 302845 494647 703784
$$ packed form
11111B87720i9672A02756d9199g370j13925d656B1289a48594A17323J87745k8673
11100B76395B616K44183r566Q7384m2235H3726C32i1118B48578C312N64694b37289
11087h807C32077G8231a77894A68129M8957K8547A03657L6712c14608A60467k9164
11076A31303A8715L41850q3864M25364A10754L02569j87594j5707N989G6268J81900
11065B58168J21142K19249j72796A12563J27226b701A49895L42486p5076A09097
11054F82514p8287B48596J86470k0577P9176J35031M7534E7049M37700M4929o6996
11043D72682j70031J41243j92686J89115M41402D05752P8203K15068k14642L38959
11033H23340C53278E8037N09160j93647L08635k61103n2319o5918J91802K09137
$$ plain form
11023 703784 537427 550010 182158 609140 116612 451255 402367 363692 848117 311229
11012 419439 531434 174571 404474 586665 312995 362604 402965 484042 438707 458413
11002 458413 397671 720656 699581 177878 696915 589245 572986 219713 327726 842053
10992 842053 503642 416032 553790 681392 540989 476932 670608 437126 641361 792439
10982 792439 431804 766784 1074848 496537 917536 1113802 1048868 1456545 1854186 1844972
10972 1844972 2163055 2119205 2058775 1819897 2282135 1738552 1635673 1237300 1073877 1232640
10962 1232640 1029487 1216295 1015814 1143991 1185657 1218315 752328 1034037 973105 637500
10952 637500 696931 632556 503358 240971 337598 391154 537290 142182 -66111 223166
$$ packed form
11023G03784j66357J2583A82158M26982A16612L34643m8888l8675M84425C11229
11012D19439J11995A74571K29903J82191k73670M9609M0361Q1077m5335J9706
11002D58413o0742L22985k1075A77878N19037j07670j6259B19713J08013N14327
10992H42053l38411q7610J37758J27602j40403o4057J93676k33482K04235J51078
10982G92439l60635L34980L08064D96537M20999J96266o4934M07677L97641r214
10972A844972L18083m3850o0430k38878M62238n43583j02879l98373j63423J58763
10962A232640k03153J86808k00481J28177M1666L2658m65987K81709o0932l35605
10952F37500N9431o4375j29198B40971R6627N3556J46136A42182f6111B23166
$$ plain form
10941 269682 174653 446085 344057 261790 137920 -78726 713336 115424 236286 -68712
10930 146195 63604 -44278 -43217 66469 -167079 290052 -49928 235578 221125 -129305 133287
10918 205690 224967 -93981 -51553 -200730 -76123 -261404 162053 191773 73658 -4176 135541
10906 -221864 47765 16975 -134340 62122 201613 -245328 248052 186152 -41840 168364
10895 -16281 -157632 46851 101637 7279 -100496 -162839 15475 -124669 -37593 -293132 -101224
10883 190528 141455 -190508 32375 -90618 42270 6714 -114788 -81666 83160 235340 -52151
10871 111852 87666 -259161 72748 -29713 -77902 -49973 -119931 75125 22836 -67139 -176641
10860 -176641 194640 42561 -249668 39660 -37204 177514 -161180 83793 154123 -139455
$$ packed form
10941B69682r5029K71432j02028q2267j23870g8726G13336A15424J20862f8712
10930A46195F3604d4278J061F6469a67079B90052d9928B35578j4453a29305A33287
10918B05690J9277i3981M2428j49177g6123j85281A62053K9720G3658d176A35541
10906b21864D7765A6975a34340F2122J39491b45328B48052o1900d1840A68364
10895a6281j41351D6851N4786G279a00496o2343A5475a24669c7593k55539a01224
10883A90528m9073a90508C2375i0618D2270F714a14788L3122H3160J52180e2151
10871A11852k4186b59161G2748b9713m8189K7929o9958G5125B2836f7139j09502
10860a76641A94640D2561b49668C9660c7204A77514a61180H3793P0330a39455
$$ plain form
10849 -219911 350409 -203993 173058 -24350 89164 -45598 397024 -167707 200394 123280
10839 123280 -41350 72369 -14134 -16493 66569 -175622 -42985 180619 -477652 172040 171069
10828 171069 -12238 115183 -172830 -55031 34374 -195049 83774 -52770 -255316 -360806
10818 -360806 -102762 -110715 2576 -27743 134036 -28320 -32194 -113197 -141185 -28850 147993
10806 185822 148413 -363351 -150712 -270935 -146066 -398041 -239632 63174 -283824 249418
10795 -169735 -210040 -268663 11823 -148257 299875 -71011 -74324 415592 110172 -238239 -67083
10783 -230402 8976 -241620 130916 92860 399220 167234 -215021 -191610 -70481 -195923
10773 -195923 -147255 -400630 119296 220655 237289 248663 -52376 -50031 110377 -146761 -39101
$$ packed form
10849b19911C50409b03993A73058b4350H9164d5598C97024a67707B00394p7114
10839A23280d1350G2369a4134k359F6569a75622d2985A80619d77652A72040r71
10828A71069a2238A15183a72830e5031C4374a95049H3774e2770k02546j05490
10818c60806a02762p953B576b7743A34036b8320l874q1003k7988b8850A47993
10806A85822l7409c63351a50712j20223J24869k51975J58409F3174b83824B49418
10795a69735m0305n8623A1823a48257B99875g1011l313D15592A10172b38239f7083
10783b30402H976b41620A30916l8056L06360A67234b15021K3411g0481j25442
10773a95923M8668k53375A19296J01359J6634J1374e2376K345A10377a46761c9101
$$ plain form
10761 -25553 66284 -110649 -310621 -419305 173765 -47670 289963 200061 -64713 -362706
10751 -362706 149518 -85791 -55505 -166909 -195504 -124005 337815 229109 30008 -207092
10740 74044 -302028 -100878 -10396 -548291 234233 -355969 -13688 -107414 167494 36338
10729 -33889 -214312 216787 -215076 34411 35500 -34603 265417 -114840 -319816 238436
10718 -179028 -174878 -248024 132345 9054 -97 -251807 -213101 -63104 196769 42061 -103677 -134038
10706 -134038 -4182 -72605 -68514 -85708 242042 207137 -323665 -33199 -97102 -49899 -352410
10695 -352410 182949 -46743 131271 -150382 -340836 -81623 65409 -2496 181445 -29131 127358
10683 -23933 -42649 198342 -344349 -49266 -17746 -90040 -8217 -123904 -236840 -36293 -177615
$$ packed form
10761b5553F6284a10649j99972j08684A73765d7670B89963q9902f4713k97993
10751c62706A49518h5791L0286j11404k8595P1499C37815j08706C0008b07092
10740G4044c02028a00878a0396n37895B34233c55969a3688r3726A67494C6338
10729c3889j80423B16787b15076C4411J089c4603B65417a14840k04976B38436
10718a79028M150p3146A32345I054i7k51710L8706f3104A96769D2061a03677l0361
10706a34038d182o8423M091j7194B42042l4905c23665c3199o3903M7203l02511
10695c52410A82949d6743A31271a50382j90454h1623F5409b496A81445b9131A27358
10683b3933j8716A98342c44349d9266a7746p2294h217j15687j12936c6293j41322
$$ plain form
10672 -177615 -300152 152370 -105133 22565 -43409 -84657 226652 -387652 164700 -67547
10661 228753 -141401 -57713 26446 -218211 -274945 8310 -140779 -231729 -52499 -37380 -71313
10650 -71313 -69127 -115584 -65344 1351 159741 114023 -7500 -156298 157091 -143732 4176 50325
10638 50325 171631 -247943 217558 -334175 303370 -172642 115111 -18992 46523 -325884
10627 -154524 -2598 52550 -59964 8202 -53210 269313 150195 -241194 -47059 -148810 -52174
10615 -152613 -51035 45146 -39248 217324 -35270 13947 118604 378933 -227310 172436
10604 -184393 -65248 -105930 122644 85006 58779 -56619 78614 -281606 -514965 81697 379726
10593 379726 -104044 115294 -155252 -65821 -109195 46391 -123627 183899 -105705 158448
$$ packed form
10672a77615j22537A52370a05133B2565d3409m1248B26652c87652A64700f7547
10661B28753a41401e7713B6446b18211n6734H310a40779r0950e2499J5119l3933
10650g1313K186m6457N0240A351J58390m5718g500j48798A57091a43732D176M6149
10638E0325J21306b47943B17558c34175C03370a72642A15111a8992D6523c25884
10627a54524b598E2550e9964H202e3210B69313j19118b41194d7059j01751e2174
10615a52613e1035D5146c9248B17324c5270A3947J04657K60329b27310A72436
10604a84393f5248m0682A22644l7638k6227e6619G8614b81606k33359H1697K98029
10593C79726a04044A15294a55252f5821m3374D6391a23627A83899a05705A58448
$$ plain form
10582 175598 -126561 -65539 -361140 -234744 -82983 198654 33794 90552 73891 -111785
10571 -94198 27768 -451271 234325 -201929 62613 -367550 188799 430149 122173 273915
10561 273915 -38193 -152847 -100357 -240775 -305542 -151920 117694 -213787 35888 -178736
10550 -151959 196281 15700 221776 53026 112740 -37738 91358 -58203 -241089 16060 -36476
10538 136755 52896 6129 -29317 -269076 109055 -164185 20084 184764 202655 -434117 -320633
10527 -320633 -51293 -124164 -45796 -50887 69817 131304 -119474 -312554 272675 -65884 -11963
10515 30494 218189 -234480 69088 -311820 14159 143455 -213146 86115 63958 -70687 -68807
10504 -68807 -125320 -41921 -146440 2529 -69080 52653 -359337 -9248 -126201 296860 -69420
$$ packed form
10582A75598a26561O1022k95601J26396h2983A98654C3794N6758j6661a11785
10571i4198B7768d51271B34325b01929F2613c67550A88799K41350A22173J51742
10561B73915c8193j14654N2490j40418o4767a51920A17694b13787C5888a78736
10550a51959A96281A5700K06076E3026N9714c7738I1358e8203j82886A6060c6476
10538A36755E2896F129b9317k39759A09055a64185B0084J64680J7891d34117J13484
10527c20633e1293p2871d5796n091F9817O1487a19474j93080B72675f5884a1963
10515C0494J87695b34480F9088c11820A4159J29296b13146H6115k2157g0687J880
10504f8807n6513d1921j04519B529f9080E2653c59337i248j16953B96860f9420
$$ plain form
10492 -10711 222895 -32730 96705 -49113 -65971 -114763 265524 -212947 -441688 148103 -327710
10480 -4832 -98307 249677 219718 -202576 -195622 175394 30857 -14808 -13322 117937 -131084
10468 -100015 -461407 -152780 -52648 -268543 271068 -482014 -103475 -132185 135729 -99133
10457 147139 -91277 -101023 -233703 56170 163956 -169085 210706 20268 218476 -60153 -88103
10446 -88103 -152733 -103463 -342847 -127811 27022 4637 -346348 -11214 -74589 41959 -316403
10434 -52613 4835 257814 -387040 51857 -300996 62650 -87687 20884 339251 173921 42696
10422 150385 290325 -88825 53173 41003 -26933 144778 210199 234824 -121603 -1538 -291232
10411 -291232 -31612 -65924 63143 -122740 -333231 -69731 -193172 -11799 114552 -48574 -89093
$$ packed form
10492a0711B22895c2730I6705d9113j6858m8792B65524b12947k28741A48103c27710
10480d832r3475B49677k9959b02576O954A75394C0857a4808J486A17937a31084
10468a00015l61392a52780e2648k15895B71068d82014a03475k8710A35729i9133
10457A47139i1277r746j32680E6170J07786a69085B10706B0268J98208f0153k7950
10446h8103o4630M9270k39384a27811B7022D637c46348a1214o3375D1959c16403
10434e2613D835K52979c87040E1857c00996F2650h7687B0884L18367j65330D2696
10422A50385J39940h8825E3173j2170b6933A44778O5421K4625a21603a538k89694
10411b91232c1612l4312F3143a22740k10491f9731j23441a1799A14552d8574m0519
$$ plain form
10400 -89093 705 -92025 -254757 188701 -162999 -63108 -355408 -53740 212438 311404 54924
10388 19100 330432 173363 253307 158109 233972 -98541 282614 367616 143758 283136 76063
10376 333893 -75010 295337 -141508 197288 29923 225532 36978 203148 196054 -93059 410659
10364 371798 441214 315046 246494 152113 225946 223304 448699 57979 456821 39990 343389
10353 343389 208023 301739 163114 383150 273600 68705 291603 294127 -199413 -151885
10343 -151885 201712 28047 -39635 291846 -103683 -43547 -380245 -45059 -208918 198221
10332 292784 135147 -21454 31665 -17878 -18316 -262427 77760 40040 222831 163845 120459
10321 120459 63876 362714 -172960 63831 205221 38735 -95656 -220536 116392 -18642
$$ packed form
10400h9093G05i2025j62732A88701a62999f3108k92300e3740B12438R8966E4924
10388A9100L11332j57069P9944r5198P5863i8541B82614Q5002A43758J39378G6063
10376C33893g5010B95337a41508A97288B9923J95609C6978J66170p094i3059D10659
10364C71798O9416j26168o8552r4381P3833k642K25395E7979L98842C9990L03399
10353C43389j35366R3716j38625K20036j09550F8705K22898K524a99413M7528
10343a51885B01712B8047c9635B91846a03683d3547l36698d5059j63859A98221
10332B92784A35147b1454C1665a7878m38k44111G7760l7720J82791n8986m3386
10321A20459n6583K98838a72960F3831J41390C8735i5656j24880A16392a8642
$$ plain form
10310 -133364 -18218 345988 28202 -110402 -84025 -172148 166102 -284869 -44905 -165775
10300 -165775 109388 497801 -92910 -386345 13402 194434 121280 -297418 -187247 -201320
10290 -201320 -38006 -291787 32982 107757 124876 -190906 66879 -359934 -115542 -70820 -36329
10279 -36329 -6506 -136430 -166274 150145 -169286 4822 73153 127596 -54724 21572 -167368
10267 7780 -55488 17830 -68493 357813 -214733 73185 9066 10690 23707 368976 126801
10255 32673 -79599 -265597 -52628 205818 -18296 70340 241972 -65584 -43202 273960 -73553
10243 253091 -102574 186393 -66905 -325957 116828 -205346 -51793 75961 326194 139674
10232 -284076 67627 -106816 -66264 44981 -86671 -187831 253163 -188191 96984 -272683
$$ packed form
10310a33364a8218C45988B8202a10402K6377q8123A66102b84869d4905j20870
10300a65775A09388L88413i2910k93435A3402J81032p3154b97418J10171j4073
10290b01320c8006k53781C2982P4775J7119a90906F6879c59934a15542M4722L4491
10279c6329f506j29924k9844A50145a69286D822O8331N4443e4724B1572a67368
10267G780e5488A7830f8493C57813b14733G3185I066J624J3017L45269A26801
10255C2673g9599j85998e2628B05818a8296G0340J71632f5584K2382B73960g3553
10243B53091a02574A86393f6905k59052A16828b05346e1793G5961K50233A39674
10232b84076F7627a06816M0552D4981h6671j01160B53163a88191I6984b72683
$$ plain form
10221 229657 108015 -206113 -14191 17086 -406875 89946 -306499 134860 3039 -4837 14818
10209 47003 99811 -24592 363810 161568 48696 149018 -141445 -194939 -135099 273300 -79338
10197 92031 -32703 -234731 -27699 -208022 -137759 -204793 -203821 143824 -124053 -233834 -247512
10186 -247512 -105658 -167236 129759 -110000 -243516 -27639 81685 -14310 149486 -76009
10175 -97837 48412 103388 -100962 -90026 -207287 -278848 330332 -106737 239748 -76610 -221562
10164 -221562 -83975 -33246 -58685 75835 365973 -30467 -171019 127075 -282294 -150160
10154 -150160 -186743 -186283 36549 -108856 -107465 -17221 -3924 92663 -245033 23763 374363 -79115
10141 -16160 -258323 -130780 -28989 -267460 -431605 -17242 78293 49144 -257048 -156870
$$ packed form
10221B29657A08015b06113a4191A7086d06875H9946c06499A34860C039d837A4818
10209D7003N2808b4592C63810A61568D8696J00322a41445n3494N9840B73300g9338
10197I2031c2703k02028b7699j80323P0263o7034R72A43824a24053j09781j3678
10186b47512a05658o1578A29759a10000j33516b7639H1685a4310A49486g6009
10175i7837D8412N4976a00962J0936j17261p1561C30332a06737B39748g6610j44952
10164b21562h3975c3246k5439G5835K90138c0467j40552A27075b82294J32134
10154a50160l6583M60C6549a08856J391a7221c924I2663b45033B3763L50600g9115
10141a6160k42163J27543b8989k38471j64145a7242G8293k9149b57048J00178
$$ plain form
10131 -156870 453618 -69586 -130539 -123900 -148930 -29322 36489 41536 -245382 21457 -71916
10119 134399 -33706 -145995 -40617 76216 -294266 -241025 -20916 -152489 369649 -131754
10108 -89953 28324 24410 283397 -187862 -71728 -94276 164935 -196920 151684 -93901 320110
10096 -378877 98575 -35424 36273 2858 -128068 19713 433854 -79928 86494 124409 -130021
10084 -143009 -611042 109415 -174604 -119850 19719 171418 -99281 -973 -138037 -10994 -189172
10073 -189172 345834 -119589 -443984 23946 -200745 226887 181292 171122 -201149 -288309
10063 -288309 -42656 52143 8754 -253599 244611 -114765 -195557 -90291 225197 111411 -65719
10051 -157857 50248 200291 -109546 -66853 300778 -306593 -66789 153372 -58944 -113605
$$ packed form
10131a56870D53618f9586o0953O639k5030b9322C6489N047b45382B1457g1916
10119A34399c3706j12289d0617G6216b94266N3241b0916j31573C69649a31754
10108h9953B8324l914K58987a87862g1728k2548A64935a96920A51684i3901C20110
10096c78877I8575c5424C6273B858a28068A9713M14141g9928H6494L7915a30021
10084a43009m68033A09415a74604N4754A9719J51699i9281i73j37064a0994j78178
10073a89172C45834a19589l24395B3946b00745B26887m5595j0170b01149q7160
10063b88309d2656E2143H754b53599B44611a14765q0792i0291B25197A11411f5719
10051a57857E0248J50043a09546M2693C00778c06593f6789A53372e8944n4661
$$ plain form
10041 -113605 -20746 -216072 -112963 16404 -361027 -366341 239966 -59773 -210736 -334784
10031 -334784 291190 -28191 117659 -287073 -142197 26098 104221 -353490 -197643 -515667
10021 -515667 -33840 -122120 21159 158933 267419 -365898 207030 248840 -36073 -341223
10011 -341223 115461 -186306 17147 -5452 81364 81322 -3943 -219311 -243081 -216345 -378903 -229140
9999 -229140 -140312 178559 -123791 -129123 -154388 -52683 325583 -66932 -270399 -114479 -116532
9988 -116532 154999 -103978 -104581 138883 -213724 -291491 -169601 -106242 91642 112209 -37056
9976 35577 -148265 -351269 -111532 -209889 -197016 182099 -99784 -273529 -14956 1483 -234593
9964 -132585 -177962 -199698 -153365 -119819 -73169 60856 138472 -87813 246714 6167 77868 189612
$$ packed form
10041a13605b0746j95326J03109A6404c61027n314B39966e9773j50963j24048
10031c34784B91190b8191A17659b87073a42197B6098P8123c53490J55847l18024
10021e15667c3840q8280B1159J37774J08486c65898B07030M1810c6073l05150
10011c41223A15461a86306A7147e452H1364m2c943k15368k3770K6736j62558J49763
9999b29140Q8828A78559a23791n332k5265e2683C25583f6932k03467a14479k053
9988a16532A54999a03978o03A38883b13724p7767J21890O3359I1642K0567c7056
9976C5577a48265k03004a11532r8357J2873A82099i9784j73745a4956A483b34593
9964a32585m5377k1736M6333L3546M6650F0856P7616h7813B46714F167P1701J11744
$$ plain form
9952 189612 13042 -250778 194203 10696 101776 -111310 -370388 -50723 6234 -230606 -27542
9940 -68773 197263 -160363 -33034 -6669 55430 10025 17938 -373115 -68616 315471 -124791
9928 -252271 -168141 -201949 -183379 -240511 107028 -307893 194941 182922 -317798 -254101 -173039
9917 -173039 -160515 -61884 49416 -13582 152903 -451 -25062 -37821 -278960 -46388 101726
9905 263400 144688 -303750 182584 -135166 -35492 18467 -103468 -614640 121356 -268680
9894 50555 39912 -55937 -41107 150822 148401 119917 142135 94945 -213743 -72633 231533
9882 -260657 139256 -514703 -161110 -83727 -92759 109924 -314482 6439 -411551 155047 349606
9871 349606 149037 344111 -93839 -209802 -60868 -33537 186242 -253374 306934 925 46978
$$ packed form
9952A89612A3042b50778A94203A0696R1080a11310k59078e0723F234b30606b7542
9940f8773A97263a60363c3034f669E5430A0025P913c73115f8616C15471a24791
9928b52271Q4130l3808J8570n7132A07028c07893A94941j2019c17798O3697Q1062
9917a73039J2524f1884D9416a3582A52903d51k4611j2759k41139d6388A01726
9905B63400j18712c03750A82584a35166c5492A8467a03468n11172A21356b68680
9894E0555j0643e5937J4830A50822k421k8484K2218m7190b13743g2633B31533
9882b60657A39256e14703a61110P7383r032A09924c14482F439d11551A55047J94559
9871C49606A49037J95074i3839j15963f0868K7331A86242b53374C06934I25M6053
$$ plain form
9860 46978 45898 -280103 267401 -5808 -128883 8688 -237194 -166707 165028 29693 213577
9849 213577 -77965 130586 -256878 -171451 199151 -133200 -294549 -161300 -7385 -269304
9839 -269304 -320293 38678 -172608 14268 161292 -228412 146189 -45577 -51257 -232167 -208456
9828 -208456 -331979 -201318 -158397 -285773 70631 -110534 44372 -108499 -146309 64113 -69704
9816 15841 29404 -88668 -53078 -198426 -295881 -390578 -121609 -203523 -109356 -237969 -133817
9805 -133817 -253743 159214 -76978 -74738 -8926 78040 7698 -183200 125394 66319 83866
9794 83866 200 -53159 -73966 -94307 10632 334763 -167416 194160 -86552 -349948 66600
9782 -295391 -114570 -22795 -237112 61406 -32540 -74635 -263697 34736 -112298 170533 -64688
$$ packed form
9860D6978j080b80103B67401e808j23075H688b37194P0487A65028B9693J83884
9849B13577g7965A30586b56878Q5427A99151a33200j61349J33249g385k61919
9839b69304n0989C8678a72608A4268J47024b28412A46189d5577n680j80910K3711
9828b08456j23523J30661M2921j27376G0631a10534D4372a08499l7810F4113f9704
9816A5841J3563h8668L5590j45348r7455r4697a21609q1914R4167j28613J04152
9805a33817j19926A59214g6978K240h926G8040G698a83200A25394n9075J7547
9794H3866B00e3159k0807k0341A0632L24131a67416A94160h6552k63396F6600
9782b95391a14570b2795k14317F1406c2540m2095j89062C4736a12298A70533f4688
$$ plain form
9770 -330016 -160682 -147695 -302650 -260948 13214 116823 -111627 177302 159480 -179011
9759 -227910 -20331 -208822 -207009 -9331 -174223 -191923 114531 78067 107579 3985 239843
9748 239843 -48512 -178689 130802 -41240 -6756 19419 -289032 120934 -443226 -204195 -449379
9737 -449379 35624 -175253 20332 37929 309117 -57672 129982 -307401 242850 -195039
9726 107001 232616 215171 -107968 121004 -9866 200293 14005 -135874 -176387 -66845 -147846
9715 -147846 -235977 -10473 -40528 11569 -13233 -184485 -54746 -273346 -41178 -31487 265501
9703 -105416 -499426 -319032 -63214 -124347 -136853 -265743 27241 -45203 99877 -21316 -194213
9692 -194213 173301 -503457 104959 136513 -171885 29339 -163756 270445 -69874 369330
$$ packed form
9770c30016a60682J2987j54955M1702A3214J03609a11627A77302j7822a79011
9759b27910b0331j88491J813i331j64892j7700A14531l6464K9512C985K35858
9748B39843d8512j30177A30802d1240f756A9419b89032A20934d43226b04195k45184
9737d49379C5624a75253B0332J7597K71188e7672A29982c07401B42850a95039
9726A07001J25615j7445a07968A21004i866B00293A4005a35874m0513f6845q1001
9715a47846q8131a0473l0055A1569a3233j71252e4746k18600d1178R691B65501
9703a05416l94010J80394f3214o1133j2506j28890B7241d5203I9877b1316j72897
9692a94213A73301e03457A04959L1554a71885B9339a63756B70445f9874C69330
$$ plain form
9681 -142095 -173711 -51643 136650 34607 -136815 -280783 -191291 -321586 14029 -140307 -30678
9669 -12100 -157163 -254080 143805 -44938 -241496 75327 160755 -354987 41528 -158078 -327899
9658 -327899 -288551 108412 244111 -289217 205118 22755 -339586 -474524 45343 -195805
9647 -277041 60243 -174202 317061 -390515 -169600 -4363 -215046 -88681 67062 27906 -142005
9635 52926 134736 42596 -155897 -329269 -224294 93222 -103093 28718 -248397 -42302 -294807
9624 -294807 -348341 110769 134779 144503 -504629 10016 32072 224465 19265 -368119 245229
9612 173595 -281274 -151706 -534590 40490 22888 -100170 282834 -68294 42485 70089 -57995
9600 4798 -171117 -172848 60815 -23938 -311893 124411 72425 34331 -15469 -98819 -42776 -49213
$$ packed form
9681a42095l1616e1643A36650C4607a36815j43968Q9492j30295A4029a40307c0678
9669a2100j45063r6917A43805d4938j96558G5327Q5428c54987D1528a58078j69821
9658c27899L9348A08412J35699b89217B05118B2755c39586j34938D5343a95805
9647b77041F0243a74202C17061c90515a69600d363k10683h8681F7062B7906a42005
9635E2926Q1810D2596a55897j73372J04975I3222a03093B8718b48397d2302k52505
9624b94807n3534A10769K4010R724e04629A0016K2056J92393A9265c68119B45229
9612A73595b81274J29568l82884D0490j7602a00170B82834f8294D2485K7604e7995
9600D798a71117j731F0815b3938k87955A24411n1986C4331a5469q3350d2776o437
$$ plain form
9588 -49213 -167961 22406 -42261 -202234 -48726 -149962 288375 52046 -40492 -54075 -271369
9577 -271369 -138998 19862 405 -107911 -45001 127357 -183581 -14521 -173530 240190 11781
9565 -326314 -52376 -57114 -145971 -84861 -11304 -28556 -87972 325133 -293194 -133383 -124173
9554 -124173 31287 -164278 74519 -173880 -48273 -46885 -318748 -33534 354826 118408 -100507
9542 -96549 273367 111637 -80865 68525 -311030 -67179 -41045 140018 -212004 -280191 199941
9530 130208 158371 91523 -43269 -268548 14411 -214909 -136140 14870 -146656 -212718 9454
9518 -427731 -337677 -278934 92403 36359 112965 -70622 -23748 -196934 -159974 -275599 -153085
9507 -153085 -33591 -123926 67880 213122 -19514 40782 -39651 -104600 -93015 -85160 -94703 349724
$$ packed form
9588d9213j18748B2406d2261j59973d8726j01236B88375E2046d0492j3583k17294
9577b71369J32371A9862D05a07911d5001A27357a83581a4521j59009B40190A1781
9565c26314e2376m738q8857O1110a1304j7252n9416C25133b93194a33383R210
9554a24173C1287a64278G4519a73880d8273J388k71863c3534C54826A18408a00507
9542i6549B73367A11637h0865F8525c11030f7179K6134A40018b12004o8187A99941
9530A30208K8163o6848d3269k25279A4411b14909P8769A4870a46656o6062I454
9518d27731R0054N8743I2403C6359P6606g0622b3748j73186L6960j15625J22514
9507a53085c3591r0335F7880J45242a9514D0782c9651o4949J1585P855r543C49724
$$ plain form
9494 22610 -247234 41751 54216 -132646 68106 -144452 -247276 -51234 -49306 -70047 -7122
9482 13091 -145501 -79705 68988 -129642 -29038 -238895 -458120 226594 -14904 -227995 -337066
9471 -337066 75883 -104986 -98316 77582 -51923 193313 -31329 189974 -33139 318188 -29541
9459 229794 -179440 -322571 -223579 -203254 -534046 -412470 -419991 -46276 56445 -122205 81698
9447 -287353 -22358 118288 233236 53569 134892 -150223 -228609 -137439 -336838 -379032 -381755
9436 -381755 213575 -67494 -9295 -195589 -111806 180152 -66360 -150572 -41229 -100090 -264216
9425 -264216 51186 -59557 -191799 193779 -133932 205475 63051 -38062 -163807 -232874 -38922
9413 -271287 -182125 -76111 -42447 -260289 230724 -441338 341185 8893 55597 -4275 -443389
$$ packed form
9494B2610b47234D1751J2465a32646F8106a44452j02824e1234J928k0741g122
9482A3091a45501O5796F8988a29642b9038k09857k19225B26594a4904k13091j09071
9471c37066G5883a04986O670G7582e1923A93313c1329A89974c3139C18188b9541
9459B29794a79440j43131R8992K0325l30792J21576p521d6276E6445a22205H1698
9447b87353b2358A18288J14948E3569Q1323a50223p8386R1170j99399m2194k723
9436c81755B13575f7494i295j86294Q3783A80152f6360q4212d1229n8861j64126
9425b64216E1186e9557j32242A93779a33932B05475F3051c8062j25745o9067c8922
9413b71287Q9162g6111L3664k17842B30724d41338C41185H893M6704d275m39114
$$ plain form
9402 -443389 -86440 -40682 467114 -398829 37600 119246 18930 -357359 210623 -123424 -23763
9390 -376904 138053 -60602 -54343 43551 -131088 -181895 -225929 -228034 -23310 -7449 -288621 -239829
9378 -239829 -132187 -297059 -35059 -175393 -4252 -86769 -277742 -257985 121390 -55565 23958
9366 -116007 -41009 2931 163078 -13332 -215181 -65304 14266 53090 178912 -60127 9048
9354 -378939 -46058 -311335 -446655 -30309 -155556 -19744 -145197 -150141 -177454 -223046 -220215
9343 -220215 263096 -197136 161383 -178068 2081 379262 -468960 -56345 -184865 83803
9332 57240 -131732 -179722 -169663 -89255 -335558 -128632 34816 109392 -179076 -2843 -234209
9321 -234209 117086 -203639 -301695 55263 -238638 4033 -92146 -79775 276431 113211 167749
$$ packed form
9402d43389h6440d0682D67114c98829C7600Q1646A8930c57359B10623a23424b3763
9390c76904A38053f0602O259D3551a31088n0807m4034k105b3310g449k81172M8792
9378b39829J07642j64872c5059j40334d252q2517j90973J9757A21390e5565B3958
9366a16007d1009B931J60147a3332k01849f5304A4266L8824J25822f0127I048
9354c78939d6058k65277j35320c0309j25247a9744j25453m944k7313m5592K831
9343b20215B63096a97136A61383a78068B081L77181d68960e6345j28520H3803
9332E7240a31732m7990J0059Q0408k46303a28632C4816P4576a79076b843k31366
9321b34209A17086b03639r8056E5263b38638D033i2146J2371B76431A13211N4538
$$ plain form
9310 167749 -16542 -122935 -90601 269714 -89322 131724 -229508 63373 -185794 -159282 79496
9298 -33267 -230024 -17009 15847 -10480 -9766 -401494 -517277 -592 -123719 169343 113269 25635
9285 -66433 12359 -178029 -99212 150107 7516 26612 -16537 -226814 -367790 -14305 -148939
9274 -148939 -104291 185477 -85991 -277104 116824 -90959 204214 112511 66756 -265268 125576
9262 -154296 -35700 148477 -119685 -121232 -121651 -86356 26897 82379 62378 133515 -87665 -404087
9250 -404087 -173852 -104968 -277964 151676 -183978 276820 -5958 114594 38582 -41112 -337823
9239 -337823 81113 -48538 -328227 60684 -57465 183784 -412132 36733 -81426 -235630 -258942
9228 -258942 196236 144024 -191516 101348 -395391 -114711 -5001 15252 -40453 100456 -9057
$$ packed form
9310A67749a6542j06393L2334B69714h9322A31724b29508F3373a85794K6512G9496
9298c3267j96757a7009A5847a0480P14l91728j15783e92j23127A69343n6074B5635
9285f6433A2359a78029P8817A50107G516J9096a6537k10277j40976a4305j34634
9274a48939M4648A85477h5991j91113A16824i0959B04214r1703m5755b65268A25576
9262a54296c5700A48477a19685j547m19L5295B6897N5482k0001P1137h7665l16422
9250d04087a73852O8884j72996A51676a83978B76820e958A14594C8582d1112k96711
9239c37823H1113d8538k79689F0684e7465A83784d12132C6733h1426j54204k3312
9228b58942A96236n2212a91516A01348c95391a14711e001A5252d0453A00456i057
$$ plain form
9216 -165191 52631 88946 -29234 171596 25617 -48281 -186837 -179469 240890 -32145 -39255
9205 -39255 -180418 -268475 137794 -218132 -286113 102734 -286745 -157476 107886 286301
9195 286301 51565 130685 -187859 -80313 -103832 -150558 221536 12771 123853 -124458 -50105
9183 -229224 162694 -18534 -209808 -212510 -8274 -146136 31813 20680 -91995 31274 -261132
9171 46351 -368906 -248255 -87770 108000 116130 -105527 104618 -50819 -52040 -72444 -32336
9159 297856 -1470 2940 -42480 244716 -134593 121833 -111261 -380228 87488 27603 102445
9148 102445 -124082 -179624 -74616 -182116 63284 -29997 57035 -332800 -311545 19518 -45671
9136 8473 232289 -27333 -160633 -54974 -164282 -142888 47131 -81171 47705 -130032 -48979
$$ packed form
9216a65191E2631L6315b9234A71596B5617d8281j38556P368B40890c2145p110
9205c9255j41163q8057A37794b18132o7981A02734b86745J29269A07886J78415
9195B86301E1565P9120a87859h0313k3519m6726B21536A2771J11082a24458e0105
9183b29224A62694a8534j91274k702h274j37862C1813j1133i1995C1274b61132
9171D6351c68906J20651h7770A08000Q130a05527A04618e0819j221k0404c2336
9159B97856a470B940d2480B44716a34593A21833a11261k68967H7488B7603P4842
9148A02445a24082n5542g4616j07500F3284b9997E7035c32800K1255A9518d5671
9136H473K23816b7333j33300e4974j09308K1394D7131h1171D7705a30032d8979
$$ plain form
9124 80149 7810 -169225 94279 -38537 54548 58038 -210411 -129879 -133209 269177 -119511 -59003
9111 3793 235631 -478987 -332687 165829 70346 121800 134414 -90971 -59347 390473 -93129
9099 -135185 -5995 43455 51659 238445 140185 -266393 155753 103073 52925 162075 -56063
9087 -117757 79949 -89548 -59394 -243896 -206856 -215047 -195208 -148427 152688 -177927 102468
9075 -83090 -150457 45587 -99780 -72879 84345 -153524 16106 -171629 -52214 68477 -49390
9063 -260069 -420166 -179490 -99450 -233346 -268487 -110629 23964 157253 -14660 41300 116657
9052 116657 -260854 -109386 -129709 156252 155290 -322322 -12049 149538 -240979 -72204 -82817
9041 -82817 -77390 26099 -84203 -240764 -149636 -75108 -120731 -100386 -11712 -118968 -276216
$$ packed form
9124H0149G810a69225I4279c8537E4548L490b10411Q0532l330B69177a19511e9003
9111C793K31838d78987J46300A65829G0346N1454J2614i0971L1624C90473i3129
9099a35185e995D3455Q204J86786r8260b66393A55753n2680n0148J09150e6063
9087a17757G9949h9548L0154j84502L7040q191J9839M6781A52688a77927A02468
9075h3090o7367D5587i9780K6901H4345a53524A6106a71629e2214F8477d9390
9063b60069j60097a79490Q0040j33896l5141a10629B3964J33289a4660D1300P5357
9052A16657b60854a09386k0323A56252r62c22322a2049A49538b40979g2204j0613
9041h2817N427B6099h4203j56561R1128P4528m5623K0345a1712j07256j57248
$$ plain form
9030 -276216 -371588 70402 -69912 4150 -10881 72099 83417 186934 -100985 -183016 44903
9018 22306 -229423 -291993 45820 -455000 -35476 -145295 71984 25536 -3986 -109640 -228932
9007 -228932 -255638 -89028 -306567 10614 -191180 -98186 -43719 -81202 -122504 207649 -49205
8995 -190247 -42818 -243092 -198733 -128377 -125918 26465 -57976 -45552 -276969 -98538 -356016
8984 -356016 -462436 62681 207132 124947 214532 -52093 42786 -65047 44696 102639 -38901
8972 -37833 -51160 -44548 -12340 -145920 -214052 -140114 -293204 -22714 22930 -43095 94080 208354
8960 208354 -169164 -259073 163851 169498 148351 -42263 -14014 -177367 -31155 123566 215133
8949 215133 122645 324744 -15676 113578 -88716 174814 127417 343627 60923 -116751 164610
$$ packed form
9030b76216r5372G0402f9912D150a0881G2099J1318J03517a00985q2031D4903
9018B2306b29423o2570D5820d55000c5476j09819G1984B5536c986j05654j19292
9007b28932k6706h9028k17539A0614a91180R2994d3719l7483m1302B07649d9205
8995a90247d2818k00274M4359P0356K459B6465e7976J2424k31417i8538k57478
8984c56016j06420F2681J44451q2185Q9585e2093D2786f5047D4696N7943c8901
8972c7833j3327O612a2340j33580o8132P3938j53090b2714B2930d3095I4080J14274
8960B08354a69164q9909A63851N647k1147d2263a4014j63353c1155A23566R1567
8949B15133r2488K02099a5676A13578h8716A74814m7397K16210F0923a16751A64610
$$ plain form
8937 129294 -341503 -108720 3055 412281 -280878 -287043 -61391 125061 -156890 186714 53791
8925 -235553 54193 332952 285510 1498351 7360996 1967856 488919 256083 268186 76378
8914 -179543 -32537 51408 80645 303522 28976 -172902 6431 64374 96909 273747 -72162
8902 332857 -58872 -18686 67281 -153693 -246197 -18276 51316 -185480 -266071 -165033 3656
8890 -184849 -161668 -239145 51314 54324 2737 38898 200188 -232314 319296 108699 103071
8879 103071 56530 -19370 -19166 256061 -175734 -95076 45816 -171419 230970 152541 -109791
$$ packed form
8937A29294c41503a08720C055M09226b80878o165f1391A25061a56890A86714E3791
8925b35553E4193K78759m7442J212841N862645A967856D88919k32836J2103G6378
8914a79543c2537E1408K9237K22877B8976a72902F431N7943L2535J76838g2162
8902C32857e8872a8686F7281a53693r2504a8276E1316a85480q0591J01038C656
8890a84849K3181p7477E1314L010B737L6161J61290b32314C19296A08699n628
8879A03071m6541a9370K04B56061a75734Q0658D5816a71419B30970p8429a09791
$$ [...]
##END NTUPLES=NMR SPECTRUM
##END=
