##TITLE=AC1666_DOMRH14357_8570712_2nxr0FZYMF
##JCAMPDX= 6.0         $$ Bruker NMR JCAMP-DX V2.0
##DATA TYPE= NMR SPECTRUM
##DATA CLASS= NTUPLES
##ORIGIN= BRUKER
##OWNER= Administrator
$$ 1.72 TOPSPIN		Version 2.1
$$ 2014-04-11 21:20:28.632 -0700  Administrator@X
$$ Compression mode = diff/dup
##.OBSERVE FREQUENCY= 400.02188249412
##.OBSERVE NUCLEUS= ^1H
##.ACQUISITION MODE= SIMULTANEOUS (DQD)
##.ACQUISITION SCHEME= undefined
##.AVERAGES= 64
##.DIGITISER RES= 22
##SPECTROMETER/DATA SYSTEM= spect
##.PULSE SEQUENCE= noesygpps1d.comp
##.SOLVENT NAME= COFFEE_meoh
##.SHIFT REFERENCE= INTERNAL, COFFEE_meoh, 1, 14.96121
##AUDIT TRAIL= $$ (NUMBER, WHEN, WHO, WHERE, PROCESS, VERSION, WHAT)
$$ ##TITLE= Audit trail, TOPSPIN		Version 2.1
$$ ##JCAMPDX= 5.01
$$ ##ORIGIN= Bruker BioSpin GmbH
$$ ##OWNER= Administrator
$$ $$ E:\/data/COFFEE/nmr/AC1666_DOMRH14357_8570712_2nxr0FZYMF/12/pdata/1/auditp.txt
$$ ##AUDIT TRAIL=  $$ (NUMBER, WHEN, WHO, WHERE, PROCESS, VERSION, WHAT)
(   1,<2014-04-11 21:20:23.241 -0700>,<Administrator>,<X>,<go>,<TOPSPIN 2.1>,
      <created by zg
	started at 2014-04-11 21:08:54.149 -0700,
	POWCHK enabled, PULCHK disabled,
       configuration hash MD5:
       C8 4E 4E 5D D3 5C D8 9E 9F 52 82 E0 59 8A DE 15
       data hash MD5: 64K
       9F 94 7C 53 B1 A4 4E 5A F3 32 E1 20 90 0A AD 17>)
(   2,<2014-04-11 21:20:26.225 -0700>,<Administrator>,<X>,<proc1d>,<TOPSPIN 2.1>,
      <Start of raw data processing
       efp LB = 0.3 FT_mod = 6 PKNL = 1 PHC0 = 0 PHC1 = 0 SI = 128K 
       data hash MD5: 128K
       6D A1 AC D5 A3 B8 61 64 3C CA F1 8B 17 28 C6 38>)
(   3,<2014-04-11 21:20:27.335 -0700>,<Administrator>,<X>,<proc1d>,<TOPSPIN 2.1>,
      <pk PHC0 = -81.95251 PHC1 = 0 
       data hash MD5: 128K
       DA 26 A0 5D FC 5A D5 76 BB 94 F3 2E 01 7D 99 29>)
(   4,<2014-04-11 21:20:27.866 -0700>,<Administrator>,<X>,<proc1d>,<TOPSPIN 2.1>,
      <abs ABSG = 1 
       data hash MD5: 128K
       27 B8 B5 85 AE C2 B9 31 C0 B9 BA 79 2D 0E AA 6D>)
(   5,<2014-04-11 21:20:27.975 -0700>,<Administrator>,<X>,<proc1d>,<TOPSPIN 2.1>,
      <abs ABSG = 2 
       data hash MD5: 128K
       94 22 F7 94 26 7F D6 1D 10 27 4E AE 05 B5 B7 55>)
(   6,<2014-04-11 21:20:28.116 -0700>,<Administrator>,<X>,<proc1d>,<TOPSPIN 2.1>,
      <abs ABSG = 3 
       data hash MD5: 128K
       AF DE BC 81 69 21 7B 6B 92 3C 34 9D E4 02 CA 10>)
(   7,<2014-04-11 21:20:28.257 -0700>,<Administrator>,<X>,<proc1d>,<TOPSPIN 2.1>,
      <abs ABSG = 4 
       data hash MD5: 128K
       03 7F 46 35 A0 7C F8 DD 81 4F 31 50 87 C9 A6 59>)
(   8,<2014-04-11 21:20:28.413 -0700>,<Administrator>,<X>,<proc1d>,<TOPSPIN 2.1>,
      <abs ABSG = 5 
       data hash MD5: 128K
       9B 68 78 05 29 8A 14 24 9F 18 BB 8B 9D D9 5F 1D>)
$$ ##END=
$$ 
$$ $$ hash MD5
$$ $$ 9E CE 11 2D 44 6E BE 0C FE 95 E1 E4 BE 14 6E C9
##$RELAX= 
##$RELAX= 
##$RELAX= 
##$RELAX= 
##$RELAX= 
##$RELAX= 
##$RELAX= 
##$RELAX= 
$$ Bruker specific parameters
$$ --------------------------
##$DU= <E:\>
##$EXPNO= 12
$$ [...]
##$TP07= 0
##$TPNAME0= <>
##$TPNAME1= <>
##$TPNAME2= <>
##$TPNAME3= <>
##$TPNAME4= <>
##$TPNAME5= <>
##$TPNAME6= <>
##$TPNAME7= <>
##$TPOAL= (0..7)
0.5 0.5 0.5 0.5 0.5 0.5 0.5 0.5
##$TPOFFS= (0..7)
0 0 0 0 0 0 0 0
##$TUNHIN= 0
##$TUNHOUT= 0
##$TUNXOUT= 0
##$USERA1= <user>
##$USERA2= <user>
##$USERA3= <user>
##$USERA4= <user>
##$USERA5= <user>
##$V9= 5
##$VALIST= <valist>
##$VCLIST= <CCCCCCCCCCCCCCC>
##$VD= 0
##$VDLIST= <DDDDDDDDDDDDDDD>
##$VPLIST= <PPPPPPPPPPPPPPP>
##$VTLIST= <TTTTTTTTTTTTTTT>
##$WBST= 1024
##$WBSW= 4
##$XGAIN= (0..3)
0 0 0 0
##$XL= 0
##$YL= 0
##$YMAX_a= 5274129
##$YMIN_a= -11355115
##$ZGOPTNS= <>
##$ZL1= 120
##$ZL2= 120
##$ZL3= 120
##$ZL4= 120
##$ABSF1= 14.96121
##$ABSF2= -5.596972
##$ABSG= 5
##$ABSL= 3
##$ALPHA= 0
##$AQORDER= 0
##$ASSFAC= 0
##$ASSFACI= 0
##$ASSFACX= 0
##$ASSWID= 0
##$AUNMP= <proc_prof1d_extract.lims>
##$AXLEFT= 0
##$AXNAME= <>
##$AXNUC= <1H>
##$AXRIGHT= 0
##$AXTYPE= 0
##$AXUNIT= <>
##$AZFE= 0.1
##$AZFW= 0.1
##$BCFW= 0
##$BC_mod= 0
##$BYTORDP= 0
##$COROFFS= 0
##$CY= 15
##$DATMOD= 1
##$DC= 0
##$DFILT= <>
##$DTYPP= 0
##$F1P= 0
##$F2P= 0
##$FCOR= 0.5
##$FTSIZE= 131072
##$FT_mod= 6
##$GAMMA= 0
##$GB= 0
##$INTBC= 1
##$INTSCL= 1
##$ISEN= 128
##$LB= 0.3
##$LEV0= 0
##$LPBIN= 0
##$MAXI= 10000
##$MC2= 0
##$MEAN= 0
##$ME_mod= 0
##$MI= 0
##$NCOEF= 0
##$NC_proc= -2
##$NLEV= 6
##$NOISF1= 0
##$NOISF2= 0
##$NSP= 0
##$NTH_PI= 0
##$NZP= 0
##$OFFSET= 14.96121
##$PC= 1
##$PHC0= -81.95251
##$PHC1= 0
##$PH_mod= 1
##$PKNL= yes
##$PPARMOD= 0
##$PPDIAG= 0
##$PPIPTYP= 0
##$PPMPNUM= 2147483647
##$PPRESOL= 1
##$PSCAL= 4
##$PSIGN= 0
##$PYNMP= <proc.py>
##$REVERSE= no
##$SF= 400.020009553405
##$SI= 131072
##$SIGF1= 0
##$SIGF2= 0
##$SINO= 400
##$SIOLD= 131072
##$SPECTYP= <>
##$SREGLST= <1H.CDCl3>
##$SSB= 0
##$STSI= 131072
##$STSR= 0
##$SW_p= 8223.68421052631
##$SYMM= 0
##$S_DEV= 0
##$TDeff= 65536
##$TDoff= 0
##$TI= <>
##$TILT= no
##$TM1= 0
##$TM2= 0
##$TOPLEV= 0
##$USERP1= <user>
##$USERP2= <user>
##$USERP3= <user>
##$USERP4= <user>
##$USERP5= <user>
##$WDW= 1
##$XDIM= 131072
##$YMAX_p= 367597888
##$YMIN_p= -11973
##$CURPLOT= <Network HP LaserJet P1505>
##$CURPRIN= <$Network HP LaserJet P1505>
##$DFORMAT= <normdp>
##$LAYOUT= <+/1D_H.xwp>
##$LFORMAT= <normlp>
##$PFORMAT= <normpl>
##$SURQMSG= 1
$$ End of Bruker specific parameters
$$ ---------------------------------
##NTUPLES= NMR SPECTRUM
##VAR_NAME=  FREQUENCY,     SPECTRUM/REAL,   SPECTRUM/IMAG
##SYMBOL=    X,             R,               I
##VAR_TYPE=  INDEPENDENT,   DEPENDENT,       DEPENDENT
##VAR_FORM=  AFFN,          ASDF,            ASDF
##VAR_DIM=   131072,        131072,          131072
##UNITS=     HZ,            ARBITRARY UNITS, ARBITRARY UNITS
##FACTOR=    0.0627417313425164, 1,          1
##FIRST=     8223.62146879497, 590,          -44086
##LAST=      0,             1853,            -44544
##MIN=       0,             -11973,          0
##MAX=       8223.62146879497, 367597888,    0
$$ Real data points
##PAGE= N=1
##DATA TABLE= (X++(R..R)), XYDATA
$$ [...]
$$ plain form
63917 5042969 4949409 4821771 4661766 4473448 4262896 4036629 3800348 3558703 3315543 3074264
63907 3074264 2838108 2610245 2393504 2190185 2002165 1830894 1676903 1539409 1416798
63898 1416798 1307642 1211129 1126568 1052836 988503 932328 883368 840687 803201 769855 739841
63887 739841 712571 687608 664689 643702 624472 606641 589906 574349 560334 548061 537343
63876 537343 527852 519428 512149 506312 502380 500636 500682 501569 502717 504676 508697 515609 525254 536870 549727
63861 549727 563554 578775 596365 617051 640523 665802 692605 721930 754860 790966 828384
63850 828384 865477 901997 938514 975143 1011266 1046306 1080235 1113071 1144115 1171915 1194983
63839 1194983 1212410 1223918 1229572 1229581 1224243 1213952 1199176 1180326 1157538 1130667 1099755 1065637
$$ packed form
63917E042969r3560j27638j60005j88318k10552k26267k36281k41645k43160k41279
63907C074264k36156k27863k16741k03319j88020j71271j53991j37494j22611
63898A416798j09156r6513q4561p3732o4333n6175m8960m2681l7486l3346l0014
63887G39841k7270k4963k2919k0987j9230j7831j6735j5557j4015j2273j0718
63876E37343r491q424p279n837l932j744M6Q87J148J959M021O912R645J1616J2857
63861E49727J3827J5221J7590K0686K3472K5279K6803K9325L2930L6106L7418
63850H28384L7093L6520L6517L6629L6123L5040L3929L2836L1044K7800K3068
63839A194983J7427J1508N654Rn338j0291j4776j8850k2788k6871l0912l4118
$$ plain form
63827 1065637 1029823 993594 957324 920821 884115 847539 811161 774707 738229 702468 668230
63816 668230 635660 604501 574862 547238 521800 498195 476238 456370 439114 424355 411508
63805 411508 400109 389823 380059 370190 360343 351521 344600 339321 334368 328331 320660 312043 303960 297594
63791 297594 292924 289031 285298 281916 279071 276203 272594 268455 264834 262383 260626 258556 255749 252798
63777 252798 250723 250004 250150 250312 250187 249982 249545 248164 245552 242518 240118 238550 237391 236502 235977 235519
63761 235519 234719 233836 233482 233540 233282 232608 232290 232645 232837 231991 230371 228935 228187 227965 227989 228162 228541 229283 230381
63742 230381 231317 231441 230866 230528 231142 232602 234624 237294 240576 243851 246548 248787 250987 253280 255743
63727 255743 258650 261977 265148 267882 270824 274712 279372 284218 289231 294615 299906 304383 308130 311714
$$ packed form
63827A065637l5814l6229l6270l6503l6706l6576l6378l6454l6478l5761l4238
63816F68230l2570l1159k9639k7624k5438k3605k1957j9868j7256j4759j2847
63805D11508j1399j0286r764r869r847q822o921n279m953o037p671q617q083o366
63791B97594m670l893l733l382k845k868l609m139l621k451j757k070k807k951
63777B52798k075p19J46J62j25k05m37j381k612l034k400j568j159q89n25m58
63761B35519q00q83l54N8k58o74l18L55J92q46j620j436p48k22K4J73L79P42J098
63742B30381R36J24n75l38O14J460K022K670L282L275K697K239K200K293K463
63727B55743K907L327L171K734K942L888M660M846N013N384N291M477L747L584
$$ plain form
63713 311714 314945 316916 317306 316667 315308 312821 309091 305013 301781 299898 299108 298786 298193 296910 295337
63698 295337 294351 294282 294583 294681 294684 295093 296228 298115 300518 302923 304929 306767 308987 311448 313103 313077 311558
63681 311558 309460 307649 306731 307038 308328 309774 310681 311107 311621 312734 314810 318158 322736 327893 332779
63666 332779 337029 340881 344617 348025 350433 351264 350642 349348 348049 346665 344675 341798 338056 333405 327923
63651 327923 322320 317664 314440 312359 311061 310314 309422 307376 304197 301461 300769 302029 303906 305672 307850
63636 307850 311066 314959 318529 321200 323338 325818 329213 333391 337878 342496 347436 352745 358140 363497
63622 363497 369196 375796 383607 392777 403463 415598 428738 442518 457166 473365 491673 512178
63610 512178 534525 558172 582931 609338 638059 668670 699428 728550 755246 779067 798812
$$ packed form
63713C11714L231J971L90o39j359k487l730m078l232j883p90l22n93j283j573
63698B95337r86o9L01R8LM09J135J887K403K405K006J838K220K461J655k6j519
63681C11558k098j811r18L07J290J446R07M26N14J113K076L348M578N157M886
63666C32779M250L852L736L408K408Q31o22j294j299j384j990k877l742m651n482
63651C27923n603m656l224k081j298p47q92k046l179k736o92J260J877J766K178
63636C07850L216L893L570K671K138K480L395M178M487M618M940N309N395N357
63622C63497N699O600P811R170J0686J2135J3140J3780J4648J6199J8308K0505
63610E12178K2347K3647K4759K6407K8721L0611L0758K9122K6696K3821J9745
$$ plain form
63599 798812 812850 820382 821802 818016 810049 799207 786811 773585 759746 745682 731886 718107
63587 718107 703261 686549 668134 648506 627833 606482 585632 566538 549340 533262 517982
63576 517982 504222 492850 484015 477405 472841 470168 468873 468380 468664 470136 472892 476475 480429 484648
63562 484648 489042 493344 497643 502773 509583 517947 526954 536084 545805 556975 570155 585659 603872
63549 603872 625182 649774 677668 708788 742835 779266 817482 856713 895351 930461 958323
63538 958323 975864 982050 978276 967442 952345 934725 915705 896672 879113 863579 849316 835095
63526 835095 820043 803621 785365 765030 742660 718279 691899 664167 636585 610604 586591
63515 586591 563961 542065 520772 500478 481910 465653 451558 438854 427078 416467 407166 398651
$$ packed form
63599G98812J4038P532J420l786p967j0842j2396j3226j3839j4064j3796j3779
63587G18107j4846j6712j8415j9628k0673k1351k0850j9094j7198j6078j5280
63576E17982j3760j1372q835o610m564k673j295m93K84J472K756L583L954M219
63562D84648M394M302M299N130O810Q364R007R130R721J1170J3180J5504J8213
63549F03872K1310K4592K7894L1120L4047L6431L8216L9231L8638L5110K7862
63538I58323J7541O186l774j0834j5097j7620j9020j9033j7559j5534j4263j4221
63526H35095j5052j6422j8256k0335k2370k4381k6380k7732k7582k5981k4013
63515E86591k2630k1896k1293k0294j8568j6257j4095j2704j1776j0611r301q515
$$ plain form
63503 398651 390546 383483 378258 374367 370298 365300 360092 355722 352484 350125 348398 347016 345611 344164
63489 344164 343136 342892 343244 343788 344348 344912 345520 346434 348097 350622 353644 356900 360633 365131 370130 375002
63473 375002 379325 382969 385863 388029 389694 390932 391272 390042 387148 383270 379225 375397 371837 368633
63459 368633 365915 363600 361378 359063 356896 355390 354909 355413 356599 358150 359873 361823 364372 367952 372537
63444 372537 377616 382886 388785 395971 404439 413640 423475 434742 448396 464717 483379 504124 527256
63431 527256 553604 583847 617332 651385 682283 707341 726038 739267 748207 754302 759648 766472
63419 766472 776146 789145 805760 826331 850758 878336 908151 939162 969744 997587 1020373 1036412
63407 1036412 1044703 1044947 1037948 1025653 1010240 993032 974465 954929 935177 915750 896276 875648
$$ packed form
63503C98651q105p063n225l891m069m998n208m370l238k359j727j382j405j447
63489C44164j028k44L52N44N60N64O08R14J663K525L022L256L733M498M999M872
63473C75002M323L644K894K166J665J238L40j230k894l878m045l828l560l204
63459C68633k718k315k222k315k167j506m81N04J186J551J723J950K549L580M585
63444C72537N079N270N899P186Q468R201R835J1267J3654J6321J8662K0745K3132
63431E27256K6348L0243L3485L4053L0898K5058J8697J3229Q940O095N346O824
63419G66472R674J2999J6615K0571K4427K7578K9815L1011L0582K7843K2786J6039
63407A036412Q291K44o999j2295j5413j7208j8567j9536j9752j9427j9474k0628
$$ plain form
63395 875648 852912 827906 801085 773031 744317 715723 688151 662111 637466 613911 591604
63384 591604 571052 552474 535656 520546 507646 497568 490351 485467 482397 480951 481050 482424 484673
63371 484673 487596 491488 497048 504851 514791 526139 538310 551534 566669 584428 604934 627957
63359 627957 653327 680968 710677 742007 774440 807715 841866 876691 911005 942625 969450
63348 969450 990534 1005848 1015172 1017765 1013333 1002917 988480 971804 953966 935504 916593 897118
63336 897118 876966 856269 835068 812814 788613 762168 734250 706186 679087 653620 630166
63325 630166 608893 589811 572970 558574 546782 537523 530764 526881 526399 528956 532489 533719 529836
63312 529836 519985 505310 487731 468837 449702 431189 414012 398645 385462 374849 366856 360774
$$ packed form
63395H75648k2736k5006k6821k8054k8714k8594k7572k6040k4645k3555k2307
63384E91604k0552j8578j6818j5110j2900j0078p217m884l070j446R9J374K249
63371D84673K923L892N560P803R940J1348J2171J3224J5135J7759K0506K3023
63359F27957K5370K7641K9709L1330L2433L3275L4151L4825L4314L1620K6825
63348I69450K1084J5314R324K593m432j0416j4437j6676j7838j8462j8911j9475
63336H97118k0152k0697k1201k2254k4201k6445k7918k8064k7099k5467k3454
63325F30166k1273j9082j6841j4396j1792r259o759l883m82K557L533J230l883
63312E29836r851j4675j7579j8894j9135j8513j7177j5367j3183j0613p993o082
$$ plain form
63300 360774 355452 350156 344932 340090 335659 331489 327631 324279 321412 318726 315965 313186 310654 308555
63286 308555 306902 305658 304811 304213 303513 302472 301315 300492 300031 299473 298569 297658 297092 296633 295824 294680 293583
63269 293583 292785 292466 293022 294656 296831 298802 300578 302617 304608 305503 304977 304013 303653 303892 304230 304500 304584
63252 304584 304060 302952 302261 302888 304362 305477 305953 306674 308332 310604 312648 313833 314015 313682 313832 315148
63236 315148 317250 319226 320739 322071 323267 324015 324395 324977 326023 327235 328444 329844 331417 332860 334354
63221 334354 336680 340167 344133 347741 350840 353598 356048 358535 361946 366679 371845 376279 380036 384090
63207 384090 388814 393633 398115 402392 406363 409361 411096 412345 414191 416917 420035 423158 426347 429779
63193 429779 433455 437350 441654 446728 452863 460091 468309 477580 488152 500034 512817 526224 540611
$$ packed form
63300C60774n322n296n224m842m431m170l858l352k867k686k761k779k532k099
63286C08555j653j244q47n98p00j041j157q23m61n58r04r11n66m59q09j144j097
63269B93583p98l19N56J634K175J971J776K039J991Q95n26r64l60K39L38K70Q4
63252C04584n24j108o91O27J474J115M76P21J658K272K044J185J82l33J50J316
63236C15148K102J976J513J332J196P48L80N82J046J212J209J400J573J443J494
63221C34354K326L487L966L608L099K758K450K487L411M733N166M434L757M054
63207C84090M724M819M482M277L971K998J735J249J846K726L118L123L189L432
63193D29779L676L895M304N074O135P228Q218R271J0572J1882J2783J3407J4387
$$ plain form
63180 540611 556445 573373 590469 607468 625033 643495 661992 679363 695334 710199 723851
63169 723851 735978 746914 757342 767201 775813 783139 789862 795890 799760 800171 797386 792440 785567 776199
63155 776199 764064 749447 732688 714259 695153 676322 657737 638826 619755 601507 584625
63144 584625 568835 554142 541368 531127 522936 515901 509728 504595 500534 497478 495519 494550 493930 493017
63130 493017 491887 491191 491477 492923 495407 498512 501769 505202 509285 514061 518818 523068 527365 532519 538440
63115 538440 544467 550492 556965 563943 571008 578004 585095 591990 597961 602867 607503 612690 618518 624745
63101 624745 631337 638252 645176 651901 658754 666214 674275 682506 690760 699624 710002 722164 735182
63088 735182 747518 758293 767812 776707 784874 791527 795950 797728 796614 792789 787128 780510 772842 763337
$$ packed form
63180E40611J5834J6928J7096J6999J7565J8462J8497J7371J5971J4865J3652
63169G23851J2127J0936J0428R859Q612P326O723O028L870M11k785m946o873r368
63155G76199j2135j4617j6759j8429j9106j8831j8585j8911j9071j8248j6882
63144E84625j5790j4693j2774j0241q191p035o173n133m061l056j959r69o20r13
63130D93017j130o96K86J446K484L105L257L433M083M776M757M250M297N154N921
63115E38440O027O025O473O978P065O996P091O895N971M906M636N187N828O227
63101F24745O592O915O924O725O853P460Q061Q231Q254Q864J0378J2162J3018
63088G35182J2336J0775R519Q895Q167O653M423J778j114l825n661o618p668r505
$$ plain form
63074 763337 751734 738649 724790 710567 696522 683239 670527 657454 643727 630441 618964
63063 618964 609531 601495 594528 588951 585110 583022 582593 583672 585837 588512 591440 594954 599703 606085
63049 606085 613857 622314 630971 639991 649707 659935 670191 680495 691344 702806 714252 725235
63037 725235 736022 746843 757143 766131 773769 780674 787277 793485 799066 803888 807815 810593 811873
63024 811873 811279 808661 804354 798874 792252 784054 774277 763833 753817 744720 736669 729958 724794 720866
63010 720866 717847 716167 716749 720025 725695 733418 743262 755408 769811 786274 804638 824928 847440
62997 847440 872529 900038 929053 958474 987617 1016061 1043280 1069011 1093815 1118677 1143996
62986 1143996 1169366 1194305 1218640 1242053 1263750 1282821 1298649 1310829 1319030 1323070 1322871 1318134
$$ packed form
63074G63337j1603j3085j3859j4223j4045j3283j2712j3073j3727j3286j1477
63063F18964r433q036o967n577l841k088m29J079K165K675K928L514M749O382
63049F06085P772Q457Q657R020R716J0228J0256J0304J0849J1462J1446J0983
63037G25235J0787J0821J0300Q988P638O905O603O208N581M822L927K778J280
63024H11873n94k618m307n480o622q198r777j0444j0016r097q051o711n164l928
63010G20866l019j680N82L276N670P723R844J2146J4403J6463J8364K0290K2512
62997H47440K5089K7509K9015K9421K9143K8444K7219K5731K4804K4862K5319
62986A143996K5370K4939K4335K3413K1697J9071J5828J2180Q201M040j99m737
$$ plain form
62974 1318134 1308287 1292919 1272094 1246237 1215973 1182279 1146491 1109811 1072771 1035397 997948
62963 997948 961332 926681 894517 864479 835920 808720 783315 760067 738750 718690 699138
62952 699138 679578 660026 641148 623677 607497 591666 575600 559875 545513 532790 521165
62941 521165 510087 499368 489024 479325 470865 463942 457910 451734 445344 439835 436140 433996 432447
62928 432447 430928 429502 428320 427259 425989 424240 422097 420119 418898 418335 417585 415900 413382 410773 408771
62913 408771 407672 407416 407667 408014 408333 408873 409746 410535 410721 410405 410306 411097 413046 416209 420483 425322 429930
62896 429930 434166 438964 445395 453403 461970 470480 479410 489499 500714 512306 523479 533613 542252
62883 542252 549374 555498 561013 565496 568158 568777 567656 564811 559951 553298 545684 537574 528687 518934
$$ packed form
62974A318134r847j5368k0825k5857l0264l3694l5788l6680l7040l7374l7449
62963I97948l6616l4651l2164l0038k8559k7200k5405k3248k1317k0060j9552
62952F99138j9560j9552j8878j7471j6180j5831j6066j5725j4362j2723j1625
62941E21165j1078j0719j0344r699q460o923o032o176o390n509l695k144j549
62928D32447j519j426j182j061j270j749k143j978j221n63p50j685k518k609k002
62913D08771j099k56K51L47L19N40Q73P89J86l16r9P91J949L163M274M839M608
62896D29930M236M798O431Q008Q567Q510Q930J0089J1215J1592J1173J0134Q639
62883E42252P122O124N515M483K662O19j121k845m860o653p614q110q887r753
$$ plain form
62869 518934 509039 499669 490557 481078 471312 461834 452771 443809 435002 426906 419795 413248 406699 400096
62855 400096 393976 389055 385664 383437 381700 380235 379377 379163 378968 378370 377806 377764 377796 377137 375924 374811 373588
62838 373588 371356 368190 365524 364495 364784 365528 366460 367498 368000 367353 365996 365067 365185 366160 367657 369517
62822 369517 371486 373206 374610 375916 377222 378359 379093 379205 378452 376855 375011 373711 373105 372608 371737 370785
62806 370785 370413 370747 371167 370991 370240 369639 369913 371156 372825 374275 375166 375416 374987 373899 372444 371164 370486
62789 370486 370397 370541 370697 371083 372108 373873 376082 378453 381004 383890 387195 391036 395649 401039 406677
62774 406677 411922 416760 421868 427851 434614 441470 447580 452239 455067 456272 456655 457180 458404 460219 462035
62759 462035 463223 463572 463333 462700 461239 458054 452658 445590 438051 430991 424565 418394 412219 406186 400512
$$ packed form
62869E18934r895r370r112r479r766r478r063q962q807q096p111o547o549o603
62855D00096o120m921l391k227j737j465q58k14j95n98n64m2L2o59j213j113j223
62838C73588k232l166k666j029K89P44R32J038N02o47j357r29J18R75J497J860
62822C69517J969J720J404J306J306J137P34J12p53j597j844j300o06m97q71r52
62806C70785l72L34M20j76p51o01K74J243J669J450Q91K50m29j088j455j280o78
62789C70486q9J44J56L86J025J765K209K371K551K886L305L841M613N390N638
62774D06677N245M838N108N983O763O856O110M659K828J205L83N25J224J815J816
62759D62035J188L49k39o33j461l185n396p068p539p060o426o171o175o033n674
$$ plain form
62744 400512 395051 389490 383925 378907 374722 370967 367194 363743 361437 360460 359946 358823 356847 354727 353464
62729 353464 353555 354615 355727 356373 357013 358534 361168 364225 366919 369146 371382 374172 377894 382726 388573
62714 388573 395080 401866 408783 416035 424193 433970 445654 458730 472340 486252 501138 517887 536912
62701 536912 558198 581663 607182 634471 663292 693834 726727 762600 801572 843112 886480
62690 886480 931385 978072 1026570 1075868 1124008 1168947 1209163 1243609 1271477 1292097 1304833
62679 1304833 1309042 1304308 1290774 1269097 1240166 1205015 1164849 1120817 1073824 1024869 975424 927053
62667 927053 880696 836663 795104 755982 718797 683134 649584 619392 592941 569253 547250
62656 547250 526840 508377 491784 476832 463751 452799 443439 434622 425775 417071 408911 401588 395320
$$ packed form
62744D00512n461n561n565n018m185l755l773l451k306r77n14j123j976k120j263
62729C53464R1J060J112O46O40J521K634L057K694K227K236K790L722M832N847
62714C88573O507O786O917P252Q158R777J1684J3076J3610J3912J4886J6749J9025
62701E36912K1286K3465K5519K7289K8821L0542L2893L5873L8972M1540M3368
62690H86480M4905M6687M8498M9298M8140M4939M0216L4446K7868K0620J2736
62679A304833M209m734j3534k1677k8931l5151m0166m4032m6993m8955m9445m8371
62667I27053m6357m4033m1559l9122l7185l5663l3550l0192k6451k3688k2003
62656E47250k0410j8463j6593j4952j3081j0952r360q817q847q704q160p323o268
$$ plain form
62643 395320 390092 385495 381120 377096 373887 371641 370103 369068 368532 368383 368291 367919 367048 365557 363562 361497
62627 361497 359740 358136 356166 353597 350756 348189 346229 344849 343701 342354 340696 339071 337834 336922
62613 336922 336117 335590 335763 336621 337465 337481 336433 334793 333354 332651 332529 332311 331555 330525 329763 329400 329296 329740
62595 329740 331390 334322 337622 340274 342261 344416 347303 350569 353441 355599 357382 359217 361071 362608
62581 362608 363779 364971 366391 367512 367439 365881 363504 361263 359610 358443 357563 356853 356101 355039 353687
62566 353687 352366 351178 349677 347393 344578 342062 340369 339338 338728 338692 339340 340228 340784 341029 341369 341817
62550 341817 342021 342007 342281 343013 343652 343678 343274 342962 342923 343098 343636 344806 346605 348827 351482 354783 358643 362436
62532 362436 365395 367236 368417 369686 371314 372882 374010 375159 377346 381116 386227 392439 400108 409765
$$ packed form
62643C95320n228m597m375m024l209k246j538j035n36j49r2l72q71j491j995k065
62627C61497j757j604j970k569k841k567j960j380j148j347j658j625j237r12
62613C36922q05n27J73Q58Q44J6j048j640j439p03j22k18p56j030p62l63j04M44
62595C29740J650K932L300K652J987K155K887L266K872K158J783J835J854J537
62581C62608J171J192J420J121p3j558k377k241j653j167q80p10p52j062j352
62566C53687j321j188j501k284k815k516j693j031o10l6O48Q88N56K45L40M48
62550C41817K04j4K74P32O39K6m04l12l9J75N38J170J799K222K655L301L860L793
62532C62436K959J841J181J269J628J568J128J149K187L770N111O212P669R657
$$ plain form
62518 409765 421456 434710 448875 463417 478338 494510 513065 534174 556886 580532 605676
62507 605676 633163 662716 693186 723798 754383 784509 813199 839585 863226 883706 900511
62496 900511 913511 923133 929891 934042 935804 935620 934193 932540 931966 933577 937747 944295 953126 964344
62482 964344 977833 993198 1010148 1028392 1046926 1063788 1076848 1084787 1087400 1085235 1078901 1068310
62470 1068310 1052477 1030355 1001969 968525 931488 892025 851293 810593 770844 732282 695010
62459 695010 659563 626580 596269 568566 543657 521883 503183 487019 472921 460820 450766
62448 450766 442553 435797 430301 426232 423833 422927 422722 422275 421348 420759 421736 424756 428990 432903 435413 436510
62432 436510 436847 436920 436667 435711 433778 430939 427654 424573 422060 419837 417296 414196 410820 407408 403831
$$ packed form
62518D09765J1691J3254J4165J4542J4921J6172J8555K1109K2712K3646K5144
62507F05676K7487K9553L0470L0612L0585L0126K8690K6386K3641K0480J6805
62496I00511J3000R622O758M151J762j84j427j653n74J611M170O548Q831J1218
62482I64344J3489J5365J6950J8244J8534J6862J3060P939K613k165o334j0591
62470A068310j5833k2122k8386l3444l7037l9463m0732m0700l9749l8562l7272
62459F95010l5447l2983l0311k7703k4909k1774j8700j6164j4098j2101j0054
62448D50766q213o756n496m069k399r06k05m47r27n89R77L020M234L913K510J097
62432D36510L37P3k53r56j933k839l285l081k513k223k541l100l376l412l577
$$ plain form
62417 403831 399986 396135 392539 389052 385476 382132 379648 378219 377394 376552 375424 374239 373558 373790 374613
62402 374613 375119 374809 374230 374272 375095 376275 377780 380146 383652 387927 392449 396938 401190 405051 408780 412956
62386 412956 417766 422717 427280 431527 435959 441025 446991 453970 461772 469923 477974 485721 493161 500609
62372 500609 508862 518775 530364 542621 554463 565737 577191 589791 604221 620793 639620 661005
62360 661005 685685 714388 747187 783709 823977 868388 916590 967028 1018029 1068765 1118566
62349 1118566 1165659 1207305 1241082 1265702 1281049 1288153 1288845 1284570 1275370 1260531 1240118 1215248
62337 1215248 1186958 1155697 1122135 1087603 1053246 1019369 986113 954171 924180 895870 868494
62326 868494 841947 816775 793228 770964 749663 729278 709616 690308 671330 653040 635511
$$ packed form
62417D03831l845l851l596l487l576l344k484j429q25q42j128j185o81K32Q23
62402C74613N06l10n79M2Q23J180J505K366L506M275M522M489M252L861L729M176
62386D12956M810M951M563M247M432N066N966O979P802Q151Q051P747P440P448
62372E00609Q253R913J1589J2257J1842J1274J1454J2600J4430J6572J8827K1385
62360F61005K4680K8703L2799L6522M0268M4411M8202N0438N1001N0736M9801
62349A118566M7093M1646L3777K4620J5347P104O92m275r200j4839k0413k4870
62337A215248k8290l1261l3562l4532l4357l3877l3256l1942k9991k8310k7376
62326H68494k6547k5172k3547k2264k1301k0385j9662j9308j8978j8290j7529
$$ plain form
62315 635511 618453 602022 587030 573837 561560 549094 536587 525237 515844 508286 502293 497812
62303 497812 494421 491176 487556 484098 481683 480526 480224 480428 481012 481851 482928 484533 486960 490076 493517
62288 493517 497165 501074 504972 508332 511031 513620 516727 520380 524052 527267 529986 532497 535105 537997
62274 537997 541330 545213 549484 553725 557796 562370 568582 577069 587633 599869 613804 629740 647918
62261 647918 668628 692396 719782 751167 786873 827114 871507 918991 968581 1019946 1072799
62250 1072799 1125938 1177253 1224419 1265192 1297440 1319685 1331775 1334613 1329254 1316557 1297475 1273020
62238 1273020 1243812 1210070 1172154 1130808 1086924 1041467 995653 950797 907865 867446 830072
62227 830072 796254 766224 739914 717075 697132 679194 662718 648013 635579 625056 615443 606247
$$ packed form
62315F35511j7058j6431j4992j3193j2277j2466j2507j1350r393p558n993m481
62303D97812l391l245l620l458k415j157l02K04N84Q39J077J605K427L116L441
62288D93517L648L909L898L360K699K589L107L653L672L215K719K511K608K892
62274E37997L333L883M271M241M071M574O212Q487J0564J2236J3935J5936J8178
62261F47918K0710K3768K7386L1385L5706M0241M4393M7484M9590N1365N2853
62250A072799N3139N1315M7166M0773L2248K2245J2090K838n359j2697j9082k4455
62238A273020k9208l3742l7916m1346m3884m5457m5814m4856m2932m0419l7374
62227H30072l3818l0030k6310k2839j9943j7938j6476j4705j2434j0523r613r196
$$ plain form
62215 606247 597781 590317 583612 577372 571599 566386 561886 558501 556430 554942 552859 549945 547094 544888
62201 544888 542864 540690 539287 539932 542659 546217 549450 552196 555003 558514 563160 569169 576741 586060
62187 586060 596847 608090 618799 629188 640439 653107 666375 679157 691158 702350 712196 720248
62175 720248 727081 733794 740862 748206 756215 765901 778127 793390 812265 835355 862623 893378 927078
62162 927078 963638 1002753 1043322 1083683 1122004 1156288 1184516 1205326 1218531 1224815 1225012 1219805
62150 1219805 1209924 1196248 1179528 1160067 1137845 1113019 1086221 1058284 1029875 1001718 975033
62139 975033 951252 931035 913902 899062 886404 876433 869474 865217 862906 861723 861177 861274 862244 863929
62125 863929 865571 866346 865951 864641 862927 861281 859759 857749 854480 850003 845309 841265 837872 834936 832931
$$ packed form
62215F06247q466p464o705o240n773n213m500l385k071j488k083k914k851k206
62201E44888k024k174j403O45K727L558L233K746K807L511M646O009P572R319
62187E86060J0787J1243J0709J0389J1251J2668J3268J2782J2001J1192R846Q052
62175G20248O833O713P068P344Q009R686J2226J5263J8875K3090K7268L0755L3700
62162I27078L6560L9115M0569M0361L8321L4284K8228K0810J3205O284J97n207
62150A219805r881j3676j6720j9461k2222k4826k6798k7937k8409k8157k6685
62139I75033k3781k0217j7133j4840j2658r971o959m257k311j183n46R7R70J685
62125H63929J642P75l95j310j714j646j522k010l269m477m694m044l393k936k005
$$ plain form
62110 832931 832665 834347 837558 841985 847668 854690 863075 872812 883335 893044 899993 903276 903469 901754
62096 901754 899131 896530 895034 895434 897573 900262 901780 900560 895810 887890 878134 868210 859495 852866
62082 852866 848881 848026 850676 856736 865496 876263 889172 905014 924051 945348 967518 989838 1012364
62069 1012364 1035302 1058683 1082442 1106399 1130286 1154133 1178509 1204015 1230600 1257474 1283450
62058 1283450 1307091 1326877 1341731 1351285 1355389 1353681 1346100 1333528 1317382 1298664 1277811 1255067
62046 1255067 1230348 1202989 1172462 1139457 1105548 1071778 1038230 1004999 972707 941749 911840
62035 911840 882852 855493 830572 807956 786786 766476 747096 729054 712817 698738 686663
62024 686663 675854 665707 656443 648656 642198 635992 629007 621098 612734 604256 595651 586948 578518 570898
$$ packed form
62110H32931k66J682L211M427N683P022Q385R737J0523R709O949L283J93j715
62096I01754k623k601j496M00K139K689J518j220m750p920r756r924q715o629
62082H52866l985q55K650O060Q760J0767J2909J5842J9037K1297K2170K2320K2526
62069A012364K2938K3381K3759K3957K3887K3847K4376K5506K6585K6874K5976
62058A283450K3641J9786J4854R554M104j708p581j2572j6146j8718k0853k2744
62046A255067k4719k7359l0527l3005l3909l3770l3548l3231l2292l0958k9909
62035I11840k8988k7359k4921k2616k1170k0310j9380j8042j6237j4079j2075
62024F86663j0809j0147r264p787o458o206o985p909q364q478q605q703q430p620
$$ plain form
62010 570898 564411 559021 554536 550883 548153 546393 545464 545125 545194 545626 546483 547886 549879 552264 554615 556586
61994 556586 558228 559840 561443 562528 562537 561501 559926 558005 555256 551144 545771 539630 532900 525392 517111
61979 517111 508435 499732 491229 483301 476374 470348 464570 458652 452967 448057 443914 440226 437042 434724
61965 434724 433340 432492 431770 431137 430838 431115 431990 433257 434765 436712 439440 442947 446863 450941 455216 459598
61949 459598 463822 468052 473080 479540 487229 495641 504835 515327 527373 540850 555720 572094 589778
61936 589778 608091 626268 643893 660998 677852 694579 710917 726440 740943 754303 766117
61925 766117 775955 783946 790394 794692 795480 792253 786121 778538 770098 761138 752579 745188 738674 732633
61911 732633 727937 726101 727564 731693 738264 747733 759994 773900 788205 802101 814728 825110 832839
$$ packed form
62010E70898o487n390m485l653k730j760r29l39O9M32Q57J403J993K385K351J971
61994E56586J642J612J603J085Rj036j575j921k749m112n373o141o730p508q281
61979E17111q676q703q503p928o927o026n778n918n685m910m143l688l184k318
61965D34724j384q48p22o33k99K77Q75J267J508J947K728L507L916M078M275M382
61949D59598M224M230N028O460P689Q412R194J0492J2046J3477J4870J6374J7684
61936E89778J8313J8177J7625J7105J6854J6727J6338J5523J4503J3360J1814
61925G66117R838P991O448M298P88l227o132p583q440q960q559p391o514o041
61911G32633m696j836J463M129O571R469J2261J3906J4305J3896J2627J0382P729
$$ plain form
61898 832839 838067 840612 839807 835455 828229 818927 807970 795769 782855 769434 755441 741216 727490
61885 727490 714547 702104 690180 679331 669715 660595 651136 641176 630979 620779 610737 600812
61873 600812 590554 579701 569059 560100 553520 548940 546018 544879 545214 546168 547669 550889 556671 564408
61859 564408 573223 583400 595712 610033 625669 642572 661220 681570 703122 725980 751038 778977
61847 778977 809472 841275 872693 902331 929874 955948 980774 1003254 1021783 1035526 1044353 1048053
61835 1048053 1046535 1040657 1032023 1021964 1011331 1001179 992886 987434 985089 985876 989815 996568 1005408
61822 1005408 1015787 1027575 1040518 1053705 1065717 1075102 1080599 1081140 1075911 1064593 1047686 1026519
61810 1026519 1002626 976908 949571 920902 891788 863259 835886 809861 785358 762492 741180
$$ packed form
61898H32839N228K545q05m352p226r302j0957j2201j2914j3421j3993j4225j3726
61885G27490j2943j2443j1924j0849r616r120r459r960j0197j0200j0042r925
61873F00812j0258j0853j0642q959o580m580k922j139L35R54J501L220N782P737
61859E64408Q815J0177J2312J4321J5636J6903J8648K0350K1552K2858K5058K7939
61847G78977L0495L1803L1418K9638K7543K6074K4826K2480J8529J3743Q827L700
61835A048053j518n878q634j0059j0633j0152q293n452k345P87L939O753Q840
61822A005408J0379J1788J2943J3187J2012R385N497N41n229j1318j6907k1167
61810A026519k3893k5718k7337k8669k9114k8529k7373k6025k4503k2866k1312
$$ plain form
61799 741180 721346 703047 686183 670491 656138 643893 634236 626574 619810 613393 607374 601777 596567
61786 596567 592110 588997 587343 586590 585983 584953 583254 581159 579342 578090 576810 574801 572363 570534 569818
61771 569818 569743 569726 569796 570312 571410 572892 574383 575604 576822 578925 582587 587367 592100 596174 599887 603479
61755 603479 606497 608470 609674 610744 611780 612322 612054 611147 609849 608064 605511 602191 598524 594924 591340
61740 591340 587389 582992 578638 574953 572209 570374 569341 568868 568560 568274 568378 569310 571076 573494 576692
61725 576692 580887 585835 591075 596576 602500 608251 612571 615001 616674 619107 622493 625733 627978 629493
61711 629493 630898 632127 632558 631902 630430 628320 625315 621341 617099 613456 610329 606782 602317 597544 593275
61696 593275 589468 585573 581528 577863 574921 572525 570430 568618 567093 565643 563940 561712 558915 555936
$$ packed form
61799G41180j9834j8299j6864j5692j4353j2245r657p662o764o417o019n597n210
61786E96567m457l113j654p53o07j030j699k095j817j252j280k009k438j829p16
61771E69818p5j7P0N16J098J482J491J221J218K103L662M780M733M074L713L592
61755F03479L018J973J204J070J036N42k68r07j298j785k553l320l667l600l584
61740E91340l951m397m354l685k744j835j033m73l08k86J04R32J766K418L198
61725E76692M195M948N240N501N924N751M320K430J673K433L386L240K245J515
61711F29493J405J229M31o56j472k110l005l974m242l643l127l547m465m773m269
61696E93275l807l895m045l665k942k396k095j812j525j450j703k228k797k979
$$ plain form
61682 555936 553423 551589 549829 547482 544885 543138 542771 543056 542790 541411 539211 536905 535161 534194 533538
61667 533538 532416 530561 528440 526552 524828 523036 521431 520486 520080 519458 518110 516333 514712 513392 512130
61652 512130 510870 509841 509123 508490 507828 507421 507656 508621 510192 512305 514916 517842 520900 524083 527282 529963
61636 529963 531487 531737 531105 529886 528032 525473 522276 518468 514109 509625 505574 501965 498273 494302 490536
61621 490536 487380 484592 481838 479385 477713 476746 475976 475192 474644 474554 474803 475056 474884 473846 471725 468685
61605 468685 465057 461079 456878 452487 447779 442652 437414 432664 428616 424880 421084 417273 413485 409475
61591 409475 405267 401499 398673 396420 393981 391140 388165 385180 382213 379584 377581 375816 373529 370548
61577 370548 367493 365027 363380 362536 362388 362568 362518 361878 360690 359277 358088 357514 357624 358248 359383 361190
$$ packed form
61682E55936k513j834j760k347k597j747l67K85k66j379k200k306j744r67o56
61667E33538j122j855k121j888j724j792j605r45m06o22j348j777j621j320j262
61652E12130j260j029p18o33o62m07K35R65J571K113K611K926L058L183L199K681
61636E29963J524K50o32j219j854k559l197l808m359m484m051l609l692l971l766
61621D90536l156k788k754k453j672r67p70p84n48r0K49K53j72j038k121l040
61605D68685l628l978m201m391m708n127n238m750m048l736l796l811l788m010
61591D09475m208l768k826k253k439k841k975k985k967k629k003j765k287k981
61577C70548l055k466j647q44j48J80n0o40j188j413j189n74J10O24J135J807
$$ plain form
61561 361190 363372 365075 365846 366236 366934 367678 367747 367219 367019 367745 369081 370370 371298 372001 372916 374388 376066
61544 376066 376931 376398 375157 374438 374691 375477 376291 376842 376858 376468 376558 377945 380298 382615 384561 386378 387690
61527 387690 387573 386004 384166 382955 382065 380939 379794 379148 379021 379042 378877 378185 376705 374652 372525 370310
61511 370310 367537 364455 362357 362167 363269 364315 364779 365137 365894 367052 368362 369617 370707 371630 372337 372502
61495 372502 371799 370544 369664 369772 370603 371547 372341 372929 373090 372634 371709 370590 369298 367789 366328 365424 365439
61478 365439 366344 367737 369064 370022 370817 371803 372940 373880 374551 375197 375847 376210 376179 376043 376142 376689 377897 379698
61460 379698 381263 381439 379942 377618 375356 373348 371652 370779 371187 372562 374125 375402 376393 377272 378219 379310
61444 379310 380330 380931 381112 381192 381248 381032 380686 381021 382767 385854 389701 393879 398207 402551 406789 410718
$$ packed form
61561C61190K182J703P71L90O98P44O9n28k00P26J336J289R28P03R15J472J678
61544C76066Q65n33j241p19K53P86Q14N51J6l90R0J387K353K317J946J817J312
61527C87690j17j569j838j211q90j126j145o46j27K1j65o92j480k053k127k215
61511C70310k773l082k098j90J102J046M64L58P57J158J310J255J090R23P07J65
61495C72502p03j255q80J08Q31R44P94N88J61m56r25j119j292j509j461r04J5
61478C65439R05J393J327R58P95R86J137R40O71O46O50L63l1j36R9N47J208J801
61460C79698J565J76j497k324k262k008j696q73M08J375J563J277R91Q79R47J091
61444C79310J020O01J81Q0N6k16l46L35J746L087L847M178M328M344M238L929
$$ plain form
61428 410718 413919 416052 417393 418600 419895 420944 421608 422154 422608 422712 422870 424256 427354 431030 433747
61413 433747 435199 436057 436552 436162 434574 432263 430044 428433 427394 426455 425190 423742 422581 421645 420278
61398 420278 418254 416244 414768 413278 410996 408269 406269 405561 405667 405957 406287 406755 407416 408373 409688 411043
61382 411043 411866 411929 411687 411909 413077 415092 417451 419766 422067 424548 427047 429118 430568 431602 432444 433282
61366 433282 434592 436902 439978 442823 444759 446058 447238 448332 449272 450466 452457 455336 458897 463036
61352 463036 467649 472564 477931 484258 491702 499825 508449 518209 529717 542611 555887 568638 579947
61339 579947 588726 594517 598194 601138 603910 606214 607734 608280 607515 605346 602418 599455 596298 592328 587676
61324 587676 583257 579637 576578 573716 571009 568515 566339 564884 564566 565129 565693 565616 564985 564279 563936 564254
$$ packed form
61428D10718L201K133J341J207J295J049O64N46M54J04J58J386L098L676K717
61413D33747J452Q58M95l90j588k311k219j611j039r39j265j448j161r36j367
61398D20278k024k010j476j490k282k727k000p08J06K90L30M68O61R57J315J355
61382D11043Q23O3k42K22J168K015K359K315K301K481K499K071J450J034Q42Q38
61366D33282J310K310L076K845J936J299J180J094R40J194J991K879L561M139
61352D63036M613M915N367O327P444Q123Q624R760J1508J2894J3276J2751J1309
61339E79947Q779N791L677K944K772K304J520N46p65k169k928k963l157l970m652
61324E87676m419l620l059k862k707k494k176j455l18N63N64p7o31p06l43L18
$$ plain form
61308 564254 565399 567444 570565 575076 581021 588022 595800 604537 614358 624721 634806 644229 652918 660601
61294 660601 666920 671752 674841 675380 672661 667081 659941 652311 644545 636703 628904 621300 614182 608068
61280 608068 603320 599813 597346 596047 595947 596553 597459 599080 602093 606337 610986 615679 620768 626536 632834
61265 632834 639534 646708 654309 662154 670183 678314 686204 693730 701623 711024 722420 735424 749390
61252 749390 763691 777453 789634 799419 806303 810007 810710 809055 805513 800149 793393 786393 779819 772936
61238 772936 764833 756129 748409 742299 737296 733244 730720 729862 729969 730491 731360 732200 732215 731269 730227 729950
61222 729950 730652 732341 735034 738294 741351 743937 746299 748303 749453 749958 750782 752304 753795 754669 755401
61207 755401 756721 758608 760548 762178 763207 763336 762743 762284 762852 764895 768711 774623 782630 792410 803867
$$ packed form
61308E64254J145K045L121M511N945P001P778Q737R821J0363J0085R423Q689P683
61294F60601O319M832L089N39k719n580p140p630p766p842p799p604p118o114
61280F08068m748l507k467j299j00O06R06J621L013M244M649M693N089N768O298
61265F32834O700P174P601P845Q029Q131P890P526P893R401J1396J3004J3966
61252G49390J4301J3762J2181R785O884L704P03j655l542n364o756p000o574o883
61238G72936q103q704p720o110n003m052k524q58J07N22Q69Q40J5r46j042k77
61222G29950P02J689K693L260L057K586K362K004J150N05Q24J522J491Q74P32
61207G55401J320J887J940J630J029J29n93m59N68K043L816N912Q007R780J1457
$$ plain form
61192 803867 817143 831985 847708 864011 881217 899507 918471 937515 956093 973421 988615
61181 988615 1001286 1011445 1018919 1023656 1026564 1029013 1031310 1032624 1032506 1031405 1029382 1025567 1019487 1011823
61167 1011823 1003169 993017 980719 966611 951414 935319 918437 901431 884817 868245 851302
61156 851302 834536 818874 804543 791354 779663 770167 762953 757437 753122 749851 747584 746436 746791
61143 746791 748850 752146 755878 759533 762862 765398 766297 764709 760422 754378 748370 743717 740327 737526
61129 737526 735498 735062 736291 738502 741758 747130 755139 765039 776110 788647 803203 819843 838664
61116 838664 859991 883489 908132 933566 960426 988606 1016483 1042664 1067329 1090871 1112444
61105 1112444 1131116 1147380 1162107 1174847 1184573 1191440 1196387 1199564 1200515 1199453 1196811 1191798 1182798
$$ packed form
61192H03867J3276J4842J5723J6303J7206J8290J8964J9044J8578J7328J5194
61181I88615J2671J0159P474M737K908K449K297J314j18j101k023l815o080p664
61167A011823q654j0152j2298j4108j5197j6095j6882j7006j6614j6572j6943
61156H51302j6766j5662j4331j3189j1691r496p214n516m315l271k267j148L55
61143G46791K059L296L732L655L329K536Q99j588m287o044o008m653l390k801
61129G37526k028m36J229K211L256N372Q009R900J1071J2537J4556J6640J8821
61116H38664K1327K3498K4643K5434K6860K8180K7877K6181K4665K3542K1573
61105A112444J8672J6264J4727J2740R726O867M947L177R51j062k642n013r000
$$ plain form
61092 1182798 1169217 1151831 1131494 1108678 1084185 1059137 1034141 1009292 984918 961433 938640
61081 938640 916110 894121 873347 853790 835001 817203 801161 787029 774328 763145 754345 748381
61069 748381 744606 741909 739497 737126 735230 734716 736014 738411 740921 743568 747126 751868 757368 763411
61055 763411 770258 777978 786196 794577 803140 812159 822087 833367 846063 860092 875941 894362 915000
61042 915000 936318 957582 979954 1004795 1031859 1060113 1089249 1119142 1148793 1177298 1205183
61031 1205183 1233411 1261743 1289429 1316781 1344584 1372700 1400829 1429963 1461362 1494778 1529396
61020 1529396 1565853 1605431 1647993 1692923 1741544 1796197 1857093 1922281 1990555 2062252 2137632
61009 2137632 2217179 2303554 2400699 2510811 2634528 2773909 2932405 3111876 3312708 3537273
$$ packed form
61092A182798j3581j7386k0337k2816k4493k5048k4996k4849k4374k3485k2793
61081I38640k2530k1989k0774j9557j8789j7798j6042j4132j2701j1183q800n964
61069G48381l775k697k412k371j896n14J298K397K510K647L558M742N500O043
61055G63411O847P720Q218Q381Q563R019R928J1280J2696J4029J5849J8421K0638
61042I15000K1318K1264K2372K4841K7064K8254K9136K9893K9651K8505K7885
61031A205183K8228K8332K7686K7352K7803K8116K8129K9134L1399L3416L4618
61020A529396L6457L9578M2562M4930M8621N4653O0896O5188O8274P1697P5380
61009B137632P9547Q6375R7145J10112J23717J39381J58496J79471K00832K24565
$$ plain form
60999 3537273 3790617 4078216 4407105 4789755 5243078 5783477 6427677 7199210 8129268
60990 8129268 9251335 10601569 12222134 14148426 16385791 18913969 21724012 24818775
60982 24818775 28121261 31366072 34132235 36056502 37053833 37336729 37235258 37020902 36880125
60973 36880125 36959196 37320570 37817404 38065673 37621752 36239737 33985717 31139817 28018313
60964 28018313 24869116 21862324 19106985 16655219 14510524 12651911 11054415 9691920
60956 9691920 8534579 7553408 6725272 6029836 5444941 4948700 4523926 4157665 3838417
60947 3838417 3556593 3306156 3083202 2883706 2704104 2542688 2398439 2269373 2153374
60938 2153374 2049479 1956603 1871752 1791001 1711842 1633663 1556843 1482501 1412317 1347333 1287300
$$ packed form
60999C537273K53344K87599L28889L82650M53323N40399O44200P71533R30058
60990H129268J122067J350234J620565J926292K237365K528178K810043L094763
60982B4818775L302486L244811K766163J924267R97331K82896j01471k14356j40777
60973C6880125P9071L61374M96834K48269m43921j382015k254020k845900l121504
60964B8018313l149197l006792k755339k451766k144695j858613j597496j362495
60956I691920j157341r81171q28136o95436n84895m96241m24774l66261l19248
60947C838417k81824k50437k22954j99496j79602j61416j44249j29066j15999
60938B153374j03895r2876q4851q0751p9159p8179p6820p4342p0184o4984o0033
$$ plain form
60927 1287300 1231915 1181835 1137527 1097939 1061405 1027338 996115 967899 942492 919821 899634
60916 899634 881183 864016 848636 835637 824652 814820 805796 797674 790467 784320 779707 776740 774736
60903 774736 772974 771329 769710 767666 765113 762528 759720 755267 748160 739234 729993 720742 710848 700176
60889 700176 689078 677561 665680 654356 644555 635934 627418 618900 611220 604609 598345 591971 585779
60876 585779 579964 574231 568411 562700 557177 551765 546701 542412 538984 536356 534853 534814 535928 537684 540278
60861 540278 544168 548925 553520 557683 562051 566934 571996 577190 582925 589104 595022 600515 606223 612398
60847 612398 618366 623557 628150 632205 635174 636926 638439 640590 642771 643514 642192 639401 635894 631791
60833 631791 626799 620788 614087 607301 600676 593605 585221 575611 565979 557353 549613 542100 534675 527654
$$ packed form
60927A287300n5385n0080m4308l9588l6534l4067l1223k8216k5407k2671k0187
60916H99634j8451j7167j5380j2999j0985r832r024q122p207o147m613k967k004
60903G74736j762j645j619k044k553k585k808m453p107q926r241r251r894j0672
60889G00176j1098j1517j1881j1324r801q621q516q518p680o611o264o374o192
60876E85779n815n733n820n711n523n412n064m289l428k628j503l9J114J756K594
60861E40278L890M757M595M163M368M883N062N194N735O179N918N493N708O175
60847F12398N968N191M593M055K969J752J513K151K181P43j322k791l507m103
60833F31791m992o011o701o786o625p071q384r610r632q626p740p513p425p021
$$ plain form
60819 527654 521145 515005 509257 504062 499322 494715 490082 485589 481498 477916 474661 471369 467962 464952
60805 464952 462939 461754 460597 459098 457760 457167 457278 457783 458668 460015 461715 463683 465974 468393 470518
60790 470518 472514 475349 479609 484600 489228 493407 497876 503003 508580 514563 521102 527772 533677 538606
60776 538606 543471 549192 555542 561409 566022 569689 573418 577833 582456 586232 588908 591564 595357 600079
60762 600079 604564 608374 612337 617325 623188 629141 634569 639105 642424 644562 646204 648225 651003 654408
60748 654408 658295 662667 667407 672173 676650 680857 685221 690428 697077 705278 714576 724353 734374 745037
60734 745037 757126 771247 787329 804667 822549 840776 859381 877922 895393 910981 924697
60723 924697 937093 948465 958515 966648 972308 975069 974633 971002 964579 955926 945269 932343 916868
$$ packed form
60819E27654o509o140n748n195m740m607m633m493m091l582l255l292l407l010
60805D64952k013j185j157j499j338n93J11N05Q85J347J700J968K291K419K125
60790D70518J996K835M260M991M628M179M469N127N577N983O539O670N905M929
60776E38606M865N721O350N867M613L667L729M415M623L776K676K656L793M722
60762F00079M485L810L963M988N863N953N428M536L319K138J642K021K778L405
60748F54408L887M372M740M766M477M207M364N207O649Q201R298R777J0021J0663
60734G45037J2089J4121J6082J7338J7882J8227J8605J8541J7471J5588J3716
60723I24697J2396J1372J0050Q133N660K761m36l631o423q653j0657j2926j5475
$$ plain form
60710 916868 899181 880249 861021 841894 822828 803741 784653 765592 746615 727867 709494
60699 709494 691555 674125 657429 641690 626927 612965 599610 586728 574351 562799 552518
60688 552518 543586 535557 527974 520861 514479 508790 503477 498368 493560 489224 485592 483052 481880 481881 482580
60673 482580 483708 485257 487116 489030 490909 492849 494797 496525 498013 499481 500909 501720 501174 499046 495935
60658 495935 492968 491062 490269 489935 489619 489670 490706 492806 495595 498836 502441 506123 509642 513317 517649
60643 517649 522448 526915 530663 534012 537231 540165 542820 545566 548362 550408 551085 550783 550294 549806 548955
60628 548955 547582 545921 544123 542006 539203 535437 530877 526309 522570 519619 516602 513065 509595 506944
60614 506944 505042 503382 501924 500955 500387 499828 499189 498700 498436 498359 498654 499545 500843 502123 503233 504208 504825
$$ packed form
60710I16868j7687j8932j9228j9127j9066j9087j9088j9061j8977j8748j8373
60699G09494j7939j7430j6696j5739j4763j3962j3355j2882j2377j1552j0281
60688E52518q932q029p583p113o382n689n313n109m808m336l632k540j172JO99
60673D82580J128J549J859J914J879J940J948J728J488J468J428Q11n46k128l111
60658D95935k967j906p93l34l16N1J036K100K789L241L605L682L519L675M332
60643E17649M799M467L748L349L219K934K655K746K796K046O77l02m89m88q51
60628E48955j373j661j798k117k803l766m560m568l739k951l017l537l470k651
60614E06944j902j660j458r69n68n59o39m89k64p7K95Q91J298J280J110R75O17
$$ plain form
60597 504825 504774 504240 503835 503954 504537 505337 505968 505818 504508 502543 501035 500682 501307 502368 503483 504463 505292
60580 505292 506209 507495 509173 511257 514202 518553 524138 530123 536006 542092 548900 556643 565538 576033
60566 576033 588368 602322 617883 635755 656663 680353 705849 732673 761189 791431 821901
60555 821901 849883 872889 889552 899315 901861 897383 887204 873530 858332 842717 827448 813524
60543 813524 801892 793005 787150 784952 786997 793135 802862 816407 834867 859094 888911 923596 962697
60530 962697 1006066 1053347 1103511 1154536 1203384 1246703 1281900 1307529 1322830 1327550 1322524 1309903
60518 1309903 1292210 1271226 1248018 1223672 1199420 1176034 1153526 1131675 1110738 1091609 1075355
60507 1075355 1062554 1053006 1046129 1041761 1040512 1043240 1050269 1061221 1075636 1093725 1116697 1146432
$$ packed form
60597E04825n1n34m05J19N83Q00O31j50j310j965j508l53O25J061J115R80Q29
60580E05292R17J286J678K084K945M351N585N985N883O086O808P743Q895J0495
60566E76033J2335J3954J5561J7872K0908K3690K5496K6824K8516L0242L0470
60555H21901K7982K3006J6663R763K546m478j0179j3674j5198j5615j5269j3924
60543H13524j1632q887n855k198K045O138R727J3545J8460K4227K9817L4685L9101
60530I62697M3369M7281N0164N1025M8848M3319L5197K5629J5301M720n026j2621
60518A309903j7693k0984k3208k4346k4252k3386k2508k1851k0937j9129j6254
60507A075355j2801r548o877m368j249K728P029J0952J4415J8089K2972K9735
$$ plain form
60495 1146432 1184615 1231905 1287966 1352403 1425606 1508362 1600545 1700178 1803726 1906981 2005604
60484 2005604 2095373 2172784 2235945 2284819 2320425 2344101 2357875 2365214 2370354 2376148 2382517 2387020
60472 2387020 2386436 2377369 2355865 2317771 2260467 2184473 2093256 1991380 1882758 1770366 1657226
60461 1657226 1547085 1443699 1349376 1264455 1188223 1120021 1059367 1005542 957640 914940 876902
60450 876902 842981 812778 786236 763302 743437 725836 710075 696202 684235 673946 665166 657905
60438 657905 652022 647023 642306 637455 632321 627102 622342 618605 616007 614187 612687 611174 609347 606905
60424 606905 603737 600026 596161 592506 589139 585751 582060 578401 575564 573850 572651 571230 569433 567340
60410 567340 564749 561641 558690 556575 555127 553891 553216 553790 555304 556606 557294 558103 559482 560764 561169
$$ packed form
60495A146432L8183M7290N6061O4437P3203Q2756R2183R9633J03548J03255R8623
60484B005604Q9769P7411O3161M8874L5606K3676J3774P339N140N794O369M503
60472B387020n84r067k1504l8094n7304p5994r1217j01876j08622j12392j13140
60461A657226j10141j03386r4323q4921p6232o8202o0654n3825m7902m2700l8038
60450H76902l3921l0203k6542k2934j9865j7601j5761j3873j1967j0289q780p261
60438F57905n883m999m717m851n134n219m760l737k598j820j500j513j827k442
60424F06905l168l711l865l655l367l388l691l659k837j714j199j421j797k093
60410E67340k591l108k951k115j448j236o75N74J514J302O88Q09J379J282M05
$$ plain form
60395 561169 560805 560222 559710 559522 560094 561470 563022 564285 565595 567378 569321 570824 571893 572995 574227
60380 574227 575185 575574 575580 575726 576516 577995 579490 580108 579667 578779 577914 576942 575847 575270 575864 577570 579905 582450
60362 582450 584677 585935 586278 586802 588413 590642 592355 593299 594119 595149 596052 596614 597066 597580 598140 598956 600353
60345 600353 602130 603684 604914 606473 608972 612520 617130 622834 628961 633987 636747 637596 637848 638211 638228
60330 638228 637161 634910 631970 628922 626215 624163 622790 621701 620440 619028 617903 617272 616866 616550 616825
60315 616825 618265 620676 623258 625582 627907 630595 633814 637976 643818 651613 660689 670170 680021 691078
60301 691078 704269 720090 738766 760523 785502 813114 841337 866979 887287 901305 909178 910431
60289 910431 903967 890041 871131 850185 828712 807197 786464 767517 750447 734644 720005 707062
$$ packed form
60395E61169l64n83n12j88N72J376J552J263J310J783J943J503J069J102J232
60380E74227R58L89OJ46P90J479J495O18m41q88q65r72j095n77N94J706K335K545
60362E82450K227J258L43N24J611K229J713R44Q20J030R03N62M52N14N60Q16J397
60345F00353J777J554J230J559K499L548M610N704O127N026K760Q49K52L63J7
60330F38228j067k251k940l048k707k052j373j089j261j412j125o31m06l16K75
60315F16825J440K411K582K324K325K688L219M162N842P795R076R481R851J1057
60301F91078J3191J5821J8676K1757K4979K7612K8223K5642K0308J4018P873J253
60289I10431o464j3926j8910k0946k1473k1515k0733j8947j7070j5803j4639j2943
$$ plain form
60277 707062 695899 685758 675816 665828 655968 646612 638292 631295 625237 619486 613980 609177 605298 602131
60263 602131 599511 597372 595343 592946 590398 588611 588153 588597 589090 589180 588956 588772 589106 590331 592354 594532
60247 594532 596088 596547 595882 594499 593049 592001 591382 591058 591081 591467 591845 591776 591354 591092 591265 591782 592637 593977
60229 593977 595681 597344 598852 600623 603130 606446 610332 614482 618613 622586 626480 630365 634039 637248
60215 637248 640147 643265 647067 651693 656955 662253 666749 670087 672875 676036 679790 683731 687691 691864
60201 691864 696063 699613 702172 704069 705562 706337 706100 705236 704428 703841 702973 701222 698464 695174 692031 689228
60185 689228 686174 682155 677230 672207 667800 664140 661075 658492 656304 654582 653667 653752 654307 654487 654159 653929
60169 653929 654028 653873 653049 652093 651750 651976 652216 652404 653031 654370 656125 657856 659394 660816 662316 664155 666526
$$ packed form
60277G07062j1163j0141r942r988r860r356q320o997o058n751n506m803l879l167
60263F02131k620k139k029k397k548j787m58M44M93R0k24j84L34J225K023K178
60247E94532J556M59o65j383j450j048o19l24K3L86L78o9m22k62J73N17Q55J340
60229E93977J704J663J508J771K507L316L886M150M131L973L894L885L674L209
60215F37248K899L118L802M626N262N298M496L338K788L161L754L941L960M173
60201F91864M199L550K559J897J493P75k37q64q08n87q68j751k758l290l143k803
60185F89228l054m019m925n023m407l660l065k583k188j722r15Q5N55J80l28k30
60169F53929R9j55q24r56l43K26K40J88O27J339J755J731J538J422J500J839K371
$$ plain form
60152 666526 669430 672724 676251 679856 683430 686993 690691 694687 699155 704262 709895 715486 720440 724782
60138 724782 729022 733364 737549 741607 746190 751833 758347 765320 772723 780401 787336 792247 794912 796197
60124 796197 796641 795645 792437 787347 781636 776339 771745 767869 764828 762645 761130 760247 760230 761043 762021 762446
60108 762446 762304 761998 761487 760387 759001 758506 759641 761709 763455 764648 766206 768909 772622 776885 781793
60093 781793 787973 795832 804946 814125 822133 828482 833521 837716 840993 842863 842964 841354 838512 835199
60079 835199 832023 828849 824922 819789 813820 807584 801133 794307 787331 780574 773961 767161 760186 753324
60065 753324 746670 740154 733813 727512 720742 713265 705744 699055 693213 687646 682316 677708 673778 669762
60051 669762 665137 660070 654865 649734 645190 641881 639769 638149 636635 635536 635138 635343 636181 637904 640332
$$ packed form
60152F66526K904L294L527L605L574L563L698L996M468N107N633N591M954M342
60138G24782M240M342M185M058M583N643O514O973P403P678O935M911K665J285
60124G96197M44r96l208n090n711n297m594l876l041k183j515q83j7Q13R78M25
60108G62446j42l06n11j100j386m95J135K068J746J193J558K703L713M263M908
60093G81793O180P859R114R179Q008O349N039M195L277J870J01j610k842l313
60079H35199l176l174l927n133n969o236o451o826o976o757o613o800o975o862
60065G53324o654o516o341o301o770p477p521o689n842n567n330m608l930m016
60051F69762m625n067n205n131m544l309k112j620j514j099l98K05Q38J723K428
$$ plain form
60036 640332 642824 645185 647829 650703 652793 653197 652066 650027 647310 643987 640457 637017 633278 628618
60022 628618 622971 616804 610573 604610 599191 594318 589647 584994 580717 577360 575100 573691 572656 571488
60008 571488 570100 569238 569939 572345 575456 578254 580607 582972 585839 589672 594655 600088 604680 607978 610990
59993 610990 614946 620030 625759 631900 638274 644219 649120 653188 657023 660645 663658 666035 667980 669090
59979 669090 668437 665635 661329 656579 652058 647836 643582 639000 634306 630152 626867 624078 621351 618902
59965 618902 617259 616510 616380 616849 618148 620216 622614 625055 627731 631121 635586 640977 646498 651228 654945
59950 654945 658176 661297 664045 666157 667910 669510 670421 669986 668447 666740 665397 664175 662640 660610 658031
59935 658031 654852 651053 646605 641573 636464 632101 628815 626051 623207 620498 618523 617351 616587 616106 616078
$$ packed form
60036F40332K492K361K644K874K090M04j131k039k717l323l530l440l739m660
60022F28618n647o167o231n963n419m873m671m653m277l357k260j409j035j168
60008E71488j388q62P01K406L111K798K353K365K867L833M983N433M592L298L012
59993F10990L956N084N729O141O374N945M901M068L835L622L013K377J945J110
59979F69090o53k802m306m750m521m222m254m582m694m154l285k789k727k449
59965F18902j643p49j30M69J299K068K398K441K676L390M465N391N521M730L717
59950F54945L231L121K748K112J753J600R11m35j539j707j343j222j535k030k579
59935F58031l179l799m448n032n109m363l286k764k844k709j975j172p64m81k8
$$ plain form
59920 616078 616485 617268 618777 621408 624792 628050 630918 634021 637921 642438 647093 651656 656023 659965 663376
59905 663376 666514 669682 672768 675279 676854 677694 678480 679811 681699 683709 685600 687595 689933 692479 695034
59890 695034 697796 701193 705403 710255 715449 720574 725107 728717 731618 734424 737598 741027 744058 745994
59876 745994 746823 747379 748459 749849 750704 750849 750951 751199 750647 748402 744876 741215 737936 734745 731322 727633
59860 727633 723686 719595 715818 712838 710713 709234 708292 707701 706969 705686 703930 701947 699765 697595 696210
59845 696210 696318 697647 699162 700175 700969 702514 705848 711440 718890 727515 737409 749393 763607 778706
59831 778706 792833 804748 813569 818405 819267 817903 816659 816666 817654 818917 819345 816929 809634 797090 780768
59816 780768 762534 743728 725464 708717 693820 680485 668527 658048 648976 640977 633779 627082
$$ packed form
59920F16078M07P83J509K631L384L258K868L103L900M517M655M563M367L942L411
59905F63376L138L168L086K511J575Q40P86J331J888K010J891J995K338K546K555
59890F95034K762L397M210M852N194N125M533L610K901K806L174L429L031J936
59876G45994Q29N56J080J390Q55J45J02K48n52k245l526l661l279l191l423l689
59860G27633l947m091l777k980k125j479r42n91p32j283j756j983k182k170j385
59845F96210J08J329J515J013P94J545L334N592P450Q625R894J1984J4214J5099
59831G78706J4127J1915Q821M836Q62j364j244PR88J263M28k416p295j2544j6322
59816G80768j8234j8806j8264j6747j4897j3335j1958j0479r072p999p198o697
$$ plain form
59804 627082 620403 613732 608147 604854 603560 602539 600385 597057 593261 589646 586708 584707 583382 582265
59790 582265 581337 580863 580579 579743 578043 575883 573711 571630 569622 567529 564827 561088 556688 552469 548715
59775 548715 545112 541664 538888 537093 536156 536053 536900 538396 539915 541207 542411 543487 544373 545620 547942
59760 547942 551086 554002 556221 558239 560494 562918 565662 569261 573734 578358 582592 586488 590016 592881
59746 592881 595301 598001 601078 603731 605476 606767 607970 608636 608315 607342 606235 605028 603728 602765 602396
59731 602396 602216 601737 600945 599941 598644 597240 596242 595738 595243 594674 594662 595422 596135 596034 595369 594679 593903 592945
59713 592945 592396 592815 593831 594792 595813 597380 599348 601272 603380 606353 610256 614416 618302 621918 625510
59698 625510 629459 634259 639960 645819 651102 656150 661991 668839 675512 680382 682645 682705 681709 680711 680058
$$ packed form
59804F27082o679o671n585l293j294j021k154l328l796l615k938k001j325j117
59790E82265r28m74k84q36j700k160k172k081k008k093k702l739m400m219l754
59775E48715l603l448k776j795r37j03Q47J496J519J292J204J076Q86J247K322
59760E47942L144K916K219K018K255K424K744L599M473M624M234L896L528K865
59746E92881K420K700L077K653J745J291J203O66l21r73j107j207j300r63l69
59731F02396j80m79p92j004j297j404r98n04m95n69j2P60P13j01o65o90p76r58
59713E92945n49M19J016R61J021J567J968J924K108K973L903M160L886L616L592
59698F25510L949M800N701N859N283N048N841O848O673M870K263O0r96r98o53
$$ plain form
59683 680058 679500 678845 678206 677567 676582 675123 673629 672602 672070 671767 671381 670330 667872 663977 659673 655975
59667 655975 652823 649616 646437 644033 642701 641873 640832 639465 638282 637992 639047 641323 644311 647699 651572
59652 651572 655938 660482 665041 669902 675235 680510 684802 687424 688000 686332 682640 677559 671529 664477
59638 664477 656507 648473 641322 635159 629568 624645 621023 618830 617245 615288 612762 610275 608503 607504
59624 607504 606719 605625 604306 603142 602118 600937 599849 599650 600482 601170 600284 597561 593845 590009 586447
59609 586447 583358 580908 579081 577753 576892 576458 576256 576161 576306 576781 577308 577455 577048 576200 575210 574616 575058 576692
59591 576692 578909 580902 582364 583451 584211 584374 583670 582222 580599 579356 578340 576698 573959 570902 568707
59576 568707 567372 565710 562975 559674 556558 553686 550944 548699 547278 546342 545373 544390 543670 543146 542532 541766
$$ packed form
59683F80058n58o55o39o39r85j459j494j027n32l03l86j051k458l895m304l698
59667F55975l152l207l179k404j332q28j041j367j183k90J055K276K988L388L873
59652F51572M366M544M559M861N333N275M292K622N76j668l692n081o030p052
59638F64477p970q034p151o163n591m923l622k193j585j957k526k487j772r99
59624F07504p85j094j319j164j024j181j088j99Q32O88q86k723l716l836l562
59609E86447l089k450j827j328q61m34k02r5J45M75N27J47m07q48r90n94M42J634
59591E76692K217J993J462J087P60J63p04j448j623j243j016j642k739l057k195
59576E68707j335j662k735l301l116k872k742k245j421r36r69r83p20n24o14p66
$$ plain form
59560 541766 540958 540257 540042 540782 542343 543860 544574 544387 543490 542163 541178 541524 543203 545070 546394 547802
59544 547802 550131 553268 556951 561870 568948 578077 588539 600165 613189 627513 643113 660444 679049
59531 679049 696003 707258 710924 708497 702963 696695 691143 687239 685350 685258 686539 688690 690972 692680
59517 692680 693619 693902 693414 691980 689875 687457 684344 679657 673187 665753 658284 651053 643829 636364 628667
59502 628667 621191 614748 609859 606209 603027 599870 596737 593783 591316 589720 588814 587590 585277 582449
59488 582449 580420 579735 579948 580716 582307 584960 588474 592640 597522 603163 609401 616111 623339 631149 639465
59473 639465 647907 655648 661853 666582 670772 674904 678191 679670 679567 678840 677912 676788 676055 676665 678769
59458 678769 681730 685343 690176 696736 705095 715418 727988 742538 758257 774600 791422 808253
$$ packed form
59560E41766q08p01k15P40J561J517P14j87q97j327r85L46J679J867J324J408
59544E47802K329L137L683M919P078R129J0462J1626J3024J4324J5600J7331J8605
59531F79049J6954J1255L666k427n534o268n552l904j889r2J281K151K282J708
59517F92680R39K83m88j434k105k418l113m687o470p434p469p231p224p465p697
59502F28667p476o443m889l650l182l157l133k954k467j596r06j224k313k828
59488E82449k029o85K13P68J591K653L514M166M882N641O238O710P228P810Q316
59473F39465Q442P741O205M729M190M132L287J479j03p27r28j124p33O10K104
59458F78769K961L613M833O560Q359J0323J2570J4550J5719J6343J6822J6831
$$ plain form
59446 808253 824187 838695 851827 863307 871978 876448 875885 870129 859579 845325 829022 812291
59434 812291 796210 781218 767244 753994 741394 729645 718721 708243 698224 689539 683167 679343
59422 679343 677907 678999 682679 688349 695412 704334 716300 731984 751157 772988 796028 818598 840294
59409 840294 862539 886093 908063 922836 926395 918999 904007 885537 867319 851975 840278 831871
59397 831871 827192 827605 832825 838986 840347 832984 816804 794642 770010 745354 721810 700153 681418
59384 681418 666245 654065 643797 635197 628804 624758 622549 621781 622172 622856 622837 622316 622608 624549 627923
59369 627923 632486 638348 645023 651311 656675 661804 667379 673323 679746 687457 696748 706572 715789 724528
59355 724528 733585 743196 753242 764081 776353 790237 805522 822050 839603 857753 876308 895573
$$ packed form
59446H08253J5934J4508J3132J1480Q671M470n63n756j0550j4254j6303j6731
59434H12291j6081j4992j3974j3250j2600j1749j0924j0478j0019q685o372l824
59422F79343j436J092L680N670P063Q922J1966J5684J9173K1831K3040K2570K1696
59409H40294K2245K3554K1970J4773L559p396j4992j8470j8218j5344j1697q407
59397H31871m679M13N220O161J361p363j6180k2162k4632k4656k3544k1657j8735
59384F81418j5173j2180j0268q600o393m046k209p68L91O84j9n21K92J941L374
59369F27923M563N862O675O288N364N129N575N944O423P711R291R824R217Q739
59355G24528R057R611J0046J0839J2272J3884J5285J6528J7553J8150J8555J9265
$$ plain form
59343 895573 915804 936838 958493 980647 1002493 1022405 1039151 1052744 1063602 1071442 1075567 1075706
59331 1075706 1071947 1064361 1053341 1039910 1025034 1008941 991619 973621 955776 938439 921607 905502
59319 905502 890407 876129 862198 848571 835755 824287 814437 806224 799394 793444 787931 782762 778170
59306 778170 774568 772361 771512 771318 771006 770663 771080 772680 775114 777957 781162 784669 788302 792332 797532
59291 797532 804344 812593 822297 834122 848650 865741 884930 905916 928397 951977 976279 1000147
59279 1000147 1020409 1032665 1034441 1027186 1014639 999905 984695 970379 958310 949132 942731 938924
59267 938924 937589 938251 940109 942411 944411 945231 944340 941955 938402 933237 925530 914890 901734 886687
59253 886687 870285 853244 836438 820457 805462 791546 778964 767916 758298 749833 742485 736757
$$ packed form
59343H95573K0231K1034K1655K2154K1846J9912J6746J3593J0858P840M125J39
59331A075706l759p586j1020j3431j4876j6093j7322j7998j7845j7337j6832j6105
59319I05502j5095j4278j3931j3627j2816j1468r850q213o830n950n513n169m592
59306G78170l602k207q49j94l12l43M17J600K434K843L205L507L633M030N200
59291G97532O812Q249R704J1825J4528J7091J9189K0986K2481K3580K4302K3868
59279A000147K0262J2256J776p255j2547j4734j5210j4316j2069r178o401l807
59267I38924j335O62J858K302K000Q20q91k385l553n165p707j0640j3156j5047
59253H86687j6402j7041j6806j5981j4995j3916j2582j1048r618q465p348n728
$$ plain form
59241 736757 733352 732275 732454 732693 732956 734256 737229 741399 745932 750571 755510 760794 766082 770685 773737
59226 773737 774738 774062 772494 770209 766674 761617 755498 748964 742427 736217 730473 724786 718735 712980
59212 712980 708900 706867 705767 704582 703589 703476 704162 705239 706843 709306 712366 715366 717932 720041 721938
59197 721938 724311 727984 732935 738231 743351 748918 755613 763083 770561 777949 785542 793181 800369 806890
59183 806890 812803 818167 823195 828163 832751 836095 838002 839433 841178 842707 843040 842197 841065 840360 840462
59168 840462 841832 844730 848739 853172 857776 862704 868167 874439 881590 888829 894741 898714 901413 903442
59154 903442 904352 903580 901385 897948 892519 884608 875343 866454 858375 850402 842300 834569 827472 820959 815379
59139 815379 811173 807923 804687 801173 797841 795010 792757 791453 791443 792241 792908 793195 793608 794466 795717 797527
$$ packed form
59241G36757l405j077J79K39K63J300K973M170M533M639M939N284N288M603L052
59226G73737J001o76j568k285l535n057o119o534o537o210n744n687o051n755
59212G12980m080k033j100j185r93j13O86J077J604K463L060L000K566K109J897
59197G21938K373L673M951N296N120N567O695P470P478P388P593P639P188O521
59183H06890N913N364N028M968M588L344J907J431J745J529L33q43j132p05J02
59168H40462J370K898M009M433M604M928N463O272P151P239N912L973K699K029
59154I03442R10p72k195l437n429p911r265q889q079p973q102p731p097o513n580
59139H15379m206l250l236l514l332k831k253j304j0P98O67K87M13Q58J251J810
$$ plain form
59123 797527 800272 803925 808210 813268 819532 827017 835370 844425 854073 863805 873137 882288 891707 901134
59109 901134 909868 917770 925165 931920 937494 941791 945129 947387 948022 946959 944707 941550 937328 932088
59095 932088 926264 920095 913436 906269 898897 891619 884635 878232 872615 867576 862656 857486 851734 845033
59081 845033 837353 829050 820211 810452 799811 789176 779248 769724 760198 751128 743030 735418 727690 720425
59067 720425 714538 709633 704580 699407 695160 691957 688772 685312 682659 681613 681567 681533 681228 680654 679581 678061
59051 678061 676654 675557 674146 671963 669602 668025 667369 666920 666070 664956 664286 664706 666187 668002 669455
59036 669455 670549 671768 673380 675247 677110 678752 680173 681919 684875 689323 694561 699994 706183 714151
59022 714151 723980 734787 745783 756692 767339 777522 787093 795537 801759 804955 805554 804690 803065
$$ packed form
59123G97527K745L653M285N058O264P485Q353R055R648R732R332R151R419R427
59109I01134Q734P902P395O755N574M297L338K258O35j063k252l157m222n240
59095I32088n824o169o659p167p372p278o984o403n617n039m920n170n752o701
59081H45033p680q303q839r759j0641j0635r928r524r526r070q098p612p728p265
59067G20425n887m905n053n173m247l203l185l460k653j046m6l4l05n74j073j520
59051F78061j407j097j411k183k361j577o56m49q50j114o70M20J481J815J453
59036F69455J094J219J612J867J863J642J421J746K956M448N238N433O189P968
59022G14151R829J0807J0996J0909J0647J0183R571Q444O222L196N99q64j625
$$ plain form
59009 803065 800894 798485 796043 793229 789806 786546 784748 785052 787367 791522 797141 803307 809292 815287
58995 815287 821536 827239 831488 834872 838796 843246 846543 847403 846090 843359 839423 834298 828235 821439
58981 821439 813952 806022 798094 790521 783816 778905 776334 775525 775668 777118 780944 787342 795518 804949 815660
58966 815660 827361 839449 851856 864921 878431 891738 904665 917247 928772 938161 945148 949905
58954 949905 951722 949464 943291 934546 923859 910820 895700 879927 864402 848695 832540 816978
58942 816978 803393 792251 783296 776108 770137 764910 760567 757496 755407 753498 751487 749569 747453 744528
58928 744528 740907 737161 733073 727910 721908 716164 711002 705855 700836 696872 694046 691377 688667 687018
58914 687018 687037 688019 689478 691968 695674 699648 703292 707328 712479 718425 724879 732574 742221 753486 765794
$$ packed form
59009H03065k171k409k442k814l423l260j798L04K315M155N619O166N985N995
58995H15287O249N703M249L384L924M450L297Q60j313k731l936n125o063o796
58981H21439p487p930p928p573o705m911k571q09J43J450L826O398Q176R431J0711
58966H15660J1701J2088J2407J3065J3510J3307J2927J2582J1525R389O987M757
58954I49905J817k258o173q745j0687j3039j5120j5773j5525j5707j6155j5562
58942H16978j3585j1142q955p188n971n227m343l071k089j909k011j918k116k925
58928G44528l621l746m088n163o002n744n162n147n019l964k826k669k710j649
58914F87018J9R82J459K490L706L974L644M036N151N946O454P695R647J1265J2308
$$ plain form
58899 765794 779209 793796 809099 824885 841466 858629 875309 891062 906829 923518 940909
58888 940909 958720 977718 998786 1021675 1045380 1068877 1090847 1109714 1124810 1136668 1145502 1150341
58876 1150341 1150472 1146714 1140271 1131142 1118624 1102741 1084371 1064519 1044175 1024267 1005156 986723
58864 986723 969249 953376 938891 924676 910360 896817 884418 872070 858793 845040 831504
58853 831504 817824 803592 789570 776723 764936 753823 743937 735915 729129 722339 715188 708041 700965
58840 700965 693903 687280 681501 676321 671488 667300 663727 659779 654798 649696 645789 642957 640023 636473
58826 636473 632836 629701 627286 625630 624481 623410 622669 623347 626001 629794 633598 637219 640738 643586 645309
58811 645309 646579 648316 650334 651780 652443 652766 653039 653380 653883 654012 652597 649406 646033 644173 643627 642985
$$ packed form
58899G65794J3415J4587J5303J5786J6581J7163J6680J5753J5767J6689J7391
58888I40909J7811J8998K1068K2889K3705K3497K1970J8867J5096J1858Q834M839
58876A150341J31l758o443r129j2518j5883j8370j9852k0344j9908j9111j8433
58864I86723j7474j5873j4485j4215j4316j3543j2399j2348j3277j3753j3536
58853H31504j3680j4232j4022j2847j1787j1113r886q022o786o790p151p147p076
58840G00965p062o623n779n180m833m188l573l948m981n102l907k832k934l550
58826F36473l637l135k415j656j149j071p41O78K654L793L804L621L519K848J723
58811F45309J270J737K018J446O63L23K73L41N03J29j415l191l373j860n46o42
$$ plain form
58795 642985 641596 639738 637528 635034 633059 632481 632937 633326 633494 634455 637024 641140 646485 652874 660069
58780 660069 667818 676036 684507 692714 700407 707916 715336 721894 726697 729569 730572 729361 725720 720130
58766 720130 713115 704657 695022 685373 676642 668435 660130 652468 646864 643454 640972 638443 636072 634547
58752 634547 634221 634928 636043 636857 637355 638333 640398 643371 647067 651994 658633 666641 675391 684698 694435
58737 694435 704088 713334 722399 731268 739360 746656 754245 762892 771830 779835 786721 792868 798087 802089
58723 802089 805422 808885 812455 815706 818766 822025 825495 829312 834227 840599 847470 853488 858316 862308
58709 862308 865433 867236 867276 864893 859328 850784 840489 828990 815432 799366 782089 765023 747893
58696 747893 729912 711773 694920 679582 665045 651297 638932 627887 617627 608237 600099 592916
$$ packed form
58795F42985j389j858k210k494j975n78M56L89J68R61K569M116N345O389P195
58780F60069P749Q218Q471Q207P693P509P420O558M803K872J003j211l641n590
58766G20130p015q458r635r649q731q207q305p662n604l410k482k529k371j525
58752F34547l26P07J115Q14M98R78K065K973L696M927O639Q008Q750R307R737
58737F94435R653R246R065Q869Q092P296P589Q647Q938Q005O886O147N219M002
58723H02089L333L463L570L251L060L259L470L817M915O372O871O018M828L992
58709H62308L125J803M0k383n565q544j0295j1499j3558j6066j7277j7066j7130
58696G47893j7981j8139j6853j5338j4537j3748j2365j1045j0260r390q138p183
$$ plain form
58684 592916 586167 580080 575003 570369 565425 560521 556548 553608 551273 549585 548694 548144 547647 547924 549740
58669 549740 552761 556480 561464 568483 577202 587020 598363 611714 626041 639539 651303 660913 667214
58656 667214 669076 666841 661682 654165 644789 635041 626269 618138 609743 601531 594519 588399 582215 576321
58642 576321 571825 568581 565583 562890 561373 560883 560487 560274 561204 563373 565995 568762 571650 573766 574080
58627 574080 573013 571698 570104 567582 564762 563002 562282 561544 560900 561630 564152 567824 572642 579314 587641
58612 587641 596540 605564 614826 623581 630590 635735 639655 642122 642548 641744 641211 640813 639114 635898 632444
58597 632444 629404 626396 623690 622252 621965 621685 621275 621823 623779 626631 630528 636394 644289 653347 663334
58582 663334 674587 686525 698095 709554 721805 734036 744115 751489 757570 763117 767388 770291
$$ packed form
58684E92916o749o087n077m634m944m904l973k940k335j688q91n50m97K77J816
58669E49740L021L719M984P019Q719R818J1343J3351J4327J3498J1764R610O301
58656F67214J862k235n159p517r376r748q772q131q395q212p012o120o184n894
58642E76321m496l244k998k693j517m90l96k13R30K169K622K767K888K116L14
58627E74080j067j315j594k522k820j760p20p38o44P30K522L672M818O672Q327
58612E87641Q899R024R262Q755P009N145L920K467M26q04n33l98j699l216l454
58597F32444l040l008k706j438k87k80m10N48J956K852L897N866P895R058R987
58582F63334J1253J1938J1570J1459J2251J2231J0079P374O081N547M271K903
$$ plain form
58570 770291 773246 777376 782683 789523 799075 811704 826373 842085 858603 875641 892825 910440
58558 910440 928660 946233 961519 974446 985535 993562 996642 995402 992490 988864 983163 974974 965944
58545 965944 957091 947711 937727 928559 920552 911792 900584 887191 872269 855656 837716 819971 803301
58532 803301 787172 771478 757457 745936 736289 727869 720922 715430 710679 706658 704261 703582 703552 703699
58518 703699 704581 706113 707247 707766 708629 710134 711519 712706 714559 717063 719152 720622 722234 723688 723691 722379
58502 722379 721467 721569 721592 721128 721046 721208 720135 717662 715510 714489 713527 712204 711781 712834 714241 715445 717360
58485 717360 720150 722567 724511 727837 733523 740345 747374 755487 765287 775868 786701 798346 810099
58472 810099 819305 824342 826144 825722 822544 816557 809431 802438 795281 788170 782704 779369 776541 773339
$$ packed form
58570G70291K955M130N307O840R552J2629J4669J5712J6518J7038J7184J7615
58558I10440J8220J7573J5286J2927J1089Q027L080j240k912l626n701q189r030
58545I65944q853r380r984r168q007q760j1208j3393j4922j6613j7940j7745j6670
58532H03301j6129j5694j4021j1521r647q420o947n492m751m021k397o79l0J47
58518G03699Q82J532J134N19Q63J505J385J187J853K504K089J470J612J454Lj312
58502G22379r12J02K3m64q2J62j073k473k152j021r62j323m23J053J407J204J915
58485G17360K790K417J944L326N686O822P029Q113R800J0581J0833J1645J1753
58472H10099R206N037J802m22l178n987p126o993p157p111n466l335k828l202
$$ plain form
58458 773339 771195 771264 772635 774521 777937 783664 790716 798217 806610 815631 823356 828631 832228 834308 833275
58443 833275 828622 822486 816763 811015 804764 799364 795816 793115 790541 789349 790416 792448 794268 796659
58429 796659 800281 804034 807293 811478 817632 824671 831718 839801 849394 858617 865859 871913 877655 881935
58415 881935 883842 884735 885997 886922 886856 887207 889064 890790 890113 886859 881825 875036 866990 859626 854098 849365
58399 849365 844516 840460 837881 835847 834026 833822 835747 838179 840328 843674 848774 853606 857066 861122
58385 861122 867331 874170 880184 886780 895339 904278 911558 917549 922932 926410 927141 926934 927638 928773 929994
58370 929994 933031 938731 944988 950221 956128 964473 974053 983438 993746 1005954 1018427 1030004 1042482
58357 1042482 1057075 1071312 1082513 1091497 1099869 1106655 1110740 1113668 1116927 1119368 1120303 1121980 1125857
$$ packed form
58458G73339k144O9J371J886L416N727P052P501Q393R021P725N275L597K080j033
58443H33275m653o136n723n748o251n400l548k701k574j192J067K032J820K391
58429G96659L622L753L259M185O154P039P047Q083R593R223P242O054N742M280
58415H81935J907Q93J262R25o6L51J857J726o77l254n034o789q046p364n528m733
58399H49365m849m056k579k034j821k04J925K432K149L346N100M832L460M056
58385H61122O209O839O014O596Q559Q939P280N991N383L478P31k07P04J135J221
58370I29994L037N700O257N233N907Q345R580R385J0308J2208J2473J1577J2478
58357A042482J4593J4237J1201Q984Q372O786M085K928L259K441R35J677L877
$$ plain form
58344 1125857 1129743 1131951 1134844 1140694 1147537 1153007 1158999 1168438 1180531 1193190 1207095 1223287 1239820
58331 1239820 1254894 1270298 1287740 1304858 1319013 1331732 1345063 1356919 1364741 1370594 1377803 1385420
58319 1385420 1390891 1395349 1401434 1408531 1414956 1422160 1432122 1443302 1453767 1465407 1480386 1496487 1510771
58306 1510771 1524728 1540909 1557733 1572780 1587932 1605934 1625057 1642470 1659612 1678818 1698124
58295 1698124 1715130 1732463 1753433 1775739 1795667 1815086 1837852 1862621 1885840 1908721 1934565
58284 1934565 1962218 1988832 2016074 2046897 2079260 2109780 2140422 2174735 2210943 2245864 2282142
58273 2282142 2324087 2369746 2414740 2460567 2511362 2565945 2621064 2678900 2742900 2809725 2874022
58262 2874022 2937828 3006402 3078235 3148312 3217908 3291617 3367933 3442422 3517086 3596760 3679396
$$ packed form
58344A125857L886K208K893N850O843N470N992R439J2093J2659J3905J6192J6533
58331A239820J5074J5404J7442J7118J4155J2719J3331J1856P822N853P209P617
58319A385420N471M458O085P097O425P204R962J1180J0465J1640J4979J6101J4284
58306A510771J3957J6181J6824J5047J5152J8002J9123J7413J7142J9206J9306
58295A698124J7006J7333K0970K2306J9928J9419K2766K4769K3219K2881K5844
58284A934565K7653K6614K7242L0823L2363L0520L0642L4313L6208L4921L6278
58273B282142M1945M5659M4994M5827N0795N4583N5119N7836O4000O6825O4297
58262B874022O3806O8574P1833P0077O9596P3709P6316P4489P4664P9674Q2636
$$ plain form
58251 3679396 3759971 3841007 3929126 4024250 4122413 4225778 4339147 4459943 4582671 4709920
58241 4709920 4847830 4994409 5144118 5300094 5469526 5650764 5837834 6033888 6246800
58232 6246800 6475242 6713013 6963415 7234964 7526612 7832030 8154793 8504084 8879382
58223 8879382 9275318 9697580 10157471 10655173 11185857 11757703 12385575 13071818 13812871
58214 13812871 14619914 15512548 16497494 17575595 18764686 20092689 21574464 23220976
58206 23220976 25066333 27160596 29543907 32257638 35375799 38997308 43218319 48148463
58198 48148463 53948187 60817145 68961753 78621263 90119113 103843216 120172564 139421860
58190 139421860 161758372 187054753 214856169 244573606 275530106 306399146 334421981
$$ packed form
58251C679396Q0575Q1036Q8119R5124R8163J03365J13369J20796J22728J27249
58241D709920J37910J46579J49709J55976J69432J81238J87070J96054K12912
58232F246800K28442K37771K50402K71549K91648L05418L22763L49291L75298
58223H879382L95936M22262M59891M97702N30684N71846O27872O86243P41053
58214A3812871Q07043Q92634R84946J078101J189091J328003J481775J646512
58206B3220976J845357K094263K383311K713731L118161L621509M221011M930144
58198D8148463N799724O868958Q144608R659510J1497850J3724103J6329348J9249296
58190A39421860K2336512K5296381K7801416K9717437L0956500L0869040K8022835
$$ plain form
58183 334421981 355554170 366015439 364146720 351014357 329478553 302811301 273872585
58176 273872585 244886707 217413336 192375934 170208158 151051177 134882022 121576180
58169 121576180 110940519 102708083 96550935 92184242 89425890 87989336 87154102 85801879
58161 85801879 82967709 78386059 72477752 65895247 59166003 52654926 46624730 41218871
58153 41218871 36452088 32281458 28666318 25554734 22870153 20545747 18544001 16827829
58145 16827829 15344543 14052981 12936987 11977944 11139543 10391612 9725035 9131969 8592963
58136 8592963 8093386 7632495 7207402 6806603 6426659 6077065 5761455 5470706 5200160
58127 5200160 4956391 4740937 4543995 4360197 4194636 4047121 3905718 3762309 3620751
$$ packed form
58183C34421981K1132189J0461269j868719j3132363k1535804k6667252k8938716
58176B73872585k8985878k7473371k5037402k2167776j9156981j6169155j3305842
58169A21576180j0635661q232436o157148m366693k758352j436554q35234j352223
58161H5801879k834170m581650n908307o582505o729244o511077o030196n405859
58153D1218871m766783m170630l615140l111584k684581k324406k001746j716172
58145A6827829j483286j291562j115994r59043q38401p47931o66577n93066n39006
58136H592963m99577m60891m25093m00799l79944l49594l15610k90749k70546
58127E200160k43769k15454j96942j83798j65561j47515j41403j43409j41558
$$ plain form
58118 3620751 3484217 3348272 3212056 3083085 2965029 2852580 2743202 2642067 2550801 2463141
58108 2463141 2376490 2296381 2224960 2156180 2087012 2022625 1965923 1912400 1859959 1813674 1776005
58097 1776005 1741693 1706800 1673773 1643560 1611765 1576811 1543258 1513028 1481720 1447345 1414396
58086 1414396 1385526 1357375 1328248 1301838 1279585 1257146 1232124 1207839 1186092 1163673 1139390
58075 1139390 1117077 1098218 1078844 1056980 1036023 1017552 998066 976151 955767 939048 922821
58064 922821 905561 890790 880148 869884 857782 846852 838742 830067 818878 808296 800098 791097
58052 791097 779583 769130 762114 755414 746412 737490 730708 723606 714168 704705 697117 689393 680299 672395
58038 672395 666998 661226 653386 646084 640691 634018 624080 613970 606280 598696 588883 578820 570356 561207
$$ packed form
58118C620751j36534j35945j36216j28971j18056j12449j09378j01135r1266q7660
58108B463141q6651q0109p1421o8780o9168o4387n6702n3523n2441m6285l7669
58097A776005l4312l4893l3027l0213l1795l4954l3553l0230l1308l4375l2949
58086A414396k8870k8151k9127k6410k2253k2439k5022k4285k1747k2419k4283
58075A139390k2313j8859j9374k1864k0957j8471j9486k1915k0384j6719j6227
58064I22821j7260j4771j0642j0264j2102j0930q110q675j1189j0582q198r001
58052G91097j1514j0453p016o700r002q922o782p102r438r463p588p724r094p904
58038F72395n397n772p840p302n393o673r938j0110p690p584r813j0063q464r149
$$ plain form
58024 561207 549425 537541 528351 520666 512815 506200 501705 496690 489246 481579 475753 470047 463023 457089
58010 457089 454320 452552 449326 446015 444379 442679 439014 435177 433442 432617 430776 428878 428278 427607 425379
57995 425379 422869 421435 419972 417843 417100 418815 420522 420371 420522 423252 427017 429707 432558 437269 442194
57980 442194 444938 446139 447450 448442 448648 449892 453256 456375 457029 456900 458555 461184 462568 462874 463324 463405
57964 463405 462524 462220 463671 465153 464857 463945 463963 463592 460980 457027 453352 449228 443528 437575 433051 429017
57948 429017 423949 418705 414735 411380 407730 405033 404497 404788 404521 405021 407760 411239 413477 415588 419824
57933 419824 426019 432922 441101 451353 461958 470668 477982 485596 493164 499371 504654 510030 514663 517248
57919 517248 518318 518690 517274 512982 507136 501399 495079 487015 478318 470480 462540 452939 442565 433174
$$ packed form
58024E61207j1782j1884r190p685p851o615m495n015p444p667n826n706p024n934
58010D57089k769j768l226l311j636j700l665l837j735q25j841j898o00o71k228
57995D25379k510j434j463k129p43J715J707j51J51K730L765K690K851M711M925
57980D42194K744J201J311R92K06J244L364L119O54j29J655K629J384L06M50Q1
57964D63405q81l04J451J482k96r12J8l71k612l953l675m124n700n953m524m034
57948D29017n068n244l970l355l650k697n36K91k67N00K739L479K238K111M236
57933D19824O195O903Q179J0252J0605Q710P314P614P568O207N283N376M633K585
57919E17248J070L72j416m292n846n737o320q064q697p838p940r601j0374r391
$$ plain form
57905 433174 424457 415429 407016 400342 394050 386278 377849 370592 364004 356526 348701 342080 336229 329799
57891 329799 323450 318917 316187 314247 313389 314123 315023 314350 312763 311981 312047 312328 313691 316971 320713 323177
57875 323177 325149 327985 330437 330459 328761 327442 326340 323944 320810 318823 317926 316662 315159 314577 314424
57860 314424 313404 312130 312093 312829 313105 314052 317912 324342 331055 337530 344971 353179 360641 367431 374973
57845 374973 383127 390411 396824 403619 410526 416094 420500 425093 429269 430742 429037 426007 422792 418781
57831 418781 413695 408202 402360 395724 389028 383588 379144 374376 369271 364862 361088 357238 354014 352680
57817 352680 352592 352023 351001 350798 351184 351029 351184 353705 358186 361777 362997 362898 362414 361399 360482 360977 362350
57800 362350 362350 360108 356833 353149 348342 342634 337672 334071 330750 327284 324662 323105 321319 318628 315871
$$ packed form
57905D33174q717r028q413o674o292p772q429p257o588p478p825o621n851o430
57891C29799o349m533k730j940q58P34R00o73j587p82O6K81J363L280L742K464
57875C23177J972K836K452K2j698j319j102k396l134j987q97j264j503n82j53
57860C14424j020j274l7P36K76R47L860O430O713O475P441Q208P462O790P542
57845C74973Q154P284O413O795O907N568M406M593M176J473j705l030l215m011
57831D18781n086n493n842o636o696n440m444m768n105m409l774l850l224j334
57817C52680q8n69j022k03L86j55J55K521M481L591J220r9m84j015r17M95J373
57800C62350%k242l275l684m807n708m962l601l321l466k622j557j786k691k757
$$ plain form
57785 315871 313557 311009 307905 304893 302195 299302 296465 294814 294672 295344 296667 299057 301991 304340 306303
57770 306303 309145 312951 316557 319760 323550 327966 331752 334358 336311 337405 336539 333650 329882 325620
57756 325620 320343 314544 309664 305800 301536 296421 291552 287351 282901 278035 273970 271253 268964 266600
57742 266600 264854 263879 262635 260699 259048 258295 257651 256313 254511 252684 250897 249450 248758 248456 247950 247769
57726 247769 248822 250436 250959 250310 250066 250934 252153 253529 255864 258933 261095 261619 261629 262191 263121 264117 265320
57709 265320 266329 266328 265633 265461 265902 265804 264962 264626 265528 267150 269199 271916 274691 276363 277312 279294 282755
57692 282755 286254 288893 291230 293352 294247 293798 293274 293103 292214 290401 289325 290227 292552 295746 300547 307536
57676 307536 316239 326803 340979 360478 385790 417407 456595 504015 559023 621074 690417 766655
$$ packed form
57785C15871k314k548l104l012k698k893k837j651j42O72J323K390K934K349J963
57770C06303K842L806L606L203L790M416L786K606J953J094q66k889l768m262
57756C25620n277n799m880l864m264n115m869m201m450m866m065k717k289k364
57742B66600j746r75j244j936j651p53o44j338j802j827j787j447o92l02n06j81
57726B47769J053J614N23o49k44Q68J219J376K335L069K162N24J0N62R30R96J203
57709B65320J009jo95j72M41r8q42l36R02J622K049K717K775J672R49J982L461
57692B82755L499K639K337K122Q95m49n24j71q89j813j076R02K325L194M801O989
57676C07536Q703J0564J4176J9499K5312L1617L9188M7420N5008O2051O9343P6238
$$ plain form
57664 766655 847477 928399 1001645 1055564 1078830 1067558 1027265 967350 895586 818188 741575
57653 741575 671072 608911 555113 509260 470373 436684 407146 382196 362060 345565 331501
57642 331501 319712 309897 300910 292401 285618 281370 278575 275911 273504 271782 270121 267931 265844 264534
57628 264534 263468 261984 260470 259470 258677 257740 256910 256046 254323 251793 249823 249026 248206 246412 244546 243757
57612 243757 243707 243616 243671 244061 243963 242840 241681 241656 242554 243543 244330 244560 243441 241208 239699 240175 241605 242274
57594 242274 241923 241150 239919 238011 235983 234424 233059 231517 229966 228136 224997 220414 215855 212477 209822
57579 209822 207387 205892 205746 205787 204987 203956 203315 202079 199333 196147 193984 192384 190067 187280 185154
57564 185154 183523 181303 178432 175701 173185 170490 168093 166878 166666 166556 166410 166745 167602 168611 169769
$$ packed form
57664G66655Q0822Q0922P3246N3919K3266j1272m0293n9915p1764p7398p6613
57653G41575p0503o2161n3798m5853l8887l3689k9538k4950k0136j6495j4064
57642C31501j1789r815q987q509o783m248k795k664k407j722j661k190k087j310
57628B64534j066j484j514j000p93r37q30q64j723k530j970p97q20j794j866p89
57612B43757n0r1N5L90r8j123j159k5Q98R89P87K30j119k233j509M76J430O69
57594B42274l51p73j231j908k028j559j365j542j551j830l139m583m559l378k655
57579B09822k435j495j46M1q00j031o41j236k746l186k163j600k317k787k126
57564A85154j631k220k871k731k516k695k397j215k12j10j46L35Q57J009J158
$$ plain form
57549 169769 171134 172317 173220 174631 177121 180091 182796 185424 188215 190516 191821 192723 193698 194045 193325
57534 193325 192727 193520 195095 196037 196251 196459 196464 195587 194218 193335 192950 192478 192075 192205 192364 191752 190803 190733 191857
57515 191857 193501 195151 196575 197333 197322 197335 198081 199130 199734 199971 200184 200155 199817 199806 200211 199844 197946 195557
57497 195557 193894 192583 190903 189518 189259 189310 188527 187575 187762 188537 188254 186797 185382 184193 182376 180136
57481 180136 178845 179005 179786 180525 181149 181307 180653 179847 179802 180180 180100 179886 180447 181298 181040 179656 178522 178173
57463 178173 177866 177430 177773 179207 180785 181694 182088 182332 182584 183207 184485 185906 186787 187458 188725 190413 191680
57446 191680 192519 193675 195289 196932 198693 200856 202714 203171 202477 202031 202561 203710 205170 206872 208309
57431 208309 209065 209792 211275 212895 213481 213374 213989 215584 217156 218336 219560 220447 219966 218406 217347 217394
$$ packed form
57549A69769J365J183R03J411K490K970K705K628K791K301J305R02R75L47p20
57534A93325n98P93J575R42K14K08Nq77j369q83l85m72m03J30J59o12r49p0J124
57515A91857J644J650J424P58j1J3P46J049O04K37K13k9l38j1M05l67j898k389
57497A95557j663j311j680j385k59N1p83r52J87P75k83j457j415j189j817k240
57481A80136j291J60P81P39O24J58o54q06m5L78q0k14N61Q51k58j384j134l49
57463A78173l07m36L43J434J578R09L94K44K52O23J278J421Q81O71J267J688J267
57446A91680Q39J156J614J643J761K163J858M57o94m46N30J149J460J702J437
57431B08309P56P27J483J620N86j07O15J595J572J180J224Q87m81j560j059M7
$$ plain form
57415 217394 217618 217488 217577 217990 217897 217229 217170 218235 219287 219307 218892 219257 220732 222884 225210 227214 228628 229944
57397 229944 231965 234645 237187 239271 241228 242993 243974 244035 243632 242976 242124 241766 242741 244871 247405 250452
57381 250452 254616 259468 263886 267783 271829 275507 277286 277028 276464 276824 277634 278336 279389 280988 282249
57366 282249 282560 282580 283104 284002 284945 286102 287517 288730 289609 290586 291705 292466 293030 294469 297311 300866 304423
57349 304423 308055 311766 314948 317298 319369 321682 324117 326542 329227 332280 335499 338968 342895 346781
57335 346781 349791 352122 354882 358464 362203 365751 369445 373035 375483 376555 377366 378819 380685 382686
57321 382686 385244 388545 391986 395168 398488 402268 406273 410472 415224 420252 424546 427737 430601 433879
57307 433879 437633 441999 447372 453466 459387 464918 470560 476104 480679 484515 489055 494787 500542 505624
$$ packed form
57415B17394K24j30Q9M13r3o68n9J065J052K0m15L65J475K152K326K004J414J316
57397B29944K021K680K542K084J957J765R81O1m03o56q52l58R75K130K534L047
57381B50452M164M852M418L897M046L678J779k58n64L60Q10P02J053J599J261
57366B82249L11K0N24Q98R43J157J415J213Q79R77J119P61N64J439K842L555L557
57349C04423L632L711L182K350K071K313K435K425K685L053L219L469L927L886
57335C46781L010K331K760L582L739L548L694L590K448J072Q11J453J866K001
57321C82686K558L301L441L182L320L780M005M199M752N028M294L191K864L278
57307D33879L754M366N373O094N921N531N642N544M575L836M540N732N755N082
$$ plain form
57293 505624 510993 517504 524536 531373 538482 546325 554246 561737 569632 578825 588835 598823 609043 620107
57279 620107 631635 642808 653599 664441 675291 685891 696363 706771 716809 726631 737224 749127
57267 749127 761527 773345 784494 795400 806135 816802 827953 839885 852194 864668 877802
57256 877802 891836 906217 920608 935435 950750 965685 979875 994343 1010009 1026366 1042621
57245 1042621 1059094 1076321 1093767 1110739 1127824 1146078 1165355 1184693 1203902 1223569 1243848
57234 1243848 1264441 1285627 1308333 1333095 1359578 1386948 1414310 1441095 1467441 1493886 1520452
57223 1520452 1546611 1572332 1598307 1624891 1651798 1679270 1708389 1739609 1772130 1805508 1840668
57212 1840668 1878280 1917244 1956063 1994870 2034781 2075873 2117062 2157608 2197586 2237139 2276237
$$ packed form
57293E05624N369O511P032O837P109P843P921P491P895R193J0010R988J0220J1064
57279F20107J1528J1173J0791J0842J0850J0600J0472J0408J0038R822J0593J1903
57267G49127J2400J1818J1149J0906J0735J0667J1151J1932J2309J2474J3134
57256H77802J4034J4381J4391J4827J5315J4935J4190J4468J5666J6357J6255
57245A042621J6473J7227J7446J6972J7085J8254J9277J9338J9209J9667K0279
57234A243848K0593K1186K2706K4762K6483K7370K7362K6785K6346K6445K6566
57223A520452K6159K5721K5975K6584K6907K7472K9119L1220L2521L3378L5160
57212A840668L7612L8964L8819L8807L9911M1092M1189M0546L9978L9553L9098
$$ plain form
57201 2276237 2315030 2353687 2392031 2429727 2466457 2501623 2534680 2566194 2597698 2629940 2662219
57190 2662219 2694063 2726469 2760641 2796614 2834145 2873874 2916323 2960603 3005467 3051053 3098267
57179 3098267 3146928 3195761 3243900 3291301 3338015 3384071 3429870 3475775 3521534 3566768 3611615
57168 3611615 3656249 3700287 3743249 3784941 3824739 3861374 3894341 3924813 3954281 3983041 4010774
57157 4010774 4037582 4063258 4086366 4105370 4120113 4131190 4138730 4143145 4146388 4150879 4157476 4165673
57145 4165673 4175299 4186761 4200049 4214799 4230996 4248390 4265535 4280736 4293706 4305104 4314753 4321611
57133 4321611 4325320 4326587 4326153 4324582 4323026 4323029 4325492 4330715 4339341 4352338 4370070 4391997 4416992 4443334
57119 4443334 4469039 4493326 4517535 4543908 4574069 4609502 4652555 4705426 4768575 4841412 4924218
$$ packed form
57201B276237L8793L8657L8344L7696L6730L5166L3057L1514L1504L2242L2279
57190B662219L1844L2406L4172L5973L7531L9729M2449M4280M4864M5586M7214
57179C098267M8661M8833M8139M7401M6714M6056M5799M5905M5759M5234M4847
57168C611615M4634M4038M2962M1692L9798L6635L2967L0472K9468K8760K7733
57157D010774K6808K5676K3108J9004J4743J1077P540M415L243M491O597Q197
57145D165673R626J1462J3288J4750J6197J7394J7145J5201J2970J1398R649O858
57133D321611L709J267m34j571j556LK463N223Q626J2997J7732K1927K4995K6342
57119D443334K5705K4287K4209K6373L0161L5433M3053N2871O3149P2837Q2806
$$ plain form
57108 4924218 5018370 5125508 5248290 5391728 5562346 5766260 6009621 6300938 6651737 7075575
57098 7075575 7588459 8210552 8966026 9881056 10983159 12301946 13867876 15708414 17844731
57089 17844731 20289617 23044099 26092921 29402039 32917759 36563980 40239674 43824516
57081 43824516 47193252 50226730 52810531 54830494 56183093 56802576 56684592 55885449
57073 55885449 54497850 52622736 50353980 47776380 44967593 41998348 38932305 35827516
57065 35827516 32738326 29715934 26807721 24055568 21492783 19140973 17009685 15099097
57057 15099097 13402723 11908347 10599129 9456219 8460982 7595298 6841684 6184638 5611335
57048 5611335 5110331 4670556 4282413 3938783 3633752 3361248 3116041 2895066 2696322
$$ packed form
57108D924218R4152J07138J22782J43438J70618K03914K43361K91317L50799M23838
57098G075575N12884O22093P55474R15030J102103J318787J565930J840538K136317
57089A7844731K444886K754482L048822L309118L515720L646221L675694L584842
57081D3824516L368736L033478K583801K019963J352599O19483j17984p99143
57073E5885449j387599j875114k268756k577600k808787k969245l066043l104789
57065C5827516l089190l022392k908213k752153k562785k351810k131288j910588
57057A5099097j696374j494376j309218j142910r95237q65684p53614o57046n73303
57048E611335n01004m39775l88143l43630l05031k72504k45207k20975j98744
$$ plain form
57039 2696322 2517117 2354679 2207686 2075667 1957279 1850458 1753785 1666430 1587245 1515081
57029 1515081 1449516 1390195 1336134 1286793 1242995 1205505 1173585 1146376 1124821 1110800 1105427
57018 1105427 1109862 1126807 1159534 1210572 1282701 1378884 1498525 1636257 1788436 1957927 2144533
57007 2144533 2328506 2470088 2531623 2500759 2392557 2233991 2049853 1858952 1675042 1506845
56997 1506845 1358082 1229044 1118429 1024484 945701 880866 828293 785584 750633 722341 699985
56986 699985 682606 669466 660318 654548 650566 646416 640331 630508 615345 594611 569793 542939 515727
56973 515727 489669 466024 444994 425865 408407 393299 380932 370857 362890 357729 355967 357426
56961 357426 361910 369639 380431 393401 407936 423869 440062 453772 462159 463828 458656 447219
$$ packed form
57039B696322j79205j62438j46993j32019j18388j06821r6673q7355p9185p2164
57029A515081o5565n9321n4061m9341m3798l7490l1920k7209k1555j4021n373
57018A105427M435J6945L2727N1038P2129R6183J19641J37732J52179J69491J86606
57007B144533J83973J41582O1535l0864j08202j58566j84138j90901j83910j68197
56997A506845j48763j29038j10615r3945p8783o4835n2573m2709l4951k8292k2356
56986F99985j7379j3140r148n770l982m150o085r823j5163k0734k4818k6854k7212
56973E15727k6058k3645k1030j9129j7458j5108j2367j0075p967n161j762J459
56961C57426M484P729J0792J2970J4535J5933J6193J3710Q387J669n172j1437
$$ plain form
56949 447219 431019 412303 392938 373981 356452 341451 329145 318788 310190 304064 300548 298798
56937 298798 298793 302234 310693 323859 340408 359513 380585 402517 424027 443759 459195 466694 463993
56924 463993 452100 433870 411547 386606 360910 336396 313894 293313 274697 258254 243777
56913 243777 230928 219796 210413 202137 194277 187001 180938 176229 172609 169997 168359 167328 166581 166302
56899 166302 166831 168231 170484 173613 177309 181124 185475 191734 200860 212503 225855 240575 256483
56886 256483 273218 290679 308850 326486 340929 350094 353988 353619 349391 341545 331317 320500 310275
56873 310275 301439 295227 292795 294104 298241 304715 313882 326393 342904 364015 389820 419695 452979
56860 452979 489542 529134 570344 610335 645146 670191 681672 678596 663324 639800 611601 581650
$$ packed form
56949D47219j6200j8716j9365j8957j7529j5001j2306j0357q598o126l516j750
56937B98798nL441Q459J3166J6549J9105K1072K1932K1510J9732J5436P499k701
56924D63993j1893j8230k2323k4941k5696k4514k2502k0581j8616j6443j4477
56913B43777j2849j1132r383q276p860p276o063m709l620k612j638j031p47k79
56899A66302N29J400K253L129L696L815M351O259R126J1643J3352J4720J5908
56886B56483J6735J7461J8171J7636J4443R165L894l69m228p846j0228j0817j0225
56873C10275q836o212k432J309M137O474R167J2511J6511K1111K5805K9875L3284
56860D52979L6563L9592M1210L9991L4811K5045J1481l076j5272k3524k8199k9951
$$ plain form
56848 581650 552561 526312 504011 486570 475036 469809 470343 476364 488884 509424 538725 576652
56836 576652 622647 675714 734626 798489 865975 932916 991335 1032134 1049169 1041132 1010922 964176
56824 964176 907512 846661 785699 727755 675443 630173 592000 560931 537762 523179 516953 518761
56812 518761 528961 547773 574438 607952 647822 693225 741823 789750 831913 862078 874451
56801 874451 866793 841570 803357 756039 703157 649206 598515 553194 513437 479341 451226 428808
56789 428808 411520 399456 393010 391925 395646 404061 416963 433363 452352 473797 496811 518002
56777 518002 532682 537718 532358 517063 493141 463302 430906 398183 365918 334749 305797 280057
56765 280057 257944 239346 223495 209165 195828 184306 175495 168865 163008 157180 151456 145876 140435
$$ packed form
56848E81650k9089k6249k2301j7441j1534n227N34O021J2520K0540K9301L7927
56836E76652M5995N3067N8912O3863O7486O6941N8419M0799J7035q037l0210m6746
56824I64176n6664o0851o0962n7944n2312m5270l8173l1069k3169j4583o226J808
56812E18761J0200J8812K6665L3514L9870M5403M8598M7927M2163L0165J2373
56801H74451p658k5223l8213m7318n2882n3951n0691m5321l9757l4096k8115k2418
56789D28808j7288j2064o446j085L721Q415J2902J6400J8989K1445K3014K1191
56777E18002J4680N036n360j5295k3922k9839l2396l2723l2265l1169k8952k5740
56765B80057k2113j8598j5851j4330j3337j1522q811o630n857n828n724n580n441
$$ plain form
56752 140435 135469 131086 126631 121630 116748 112870 109841 107246 105675 105803 106632 106194 103921 101038 98710
56737 98710 97025 95685 94482 93060 91246 89662 89040 89050 88801 88361 88703 90187 92083 93626 94676 95418
56721 95418 96210 97613 99763 101916 103363 104416 105673 106810 107170 107077 107374 107982 108136 107820 107749 108113 108509
56704 108509 108978 109890 110885 111136 110644 110207 110138 110076 109990 110250 110748 111034 111256 111928 112797 113061 112648 112202 111887 111320
56684 111320 110664 110661 111461 112487 113428 114367 114932 114500 113364 112601 112571 112502 111730 110521 109529 109204 109776 111090 112491
56665 112491 113506 114469 115825 117266 118384 119555 121107 122207 121932 121023 121088 122289 123284 123385 123278 123505
56649 123505 123691 123494 123157 122897 122786 123313 125026 127594 130190 132622 135067 137072 138119 138905 140586 142913
56633 142913 144573 145264 145895 146851 147725 148789 150968 154011 156308 156944 156536 155785 154674 153429 152757 152683 152495
$$ packed form
56752A40435m966m383m455n001m882l878l029k595j571J28Q29m38k273k883k328
56737I8710j685j340j203j422j814j584o22J0k49m40L42J484J896J543J050P42
56721I5418P92J403K150K153J447J053J257J137L60r3K97O08J54l16p1L64L96
56704A08509M69R12R95K51m92m37o9o2q6K60M98K86K22O72Q69K64m13m46l15n67
56684A11320o56lQ00J026R41R39N65m32j136p63l0o9p72j209r92l25N72J314J401
56665A12491J015R63J356J441J118J171J552J100k75r09O5J201R95J01j07K27
56649A23505J86j97l37k60j11N27J713K568K596K432K445K005J047P86J681K327
56633A42913J660O91O31R56Q74J064K179L043K297O36m08p51j111j245o72p4j88
$$ plain form
56616 152495 152165 152480 153457 154064 153910 153786 154125 154314 153968 153515 153135 152492 151897 152245 153293 153503 152147 150243
56598 150243 148932 148286 148166 148690 149276 148774 147317 146551 147277 148263 148220 147506 146981 146551 145889 145437 145583 145885
56580 145885 146017 146548 147937 149656 151104 152434 153797 154742 155125 155668 156985 158982 161726 165703 170541
56565 170541 174759 177702 180648 185099 190974 197414 204391 212479 221774 231954 242717 253446 263021
56552 263021 270629 276235 279952 281881 282978 284909 288311 291970 294318 294970 294467 293445 292482 291762 290455
56537 290455 287443 283037 278872 275741 272700 268647 263537 257712 251519 246012 242426 240334 237834 234154
56523 234154 230423 227221 223335 218003 212557 208454 205308 202253 199789 198635 198022 196682 194599 192465
56509 192465 190368 188253 186701 185966 185234 183955 182846 182470 182038 180886 179904 180069 180692 180600 179927 179247 178096
$$ packed form
56616A52495l30L15R77O07j54j24L39J89l46m53l80o43n95L48J048K10j356j904
56598A50243j311o46j20N24N86n02j457p66P26R86m3p14n25m30o62m52J46L02
56580A45885J32N31J389J719J448J330J363R45L83N43J317J997K744L977M838
56565A70541M218K943K946M451N875O440O977Q088R295J0180J0763J0729R575
56552B63021P608N606L717J929J097J931L402L659K348O52n03j022r63p20j307
56537B90455l012m406m165l131l041m053n110n825o193n507l586k092k500l680
56523B34154l731l202l886n332n446m103l146l055k464j154o13j340k083k134
56509A92465k097k115j552p35p32j279j109l76m32j152r82J65O23r2o73o80j151
$$ plain form
56492 178096 176017 174111 173753 174539 175143 175455 176160 176965 177050 176784 177188 178052 178263 177740 177429 177514 177184 176117
56474 176117 174857 173754 172793 172441 173440 175679 178216 180405 182240 183799 185168 186685 188491 190132 191233
56459 191233 192134 193224 194247 194948 195760 197037 198325 199137 199792 200732 201823 203102 205246 208356 211267 213049
56443 213049 214169 215196 215573 214973 214626 215675 217222 217742 217579 218146 219364 219890 219561 219648 220707 221917 222689
56426 222689 223400 224198 224378 223324 221284 219043 217453 217077 217585 217815 217084 216043 215603 215671 215743 215967 216632 217280
56408 217280 217331 216967 216453 215351 213524 212100 212207 213398 214515 215415 216589 217731 218024 217385 216225 214612
56392 214612 212793 211923 212906 215022 216824 217836 218372 218489 218356 218811 220232 221604 221996 222138 223244 225134
56376 225134 226914 228586 230445 231804 231973 231739 232246 233239 233993 235048 237193 239653 241262 242590 244870
$$ packed form
56492A78096k079j906l58P86O04L12P05Q05Q5k66M04Q64K11n23l11Q5l30j067
56474A76117j260j103r61l52R99K239K537K189J835J559J369J517J806J641J101
56459A91233R01J090J023P01Q12J277J288Q12O55R40J091J279K144L110K911J782
56443B13049J120J027L77o00l47J049J547N20j63N67J218N26l29Q7J059J210P72
56426B22689P11P98J80j054k040k241j590l76N08K30p31j041m40O8P2K24O65O48
56408B17280N1l64n14j102j827j424J07J191J117R00J174J142K93o39j160j613
56392B14612j819q70R83K116J802J012N36J17j33M55J421J372L92J42J106J890
56376B25134J780J672J859J359J69k34N07R93P54J055K145K460J609J328K280
$$ plain form
56361 244870 247547 249107 249758 250962 252667 253332 252579 251659 251282 250966 250602 250738 251241 251377 251164 251041 250500
56344 250500 248810 246859 246332 247285 248384 249336 251053 253561 255822 257671 259954 262685 264910 266498 268247
56329 268247 270245 271974 273879 276832 280118 282128 283080 284881 288060 291084 293081 295046 297711 300250
56315 300250 301896 303201 304981 307358 310214 313215 315213 315188 313985 313615 314754 316541 318740 322086 326306
56300 326306 329824 332002 333965 336756 340264 344226 348621 352698 355270 356374 357240 358417 359425 360236 361457
56285 361457 362989 364203 365444 367713 370961 374533 379034 385554 393098 399134 403019 406627 411354 416715
56271 416715 422291 428665 435808 442711 449286 456694 465251 474009 482916 493274 505460 518324 531424
56258 531424 545801 561927 579062 597367 618571 643710 672137 703509 738735 778209 821167
$$ packed form
56361B44870K677J560O51J204J705O65p53r20l77l16l64J36N03J36k13j23n41
56344B50500j690j951n27R53J099R52J717K508K261J849K283K731K225J588J749
56329B68247J998J729J905K953L286K010R52J801L179L024J997J965K665K539
56315C00250J646J305J780K377K856L001J998k5j203l70J139J787K199L346M220
56300C26306L518K178J963K791L508L962M395M077K572J104Q66J177J008Q11J221
56285C61457J532J214J241K269L248L572M501O520P544O036L885L608M727N361
56271D16715N576O374P143O903O575P408Q557Q758Q907J0358J2186J2864J3100
56258E31424J4377J6126J7135J8305K1204K5139K8427L1372L5226L9474M2958
$$ plain form
56247 821167 867639 919020 975790 1036462 1099626 1165243 1233147 1302097 1370998 1439287 1505433
56236 1505433 1566900 1622211 1671207 1712752 1744251 1764128 1772879 1771080 1758379 1735096 1702778 1662609
56224 1662609 1615340 1563159 1509190 1454493 1397910 1339534 1281827 1226549 1173232 1121671 1073274
56213 1073274 1028684 986584 946167 908551 874525 843103 813499 786255 761338 737467 714499
56202 714499 694086 676786 660959 645682 632178 621077 610921 600914 592522 586681 581945 577144
56190 577144 573338 571249 569221 565797 562173 560015 558817 557320 555639 554214 552536 550621 549808 550509 551194
56175 551194 551116 551785 554125 556539 557638 558559 560572 562658 563584 564312 566297 569325 572923 577833 584147 590083
56159 590083 594613 599293 605605 612694 619664 627767 638116 649488 660735 673225 688505 705597 723050
$$ packed form
56247H21167M6472N1381N6770O0672O3164O5617O7904O8950O8901O8289O6146
56236A505433O1467N5311M8996M1545L1499J9877Q751j799j2701k3283l2318m0169
56224A662609m7269n2181n3969n4697n6583n8376n7707n5278n3317n1561m8397
56213A073274m4590m2100m0417l7616l4026l1422k9604k7244k4917k3871k2968
56202G14499k0413j7300j5827j5277j3504j1101j0156j0007q392n841m736m801
56190E77144l806k089k028l424l624k158j198j497j681j425j678j915q13P01O85
56175E51194p8O69K340K414J099R21K013K086R26P28J985L028L598M910O314N936
56159E90083M530M680O312P089O970Q103J0349J1372J1247J2490J5280J7092J7453
$$ plain form
56146 723050 741757 763317 787357 812814 840081 869697 900654 932195 965570 1002033 1041125
56135 1041125 1083000 1130408 1186242 1251127 1325382 1410870 1508407 1615381 1728178 1844582 1961417
56124 1961417 2072453 2171836 2258036 2332264 2395381 2448916 2496470 2540613 2579789 2610720 2631947
56113 2631947 2642736 2641220 2626960 2603478 2575189 2543219 2506337 2463495 2412603 2349359 2270874
56102 2270874 2179091 2078315 1971674 1862598 1756830 1659299 1570813 1490796 1420946 1362986
56092 1362986 1315243 1274969 1241949 1216558 1196518 1179116 1164624 1154198 1146603 1140274 1136207 1135356
56080 1135356 1135653 1135229 1136028 1140393 1146615 1151834 1156902 1164221 1173214 1182205 1192441 1205848 1220951 1235385
56066 1235385 1250256 1267687 1286306 1303687 1321008 1340653 1361317 1380222 1398071 1417058 1436068
$$ packed form
56146G23050J8707K1560K4040K5457K7267K9616L0957L1541L3375L6463L9092
56135A041125M1875M7408N5834O4885P4255Q5488R7537J06974J12797J16404J16835
56124A961417J11036R9383Q6200P4228O3117N3535M7554M4143L9176L0931K1227
56113B631947J0789j516j4260k3482k8289l1970l6882m2842n0892o3244p8485
56102B270874r1783j00776j06641j09076j05768r7531q8486q0017o9850n7960
56092A362986m7743m0274l3020k5391k0040j7402j4492j0426p595o329m067q51
56080A135356K97m24P99M365O222N219N068P319Q993Q991J0236J3407J5103J4434
56066A235385J4871J7431J8619J7381J7321J9645K0664J8905J7849J8987J9010
$$ plain form
56055 1436068 1452728 1468153 1484751 1501336 1515458 1528623 1544160 1561796 1579322 1597556 1618500
56044 1618500 1640632 1661359 1682158 1706006 1731690 1756098 1780141 1806922 1836085 1865485 1896437
56033 1896437 1931664 1970157 2009730 2052314 2100883 2153479 2206293 2260152 2317778 2377390 2435627
56022 2435627 2494140 2556354 2620376 2682321 2744108 2810462 2880708 2951194 3023377 3101456 3184286
56011 3184286 3267769 3353113 3444632 3541765 3641615 3746701 3861286 3982570 4104770 4229535
56001 4229535 4362915 4504714 4650822 4803437 4968345 5144352 5326323 5516565 5722134
55992 5722134 5943017 6174351 6418092 6680647 6961285 7255232 7565900 7901309 8260970
55983 8260970 8639841 9042649 9480089 9953696 10459690 11005026 11603386 12257954 12965454
$$ packed form
56055A436068J6660J5425J6598J6585J4122J3165J5537J7636J7526J8234K0944
56044A618500K2132K0727K0799K3848K5684K4408K4043K6781K9163K9400L0952
56033A896437L5227L8493L9573M2584M8569N2596N2814N3859N7626N9612N8237
56022B435627N8513O2214O4022O1945O1787O6354P0246P0486P2183P8079Q2830
56011C184286Q3483Q5344R1519R7133R9850J05086J14585J21284J22200J24765
56001D229535J33380J41799J46108J52615J64908J76007J81971J90242K05569
55992E722134K20883K31334K43741K62555K80638K93947L10668L35409L59661
55983H260970L78871M02808M37440M73607N05994N45336N98360O54568P07500
$$ plain form
55974 12965454 13734953 14584789 15523609 16553810 17691407 18962253 20381620 21960167
55966 21960167 23728321 25732383 28011009 30603106 33577872 37031035 41057349 45760930
55958 45760930 51292269 57843693 65617019 74841210 85823983 98943654 114582979 133079470
55950 133079470 154658892 179289867 206609289 236091478 267177074 298818892 328598469
55943 328598469 352527620 366351525 367597888 356668760 336207933 309612270 279952579
55936 279952579 249640465 220408043 193308938 168817982 147052942 127953600 111344403
55929 111344403 96977492 84602457 73994411 64926848 57167556 50516580 44818602
55922 44818602 39933138 35723425 32079935 28925506 26189396 23798867 21699252 19857434
$$ packed form
55974A2965454P69499Q49836R38820J030201J137597J270846J419367J578547
55966B1960167J768154K004062K278626K592097K974766L453163M026314M703581
55958D5760930N531339O551424P773326R224191J0982773J3119671J5639325J8496491
55950A33079470K1579422K4630975K7319422K9482189L1085596L1641818K9779577
55943C28598469K3929151J3823905J246363j0929128k0460827k6595663k9659691
55936B79952579l0312114k9232422k7099105k4490956k1765040j9099342j6609197
55929A11344403j4366911j2375035j0608046r067563p759292o650976n697978
55922D4818602m885464m209713l643490l154429k736110k390529k099615j841818
$$ plain form
55914 19857434 18239369 16804023 15522430 14381717 13365611 12449235 11616532 10864606
55906 10864606 10186533 9566328 8994523 8472760 7998954 7562532 7157819 6787917 6451638
55897 6451638 6139924 5848584 5581812 5339671 5114312 4901927 4706733 4529904 4365883
55888 4365883 4212964 4076595 3958785 3854531 3762053 3686672 3631383 3593163 3571703 3572350 3596936
55877 3596936 3640378 3699305 3775168 3865252 3958377 4042383 4108298 4145327 4141180 4092037 4005592
55866 4005592 3891226 3753416 3596364 3426912 3249560 3065620 2880322 2703942 2542785
55857 2542785 2395293 2259420 2137083 2028620 1929807 1837941 1754973 1681603 1614194 1550473
55847 1550473 1492500 1441035 1392636 1345339 1301670 1263061 1226603 1190306 1156342 1126227 1097892
$$ packed form
55914A9857434j618065j435346j281593j140713j016106r16376q32703p51926
55906A0864606o78073o20205n71805n21763m73806m36422m04713l69902l36279
55897F451638l11714k91340k66772k42141k25359k12385j95194j76829j64021
55888D365883j52919j36369j17810j04254r2478p5381n5289l8220k1460O47K4586
55877C596936M3442N8927P5863R0084R3125Q4006O5915L7029m147m9143q6445
55866D005592j14366j37810j57052j69452j77352j83940j85298j76380j61157
55857B542785j47492j35873j22337j08463r8813r1866q2968p3370o7409o3721
55847A550473n7973n1465m8399m7297m3669l8609l6458l6297l3964l0115k8335
$$ plain form
55836 1097892 1070361 1046183 1026210 1006973 986297 966683 950109 934249 917010 900216 885532
55825 885532 871146 855701 841368 829698 818311 804889 790809 777849 764888 750809 737124
55814 737124 724907 712576 699397 687743 679215 672066 665099 660466 659742 660738 661248 662672 666872 672537
55800 672537 677712 683001 689253 694805 697933 699365 699598 696449 688202 676824 665196 653475 640853
55787 640853 628544 618210 609397 601136 594186 589351 585370 580615 574974 568223 558861 546723 534546
55774 534546 524745 516723 509316 503545 500746 500201 500966 503906 509507 515484 518786 518296 513800 504538 490985
55759 490985 476015 461958 448134 433147 417582 402489 387361 371904 357759 346140 335590
55748 335590 324441 313719 305332 299078 293780 289748 287760 287014 286355 286200 287227 288527 289039 289405 290479
$$ packed form
55836A097892k7531k4178j9973j9237k0676j9614j6574j5860j7239j6794j4684
55825H85532j4386j5445j4333j1670j1387j3422j4080j2960j2961j4079j3685
55814G37124j2217j2331j3179j1654q528p149o967m633p24R96N10J424M200N665
55800F72537N175N289O252N552L128J432K33l149q247j1378j1628j1721j2622
55787F40853j2309j0334q813q261o950m835l981m755n641o751r362j2138j2177
55774E34546r801q022p407n771k799n45P65K940N601N977L302m90m496r262j3553
55759D90985j4970j4057j3824j4987j5565j5093j5128j5457j4145j1619j0550
55748C35590j1149j0722q387o254n298m032j988p46o59j55J027J300N12L66J074
$$ plain form
55733 290479 291511 291721 292006 293049 293353 291360 288062 285348 283217 280775 278500 277128 275576 272377 268165
55718 268165 264586 261773 258961 256498 255085 254031 252401 251000 251180 252598 254173 256350 260247 265318
55704 265318 269899 273389 275985 276907 274937 270294 264325 257763 250764 243928 237692 231366 224306 217458
55690 217458 212269 208748 205941 203525 201571 199630 197537 196294 196661 197677 197992 197808 198117 198952 199856 201086
55674 201086 202737 203547 202195 199141 195784 192589 189385 186602 184704 183212 181703 180860 181214 181843 181793 181773
55658 181773 182889 184832 186904 189785 194437 200178 205618 210688 215989 220980 224549 226656 227690 227067
55644 227067 224274 220463 217114 213842 209412 204230 199786 196190 192251 187631 183003 178427 173440 168570
55630 168570 164982 162780 161182 160060 159747 159684 158910 157616 156698 156085 155080 153954 153569 153729 153459 152630 151780
$$ packed form
55733B90479J032K10K85J043L04j993l298k714k131k442k275j372j552l199m212
55718B68165l579k813k812k463j413j054j630j401J80J418J575K177L897N071
55704B65318M581L490K596R22j970m643n969o562o999o836o236o326p060o848
55690B17458n189l521k807k416j954j941k093j243L67J016L15j84L09Q35R04J230
55674B01086J651Q10j352l054l357l195l204k783j898j492j509q43L54O29n0k0
55658A81773J116J943K072K881M652N741N440N070N301M991L569K107J034o23
55644B27067k793l811l349l272m430n182m444l596l939m620m628m576m987m870
55630A68570l588k202j598j122l13o3p74j294r18o13j005j126l85J60k70q29q50
$$ plain form
55613 151780 150711 148897 146874 145571 144505 142385 139257 136372 134091 131677 129092 127262 126429 125801 124992
55598 124992 124461 124407 124505 124747 125369 126091 126609 127506 129370 131316 131870 131165 130781 131568 133048 134732 136488 137671
55580 137671 137433 136083 134853 134351 134473 135576 138277 142151 146086 149917 154372 159576 164984 170676 177160
55565 177160 183928 189752 194448 198776 202550 204469 204084 202392 200128 196949 192668 187883 182906 177315
55551 177315 171113 165227 160350 156180 152129 147974 143632 139169 135154 132118 129636 126838 123740 121078
55537 121078 118940 116728 114453 112893 112355 112318 112325 112282 111944 111159 110464 110389 110382 109615 108556 108330 108787 108728 107986 107588
55517 107588 107802 107681 106798 105815 105019 103929 102813 102966 104737 106680 107408 107078 106388 105374 104034 103047 102946
55500 102946 103354 103712 104012 104241 103933 102916 101819 101255 101082 100870 100530 100115 99616 99250 99363 99839 100175 100209
$$ packed form
55613A51780j069j814k023j303j066k120l128k885k281k414k585j830q33o28q09
55598A24992n31n4R8K42O22P22N18Q97J864J946N54p05l84P87J480J684J756J183
55580A37671k38j350j230n02J22J103K701L874L935L831M455N204N408N692O484
55565A77160O768N824M696M328L774J919l85j692k264l179m281m785m977n591
55551A77315o202n886m877m170m051m155m342m463m015l036k482k798l098k662
55537A21078k138k212k275j560n38l7Pm3l38p85o95p5pp67j059k26M57n9p42l98
55517A07588K14j21q83r83p96j090j116J53J771J943P28l30o90j014j340r87j01
55500A02946M08L58L00K29l08j017j097n64j73k12l40m15m99l66J13M76L36L4
$$ plain form
55482 100209 100151 99911 99157 98058 97158 96571 96158 96348 97715 99807 101491 102504 103487 104467 104693 104167 103882
55465 103882 104105 103799 102365 100723 99916 99746 99605 99656 100290 101094 101291 100779 100084 99595 99278 98831 97885 96381
55447 96381 94828 93761 93120 92731 93093 94677 96650 97498 97008 96466 96726 97335 97832 98562 99647 100397 100497
55430 100497 100805 102196 104350 106283 107402 107562 106835 105805 105377 105806 106448 106822 107239 108109 109394 111110
55414 111110 113569 116692 119782 122386 124770 127226 129538 131345 132365 132179 130619 128453 126752 125389
55400 125389 123193 119828 116385 113846 112080 110744 109917 109223 107578 104652 101688 100093 99978 100682 101760
55385 101760 102723 102758 101654 100326 99675 99560 99546 99884 100896 102056 102537 102195 101322 99914 97975 96078 94885
55368 94885 94366 94061 93775 93529 93216 92766 92306 91826 91104 90263 89911 90341 91088 91556 91594 91264 90615 89970 89780
$$ packed form
55482A00209n8k40p54j099r00n87m13J90J367K092J684J013R83R80K26n26k85
55465A03882K23l06j434j642q07j70j41N1O34Q04J97n12o95m89l17m47r46j504
55447I6381j553j067o41l89L62J584J973Q48m90n42K60O09M97P30J085P50J00
55430A00497L08J391K154J933J119J60p27j030m28M29O42L74M17Q70J285J716
55414A11110K459L123L090K604K384K456K312J807J020j86j560k166j701j363
55400A25389k196l365l443k539j766j336q27o94j645k926k964j595j15P04J078
55385A01760R63L5j104j328o51j15j4L38J012J160M81l42q73j408j939j897j193
55368I4885n19l05k86k46l13m50m60m80p22q41l52M30P47M68L8l30o49o45j90
$$ plain form
55349 89780 89985 90115 90136 90431 90872 90838 90381 90324 90869 91210 90928 90661 90835 90872 90380 90046 90511 91303 91768 92165
55329 92165 92943 93694 93822 93557 93451 93421 93127 92656 92128 91248 90061 89445 90028 91218 92138 92852 93825 94821 95347
55310 95347 95642 96215 96799 96659 95647 94215 92776 91750 91735 92787 93951 94306 94045 93804 93453 92494 91188
55293 91188 90307 90039 90002 90070 90364 90660 90665 90653 91140 92088 93082 94013 94927 95511 95420 94892 94436 94193 94126 94410 95106
55272 95106 95898 96789 98410 100849 102781 102785 101170 99499 98627 98184 97775 97578 97707 97897 97974 98067 98308 98841 99934
55253 99934 101541 102932 103363 102948 102368 102013 101931 102218 102770 102962 102330 101306 100584 100080 99243 98066 96939 95782
55235 95782 94256 92693 91892 91995 92398 92791 93486 94627 95807 96653 97240 97732 98125 98451 98903 99592 100433 101161
55217 101161 101374 100849 100077 100044 101093 102433 103208 103575 104169 104961 105393 105274 104885 104364 103641 102776 101865 100848
$$ packed form
55349H9780K05J30K1K95M41l4m57n7N45L41k82k67J74L7m92l34M65P92M65L97
55329I2165P78P51J28k65j06l0k94m71n28q80j187o16N83J190R20P14R73R96N26
55310I5347K95N73N84j40j012j432j439j026j5J052J164L55k61k41l51r59j306
55293I1188q81k68l7O8K94K96Nj2M87R48R94R31R14N84r1n28m56k43o7K84O96
55272I5106P92Q91J621K439J932Mj615j671q72m43m09j97J29J90P7R3K41N33J093
55253I9934J607J391M31m15n80l55q2K87N52J92o32j024p22n04q37j177j127j157
55235I5782j526j563q01J03M03L93O95J141J180Q46N87M92L93L26M52O89Q41P28
55217A01161K13n25p72l3J049J340P75L67N94P92M32j19l89n21p23q65r11j017
$$ plain form
55199 100848 99866 99413 99664 100081 100259 100616 101641 102937 103783 104130 104262 103973 102978 101811 101362 101762 102451 103034
55181 103034 103324 102958 101815 100474 99485 98658 97853 97783 98938 100365 100862 100924 101976 103948 105224 105055 104474
55164 104474 104534 105017 105330 105479 105638 105730 105882 106471 107393 108136 108719 109679 110922 111642 111648 111794 112683 113867 114675
55145 114675 114945 114551 113189 111143 109424 108564 108005 107122 106117 105473 105210 105196 105432 105587 105000 103732 102897
55128 102897 103332 104461 105088 104769 103794 102431 100942 99970 100088 101076 102160 102873 103262 103440 103408 103266 103225 103360
55110 103360 103550 103679 103834 104357 105596 107399 109009 109843 110268 111142 112633 114003 114669 114827 114918 114975 114856 114667
55092 114667 114678 115010 115598 116225 116536 116283 115610 114844 114130 113520 113267 113499 113824 113809 113768 114417 115823 117314 118404
55073 118404 119057 119100 118251 116825 115571 114525 112891 110386 107918 106482 106092 106250 106808 107746 108669 109146 109226
$$ packed form
55199A00848r82m53K51M17J78L57J025J296Q46L47J32k89r95j167m49M00O89N83
55181A03034K90l66j143j341r89q27q05p0J155J427M97O2J052J972J276j69n81
55164A04474O0M83L13J49J59R2J52N89R22P43N83R60J243P20OJ46Q89J184Q08
55145A14675K70l94j362k046j719q60n59q83j005o44k63j4K36J55n87j268q35
55128A02897M35J129O27l19r75j363j489r72J18R88J084P13L89J78l2j42m1J35
55110A03360J90J29J55N23J239J803J610Q34M25Q74J491J370O66J58R1N7j19j89
55092A14667J1L32N88O27L11k53o73p66p14o10k53K32L25j5m1O49J406J491J090
55073A18404O53M3q49j426j254j046j634k505k468j436l90J58N58R38R23M77Q0
$$ plain form
55056 109226 109170 109025 108910 109317 110596 112349 113735 114246 113857 112708 111019 109237 107966 107633 108208 109105 109507
55039 109507 109096 108386 108006 107866 107559 107387 108179 109972 111654 112216 111774 111034 110371 109828 109491 109403 109418 109460 109624
55020 109624 109804 109628 108983 108269 107893 107892 108136 108518 108781 108630 108147 107650 107119 106345 105690 105979 107379 109097 110466
55001 110466 111619 112729 113379 113256 112888 113032 113738 114549 115247 115903 116534 117146 117804 118381 118666 119000 120206 122413
54983 122413 124481 125162 124393 122945 121348 119883 119139 119659 121135 122624 123551 123963 123923 123310 122258 121279 120772
54966 120772 120779 121250 122232 123649 125103 125993 125925 125149 124642 125400 127421 129566 130601 130259 129266 128675 129211 130793
54948 130793 132413 132854 131822 130153 128835 128219 128294 129060 130238 131145 131380 131324 131517 131936 132302 132747 133651 135101
54930 135101 136952 139204 141896 144933 148469 153140 159378 166693 174152 181398 188717 196284 203902 211388
$$ packed form
55056A09226n6j45j15M07J279J753J386N11l89j149j689j782j271l33N75Q97M02
55039A09507m11p10l80j40l07j72P92J793J682N62m42p40o63n43l37q8J5M2J64
55020A09624J80j76o45p14l76jK44L82K63j51m83m97n31p74o55K89J400J718J369
55001A10466J153J110O50j23l68J44P06Q11O98O56O31O12O58N77K85L34J206K207
54983A22413K068O81p69j448j597j465p44N20J476J489R27M12m0o13j052r79n07
54966A20772PM71R82J417J454Q90o8p76n07P58K021K145J035l42r93n91N36J582
54948A30793J620M41j032j669j318o16P5P66J178R07K35n6J93M19L66M45R04J450
54930A35101J851K252K692L037L536M671O238P315P459P246P319P567P618P486
$$ plain form
54916 211388 218613 225088 229888 232109 231214 227117 220344 212075 203637 195801 188754 182575 177411 173112
54902 173112 169049 164530 159447 154485 150608 148163 146530 144843 142971 141450 140577 140112 139938 140387 141596
54887 141596 143146 144772 146957 150318 154687 159308 163681 167849 172145 177075 183172 190526 198598 206770
54873 206770 214752 222047 227479 229889 229188 226242 221853 216305 209764 202570 195122 187801 180921 174491
54859 174491 168208 161989 156313 151662 147884 144531 141598 139420 138004 136949 135969 135030 134040 132805 131277
54844 131277 129502 127457 125214 123115 121359 119657 117775 116218 115822 116677 117959 118795 118892 118444 117979 118227
54828 118227 119531 121284 122440 122639 122316 121799 120986 120098 119898 120672 121514 121252 119798 118087 116903 116289 116051
54811 116051 116270 117133 118589 120346 122047 123309 123786 123412 122526 121633 121037 120856 121245 122329 123815 124952
$$ packed form
54916B11388P225O475M800K221q95m097o773q269q438p836p047o179n164m299
54902A73112m063m519n083m962l877k445j633j687j872j521q73m65j74M49J209
54887A41596J550J626K185L361M369M621M373M168M296M930O097P354Q072Q172
54873B06770P982P295N432K410p01k946m389n548o541p194p448p321o880o430
54859A74491o283o219n676m651l778l353k933k178j416j055r80r39r90j235j528
54844A31277j775k045k243k099j756j702j882j557l96Q55J282Q36R7m48m65K48
54828A18227J304J753J156J99l23n17q13q88k00P74Q42k62j454j711j184o14k38
54811A16051K19Q63J456J757J701J262M77l74q86q93n96j81L89J084J486J137
$$ plain form
54795 124952 125218 124910 124813 125331 126175 126895 127347 127601 127666 127543 127392 127475 127936 128678 129428 130039 130813 132308 134632
54776 134632 137198 139491 141866 145086 149267 153904 158885 164778 172021 180462 189823 199921 210170 219586
54762 219586 227695 234846 241192 245924 247974 247029 243401 237464 229831 221588 213637 205986 198214 190402
54748 190402 183090 176556 170666 165271 160328 155881 152336 150398 150187 150741 151011 151072 151699 152975 154160 154920
54732 154920 155836 157471 159602 161740 163963 166844 170765 175631 181199 187431 194407 201909 209299 216000
54718 216000 221989 227394 231661 233659 232843 229858 225695 220698 214701 207653 199705 191172 182882 175973
54704 175973 170719 166013 160747 155388 151360 149143 147802 146372 144837 143658 143002 142700 142470 142046 141401
54689 141401 140825 140395 139491 137386 134358 131690 130425 130477 130985 131155 130726 129927 129137 128440 127591 126569 125894
$$ packed form
54795A24952K66l08r7N18Q44P20M52K54O5j23j51Q3M61P42P50O11P74J495K324
54776A34632K566K293K375L220M181M637M981N893P243Q441R361J0098J0249R416
54762B19586Q109P151O346M732K050r45l628n937p633q243p951p651p772p812
54748A90402p312o534n890n395m943m447l545j938k11N54K70O1O27J276J185P60
54732A54920R16J635K131K138K223K881L921M866N568O232O976P502P390O701
54718B16000N989N405M267J998q16k985m163m997n997p048p948q533q290o909
54704A75973n254m706n266n359m028k217j341j430j535j179o56l02k30m24o45
54689A41401n76m30r04k105l028k668j265N2N08J70m29p99p90o97q49j022o75
$$ plain form
54672 125894 126074 126950 127859 128200 127602 126004 124042 122872 122982 123518 123456 123050 123322 124375 125149 124856 123828
54655 123828 122903 122697 123463 124929 126222 126644 126545 126758 127248 127236 126684 126641 127754 129343 130408 130726 130469 129520
54637 129520 127896 126350 125782 126278 127205 128074 128835 129539 130178 130817 131528 132127 132220 131604 130634 130053 130283 130781
54619 130781 130353 128380 125498 122837 120999 120153 120610 122468 124951 126980 128333 129479 130373 130485 130127 130571
54603 130571 132313 134204 134926 134603 134236 134206 134144 133845 133460 132924 131938 130498 128990 127777 127053 127014 127762 129023
54585 129023 130209 130793 130540 129553 128256 127178 126533 126113 125670 125275 125224 125722 126670 127600 127934 127652 127558 128450
54567 128450 130041 131233 131480 131243 130977 130485 129670 129169 129560 130390 130766 130660 130933 132127 133871 135474 136576
54550 136576 137049 136781 135847 134656 133637 132870 132208 131678 131595 132193 133294 134461 135444 136286 137005 137473 137735 138153
$$ packed form
54672A25894J80Q76R09L41n98j598j962j170J10N36o2m06K72J053P74k93j028
54655A23828r25k06P66J466J293M22r9K13M90j2n52m3J113J589J065L18k57r49
54637A29520j624j546n68M96R27Q69P61P04O39O39P11N99R3o16r70n81K30M98
54619A30781m28j973k882k661j838q46M57J858K483K029J353J146Q94J12l58M44
54603A30571J742J891P22l23l67l0o2k99l85n36r86j440j508j213p24l9P48J261
54585A29023J186N84k53r87j297j078o45m20m43l95n1M98R48R30L34k82r4Q92
54567A28450J591J192K47k37k66m92q15n01L91Q30L76j06K73J194J744J603J102
54550A36576M73k68r34j191j019p67o62n30q3N98J101J167R83Q42P19M68K62M18
$$ plain form
54532 138153 138959 139877 140512 140925 141484 142255 142901 143044 142399 140748 138320 136145 135385 136160 137399 137925 137388
54515 137388 136245 135254 134983 135292 135255 134091 132184 130703 130213 130270 130417 130809 131617 132499 133098 133535 134008 134365
54497 134365 134471 134617 135169 136083 137078 137929 138374 138068 137016 135795 135069 135078 135696 136612 137258 137052 136037 134950
54479 134950 134367 134101 133722 133249 133006 133152 133782 135169 137464 140212 142552 143842 144069 143819 143944 144920 146324
54462 146324 147186 146999 146157 145361 145001 145167 145719 146117 145681 144363 142842 141621 140498 139204 137985 137098 136280
54445 136280 135279 134542 134679 135493 136126 136140 135941 136113 136712 137261 137252 136666 136098 136164 136739 137069 136779 136352 136327 136478
54425 136478 136221 135507 134774 134187 133478 132574 131981 132365 133896 136065 138080 139515 140557 141564 142484 142948 142833
54408 142833 142366 141767 141194 141019 141555 142466 143040 143189 143537 144396 145331 146059 146984 148331 149462 149759 149662 150125
$$ packed form
54532A38153Q06R18O35M13N59P71O46J43o45j651k428k175p60P75J239N26n37
54515A37388j143r91k71L09l7j164j907j481m90N7J47L92Q08Q82N99M37M73L57
54497A34365J06J46N52R14R95Q51M45l06j052j221p26RO18R16O46k06j015j087
54479A34950n83k66l79m73k43J46O30J387K295K748K340J290K27k50J25R76J404
54462A46324Q62j87q42p96l60J66N52L98m36j318j521j221j123j294j219q87q18
54445A36280j001p37J37Q14O33J4j99J72N99N49rn86n68O6N75L30k90m27k5J51
54425A36478k57p14p33n87p09r04n93L84J531K169K015J435J042J007R20M64j15
54408A42833m67n99n73j75N36R11N74J49L48Q59R35P28R25J347J131K97r7M63
$$ plain form
54390 150125 151351 152790 154092 155380 156636 157437 157378 156433 154929 153365 152097 151027 149819 148545 147703
54375 147703 147449 147383 147418 148228 150219 152597 154099 154350 153896 153204 152305 151207 150030 148810 147632 146862 146797
54358 146797 147262 147882 148510 149035 149186 149006 149131 149981 150969 151187 150608 149952 149542 149063 148346 147672 147247 146956 146724
54339 146724 146594 146436 146086 145801 146060 146815 147375 147215 146565 146114 146308 146983 147511 147387 146797 146441 146686 147247 147898
54320 147898 149017 150934 153138 154741 155509 155964 156632 157775 159613 162176 164927 167060 168280 168963 169630
54305 169630 170495 171346 171540 170400 167983 165198 162756 160391 157559 154527 152107 150631 149857 149652 150032 150655
54289 150655 150955 150762 150234 149332 147946 146437 145381 144877 144692 144946 145956 147412 148402 148378 147610 146720 146200
54272 146200 146277 146721 146928 146688 146647 147374 148346 148696 148757 149773 151994 154049 154556 153631 152467 152014 152389 153108
$$ packed form
54390A50125J226J439J302J288J256Q01n9r45j504j564j268j070j208j274q42
54375A47703k54o6L5Q10J991K378J502K51m54o92q99j098j177j220j178p70o5
54358A46797M65O20O28N25J51j80J25Q50R88K18n79o56m10m79p17o74m25k91k32
54339A46724j30j58l50k85K59P55N60j60o50m51J94O75N28j24n90l56K45N61O51
54320A47898J119J917K204J603P68M55O68J143J838K563K751K133J220O83O67
54305A69630Q65Q51J94j140k417k785k442k365k832l032k420j476p74k05L80O23
54289A50655L00j93n28r02j386j509j056n04j85K54J010J456R90k4p68q90n20
54272A46200P7M44K07k40m1P27R72L50O1J016K221K055N07r25j164m53L75P19
$$ plain form
54254 153108 153620 153848 154224 154921 155322 154802 153782 153287 153641 154297 154823 155176 155135 154426 153488 153168 153486 153594 153069
54235 153069 152299 151448 150082 148243 146911 146834 147635 148523 149176 149515 149329 148678 148037 147648 147280 146982 147328 148502
54217 148502 149895 151035 152161 153280 153557 152380 150430 148818 147656 146276 144484 142802 141717 141408 141999
54202 141999 143434 145154 146463 147185 147612 148001 148423 148876 149174 148959 148147 147146 146393 146005 146048 146688 147726
54185 147726 148466 148499 148151 147820 147448 147127 147533 148967 150495 150962 150517 150239 150517 150793 150872 151312 152207 152579 151606
54166 151606 149819 148434 147835 147347 146397 145301 144808 145245 146375 147843 149427 150837 151655 151711 151385 151269 151590
54149 151590 152192 152908 153625 154039 153783 152932 152093 151858 152331 153150 153717 153519 152597 151642 151196 150882 149914 148291
54131 148291 146850 146094 145777 145761 146436 147806 148932 148915 148006 147236 147338 148443 150231 151864 152251 151173 149884
$$ packed form
54254A53108N12K28L76O97M01n20j020m95L54O56N26L53m1p09r38l20L18J08n25
54235A53069p70q51j366j839j332p7Q01Q88O53L39j86o51o41l89l68k98L46J174
54217A48502J393J140J126J119K77j177j950j612j162j380j792j682j085l09N91
54202A41999J435J720J309P22M27L89M22M53K98k15q12j001p53l88M3O40J038
54185A47726P40L3l48l31l72l21M06J434J528M67m45k78K78K76P9M40Q95L72r73
54166A51606j787j385n99m88r50j096m93M37J130J468J584J410Q18N6l26j16L21
54149A51590O02P16P17M14k56q51q39k35M73Q19N67j98r22r55m46l14r68j623
54131A48291j441p56l17j6O75J370J126j7r09p70J02J105J788J633L87j078j289
$$ plain form
54114 149884 149901 151367 153111 154140 154470 154601 154744 154709 154214 153313 152607 152841 154058 155457 156406 157212 158472
54097 158472 159964 160735 160227 158874 157613 157130 157442 157957 158039 157712 157614 158080 158657 158842 158893 159448 160612 161909
54079 161909 162887 163327 163068 162177 161182 160785 161360 162953 165409 168141 170087 170482 169553 168117 166758 165814 165756
54062 165756 166879 168752 170567 171953 172949 173391 172962 171813 170491 169227 167882 166650 166214 166991 168624
54047 168624 170410 171899 172985 173748 174357 174974 175753 176992 179033 181783 184638 187239 189991 193361 197066
54032 197066 200577 204157 208568 213872 219366 224686 230096 235545 240307 243965 247034 250166 253330 256266
54018 256266 259172 262328 265421 267820 269404 270573 271554 272158 272232 271948 271515 270876 269818 268294 266515 264674
54002 264674 262639 260021 256655 252927 249488 246716 244641 243267 242637 242531 242419 241931 241335 241466 243178 246757
$$ packed form
54114A49884J7J466J744J029L30J31J43l5m95r01p06K34J217J399R49Q06J260
54097A58472J492P71n08j353j261m83L12N15Q2l27r8M66N77J85N1N55J164J297
54079A61909R78M40k59q91r95l97N75J593K456K732J946L95r29j436j359r44n8
54062A65756J123J873J815J386R96M42m29j149j322j264j345j232m36P77J633
54047A68624J786J489J086P63O09O17P79J239K041K750K855K601K752L370L705
54032A97066L511L580M411N304N494N320N410N449M762L658L069L132L164K936
54018B56266K906L156L093K399J584J169R81O04P4k84m33o39j058j524j779j841
54002B64674k035k618l366l728l439k772k075j374o30j06j12m88n96J31J712L579
$$ plain form
53986 246757 251736 257355 263301 269834 276975 283783 288785 291022 290372 287006 281098 273142 264070 254779
53972 254779 245844 237803 231285 226442 222531 218554 214346 210762 208617 207654 206761 205197 203378 202365 202752
53957 202752 204273 206333 208502 210492 212170 213897 216413 219936 223613 226332 227912 229083 230440 231928
53943 231928 233299 234581 236002 237850 240454 243922 247819 251514 254864 258226 261756 265189 268427 271838
53929 271838 275650 279366 282130 283521 283817 283698 283851 284604 285690 286505 286849 287270 288526 290898 294186 298137
53913 298137 302534 306972 310976 314549 318387 323321 329552 336463 343185 349241 354628 359438 363595 366988
53899 366988 369664 371740 373251 374211 374725 374865 374464 373291 371504 369730 368523 367723 366486 364021 360240
53884 360240 355625 350504 344731 338169 331187 324402 318097 312264 307002 302371 297902 292921 287511 282588
$$ packed form
53986B46757M979N619N946O533P141O808N002K237o50l366n908p956r072r291
53972B54779q935q041o518m843l911l977m208l584k145r63q93j564j819j013L87
53957B02752J521K060K169J990J678J727K516L523L677K719J580J171J357J488
53943B31928J371J282J421J848K604L468L897L695L350L362L530L433L238L411
53929B71838L812L716K764J391K96j19J53P53J086Q15L44M21J256K372L288L951
53913B98137M397M438M004L573L838M934O231O911O722O056N387M810M157L393
53899C66988K676K076J511R60N14J40m01j173j787j774j207q00j237k465l781
53884C60240m615n121n773o562o982o785o305n833n262m631m469m981n410m923
$$ plain form
53870 282588 278771 275747 273084 271043 269982 269396 268260 266190 263659 261174 258787 256397 254051 251827
53856 251827 249699 247524 245004 241871 238401 235453 233654 232784 232331 232298 232907 233798 234267 234153 233847 233501 232891
53839 232891 232052 231322 230649 229551 227980 226654 226230 226570 227046 227231 227173 227368 228490 230721 233324 235423 237240
53822 237240 239967 244307 249868 256188 263588 272544 282939 294595 308028 323751 340867 356882 368957
53809 368957 375174 374949 368899 358502 345574 331801 318556 306763 296656 287909 280307 274197 270063
53796 270063 267841 266960 266945 267719 269340 271701 274549 277667 280999 284595 288365 291921 294868 297307 299846
53781 299846 302973 306540 309939 312598 314194 314543 313521 311122 307570 303340 298948 294555 289915 284942
53767 284942 280136 276029 272277 267870 262369 256434 250917 245929 241205 236922 233533 230949 228510 225894
$$ packed form
53870B82588l817l024k663k041j061n86j136k070k531k485k387k390k346k224
53856B51827k128k175k520l133l470k948j799q70m53l3O09Q91M69j14l06l46o10
53839B32891q39p30o73j098j571j326m24L40M76J85n8J95J122K231K603K099J817
53822B37240K727M340N561O320P400Q956J0395J1656J3433J5723J7116J6015J2075
53809C68957O217k25o050j0397j2928j3773j3245j1793j0107q747p602o110m134
53796B70063k222q81j5P74J621K361K848L118L332L596L770L556K947K439K539
53781B99846L127L567L399K659J596L49j022k399l552m230m392m393m640m973
53767B84942m806m107l752m407n501n935n517m988m724m283l389k584k439k616
$$ plain form
53753 225894 223634 222443 222202 221929 220793 219001 217447 216522 215589 213912 211800 210364 210132 210417 210247 209529
53737 209529 209029 209452 210814 212531 213905 214606 214856 215064 215251 215038 214248 213219 212382 211857 211684 212068 213030
53720 213030 214094 214845 215659 217331 219870 222155 222988 222209 220537 218721 217199 216366 216489 217209 217658 217428
53704 217428 217175 217833 219459 221315 222995 224852 227276 230127 233163 236397 239616 242086 243322 243841 244550
53689 244550 245578 246309 246413 246184 245846 245171 243955 242440 241067 240177 240008 240655 241823 242855 243144 242421 240762
53672 240762 238593 236571 235142 234268 233840 234087 235180 236640 237670 237936 237523 236325 234194 231606 229441
53657 229441 227996 226855 225787 225078 224844 224771 224768 225163 225931 226393 226092 225421 225037 225090 225351 225599 225569 225053 224386
53638 224386 224331 225107 226031 226476 226696 227260 228184 229077 229804 230583 231732 233577 236103 238443 239349 238651 237721 237962
$$ packed form
53753B25894k260j191k41k73j136j792j554r25r33j677k112j436k32K85j70p18
53737B09529n00M23J362J717J374P01K50K08J87k13p90j029q37n25j73L84R62
53720B13030J064P51Q14J672K539K285Q33p79j672j816j522q33J23P20M49k30
53704B17428k53O58J626J856J680J857K424K851L036L234L219K470J236N19P09
53689B44550J028P31J04k29l38o75j216j515j373q90j69O47J168J032K89p23j659
53672B40762k169k022j429q74m28K47J093J460J030K66m13j198k131k588k165
53657B29441j445j141j068p09k34p3lL95P68M62l01o71l84N3K61K48l0n16o67
53638B24386n5P76R24M45K20N64R24Q93P27P79J149J845K526K340R06o98r30K41
$$ plain form
53620 237962 239404 241352 243787 247239 251580 255857 259329 262050 264427 266697 268878 270870 272568 274052
53606 274052 275553 277128 278726 280668 283454 286740 289178 289869 289498 289365 289771 290120 290195 290389 290916 291680 292876
53589 292876 294796 296953 298215 298052 296991 295735 294467 293266 292524 292485 292746 292631 291894 290845 289929 289344
53573 289344 288948 288386 287361 285805 283835 281717 279949 279058 279025 279114 278594 277465 276281 275461 275081 275015 274893
53556 274893 274201 272876 271651 271351 272026 273180 274596 276393 278402 280158 281536 282906 284586 286534 288609
53541 288609 290757 292915 295106 297621 300812 304673 308888 313228 317701 322522 328178 335195 343430 351920
53527 351920 359967 368053 377102 387067 396999 406389 415657 425266 435070 444692 453949 462734 471083 479534
53513 479534 488964 499866 512114 525502 540080 555955 573244 592212 612924 634674 656252 676800
$$ packed form
53620B37962J442J948K435L452M341M277L472K721K377K270K181J992J698J484
53606B74052J501J575J598J942K786L286K438O91l71j33M06L49P5J94N27P64J196
53589B92876J920K157J262j63j061j256j268j201p42l9K61j15p37j049r16n85
53573B89344l96n62j025j556j970k118j768q91l3Q9n20j129j184q20l80o6j22
53556B74893o92j325j225l00O75J154J416J797K009J756J378J370J680J948K075
53541B88609K148K158K191K515L191L861M215M340M473M821N656P017Q235Q490
53527C51920Q047Q086R049R965R932R390R268R609R804R622R257Q785Q349Q451
53513D79534R430J0902J2248J3388J4578J5875J7289J8968K0712K1750K1578K0548
$$ plain form
53501 676800 696042 713812 730101 745624 761549 778352 795486 812307 828732 844839 860514
53490 860514 875831 891155 906578 921780 936729 951844 967099 981648 994827 1006987 1018767
53479 1018767 1030142 1040801 1050984 1061158 1071104 1080110 1087963 1095047 1101450 1106595 1109919 1111429 1111392
53466 1111392 1109843 1106655 1101843 1095543 1087743 1078263 1067124 1054831 1042147 1029486 1016670 1003374
53454 1003374 989567 975238 959913 942961 924509 905673 887709 871174 855883 841253 826530
53443 826530 811164 795343 779993 766022 753704 742837 733159 724408 716289 708680 701742 695691 690673
53430 690673 686940 684869 684554 685551 687244 689337 691961 695524 700495 707074 714947 723611 733015 743605
53416 743605 755748 769408 784430 800708 818026 836198 855488 876375 898720 921700 944863
$$ packed form
53501F76800J9242J7770J6289J5523J5925J6803J7134J6821J6425J6107J5675
53490H60514J5317J5324J5423J5202J4949J5115J5255J4549J3179J2160J1780
53479A018767J1375J0659J0183J0174R946R006P853P084O403N145L324J510l7
53466A111392j549l188m812o300p800r480j1139j2293j2684j2661j2816j3296
53454A003374j3807j4329j5325j6952j8452j8836j7964j6535j5291j4630j4723
53443H26530j5366j5821j5350j3971j2318j0867r678q751q119p609o938o051n018
53430F90673l733k071l15R97J693K093K624L563M971O579P873Q664R404J0590
53416G43605J2143J3660J5022J6278J7318J8172J9290K0887K2345K2980K3163
$$ plain form
53405 944863 968725 994027 1020902 1049231 1079243 1111164 1144607 1178893 1213812 1249630 1286645
53394 1286645 1325168 1365629 1408064 1451618 1495126 1538090 1580730 1623278 1665747 1708147 1750223
53383 1750223 1791052 1829578 1865660 1900027 1933035 1963997 1991951 2016602 2038299 2057411 2073995
53372 2073995 2087751 2098111 2104604 2107251 2106397 2102083 2093953 2081872 2066195 2047063 2023836 1995641
53360 1995641 1962429 1925184 1885155 1843170 1799646 1754954 1709660 1664478 1619996 1576350 1533261
53349 1533261 1490530 1448532 1408035 1369500 1332618 1296550 1260579 1224576 1188979 1154315 1120629
53338 1120629 1087378 1054074 1021041 989324 959716 932089 905876 881021 858096 837553 819242
53327 819242 802720 787638 773709 760639 748383 737222 727331 718527 710632 703777 698030 693004 688345
$$ packed form
53405I44863K3862K5302K6875K8329L0012L1921L3443L4286L4919L5818L7015
53394A286645L8523M0461M2435M3554M3508M2964M2640M2548M2469M2400M2076
53383A750223M0829L8526L6082L4367L3008L0962K7954K4651K1697J9112J6584
53372B073995J3756J0360O493K647q54m314q130j2081j5677j9132k3227k8195
53360A995641l3212l7245m0029m1985m3524m4692m5294m5182m4482m3646m3089
53349A533261m2731m1998m0497l8535l6882l6068l5971l6003l5597l4664l3686
53338A120629l3251l3304l3033l1717k9608k7627k6213k4855k2925k0543j8311
53327H19242j6522j5082j3929j3070j2256j1161r891q804p895o855n747n026m659
$$ plain form
53314 688345 684435 682081 681561 682453 684443 687789 692872 699656 707744 716577 725567 734499 744026 755277
53300 755277 768683 783501 798761 814379 830999 848997 868007 887313 906472 925615 945347
53289 945347 966196 988037 1010155 1031956 1053436 1074800 1095785 1115526 1133004 1147638 1159673
53278 1159673 1169968 1179131 1186830 1192322 1195615 1197500 1198251 1196969 1192712 1185766 1177257 1167869 1157600 1146446
53264 1146446 1134517 1121501 1106758 1090161 1072288 1053606 1033917 1012874 990668 967841 944719
53253 944719 921349 897875 874644 851918 829659 807661 785769 763954 742263 720800 699742
53242 699742 679242 659269 639602 620072 600741 581701 562818 543929 525239 507287 490432
53231 490432 474673 460023 446761 435094 424841 415676 407453 400048 392984 385530 377316 368786 361009
$$ packed form
53314F88345l910k354n20Q92J990L346N083O784Q088Q833Q990Q932R527J1251
53300G55277J3406J4818J5260J5618J6620J7998J9010J9306J9159J9143J9732
53289I45347K0849K1841K2118K1801K1480K1364K0985J9741J7478J4634J2035
53278A159673J0295R163P699N492L293J885P51j282m257o946q509r388j0269j1154
53264A146446j1929j3016j4743j6597j7873j8682j9689k1043k2206k2827k3122
53253I44719k3370k3474k3231k2726k2259k1998k1892k1815k1691k1463k1058
53242F99742k0500j9973j9667j9530j9331j9040j8883j8889j8690j7952j6855
53231D90432j5759j4650j3262j1667j0253r165q223p405p064p454q214q530p777
$$ plain form
53218 361009 354838 350040 345381 339865 333771 328046 322815 317275 311234 305860 302285 300066 297762 294688
53204 294688 291279 287996 284781 281669 279103 277297 275818 274098 272033 269857 267714 265567 263331 260975
53190 260975 258722 257135 256665 256999 257186 256539 255135 253384 251508 249668 248164 247092 246033 244570 243039
53175 243039 242352 242939 244132 244760 244223 242873 241497 240630 240352 240472 240705 240748 240423 239845 239307 238887 238269 237109
53157 237109 235540 234180 233585 233760 234225 234506 234525 234458 234342 233993 233365 232756 232444 232266 231784 230815 229520 228052
53139 228052 226462 224936 223724 222776 221820 220891 220406 220536 220906 221075 220913 220290 218891 216783 214783 213784 213870
53122 213870 214468 215141 215833 216555 217252 217907 218416 218513 218093 217462 216970 216651 216562 217127 218610 220460 221740 222093
53104 222093 221820 221200 220358 219633 219344 219119 218175 216443 214790 213855 213271 212374 211235 210510 210531 210921 211045 210650
$$ packed form
53218C61009o171m798m659n516o094n725n231n540o041n374l575k219k304l074
53204B94688l409l283l215l112k566j806j479j720k065k176k143k147k236k356
53190B60975k253j587m70L34J87o47j404j751j876j840j504j072j059j463j531
53175B43039o87N87J193O28n37j350j376q67k78J20K33M3l25n78n38m20o18j160
53157B37109j569j360n95J75M65K81J9o7j16l49o28o09l12j78m82r69j295j468
53139B28052j590j526j212r48r56r29m85J30L70J69j62o23j399k108k000r99Q6
53122B13870N98O73O92P22O97O55N09R7m20o31m92l19q9N65J483J850J280L53
53104B22093k73o20q42p25k89k25r44j732j653r35n84q97j139p25K1L90J24l95
$$ plain form
53086 210650 210082 209908 210183 210232 209374 207740 206022 204564 203219 201972 201045 200306 199223 197656 196109 194944
53070 194944 193916 192806 191938 191625 191632 191652 191866 192470 193048 193034 192548 192192 192258 192725 193802 195663 197685 198719
53052 198719 198359 197417 196901 197017 197404 197873 198407 198743 198481 197656 196904 196892 197728 198964 200097 200939 201489 201563 200817
53033 200817 199191 197103 195037 193099 191201 189551 188605 188546 189078 189723 190069 189797 188901 187939 187639 187987 188083
53016 188083 187218 185817 184922 184979 185599 186401 187442 188729 189846 190407 190452 190076 189004 187073 184942 183729 183790
52999 183790 184291 184228 183603 183298 183904 184965 185461 184896 183795 183081 183065 183253 183182 183138 183721 184880 185855 186137 186098
52980 186098 186451 187412 188633 189736 190531 190894 190768 190362 190084 190218 190764 191618 192757 194146 195542 196476 196536
52963 196536 195752 194653 193848 193539 193499 193459 193353 193251 193250 193370 193386 192878 191777 190771 190692 191483 192212 192148 191334 190024
$$ packed form
53086B10650n68j74K75M9q58j634j718j458j345j247r27p39j083j567j547j165
53070A94944j028j110q68l13PK0K14O04N78j4m86l56O6M67J077J861K022J034
53052A98719l60r42n16J16L87M69N34L36k62q25p52j2Q36J236J133Q42N50P4p46
53033B00817j626k088k066j938j898j650r46n9N32O45L46k72q96r62l00L48R6
53016A88083q65j401q95N7O20Q02J041J287J117N61M5l76j072j931k131j213O1
52999A83790N01o3o25l05O06J061M96n65j101p14j6J88p1m4N83J159R75K82l9
52980A86098L53R61J221J103P95L63j26m06k78J34N46Q54J139J389J396R34O0
52963A96536p84j099q05l09m0m0j06j02jJ20J6n08j101j006p9P91P29o4q14j310
$$ plain form
52943 190024 188305 186559 185547 185428 185242 184080 182397 181452 181747 182660 183387 183473 182575 180601 178159 176166
52927 176166 174879 173880 173041 172797 173297 174021 174524 174937 175420 175664 175386 174879 174703 175097 176027 177385 178828 179740
52909 179740 179809 179440 179314 179697 180354 180883 180919 180321 179436 178884 178846 178790 178172 177096 176008 175084 174344 174109 174880
52890 174880 176778 179390 182049 184081 185050 185164 185237 185833 186541 186464 185305 183585 181935 180700 180181 180640 181808
52873 181808 182878 183329 183463 183791 184192 184181 183901 184288 186010 188631 191135 193099 194906 196880 198701 199929
52857 199929 200722 201715 203333 205561 208183 210795 212656 213010 211724 209345 206547 203833 201732 200649 200262
52842 200262 199538 197784 195406 193292 191737 190388 188994 187658 186425 185133 183801 182819 182569 183058 184020
52827 184020 185149 186134 186668 186682 186485 186481 186693 186703 186146 185220 184492 184185 183878 183156 182384 182432 183590 185111 186045
$$ packed form
52943A90024j719j746j012j19j86j162j683r45K95R13P27Q6q98j974k442j993
52927A76166j287r99q39k44N00P24N03M13M83K44k78n07j76L94R30J358J443R12
52909A79740O9l69j26L83O57N29L6n98q85n52l8n6o18j076j088r24p40k35P71
52890A74880J898K612K659K032R69J14P3N96P08p7j159j720j650j235n19M59J168
52873A81808J070M51J34L28M01j1k80L87J722K621K504J964J807J974J821J228
52857A99929P93R93J618K228K622K612J861L54j286k379k798k714k101j083l87
52842B00262p24j754k378k114j555j349j394j336j233j292j332r82k50M89R62
52827A84020J129R85N34J4j97mK12J0n57r26p28l07l07p22p72M8J158J521R34
$$ plain form
52808 186045 186304 186698 188056 190532 193623 196536 198509 199033 198021 195861 193264 190890 188995 187437 186068
52793 186068 184942 183987 182708 180660 178244 176584 176427 177414 178549 179077 178797 177911 176890 176200 175840 175284
52777 175284 174122 172587 171218 170290 169843 170038 171024 172524 173980 175108 176038 176936 177820 178772 179966 181342
52761 181342 182519 183177 183358 183298 183174 183108 183235 183514 183583 183068 182150 181644 182263 183789 185179 185669 185600 185896 186807
52742 186807 187592 187581 187188 187502 189042 191288 193385 194936 195961 196419 196168 195374 194598 194256 194146 193776 193145
52725 193145 192875 193474 194757 196156 197266 197821 197489 196232 194676 193507 192512 190838 188374 186248 185631 186474
52709 186474 187762 188626 188784 188216 186980 185357 183857 182970 182908 183460 184046 184187 183973 183828 183783 183378 182412 181275
52691 181275 180338 179532 178866 178823 179764 181326 182905 184339 185591 186219 185923 185323 185378 186109 186682 186760 186994 188036
$$ packed form
52808A86045K59L94J358K476L091K913J973N24j012k160k597k374j895j558j369
52793A86068j126r55j279k048k416j660j57R87J135N28k80q86j021o90l60n56
52777A75284j162j535j369r28m47J95R86J500J456J128R30Q98Q84R52J194J376
52761A81342J177O58J81o0j24o6J27K79O9n15r18n06O19J526J390M90o9K96R11
52742A86807P85j1l93L14J540K246K097J551J025M58k51p94p76l42j10l70o31
52725A93145k70N99J283J399J110N55l32j257j556j169r95j674k464k126o17Q43
52709A86474J288Q64J58n68j236j623j500q87o2N52N86J41k14j45m5m05r66j137
52691A81275r37q06o66m3R41J562J579J434J252O28k96o00N5P31N73P8K34J042
$$ plain form
52673 188036 189781 191807 193889 195729 196846 197198 197459 198159 198804 198395 196696 194561 193003 192282 191972 191681
52657 191681 191467 191571 191949 192309 192624 193314 194691 196440 198031 199473 201184 203156 204803 205788 206476 207251
52641 207251 207777 207362 205815 203536 200883 197927 194874 192341 190978 190975 192018 193599 195249 196620 197617 198491
52625 198491 199648 201171 202640 203559 203895 204018 204109 203944 203309 202391 201501 200638 199588 198370 197364 196963 197209
52608 197209 197672 197691 196930 195812 195175 195367 195943 196413 196870 197511 197986 197865 197525 197858 199081 200455 201311 201781
52590 201781 202342 203194 204329 205698 206964 207515 207219 206842 207306 208653 210096 210947 211171 211150 211308 211968 213196
52573 213196 214678 215898 216552 216753 216844 217119 217617 218094 218194 217769 217033 216364 215960 215673 215107 213876 211990 210068
52555 210068 208942 208834 209034 208574 207170 205381 203953 203252 203233 203662 204239 204720 205097 205527 206003 206238 206043 205730
$$ packed form
52673A88036J745K026K082J840J117L52K61P00O45m09j699k135j558p21l10k91
52657A91681k14J04L78L60L15O90J377J749J591J442J711J972J647R85O88P75
52641B07251N26m15j547k279k653k956l053k533j363lJ043J581J650J371R97Q74
52625A98491J157J523J469R19L36J23R1j65o35r18q90q63j050j218j006m01K46
52608A97209M63J9p61j118o37J92N76M70M57O41M75j21l40L33J223J374Q56M70
52590B01781N61Q52J135J369J266N51k96l77M64J347J443Q51K24k1J58O60J228
52573B13196J482J220O54K01R1K75M98M77J00m25p36o69m04k87n66j231j886j922
52555B10068j126j08K00m60j404j789j428p01j9M29N77M81L77M30M76K35j95l13
$$ plain form
52537 205730 205885 206730 207912 209000 209947 210896 211777 212396 212805 213192 213421 213039 211901 210492 209415 208802 208452
52520 208452 208375 208871 210117 211854 213487 214456 214642 214543 214947 216286 218408 220966 223797 226756 229491 231658
52504 231658 233168 234004 234006 233117 231630 229883 227924 225823 224027 222919 222140 220921 219122 217499 216836 217141
52488 217141 217781 218048 217565 216442 215194 214317 213950 214085 214893 216432 218225 219635 220680 221950 223678 225443
52472 225443 226882 228170 229616 231271 233129 235216 237269 238805 239836 241053 243001 245511 248209 251049
52458 251049 253871 255932 256531 255836 254498 252683 250066 246633 242861 239103 235385 231876 228996 226888 225184
52443 225184 223524 222029 221035 220582 220365 220044 219526 219054 219024 219544 220108 220023 219254 218688 219270 220940 222578 223088
52425 223088 222490 221833 221972 222520 222206 220370 217901 216472 216917 218578 220195 221091 221427 221693 222301 223529 225431
$$ packed form
52537B05730J55Q45J182J088R47R49Q81O19M09L87K29l82j138j409j077o13l50
52520B08452p7M96J246J737J633R69J86r9M04J339K122K558K831K959K735K167
52504B31658J510Q36Kq89j487j747j959k101j796j108p79j219j799j623o63L05
52488B17141O40K67m83j123j248q77l67J35Q08J539J793J410J045J270J728J765
52472B25443J439J288J446J655J858K087K053J536J031J217J948K510K698K840
52458B51049K822K061N99o95j338j815k617l433l772l758l718l509k880k108j704
52443B25184j660j495r94m53k17l21n18m72l0N20N64q5p69n66N82J670J638N10
52425B23088n98o57J39N48l14j836k469j429M45J661J617Q96L36K66O08J228J902
$$ plain form
52408 225431 227644 229636 231384 233643 237187 241862 246742 251310 256043 261586 267668 273228 277372 279747
52394 279747 280182 278650 275736 272550 269741 266897 263254 258787 254280 250462 247473 245202 243777 243489 244262
52379 244262 245395 246039 246008 245961 246621 247957 249415 250821 252646 255310 258632 262094 265299 267986 269972 271299
52363 271299 272150 272364 271467 269478 267339 266020 265493 265049 264398 263841 263497 263077 262563 262471 263118 264070 264641 264677
52345 264677 264563 264747 265544 267084 269035 270564 271020 270707 270614 271387 272913 274951 277644 281123 284960 288532
52329 288532 291802 295310 299447 304216 309748 316455 324332 332550 340243 347402 354466 361189 366580 370071
52315 370071 372202 373967 375913 378079 380413 382917 385691 389113 393705 399453 405509 410990 415955 421188
52301 421188 427147 433516 439776 445755 451492 456935 462030 466811 471100 474280 475733 475527 474436 473207
$$ packed form
52408B25431K213J992J748K259L544M675M880M568M733N543O082N560M144K375
52394B79747M35j532k914l186k809k844l643m467m507l818k989k271j425k88P73
52379B44262J133O44l1m7O60J336J458J406J825K664L322L462L205K687J986J327
52363B71299Q51K14q97j989k139j319n27m44o51n57l44m20n14r2O47R52N71L6
52345B64677j14J84P97J540J951J529M56l13r3P73J526K038K693L479L837L572
52329B88532L270L508M137M769N532O707P877Q218P693P159P064O723N391L491
52315C70071K131J765J946K166K334K504K774L422M592N748O056N481M965N233
52301D21188N959O369O260N979N737N443N095M781M289L180J453k06j091j229
$$ plain form
52287 473207 472045 470932 470161 470163 470841 471491 471554 471139 470668 470327 470248 470922 472810 475480 477659 478411 478068 477891
52269 477891 479004 481742 485715 490231 494755 499134 503425 507640 511849 516390 521586 527245 532752 537750
52255 537750 542418 547054 551754 556547 561486 566484 571452 576636 582294 587893 592304 595102 597138 599363
52241 599363 601648 603323 604420 605708 607799 610809 614638 618918 622907 626147 629129 632754 637244 642206
52227 642206 647547 653509 659825 665735 671058 676513 682678 689332 696128 703223 710740 718174 724824 730475
52213 730475 735288 739505 743749 749083 756046 763855 771200 777748 784256 791312 798619 805587 812037 818100
52199 818100 823871 829442 834996 840650 846384 852278 858492 864935 871230 877235 883303 889735 896188 901877
52185 901877 906198 908888 909799 908967 906870 904146 901005 897223 892789 888166 883727 879273 874426 869283 864417
$$ packed form
52287D73207j162j113p71KO78O50O3m15m71l41p9O74J888K670K179P52l43j77
52269D77891J113K738L973M516M524M379M291M215M209M541N196N659N507M998
52255E37750M668M636M700M793M939M998M968N184N658N599M411K798K036K225
52241E99363K285J675J097J288K091L010L829M280L989L240K982L625M490M962
52227F42206N341N962O316N910N323N455O165O654O796P095P517P434O650N651
52213G30475M813M217M244N334O963P809P345O548O508P056P307O968O450O063
52199H18100N771N571N554N654N734N894O214O443O295O005O068O432O453N689
52185I01877M321K690R11q32k097k724l141l782m434m623m439m454m847n143m866
$$ plain form
52170 864417 860348 857227 854829 852616 849985 846847 843953 842316 842206 842892 843328 842960 841963 841025 840878 841786
52154 841786 843365 844972 846213 846965 847173 847000 847015 847791 849311 851183 853376 856231 859677 863006 865650 867718
52138 867718 869529 871045 872036 872408 872056 870798 868762 866565 864750 863403 862660 863227 865927 870883 877506
52123 877506 885105 893231 901707 910713 920602 931227 941642 950840 958589 965152 970490 974252 976311 976758
52109 976758 975581 972910 969520 966366 963584 960578 957246 954558 953641 954723 957256 960744 965127 970482
52095 970482 976509 982333 986862 989546 990684 990722 989483 986459 981684 975755 969058 961675 954232 948087 944161
52080 944161 941963 940304 938701 937637 937606 938450 939702 941166 942888 944777 946499 947835 948999 950503 952724
52065 952724 955706 959305 963278 967190 970520 973144 975508 978074 980698 982843 984293 985391 986634 988273
$$ packed form
52170H64417m069l121k398k213k631l138k894j637j10O86M36l68r97r38j47R08
52154H41786J579J607J241P52K08j73J5P76J520J872K193K855L446L329K644K068
52138H67718J811J516R91L72l52j258k036k197j815j347p43N67K700M956O623
52123H77506P599Q126Q476R006R889J0625J0415R198P749O563N338L762K059M47
52109I76758j177k671l390l154k782l006l332k688r17J082K533L488M383N355
52095I70482O027N824M529K684J138L8j239l024m775n929o697p383p443o145l926
52080I44161k198j659j603j064l1Q44J252J464J722J889J722J336J164J504K221
52065I52724K982L599L973L912L330K624K364K566K624K145J450J098J243J639
$$ plain form
52051 988273 990166 991731 992103 990732 987826 983967 979308 973480 966237 957897 949136 940663 933095 926779
$$ packed form
52051I88273J893J565L72j371k906l859m659n828p243q340q761q473p568o316
$$ [...]
##END NTUPLES=NMR SPECTRUM
##END=
