##TITLE=AC1667_DOMCH14358_8531045_UcovPnFRbW
##JCAMPDX= 6.0         $$ Bruker NMR JCAMP-DX V2.0
##DATA TYPE= NMR SPECTRUM
##DATA CLASS= NTUPLES
##ORIGIN= BRUKER
##OWNER= Administrator
$$ 1.72 TOPSPIN		Version 2.1
$$ 2014-03-14 21:18:06.165 -0800  Administrator@X
$$ Compression mode = diff/dup
##.OBSERVE FREQUENCY= 400.02188249412
##.OBSERVE NUCLEUS= ^1H
##.ACQUISITION MODE= SIMULTANEOUS (DQD)
##.ACQUISITION SCHEME= undefined
##.AVERAGES= 8
##.DIGITISER RES= 22
##SPECTROMETER/DATA SYSTEM= spect
##.PULSE SEQUENCE= zg30
##.SOLVENT NAME= COFFEE_meoh
##.SHIFT REFERENCE= INTERNAL, COFFEE_meoh, 1, 14.98509
##AUDIT TRAIL= $$ (NUMBER, WHEN, WHO, WHERE, PROCESS, VERSION, WHAT)
$$ ##TITLE= Audit trail, TOPSPIN		Version 2.1
$$ ##JCAMPDX= 5.01
$$ ##ORIGIN= Bruker BioSpin GmbH
$$ ##OWNER= Administrator
$$ $$ E:\/data/COFFEE/nmr/AC1667_DOMCH14358_8531045_UcovPnFRbW/20/pdata/1/auditp.txt
$$ ##AUDIT TRAIL=  $$ (NUMBER, WHEN, WHO, WHERE, PROCESS, VERSION, WHAT)
(   1,<2014-03-14 21:17:59.415 -0800>,<Administrator>,<X>,<go>,<TOPSPIN 2.1>,
      <created by zg
	started at 2014-03-14 21:16:52.133 -0800,
	POWCHK enabled, PULCHK disabled,
       configuration hash MD5:
       C8 4E 4E 5D D3 5C D8 9E 9F 52 82 E0 59 8A DE 15
       data hash MD5: 64K
       CE 84 E4 2A 11 73 57 C0 2E BC 01 01 A1 2C 18 18>)
(   2,<2014-03-14 21:18:02.336 -0800>,<Administrator>,<X>,<proc1d>,<TOPSPIN 2.1>,
      <Start of raw data processing
       efp LB = 0 FT_mod = 6 PKNL = 1 PHC0 = 0 PHC1 = 0 SI = 32K 
       data hash MD5: 32K
       2E AA 3E 51 99 88 72 1A E6 5B 76 EF 77 A9 9B 85>)
(   3,<2014-03-14 21:18:02.665 -0800>,<Administrator>,<X>,<proc1d>,<TOPSPIN 2.1>,
      <pk PHC0 = 93.90564 PHC1 = 0 
       data hash MD5: 32K
       45 84 4A 75 AA 28 A1 D5 CE 2B FE 76 B7 19 DE 8E>)
(   4,<2014-03-14 21:18:02.758 -0800>,<Administrator>,<X>,<proc1d>,<TOPSPIN 2.1>,
      <abs ABSG = 1 
       data hash MD5: 32K
       AD CC D4 8D F9 B4 3E 57 54 A9 F0 E1 EE C1 45 32>)
(   5,<2014-03-14 21:18:02.821 -0800>,<Administrator>,<X>,<proc1d>,<TOPSPIN 2.1>,
      <abs ABSG = 2 
       data hash MD5: 32K
       B7 FE 52 04 15 92 3D 18 07 6D EF 04 A8 E8 ED 61>)
(   6,<2014-03-14 21:18:02.883 -0800>,<Administrator>,<X>,<proc1d>,<TOPSPIN 2.1>,
      <abs ABSG = 3 
       data hash MD5: 32K
       74 FD 57 75 9A 48 74 EA BA A2 AA DF 49 1E DB 4F>)
(   7,<2014-03-14 21:18:02.930 -0800>,<Administrator>,<X>,<proc1d>,<TOPSPIN 2.1>,
      <abs ABSG = 4 
       data hash MD5: 32K
       47 94 9C FB 87 8B 9C 6B 87 93 0E E7 3E B3 91 B1>)
(   8,<2014-03-14 21:18:02.993 -0800>,<Administrator>,<X>,<proc1d>,<TOPSPIN 2.1>,
      <abs ABSG = 5 
       data hash MD5: 32K
       45 5C 7B 0F 16 D1 DA EB 02 59 3A 40 05 CE 1B D4>)
$$ ##END=
$$ 
$$ $$ hash MD5
$$ $$ 15 6C 04 94 6F B6 F2 EF 10 C5 C1 F3 8A 95 D3 B8
##$RELAX= 
##$RELAX= 
##$RELAX= 
##$RELAX= 
##$RELAX= 
##$RELAX= 
##$RELAX= 
$$ Bruker specific parameters
$$ --------------------------
##$DU= <E:\>
##$EXPNO= 20
##$NAME= <AC1667_DOMCH14358_8531045_UcovPnFRbW>
$$ [...]
150 150 150 150 150 150 150 150
##$TP07= 0
##$TPNAME0= <>
##$TPNAME1= <>
##$TPNAME2= <>
##$TPNAME3= <>
##$TPNAME4= <>
##$TPNAME5= <>
##$TPNAME6= <>
##$TPNAME7= <>
##$TPOAL= (0..7)
0.5 0.5 0.5 0.5 0.5 0.5 0.5 0.5
##$TPOFFS= (0..7)
0 0 0 0 0 0 0 0
##$TUNHIN= 0
##$TUNHOUT= 0
##$TUNXOUT= 0
##$USERA1= <user>
##$USERA2= <user>
##$USERA3= <user>
##$USERA4= <user>
##$USERA5= <user>
##$V9= 5
##$VALIST= <valist>
##$VCLIST= <CCCCCCCCCCCCCCC>
##$VD= 0
##$VDLIST= <DDDDDDDDDDDDDDD>
##$VPLIST= <PPPPPPPPPPPPPPP>
##$VTLIST= <TTTTTTTTTTTTTTT>
##$WBST= 1024
##$WBSW= 4
##$XGAIN= (0..3)
0 0 0 0
##$XL= 0
##$YL= 0
##$YMAX_a= 629984
##$YMIN_a= -534489
##$ZGOPTNS= <>
##$ZL1= 120
##$ZL2= 120
##$ZL3= 120
##$ZL4= 120
##$ABSF1= 14.98509
##$ABSF2= -5.573092
##$ABSG= 5
##$ABSL= 3
##$ALPHA= 0
##$AQORDER= 0
##$ASSFAC= 0
##$ASSFACI= 0
##$ASSFACX= 0
##$ASSWID= 0
##$AUNMP= <proc_prof1d_extract_pilot.lims>
##$AXLEFT= 0
##$AXNAME= <>
##$AXNUC= <1H>
##$AXRIGHT= 0
##$AXTYPE= 0
##$AXUNIT= <>
##$AZFE= 0.1
##$AZFW= 0.1
##$BCFW= 0
##$BC_mod= 0
##$BYTORDP= 0
##$COROFFS= 0
##$CY= 15
##$DATMOD= 1
##$DC= 0
##$DFILT= <>
##$DTYPP= 0
##$F1P= 0
##$F2P= 0
##$FCOR= 0.5
##$FTSIZE= 32768
##$FT_mod= 6
##$GAMMA= 0
##$GB= 0
##$INTBC= 1
##$INTSCL= 1
##$ISEN= 128
##$LB= 0
##$LEV0= 0
##$LPBIN= 0
##$MAXI= 10000
##$MC2= 0
##$MEAN= 0
##$ME_mod= 0
##$MI= 0
##$NCOEF= 0
##$NC_proc= -8
##$NLEV= 6
##$NOISF1= 0
##$NOISF2= 0
##$NSP= 0
##$NTH_PI= 0
##$NZP= 0
##$OFFSET= 14.98509
##$PC= 1
##$PHC0= 93.90564
##$PHC1= 0
##$PH_mod= 1
##$PKNL= yes
##$PPARMOD= 0
##$PPDIAG= 0
##$PPIPTYP= 0
##$PPMPNUM= 2147483647
##$PPRESOL= 1
##$PSCAL= 4
##$PSIGN= 0
##$PYNMP= <proc.py>
##$REVERSE= no
##$SF= 400.02
##$SI= 32768
##$SIGF1= 0
##$SIGF2= 0
##$SINO= 400
##$SIOLD= 32768
##$SPECTYP= <>
##$SREGLST= <1H.CDCl3>
##$SSB= 0
##$STSI= 32768
##$STSR= 0
##$SW_p= 8223.68421052631
##$SYMM= 0
##$S_DEV= 0
##$TDeff= 65536
##$TDoff= 0
##$TI= <>
##$TILT= no
##$TM1= 0
##$TM2= 0
##$TOPLEV= 0
##$USERP1= <user>
##$USERP2= <user>
##$USERP3= <user>
##$USERP4= <user>
##$USERP5= <user>
##$WDW= 1
##$XDIM= 32768
##$YMAX_p= 443895369
##$YMIN_p= -612524
##$CURPLOT= <Network HP LaserJet P1505>
##$CURPRIN= <$Network HP LaserJet P1505>
##$DFORMAT= <normdp>
##$LAYOUT= <+/1D_H.xwp>
##$LFORMAT= <normlp>
##$PFORMAT= <normpl>
##$SURQMSG= 1
$$ End of Bruker specific parameters
$$ ---------------------------------
##NTUPLES= NMR SPECTRUM
##VAR_NAME=  FREQUENCY,     SPECTRUM/REAL,   SPECTRUM/IMAG
##SYMBOL=    X,             R,               I
##VAR_TYPE=  INDEPENDENT,   DEPENDENT,       DEPENDENT
##VAR_FORM=  AFFN,          ASDF,            ASDF
##VAR_DIM=   32768,         32768,           32768
##UNITS=     HZ,            ARBITRARY UNITS, ARBITRARY UNITS
##FACTOR=    0.250966925370066, 1,           1
##FIRST=     8223.43324360094, -23880,       -141689
##LAST=      0,             -175719,         -48874
##MIN=       0,             -612524,         0
##MAX=       8223.43324360094, 443895369,    0
$$ Real data points
##PAGE= N=1
##DATA TABLE= (X++(R..R)), XYDATA
$$ [...]
$$ plain form
19540 41961 -153394 217057 86910 -23714 -21669 -197176 110336 161529 -72007 190928 -255946
19528 27310 -53375 99146 -56375 -69797 -147820 -100886 64715 -182141 283055 -375858 -141346
19516 146149 46772 -132747 -191018 91052 -74792 -21429 161285 -2667 199000 -283541 13675
19504 -123445 -181369 -134673 21950 127346 -115208 -291768 -67903 -207221 -338549 -145633
19493 -163893 -25254 72298 -235991 -335522 151504 99949 -247790 -60456 484 285097 -69190
19481 -58236 -206764 -142685 137927 114275 -44100 -119367 141685 -27167 272109 49910 -167375
19469 -330048 -107521 158546 -47609 -85822 -407474 258253 226006 194680 -206971 184173
19458 -161157 -13492 161642 92480 -63295 -171145 -172568 -313789 23246 -56238 76431 -72508
$$ packed form
19540D1961a53394B17057H6910b3714K045j75507A10336N1193g2007A90928b55946
19528B7310e3375I9146e6375j3422p8023M6934F4715a82141B83055c75858a41346
19516A46149D6772a32747n8271I1052g4792b1429A61285b667A99000b83541A3675
19504a23445n7924M6696B1950J05396a15208j76560f7903j39318j31328a45633
19493a63893b5254G2298b35991r9531A51504n1555b47790f0456D84K84613f9190
19481e8236j48528O4079A37927k3652d4100p5267A41685b7167B72109D9910a67375
19469c30048a07521A58546d7609l8213l21652B58253l2247l1326b06971A84173
19458a61157a3492A61642o9162f3295j07850j423j41221B3246e6238G6431g2508
$$ plain form
19446 12259 129832 170798 -77491 -274525 -212533 -24739 114987 295128 30409 -215309 -204441
19435 -204441 -40994 -265246 201930 -189536 161554 28475 34229 -280538 76257 -119044
19424 -132821 -19512 -153487 -184186 -91918 -30832 -267824 37367 -324589 -64537 -82598 138846
19412 -5583 19208 241927 -131896 68477 -210966 66140 -84436 -212508 -26323 -405592 79482
19400 30358 -298930 -187350 -153742 313625 147320 -284824 -94920 -379172 -163137 -112163
19390 -112163 -158640 92780 -49436 202092 -86971 -109321 56279 -166248 134717 36288 -29531
19378 -55236 3152 -280996 173515 -269327 -157286 -101727 -160882 220042 52001 193494 -257
19366 -330262 -213111 -22408 28587 -272190 -10102 -175903 176671 -104433 -214967 -40963
$$ packed form
19446A2259J17573M0966g7491j97034O1992b4739A14987J80141C0409b15309J0868
19435b04441d0994k24252B01930a89536A61554B8475N754b80538G6257a19044
19424a32821a9512j33975l0699i1918c0832k36992C7367c24589f4537j8061A38846
19412e583A9208K22719a31896F8477b10966F6140h4436j28072b6323l79269G9482
19400C0358b98930J11580L3608C13625A47320b84824i4920k84252a63137N0974
19390a12163m6477I2780d9436B02092h6971k2350E6279a66248A34717C6288b9531
19378e5236C152b80996A73515b69327J12041N5559n9155B20042E2001J41493b57
19366c30262J17151b2408B8587b72190a0102j65801A76671a04433j10534d0963
$$ plain form
19355 -59601 -25783 -86804 -216027 -28847 -104123 -366374 21257 -35742 85050 -103633 -339573
19344 -339573 -107987 126055 -100611 16465 84189 -161093 -191811 11313 -217496 -90322
19333 -270860 127056 115082 -108610 141461 -106242 128719 -9384 -440471 -300002 -97270
19322 8143 66588 -169088 -11328 157584 364854 85320 -184694 -129271 -6026 -359598 18940
19310 -76903 -121387 112277 -91532 -196102 5885 -189610 42716 -191312 -207383 77517 -29892
19298 -51418 -73311 -186814 123846 8111 -160305 -141375 -224661 -453882 -86636 29967 644
19286 -10252 -132289 -246605 152275 -155238 -135763 33416 -261925 127042 -16760 -9913 -263433
19275 -263433 28394 -139133 -306474 313979 -86675 157716 77398 -25121 -78176 -26249 37205
$$ packed form
19355e9601b5783o1021j29223b8847p5276k62251B1257c5742H5050a03633k35940
19344c39573a07987A26055a00611A6465O7724a61093l0718A1313b17496i0322
19333b70860A27056j1974a08610A41461a06242A28719i384m31087J40469i7270
19322H143N8445a69088a1328A57584K07270H5320a84694N5423f026l53572A8940
19310g6903m4484A12277i1532j04570E885a89610D2716a91312j6071G7517b9892
19298e1418k1893j13503A23846H111a60305J8930q3286k29221h6636B9967F44
19286a0252j22037j14316A52275a55238J9475C3416b61925A27042a6760O847k53520
19275b63433B8394a39133j67341C13979h6675A57716G7398b5121n3055b6249C7205
$$ plain form
19263 80540 -128955 -3003 -282180 164135 -228218 122037 -186531 -298373 281604 -77187
19252 -146827 30094 152788 13085 -90947 245724 -166693 -91156 -238991 103864 -34419
19241 67711 -113758 119693 -61114 -267394 -363920 -248562 -23 86449 -403245 95273 15294
19229 -93542 -190985 104477 -169180 37328 201825 101992 38111 -106035 219391 109993
19219 109993 -436694 -67159 -41489 -12572 298158 145869 -10257 -217333 -9071 -39133 453511
19207 -79657 -148193 208273 -213764 -248749 280866 -82510 -205440 -281429 48726 -186269 45221
19195 -110674 -187027 -29232 -236907 -194874 -320254 -14959 -196708 249904 -89591 97495 35478
19183 10547 -82414 -219437 -14070 -219401 -381568 -25839 153110 132480 -326980 33758 -46634
$$ packed form
19263H0540a28955c003k79177A64135b28218A22037a86531j11842B81604g7187
19252a46827C0094J22694A3085i0947B45724a66693P5537j47835A03864c4419
19241F7711a13758A19693f1114k06280r6526J15358b3H6449d03245I5273A5294
19229i3542r7443A04477a69180C7328J64497r9833C8111a06035B19391j09398
19219A09993d36694f7159K5670a2572B98158A45869a0257k07076i071l0062D53511
19207g9657o8536B08273b13764l4985B80866h2510j22930p5989D8726a86269D5221
19195a10674p6353b9232k07675M2033j25380a4959j81749B49904h9591I7495C5478
19183A0547h2414j37023a4070k05331j62167b5839A53110k0630c26980C3758d6634
$$ plain form
19171 -57338 -14069 145127 -61095 -8053 170654 -190125 -253920 -120857 -51217 66075 -34739
19159 -215978 -1480 -129324 110229 374272 -407209 187506 35828 44486 220549 -317217
19148 -154429 -126692 -40862 -37258 270961 43590 -369338 54388 -80736 -46519 -170337 90163
19136 -210440 33591 -315775 -85069 -18843 -183190 -169740 4166 298426 -241049 -71608 112482
19124 -252134 -195639 -11338 110196 49424 135808 -288611 -187721 554 44946 71272 -219846
19112 -46874 82859 -297207 -259140 10272 -140711 150072 -151482 -1885 122176 -124656 -8213
19100 77010 94084 -75838 41779 -88355 -203696 104275 162016 -203604 46348 60591 -268785
19088 -55345 36704 -155774 -45919 331578 -5737 -145608 -24425 -89411 -98871 -234072 1180
$$ packed form
19171e7338a4069A45127f1095h053A70654a90125o3795a20857e1217F6075c4739
19159b15978a480j27844A10229K64043d07209A87506C5828Q658J76063c17217
19148a54429K7737d0862L604B70961D3590c69338E4388h0736L4217j23818I0163
19136b10440C3591c15775h5069a8843j64347J3450D166K94260b41049g1608A12482
19124b52134N6495a1338A10196D9424Q6384b88611J00890E54M4392K6326b19846
19112d6874H2859b97207L8067A0272a40711A50072a51482a885A22176a24656h213
19100G7010J7074g5838D1779h8355j15341A04275N7741b03604D6348J4243b68785
19088e5345C6704a55774d5919C31578e737j39871b4425o4986r460j35201A180
$$ plain form
19076 112972 -82259 2822 99880 -91079 -229360 179341 366495 73206 -200287 192873 -222268
19064 67549 -44148 -369696 -50524 87151 -27301 -251506 -365537 -127069 75758 -8623 235816
19052 -330973 -52344 28935 156733 -142502 254271 34185 -13165 137075 76029 -138583
19041 -164391 67971 -269680 33932 137587 -134027 774 27794 14321 41241 -298263 441464
19029 -199741 -148525 -46156 -206680 -102987 -86192 -314971 20208 -123691 86729 379498
19019 379498 -150250 -85800 -140590 21694 79764 -4987 205675 -203154 -114199 61416 -275353
19007 122214 31056 215964 -33787 -13439 266562 -180115 -69667 64935 -439826 135400
18996 -164204 -70615 114104 -184787 -41252 156462 32281 148538 121802 -40181 -95102 -10442
$$ packed form
19076A12972h2259B822R7058i1079j38281A79341J87154G3206b00287A92873b22268
19064F7549d4148l25548e0524H7151b7301k24205j14031a27069G5758h623B35816
19052c30973e2344B8935J27798a42502B54271C4185a3165A37075o1046a38583
19041a64391F7971b69680C3932J03655a34027G74K7020j3473K6920b98263D41464
19029a99741N1216d6156j60524a02987J6795k28779B0208a23691H6729K92769
19019C79498a50250O4450n4790B1694N8070d987B05675b03154Q8955F1416b75353
19007A22214C1056J84908c3787a3439B66562a80115f9667F4935d39826A35400
18996a64204g0615A14104a84787d1252A56462C2281J16257k6736d0181n4921a0442
$$ plain form
18984 -80537 -174075 208190 -307862 -65026 -260007 20436 -192898 -188391 65991 105171 -280399
18972 -111427 -205561 -370384 -85733 -153787 -161413 -27146 -275530 35624 92448 -139974 -242712
18961 -242712 -403713 103192 143 -219998 -149957 77068 -426505 -40728 7708 336362 -175346
18949 -89282 -260189 285918 180826 -243139 312171 79084 -15947 -64 -26000 238311 -270648
18937 183738 -244308 -193737 -198153 -69345 -55807 20482 172013 -19946 -218034 104791 -283854
18925 -175088 -74687 -87821 189174 -18319 -35765 -53296 -139377 -203461 -228807 66209 122166
18914 122166 7826 94732 -230873 -160598 84949 -26099 -82470 -561190 170828 224457 59651
18902 -105222 -111947 -128940 -41719 64011 -201756 -55313 55440 -11137 -115370 225213 148802
$$ packed form
18984h0537r3538B08190c07862f5026j94981B0436a92898M507F5991L9180b80399
18972a11427r4134j64823h5733o8054p626b7146k48384C5624N6824a39974j02738
18961b42712j61001A03192A43b19998P0041G7068d26505d0728G708L28654a75346
18949h9282j70907B85918j05092b43139C12171G9084a5947f4k5936B38311b70648
18937A83738b44308N0571m416f9345J3538B0482J51531a9946j98088A04791b83854
18925a75088g4687j3134A89174a8319j7446j7531q6081o4084k5346F6209N5957
18914A22166G826Q6906b30873P0275H4949b6099n6371m78720A70828N3629E9651
18902a05222o725j6993d1719F4011b01756e5313E5440a1137j04233B25213p6411
$$ plain form
18891 148802 203262 99197 -85433 35513 150768 12007 80260 30178 201037 261679 -277239
18879 -482 -73638 -96587 -209326 130244 -87016 -55318 -240357 -18813 -148528 -132515 -112251
18868 -112251 -359108 190338 133336 -101425 33742 193598 -6311 -211793 -178604 -31023 -184099
18857 -184099 298994 -50401 -294956 -285428 -120095 -252773 -232290 145312 -7913 -496759 -259272
18846 -259272 -52617 -132145 400093 -177783 56992 -217191 207198 -148898 -29317 93986
18835 -199572 -181707 323598 20738 -69865 120811 236786 -179951 -155252 -492 -35243 205882
18823 -259846 -139311 69016 -169311 289730 103782 109411 210451 -256647 -181438 -119516
18813 -119516 2428 18668 -349926 -73390 -39518 255773 217416 -17901 27177 142162 121112
$$ packed form
18891A48802N4460I9197h5433C5513J15255A2007O8253C0178J70859O0642b77239
18879d82p3156k2949j12739A30244h7016L1698j85039a8813j29715J6013K0264
18868a12251k46857A90338n7002a01425C3742J59856f311k05482L3189c1023j53076
18857a84099B98994e0401k44555R528a20095j32678K0483A45312g913m88846K37487
18846b59272e2617p9528D00093a77783E6992b17191B07198a48898b9317I3986
18835a99572J7865C23598B0738f9865A20811J15975a79951K4699d92l4751B05882
18823b59846J20535F9016a69311B89730A03782N629J01040b56647P5209O1922
18813a19516B428J6240c49926g3390L3872B55773l8357a7901B7177J14985k1050
$$ plain form
18802 121112 -220777 -382708 -69681 178347 -280637 115492 225900 43388 59504 -50301
18791 81213 42876 286197 18106 -77771 -38210 -226820 -505946 -74726 -74269 -9335 -327221
18780 -327221 319532 8618 -458998 -257009 8851 132646 145455 -212647 -50825 -134627 -98727
18769 -98727 -108791 64711 120854 105820 12726 -99543 -150608 -100666 -181400 275134 -133705
18757 -286268 -92564 -35047 37474 78835 233625 -84565 204243 -6660 -181410 168523 -376381
18745 115501 134843 -290401 -94630 316139 -38378 -118446 238210 -227623 -77643 -49189 -237382
18734 -237382 -177555 -81110 75068 -106111 -285461 192399 -132427 45916 150921 -65788
18723 -233754 -45367 -12857 173024 -328667 -221638 -153528 75487 129914 -104703 -439173
$$ packed form
18802A21112b20777j61931f9681A78347b80637A15492J10408D3388J6116e0301
18791H1213l8337K43321A8106g7771c8210j88610k79126g4726M57i335l17886
18780c27221C19532H618d58998K01989H851J23795J2809b12647e0825q3802L5900
18769i8727j0064F4711N6143j5034A2726i9543n1065M9942q0734B75134a33705
18757b86268i2564c5047C7474M1361J54790h4565B04243f660j74750A68523c76381
18745A15501J9342b90401i4630C16139c8378q0068B38210b27623g7643K8454j88193
18734b37382N9827h1110G5068a06111j79350A92399a32427D5916J05005f5788
18723b33754d5367a2857A73024c28667J07029O8110G5487N4427a04703l34470
$$ plain form
18713 -439173 -39540 -343406 132870 -77891 -411062 -216483 264176 -56382 265650 -180616
18702 50183 140232 -313678 -172821 287950 -112838 -181918 -114655 -73866 -432906 39747 -194293
18690 -11956 207464 -94324 -141130 -261932 -271670 -271404 52185 -13612 -167534 79264 -59978 -82219
18678 -82219 108214 -56347 44584 -22051 158369 -86923 -160057 106922 -245726 89325 -29288
18666 -74186 138478 117051 -23964 -34870 12917 -104230 73158 -49317 116041 -75885 -202528
18655 -202528 -226163 186292 -55995 67465 170718 -230876 429860 -151411 -256123 -173345
18645 -173345 -382508 122154 -20499 244679 146041 -248239 -173172 -425256 179831 -59479
18634 342736 -215021 498530 -35121 41064 -23657 -353052 -154373 240305 -317113 -364568
$$ packed form
18713d39173c9540l03866A32870g7891l33171J94579B64176e6382B65650a80616
18702E0183R0049c13678J40857B87950a12838o9080O7263M0789l59040C9747a94293
18690a1956B07464i4324m6806j20802r738K66E2185a3612j53922G9264e9978k2241
18678h2219A08214e6347D4584b2051A58369h6923p3134A06922b45726H9325b9288
18666g4186A38478k1427b3964j0906A2917a04230G3158d9317A16041g5885j26643
18655b02528k3635A86292e5995F7465J03253b30876D29860a51411j04712Q2778
18645a73345k09163A22154b0499B44679r8638b48239P5067k52084A79831e9479
18634C42736b15021D98530c5121D1064b3657l29395a54373B40305c17113m7455
$$ plain form
18624 -364568 405489 -36294 -60430 -214340 -122104 173097 -152280 -207771 -142667 102786
18613 -256594 -142700 -14728 347751 -106882 -20904 174706 59251 -22860 -107770 -103278 -9259
18601 58674 -20698 -6692 -189177 43347 -104672 -211663 185633 50184 -444392 61122 -60242
18589 12375 -303159 -79520 126742 172286 -233734 -254982 -209082 91915 -116268 439365 125597
18577 160974 -166314 150202 -161283 54443 -199765 -162837 94162 108552 17797 136431
18567 136431 59573 -59837 135588 -25615 -65723 62770 -125762 -65811 -80112 -305161 292208
18555 97098 -129122 24989 150809 -400500 -110154 -31852 -120983 74007 86407 -84189 -62583
18544 -62583 8285 -142227 43760 -46833 -145087 -357088 21008 -309188 -191538 -49578 -40531
$$ packed form
18624c64568D05489c6294k4136j53910R2236A73097a52280n5491O5104A02786
18613b56594J13894a4728C47751a06882b0904A74706E9251b2860q4910M492i259
18601E8674b0698f692j82485D3347a04672j06991A85633E0184d44392F1122f0242
18589A2375c03159g9520A26742M5544b33734k1248M5900I1915a16268D39365A25597
18577A60974a66314A50202a61283E4443a99765L6928I4162J4390A7797J18634
18567A36431E9573e9837A35588b5615m0108F2770a25762N9951j4301k25049B92208
18555I7098a29122B4989J25820d00500a10154c1852q9131G4007J2400h4189K1606
18544f2583H285a42227D3760d6833r8254k12001B1008c09188J17650d9578R047
$$ plain form
18533 -40531 228287 -197865 -46396 125137 -84928 34112 166255 59369 -458704 -192667
18522 -93867 -169144 -170388 110876 10663 -128895 -370996 66725 -284591 87418 -161432 91029
18510 -193939 -150099 -50672 10774 15192 -166469 -96715 59320 -126978 209979 -137172 -184039
18499 -184039 221948 45202 -38129 -35633 -4488 107880 196927 -281047 -406960 142927 61446
18487 223767 -160565 38884 99866 -49661 -161619 199681 -178160 -110845 -313348 -48327
18476 -197132 112440 -177159 -67897 -139045 -299759 317929 -310576 -255614 121573 -325443
18465 -210396 -82990 109182 124125 286273 -67237 -93240 -257940 49153 -191575 -145040 100981
18453 -144712 -243548 -109166 63880 -33938 -407982 18446 -51526 212888 261348 -85175 132073
$$ packed form
18533d0531B28287a97865d6396A25137h4928C4112J32143E9369d58704a92667
18522i3867p5277j244A10876A0663a28895k42101F6725b84591H7418a61432I1029
18510a93939M3840e0672A0774M418a66469O9754E9320a26978B09979a37172m6867
18499a84039B21948D5202c8129K496d488A07880Q9047b81047j25913A42927F1446
18487B23767a60565C8884O0982d9661j11958A99681a78160O7315k02503d8327
18476a97132A12440a77159f7897p1148j60714C17929c10576N4962A21573c25443
18465b10396h2990A09182J4943J62148f7237k6003j64700D9153a91575M6535A00981
18453a44712r8836a09166F3880c3938l74044A8446e1526B12888M8460h5175A32073
$$ plain form
18441 -6785 7420 100925 213934 101022 -53246 -79529 -215547 -394774 -33820 67809 -118385
18429 28741 40231 -60484 -7250 -89975 3518 53971 -290790 14826 -92596 -381865 110192
18417 -18121 -110950 -64672 -242355 -172978 -258617 -32625 14421 -244296 77983 -140137 52180
18405 -44157 -37615 -137352 207835 256925 -316791 -42940 -251778 273351 -169016 -48922 -248381
18394 -248381 41893 -50398 24530 34142 -107065 -114512 -12108 43887 54131 120383 25450 -297273
18381 -308782 1640 53386 368595 -160975 67886 85731 -120952 -67108 25950 97906 133224
18370 133224 -75959 -335211 31838 -61298 17789 195092 -83042 8149 -14952 -287680 126624
18358 17358 -281662 235020 -285518 -74094 27698 156900 -238635 -236308 11215 -21602 41424
$$ packed form
18441f785G420R3505J13009A01022e3246k6283j36018j79227c3820F7809a18385
18429B8741J1490f0484g250q2725C518N0453b90790A4826i2596k89269A10192
18417a8121r2829M6278j77683O9377q5639c2625A4421b44296G7983a40137E2180
18405d4157O542r9737B07835M9090c16791d2940k08838B73351a69016d8922j99459
18394b48381D1893e0398B4530R612a07065p447a2108D3887J0244O6252B5450b97273
18381c08782A640N1746L15209a60975F7886J7845a20952N3844B5950P1956L5318
18370A33224g5959k59252C1838f1298A7789J77303h3042H149a4952k72728A26624
18358A7358b81662B35020b85518g4094B7698J29202b38635K327A1215b1602D1424
$$ plain form
18346 -200049 15321 97361 -18556 83949 -89522 111091 -84892 70851 53798 -101366 -213263
18335 -213263 -529340 -269990 27003 161009 -398713 112884 16683 83021 -7805 -307882
18325 -307882 119096 -445325 -98341 -137249 49418 124209 69227 239387 51203 -25355 99747
18313 -164357 -328602 -66867 -151554 122099 -132273 182636 163148 -158694 171457 -87981
18302 118585 -270369 -79950 97677 212158 -41116 -518568 -156255 32419 180914 -320662
18291 -151894 44354 11188 -188008 -302430 24325 291334 -82142 147605 -34762 -55315 -93970
18280 -93970 -241316 -11653 -303135 137094 -268133 -29807 2389 -131673 27158 29493 -46600
18268 4749 -89200 458248 72941 197062 -182404 -104707 -227787 -142768 593470 51222 32956
$$ packed form
18346b00049A5321Q2040a8556H3949h9522A11091h4892G0851j7053a01366j11897
18335b13263l16077K59350B7003J34006c98713A12884A6683O6338g805l00077
18325c07882A19096d45325i8341l8908D9418P4791n4982J70160E1203b5355I9747
18313a64357j64245f6867q4687A22099a32273A82636j9488a58694A71457h7981
18302A18585b70369g9950I7677J14481d1116m77452a56255C2419J48495c20662
18291a51894D4354A1188a88008j14422B4325K67009h2142A47605c4762k0553l8655
18280i3970j47346a1653k91482A37094b68133b9807B389a31673B7158K335d6600
18268D749h9200D58248G2941J24121a82404P7697j23080Q5019E93470E1222j8266
$$ plain form
18257 32956 66996 -65534 136483 -27341 118383 136290 30394 224017 99259 -75817 78023
18245 31604 83807 71497 16309 -389532 -46028 138195 -119109 118577 31229 -137061 -144522
18234 -144522 -72158 103222 -40353 -43551 -201280 -209190 -268362 -244397 89032 111960 -178071
18222 41624 108152 41436 -150711 -171768 164798 33996 71574 38598 225904 156586 231617
18211 231617 200581 13044 184997 64028 -55072 329087 70190 -119266 -4322 122864 -90329
18199 -39011 32001 -237463 54291 175262 -166803 -99275 8310 -90660 -147338 -136860 -54119
18187 -12405 -27815 -117415 324681 81780 -181997 136788 -231564 38511 -265490 -265 -142705
18176 -142705 25466 -132148 -183564 -19151 -148464 22713 9210 -225775 -8082 -384758 99106
$$ packed form
18257C2956L4040f5534A36483b7341A18383J7907C0394J93623I9259g5817G8023
18245C1604N2203j2310A6309c89532d6028A38195a19109A18577C1229a37061p461
18234a44522g2158A03222d0353l198j57729p910n9172K3965H9032K2928a78071
18222D1624O6528D1436a50711k1057A64798C3996L7578l2976J87306o9318P5031
18211B31617l1036A3044J71953F4028e5072C29087G0190a19266d322A22864i0329
18199c9011C2001b37463E4291J20971a66803O7528H310i0660n6678J0478e4119
18187a2405j5410q9600C24681H1780a81997A36788b31564C8511b65490b65j42440
18176a42705B5466a32148n1416a9151j29313B2713I210b25775h082l76676I9106
$$ plain form
18164 -16264 -52020 -90022 -269377 -85469 -247630 -171432 -354267 -39037 -83852 60416 -56105
18152 -66479 19339 -121948 -168509 -122131 -49661 -258636 -381690 33607 191351 94462 -88462
18140 53919 206002 24587 122384 -58097 115994 -77822 94782 52005 176555 -77874 -212461
18129 -212461 -99329 -127809 -44378 -350204 203931 -60360 -132540 97709 -42749 -202851 -240016
18118 -240016 -182269 233754 -53794 -3041 -46040 -31633 -62985 152304 177929 -95576 -440986
18107 -440986 -97289 133641 -220226 110641 184830 247170 -125109 -6430 -136268 -39283 102773
18095 -171359 131369 5803 103928 -136339 196870 83422 5777 104758 90492 224659 -133668
18083 31141 325832 -121880 -248432 -300534 -19916 62003 -68679 68670 103650 263453 -171819
$$ packed form
18164a6264l5756l8002j79355h5469j62161P6198j82835c9037m4815F0416e6105
18152f6479A9339a21948m6561M6378d9661k08975j23054C3607J57744I4462h8462
18140E3919J52083B4587R7797e8097A15994g7822I4782m2777J24550g7874j34587
18129b12461i9329k8480d4378l05826B03931f0360p2180I7709d2749j60102l7165
18118b40016N7747B33754e3794c041m2999J4407l1352A52304K5625i5576l45410
18107d40986i7289A33641b20226A10641P4189O2340a25109f430j29838c9283A02773
18095a71359A31369E803R8125a36339A96870H3422E777R8981j4266J34167a33668
18083C1141K94691a21880j26552n2102a9916F2003f8679F8670L4980J59803a71819
$$ plain form
18071 -44651 -393526 451 -372723 -329344 133086 237116 1456 203236 -260172 -187083 186382
18059 112548 -91953 -512835 -91253 -196 218933 55717 48300 30557 -52230 37304 96629 182283
18047 182283 -138214 61626 42828 -168278 -13058 -178463 76740 -137130 -234260 47981 105644
18036 105644 -129899 -27925 1082 -17364 -166406 6356 159127 -113505 12813 21979 301 -426620
18023 219595 -38971 53807 239081 -151888 -136268 -138924 -110148 188818 217605 -218384 224531
18011 11375 -332022 -102835 -13918 -223566 133800 -102820 121508 194267 -262256 -30760
18000 127925 -85163 -115588 367572 29892 118580 83543 -32742 -56160 22562 159497 -9099
17988 -26982 125309 113987 54980 -232507 -14827 164921 -240053 -209042 -2400 -79025 -118304
$$ packed form
18071d4651l48875D51c72723M3379A33086J04030A456K01780b60172P3089A86382
18059A12548i1953m20882i1253a96B18933E5717p417j7743e2230C7304N9325Q5654
18047A82283a38214F1626j8798a68278a3058j65405G6740a37130r7130D7981N7663
18036A05644a29899b7925A082a7364j49042F356J52771a13505A2813R166C01d26620
18023B19595c8971E3807J85274a51888J5620k656K8776A88818K8787b18384B24531
18011A1375c32022a02835a3918k09648A33800a02820A21508P2759b62256c0760
18000A27925h5163l0425C67572B9892Q8688l5037c2742k3418B2562J36935i099
17988b6982A25309j1322E4980b32507a4827A64921b40053L1011b400p6625l9279
$$ plain form
17977 -118304 57445 183884 -121766 121907 -238947 -285390 -129683 127025 14437 -127898
17966 41143 106027 -29981 -240544 -419627 53486 48206 -37019 -287510 214828 -235185 67572
17954 -297472 -119140 -64690 -174947 -336374 -10444 122263 -37489 -255690 -5302 -44365 392441
17942 342 88320 127748 56494 -259349 370530 -13461 65720 19591 24357 -277033 36997 -16920
17929 21605 393374 250215 39389 -47070 -143915 -23133 -174336 -196757 135526 -158112 258970
17917 -332471 -190486 89077 99331 -129868 -236671 -66118 251189 -203516 -8692 51728 -66947
17905 280651 -253323 96601 70814 247271 40529 -190088 30401 70020 460712 221720
17894 -389258 92330 101826 56863 -9667 353227 -254567 71791 15541 318571 28997 283888
$$ packed form
17977a18304E7445J26439a21766A21907b38947m6443a29683A27025A4437a27898
17966D1143O4884b9981k10563j79083E3486n280c7019k50491B14828b35185F7572
17954b97472a19140N4450j10257j61427a0444A22263c7489k18201e302l9063C92441
17942C42Q7978L9428E6494b59349C70530a3461F5720A9591M766b77033C6997a6920
17929B1605L71769j43159C9389d7070r6845b3133j51203k2421A35526a58112B58970
17917c32471J41985H9077J0254a29868j06803f6118B51189b03516h692E1728f6947
17905B80651b53323I6601k5787J76457D0529a90088C0401L9619L90692B21720
17894c89258I2330R496m4963i667C53227b54567G1791A5541L03030B8997K54891
$$ plain form
17883 283888 82320 -252741 -58498 32237 250078 -148157 -59388 196487 77263 35955 196403
17872 196403 -20343 125289 23901 -273586 -131947 -92714 -260606 -32341 -96975 -127484 40937
17860 -88537 -129240 -155128 133238 -165940 -97294 -34025 -81623 112911 -74075 271372 -226189
17848 300467 -7624 21713 203587 -48643 247640 6477 33031 -81295 129932 -116356 57425
17836 169385 -116513 -126496 -58269 279047 60523 113970 -184013 196401 116832 -128729 36957
17824 182637 -309441 241008 -237255 -180494 -189329 -108880 -12071 -91974 63640 212167 84210
17812 -193454 172077 227428 191128 -110339 158208 -118970 -89694 -67341 -332372 -11869
17801 45233 94192 -101798 -16936 -16419 -48067 177147 269430 -194040 -420095 239931 274235
$$ packed form
17883B83888H2320b52741e8498C2237K17841a48157e9388A96487G7263C5955J60448
17872A96403b0343A25289B3901b73586a31947L9233j67892c2341o4634l0509D0937
17860h8537m0703k5888A33238a65940O8646c4025m7598A12911g4075B71372b26189
17848C00467g624B1713J81874d8643B47640F477K6554h1295A29932a16356E7425
17836A69385a16513r983e8269B79047F0523N3447a84013A96401p9569a28729C6957
17824A82637c09441B41008b37255N6761q835Q0449a2071p9903F3640J48527H4210
17812a93454A72077N5351l6300a10339A58208a18970K9276K2353k65031a1869
17801D5233M8959a01798a6936N17l1648A77147R2283a94040k26055B39931L4304
$$ plain form
17790 274235 23063 -57634 -57399 39099 15890 -110572 -272008 238242 -34458 -13285 16407
17778 -87332 -85265 102618 -243905 -43254 -302646 50637 56936 -152750 115455 -46517 -35091
17767 -35091 -304015 154065 184208 112518 282747 20576 236735 50599 958 -21585 42515
17755 -271418 24461 -90747 35564 181174 -307989 66344 217670 75917 -44776 132948 -211461
17743 -41640 250364 111848 49064 152647 68876 203921 -144327 -134101 -92255 -79029 93865
17731 -226884 -172766 439757 280988 147353 13238 121327 -37697 -64348 28497 247810
17721 247810 -173175 79503 265101 196544 -92138 268538 -238252 220628 144025 140661 -180679
17709 133706 -98716 98969 5064 -129211 -36687 8941 -193774 -280944 -71586 62589 124704
$$ packed form
17790B74235B3063e7634K35C9099A5890a10572j61436B38242c4458a3285A6407
17778h7332K067A02618b43905d3254k59392E0637O299a52750A15455d6517J1426
17767c5091k68924A54065L0143p1690J70229B0576K16159E0599I58b1585D2515
17755b71418B4461i0747C5564J45610c07989F6344J51326G5917d4776A32948b11461
17743d1640B50364A11848D9064J03583F8876J35045a44327J0226M1846J3226I3865
17731b26884N4118D39757j58769j33635A3238J08089c7697k6651B8497K19313
17721B47810a73175G9503J85598o8557i2138B68538b38252B20628p6603l364a80679
17709A33706i8716I8969E064a29211c6687H941a93774q7170g1586F2589O2115
$$ plain form
17698 124704 -77342 224219 -123238 300278 -212416 41303 -118162 257100 293035 63735
17687 -140972 -14803 -272283 262068 60381 -66637 106832 -140217 -95454 -264165 72430
17676 -174142 -129128 384861 -225140 87121 -109245 -71547 -73412 -198284 -250253 -131397 11502
17664 -201667 384868 94544 65423 153041 -107395 -32674 -148597 -78969 -44460 60672 -39738
17652 -85575 -51646 -97182 317420 -210858 -122685 86671 -70313 88841 268550 198288 193515
17641 193515 350045 -286474 337134 -105655 -95867 105395 -68478 -76422 113972 336865
17631 336865 168236 -33341 160865 -35745 182555 286208 100084 224358 -419059 183712
17620 -123109 -9145 48319 -128201 -199802 128820 292300 40507 -4427 -113961 108350 -1168
$$ packed form
17698A24704g7342B24219a23238C00278b12416D1303a18162B57100L5935F3735
17687a40972a4803k57480B62068F0381f6637A06832a40217M4763j68711G2430
17676a74142M5014C84861b25140H7121a09245L7698j865j24872n1969J18856A1502
17664b01667C84868I4544k9121Q7618a07395c2674j15923O9628L4509F0672c9738
17652h5575L3929m5536C17420b10858Q8173H6671g0313H8841J79709p0262m773
17641A93515J56530b86474C37134a05655R788A05395f8478p944A13972K22893
17631C36865A68236c3341A60865c5745A82555J03653A00084J24274d19059A83712
17620a23109i145D8319a28201p1601A28820J63480D0507d427j09534A08350a168
$$ plain form
17608 215010 -19428 87692 109205 39001 -216663 14425 310642 -135661 175340 57092 27015
17596 114610 162105 112226 -142448 -174769 90352 -54983 -241331 -26126 -85319 98070 28955
17584 53393 144419 -148918 -164928 65451 149002 -78634 -23330 206943 322809 -2598 70446
17572 -44762 147288 103506 -222144 -172340 -165918 -216544 177053 57851 328558 -428337 12323
17560 204787 -60394 65305 107160 79710 138570 169086 123283 -306375 282515 149105 -26877
17548 -51233 287824 -184087 315687 -46490 -9940 -50455 -19147 122233 7072 189056 200454
17537 200454 223560 189910 252416 140747 -6943 35942 413286 135082 -15164 246835 126305
17526 126305 27216 28106 141403 72228 198154 115618 -185363 358835 259750 -264375 86928
$$ packed form
17608B15010a9428H7692K1513C9001b16663A4425K96217a35661A75340E7092B7015
17596A14610M7495m9879a42448l2321I0352e4983j86348b6126n9193I8070B8955
17584E3393R1026a48918j6010F5451Q3551g8634b3330B06943J15866b598G0446
17572d4762A47288m3782b22144M9804O422n0626A77053E7851K70707d28337A2323
17560B04787f0394F5305M1855k7450N8860L0516m5803c06375B82515j33410b6877
17548e1233B87824a84087C15687d6490i940m0515a9147A22233G072J81984J1398
17537B00454K3106l3650O2506j11669f943C5942L77344A35082a5164B46835j20530
17526A26305B7216Q90J13297o9175J25926q2536a85363C58835r9085b64375H6928
$$ plain form
17514 -95510 129293 168869 -31386 -23995 124101 65400 -7407 240149 221998 -127726 239949
17502 50676 42407 184602 67649 -141769 221293 104759 -241485 405327 152439 276532
17492 276532 40034 14431 60128 183291 65296 230475 -36801 28530 -175716 -34526 -28232
17481 -28232 179440 84708 174744 172802 -42049 -100673 8095 -49423 75961 338021 312774 380103
17469 380103 181293 81613 29974 36861 24931 -78688 299069 428748 75927 181961 82823
17457 256251 318579 34155 62894 391822 232230 202742 269933 54436 256051 430880 70837
17445 147301 358801 470050 116012 354445 227897 240393 -136592 414726 -58343 246243
17434 367191 37682 232559 293367 175154 377563 68985 88038 221327 49210 135098 -256437
$$ packed form
17514i5510A29293L9576c1386P391A24101n8701g407B40149j8151a27726B39949
17502E0676q269J42195F7649a41769B21293A04759b41485D05327A52439J24093
17492B76532D0034A4431M5697J23163F5296J65179c6801B8530a75716c4526O294
17481b8232A79440H4708R0036j942d2049n8624H095d9423G5961K62060k5247O7329
17469C80103A81293H1613B9974O887j1930g8688B99069J29679G5927J06034H2823
17457B56251O2328C4155K8739L28928j59592k9488O7191E4436K01615J74829G0837
17445A47301K11500J11249A16012K38433j26548J2496a36592D14726e8343B46243
17434C67191C7682J94877O0808j18213K02409F8985J9053J33289D9210Q5888b56437
$$ plain form
17422 -14378 726690 420888 216820 6858 279496 357217 -48840 386259 621690 480353
17412 480353 601970 158851 127561 -50476 155641 -132148 175685 124709 120171 203971 164112
17401 164112 327913 326080 249736 310052 283307 137390 290760 217610 187722 134699 268709
17390 268709 -122697 1743 -253554 65135 -89035 -100541 176472 294157 -48178 -155784 315278
17378 142849 190665 291091 130412 290340 8580 21432 113528 760239 449498 70443 -161529
17366 375877 -59745 157409 -117090 -137312 176622 72052 -315758 345787 101557 151946
17356 151946 -45185 256709 226534 99153 -200908 120894 219259 22948 56753 2887 120603
17345 120603 -94960 254256 335979 314448 109573 29969 319627 304048 162702 272419
$$ packed form
17422a4378G26690l05802k04068F858K72638P7721d8840C86259K35431j41337
17412D80353J21617A58851l1290e0476A55641a32148A75685n0976m538Q3800l9859
17401A64112J63801j833p6344O0316k6745A37390J53370p3150k9888n3023J34010
17390B68709a22697A743b53554F5135h9035j1506A76472J17685d8178j07606C15278
17378A42849M7816J00426A30412J59928H580J2852R2096O46711l10741G0443a61529
17366C75877e9745A57409a17090k0222A76622G2052c15758C45787A01557N0389
17356A51946d5185B56709l0175I9153b00908A20894R8365B2948L3805B887J17716
17345A20603i4960B54256Q1723k1531A09573B9969K89658j5579j41346J09717
$$ plain form
17335 272419 386194 91235 -156474 4520 26208 250273 48977 454198 13658 107546 19419
17323 287363 -127032 148119 329874 128943 92202 291801 215017 338054 141581 54548
17312 -47138 172703 242522 220790 -208564 -116219 80861 36044 -36634 236791 506444 393398
17301 393398 472885 197253 74906 -336532 312975 -8137 167118 107593 371125 318455 -82054
17289 3658 43121 560481 76203 299617 257729 336689 78052 278875 -170939 203213 -18760
17277 341911 172659 32762 171929 -8361 59703 197604 380163 234162 -44807 105920
17266 389727 217354 500488 219172 -22509 429730 347210 243854 483335 132561 264292
17256 264292 483184 319068 205148 139998 503241 128844 79551 186143 84186 71274
$$ packed form
17335B72419J13775I1235a56474D520K1688K24065D8977M05221A3658R3888A9419
17323B87363a27032A48119J81755A28943l6741J99599p6784J23037A41581E4548
17312d7138A72703O9819k1732b08564R2345H0861C6044c6634B36791K69653j13046
17301C93398P9487A97253G4906c36532C12975h137A67118n9525K63532n2670h2054
17289C658L9463N17360G6203K23414m1888P8960G8052K00823a70939B03213a8760
17277C41911j69252C2762J39167h361E9703J37901J82559j46001d4807A05920
17266C89727j72373K83134B19172b2509D29730q2520j03356K39481A32561J31731
17256B64292K18892j64116j13920o5150L63243A28844m9293J06592H4186j2912
$$ plain form
17246 71274 -206957 -167908 257804 41536 348292 242612 339408 318755 374091 127357 246772
17235 246772 75846 372609 231262 285200 185944 253884 248662 274887 211994 114755 315874
17224 315874 77892 306940 253372 232197 493400 292526 186679 141487 265237 328640
17214 328640 534217 76712 190962 372599 281564 176481 460133 320304 23225 209564
17204 209564 361144 222423 423024 251854 371833 148282 236623 285728 384369 117258
17193 230450 69102 187544 349027 236297 425127 25134 274125 512665 373575 172162
17182 6992 437698 123172 547654 155861 277282 97811 399906 86739 269141 361794
17172 361794 453429 166118 499831 534110 484945 142779 203569 261255 489256 56408 400504
$$ packed form
17246G1274b06957L9049B57804D1536L06756j05680R6796k0653N5336A27357J19415
17235B46772G5846K96763j41347N3938r9256O7940n222K6225o2893r7239K01119
17224C15874G7892K29048n3568k1175K61203k00874j05847m5192J23750O3403
17214C28640K05577G6712J14250J81637r1035j05083K83652j39829B3225J86339
17204B09564J51580j38721K00601j71170J19979A48282Q8341M9105R8641A17258
17193B30450F9102J18442J61483j12730J88830B5134K48991K38540j39090A72162
17182F992M30706A23172M24482A55861J21421I7811L02095H6739J82402R2653
17172C61794R1635A66118L33713L4279m9165A42779O0790N7686K28001E6408L44096
$$ plain form
17161 400504 462732 161937 200231 396563 168133 311823 404753 322946 458402 273214
17151 273214 467364 474647 611729 458805 143316 389566 357841 535735 553966 379583
17141 379583 366334 238018 314763 371809 210027 372918 391750 204087 281438 336069 487855
17130 487855 558698 332765 283812 539701 453350 309896 482530 465285 350432 115721
17119 249904 371102 546828 278271 540109 430988 228034 447087 361158 653654 405146
17109 405146 48695 511496 395631 51510 508273 532776 70471 626330 392313 469856
17099 469856 502600 357878 200246 300134 387361 289067 325317 314036 282013 645882 523725
17088 523725 461629 466300 593514 688544 454728 523692 193400 184858 255683 359533 483582
$$ packed form
17161D00504O2228A61937L8294J96332A68133J43690R2930q1807J35456j85188
17151B73214J94150P283J37082j52924A43316K46250l1725J77894J8231j74383
17141C79583j3249j28316P6745N7046j61782J62891J8832j87663P7351N4631J51786
17130D87855P0843k25933m8953K55889q6351j43454J72634j7245j14853A15721
17119B49904J21198J75726k68557K61838j09121k02954K19053q5929K92496k48508
17109D05146D8695M62801j15865E1510M56763K4503G0471N55859k34017P7543
17099D69856L2744j44722j57632R9888Q7227r8294L6250j1281l2023L63869j22157
17088E23725o2096M671J27214R5030k33816O8964A93400q542P0825J03850J24049
$$ plain form
17077 483582 274045 710112 445295 453220 437122 334996 727323 393321 451895 534732
17067 534732 468075 470233 486210 430804 719947 638954 423691 601158 107994 574638 301960
17056 301960 910503 717606 676499 696765 543274 521389 567291 893035 376827 515435
17046 515435 520018 702229 604062 855348 829102 865579 520215 584605 553477 486513 765409
17035 765409 610457 543859 581963 940989 645115 735381 773165 406463 801763 743960
17025 743960 607517 386548 745180 856459 811887 683620 515308 439087 715351 676148
17015 676148 824539 643417 946717 860037 736853 502588 752180 599501 723254 932537
17005 932537 926772 794272 911005 740836 646735 770912 725904 1042656 637859 772391
$$ packed form
17077D83582k09537M36067k64817P925j6098j02126L92327l34002N8574Q2837
17067E34732o6657K158J5977n5406K89143q0993k15263J77467A07994M66644k72678
17056C01960O08543j92897m1107K0266j53491k1885M5902L25744C76827J38608
17046E15435M583J82211r8167K51286k6246L6477l45364O4390l1128o6964K78896
17035G65409j54952o6598L8104L59026k95874R0266L7784l66702L95300n7803
17025G43960j36443k20969L58632J11279m4572j28267j68312p6221K76264l9203
17015F76148J48391j81122L03300q6680j23184k34265K49592j52679J23753K09283
17005I32537n765j32500J16733j70169r4101J24177m5008L16752m04797J34532
$$ plain form
16995 772391 712127 710814 1086636 842031 962588 1109918 989350 965297 969946 905758 841152
16984 841152 857697 998831 923365 868015 1011465 522401 987112 750916 991356 1023336
16974 1023336 1008879 991231 942418 1094353 1135424 890438 1106120 982097 944255 904366
16964 904366 1171510 968983 1161679 804264 866608 1094204 1197966 1059416 1132702 1270517
16954 1270517 1153500 1163381 1224119 1293115 1089627 1170973 1168789 1423895 1172257 902626 1335324
16943 1335324 1324001 1464553 1323482 1426330 1489786 1260079 1657500 1325424 1416494 1259932
16933 1259932 1382858 1753574 1276092 1510486 1342756 1487351 1502926 1753034 1659747 1606066
16923 1606066 1657606 1610809 1284465 1307973 1594453 1407625 1528913 1868665 1475491 1717623
$$ packed form
16995G72391o0264j313L75822k44605J20557J47330j20568k4053M649o4188o4606
16984H41152J6545J41134p5466n5350J43450m89064M64711k36196K40440L1980
16974A023336j4457j7648m8813J51935M1071k44986K15682j24023l7842l9889
16964I04366K67144k02527J92696l57415O2344K27596J03762j38550P3286J37815
16954A270517j17017R881O0738O8996k03488Q1346k184K55106k51638k69631M32698
16943A335324j1323J40552j41071J02848O3456k29707L97421l32076R1070j56562
16933A259932J22926L70716m77482K34394j67730J44595J5575K50108r3287n3681
16923A606066N1540m6797l26344K3508K86480j86828J21288L39752l93174K42132
$$ plain form
16913 1717623 1742710 1720917 1496718 1952904 1787040 2007487 1800779 1936851 1664276 1894875
16903 1894875 1951986 2045583 2191739 1893429 1963849 2416101 1905913 1566387 2151298 2245952
16893 2245952 2368394 1963185 2273049 2193676 2244895 2378862 2362022 2469473 2433447 2396266
16883 2396266 1966022 2597838 2510362 2686463 2474778 2515717 2657611 2790420 2698519 2710167
16873 2710167 2756758 2751878 2578950 2719059 2764167 2613758 2944473 3033449 3093404 2922309
16863 2922309 2897806 3058316 2931111 2896065 3146473 3456231 3408291 3393201 3314433 3700380
16853 3700380 3363980 3886743 3765909 3959698 3651236 3499565 4058292 3554235 4162472
16844 4162472 4135671 4091671 4058398 4336473 4075585 4590191 4260805 4814075 4784298 4569347
$$ packed form
16913A717623K5087k1793k24199M56186j65864K20447k06708J36072k72575K30599
16903A894875N7111R3597J46156k98310P0420M52252n10188l39526N84911R4654
16893B245952J22442m05209L09864p9373N1219J33967j6840J07451l6026l7181
16883B396266m30244O31816q7476J76101k11685M0939J41894J32809r1901J1648
16873B710167M6591m880j72928J40109M5108j50409L30715Q8976N9955j71095
16863B922309k4503J60510j27205l5046K50408L09758m7940j5090p8768L85947
16853C700380l36400N22763j20834J93789l08462j51671N58727n04057O08237
16844D162472k6801m4000l3273K78075k60888N14606l29386N53270k9777k14951
$$ plain form
16834 4569347 4747126 4636084 5025272 5259324 5052495 5324773 5533402 5625991 5250340 5312205
16824 5312205 5684306 5653157 5732055 6278284 6184159 5908252 6202993 6358424 6410857 6655588
16814 6655588 6711239 7127687 7252312 7283766 7574047 7563104 7728459 7717799 8247262 8052920
16804 8052920 8417487 8878561 8763238 8853879 9231089 9395266 9304179 10041625 9988237 10453530
16794 10453530 10594445 10589604 10964610 11485202 11642325 12034119 12487484 12547503 13174165 13269980
16784 13269980 13818895 14426278 14667470 15046124 15481207 16058250 16539355 16863089 17516054
16775 17516054 18106662 18970875 19618240 19821952 20550101 21469554 22218401 22706956 23541439
16766 23541439 24249578 25071170 26009168 27377457 27964231 29164180 30422467 31601433 33152017
$$ packed form
16834D569347J77779j11042L89188K34052k06829K72278K08629R2589l75651O1865
16824E312205L72101l1149P8898N46229r4125k75907K94741J55431N2433K44731
16814F655588N5651M16448J24625L1454K90281j0943J65355j0660N29463j94342
16804H052920L64567M61074j15323R0641L77210J64177r1087P37446n3388M65293
16794A0453530J40915m841L75006N20592J57123L91794M53365O0019O26662R5815
16784A3269980N48915O07383K41192L78654M35083N77043M81105L23734O52965
16775A7516054N90608Q64213O47365K03712P28149R19453P48847M88555Q34483
16766B3541439P08139Q21592R37998J368289N86774J199949J258287J178966J550584
$$ plain form
16757 33152017 34368029 36022986 37608331 39109945 40701716 42728679 44604780 46444920
16749 46444920 48525527 51177190 53693891 56103523 58966558 62370917 65450532 69215293
16741 69215293 72740837 76924131 81038193 85359321 89893574 94612886 100444271 105720308
16733 105720308 111780857 117566785 123895557 130122722 136722922 143062297 149257244 155634281
16725 155634281 161099300 166927682 171538320 175280381 178124340 179960718 181201714 180581367
16717 180581367 179081974 176405642 172978871 168530064 163164189 156929578 150440565 143906816
16709 143906816 136564669 129617307 123036005 116068895 109711908 103506121 97624415 91848522
16701 91848522 86744855 81679930 76892970 72699597 68159962 64660352 61092616 57779082
$$ packed form
16757C3152017J216012J654957J585345J501614J591771K026963J876101J840140
16749D6444920K080607K651663K516701K409632K863035L404359L079615L764761
16741F9215293L525544M183294M114062M321128M534253M719312N831385N276037
16733A05720308O060549N785928O328772O227165O600200O339375O194947O377037
16725A55634281N465019N828382M610638L742061K843959J836378J240996o20347
16717A80581367j499393k676332l426771m448807n365875o234611o489013o533749
16709A43906816p342147o947362o581302o967110o356987o205787n881706n775893
16701I1848522n103667n064925m786960m193373m539635l499610l567736l313534
$$ plain form
16693 57779082 54697440 51636963 48966241 46551623 43990030 41710345 40049376 37970839
16685 37970839 36175068 34548881 33029767 31191368 30268482 28812635 27267095 26026536
16677 26026536 25268149 24350582 23010680 22078323 21282364 20331489 19796792 18884677 18386533
16668 18386533 17333321 17339640 16773357 16160430 15366852 15020291 14560471 13772374 13577272
16659 13577272 13263590 12728659 12439148 12036688 11711026 11298441 10732666 10709541 10207956
16650 10207956 10095699 9908657 9470076 8933353 8879927 8868466 8463341 8043017 8162753 7711804
16640 7711804 7742638 7462402 7503186 7399598 7637160 6686108 6832628 6892136 6270750 6332751
16630 6332751 6270374 6075261 5826457 5618383 5604133 5538692 5569024 5374380 5087173 5311629
$$ packed form
16693E7779082l081642l060477k670722k414618k561593k279685j660969k078537
16685C7970839j795771j626187j519114j838399r22886j455847j545540j240559
16677B6026536p58387r17567j339902r32357p95959r50875n34697r12115m98144
16668A8386533j053212O319n66283o12927p93578l46561m59820p88097j95102
16659A3577272l13682n34931k89511m02460l25662m12585n65775k3125n01585
16650A0207956j12257j87042m38581n36723n3426j1461m05125m20324J19736m50949
16640G711804L0834k80236M0784j03588K37562r51052J46520N9508o21386O2001
16630F332751o2377j95113k48804k08074j4250o5441L0332j94644k87207K24456
$$ plain form
16620 5311629 5118353 5069359 4793872 4722765 4805112 4433878 4564191 4773204 3945530 4017560
16610 4017560 4370921 3973145 3773327 4227413 3723450 3500273 3583320 3889295 3557589 3463694
16600 3463694 3211472 3458456 3215577 3121560 3120230 3067732 2947988 3037127 3110387 2898735
16590 2898735 2729826 2914442 2539663 2978759 2433191 2522030 2797633 2593813 2256847 2722505
16580 2722505 2673647 2487042 2345706 2208214 2362432 2386763 2069340 2238519 2046830 2451944
16570 2451944 2094821 2164380 2040912 2101434 2266354 2104248 1978289 1993292 2153059 1742168
16560 1742168 1747142 1513456 1684879 2023782 1768285 1622614 1738569 1659823 1733733 1727747
16550 1727747 1354070 1708270 1504507 1441311 1541176 1536695 1618749 1603960 1389908 1460279 1325321
$$ packed form
16620E311629j93276m8994k75487p1107Q2347l71234J30313K09013q27674P2030
16610D017560L53361l97776j99818M54086n03963k23177Q3047L05975l31706r3895
16600C463694k52222K46984k42879r4017j330n2498j19744Q9139P3260k11652
16590B898735j68909J84616l74779M39096n45568Q8839K75603k03820l36966M65658
16580B722505m8858j86605j41336j37492J54218K4331l17423J69179j91689M05114
16570B451944l57123O9559j23468O0522J64920j62106j25959J5003J59767m10891
16560A742168M974k33686J71423L38903k55497j45671J15955p8746P3910n986
16550A727747l73677L54200k03763o3196R9865m481Q2054j4789k14052P0371j34958
$$ plain form
16539 1325321 1160815 1446894 1396101 1607313 1575068 1372303 1336921 1349484 1266449 1311036
16529 1311036 1666729 1498604 1219962 951126 1143387 863605 1108126 1201872 1243431 1328406
16519 1328406 1262716 1238527 1326104 1050352 1233078 1099357 1257171 827290 920558 901102
16509 901102 1262230 993616 1028999 1382408 1209910 1446918 826140 1138972 874355 1115640
16499 1115640 982202 1097282 912309 1326321 795776 1010163 961971 905682 947883 643665
16489 643665 704853 922572 1217389 761635 926880 523393 738255 889604 464357 538738
16479 538738 1000862 1012177 766808 569277 905468 684821 506555 448712 828144 423321
16469 423321 692336 667576 510526 708983 768565 963929 771951 473514 755874 514138
$$ packed form
16539A325321j64506K86079n0793K11212l2245k02765l5382J2563q3035M4587
16529A311036L55693j68125k78642k68836J92261k79782K44521R3746M1559Q4975
16519A328406o5690k4189Q7577k75752J82726j33721J57814m29881R3268j9456
16509I01102L61128k68614L5383L53409j72498K37008o20778L12832k64617K41285
16499A115640j33438J15080j84973M14012n30545K14387m8192n6289M2201l04218
16489F43665O1188K17719K94817m55754J65245m03487K14862J51349m25247P4381
16479E38738M62124J1315k45369j97531L36191k20647j78266n7843L79432m04823
16469D23321K69015k4760j57050J98457N9582J95364j91978k98437K82360k41736
$$ plain form
16459 514138 581388 647425 565571 829535 608977 576910 523775 234248 591882 800938
16449 800938 351700 681383 561905 715119 415094 628413 722791 451305 677473 431398
16439 431398 758326 648765 877242 571109 528987 567821 594764 201479 401363 553554
16429 553554 594804 639797 608401 352870 642371 548146 631006 693538 461561 516531 558683
16418 558683 590808 409994 447249 909912 567247 312488 553218 682131 251522 628036
16408 628036 548052 456933 440914 579835 401538 597889 709367 640812 595432 748434
16398 748434 682517 382300 314213 425552 30725 395427 182329 552877 292470 214561
16388 214561 516106 434716 640800 335745 388005 209173 141973 444300 487988 445169
$$ packed form
16459E14138O7250O6037q1854K63964k20558l2067n3135B34248L57634K09056
16449H00938C51700L29683j19478J53214l00025K13319R4378k71486K26168k46075
16439D31398L26928j09561K28477l06133m2122L8834K6943B01479J99884J52191
16429E53554M1250M4993l1396k55531K89501r4225Q2860O2532k31977N4970M2152
16418E58683L2125j80814L7255M62663l42665k54759K40730J28913B51522L76514
16408F28036p9984r1119j6019J38921j78297J96351J11478o8555m5380J53002
16398G48434o5917l00217o8087J11339C0725L64702A82329L70548k60407p7909
16388B14561L01545q1390K06084l05055N2260j78832o7200L02327M3688m2819
$$ plain form
16378 445169 558273 309271 21916 186695 429411 340655 495806 488359 443085 307650
16368 307650 334255 365226 367306 -135268 333323 680991 45928 166580 419073 423012 467370
16357 467370 22503 75037 334420 319989 364221 -72392 544204 317292 308940 502327 281009
16346 281009 43059 457524 21862 332387 440930 279029 162982 377138 267857 563596
16336 563596 417300 -9443 334550 217630 336358 69434 395277 43662 408737 231701
16326 231701 90684 309715 -11444 370218 389851 235146 -62840 114626 265635 107660
16315 -5171 295947 119552 21324 330054 560938 296780 248486 427572 300823 263618
16305 263618 189489 257333 179527 -54351 -234320 284853 273173 -43598 20577 63373 209831
$$ packed form
16378D45169J13104k49002B1916J64779K42716q8756J55151p447m5274j35435
16368C07650K6605L0971K080a35268C33323L47668D5928J20652K52493L939M4358
16357D67370B2503N2534K59383j4431M4232g2392E44204k26912q352J93387k21318
16346B81009D3059M14465B1862L10525J08543j61901j16047K14156j09281K95739
16336E63596j46296i443C34550j16920J18728F9434L25843D3662L65075j77036
16326B31701I0684K19031a1444C70218J9633j54705f2840A14626J51009A07660
16315e171B95947A19552B1324L08730K30884k64158m8294J79086j26749l7205
16305B63618p4129O7844p7806e4351j79969B84853j1680d3598B0577M2796J46458
$$ plain form
16294 209831 560034 509751 -41571 10139 171977 425144 168067 437877 194050 249192
16284 249192 39238 281038 127386 86148 493364 531060 295105 560787 124988 -120638
16273 -16968 173482 317692 87795 247227 200480 -158075 -61857 -1607 160358 134332 -21239
16261 174071 -50186 56385 251344 159016 414543 231596 -9774 194876 254571 132427 63432
16249 342990 -129400 270033 7761 66424 67779 106028 68940 177954 288939 -4935 -71205
16238 -71205 -45691 -325187 166085 290038 -20441 -421825 389842 196194 141709 116814
16228 116814 -79432 346470 171676 268607 142374 329999 283374 92795 340999 240267
16218 240267 119364 11989 111409 65412 229980 45639 158913 204963 98321 239092 169340
$$ packed form
16294B09831L50203n0283d1571A0139J61838K53167A68067K69810A94050N5142
16284B49192C9238K41800A27386m1238M07216L7696k35955K65682A24988a20638
16273a6968A73482J44210H7795J59432m6747a58075f1857a607A60358k6026b1239
16261A74071e0186E6385J94959r2328K55527j82947i774A94876N9695j22144F3432
16249C42990a29400B70033G761N8663J355L8249l7088J09014J10985d935o6270
16238g1205K5514k79496A66085J23953b0441m01384C89842j93648n4485k4895
16228A16814g9432C46470A71676R6931j26233J87625m6625I2795K48204j00732
16218B40267A19364A1989R9420m5997J64568D5639J13274M6050I8321J40771o9752
$$ plain form
16207 169340 -16628 140181 248508 391110 152879 -10060 80587 180865 72198 215248
16197 215248 -8565 84669 197720 -148244 267804 86865 82909 137326 119442 93680 -4179
16185 1427 -25764 -84656 -152503 15299 -5258 59753 -111220 432411 440637 -139744 11470 -22694
16172 -151417 142155 -11818 319675 -42665 141443 194296 -47593 254004 186103 401967
16162 401967 11460 253111 11225 -154561 58251 151576 355792 118419 51700 168573
16152 168573 -253551 -23870 -88674 -83025 401957 425634 -27084 -142022 -283799 109890 79650
16141 79650 -351088 242540 -50828 212426 60872 -99195 -41939 276408 228860 87870 -78606
16129 165398 -41857 198767 -104649 34103 -21084 14032 10765 65974 -184102 29445 154731
$$ packed form
16207A69340a6628A40181J08327J42602A52879a0060H0587J00278G2198J43050
16197B15248h565H4669J13051a48244B67804H6865l956N4417j7884k5762d179
16185A427b5764n8892o7847A5299e258E9753a11220D32411Q226a39744A1470b2694
16172a51417A42155a1818C19675d2665A41443N2853d7593B54004o7901K15864
16162D01967A1460K41651A1225a54561E8251R3325K04216A18419E1700J16873
16152A68573b53551b3870o4804N649D01957K3677b7084j14938j41777A09890l0240
16141G9650c51088B42540e0828B12426F0872i9195d1939B76408m7548H7870g8606
16129A65398d1857A98767a04649C4103b1084A4032l267N5209a84102B9445J25286
$$ plain form
16118 154731 -140816 73049 -88635 -125589 -183876 -92634 150568 86793 25400 179576 -28740
16106 171549 75633 -31189 -5764 47896 106817 238291 265990 -383423 137349 191539 330673
16095 330673 156085 6890 -311503 -146399 28358 -150520 238824 147954 561876 162941
16084 158792 274854 18702 -215955 -57202 91478 128938 -217030 -206573 -153458 47373 -348745
16072 153250 80956 294976 95280 -147843 249762 126164 -156290 -72983 276287 -27672
16061 95707 122635 104959 -183407 -272925 135936 -55518 42809 -7460 -53822 123131 210293
16050 210293 -260838 158655 43491 58911 -312103 -104514 230221 208156 28350 -196856
16039 -42332 -135031 -25028 -99197 -213723 72470 196957 -313632 155832 -23465 7146 -522181
$$ packed form
16118A54731a40816G3049h8635l6954n8287R1242A50568o3775B5400J54176b8740
16106A71549G5633c1189e764D7896N8921J31474K7699c83423A37349N4190J39134
16095C30673A56085F890c11503a46399B8358a50520B38824r0870M13922A62941
16084A58792J16062A8702b15955e7202I1478L7460b17030J0457N3115D7373c48745
16072A53250p2294K14020I5280a47843B49762j23598a56290g2983B76287b7672
16061I5707K6928j7676a83407q9518A35936e5518D2809g460m6362A23131Q7162
16050B10293b60838A58655D3491J5420c12103a04514B30221k2065B8350a96856
16039d2332r2699b5028p4169j14526G2470J24487c13632A55832b3465G146e22181
$$ plain form
16027 -146137 -36795 -9361 -184884 346236 -138484 246953 160874 81057 -138748 25939 277851
16016 277851 271688 -146117 48580 -8755 -138233 -143594 -16230 138645 50068 -77211 -123584
16005 -123584 216358 -97906 -42161 122145 -253556 -364102 77943 -91385 12043 171640
15995 171640 -224977 29781 -14127 88206 48082 -112017 144862 -125688 16095 -114423
15984 40171 158083 -10545 -48377 116121 360760 195660 320633 97237 215350 333195
15974 333195 361977 -135449 275718 -154573 108070 -25011 19921 -84393 -286678 128864
15963 -43778 -14097 110509 -26105 55855 -202354 -21273 -391984 -154304 40766 200715 170211
15952 170211 118144 169020 84352 -228560 -431831 204120 263321 184564 -169429 157 -115968
$$ packed form
16027a46137c6795i361j75523C46236a38484B46953q6079p9817a38748B5939K51912
16016B77851o163a46117D8580h755j29478n361a6230A38645E0068g7211m6373
16005a23584B16358i7906d2161A22145b53556j10546G7943i1385A2043J59597
15995A71640b24977B9781a4127H8206m0124a12017A44862a25688A6095a14423
15984D0171J17912a0545l7832A16121K44639j65100J24973I7237J18113J17845
15974C33195K8782a35449B75718a54573A08070b5011A9921h4393k02285A28864
15963d3778a4097A10509b6105E5855b02354b1273l70711a54304D0766J59949l0504
15952A70211n2067N0876H4352b28560k03271B04120N9201p8757a69429A57a15968
$$ plain form
15940 -56782 -78171 -277005 -226367 -360496 -257924 77667 -121556 -266959 -347488 94819 204527
15929 204527 -92702 -56222 -38109 -45331 -111064 175047 -93645 407581 186253 -156706 -179951
15918 -179951 -248588 -106720 -91217 -371274 -60657 -151796 -301847 137030 -20282 -34931 -73978
15907 -73978 -11398 -14056 214576 -146120 -180438 -205404 -52908 -128924 189792 -9171 68263
15895 -259652 66076 49436 -141173 425499 40126 -465867 254054 -37831 -73097 38533 -156443
15883 -161315 -290855 17734 130699 40028 91837 116750 171175 -241211 340754 -262490
15872 -121201 -96887 110084 2081 -71564 -64859 31982 -38136 115759 18577 -87986 -85419 -50991
15860 -50991 -105119 -85720 153837 -39847 -45659 31171 -351224 152407 -371471 77463 33868
$$ packed form
15940e6782k1389j98834N0638j34129J02572G7667a21556j45403q0529I4819J09708
15929B04527i2702L6480J8113p222o5733A75047i3645D07581A86253a56706k3245
15918a79951o8637a06720J5503k80057f0657r1139j50051A37030b0282j4649l9047
15907g3978a1398k658B14576a46120l4318k4966e2908p6016A89792i171F8263
15895b59652F6076j6640a41173D25499D0126d65867B54054c7831l5266C8533a56443
15883a61315j29540A7734J12965D0028N1809K4913N4425b41211C40754b62490
15872a21201K4314A10084B081g1564O705C1982c8136A15759A8577h7986K567L4428
15860e0991n4128J9399A53837c9847n812C1171c51224A52407c71471G7463C3868
$$ plain form
15848 85348 20803 79114 327903 -144373 20450 -117228 363048 12786 -173802 -334972
15838 -334972 -278 -143313 80893 201989 -50840 43821 189958 280814 -61507 35994 37805
15827 37805 59019 119396 -57992 27162 -113673 -38663 -165966 -87663 162999 -16753 -60647
15816 -60647 -351611 259992 -2916 61837 -279019 -312246 149838 -9975 -31211 -12559 -112014
15805 -112014 -19336 64291 59030 20380 -88664 -187195 5838 226899 -265566 21110 193363
15794 193363 -63555 -225839 -246241 -138631 76544 498899 54540 -111331 123109 -93987
15783 -23895 107399 106190 -329294 213300 159537 -123284 -133819 -243965 58691 -220098 882
15771 35619 -16142 -466926 -57763 -151995 -235647 223818 338794 135173 186465 -159093 -160333
$$ packed form
15848H5348B0803N8311K48789a44373B0450a17228C63048A2786a73802j61170
15838c34972b78j43035H0893J21096e0840D3821J46137R0856f1507C5994J811
15827C7805K1214O0377e7992B7162a13673c8663j27303P8303A62999a6753m3894
15816f0647k90964B59992b916F1837b79019l3227A49838i975k1236a2559r9455
15805a12014a9336F4291n261B0380h8664r8531E838K21061b65566B1110J72253
15794A93363f3555j62284k0402J07610G6544M22355E4540a11331A23109i3987
15783b3895A07399j209c29294B13300n3763a23284j0535j10146E8691b20098H82
15771C5619a6142m50784e7763r4232q3652B23818J14976A35173N1292a59093j240
$$ plain form
15760 -160333 94554 -62742 224533 -77321 17223 -211685 -38634 -236309 -39112 71139 104668
15749 104668 -22904 -52715 -101128 45879 203104 -74535 -292618 149151 119475 173848 -374333
15737 260748 -258899 -107369 -131180 -135463 -103310 -55232 -86109 158660 129627 -296154 183358
15725 -30116 6891 -155827 -171829 175134 -103701 234623 -243622 74379 -40959 -136413 29681
15713 148373 -17045 18997 347819 -59789 -25244 278010 69919 29791 30761 199145 -165096
15701 -57875 -424226 -143851 -54047 4430 -50607 80253 -42659 -164236 -52950 47446 54739
15690 54739 -49811 -112890 -268488 -27678 242109 -42642 -114654 105591 107411 -203432 -5209
15678 -158401 -244949 -147838 243262 -224374 104161 -311625 -62284 220576 106736 320435
$$ packed form
15760a60333I4554f2742B24533g7321A7223b11685c8634j97675c9112G1139L3529
15749A04668b2904k9811m8413D5879J57225g4535k18083A49151k9676N4373c74333
15737B60748b58899a07369k3811m283L2153M8078l0877A58660k9033b96154A83358
15725c0116F891a55827j6002A75134a03701B34623b43622G4379d0959r5454B9681
15713A48373a7045A8997L28822e9789b5244B78010F9919B9791R70J68384a65096
15701e7875l66351a43851e4047D430e0607H0253d2659j21577e2950D7446P293
15690E4739d9811o3079j55598b7678B42109d2642p2012A05591J820b03432e209
15678a58401q6548R7111B43262b24374A04161c11625f2284B20576A06736K13699
$$ plain form
15668 320435 -108915 -438995 116026 97473 34077 -77837 -185468 -124257 -114966 -212588 -268685
15657 -268685 -238101 -61888 -73841 -67052 52288 30003 -80243 93777 188221 -62060 -288704
15646 -288704 18596 51550 144371 48174 102773 208935 -455278 -149201 -294809 -122743
15635 185412 56064 72032 -20197 -205431 -91551 -120826 68512 105090 -55317 -123184 115686
15623 333724 66510 8940 -167241 -28545 3249 160421 197646 18433 -1529 -23010 -18428 174400
15610 -393520 -31686 -55099 70513 112925 176788 -32411 -28644 -25049 -221211 -89845 -63634 -205844
15598 -205844 -259154 -220527 -176379 -30031 -124525 267376 23621 102956 65205 75252 92325
15587 92325 -361806 227711 32757 120353 -24658 -146668 106737 36307 -121625 -143552 23518
$$ packed form
15668C20435a08915l30080A16026j8553C4077g7837j07631O1211R291r7622n6097
15657b68685L0584f1888j1953O789E2288k2285h0243I3777R4444f2060k26644
15646b88704A8596L2954R2821D8174N4599J06162d55278a49201j45608a22743
15635A85412E6064J5968b0197j85234i1551k9275F8512L6578e5317o7867A15686
15623C33724F6510H940a67241b8545C249J57172L7225A8433a529k1481M582A74400
15610c93520c1686k3413G0513M2412O3863c2411L767L595j96162h9845K6211j42210
15598b05844n3310L8627M4148c0031r4494B67376B3621P9335l7751J0047J7073
15587I2325c61806B27711C2757Q7596b4658j22010A06737C6307a21625k1927B3518
$$ plain form
15575 -68462 -39492 -172859 205374 103945 -187857 -279470 -89228 35808 -171267 -251717 -374315
15564 -374315 -28866 -121981 53564 135209 -218967 -15173 -216655 -216571 319501 358083 40060
15552 -7733 -342085 -292059 -263504 -3143 -232954 -386310 72846 -95884 -403643 -300626 107303
15540 39418 171323 114077 366267 -138144 -175681 -55799 -183868 -153609 -361695 141780
15529 -39952 207626 -114126 263641 -185325 40078 -19875 -317941 -131236 155053 -161233
15518 131051 110083 100473 37002 142885 131938 -134035 12011 -47565 164642 18098 -243832
15506 73866 4521 138657 -331200 -112101 98601 311899 153331 166278 -153214 46161 122006
15495 122006 190526 115976 256461 82595 25283 -239069 276692 -122962 155829 244621
$$ packed form
15575f8462K8970j33367B05374j01429a87857r1613h9228C5808a71267q0450j22598
15564c74315b8866r3115E3564Q1645b18967a5173k01482Q4C19501L8582D0060
15552g733l34352N0026K8555c143k29811j53356G2846i5884l07759J03017A07303
15540C9418J31905n7246K52190a38144l7537e5799j28069L0259k08086A41780
15529c9952B07626a14126B63641a85325D0078a9875k98066a31236A55053a61233
15518A31051k0968r610C7002J05883j0947a34035A2011d7565A64642A8098b43832
15506G3866D521J34136c31200a12101I8601K13298A53331J2947a53214D6161P5845
15495A22006O8520p4550J40485H2595B5283b39069B76692a22962A55829Q8792
$$ plain form
15485 244621 259385 -122229 -201737 -27426 13030 27174 -95943 111746 116651 -245468 138273
15473 193370 -21534 81556 -262820 -149907 190764 114174 -266330 -129805 212728 -66039
15462 -222519 264223 112394 151699 28108 -73298 -139243 144198 -49803 -46918 65722 24869
15450 593477 -31035 -823 22830 143243 221349 -84995 -4345 -110044 -91007 -89826 -104263 -48134
15437 -98163 -72274 77184 117914 -210370 299494 266177 141598 -23599 -75601 315707 -146238
15425 -63497 -75127 186045 104952 30791 245551 35571 -65143 65907 106712 96146 -74988
15413 82489 205634 137602 -26723 -152442 70215 -146693 409173 22591 -111962 -72546 -301719
15402 -301719 127866 -76963 -2080 311540 71071 -163273 -44404 -183226 15495 200406 -13419
$$ packed form
15485B44621J4764a22229p9508b7426A3030J4144i5943A11746M905b45468A38273
15473A93370b1534H1556b62820J12913A90764p6590b66330a29805B12728f6039
15462b22519B64223A12394L9305B8108g3298o5945A44198d9803K885F5722B4869
15450E93477c1035h23B2830J20413P8106h4995d345j05699J9037J181j4437d8134
15437i8163K5889G7184M0730b10370B99494l3317j24579b3599n2002C15707a46238
15425f3497j1630A86045q1093C0791K14760C5571f5143F5907M0805j0566g4988
15413H2489J23145o8032b6723j25719G0215a46693D09173B2591a11962L9416k29173
15402c01719A27866g6963b080C11540G1071a63273d4404j38822A5495J84911a3419
$$ plain form
15390 236611 -27017 -199253 160475 11316 -4056 -194836 160287 85525 -123992 70287 -168512
15378 -161948 -264535 10634 125470 192372 48778 -94415 -272783 -9767 386621 108528 178145
15367 178145 1733 188190 335676 257427 -483143 -275480 -175544 -312532 -14202 125567
15356 -14091 -21056 -241958 -194232 15835 -232873 98123 -218044 -66822 -27205 -71421 200782
15344 255929 105351 -108505 -220915 265727 91764 31852 -37752 382721 221164 -9509
15333 118587 71351 18359 101238 -30347 -77220 -1597 16416 -11800 -33932 244352 34139
15321 31680 3511 61582 25593 8546 235090 109438 218901 10694 -5957 8461 343987 -18098
15308 -21452 83241 12451 -42562 461007 -103669 9610 -164760 56022 -46487 84823 -151342
$$ packed form
15390B36611b7017j72236A60475A1316d056j90780A60287p4762a23992G0287a68512
15378a61948j02587A0634J14836O6902D8778i4415j78368i767C86621A08528O9617
15367A78145A733J86457J47486p8249d83143K07663R9936j36988a4202A25567
15356a4091o965k20902M7726A5835b32873I8123b18044f6822b7205m4216B00782
15344B55929A05351a08505j12410B65727I1764C1852c7752C82721j61557i509
15333A18587m7236A8359Q2879c0347m6873a597A6416a1800k2132B44352C4139
15321C1680C511N8071B5593H546K26544A09438J09463A0694e957H461L35526a8098
15308b1452H3241A2451d2562D61007a03669I610a64760E6022d6487H4823a51342
$$ plain form
15296 75521 88855 327482 -19277 92644 84786 -264297 43861 -100288 -123310 270185 201752
15285 201752 -230803 146867 -176134 120222 7527 -133216 -104303 125317 178476 215956
15275 215956 275187 18098 -118255 34278 286644 120064 -84546 -91972 -106906 225706 -75235
15263 153876 -247745 354272 122842 -272036 150476 276695 252127 170796 117043 200128
15253 200128 28469 256147 253602 164898 389631 368927 450394 830854 1468422 2480403
15243 2480403 2208045 1558118 2027270 1180532 516742 -51012 281866 12915 158286 -147723
15232 -77498 114116 -259978 360577 167549 33391 -125001 9557 -119301 201759 -98979
15221 -217784 118500 -125199 -58790 156194 -41274 -64578 -251007 87900 53817 63586 173676
$$ packed form
15296G5521J3334K38627a9277I2644p858b64297D3861a00288k3022B70185o8433
15285B01752b30803A46867a76134A20222G527a33216K8913A25317N3159L7480
15275B15956N9231A8098a18255C4278K52366A20064h4546p426j4934B25706g5235
15263A53876b47745C54272A22842b72036A50476J26219k4568q1331n3753Q3085
15253B00128B8469K27678k545q8704K24733k0704Q1467L80460O37568J011981
15243B480403k72358o49927M69152q46738E16742e1012B81866A2915J45371a47723
15232g7498A14116b59978C60577A67549C3391a25001I557a19301B01759i8979
15221b17784A18500a25199e8790A56194d1274k3304j86429H7900l4083R769J10090
$$ plain form
15210 173676 47168 -56856 65459 105455 284113 77514 -72382 -232996 243001 83233 223130
15199 223130 -133830 18298 17384 12312 226424 146024 234139 121188 92418 -209116 -145358
15188 -145358 363652 15657 220088 133846 43015 293036 -149497 239212 -55045 195990
15177 84701 16502 -108536 19011 -76903 122493 -141026 55578 12667 107158 356055 241254
15166 241254 184428 144468 41634 178662 243256 -17200 -62777 67301 -58338 226682 425994
15155 425994 -42779 203164 -169219 386056 3061 243631 206941 119210 74391 312286 -204717
15143 316234 396724 -69518 232883 220070 172744 553595 300317 85033 -40967 270997 286957
15132 286957 23059 174879 -238123 306098 86759 158443 232203 173983 300835 -70022 24619
$$ packed form
15210A73676D7168e6856F5459L9996J78658G7514g2382j60614B43001H3233J39897
15199B23130a33830A8298r14n072K14112q0400Q8115j12951k8770b09116O3758
15188a45358C63652A5657K04431q6242D3015K50021a49497B39212e5045A95990
15177H4701A6502a08536A9011g6903A22493a41026E5578A2667R4491K48897j14801
15166B41254n6826l9960D1634J37028O4594a7200m5577F7301e8338B26682J99312
15155D25994d2779B03164a69219C86056C061K40570l6690q7731m4819K37895b04717
15143C16234Q0490f9518B32883j2813m7326L80851k53278H5033d0967B70997J5960
15132B86957B3059J51820b38123C06098H6759P1684P3760n8220J26852g0022B4619
$$ plain form
15120 244467 111861 251366 255149 145357 222144 291759 129056 206684 392498 41316 -16770
15108 35790 -27430 -73350 21623 88174 341888 135972 605186 55404 31354 75653 197977
15097 197977 205771 397600 129267 188176 218588 216058 388527 383990 50987 179310 -228609
15085 41213 6186 30547 110993 15898 -49425 48159 211988 124427 288181 235906 240879 465131
15073 465131 9580 330405 118406 550197 190749 201279 410154 136171 224052 391895
15063 391895 190795 478327 53473 252646 431281 410168 140833 250682 55121 -202005
15052 18756 206563 302617 200566 97302 115186 256628 6823 552924 367700 208107 298935
15041 298935 232394 71471 204101 478952 56146 -82540 30327 18181 234678 -31823 174095
$$ packed form
15120B44467A11861J39505L783j09792P6787O9615A29056P7628J85814D1316a6770
15108C5790b7430m5920B1623O6551K53714A35972M69214E5404k4050M4299J22324
15097A97977P794J91829A29267N8909L0412k530J72469m537E0987J28323b28609
15085D1213F186K4361Q0446A5898d9425D8159J63829q7561J63754n2275M973K24252
15073D65131I580L20825A18406M31791A90749J0530K08875A36171Q7881J67843
15063C91895A90795K87532E3473J99173J78635k1113A40833J09849E5121b02005
15052A8756J87807R6054j02051I7302J7884J41442F823N46101j85224j59593R0828
15041B98935o6541G1471J32630K74851E6146h2540C0327j2146K16497c1823A74095
$$ plain form
15029 -152603 189236 487912 192879 63123 262272 216519 200519 132859 195390 447312
15019 447312 300730 -36063 81167 311701 46721 89162 156891 642568 139314 384976
15009 384976 290087 358354 19704 370405 608336 493312 142093 -85471 100667 409349
14999 409349 36027 432799 159311 341419 99378 187482 74831 37807 56332 450027 477528
14988 477528 293425 86375 -123157 281592 211285 425527 168462 139877 232198 232268 323958
14977 323958 42864 92049 7526 167713 117974 70775 536957 46517 -104965 31512 377230
14966 377230 229854 142136 41894 94171 210039 246210 317441 159347 78216 399524 449060
14955 449060 216143 227557 264948 292537 357166 246585 201053 155679 289204 474162 157810
$$ packed form
15029a52603A89236K98676A92879F3123J99149m5753j6000o7660O2531K51922
15019D47312j46582c6063H1167K30534D6721M2441O7729M85677A39314K45662
15009C84976r4889O8267A9704L50701K37931j15024A42093h5471A00667L08682
14999D09349C6027L96772A59311J82108I9378Q8104G4831l7024J8525L93695K7501
14988D77528j84103H6375a23157B81592p0307K14242A68462k8585R2321P0R1690
14977C23958D2864M9185G526J60187m9739m7199M66182D6517a04965C1512L45718
14966C77230j47376q7718D1894N2277J15868L6171P1231j58094G8216L21308M9536
14955D49060B16143J1414L7391K7589O4629j10581m5532m5374J33525J84958A57810
$$ plain form
14943 444362 -93215 127423 244950 379586 180050 418284 96847 369452 237292 340257
14933 340257 187335 572747 262446 802675 455474 662806 278417 344993 673482 453387
14923 453387 324485 237208 395221 232811 253855 266439 472467 354202 492968 206223
14912 570934 182510 446548 93184 450376 426056 169574 371722 578318 199875 352758
14902 352758 588672 320815 574650 315000 -46526 476689 367515 447855 21444 333307
14892 333307 5164 602564 221864 492536 361661 391533 453714 573604 315209 488733
14882 488733 257746 376270 475213 393955 338200 265938 278976 557453 151318 72016 358405
14871 358405 458196 732931 252207 488402 252521 282250 269650 758717 477632 603265
$$ packed form
14943D44362i3215A27423J17527J34636A80050K38234I6847K72605j32160J02965
14933C40257j52922L85412B62446N40229l47201K07332B78417O6576L28489k20095
14923D53387j28902q7277J58013j62410K1044J2584K06028j18265J38766B06223
14912E70934A82510K64038I3184L57192k4320A69574K02148K06596A99875J52883
14902C52758K35914k67857K53835k59650d6526D76689j09174Q0340B1444L11863
14892C33307E164N97400B21864K70672j30875K9872O2181J19890k58395J73524
14882D88733k30987J18524R8943q1258n5755p2262J3038K78477A51318G2016K86389
14871C58405R9791K74735B52207K36195k35881K9729j2600M89067k81085J25633
$$ plain form
14861 603265 616739 527747 598711 517347 353595 407174 640048 646184 504864 299895 512207
14850 512207 355343 310872 262656 613531 461090 656506 441241 312101 453002 484788
14840 484788 327948 367865 229856 442159 472898 505299 471557 592342 121636 631525
14830 631525 725450 582276 572514 229086 187078 490213 569130 642318 460346 601315 650006
14819 650006 -7134 559943 554046 235071 691962 336512 453146 922273 516465 488904
14809 488904 504006 348663 427994 502790 404538 725138 264526 824538 729578 716697 582870
14798 582870 331608 185887 718172 749406 538583 572905 600337 374788 654597 772018
14788 772018 319585 474817 580629 642908 710371 599721 462901 466565 787666 728938
$$ packed form
14861F03265J3474q8992P0964q1364j63752N3579K32874O136j41320k04969K12312
14850E12207j56864m4471m8216L50875j52441J95416k15265j29140J40901L1786
14840D84788j56840L9917j38009K12303L0739L2401l3742J20785A21636N09889
14830F31525R3925j43174r762B29086m2008L03135P8917P3188j81972J40969M8691
14819F50006g134E59943n897B35071M56891C36512J16634M69127m05808k7561
14809D88904J5102j55343P9331P4796r8252L20600B64526N60012r4960j2881j33827
14798E82870k51262j45721N32285L1234k10823L4322K7432k25549K79809J17421
14788G72018C19585J55232J05812O2279O7463j10650j36820L664L21101n8728
$$ plain form
14778 728938 575360 372744 796807 297820 1002167 504012 743509 493571 525485 829337
14768 829337 758592 563208 447353 1256489 805498 529084 730912 1015731 488252 575176
14758 575176 711276 855958 832755 704674 698141 457751 825327 545743 866995 839532
14748 839532 665645 757365 634891 713514 789867 617026 813328 580289 808011 577706
14738 577706 580433 498094 670209 774801 835575 579122 813318 845633 859979 739545 759645
14727 759645 892871 1077483 923839 725245 1010403 734625 1218066 866774 1054667 1085502
14717 1085502 928014 910200 1008500 831047 1022510 1177311 736377 665398 801674 1131665
14707 1131665 973960 750794 1012732 829886 646149 840213 784701 866139 930723 1203477
$$ packed form
14778G28938j53578k02616M24063B97820P04347m98155K39497k49938L1914L03852
14768H29337p0745j95384j15855Q09136m50991k76414K01828K84819D88252Q6924
14758E75176J36100J44682k3203j28081o533k40390L67576k79584L21252k7463
14748H39532j73887R1720j22474P8623P6353j72841J96302k33039K27722k30305
14738E77706K727q2339J72115J04592O0774k56453K34196L2315J4346j20434K0100
14727G59645J33226J84612j53644j98594K85158k75778M83441l51292J87893L0835
14717A085502j57488j7814R8300j77453J91463J54801m40934p0979J36276L29991
14707A131665j57705k23166K61938j82846j83737J94064n5512Q1438O4584K72754
$$ plain form
14697 1203477 1080391 938242 887586 1040869 1137658 1236984 1021445 732300 1176501 894062
14687 894062 1080454 682920 932541 808644 1139747 1506180 849243 1129435 1000858 1136007
14677 1136007 1097404 884047 1064378 876980 990594 1033344 1058217 796142 878318 1193557
14667 1193557 1189011 1244196 1153618 1092078 1382710 1084090 1284580 1318601 1151474 1288707
14657 1288707 1378510 1391488 1183834 1388798 1334201 1333095 1171110 1380106 1247390 1173998
14647 1173998 1404939 1124426 1179876 1208180 1351530 1354159 1657200 1494368 1399101 1247890
14637 1247890 1253893 1307828 1270226 1445127 1367779 1246068 1406604 1427794 1428577 1579672 1534904
14626 1534904 1648225 1791646 1624903 1739367 1488391 1968352 1810300 1618951 1770445
$$ packed form
14697A203477j23086j42149n0656J53283R6789R9326k15539k89145M44201k82439
14687H94062J86392l97534K49621j23897L31103L66433o56937K80192j28577J35149
14677A136007l8603k13357J80331j87398J13614M2750K4873k62075Q2176L15239
14667A193557m546N5185r0578o1540K90632k98620K00490L4021j67127J37233
14657A288707Q9803J2978k07654K04964n4597j106j61985K08996j32716p3392
14647A173998K30941k80513N5450K8304J43350K629L03041j62832r5267j51211
14637A247890O003N3935l7602J74901p7348j21711J60536K1190P83J51095m4768
14626A534904J13321J43421j66743J14464k50976M79961j58052j91349J51494
$$ plain form
14617 1770445 1748047 1422323 1752536 1790786 1712223 1471777 1722686 1825184 1778950 1544348
14607 1544348 1758307 1523732 1674066 1764621 1802095 2058818 1709382 1799688 1991025 1987006
14597 1987006 2028360 1904149 1868624 1925030 1949170 1809580 2105182 1922971 2071786 1838619
14587 1838619 2105535 2037741 2116450 2080345 2561299 2084339 2191705 2329576 1973603 2041042
14577 2041042 2229206 2257165 2404354 2298986 2005583 2081812 2406802 2594352 2596756 2845631
14567 2845631 2772450 2687958 2977202 2938792 3015164 2940933 2975203 3114937 3442986 3626627
14557 3626627 3516663 3924335 3965513 4288167 4707817 4930187 5870803 7185563 9597335
14548 9597335 13429036 20709673 32901825 37255106 18803836 8337838 4701999 4554306
$$ packed form
14617A770445k2398l25724L30213L8250p8563k40446K50909J02498m6234k34602
14607A544348K13959k34575J50334R0555L7474K56723l49436R0306J91337m019
14597A987006M1354j24211l5525N6406K4140j39590K95602j82211J48815k33167
14587A838619K66916o7794P8709l6105M80954m76960J07366J37871l55973O7439
14577B041042J88164K7959J47189j05368k93403P6229L24990J87550K404K48875
14567B845631p3181q4492K89244l8410P6372p4231L4270J39734L28049J83641
14557C626627j09964M07672M1178L22654M19650K22370R40616J314760K411772
14548I597335L831701P280637J2192152M353281j8451270H337838l635839j47693
$$ plain form
14540 4554306 5647334 6505862 3629783 2442491 2599470 2527760 2350742 2356860 2396651 2501697
14530 2501697 2675073 2755708 2767947 2164672 2598465 2733458 2822674 2798229 2672798 2691018
14520 2691018 2762412 2948365 3088610 2669127 2878380 2935334 3437060 3307273 3395341 2971859
14510 2971859 3573320 3146154 3399263 3137196 3253570 3414451 3493032 3377707 3579555 3249396
14500 3249396 3587205 3662784 3684273 3670697 4077038 3910710 3711768 3938930 4257164 3746747
14490 3746747 4245004 3960028 4238068 4042255 4026518 4232481 4164927 4191781 4538329 4734019
14480 4734019 4413076 4527652 4439571 4872399 4467840 4596127 4677832 4694828 4872797 4963507
14470 4963507 4927193 4716680 5111292 4825125 5127822 5217545 5391592 5163518 5226471 5734640
$$ packed form
14540D554306J093028Q58528k876079j187292J56979p1710j77018O118L9791J05046
14530B501697J73376Q0635J2239o03275M33793J34993Q9216k4445j25431J8220
14520B691018P1394J85953J40245m19483K09253N6954N01726j29787Q8068m23482
14510B971859O01461m27166K53109k62067J16374J60881P8581j15325K01848l30159
14500C249396L37809P5579K1489j3576M06341j66328j98942K27162L18234n10417
14490C746747M98257k84976K78040j95813j5737K05963o7554K6854L46548J95690
14480D734019l20943J14576q8081M32828m04559J28287Q1705J6996J77969R0710
14470D963507l6314k10513L94612k86167L02697Q9723J74047k28074O2953N08169
$$ plain form
14460 5734640 5570126 5445512 5518659 5674555 5727862 5939461 5655541 5897401 6264518 5997652
14450 5997652 6030631 6591511 6268224 6480420 6193131 6567827 6791905 6758559 6825464 6852981
14440 6852981 6749847 7165998 7407847 7045281 6998788 7396623 7368635 7726536 7664562 7670282
14430 7670282 7984692 8014566 7829428 8156657 8449557 8433459 8561205 8483178 8885786 8891543
14420 8891543 9519904 9056492 9325237 9655388 9771897 9692685 9951140 9887604 9665688 10436280
14410 10436280 10307361 10680714 10604077 10833200 10855610 11299870 11380528 11687875 11696798 11946630
14400 11946630 11917438 12195628 12713044 12441109 12788408 13233491 13624556 13304605 13778693
14391 13778693 14012846 14134056 14410484 14631001 14752854 15020398 15378814 15610689 16065321
$$ packed form
14460E734640j64514j24614P3147J55896N3307K11599k83920K41860L67117k66866
14450E997652L2979N60880l23287K12196k87289L74696K24078l3346O6905K7517
14440F852981j03134M16151K41849l62566m6493L97835k7988L57901o1974N720
14430G670282L14410K9874j85138L27229K92900j6098J27746p8027M02608N757
14420H891543O28361m63412K68745L30151J16509p9212K58455o3536k21916P70592
14410A0436280j28919L73353p6637K29123K2410M44260Q0658L07347Q923K49832
14400A1946630k9192K78190N17416k71935L47299M45083L91065l19951M74088
14391A3778693K34153J21210K76428K20517J21853K67544L58416K31875M54632
$$ plain form
14382 16065321 16189937 16343616 16623862 17070475 17367620 17847396 18146869 18335689 18716497
14373 18716497 18728893 19281858 19511239 20435819 20730438 20986066 21717897 22258298 22137688
14364 22137688 22727503 23080683 23741596 24239483 24681006 25535698 25938587 26052998 26728040
14355 26728040 27428148 28187674 28515409 29220279 30078451 30849971 31352321 32123325 33072917
14346 33072917 34040201 34863910 35734202 36554250 37125858 38369912 39258844 40707467 41886994
14337 41886994 42964851 44078301 44988611 46538671 47458743 49228354 50488466 52444554
14329 52444554 53854003 55223735 57093043 58722043 60538956 62363716 64781520 67090789
14321 67090789 69115777 71370492 73807206 76339593 78969232 82110798 85084680 88057517
$$ packed form
14382A6065321J24616J53679K80246M46613K97145M79776K99473J88820L80808
14373A8716497J2396N52965K29381R24580K94619K55628P31831N40401j20610
14364B2137688N89815L53180O60913M97887M41523Q54692M02889J14411O75042
14355B6728040P00108P59526L27735P04870Q58172P71520N02350P71004R49592
14346C3072917R67284Q23709Q70292Q20048N71608J244054Q88932J448623J179527
14337D1886994J077857J113450R10310J550060R20072J769611J260112J956088
14329E2444554J409449J369732J869308J629000J816913J824760K417804K309269
14321F7090789K024988K254715K436714K532387K629639L141566K973882K972837
$$ plain form
14313 88057517 90973354 94856500 98428672 102007799 106001133 110162395 114395550 119284196
14305 119284196 123881756 129115251 134213286 140269818 146412417 152568207 159202236 166661710
14297 166661710 173757998 181553949 190154236 198779252 208125373 217657082 227514553 237906184
14289 237906184 249150618 260595657 272550445 285178621 297886505 310918579 324610758
14282 324610758 338090919 351647322 365627758 378759324 391966416 404259352 415654531
14275 415654531 425918692 433310288 437284215 438646314 440047686 441795480 443895369 441706511
14267 441706511 438448806 431760280 422016615 410141163 396663627 382390370 367188770
14260 367188770 351505036 336118513 320819929 305579426 290758894 276480835 262708546
$$ packed form
14313H8057517K915837L883146L572172L579127L993334M161262M233155M888646
14305A19284196M597560N233495N098035O056532O142599O155790O634029P459474
14297A66661710P096288P795951Q600287Q625016R346121R531709R857471J0391631
14289B37906184J1244434J1445039J1954788J2628176J2707884J3032074J3692179
14282C24610758J3480161J3556403J3980436J3131566J3207092J2292936J1395179
14275D15654531J0264161P391596L973927J362099J401372J747794K099889k188858
14267D41706511l257705o688526r743665j1875452j3477536j4273257j5201600
14260C67188770j5683734j5386523j5298584j5240503j4820532j4278059j3772289
$$ plain form
14253 262708546 249183258 236737551 225011460 215331325 204630927 194211870 184429576
14246 184429576 175458399 167002553 159445273 151613387 144235616 137785551 131852529 125653533
14238 125653533 120292722 115015062 110175459 105161363 101105894 96678863 92977208 89564305
14230 89564305 85962754 82360568 79389821 76338160 73088750 70640253 68047592 65644795
14222 65644795 63260110 61472339 59170257 57372241 55177295 53478493 52079802 50397957
14214 50397957 48748252 47572449 45913272 44608233 43069583 42081741 40863407 40241681
14206 40241681 39027247 38136758 36512466 35538478 34619107 33805003 33334861 32108453 31301825
14197 31301825 30480411 29778107 29091743 28368333 27580404 27153295 26344863 25716587 25334617
$$ packed form
14253B62708546j3525288j2445707j1726091r680135j0700398j0419057r782294
14246A84429576q971177q455846p557280p831886p377771o450065n933022o198996
14238A25653533n360811n277660m839603n014096m055469m427031l701655l412903
14230H9564305l601551l602186k970747l051661l249410k448497k592661k402797
14222F5644795k384685j787771k302082j798016k194946j698802j398691j681845
14214E0397957j649705j175803j659177j305039j538650r87842j218334o21726
14206D0241681j214434q90489j624292r73988r19371q14104m70142j226408q06628
14197C1301825q21414p02304o86364p23410p87929m27109q08432o28276l81970
$$ plain form
14188 25334617 24381370 23932707 23706854 23179996 22456755 21906861 21306782 21080674 20605035
14179 20605035 19948256 19639023 19414820 18829156 18549787 18377421 17660218 17268658 16993273
14170 16993273 17015472 16623119 16530701 15772875 15428270 15517532 15006711 14486530 14624770 14071514
14160 14071514 14102976 13824791 13423192 13237151 13539462 12797498 12367469 12337537 11932849 11985830
14150 11985830 11585020 11623483 11424906 11130960 10913084 10935849 10829745 10655040 10610257 10047386
14140 10047386 10094727 9675150 9611004 9837361 9772981 9121851 9410805 9200824 8937082 8902814
14130 8902814 8703051 8501241 8368841 8227421 8432789 7994388 7921401 7922391 7955006 7299921
14120 7299921 7594343 7213537 7605528 7381574 7113942 7264933 7171503 6996766 6673782 6972297
$$ packed form
14188B5334617r53247m48663k25853n26858p23241n49894o00079k26108m75639
14179B0605035o56779l09233k24203n85664k79369j72366p17203l91560k75385
14170A6993273K2199l92353r2418p57826l44605Q9262n10821n20181J38240n53256
14160A4071514L1462k78185m01599j86041L02311p41964m30029k9932m04688N2981
14150A1985830m00810L8463j98577k93946k17876K2765j06104j74705m4783n62871
14140A0047386M7341m19577o4146K26357o4380o51130K88954k09981k63742l4268
14130H902814j99763k01810j32400j41420K05368m38401p2987R90L2615o55085
14120G299921K94422l80806L91991k23954k67632J50991r3430j74737l22984K98515
$$ plain form
14110 6972297 6835533 6597278 6461187 6621394 6157383 6253934 6316364 6022195 5807146 6216738
14100 6216738 6110121 5873017 5598410 5905408 5819652 5525145 5342610 5719664 5462002 5257412
14090 5257412 5254927 5293193 5343522 5184726 5077944 4973471 5000794 4965234 5045820 4975646 5015400
14079 5015400 4739579 4641737 4672981 4634903 4313206 4170282 4461659 4519270 4190171 4091377
14069 4091377 3879051 4265145 4196240 4207959 4342001 3983613 4042121 3488234 4185739 3786855
14059 3786855 3919478 3976928 3946154 3712156 3514564 3546086 3617642 3678889 3538449 3297022
14049 3297022 3351341 3635096 3564407 3427356 3322268 3432467 3222576 3164694 3270529 3350320
14039 3350320 3303283 3223858 3330113 3220028 2718893 3150291 3007845 3078990 2937377 2898323
$$ packed form
14110F972297j36764k38255j36091J60207m64011R6551O2430k94169k15049M09592
14100F216738j06617k37104k74607L06998q5756k94507j82535L77054k57662k04590
14090E257412k485L8266N0329j58796j06782j04473K7323l5560Q0586p0174L9754
14079E015400k75821r7842L1244l8078l21697j42924K91377N7611l29099r8794
14069D091377k12326L86094o8905J1719J34042l58388N8508n53887O97505l98884
14059C786855J32623N7450l0774k33998j97592L1522P1556O1247j40440k41427
14049C297022N4319K83755p0689j37051j05088J10199k09891n7882J05835P9791
14039C350320m7037p9425J06255j10085n01135M31398j42446P1145j41613l9054
$$ plain form
14029 2898323 3136724 2950956 2857257 2910142 2761718 3014755 2893762 2852414 2663320 2935647
14019 2935647 2979614 2542207 2688861 2607479 2650774 2597683 2368055 2474355 2348941 2413400
14009 2413400 2635136 2467497 2468288 2644623 2478395 2341273 2243675 2658502 2428091 1956136
13999 1956136 2127781 2284956 2361122 2136251 2216647 2498872 2867587 2945928 3131725 3511822
13989 3511822 5387435 8955072 14990500 27230635 38321890 24163738 12340430 7565535
13981 7565535 5650754 4622738 4132882 3581435 3067424 3006694 3064614 2557875 2859042
13972 2859042 2671131 2504933 2699220 2404161 2507381 2588112 2327442 2331594 2117566 2276305
13962 2276305 2102510 2084165 2175841 2125258 2167729 2125128 1800904 1846695 2017401 1701052
$$ packed form
14029B898323K38401j85768r3699N2885j48424K53037j20993m1348j89094K72327
14019B935647M3967m37407J46654q1382M3295n3091k29628J06300j25414O4459
14009B413400K21736j67639P91J76335j66228j37122r7598M14827k30411m71955
13999A956136J71645J57175P6166k24871Q0396K82225L68715P8341J85797L80097
13989C511822J875613L567637O035428J2240135J1091255j4158152j1823308m774895
13981G565535j914781j028016m89856n51447n14011o0730N7920n06739L01167
13972B859042j87911j66198J94287k95059J03220Q0731k60670M152k14028J58739
13962B276305j73795j8345R1676n0583M2471m2601l24224M5791J70706l16349
$$ plain form
13952 1701052 2070825 2158832 1742860 1730924 1834686 1999424 1799454 2062271 1836052 1722075
13942 1722075 1583357 1709471 1733202 1682473 1817911 1695780 1840400 1255756 1658018 1703729
13932 1703729 1582135 1441463 1715082 1646587 1500196 1841687 1575187 1679041 1564325 1595159
13922 1595159 1772167 1708312 1504037 1436754 1376315 1898299 1252899 1490037 1548720 1467093
13912 1467093 1523172 1439814 1405745 1747767 1444143 1508915 1601219 1173926 1339622 1836935
13902 1836935 1406633 1450721 1484080 1113967 1423638 1305521 1106013 1035505 1667529 1221205
13892 1221205 1420942 907589 1136215 1176258 1539053 1351000 1068614 1461938 1052280 1335671
13882 1335671 1120832 1554529 992444 1160117 1402039 1296916 1140265 1506787 1270545
$$ packed form
13952A701052L69773Q8007m15972j1936J03762J64738j99970K62817k26219j13977
13942A722075j38718J26114K3731n0729J35438j22131J44620n84644M02262M5711
13932A703729j21594j40672K73619o8495j46391L41491k66500J03854j14716L0834
13922A595159J77008o3855k04275o7283o0439N21984o45400K37138N8683q1627
13912A467093N6079q3358l4069L42022l03624O4772R2304m27293J65696M97313
13902A836935m30302M4088L3359l70113L09671j18117j99508p0508O32024m46324
13892A221205J99737n13353K28626M0043L62795j88053k82386L93324m09658K83391
13882A335671k14839M33697n62085J67673K41922j05123j56651L66522k36242
$$ plain form
13873 1270545 1156929 1105714 1148351 1052358 1054747 1240946 1070990 805658 654855 923884
13863 923884 1174686 977707 1069671 1155536 1139623 1065429 934100 1124657 1068903 1066401 983919
13852 983919 1104791 930423 929786 1207273 1197648 928494 955887 737616 913536 888628 1265060
13841 1265060 1054118 1356493 863281 959107 876144 1018787 588919 935369 1160440 921724
13831 921724 910690 794996 843946 932940 663889 438494 933370 720255 1037246 876102
13821 876102 648216 642240 998159 824825 833066 843146 885099 1035011 1157743 793657 992978
13810 992978 969546 699338 992099 789411 690468 709500 639352 881696 880371 739413 1072733
13799 1072733 533328 518437 1007914 808111 668101 860097 647011 589183 968219 827054
$$ packed form
13873A270545j13616n1215M2637r5993K389J86199j69956k65332j50803K69029
13863I23884K50802j96979R1964Q5865j5913p4194j31329J90557n5754k502q2482
13852I83919J20872j74368o37K77487r625k69154K7393k18271J75920k4908L76432
13841A265060k10942L02375m93212R5826q2963J42643m29868L46450K25071k38716
13831I21724j1034j15694M8950Q8994k69051k25395M94876k13115L16991j61144
13821H76102k27886n976L55919j73334Q241J0080M1953J49912J22732l64086J99321
13810I92978k3432k70208K92761k02688r8943J9032p0148K42344j325j40958L33320
13799A072733E33328j4891M89477j99803j40010J91996k13086n7828L79036j41165
$$ plain form
13789 827054 1051111 1037133 477283 721587 883445 524677 896039 645670 900521 712266
13779 712266 884357 917652 929073 801069 847543 589181 494398 766142 704601 950804
13769 950804 924387 474367 762726 730719 752808 559996 463405 1134331 806516 522779
13759 522779 849124 667473 761010 650285 464381 543928 733944 610736 717845 686383
13749 686383 315086 509485 488157 711618 276593 436035 597383 513691 389664 585227
13739 585227 283034 624586 266681 734111 517258 602638 483108 548607 397987 632821
13729 632821 640279 717727 660480 663940 1118170 327496 171629 320982 457557 561955 798363
13718 798363 565353 288089 224332 421433 373483 747988 840256 679000 467144 615900
$$ packed form
13789H27054K24057j3978D77283K44304J61858l58768L71362k50369K54851j88255
13779G12266J72091L3295J1421j28004M6474k58362r4783K71744o1541K46203
13769I50804k6417m50020K88359l2007K2089j92812r6591O70926l27815k83737
13759E22779L26345j81651R3537j10725j85904P9547J90016j23208J07109l1462
13749F86383C15086J94399k1328K23461B76593J59442J61348q3692j24027J95563
13739E85227B83034L41552B66681M67430k16853Q5380j19530O5499j50620K34834
13729F32821P458P7448n7247L460M54230C27496j55867J49353J36575J04398K36408
13718G98363k33010k77264o3757J97101m7950L74505R2268j61256k11856J48756
$$ plain form
13708 615900 458009 203760 455148 336603 582684 572300 389681 465488 646684 435970
13698 435970 745279 257316 952727 553859 519331 481935 574633 591095 400164 589034
13688 589034 492707 528591 623193 596496 429083 545809 561693 606262 401780 443121 371490
13677 371490 472946 -48588 329427 348254 480742 385482 253395 620886 401763 258563
13667 258563 427740 477782 345978 596065 423405 181174 468457 550771 733414 647191
13657 647191 502213 748142 254551 170333 432274 367876 341380 421330 422474 598387 466272
13646 466272 513717 310293 737017 344081 282670 428634 609371 661414 442687 494089
13636 494089 444123 311246 156862 272792 246915 52264 387848 198394 406393 268606
$$ packed form
13708F15900j57891B03760K51388j18545K46081j0384j82619P5807J81196k10714
13698D35970L09309B57316O95411l98868l4528l7396R2698J6462j90931J88870
13688E89034r6327L5884R4602k6697j67413J16726J5884M4569k04482M1341p1631
13677C71490J01456d8588C29427J8827J32488r5260j32087L67491k19123j43200
13667B58563J69177N0042j31804K50087j72660A81174K87283Q2314J82643q6223
13657F47191j44978K45929B54551q4218K61941o4398k6496P9950J144J75913j32115
13646D66272M7445k03424M26724C44081o1411J45964J80737N2043k18727N1402
13636D94089m9966j32877j54384J15930k5877E2264L35584j89454K07999j37787
$$ plain form
13626 268606 343115 439776 398007 344566 398109 610890 389084 442060 445169 293972 483589
13615 483589 522110 477040 380547 287267 347469 413448 325476 417419 225131 252635 407345
13604 407345 470910 311900 540619 300120 583196 251886 344846 280197 284204 392726
13594 392726 245004 217996 348992 248778 308678 276859 306175 117669 378864 289634
13584 289634 296729 334183 672776 274944 716585 512222 309180 380920 566841 250406
13573 224627 133184 485940 710534 382421 347125 249070 358184 615242 319913 310383
13563 310383 251370 306018 311989 478348 357090 302542 409331 399050 544987 500459 193214
13551 284545 354159 448649 310274 612490 458319 258121 -78995 577651 356201 414179
$$ packed form
13626B68606P4509R6661m1769n3441N3543K12781k21806N2976L109j51197J89617
13615D83589L8521m5070r6493r3280O0202O5979q7972R1943j92288K7504J54710
13604D07345O3565j59010K28719k40499K83076B51886R2960o4649M007J08522
13594C92726j47722k7008J30996j00214N9900l1819K9316A17669K61195q9230
13584B89634P095L7454L38593B74944M41641k04363k03042P1740J85921B50406
13573B24627r1443L52756K24594l28113l5296r8055J09114K57058k95329r530
13563C10383n9013N4648N971J66359j21258n4548J06789j0281J45937m4528A93214
13551B84545O9614R4490j38375L02216j54171k00198g8995E77651k21450N7978
$$ plain form
13541 414179 107621 470512 153916 271761 198133 397997 486937 490216 226897 359236
13531 359236 163960 -10219 679110 101425 227370 134556 -103369 174011 506837 322133
13521 322133 -12952 298953 290730 206277 383504 -94333 18348 -212447 17405 204678 380262
13510 380262 510093 240240 535731 477971 435873 217114 -84309 91188 367589 459098
13500 459098 297060 189364 139808 201330 121038 325204 392225 228487 329551 30835
13489 180901 359285 137376 466833 95865 285934 171172 249031 89625 480668 305606
13479 305606 175890 112832 432760 581248 406356 -128026 333603 259686 422808 268482
13469 268482 -44690 203529 281888 236740 174461 287309 229069 -109316 72046 121613 388749
$$ packed form
13541D14179A07621L62891A53916J17845p3628J99864Q8940L279B26897J32339
13531C59236A63960a0219F79110A01425J25945r2814a03369A74011L32826j84704
13521C22133a2952B98953q223q4453J77227i4333A8348b12447A7405J87273J75584
13510C80262J29831B40240K95491n7760m2098B17114h4309I1188K76401R1509
13500D59098j62038j07696m9556O1522q0292K04166O7021j63738J01064C0835
13489A80901J78384A37376L29457I5865J90069j14762P7859H9625L91043j75062
13479C05606j29716o3058L19928J48488j74892a28026C33603p3917J63122j54326
13469B68482d4690B03529P8359m5148o2279J12848n8240a09316G2046M9567K67136
$$ plain form
13458 388749 301754 169518 38423 360430 62368 251016 43530 303723 -35033 131991
13447 238531 196990 328976 177717 364831 118425 254551 -120441 107327 199127 172269
13437 172269 302038 128442 203217 236008 540876 149834 448635 529493 282964 216970
13427 216970 29174 338652 31845 96053 397663 242772 34655 224101 276474 92681 143245
13416 143245 207330 429788 192588 282829 -75516 121655 210400 93760 336000 212016
13406 212016 -112607 274106 392501 217901 323780 53554 197490 339146 415093 -95906
13395 73224 309656 389744 -18949 279912 37311 193143 181988 450728 113625 62085 199558
13384 199558 173037 196627 17649 100305 -147771 218948 435453 430253 142148 -7119 -131317
$$ packed form
13458C88749q6995j32236C8423L22007F2368J88648D3530K60193c5033A31991
13447B38531m1541J31986j51259J87114A18425J36126a20441A07327R1800k6858
13437A72269J29769A28442P4775L2791L04868A49834K98801Q0858k46529o5994
13427B16970B9174L09478C1845O4208L01610j54891C4655J89446N2373I2681N0564
13416A43245O4085K22458A92588R0241g5516A21655Q8745I3760K42240j23984
13406B12016a12607B74106J18395j74600J05879E3554J43936J41656P5947i5906
13395G3224K36432Q0088a8949B79912C7311J55832j1155K68740A13625n1540J37473
13384A99558k6521K3590A7649Q2656a47771B18948K16505n200A42148g119j24198
$$ plain form
13373 -131317 20078 354764 183893 451218 -61589 6527 253342 335553 270311 165134 144986
13362 144986 -70572 49045 236406 136160 191618 217190 52280 395573 137660 13112 110267
13351 110267 244926 319416 366704 313808 533303 232790 126293 440206 224196 358142
13341 358142 66575 407757 248822 506338 164668 71338 -25045 233820 39623 234261
13331 234261 374069 192621 -3872 517626 221361 16074 296358 289159 108450 51091 -18489
13319 184079 219068 489186 230806 125083 126258 129425 372886 407375 111493 229734 184896
13308 184896 263009 338331 271622 382517 236514 103543 278815 266008 -20869 149183
13297 210036 238250 141763 153851 287014 208547 159355 -37871 31033 53904 227541 255824
$$ packed form
13373a31317B0078L34686j70871K67325f1589F527K46815Q2211o5242j05177k0148
13362A44986g0572D9045J87361j00246N5458K5572E2280L43293A37660A3112R7155
13351A10267J34659P4490M7288n2896K19495B32790j06497L13913k16010J33946
13341C58142F6575L41182j58935K57516A64668G1338b5045B33820C9623J94638
13331B34261J39808j81448c872E17626B21361A6074K80284p199A08450E1091a8489
13319A84079L4989K70118B30806j05723J175L167K43461L4489A11493J18241m4838
13308A84896P8113P5322o6709J10895j46003A03543J75272j2807b0869A49183
13297B10036K8214r6487J2088J33163p8467m9192c7871C1033K2871J73637K8283
$$ plain form
13286 255824 510756 268643 63735 -357500 -63395 220828 144966 94821 -16249 67338 695971
13275 695971 121052 70395 237830 177205 225605 -154303 253689 -118663 -22656 332843
13264 70001 154136 -124035 263515 240706 142930 228424 25098 16727 155673 141701 561581
13253 561581 -110559 -12676 -2001 -69275 180808 171594 57024 302892 102004 -208737 -149947
13242 -149947 213908 -108899 -135066 -27486 251595 268135 60489 -152278 279673 144946
13232 144946 255518 -143923 329992 -4155 296212 36572 282333 -15598 -203127 49105
13221 -84941 19262 -163521 -39198 14793 -254227 -98079 -92357 127370 156719 62236 -75172
13209 263915 316879 224858 16676 269213 196873 -33599 506358 -15542 -183337 -327330 160488
$$ packed form
13286B55824K54932k42113F3735c57500f3395B20828p5862n0145a6249F7338O28633
13275F95971A21052n0657J67435o0625M8400a54303B53689a18663b2656C32843
13264G0001Q4135a24035B63515k2809r7776Q5494B5098q371J38946j3972M19880
13253E61581a10559a2676b001o7274A80808r214E7024K45868A02004b08737N8790
13242a49947B13908a08899k6167b7486B51595J6540F0489a52278B79673j34727
13232A44946J10572a43923C29992d155B96212C6572K45761a5598j87529D9105
13221h4941A9262a63521c9198A4793b54227i8079N722A27370K9349F2236g5172
13209B63915N2964r2021A6676K52537p2340c3599E06358a5542j67795j43993A60488
$$ plain form
13197 133520 282733 172828 164114 224844 277294 275746 78158 40518 43068 69612 37928 190419
13185 190419 329001 -244587 350532 42749 167576 30458 151450 376053 132612 -232591
13174 86965 -55311 126148 177849 417704 71577 142138 59776 -12983 544390 242740 203153
13163 203153 -98677 334341 214003 197396 304113 -129178 270884 58498 62328 -9718 -48831
13152 -48831 99155 399959 71308 160310 -33207 97583 181264 245507 -153082 -8003 23578
13140 -134032 -4298 81779 52080 -119146 529949 -148966 67378 -15278 195456 50865 41161
13129 41161 21216 180376 272716 -71331 184388 118054 -17543 -121617 -59453 244172 20372
13117 -20256 -48964 125689 24365 99191 12593 194434 129378 28934 96890 -178784 102356
$$ packed form
13197A33520J49213j09905q714O0730N2450j548G8158l7640K550K6544l1684J52491
13185A90419J38582b44587C50532D2749J24827C0458J20992K24603A32612b32591
13174H6965e5311A26148N1701K39855G1577P0561E9776a2983E44390B42740l9587
13163B03153i8677C34341j20338j6607J06717a29178B70884E8498L830i718l9113
13152d8831I9155L00804G1308Q9002c3207I7583Q3681O4243a53082h003B3578
13140a34032d298H1779k9699a19146E29949a48966F7378a5278A95456E0865r704
13129D1161j9945J59160R2340g1331A84388o6334a7543j04074e9453B44172B0372
13117b0256k8708A25689B4365P4826A2593J81841o5056B8934O7956a78784A02356
$$ plain form
13105 178496 -177794 243770 164383 -21538 -29329 130048 519693 128656 5911 -167214 217586
13093 40635 -32859 -351420 -339509 352829 74870 -102450 -1583 6672 60030 8359 55682 -119104
13080 6305 -85049 221823 -194795 -170790 53593 105881 120960 -160745 255949 -127090 109763
13068 -157141 2900 129910 135938 27421 -140764 39793 -242389 176506 125197 278692 16795
13056 278209 -117736 82560 276923 58284 7794 50447 4150 220420 60647 -73148 257335
13044 233127 6991 154723 -62340 385481 449147 108968 -76041 -17613 22169 275349 99629
13032 123189 -150700 52264 -44780 -118639 -225452 238715 23200 245767 -48799 137405
13021 19030 19899 15651 276141 -142769 -168638 235738 199902 56621 -163881 235526 278614
$$ packed form
13105A78496a77794B43770p9387b1538p791A30048L89645A28656E911a67214B17586
13093D0635c2859l18561J1911C52829G4870a02450a583F672N3358H359M7323a19104
13080F305h5049B21823a94795K4005E3593N2288J5079a60745B55949a27090A09763
13068a57141B900J27010O028B7421a40764C9793b42389A76506n1309J53495A6795
13056B78209a17736H2560J94363E8284G794M2653D150K16270F0647g3148B57335
13044B33127F991J47732f2340C85481O3666A08968g6041a7613B2169K53180I9629
13032A23189a50700E2264d4780p3859j06813B38715B3200K22567d8799A37405
13021A9030Q69m248K60490a42769k5869B35738l5836E6621a63881B35526M3088
$$ plain form
13010 278614 -109492 67568 -122496 -66972 78867 37968 263104 11482 -40432 4804 -138120
12998 5688 24224 118485 -47376 316892 300120 210488 -13307 -174169 76672 107924 138234
12987 138234 -211911 125905 376300 -174405 11939 -73733 117121 238740 154954 64486
12976 154879 -27769 -128675 -153452 246444 -10978 217224 -45664 -36255 -151604 306033 246245
12965 246245 197740 70239 40512 188373 234679 357838 52431 -175805 -84057 75930 90875
12954 90875 165885 26451 387 236330 81950 -55993 -141609 91416 9659 -140366 -114133 166378
12941 243823 358756 191477 142483 -192768 383011 46457 195155 -180500 58543 95423
12931 95423 391137 -159703 -51150 156337 42875 59266 -216490 -166299 -103918 317440 148566
$$ packed form
13010B78614a09492F7568a22496N5524G8867C7968K25136A1482d0432D804a38120
12998E688J8536R4261d7376C16892j6772q9632a3307j60862G6672L1252L0310
12987A38234b11911A25905K50395a74405A1939g3733A17121J21619q3786F4486
12976A54879b7769j00906k4777B46444a0978B17224d5664R409j15349C06033n9788
12965B46245m8505G0239k9727J47861M6306J23159E2431a75805h4057G5930J4945
12954I0875P5010B6451C87K35943H1950e5993q5616I1416I659a40366K6233A66378
12941B43823J14933j67279m8994a92768C83011D6457J48698a80500E8543L6880
12931I5423K95714a59703e1150A56337D2875J6391b16490N0191O2381C17440A48566
$$ plain form
12919 48346 41952 -9025 -91228 171643 677 213375 148123 -18885 272674 42769 239439 206108
12907 206108 21776 171757 -11795 -112531 -82140 -120677 -144094 249613 227242 207953 -98620
12895 66560 -284346 181995 24046 80716 -142313 534840 73254 25158 13259 -138738 236140
12883 102849 36963 -216289 -142369 -37468 -13523 -8595 19988 -51329 5252 24739 -239999
12871 352145 -276720 -124525 89328 -156403 111728 183992 -135265 -48672 51984 373003
12861 373003 246533 48317 86519 -63206 -98749 -197981 103017 11146 151404 163500 205245
12850 205245 162747 195149 48897 183610 62589 57111 136502 -29935 75240 -2940 192218
12838 -60716 -28355 -255940 -43353 19906 -77814 122592 -220203 92186 156672 -152799 -29025
$$ packed form
12919D8346o394i025q2203A71643F77K12698o5252a8885B72674D2769J96670l3331
12907B06108B1776J49981a1795j00736L0391l8537k3417B49613k2371j9289i8620
12895F6560b84346A81995B4046N6670a42313E34840G3254B5158j1899a38738B36140
12883A02849C6963b16289P3920c7468a3523M928A9988e1329E252J9487b39999
12871C52145b76720a24525H9328a56403A11728P2264a35265d8672E1984L21019
12861C73003j26470D8317L8202f3206l5543r9232A03017A1146J40258J2096M1745
12850B05245m2498L2402D8897J34713F2589n478P9391b9935G5240b940A92218
12838f0716b8355k27585d3353A9906g7814A22592b20203I2186O4486a52799b9025
$$ plain form
12826 -256611 -135178 -18068 96381 114154 -172632 114858 11582 96056 -186677 -243811 -284016
12815 -284016 -53325 -240276 79873 -40430 -11423 -175067 235330 -223442 3282 -226716 251065
12803 -34723 -31149 266003 126496 -27433 -25510 99094 142889 -224230 -57484 -132219 -192704
12792 -192704 -79378 -72905 12772 -297448 79902 -115200 136222 97818 -262513 238341 543835
12781 543835 -136381 -146000 374998 -12515 66085 -49033 69541 10135 -54019 405688 59572
12769 -301215 28774 100549 30468 75516 -209335 143215 37608 304669 -105906 131552
12758 6416 -206463 48525 150681 -170862 44663 -14978 122696 174968 147894 -92222 -2898
12746 222666 127933 -305646 185322 -172914 -34050 164902 -115658 -26691 255919 21918
$$ packed form
12826b56611J21433a8068I6381J7773a72632A14858A1582Q4474a86677n7134m0205
12815b84016e3325j86951G9873d0430a1423j63644B35330b23442C282b26716B51065
12803c4723L574B66003A26496b7433J923I9094M3795b24230e7484p4735o0485
12792a92704g9378O473A2772b97448G9902a15200A36222l8404b62513B38341L05494
12781E43835a36381r619C74998a2515F6085d9033F9541A0135e4019D05688E9572
12769c01215B8774P1775C0468M5048b09335A43215C7608K67061a05906A31552
12758F416b06463D8525J02156a70862D4663a4978A22696N2272k7074i2222b898
12746B22666r4733c05646A85322a72914c4050A64902a15658b6691B55919B1918
$$ plain form
12735 -95225 144612 -158339 354955 163247 220307 -42506 -6621 84422 1937 247990 -25834
12723 211363 -187979 -54279 60116 -229825 -207086 -222482 61882 91587 -60565 -159855 -117148
12712 -117148 -37359 74040 246038 141041 -19624 123367 -58569 161690 -126435 -132738 -6680
12700 195107 224955 57167 184847 55599 244238 80066 156493 28744 -217801 -210377 -25927
12688 53640 123369 -39128 168007 -33787 241008 189042 340683 268640 79405 66890 -327593
12676 227 -88936 -155169 -100367 -196051 187201 309309 -68743 315255 80896 -44501 128868
12664 286706 -112830 104985 125423 26577 75340 114099 210789 24581 60413 191087 36224
12652 184851 -125395 -165007 42384 33297 17529 12117 310463 140012 -39357 -98520 353341
$$ packed form
12735i5225A44612a58339C54955A63247N7060d2506f621H4422A937K46053b5834
12723B11363a87979e4279F0116b29825K2739j5396F1882K9705f0565r9290M2707
12712a17148c7359G4040J71998j04997a9624A23367e8569A61690a26435o303f680
12700A95107K9848E7167J27680E5599J88639H0066P6427B8744b17801P424b5927
12688E3640O9729c9128A68007c3787B41008n1966J51641p2043G9405j2515c27593
12676B27h8936o6233N4802r5684A87201J22108f8743C15255H0896d4501A28868
12664B86706a12830A04985K0438B6577M8763L8759R6690B4581L5832J30674C6224
12652A84851a25395l9612D2384r087j5768n412K98346A40012c9357n9163C53341
$$ plain form
12640 45593 -28330 -147807 -22849 -178240 109277 21079 188073 50292 189036 -35106 93549
12628 256656 167122 -14850 -432552 232094 6796 69575 120968 -186547 492917 152488 157718
12617 157718 -55334 -55042 436781 -161600 -19280 -46251 -301735 445922 172170 -79670 -83796
12606 -83796 -126071 -41368 -184964 -266125 73772 -113812 171681 317060 36160 284940 229824
12595 229824 128725 -68260 120753 -191153 -88735 -58379 21719 -32653 66358 129762 -268988
12583 22093 -179164 -171402 -166490 -62940 110540 155332 -131873 8206 147629 -173764 -292860
12572 -292860 -115072 208758 -67824 251620 238941 107943 -11721 125621 238736 57457
12561 -206802 270504 -30778 156972 414671 315539 -72945 -51727 35562 183589 127805 136466
$$ packed form
12640D5593b8330j19477b2849j55391A09277B1079J66994E0292J38744c5106I3549
12628B56656q9534a4850m17702B32094F796O2779N1393a86547D92917A52488N230
12617A57718e5334K92D36781a61600a9280k6971k55484D45922A72170g9670m126
12606h3796m2275d1368j43596q1161G3772a13812A71681J45379C6160K48780n5116
12595B29824j01099f8260A20753a91153h8735L0356B1719c2653F6358O3404b68988
12583B2093a79164P762M912f2940A10540M4792a31873H206J39423a73764j19096
12572b92860a15072B08758f7824B51620j2679A07943a1721A25621J13115E7457
12561b06802B70504c0778A56972K57699r9132g2945K1218C5562J48027n5784Q661
$$ plain form
12550 136466 192904 314374 -78574 220341 33913 38119 -150489 71738 -98935 -35082 279208
12538 83679 191199 -62212 115568 -24437 -94721 -114641 14278 218208 121316 234742 123513
12527 123513 80502 297417 -77592 245272 -197560 191873 78185 1553 -84485 379272 2640
12515 -122443 83876 42356 -258590 -68374 -199128 -87312 -182004 -30705 -254311 -91541 -114942
12504 -114942 98216 117588 -380629 -43089 130015 -25138 54495 -256718 217341 -153376
12493 168982 239585 61527 -9055 -162695 77201 -297499 -146461 15781 -225574 -263 -13957
12482 -13957 -200150 196202 179025 -446750 97754 -394734 166083 -122495 60453 25859
12471 -45222 136495 189268 -112609 -91489 -145851 46686 -102300 29166 -137168 107238 75086
$$ packed form
12550A36466N6438J21470g8574B20341C3913M206a50489G1738i8935c5082B79208
12538H3679J07520f2212A15568b4437p0284j9920A4278K03930r6892J13426j11229
12527A23513m3011K16915g7592B45272a97560A91873G8185A553h4485C79272B640
12515a22443H3876m1520b58590f8374j30754h7312r4692c0705k23606i1541k3401
12504a14942I8216J9372c80629d3089A30015b5138E4495b56718B17341a53376
12493A68982P0603F1527i055j53640G7201b97499a46461A5781b25574b63j3694
12482a3957j86193A96202j7177d46750I7754c94734A66083a22495F0453B5859
12471d5222A36495N2773a12609K1120n4362D6686a02300B9166a37168A07238l2152
$$ plain form
12460 75086 27143 -159621 -56529 57067 -52436 101389 219933 83444 424867 28512 -23425
12448 184713 -240751 -105451 39490 -26357 -46838 -231544 -46734 -96703 -98276 170678 -63918
12436 227132 -130458 84815 242911 -43025 73101 2364 -141030 210474 -44897 68976 -246877
12424 145195 307069 -98744 50051 -173159 125455 -98079 -99314 -237398 -167443 -57881 -35947
12413 -35947 499440 89792 192374 89791 -73176 -24638 -126881 75233 63382 43924 -1322
12401 208069 -185723 18682 233932 -172039 -11729 -120437 -40680 -229851 124739 63934
12391 63934 -65861 192635 23344 49152 27736 186784 -273265 232073 -15432 -109875 -1582
12379 -3483 -61420 271962 245572 -234288 225707 547311 -31530 -303204 36456 38714 189731
$$ packed form
12460G5086B7143a59621e6529E7067e2436A01389J18544H3444L41423B8512b3425
12448A84713b40751a05451C9490b6357k0481j84706d6734m9969j573A70678f3918
12436B27132a30458H4815J58096d3025G3101B364a41030B10474d4897F8976b46877
12424A45195J61874i8744E0051a73159A25455i8079j235j38084O9955e7881K1934
12413c5947D99440H9792J02582H9791g3176b4638j02243G5233j1851j9458a322
12401B08069a85723A8682K15250a72039a1729j08708d0680j89171A24739o0805
12391F3934f5861A92635B3344K5808k1416J59048b73265B32073a5432r4443a582
12379c483n7937B71962k6390b34288B25707L21604c1530k71674C6456K258J51017
$$ plain form
12368 189731 166129 45020 182718 122939 55143 -263387 -109983 -160975 106641 -131032
12357 50492 27568 -20532 -45350 75904 282198 370942 336826 252093 -70174 -155792 -74363
12345 229255 249505 -31092 201948 119532 99722 -63324 -60138 -132023 -6922 -187991 72996
12333 -41818 -436652 -128392 11286 -17396 175342 80809 -107270 173368 -108284 -187938
12323 -187938 -292160 318773 -23261 176142 -132106 39505 -40017 314370 141123 -162685
12312 -130194 183864 86772 35832 -97881 97065 -300131 -42002 -194805 -265315 -58260 -81538
12301 -81538 156540 211960 -146660 105044 222025 112457 32976 -61354 111856 59378
12291 59378 -90172 -5253 -162590 -212943 -431294 110612 34993 14400 4374 -184469 81078
$$ packed form
12368A89731k3602D5020J37698n9779E5143b63387a09983n0992A06641a31032
12357E0492k2924b0532k4818G5904K06294Q8744l4116q4733g0174q5618g4363
12345B29255K0250c1092B01948q2416j9810f3324L186p1885f922j81069G2996
12333d1818l94834a28392A1286a7396A75342H0809a07270A73368a08284p9654
12323a87938j04222C18773b3261A76142a32106C9505d0017C14370A41123a62685
12312a30194A83864H6772C5832i7881I7065c00131d2002j52803p0510e8260k3278
12301h1538A56540N5420a46660A05044J16981j09568C2976f1354A11856n2478
12291E9378i0172e253j57337n0353k18351A10612C4993A4400D374a84469H1078
$$ plain form
12279 -381221 -407675 49170 -116421 229821 -288210 -8218 237373 193742 201487 239675 -43452
12267 40543 -60030 -196472 -24715 93450 64151 318324 -107348 -72299 -337908 146359 186474
12256 186474 219270 -74807 242719 -259493 -212862 -50288 263322 143600 139841 309103 59572
12244 80535 -38508 62110 319797 -177 54580 125844 159484 268140 -119303 112470 222808
12233 222808 43642 208019 516807 227444 21873 -155230 159632 -20247 149128 251318
12223 251318 43709 295554 249576 126953 258940 237287 -61514 27536 328023 197234
12213 197234 -125541 216811 95296 215991 180811 188318 44688 185648 172802 272623 359099
12202 359099 163991 20387 -12908 109457 228105 254953 355204 219167 99548 245915
$$ packed form
12279c81221k6454D9170a16421B29821b88210h218B37373m3631P745L8188d3452
12267D0543f0030j36442b4715I3450k9299K54173a07348L5049k65609A46359M0115
12256A86474L2796g4807B42719b59493M6631e0288B63322j19722l759J69262E9572
12244H0535c8508F2110K57687a77E4580P1264L3640J08656a19303A12470J10338
12233B22808D3642J64377L08788B27444B1873a55230A59632b0247A49128J02190
12223B51318D3709K51845m5978j22623J31987k1653f1514B7536L00487j30789
12213A97234a25541B16811I5296J20695l5180P507D4688J40960j2846R9821Q6476
12202C59099A63991B0387a2908A09457J18648K6848J00251j36037I9548J46367
$$ plain form
12192 245915 209523 148582 78248 -68290 33209 214815 56186 85692 13610 119346 -153740
12180 71998 102915 -359896 105813 294943 285603 -148785 5350 128631 326578 -72438 -222795
12169 -222795 68416 -135315 119683 43542 -156446 115668 105990 -78096 60480 -27464 216690
12157 113525 370193 50965 -38322 -105455 -174272 6336 96521 -197097 96391 48485 -341526
12145 78460 -39956 62837 253286 147438 124558 -60064 21950 372269 -17020 -128194 69408
12133 -189097 -327318 -25744 -72185 66227 297336 142198 54064 -52932 111783 93775 201346
12122 201346 263288 -3433 -64872 -42189 267893 14933 -63141 269627 -15772 124512 177844
12111 177844 -217511 37022 -1109 -150554 -19459 383288 -146019 -125965 46292 174726 -6997
$$ packed form
12192B45915l6392o0941p0334f8290C3209J81606E6186K9506A3610J05736a53740
12180G1998L0917c59896A05813J89130r340a48785E350J23281J97947g2438j50357
12169b22795F8416a35315A19683D3542a56446A15668r678g8096F0480b7464B16690
12157A13525K56668E0965c8322o7133o8817F336R0185a97097I6391m7906c41526
12145G8460c9956F2837J90449j05848k2880f0064B1950L50319a7020j11174F9408
12133a89097j38221b5744m6441F6227K31109A42198E4064e2932A11783j8008J07571
12122B01346O1942c433o1439K2683B67893A4933f3141B69627a5772A24512N3332
12111A77844b17511C7022a109j49445a9459C83288a46019K0054D6292J28434f997
$$ plain form
12099 184585 111531 153301 74291 -47764 -105510 -192350 229239 -177590 -16862 149047 388531
12088 388531 -153668 -8182 -171051 -42200 -66356 -5849 -23115 -13802 31002 17383 -107050
12076 -184374 -99571 109618 140569 -3535 -118969 94612 56930 -145453 308996 -235502 41341
12064 -229391 -47795 28470 154614 493199 399147 1384972 800653 60832 -17927 -179416
12054 -179416 -421202 -132488 100386 21278 135419 166931 -11428 253157 48976 -260589
12043 165953 -27816 187292 -168826 -62495 57827 -494778 105529 279782 47518 66250
12033 66250 330077 -176402 -100499 -116934 112336 13601 167621 -333802 292419 26152
12022 173761 -390366 71968 -303609 122681 -283634 129874 56767 -148433 -116889 93391
$$ packed form
12099A84585p3054M1770G4291d7764n7746q6840B29239a77590a6862A49047K39484
12088C88531a53668h182j62869d2200k4156e849j7266R313C1002j3619a07050
12076a84374Q4803A09618L0951c535j15434I4612l7682a45453C08996b35502D1341
12064b29391d7795B8470J26144L38585r4052R85825n84319F0832a7927j61489
12054a79416k41786a32488A00386B1278J14141L1512a1428B53157D8976b60589
12043A65953b7816A87292a68826f2495E7827d94778A05529J74253D7518J8732
12033F6250K63827a76402P5903j6435A12336A3601J54020c33802B92419B6152
12022A73761c90366G1968c03609A22681b83634A29874E6767a48433L1544I3391
$$ plain form
12011 -374 -128363 -120085 202092 48487 240611 -240015 -129826 -157498 21825 -102196 43737
11999 81123 -160417 -141017 -62538 -77750 -36769 -187214 188139 -23180 58902 143495 -155100
11987 -176843 -265808 -188836 4053 53247 34178 161811 -24887 12615 198497 68449 269846
11976 269846 -55404 -102267 281165 39234 93093 -169385 -184014 -10905 -127759 -44586 -34310
11965 -34310 -126000 80620 51156 -113421 -162322 -118788 -222149 -252648 -215553 92920 333978
11954 333978 163573 -290828 153604 -159902 -37073 -104832 -286142 -230415 105854 -39809
11943 -126161 -137489 -16384 -181968 55579 -285691 -8836 -127898 -46660 -163690 47049 62858
11932 62858 -289897 145210 50853 59009 62015 12725 -120659 -71477 88528 -163795 79560
$$ packed form
12011c74j27989Q278B02092D8487J92124b40015J10189k7672B1825a02196D3737
11999H1123a60417J9400f2538j5212c6769j50445A88139b3180E8902Q4593a55100
11987a76843q8965P6972D053M9194j9069J27633b4887A2615J85882F8449K01397
11976B69846e5404m6863B81165C9234N3859a69385j4629a0905j16854d4586J0276
11965c4310r1690H0620k9464a13421m8901M3534j03361l0499L7095I2920K41058
11954C33978A63573b90828A53604a59902c7073o7759j81310N5727A05854c9809
11943a26161j1328a6384j65584E5579b85691h836j19062d6660j17030D7049J5809
11932F2858b89897A45210E0853Q156L006A2725a20659M9182H8528a63795G9560
$$ plain form
11920 121780 -111486 72242 29686 57698 80826 -157398 338528 -57854 360664 72944 -106025
11908 -39632 34132 68142 -113582 235815 139723 -244415 213809 -64533 128692 -43709 -46956
11897 -46956 -121217 -154704 30625 -19694 106889 -79882 54480 -10342 198252 -168867 102013
11885 397400 -126234 -199617 -358503 55600 92991 -183233 164357 128740 -56965 250445
11874 28817 -247192 86382 5808 -122806 29077 -140208 -64952 115557 14571 407489 -95123
11862 -79365 -192051 74406 -110897 -8546 158074 34281 -183444 -87617 178896 167683 258647
11851 258647 -22573 260274 12084 104423 1403 -105326 59062 -102485 -99070 -118980 -158894
11840 -158894 -354687 -178243 138417 -48314 192227 15737 -211196 98025 -205147 -96837
$$ packed form
11920A21780a11486G2242B9686K8012K3128a57398C38528e7854C60664G2944a06025
11908c9632C4132L4010a13582B35815r6092b44415B13809f4533A28692d3709l247
11897d6956p4261l3487C0625a9694A06889g9882E4480a0342A98252a68867A02013
11885C97400a26234p3383j58886E5600L7391a83233A64357l5617e6965B50445
11874B8817b47192H6382E808a22806B9077a40208f4952A15557A4571L92918i5123
11862g9365j12686G4406a10897h546A58074C4281a83444h7617A78896j1213R0964
11851B58647b2573B60274A2084R2339A403a05326E9062a02485L415j9910l9914
11840a58894j95793J76444A38417d8314A92227A5737b11196I8025b05147i6837
$$ plain form
11829 40737 -333488 55164 -230398 121075 -31938 79270 228667 -170277 21697 -95202 111609
11817 225540 -127662 -100660 25295 31111 60254 -228922 -44497 70110 -150323 -215099 -89565
11805 126546 56315 -137409 34738 217710 72626 -205465 -4986 -219386 -211115 159025 -282447
11793 47693 -200403 128850 110404 182857 -226734 -87723 -120025 -116353 102034 -111051 -398094
11782 -398094 220430 -89834 -31263 -176157 -256111 -108512 186523 -165824 -255961 42928
11771 -47293 -202369 185915 167549 -155922 130434 -45698 116260 -383842 169642 -69891
11760 -40560 178056 -235865 124812 -38063 -83824 -142855 -313926 -252812 105912 309122
11750 309122 -79181 -32557 -181622 -13543 -50688 -94861 -149429 -17453 37073 -4413 -327517
$$ packed form
11829D0737c33488E5164b30398A21075c1938G9270J49397a70277B1697i5202A11609
11817B25540a27662K7002B5295N816K9143b28922d4497G0110a50323o4776h9565
11805A26546E6315a37409C4738J82972G2626b05465d986k14400Q271A59025b82447
11793D7693b00403A28850j8446P2453b26734h7723l2302L672A02034a11051k87043
11782c98094B20430h9834c1263j44894p9954a08512A86523a65824r0137D2928
11771d7293j55076A85915j8366a55922A30434d5698A16260c83842A69642f9891
11760d0560A78056b35865A24812c8063m5761n9031j71071O1114A05912K03210
11750C09122g9181c2557j49065a3543l7145m4173n4568a7453C7073d413l23104
$$ plain form
11739 -327517 -135712 107 -235864 -11378 -156262 -15743 5005 -77408 -11906 -83217 111576
11727 -94951 56010 -44982 -333562 247482 -36074 310264 -420109 -175569 -150300 -125171 134554
11715 115057 -54313 14396 -137081 -19580 57086 360530 -100233 285683 -11536 258303
11704 -231901 52246 -259258 -214627 -13898 -66167 -128884 -172142 61149 -184774 -10987 112409
11692 142446 -202030 -232301 -216960 -149328 106013 71486 -111686 64962 -149249 154538
11681 169981 96616 358119 -53647 -67185 112197 1447 48354 -6335 42599 55295 167124
11670 167124 -160690 161731 76121 103759 -248922 40224 144841 -36087 -201296 264777
11659 119269 -202475 103454 260716 73377 112429 -92270 93200 27867 -58727 137245 -224944
$$ packed form
11739c27517a35712A07b35864a1378j44884a5743E005g7408a1906p1311A11576
11727i4951E6010d4982k88580B47482c6074C10264d20109a75569K5269K5129A34554
11715A15057e4313A4396a37081a9580E7086L03444a00233B85683a1536B58303
11704b31901E2246b59258M4631a3898n2269o2717m3258F1149a84774a0987A12409
11692A42446b02030l0271J5341O7632A06013l4527a11686F4962a49249A54538
11681A69981p3365K61503e3647j3538A12197A447M6907f335D2599J2696J11829
11670A67124a60690A61731G6121K7638b48922D0224J04617c6087j65209B64777
11659A19269b02475A03454J57262G3377L9052i2270I3200B7867e8727A37245b24944
$$ plain form
11647 -38481 -124321 -56562 -137306 167816 18656 -40660 -112909 195303 -103365 -45297 50347
11635 82844 30685 -168182 -121046 -137024 -14554 -186304 84190 -85528 -168795 114106 -100207
11623 -222155 88983 -175574 53673 -91927 -171253 -50012 306792 99277 -276401 323639 14058
11611 194725 279012 -186445 -42374 216315 249477 -89459 202559 -148410 -36105 -204572
11601 -204572 17677 62233 -346449 -187352 -204085 202709 67434 -94203 28817 359864 107055
11589 -75114 213893 180367 -38863 -194493 -114970 -49629 -3248 -289638 91407 -42009 -280645
11578 -280645 -24379 -30010 58068 -54872 -141259 -137846 -26916 57923 89381 154645 -152926 101855
11565 152945 82908 -202921 -65801 132540 4400 -177901 164844 -113071 95313 10909 -28215
$$ packed form
11647c8481q5840e6562q0744A67816A8656d0660p2249A95303a03365d5297E0347
11635H2844C0685a68182M7136j5978a4554j71750H4190h5528q3267A14106a00207
11623b22155H8983a75574E3673i1927p9326e0012C06792I9277b76401C23639A4058
11611A94725Q4287a86445d2374B16315L3162h9459B02559a48410c6105j68467
11601b04572A7677M4556c46449J59097j6733B02709F7434i4203B8817L31047A07055
11589g5114B13893l3526c8863j55630P9523d9629c248k86390I1407d2009k38636
11578b80645b4379n631E8068e4872q6387L413b6916E7923L1458O5264a52926A01855
11565A52945p0037b02921f5801A32540D400a77901A64844a13071I5313A0909b8215
$$ plain form
11553 120915 188758 103026 21983 226004 -192229 127793 -119256 -34069 120859 -165010
11542 -34335 1350 5700 -135256 92731 137400 -280343 -329319 -110544 10404 112551 357990
11531 357990 334550 166383 -99977 404710 85104 -323463 85863 93110 79548 -206637 110520
11519 -161435 -78429 198032 59861 -247490 69678 -84160 72934 155827 192420 -103820 228062
11507 35131 -44465 17896 -404909 69217 95057 -23751 196041 64283 217896 -230222 3673
11495 -161930 -52065 41722 -86014 289885 101007 -158608 285862 -99143 161230 227893
11485 227893 285149 161382 -46105 -51973 71379 233735 -53621 229736 -239387 182207 130320
11474 130320 -67673 138299 129666 273169 82775 57821 -73125 154081 -213141 315741 -195736
$$ packed form
11553A20915O7843q5732B1983K04021a92229A27793a19256c4069A20859a65010
11542c4335A350M350a35256I2731M4669b80343m8976a10544A0404J02147K45439
11531C57990k3440A66383i9977D04710H5104c23463H5863P247j3562b06637A10520
11519a61435g8429A98032E9861b47490F9678h4160G2934Q2893L6593a03820B28062
11507C5131d4465A7896d04909F9217K5840b3751A96041F4283J53613b30222C673
11495a61930e2065D1722h6014B89885A01007a58608B85862i9143A61230O6663
11485B27893N7256j23767d6105n868G1379J62356e3621B29736b39387A82207n1887
11474A30320f7673A38299q633J43503H2775k4954g3125A54081b13141C15741a95736
$$ plain form
11462 -164713 343059 37523 195258 4748 155155 -241624 170461 -73093 244774 -307706
11451 -137215 -126250 232187 230661 75308 35421 35621 134961 -162055 97844 321485 -46436
11439 -78934 285078 138828 -128317 50186 -435970 282055 183926 -224719 210680 -116069
11428 -23752 55854 -53051 256785 277726 -164918 -71372 -15870 119800 -94615 -40991 202576
11416 -152646 52122 162291 92213 -234494 -121210 -37817 -52264 -31640 -113349 -8245 145093
11404 127091 -139781 -236851 66034 281137 50527 -19356 205368 116508 -6773 42848 -79083
11392 75598 67987 58134 -119236 -121907 456892 -360578 -51396 -172616 -36748 70017 59202
11381 59202 -1173 -124676 -147114 -145098 72463 239541 189384 48683 288599 215710 126246
$$ packed form
11462a64713C43059C7523J57735D748J50407b41624A70461g3093B44774c07706
11451a37215J0965B32187j526G5308C5421K00R9340a62055I7844K23641d6436
11439g8934B85078A38828a28317E0186d35970B82055r8129b24719B10680a16069
11428b3752E5854e3051B56785K0941a64918g1372a5870A19800i4615d0991B02576
11416a52646E2122J10169p0078b34494J13284c7817j4447K0624q1709h245A45093
11404A27091a39781r7070F6034K15103E0527a9356B05368q8860f773D2848g9083
11392G5598p611r853a19236k671D56892c60578e1396j21220c6748G0017j0815
11381E9202a173j23503k2438K016G2463J67078n0157D8683K39916p2889q9464
$$ plain form
11370 126246 -247956 -314332 185397 -337307 -318345 28612 -13097 167193 -240098 -113478
11359 48416 226309 78840 -15137 -110357 -47188 -393615 -14176 39851 175433 181597 -19328
11347 -370134 -271597 -1664 -131450 247819 -91347 -118867 -112007 -18165 343752 256151 -62303
11335 -267409 18758 -27087 -66214 -162032 -110810 -120881 -138025 -234255 -9135 -106977 125651
11323 -138801 -153519 -105808 -10275 -25845 160063 121388 38391 -117108 -301455 -314625 -49340
11311 -257937 208916 -71545 -129534 -15710 273137 -44295 54529 -125751 -247014 9676 64330
11300 64330 -322599 -311126 -82183 -62060 55669 -321919 324910 -272833 -149426 -52458 93714
11288 79920 -24840 371282 177669 -316580 -70077 -91307 108182 -40358 223622 -157150
$$ packed form
11370A26246b47956o6376A85397c37307J8962B8612a3097A67193b40098a13478
11359D8416J77893G8840a5137r5220d7188l46427a4176C9851J35582O164a9328
11347c70134R8537a664j29786B47819i1347k7520O860a8165C43752q7601f2303
11335b67409A8758b7087l9127r5818N1222j0071j7144r6230i135r7842A25651
11323a38801j4718M7711a0275j5570A60063l8675C8391a17108j84347j3170d9340
11311b57937B08916g1545n7989a5710B73137d4295E4529a25751j21263I676N4654
11300F4330c22599J1473h2183K0123E5669c21919C24910b72833J23407e2458I3714
11288G9920b4840C71282A77669c16580g0077k1230A08182d0358B23622a57150
$$ plain form
11277 -31663 202785 202488 470637 221888 40604 58378 -64736 -129793 206397 -96513 237875
11265 -245038 86223 42442 123479 -404866 -101512 -74192 55599 -192548 312087 -243991
11254 209501 -174008 212046 -103159 -55620 -185110 -38453 76920 169213 163227 -56782 -81558
11243 -81558 235481 -174532 -1254 -20196 -187463 278093 132714 -358806 -55619 -261442
11233 -261442 -282331 33781 1135 -78528 312680 47247 -197582 -81282 -254046 -113831 -206746
11222 -206746 -376435 -252821 -153949 -162777 -572310 7884 -167987 -28782 -159207 79640 98947
11211 98947 61208 -89712 18972 -97484 28203 70443 129116 -187604 -174152 -89748 21144
11199 150469 294785 -165615 -39318 -299571 278394 298781 -133386 -380784 -102107 -159317
$$ packed form
11277c1663B02785k97K68149B21888D0604J7774f4736o5057B06397i6513B37875
11265b45038H6223D2442Q1037d04866a01512K7320E5599a92548C12087b43991
11254B09501a74008B12046a03159M7539j29490c8453G6920R2293n986e6782k4776
11243h1558B35481a74532a254j8942j67267B78093A32714c58806e5619k05823
11233b61442k0889C3781A135g8528C12680D7247a97582h1282j72764a13831r2915
11222b06746j69689J23614R8872q828m09533G884a67987b8782j30425G9640J9307
11211I8947l7739h9712A8972i7484B8203M2240N8673a87604J3452Q4404B1144
11199A50469J44316a65615c9318k60253B78394K0387a33386k47398a02107n7210
$$ plain form
11189 -159317 -105789 -234496 70383 -424865 56697 -129025 -250897 -314253 70644 -291354
11178 -144607 126093 -106347 -320761 -54375 -82037 17674 -15943 246132 -130383 -70723
11168 -70723 -70993 323436 326336 -77593 -20440 -2733 -294662 140932 -206415 6619 -127808 -122428
11156 -122428 145825 -138990 117681 -120542 -243364 196498 -797 -143184 132333 -308145
11145 -252393 -12495 -62016 122953 20656 -209969 85388 114371 -170590 -127767 136748 -947
11133 -155927 95165 -116877 -153997 41335 25041 62888 71433 -21166 -17867 -23209 28672 197503
11121 197503 147978 -57144 -49334 128305 -107871 -291830 168489 325003 147057 -37162
11110 8063 -108421 76919 167270 123220 -29068 310939 177938 124238 -7141 89673 120774
$$ packed form
11189a59317N3528j28707G0383d24865E6697a29025j21872o3356G0644b91354
11178a44607A26093a06347k14414e4375k7662A7674a5943B46132a30383N9660
11168g0723k70C23436K900g7593b0440b733k91929A40932b06415F619a27808N380
11156a22428A45825a38990A17681a20542j22822A96498g97j42387A32333c08145
11145b52393a2495m9521A22953B0656b09969H5388K8983a70590M2823A36748i47
11133a55927I5165a16877l7120D1335j6294L7847Q545b1166L299n342B8672J68831
11121A97503m9525e7144P810A28305a07871j83959A68489J56514A47057c7162
11110H063a08421G6919R0351m4050b9068C10939j33001n3700g141H9673L1101
$$ plain form
11099 120774 157792 188448 -123733 229356 196827 184012 165367 -54 310734 125885 201939
11088 201939 -95120 106001 7386 141027 208901 342965 77220 277474 914 442383 -49818
11076 189892 397647 68313 334910 89590 456292 -32286 257398 152335 37087 515005
11066 515005 -1803 -61002 257424 323941 286765 171384 465932 228021 414705 379302 328415
11055 328415 316147 459982 584649 181732 519585 296950 572581 498843 474217 415099
11045 415099 398664 207449 536636 611955 557488 534667 486695 315549 740281 730156 365691
11034 365691 509485 258414 559767 369910 379003 213814 362613 796512 442142 227021
11024 227021 704961 570889 466804 263241 501127 303197 401654 730970 571966 648877
$$ packed form
11099A20774L7018L0656a23733B29356l2529j2815j8645e4C10734A25885P6054
11088B01939i5120A06001G386J33641O7874J34064G7220K00254I14M41469d9818
11076A89892K07755F8313K66597H9590L66702c2286B57398j05063C7087M77918
11066E15005a803n9199B57424O6517l7176j15381K94548B28021J86684l5403n0887
11055C28415j2268J43835J24667A81732L37853k22635K75631p3738k4626n9118
11045D15099j6435j91215L29187P5319n4467k2821m7972j71146M24732j0125l64465
11034C65691J43794k51071L01353j89857R093j65189J48799M33899l54370k15121
11024B27021M77940j34072j04085k03563K37886j97930R8457L29316j59004P6911
$$ plain form
11014 648877 366340 535828 175637 466489 462267 146755 940198 101338 497096 275880
11004 275880 521072 463061 237832 708385 376461 518438 369494 675838 382933 394320
10994 394320 528626 565889 -17615 512049 350709 468757 697551 493046 609047 533269
10984 533269 739805 632265 684703 784055 803838 836199 940813 1127948 1063356 1458756
10974 1458756 1512114 1836868 1936728 2069297 1939203 1887233 2071211 1379284 2067404 1201889
10964 1201889 1143896 874907 1226786 1238833 898420 1320556 1109350 1159456 887978 1059932
10954 1059932 1168988 695751 920632 456068 459578 303447 90426 659497 292433 -52433
10943 13940 354586 28862 74742 340408 96533 136947 207236 47947 81948 14382 417336
$$ packed form
11014F48877k82537J69488A75637K90852m222A46755P93443A01338L95758k21216
11004B75880K45192n8011k25229M70553l31924J41977j48944L06344k92905J1387
10994C94320J34306L7263a7615E12049j61340J18048K28794k04505J16001p5778
10984E33269K06536j07540N2438R9352J9783L2361J04614J87135o4592L95400
10974A458756N3358L24754R9860J32569j30094n1970J83978o91927O88120q65515
10964A201889n7993k68989L51879J2047l40413M22136k11206N0106k71478J71954
10954A059932J09056m73237K24881D56068L510j56131I0426N69071B92433e2433
10943A3940L40646B8862M5880K65666I6533M0414P0289D7947L4001A4382M02954
$$ plain form
10932 417336 351013 5210 188963 125360 -296560 -70707 13096 -60161 120963 161585 -412286
10920 -246281 -118629 232482 251785 -21276 164681 245746 -43412 65372 -290989 167125
10909 423175 168288 -163752 2509 77821 127098 125138 -297826 242013 22250 -10563 -71991
10898 -71991 -6906 -54792 -222943 59500 -327213 -112950 -277366 -73560 -208974 -63216 -172491
10887 -172491 -262339 338930 110592 -274083 -77676 -307442 -96518 -217769 51971 268816
10877 268816 229481 449518 -194315 50605 96683 -57176 -322574 -60868 -126303 40661 -89723
10865 -87703 -39700 263548 -258345 242516 -70763 -300450 -144863 204435 -454411 158784
10854 -75192 56522 -104316 -78447 -48336 -48690 71746 182794 113482 -66837 140199 -20679
$$ packed form
10932D17336o6323E210J83753o3603b96560g0707A3096f0161A20963M0622d12286
10920b46281a18629B32482J9303b1276A64681Q1065d3412F5372b90989A67125
10909D23175A68288a63752B509P5312M9277j960b97826B42013B2250a0563o1428
10898g1991f906m7886j68151E9500c27213a12950j64416g3560j35414f3216j09275
10887a72491q9848C38930A10592b74083g7676k29766i6518j21251E1971K16845
10877B68816l9335K20037a94315E0605M6078e7176k65398f0868o5435D0661h9723
10865h7703c9700B63548b58345B42516g0763k29687a44863B04435d54411A58784
10854g5192E6522a04316K5869L0111l54G1746J11048o9312f6837A40199b0679
$$ plain form
10842 -82767 90193 58391 387327 -227575 -319663 370424 -108321 -118327 18582 -172284 484486
10830 -291923 -100832 -74123 156533 -106799 149660 197869 -22473 -7188 216414 216023 -33695
10818 110585 -136942 177034 123123 117659 15387 -190772 190489 -452474 -154273 -174738
10808 -174738 212537 -175386 -63079 -88157 -18897 165936 -340720 -6787 58431 94308 29296
10796 52884 -41674 10775 -44212 -2106 -310406 -50157 109184 -162114 -114657 169702 -183806
10784 -244233 -131324 39925 -135892 -108012 329600 305602 -59013 204243 6171 -355968 103639
10772 81596 57508 220130 143376 -91400 -17182 3949 42313 -89809 -5862 -201618 -214097 -71687
10759 99901 -120340 -223144 66987 -14804 127615 -124576 -190054 -123982 331336 -22760 -162137
$$ packed form
10842h2767I0193l1802L28936b27575r2088C70424a08321j0006A8582a72284D84486
10830b91923a00832K6709A56533a06799A49660M8209b2473g188B16414l91c3695
10818A10585a36942A77034n3911n464A5387a90772A90489d52474a54273k0465
10808a74738B12537a75386f3079k5078a8897A65936c40720f787E8431L5877B9296
10796E2884d1674A0775d4212b106l08300e0157A09184a62114M7457A69702a83806
10784b44233J12909C9925a35892K7880C29600k3998e9013B04243F171c55968A03639
10772H1596k4088J62622p6754i1400a7182C949L8364h9809e862j95756j2479g1687
10759I9901a20340j02804F6987a4804A27615a24576o5478O6072C31336b2760j39377
$$ plain form
10748 -162137 181548 -128338 -167875 -35105 -146379 -119157 -67521 -47250 66899 272767 295447
10737 295447 -22940 -293366 153450 -42088 -215387 266895 -156458 240990 215125 -236707
10726 -393627 40123 -96566 169920 108045 -146251 -167431 29064 32285 -30676 -69651 -36816
10715 -36816 -204334 36053 -400620 -96790 233297 -247316 -126356 -63350 -161745 10205 -97601
10703 -50265 -161464 -20640 -257911 -140247 -242192 139026 -10506 -14683 -128797 -278180
10693 -278180 -69143 -102855 94992 24892 175579 50079 -121055 134684 -72552 -190881 -29207
10681 -281269 26032 -46482 -29476 -100481 -33056 57226 15796 -97830 153312 -169250 110215
10669 -345337 -6803 -288240 -153497 -38996 94635 -10781 24848 -124416 -148696 -255000 90655
$$ packed form
10748a62137A81548a28338l9537c5105j11274K7222N1636K0271F6899K05868K2680
10737B95447b2940k70426A53450d2088j73299B66895a56458B40990k5865b36707
10726c93627D0123i6566A69920o1875a46251k1180B9064L221c0676l8975L2835
10715c6816j67518C6053d00620i6790B33297b47316J20960O3006r8395A0205i7601
10703e0265j11199b0640k37271J17664j01945A39026a0506m177j14114j49383
10693b78180f9143l3712I4992B4892J50687E0079a21055A34684g2552j18329b9207
10681b81269B6032d6482J7006p1005c3056E7226A5796i7830A53312a69250A10215
10669c45337f803k81437J34743c8996I4635a0781B4848a24416k4280j06304I0655
$$ plain form
10657 53508 128778 -156712 -44576 227962 -110724 -110398 82251 -80724 18212 -9705 -205191
10646 -205191 173114 6917 247108 100383 -115647 -88619 -10286 61583 199853 33388 227725
10635 227725 63439 318177 -120359 -61531 -142693 58577 -77603 -15687 179521 19255 140444
10624 140444 -159637 -199712 -401967 217885 71737 68691 -10059 168075 36058 -55005 63402
10612 -26215 63338 -22550 -273138 -157746 -201189 -210287 225392 207716 25519 88850 -158589
10600 -193704 68780 81577 -141269 -145870 -209322 272211 -378666 287783 30745 108377 59210
10589 59210 -8536 188628 81916 -279850 115851 -332715 172126 13973 -205337 -123324 118136
10577 -142267 -208247 275746 -258195 -94971 154896 134738 -104237 -249336 -233876 68926
$$ packed form
10657E3508P5270a56712d4576B27962a10724L26H2251h0724A8212i705j95486
10646b05191A73114F917K40191A00383a15647K7028a0286F1583J38270C3388J94337
10635B27725F3439K54738a20359N8828q1162E8577g7603a5687A79521A9255J21189
10624A40444a59637m0075k02255B17885G1737l046a0059A68075C6058e5005F3402
10612b6215F3338b2550k50588J15392m3443r098B25392j7676B5519O3331a58589
10600a93704F8780J2797a41269m601o3452B72211c78666B87783C0745P7632m9167
10589E9210h536A88628H1916b79850A15851c32715A72126A3973b05337Q2013A18136
10577a42267o5980B75746b58195i4971A54896k0158a04237j45099J5460F8926
$$ plain form
10566 68804 80321 -9171 -93019 -5969 -90064 -332122 -88610 248297 -105116 63306 -19375
10554 -68929 -43746 71888 -19420 -37536 -113713 -51503 -47738 138555 72771 -2804 -70577 35307
10541 -302154 -246036 58375 157586 -121280 86982 -343781 97437 36550 289018 72055 -152839
10529 24999 -74187 94988 51471 -154417 149905 -260703 252301 -353318 -87064 -172197 79417
10517 -191347 212128 -187181 -150836 -228514 -211891 -56309 -252719 -113929 138618 146420 82751
10506 82751 -367509 1506 140930 112987 -126676 186228 -47910 -137736 -202041 -326862 -154198
10494 224148 49935 158570 -147868 5872 137519 66435 -59138 -213587 -75838 -215253 -84093
10482 -264103 -27142 -275760 183078 91052 181605 -98432 370277 19552 -270249 -66906 64231
$$ packed form
10566F8804J1517i171q3848e969q4095k42058h8610B48297a05116F3306a9375
10554f8929K5183G1888a9420j8116p6177e1503L765A38555o5784b804o7773C5307
10541c02154N6118E8375R9211a21280H6982c43781I7437C6550K52468G2055a52839
10529B4999g4187I4988m3517a54417A49905b60703B52301c53318h7064q5133G9417
10517a91347B12128a87181L6345p7678J6623e6309j96410a13929A38618P802o3669
10506H2751c67509A506J39424k7943a26676A86228d7910q9826o4305j24821a54198
10494B24148D9935J08635a47868E872J31647F6435e9138j54449g5838j39415h4093
10482b64103b7142k48618A83078I1052R0553i8432C70277A9552b70249f6906F4231
$$ plain form
10470 -235525 -16762 -178373 196935 -117169 -250701 103392 -319212 -156922 212560 -32649
10459 -180292 -390951 -429661 -123105 -60819 10754 -269894 -258207 379742 -75738 55257 -48585
10447 158128 53169 -70773 49506 -1467 5248 -83071 90927 -172888 -162257 271917 4738 -331066
10434 191220 -259361 -98418 164221 -105254 -383021 -27702 -282109 -243202 -277637 -148846
10424 -148846 -110764 142195 41741 -134452 -2160 1499 42366 135434 56315 127828 230764
10413 230764 -268206 15269 119981 -172594 -278421 -126517 99281 158161 113671 75651
10403 75651 4387 184189 -231155 17623 -144809 -142231 -33945 -224875 -112666 -77864 112941
10391 -181533 38532 196036 78129 -67668 -69856 -14087 -47521 42089 198867 120992 70730
$$ packed form
10470b35525a6762j61611A96935a17169j33532A03392c19212a56922B12560c2649
10459a80292k10659l8710a23105f0819A0754b69894J1687C79742g5738E5257d8585
10447A58128E3169g0773D9506a467E248h3071I0927a72888J0631B71917D738c31066
10434A91220b59361i8418A64221a05254k77767b7702k54407L8907l4435J28791
10424a48846L8082A42195D1741a34452b160A499M0867R3068E6315P1513J02936
10413B30764b68206A5269J04712a72594j05827a26517I9281N8880m4490l8020
10403G5651D387J79802b31155A7623a44809K578c3945j90930J12209L4802A12941
10391a81533C8532J57504G8129f7668k188a4087l3434D2089J56778p7875n0262
$$ plain form
10380 70730 450021 132138 169806 525220 234080 284364 255459 223501 66621 165564 -49166
10368 272680 -11860 385514 221049 367325 178631 239496 -12238 169645 63654 -68919
10357 139305 154284 -227887 -110947 53399 479100 49247 557361 254873 60497 316984
10347 316984 25095 66431 416510 189730 274680 236339 104999 -157350 66795 35946 -56432
10335 291919 371009 -131847 -3482 312014 254 365465 37470 -214302 315827 137331 360031
10324 360031 -89114 75758 259925 276722 349552 30201 -128767 106519 -118938 -48105 -71294
10313 -71294 199966 84138 81926 -120429 61676 167360 -27073 -139747 -22080 -23174 146144
10301 204319 -215245 -148067 -115648 -19403 -167773 -168441 88128 -28509 154827 123473 36980
$$ packed form
10380G0730L79291A32138L7668L55414B34080N0284k8905l1958F6621R8943d9166
10368B72680a1860C85514j64465J46276A78631O0865a2238A69645F3654f8919
10357A39305J4979b27887a10947E3399M25701D9247N08114B54873F0497K56487
10347C16984B5095M1336L50079A89730Q4950l8341A04999a57350F6795l0849e6432
10335B91919P9090a31847c482C12014B54L65211C7470b14302C15827A37331K22700
10324C60031h9114G5758J84167J6797P2830C0201a28767A06519a18938d8105k3189
10313g1294A99966H4138k212a20429F1676J05684b7073j12674b2080j094A46144
10301B04319b15245O7178L2419a9403j48370o68H8128b8509A54827l1354C6980
$$ plain form
10289 178828 442994 -263789 54293 -269315 274008 -255905 -172994 -47779 -216863 106352
10278 176715 -92720 -106055 -14495 -217762 51488 -191671 81494 36503 126097 -82261 356699
10266 134585 -36009 2592 -57843 81749 124566 214613 -62543 151123 -20811 47348 587353
10255 587353 464659 144157 209953 273502 26607 -196474 164208 40785 -162384 -2615 -14253
10244 -14253 -126332 -289542 -2150 84864 -157261 72257 30103 77089 -230579 163843 -142041
10232 -109926 -113063 164141 -137313 118849 -31364 88581 -412597 -42779 242116 -212368
10221 -74403 241537 19789 -225933 -178125 -157371 2377 -212962 49920 43931 -45796 45532
10209 12064 -190042 -227856 138009 86256 -50975 60028 36311 -131538 -17888 41192 -85212
$$ packed form
10289A78828K64166b63789E4293b69315B74008b55905Q2911d7779j69084A06352
10278A76715i2720j3335a4495k03267E1488a91671H1494C6503Q9594h2261C56699
10266A34585c6009B592e7843H1749M2817R0047f2543A51123b0811D7348N40005
10255E87353j22694A44157O5796O3549B6607a96474A64208D0785a62384b615j1638
10244a4253j12079j63210b150H4864a57261G2257C0103M6986b30579A63843a42041
10232a09926l137A64141a37313A18849c1364H8581d12597d2779B42116b12368
10221g4403B41537A9789b25933M7808K0754B377b12962D9920n989d5796D5532
10209A2064a90042l7814A38009n1753e0975F0028k3717a31538a7888D1192h5212
$$ plain form
10197 221389 -58999 219384 -195571 -296287 -129131 -132945 8371 -361892 -227237 53696 -83647
10185 -38446 -333495 -46607 206210 -214134 -66296 -6611 -160982 145460 -75155 -274014 -242190
10174 -242190 84405 -53372 -2621 13225 47519 41084 -166101 -313664 -47743 -78543 104397
10162 -4808 44732 -74823 -196871 -309405 -106114 -21136 -251518 -83764 -157488 178658 56403
10150 -4373 -255954 -94135 -282973 -148367 -133777 -94190 202346 30267 233699 -31394 89544
10138 16727 -58117 -81820 41612 22743 -76611 -106509 -93939 -53923 -161485 318416 267183
10127 267183 -152378 -71709 -88181 45035 -140022 -101226 137753 131688 -356918 -177651 -73325
10115 -205890 -283964 11584 -395335 126570 86358 -127291 124353 -112480 -138299 -326457
$$ packed form
10197B21389e8999B19384a95571j00716a29131l814H371c61892J34655E3696h3647
10185c8446k95049d6607B06210b14134f6296f611j54371A45460g5155j98859L1824
10174b42190H4405e3372b621A3225L4294o435a66101j47563d7743l0800A04397
10162d808D4732g4823j22048j12534a06114b1136k30382h3764p3724A78658E6403
10150d373k51581i4135j88838J34606J4590L9587B02346C0267K03432c1394H9544
10138A6727e8117k3703D1612j8869g6611k9898J2570M0016j07562C18416n1233
10127B67183a52378g1709j6472D5035a40022L8796A37753o065c56918a77651g3325
10115b05890p8074A1584c95335A26570m0212a27291A24353a12480k5819j88158
$$ plain form
10105 -326457 -38005 -301597 -158790 -212415 -2684 130636 365988 -351451 159061 -80978
10094 199590 105338 39311 -82616 -51676 351750 1715 -104245 -242084 -244759 -8548 -105757
10083 -105757 23322 56960 23291 -259910 -64253 -227148 345 -363674 -58924 -220883 -160812
10072 -160812 50367 1975 -83515 156433 -111351 161070 -74929 208231 -109026 -64523 -33908
10061 -33908 -167520 -24605 -90431 -252065 -289234 315128 70619 42209 -174494 -179413 -272111
10050 -272111 -153037 -38678 -312251 77667 6970 28350 60380 149839 173347 -182413 -210234
10039 -210234 145972 289100 -179803 157056 -16944 -120766 55288 -87644 -222432 -43545
10028 -128167 -180948 29176 -221508 34417 -76743 -68764 26227 237467 152077 388177 -27432
$$ packed form
10105c26457c8005k63592J42807n3625b684A30636K35352c51451A59061h0978
10094A99590r4252C9311h2616L0940C51750A715a04245j37839k675h548r7209
10083a05757B3322L3638B3291b59910f4253j62895C45c63674e8924j61959O0071
10072a60812E0367A975h3515A56433a11351A61070g4929B08231a09026M4503L0615
10061c3908j33612b4605o5826j61634l7169C15128G0619k8410a74494m919r2698
10050b72111J19074c8678k73573G7667F970K1380L2030Q9459K3508a82413k7821
10039b10234A45972J43128a79803A57056a6944j03822E5288h7644j34788d3545
10028a28167n2781B9176b21508C4417g6743P979B6227K11240q5390K36100b7432
$$ plain form
10016 -81001 -472625 -334379 -184091 234356 -102468 302595 91954 -141247 -297350 79410
10005 6838 8437 -57436 -37281 122424 -4702 -460974 55076 114127 12952 -232512 42396 -103084
9992 6990 -98448 -309520 -236220 48363 -56564 -195056 9675 152461 -232982 -166690 216575
9980 44410 -243421 -40225 -45141 140532 162221 -69568 -60326 -56579 -273912 -174039 -194343 54532
9967 5608 -32706 -323304 -36441 -232837 -392691 135449 -51523 -10408 -115564 -230740 -238157
9956 -238157 109079 -88130 27045 -126961 -265346 232120 31115 259345 -99365 -10722 137062
9944 -2439 191896 -297694 -59123 30803 48554 17689 -173348 103190 31676 11062 -277208
9932 -220166 -327795 -125262 -67290 45252 -223440 -77387 -229216 -112427 -186729 -85323 -250649
$$ packed form
10016h1001l91624J38246J50288B34356a02468C02595I1954a41247j56103G9410
10005F838J599e7436K0155A22424d702m56272E5076N9051A2952b32512D2396a03084
9992F990i8448k11072P3300D8363e6564j38492I675J42786b32982O6292B16575
9980D4410b43421d0225m916A40532K1689f9568R242L747k17333R9873k0304E4532
9967E608c2706k90598c6441j96396j59854A35449e1523a0408j05156j15176p417
9956b38157A09079h8130B7045a26961j38385B32120C1115K28230i9365a0722A37062
9944b439A91896b97694e9123C0803J7751A7689a73348A03190C1676A1062b77208
9932b20166j07629a25262N7972D5252b23440g7387j51829a12427p4302h5323j65326
$$ plain form
9921 -250649 17533 -25900 -242271 -341413 -212163 -219837 -46922 -171777 -101961 7780 -67135
9909 85634 -334594 460010 -236019 -118946 63488 -304230 -244609 -164168 -296495 -310073 368575
9897 245789 44515 112319 -30904 7988 -109697 211724 -257994 42985 141772 -182301 -207401
9886 -207401 332292 -568296 -140819 -73854 -148298 205484 -135533 -62682 -112261 -228601
9876 -228601 -72168 340797 -275212 -223703 4560 -95511 -255932 -83916 30134 186323 156584
9865 156584 97394 33999 -279434 -102568 -117266 -187050 -24424 52728 -122506 -29189 -129968
9854 -129968 -270476 286892 -150215 -2000 -117321 348526 -179677 133387 -166282 -31858
9843 -970 145662 -239595 -168927 -22062 -190075 -243549 97889 229776 -46725 27103 66678
$$ packed form
9921b50649A7533b5900k16371r9142J29250p674d6922j24855O9816G780f7135
9909H5634c34594D60010b36019J17073F3488c04230N9621Q0441j32327j3578C68575
9897B45789D4515O7804c0904G988a09697B11724b57994D2985R8787a82301k5100
9886b07401C32292e68296a40819O6965p4444B05484a35533f2682m9579j16340
9876b28601g2168C40797b75212N1509D560i5511j60421h3916C0134J56189k9739
9865A56584n9190C3999b79434a02568j4698o9784b4424E2728a22506b9189j00779
9854a29968j40508B86892a50215b000j15321C48526a79677A33387a66282c1858
9843i70A45662b39595P0668b2062j68013n3474I7889J31887d6725B7103L9575
$$ plain form
9832 66678 38547 198302 -19325 -148495 162993 195302 -201308 -513175 38073 -84928 -36826
9820 -43654 -293278 -60854 -69771 -27030 -148120 179842 -71119 85276 -73610 -219030 150211
9808 57735 -21012 -298255 64514 -198745 -81911 -260605 -167470 -40402 -268530 250090 76093
9796 103945 -39478 24015 -373472 -133607 -272554 185162 -45854 -273604 -50579 -5843 -137434
9785 -137434 -222750 264156 -410983 320921 5818 240086 -303406 34856 141828 -147597
9774 -165252 92821 -7438 -66908 -99774 -272498 11685 159099 210739 -539839 -313670 1198
9762 167993 -233845 34544 217110 -161561 -378577 -158954 -227584 62596 -453715 307567
9751 -81505 92850 -281883 -27223 237094 -384002 274911 -448727 167896 -92821 332885
$$ packed form
9832F6678k8131J59755a9325j29170A62993L2309b01308l11867C8073h4928c6826
9820d3654k49624f0854q917b7030j21090A79842g1119H5276g3610j45420A50211
9808E7735b1012k77243F4514a98745h1911j78694R3135d0402k28128B50090G6093
9796A03945c9478B4015c73472a33607j38947A85162d5854k27750e0579e843j31591
9785a37434q5316B64156d10983C20921E818K34268c03406C4856J06972a47597
9774a65252I2821g438n9470l2866j72724A1685J47414N1640e39839K26169A198
9762A67993b33845C4544J82566a61561k17016a58954o8630F2596d53715C07567
9751h1505I2850b81883b7223B37094c84002B74911d48727A67896i2821C32885
$$ plain form
9740 -102370 -14602 65777 -345486 -94779 5453 72095 71650 -122785 -273482 -8578 -138765 -331
9727 -75473 72213 290551 82759 70018 -86545 -3623 -131666 -22934 87591 41516 274475
9716 274475 -383778 213929 -269958 -201129 -13709 -126873 -138577 30150 -63840 -138466 173948
9704 -85159 -39117 -143247 -150178 -36540 -426014 -157976 -96059 -9134 -386412 -149047 -86459
9693 -86459 57498 -164930 -117988 17854 -17886 -105229 -248289 24541 46710 -59854 -152320
9682 -152320 145971 -210482 -78010 148039 194799 147867 221735 -77167 249660 34801 46430
9671 46430 194489 -49711 -253392 -60463 167627 -202146 131361 -206143 58115 -168827
9660 -65529 28408 -481785 -84082 -225281 45740 26474 167564 -11987 -295296 -178214 68511
$$ packed form
9740a02370a4602F5777c45486i4779E453O6642m45a22785j50697h578j30187c31
9727g5473G2213K18338H2759j2741h6545c623j28043b2934H7591D1516K32959
9716B74475c83778B13929b69958O8829a3709j13164j1704C0150f3840p4626A73948
9704h5159c9117j04130o931c6540l89474a57976O1917i134l77278a49047O2588
9693h6459E7498a64930M6942A7854a7886q7343j43060B4541K2169e9854r2466
9682a52320A45971b10482g8010A48039M6760m6932P3868g7167B49660C4801J1629
9671D6430J48059d9711k03681f0463A67627b02146A31361b06143E8115a68827
9660f5529B8408d81785h4082j41199D5740j9266J41090a1987k83309J17082F8511
$$ plain form
9648 -301460 -96666 -55292 165776 54010 -188269 250990 -84961 12654 -69335 -94068 -91911
9637 -91911 176530 -93889 252738 51108 -178007 150922 76670 -242871 -47504 -142983 178423
9625 -68598 -196119 94937 -45522 130662 357110 535368 100711 -88042 30233 -49530 182655
9613 -257603 -218913 -136973 -405180 -114492 176874 -94673 157603 124308 280936 134667
9602 -8611 182628 -132559 -133572 44038 -192171 -203370 -105861 191623 -436885 -101413 89173
9590 82131 -55617 285092 -166170 208544 -262411 -298483 -143070 -188301 126230 -335717
9579 18033 -32835 -228693 -254889 100348 -56116 -173463 -253711 -45271 -203519 243069 -104826
9567 -188383 -184502 83608 -148553 -106035 -200625 48492 -53763 60752 249990 -86164 13237
$$ packed form
9648c01460i6666M1374A65776E4010a88269B50990h4961A2654f9335k4733K157
9637i1911A76530i3889B52738E1108a78007A50922p4252b42871d7504r5479A78423
9625f8598j27521I4937d5522A30662K26448J78258A00711h8042C0233d9530A82655
9613b57603L8690Q1940k68207a14492A76874i4673A57603l3295J56628A34667
9602h611A82628a32559j013D4038a92171j1199R7509A91623d36885a01413H9173
9590H2131e5617B85092a66170B08544b62411l6072a43070m5231A26230c35717
9579A8033c2835j95858k6196A00348e6116j17347q0248d5271j58248B43069a04826
9567a88383L881H3608a48553M2518r4590D8492e3763F0752J89238h6164A3237
$$ plain form
9555 -61618 -155113 -37569 -243400 -127683 -71677 -63463 -134999 33644 -24225 -129903 9536 -66676
9542 419 61589 255310 -158279 -88105 -318594 -404387 -153693 -211991 -96389 67452 66718 -27121
9529 -284853 -2483 99457 -62721 -154019 38372 -132902 -2841 39836 4371 -164585 17468 39598
9517 39598 86990 276984 -217992 56835 126236 -133459 80635 -96951 -69188 -113530 -44608
9505 -209324 -56984 -178379 -100434 -69428 -146557 -233507 109021 -176759 -300323 186614 -425946
9493 4100 90208 -354549 -1197 -148056 -278774 -44133 -485156 -94911 243152 -166345 -75274
9481 -104188 185699 -217650 -153452 -179157 -374767 418432 -106982 -56559 121055 -177749
9470 109214 265103 149562 191777 92246 878 -121716 -47434 -86155 100066 157473 -219583
$$ packed form
9555f1618r3495c7569k05831J15717N6006Q214p1536C3644b4225j05678I536f6676
9542D19O1170J93721a58279P0174k30489q5793a53693n8298i6389F7452p34b7121
9529b84853b483I9457f2721r1298C8372a32902b841C9836D371a64585A7468K2130
9517C9598M7392J89994b17992E6835O9401a33459H0635i6951K7763m4342d4608
9505b09324e6984j21395P7945L1006p7129q6950A09021a76759j23564A86614d25946
9493D100Q6108c54549a197j46859j30718d4133m41023i4911B43152a66345g5274
9481a04188A85699b17650O4198k5705j95610D18432a06982N0423A21055a77749
9470A09214J55889j15541M2215I2246H78a21716d7434l8721A00066N7407b19583
$$ plain form
9458 -58684 -234439 -153480 -310997 -141415 115048 -146687 293247 68006 -188003 204495
9447 -99618 269152 -181578 202768 -172429 186246 93489 105623 -220219 -151888 -118788 43482
9435 17222 -135039 -213129 262135 142183 -95767 -100275 -124985 -438086 -106808 -132053 -5927
9423 -323784 49294 -8791 -170354 -57690 118490 -216176 21590 -383382 39852 -307125 -164031
9412 -164031 99605 -9990 -129681 2750 5396 113954 -141130 -105526 -375989 83782 -148245
9400 -209991 90092 288216 -17466 -158145 -210282 -182043 -87409 -206103 -57619 -215469 -38876
9388 -87182 -108688 91073 -229155 -59494 81838 164538 -303981 -260224 -436679 -105227 62131
9376 155022 -327789 -509820 128538 -161628 -149016 366498 -28013 -59155 -96958 -224395
$$ packed form
9458e8684j75755Q0959j57517a41415A15048a46687B93247F8006a88003B04495
9447i9618B69152a81578B02768a72429A86246r2757J2134b20219O8331L3100D3482
9435A7222a35039p8090B62135j19952i5767m508k4710l13101a06808k5245e927
9423c23784D9294h791j61563e7690A18490b16176B1590c83382C9852c07125J43094
9412a64031I9605i990j19691B750K646J08558a41130L5604k70463H3782a48245
9400b09991I0092J98124a7466j40679n2137K8239h7409j18694e7619j57850c8876
9388h7182k1506I1073b29155e9494H1838Q2700c03981M3757j76455a05227F2131
9376A55022c27789j82031A28538a61628J2612C66498b8013l1142l7803j27437
$$ plain form
9366 -224395 -65017 134260 74947 44462 -26079 -136537 -57061 152856 -62844 -115930 -156008
9355 -156008 85227 -216222 -92304 235265 -75198 -4435 144553 -202806 329151 115784 -19337
9343 -18922 -11238 211076 75055 162612 -288326 -277253 373801 -34131 -188634 882 -190515
9331 -104815 -111427 42125 39066 -449999 -9027 -196307 -614 33049 -187832 87273 -239361 47598
9318 78819 -101108 -3001 124544 -379576 -383105 207232 170257 -383397 -206332 -140996 -415022
9307 -415022 21731 -207325 184443 10091 17104 162160 -109039 -154365 46918 -93373 -66668
9296 -66668 64998 6488 -245819 -127422 -121731 -312711 -362841 63327 -99953 11553 -38320 158697
9283 72104 -244393 -39377 -82279 -17834 -90774 -198288 -217423 110994 -80053 -144496 346649
$$ packed form
9366b24395f5017A34260n9313l0485b6079j10458e7061A52856f2844n3086m0078
9355a56008H5227b16222i2304B35265g5198d435A44553b02806C29151A15784a9337
9343a8922P684B11076G5055Q7557b88326J1073C73801c4131j54503H82a90515
9331a04815o612D2125l059d49999i027j87280f14C3049a87832H7273b39361D7598
9318G8819a01108c001A24544c79576l529B07232l6975c83397J77065O5336k74026
9307d15022B1731b07325A84443A0091P013J45056a09039m5326D6918i3373K6705
9296f6668F4998F488b45819J18397N691j90980n0130F3327i9953A1553c8320A58697
9283G2104b44393c9377m2902a7834p2940j07514j9135A10994h0053o4443C46649
$$ plain form
9271 -97635 -94892 -16537 -124331 205690 -63360 -105862 32277 84463 -273833 -98801 -78236
9260 -78236 -358619 -17412 -174001 254652 38821 44279 -127434 64456 -258269 226015 -172665
9248 62790 87510 -323086 6919 -19208 -73811 121911 -148750 145821 112485 -109072 318320
9236 -180580 -95067 65379 -315042 -96904 -23983 -51962 -131651 69553 445976 -393236 -33106
9224 -137603 37416 -99348 10290 62444 37708 86441 287795 17630 -34551 -190731 21624
9212 -84302 226463 -233047 -50054 78881 20162 -221336 -318386 -28437 -16011 -77298 -89761
9201 -89761 -440235 -228406 -161052 -46795 -120107 -42959 -182952 102227 80142 -268203 2144
9189 114517 16756 -183443 46496 -88844 72423 -77785 -93692 192840 169206 30373 -25438
$$ packed form
9271i7635K743a6537j07794B05690f3360m2502C2277N2186b73833i8801K0565
9260g8236k80383a7412j56589B54652C8821N458a27434F4456b58269B26015a72665
9248F2790K4720c23086F919a9208n4603A21911a48750A45821l3336a09072C18320
9236a80580Q5513F5379c15042i6904b3983k7979p9689F9553L76423c93236c3106
9224a37603C7416i9348A0290N2154k4736M8733K01354A7630c4551j56180B1624
9212h4302B26463b33047e0054G8881B0162b21336r7050b8437J2426o1287j2463
9201h9761l50474K11829O7354d6795p3312d2959j39993A02227k2085b68203B144
9189A14517A6756a83443D6496h8844G2423g7785j5907A92840k3634C0373b5438
$$ plain form
9177 -60254 -248358 -296943 -462357 21669 154606 95361 -242450 158646 -177699 -136164 -405024
9166 -405024 94230 -169237 -169280 -432769 159904 14822 -378620 -208513 58683 -117402 -23973
9154 -103526 -283381 220965 -222426 -211538 -159310 -513966 22280 -313250 123590 -130706
9143 86061 17396 268711 95091 -7915 -289190 25507 -16504 -75121 3215 -166919 159335
9131 -372172 -77762 117115 157429 99013 -201464 6370 -6708 138053 207385 -233949 -16591
9119 16145 18075 -203170 -14867 -179394 -110237 79085 -213157 -19301 151060 -192199 -111478
9108 -111478 198029 -298353 -152675 -334188 -95877 177727 -295245 -79310 -11423 -68449
9098 -68449 92833 9558 74262 -4467 -71308 -162938 -89780 151559 46758 -294752 -431101 38889
$$ packed form
9177f0254j88104m8585j65414B1669J32937n9245b42450A58646a77699M1535k68860
9166d05024I4230a69237m3k63489A59904A4822c78620J70107E8683a17402b3973
9154a03526j79855B20965b22426J0888N2228l54656B2280c13250A23590a30706
9143H6061A7396K51315I5091g915k81275B5507a6504n8617C215a66919A59335
9131c72172g7762A17115M0314n8416b01464F370f708A38053O9332b33949a6591
9119A6145J930b03170a4867j64527O9157G9085b13157a9301A51060a92199Q0721
9108a11478A98029b98353J45678j81513i5877A77727b95245g9310a1423n7026
9098f8449I2833I558O4704d467o6841r1630P3158A51559D6758b94752j36349C8889
$$ plain form
9085 311874 -259685 106954 -31231 -156995 -3788 13633 -81487 -70140 -49531 55331 173118
9074 173118 -107786 227513 -111437 -46903 -416599 -139625 -56266 197173 -20248 67119
9063 -214205 -54891 -141341 -52743 -271309 -97543 82929 -302211 -48886 -263850 -234153 -124280
9052 -124280 -381404 62281 -114791 9398 137219 -131835 -196973 84121 97051 -72277 87252
9040 148523 235812 8290 -227496 -163288 -220961 250142 -89464 -13769 -351994 161777 -55916
9028 100374 -218513 -187951 -212850 -179081 274956 -150529 -113356 -23481 -37463 148306 124038
9017 124038 -233843 95462 -108579 -10994 -71475 -38855 -118586 -380940 -93480 130071 67915
9006 67915 -93157 -69167 -57193 144155 -31 338285 -113720 -222912 53015 -492804 22154
$$ packed form
9085C11874b59685A06954c1231j25764c788A3633h1487J1347K0609E5331J17787
9074A73118a07786B27513a11437d6903l69696a39625e6266A97173b0248F7119
9063b14205e4891q6450e2743k18566i7543H2929c02211d8886k14964K9697J09873
9052a24280k57124F2281a14791I398J27821a31835o5138H4121J2930g2277H7252
9040A48523Q7289H290b27496O4208n7673B50142h9464a3769l38225A61777e5916
9028A00374b18513L0562k4899L3769B74956a50529L7173b3481j3982A48306k4268
9017A24038b33843I5462a08579a0994o0481L2620p9731k62354i3480A30071o2156
9006F7915i3157K3990J1974A44155c1C38285a13720j09192E3015d92804B2154
$$ plain form
8994 -14331 -19273 -30399 -117263 122095 135438 -152529 21800 -311527 153185 -212282 -286822
8983 -286822 -282835 -223632 -56506 40232 -73941 -163919 -139621 32226 192742 88701 20458 256372
8971 256372 -95497 180197 -90127 -330448 -64624 -12808 54284 -106119 -242131 -183134 -147466
8960 -147466 -246651 -80940 -193009 1597 -110717 -27761 6644 -33542 -234725 -387966 28118
8948 228019 -259553 86137 -42645 91220 -127697 189327 37648 -10912 -43675 75057 -220191
8936 106427 329879 -52132 232189 134072 374645 66803 239394 379416 -23766 35807 29509
8925 29509 370272 778399 1456071 2756256 7477384 3852578 1074489 474820 49210
8915 -42192 144562 168077 -21114 93002 -376264 55197 28702 560303 203470 -111787 53659
$$ packed form
8994a4331m942j1126q6864A22095J3343a52529B1800c11527A53185b12282p4540
8983b86822L987N9203e6506D0232g3941q9978K4298C2226J60516H8701B0458K35914
8971B56372i5497A80197i0127k40321f4624a2808E4284a06119j36012N8997L5668
8960a47466r9185h0940j12069A597a10717b7761F644c3542k01183j53241B8118
8948B28019b59553H6137d2645I1220a27697A89327C7648a0912l2763G5057b20191
8936A06427K23452e2132B32189r8117K40573F6803J72591J40022b3766C5807o298
8925B9509L40763M08127O77672J300185M721128l624806A074489D74820D9210
8915d2192A44562K3515b1114I3002c76264E5197k6495N31601B03470a11787E3659
$$ plain form
8903 -106479 237799 -346154 74156 14581 91524 -200681 -217214 156727 -246057 19997 205669
8892 205669 -570079 -73303 19890 53278 73893 -282363 -302167 -176017 -375573 39867 -85009
8880 34628 43146 -38579 13337 -590683 -38220 -109311 -1656 -148472 81789 -133685 21191 -143787
8867 -92577 -41565 158728 -100286 -178524 127272 279108 -161238 14572 -261215 209350
8856 3242 126384 75870 -298970 8877 -365777 42260 168965 -456781 -216050 -121856 297
$$ packed form
8903a06479B37799c46154G4156A4581P6943b00681j6533A56727b46057A9997J85672
8892B05669e70079g3303A9890L3388K0615b82363j9804J26150j99556C9867h5009
8880C4628Q518c8579A3337e90683c8220p1091a656j46816H1789a33685B1191a43787
8867i2577d1565A58728a00286p8238A27272J51836a61238A4572b61215B09350
8856C242J23142n0514b98970H877c65777D2260J26705d56781b16050R4194B97
$$ [...]
##END NTUPLES=NMR SPECTRUM
##END=
