##TITLE=AC1667_DOMCH14358_8531045_UcovPnFRbW
##JCAMPDX= 6.0         $$ Bruker NMR JCAMP-DX V2.0
##DATA TYPE= NMR SPECTRUM
##DATA CLASS= NTUPLES
##ORIGIN= BRUKER
##OWNER= Administrator
$$ 1.72 TOPSPIN		Version 2.1
$$ 2014-03-14 21:31:05.902 -0800  Administrator@X
$$ Compression mode = diff/dup
##.OBSERVE FREQUENCY= 400.02188249412
##.OBSERVE NUCLEUS= ^1H
##.ACQUISITION MODE= SIMULTANEOUS (DQD)
##.ACQUISITION SCHEME= undefined
##.AVERAGES= 64
##.DIGITISER RES= 22
##SPECTROMETER/DATA SYSTEM= spect
##.PULSE SEQUENCE= noesygpps1d.comp
##.SOLVENT NAME= COFFEE_meoh
##.SHIFT REFERENCE= INTERNAL, COFFEE_meoh, 1, 14.96131
##AUDIT TRAIL= $$ (NUMBER, WHEN, WHO, WHERE, PROCESS, VERSION, WHAT)
$$ ##TITLE= Audit trail, TOPSPIN		Version 2.1
$$ ##JCAMPDX= 5.01
$$ ##ORIGIN= Bruker BioSpin GmbH
$$ ##OWNER= Administrator
$$ $$ E:\/data/COFFEE/nmr/AC1667_DOMCH14358_8531045_UcovPnFRbW/22/pdata/1/auditp.txt
$$ ##AUDIT TRAIL=  $$ (NUMBER, WHEN, WHO, WHERE, PROCESS, VERSION, WHAT)
(   1,<2014-03-14 21:31:00.996 -0800>,<Administrator>,<X>,<go>,<TOPSPIN 2.1>,
      <created by zg
	started at 2014-03-14 21:19:30.868 -0800,
	POWCHK enabled, PULCHK disabled,
       configuration hash MD5:
       C8 4E 4E 5D D3 5C D8 9E 9F 52 82 E0 59 8A DE 15
       data hash MD5: 64K
       DC CB 70 F9 6A 54 0F 51 C0 65 61 39 A2 6B 1B AE>)
(   2,<2014-03-14 21:31:03.934 -0800>,<Administrator>,<X>,<proc1d>,<TOPSPIN 2.1>,
      <Start of raw data processing
       efp LB = 0.3 FT_mod = 6 PKNL = 1 PHC0 = 0 PHC1 = 0 SI = 128K 
       data hash MD5: 128K
       D0 44 AE B2 E6 83 A0 99 B0 64 4B 45 19 F1 51 99>)
(   3,<2014-03-14 21:31:04.871 -0800>,<Administrator>,<X>,<proc1d>,<TOPSPIN 2.1>,
      <pk PHC0 = -83.88062 PHC1 = 0 
       data hash MD5: 128K
       AB 25 84 E1 33 9D 17 1B 72 E7 02 9A 1D 23 21 55>)
(   4,<2014-03-14 21:31:05.324 -0800>,<Administrator>,<X>,<proc1d>,<TOPSPIN 2.1>,
      <abs ABSG = 1 
       data hash MD5: 128K
       A7 5A B9 B8 36 BA 84 01 29 17 F2 ED D4 0A B3 09>)
(   5,<2014-03-14 21:31:05.434 -0800>,<Administrator>,<X>,<proc1d>,<TOPSPIN 2.1>,
      <abs ABSG = 2 
       data hash MD5: 128K
       68 7F 4E 1D 60 C9 73 3B 85 82 CF 73 9B F5 2C 50>)
(   6,<2014-03-14 21:31:05.527 -0800>,<Administrator>,<X>,<proc1d>,<TOPSPIN 2.1>,
      <abs ABSG = 3 
       data hash MD5: 128K
       71 08 39 1C D4 BF 4A 1C 5A 88 DB 62 24 28 CB 53>)
(   7,<2014-03-14 21:31:05.606 -0800>,<Administrator>,<X>,<proc1d>,<TOPSPIN 2.1>,
      <abs ABSG = 4 
       data hash MD5: 128K
       6F 8E CA 9E A5 11 85 76 D4 5F 63 17 99 9F 50 7E>)
(   8,<2014-03-14 21:31:05.715 -0800>,<Administrator>,<X>,<proc1d>,<TOPSPIN 2.1>,
      <abs ABSG = 5 
       data hash MD5: 128K
       9B B3 87 4D D4 3D AC 5E 65 0E B8 A5 C0 99 F9 72>)
$$ ##END=
$$ 
$$ $$ hash MD5
$$ $$ 2C 8D 0C 00 7E D0 47 5E 19 27 93 36 BF 8E 22 34
##$RELAX= 
##$RELAX= 
##$RELAX= 
##$RELAX= 
##$RELAX= 
##$RELAX= 
##$RELAX= 
##$RELAX= 
$$ Bruker specific parameters
$$ --------------------------
##$DU= <E:\>
##$EXPNO= 22
$$ [...]
##$TP07= 0
##$TPNAME0= <>
##$TPNAME1= <>
##$TPNAME2= <>
##$TPNAME3= <>
##$TPNAME4= <>
##$TPNAME5= <>
##$TPNAME6= <>
##$TPNAME7= <>
##$TPOAL= (0..7)
0.5 0.5 0.5 0.5 0.5 0.5 0.5 0.5
##$TPOFFS= (0..7)
0 0 0 0 0 0 0 0
##$TUNHIN= 0
##$TUNHOUT= 0
##$TUNXOUT= 0
##$USERA1= <user>
##$USERA2= <user>
##$USERA3= <user>
##$USERA4= <user>
##$USERA5= <user>
##$V9= 5
##$VALIST= <valist>
##$VCLIST= <CCCCCCCCCCCCCCC>
##$VD= 0
##$VDLIST= <DDDDDDDDDDDDDDD>
##$VPLIST= <PPPPPPPPPPPPPPP>
##$VTLIST= <TTTTTTTTTTTTTTT>
##$WBST= 1024
##$WBSW= 4
##$XGAIN= (0..3)
0 0 0 0
##$XL= 0
##$YL= 0
##$YMAX_a= 6721116
##$YMIN_a= -13300287
##$ZGOPTNS= <>
##$ZL1= 120
##$ZL2= 120
##$ZL3= 120
##$ZL4= 120
##$ABSF1= 14.96131
##$ABSF2= -5.596871
##$ABSG= 5
##$ABSL= 3
##$ALPHA= 0
##$AQORDER= 0
##$ASSFAC= 0
##$ASSFACI= 0
##$ASSFACX= 0
##$ASSWID= 0
##$AUNMP= <proc_prof1d_extract.lims>
##$AXLEFT= 0
##$AXNAME= <>
##$AXNUC= <1H>
##$AXRIGHT= 0
##$AXTYPE= 0
##$AXUNIT= <>
##$AZFE= 0.1
##$AZFW= 0.1
##$BCFW= 0
##$BC_mod= 0
##$BYTORDP= 0
##$COROFFS= 0
##$CY= 15
##$DATMOD= 1
##$DC= 0
##$DFILT= <>
##$DTYPP= 0
##$F1P= 0
##$F2P= 0
##$FCOR= 0.5
##$FTSIZE= 131072
##$FT_mod= 6
##$GAMMA= 0
##$GB= 0
##$INTBC= 1
##$INTSCL= 1
##$ISEN= 128
##$LB= 0.3
##$LEV0= 0
##$LPBIN= 0
##$MAXI= 10000
##$MC2= 0
##$MEAN= 0
##$ME_mod= 0
##$MI= 0
##$NCOEF= 0
##$NC_proc= -2
##$NLEV= 6
##$NOISF1= 0
##$NOISF2= 0
##$NSP= 0
##$NTH_PI= 0
##$NZP= 0
##$OFFSET= 14.96131
##$PC= 1
##$PHC0= -83.88062
##$PHC1= 0
##$PH_mod= 1
##$PKNL= yes
##$PPARMOD= 0
##$PPDIAG= 0
##$PPIPTYP= 0
##$PPMPNUM= 2147483647
##$PPRESOL= 1
##$PSCAL= 4
##$PSIGN= 0
##$PYNMP= <proc.py>
##$REVERSE= no
##$SF= 400.020009513211
##$SI= 131072
##$SIGF1= 0
##$SIGF2= 0
##$SINO= 400
##$SIOLD= 131072
##$SPECTYP= <>
##$SREGLST= <1H.CDCl3>
##$SSB= 0
##$STSI= 131072
##$STSR= 0
##$SW_p= 8223.68421052631
##$SYMM= 0
##$S_DEV= 0
##$TDeff= 65536
##$TDoff= 0
##$TI= <>
##$TILT= no
##$TM1= 0
##$TM2= 0
##$TOPLEV= 0
##$USERP1= <user>
##$USERP2= <user>
##$USERP3= <user>
##$USERP4= <user>
##$USERP5= <user>
##$WDW= 1
##$XDIM= 131072
##$YMAX_p= 337148999
##$YMIN_p= -11325
##$CURPLOT= <Network HP LaserJet P1505>
##$CURPRIN= <$Network HP LaserJet P1505>
##$DFORMAT= <normdp>
##$LAYOUT= <+/1D_H.xwp>
##$LFORMAT= <normlp>
##$PFORMAT= <normpl>
##$SURQMSG= 1
$$ End of Bruker specific parameters
$$ ---------------------------------
##NTUPLES= NMR SPECTRUM
##VAR_NAME=  FREQUENCY,     SPECTRUM/REAL,   SPECTRUM/IMAG
##SYMBOL=    X,             R,               I
##VAR_TYPE=  INDEPENDENT,   DEPENDENT,       DEPENDENT
##VAR_FORM=  AFFN,          ASDF,            ASDF
##VAR_DIM=   131072,        131072,          131072
##UNITS=     HZ,            ARBITRARY UNITS, ARBITRARY UNITS
##FACTOR=    0.0627417313425164, 1,          1
##FIRST=     8223.62146879497, 3200,         -52415
##LAST=      0,             3931,            -52406
##MIN=       0,             -11325,          0
##MAX=       8223.62146879497, 337148999,    0
$$ Real data points
##PAGE= N=1
##DATA TABLE= (X++(R..R)), XYDATA
$$ [...]
61358D77004J194J995K670L050L218L339L544L838M039M036M165M981O424P625
61344E31122P864P418P107P236P478P518P317O846O029M876L408J611k13j322
61330F04295j335q90r54j642k303k597k739k730k285j604j371j697j770r86K84
61315E79676J441K481L558M248M094L473L221L574M050M384M897N886P119Q101
61301F40203Q627Q871R138R606J0180J0530J0320R420P901N904L547R47j751m279
61287G29164o288p614q464r131r548r409q691p790o992o057m568k535n51P44J228
61272F43498J355J577J813J806J909K980N162P297Q147P855P483P416P103O354
61258G11755N842O098O766P281P615P906Q002P882P980Q515Q814P916N713L034
$$ plain form
61358 477004 478198 480193 482863 485913 489131 492470 496014 499852 503891 507927 512092 517073 523497 531122
61344 531122 538986 546404 553511 560747 568225 575743 583060 589906 595935 600811 604219 605830 605617 604295
61330 604295 602960 602070 601116 599474 597171 594574 591835 589105 586820 585216 583845 582148 580378 579392 579676
61315 579676 581117 583598 587156 591404 595498 598971 602192 605766 609816 614200 619097 624983 632102 640203
61301 640203 648830 657701 666839 676445 686625 697155 707475 716895 724796 730700 734247 735194 733443 729164
61287 729164 722876 715262 706798 697667 688119 678710 670019 662229 655237 649180 644612 642077 641526 642270 643498
61272 643498 644853 646430 648243 650049 651958 654938 660100 667397 675544 683399 690882 698298 705401 711755
61258 711755 717597 723695 730461 737742 745357 753263 761265 769147 777127 785642 794456 802372 808085 811119
61244H11119P17j069k632m156n350n711n260m833n195n939n848m487k796j803
61230G56757j384p23M28J521J993J850J625J937K980M304N283N817O145O149N513
61215H00195M584M219M457M238K987J603J195J514J577J291J422K210L015L350
61201H37857L400L424L388L327L609M459N607O588P245P865Q884J0436J2140J3527
61187I31756J4627J5770J6774J6905J5902J4416J2982J1154Q294M770J623n90
61175A064383j985k678k771k849l665n193o625p461q115r265j1001j2739j3771
61162I76265j3857j3444j3279j3574j3822j3575j3139j3088j3319j3079j1844
61151H30245r812p605n774m488l469k279q59M40J381K083K657L096L637M576N395
$$ plain form
61244 811119 811836 810767 808135 803979 798629 792918 787658 782825 777630 771691 765843 761356 758560 756757
61230 756757 755373 754650 755078 756599 758592 760442 762067 764004 766984 771288 776571 782388 788533 794682 800195
61215 800195 804779 808998 813455 817693 820680 822283 823478 824992 826569 827860 829282 831492 834507 837857
61201 837857 841257 844681 848069 851396 855005 859464 865071 871659 878904 886769 895653 906089 918229 931756
61187 931756 946383 962153 978927 995832 1011734 1026150 1039132 1050286 1058580 1063350 1064973 1064383
61175 1064383 1062398 1059720 1056949 1054100 1050435 1045242 1038617 1031156 1023041 1013776 1002775 990036 976265
61162 976265 962408 948964 935685 922111 908289 894714 881575 868487 855168 842089 830245
61151 830245 820433 812828 807054 802566 799097 796818 795959 796399 797780 799863 802520 805616 809253 813829 819224
61136H19224M861K648J51j094j267j617k413k615j489M60K392M127N921P835R670
61121H46794J1287J2754J4240J5743J6917J7443J7653J8344J9825K1539K2884
61110A035423K3772K4126K3571K2187K0813J9967J9106J7621J5873J4429J2962
61099A249850J0907Q542O359L934O21l073o108q587j1491j4933j7983k0213k2066
61086A175759k3630k4344k4159k3800k3508k2612k0724j8470j6597j5143j3856
61075I48916j2640j1308r555p499n639m160k857j724q95n6J201K456K821K328
61061I01389K156L115M780O231O975P010O678O679P628R400J1359J3079J4356
61048A000835J4932J4979J5464J7057J9040K0335K1167K2544K4435K5849K6576
$$ plain form
61136 819224 824085 826733 826884 825790 824523 822906 820493 817878 816389 816849 819241 823368 829289 837124 846794
61121 846794 858081 870835 885075 900818 917735 935178 952831 971175 991000 1012539 1035423
61110 1035423 1059195 1083321 1106892 1129079 1149892 1169859 1188965 1206586 1222459 1236888 1249850
61099 1249850 1260757 1269299 1275658 1279592 1280213 1277140 1271032 1262445 1250954 1236021 1218038 1197825 1175759
61086 1175759 1152129 1127785 1103626 1079826 1056318 1033706 1012982 994512 977915 962772 948916
61075 948916 936276 924968 915413 907914 902275 898115 895258 893534 892639 892583 893784 896240 899061 901389
61061 901389 903545 906660 911440 917671 924646 931656 938334 945013 952641 962041 973400 986479 1000835
61048 1000835 1015767 1030746 1046210 1063267 1082307 1102642 1123809 1146353 1170788 1196637 1223213
61037A223213K7362K8439K9269K9790L0463L1138L1287L1310L2098L3333L3860
61026A561562L3726L4050L4850L5025L4699L5512L8034M0927M3239M5642M8755
61015A986021N2303N6552O2455O9599P6139Q1579Q7442R4310J00835J06893J15072
61004B889200J27412J43141J61381J83531K10867K42223K76432L14866L59193
60995D908246M08862M63157N23401N90607O64012P45260Q40838R56020J089317
60986A1189720J237955J405707J598743J817052K058512K325511K605195K830780
60978B7069175K879766K642264K108645J389238O47675K0628m06622n85443n13525
60969C5251801k76109n1024l0362l09859q43893j496399k123575k618014k912812
$$ plain form
61037 1223213 1250575 1279014 1308283 1338073 1368536 1399674 1430961 1462271 1494369 1527702 1561562
61026 1561562 1595288 1629338 1664188 1699213 1733912 1769424 1807458 1848385 1891624 1937266 1986021
61015 1986021 2038324 2094876 2157331 2226930 2303069 2384648 2472090 2566400 2667235 2774128 2889200
61004 2889200 3016612 3159753 3321134 3504665 3715532 3957755 4234187 4549053 4908246
60995 4908246 5317108 5780265 6303666 6894273 7558285 8303545 9144383 10100403 11189720
60986 11189720 12427675 13833382 15432125 17249177 19307689 21633200 24238395 27069175
60978 27069175 29948941 32591205 34699850 36089088 36736763 36757391 36350769 35765326 35251801
60969 35251801 34975692 34924668 34894306 34584447 33740554 32244155 30120580 27502566 24589754
60960B4589754k983643k856679k598019k280009j953417j645683j371920j139037
60952G761347r44861p82587o47547n37650m49708l79402l23761k80625k46582
60943C168624k18154j94213j74863j58794j43928j29725j16729j04597r2836q2590
60933A752195p5486p1121o7802o5113o3617o2448n9668n5055n0421m6831m3369
60922A091264l9105l4583l0715k7529k4672k2166k0076j8121j6080j4151j2684
60911H31382j1898j1729j1660j0939r437p907o931o201n363m933n503o634p424
60898G24823p692p786p781p742q171r175r779r179q129p944q578q948q676q217
60884F07026p532o185m649m105m758n530n578n041m207l078j904j170q32m62j12
$$ plain form
60960 24589754 21606111 18749432 16151413 13871404 11917987 10272304 8900384 7761347
60952 7761347 6816486 6033899 5386352 4848702 4398994 4019592 3695831 3415206 3168624
60943 3168624 2950470 2756257 2581394 2422600 2278672 2148947 2032218 1927621 1834785 1752195
60933 1752195 1676709 1605588 1537786 1472673 1409056 1346608 1286940 1231885 1181464 1134633 1091264
60922 1091264 1052159 1017576 986861 959332 934660 912494 892418 874297 858217 844066 831382
60911 831382 819484 807755 796095 785156 775719 767812 760881 754680 749317 744384 738881 732247 724823
60898 724823 717131 709345 701564 693822 685651 676476 666697 657518 649389 641445 632867 623919 615243 607026
60884 607026 599494 593309 588660 584555 579797 574267 568689 563648 559441 556363 554459 553289 552457 551995 551883
60869E51883k24o14o00o9N06J084K008L025L510L644M163M901M901M118L637L860
60853E89733L954L526L381L939M275L650K806K684K825K225R95K2m89j054j786
60838F20686k293k516k850l496m288n105n986o885p732q541r176r237q515p328
60824E36738o162n217m538m173l981l660l131k562j907r90j87k97j354k306k347
60809D93926j883j641j469p80L74J397J991K198K020J627J617K380L463M209M717
60794E14146N459O280O537O115N630N624O151P048Q039Q656Q611Q198P880P698
60780F12072P513P504P813P978P482O657O245O299O334O459P274Q558R199Q806
60766G16193Q405Q961R985J0372R944R418R245R298R545J0239J1266J1907J1495
$$ plain form
60869 551883 551659 551045 550445 550376 550882 551966 553974 556999 560509 564153 568316 573217 578118 582236 585873 589733
60853 589733 593687 597213 600594 604533 608808 612458 615264 617948 620773 622998 623993 624015 623526 622472 620686
60838 620686 618393 615877 613027 609531 605243 600138 594152 587267 579535 570994 561818 552581 544066 536738
60824 536738 530576 525359 520821 516648 512667 509007 505876 503314 501407 500417 500230 499933 498579 496273 493926
60809 493926 492043 490402 488933 488153 488527 489924 491915 494113 496133 497760 499377 501757 505220 509429 514146
60794 514146 519605 525885 532422 538537 544167 549791 555942 562990 571029 579685 588296 596494 604374 612072
60780 612072 619585 627089 634902 642880 650362 657019 663264 669563 675897 682356 689630 698188 707387 716193
60766 716193 724598 733559 743544 753916 763860 773278 782523 791821 801366 811605 822871 834778 846273
60753H46273J0159Q710P768P071N758L427P88j027j735k153l154m742o338p602
60739H63203q702r993j1627j3441j5083j6273j6970j7208j6923j6155j5215j4385
60727F91228j3504j2311j1026j0097r399q333o847n671n339n491n498n254m982
60714E87476m724m450m296m301m296m353m924o124p284p693p393o777n881m695
60700E10285l772l702m177m379m194m230m676m872m292l271k498k268k466k862
60686D58626l126k883k046r41J0N83Q16R61J294J697J658J047O06J087K128K788
60670D64305L010L615M694N161M352L122K606K626K223J276N85N50P09O33N38
60655E00005P62J169J432J589J982K786L738M332M351M093L964L893L522K974
$$ plain form
60753 846273 856432 865142 872910 879981 885739 889166 889954 888927 887192 885039 881885 877143 870805 863203
60739 863203 854501 844508 832881 819440 804357 788084 771114 753906 736983 720828 705613 691228
60727 691228 677724 665413 654387 644290 634891 626558 619711 614040 608701 603210 597712 592458 587476
60714 587476 582752 578302 574006 569705 565409 561056 556132 550008 542724 535031 527638 520861 514980 510285
60700 510285 506513 502811 498634 494255 490061 485831 481155 476283 471991 468720 466222 463954 461488 458626
60686 458626 455500 452617 450571 449630 449640 450223 451039 452000 453294 454991 456649 457696 458302 459389 461517 464305
60670 464305 467315 470930 475624 480785 485137 488259 490865 493491 495714 496990 497575 498125 498834 499467 500005
60655 500005 500767 501936 503368 504957 506939 509725 513463 517795 522146 526239 530203 534096 537618 540592
60641E40592K911L530L958L242J594R9p16j313k165k984l205k836k429k422k755
60626E35101l084l166k947k440j659q35n33j183k357k956k386j305q14j131j536
60611E06769j451j105j012j261j505j359o36N46J745K438K456K155K010K093K048
60596E13931J623J065Q80J157J388J134O65N86R90J460J815K250K614K386J629
60581E35573J277J902K803K994K573K379K751L476M612O295P904Q515Q311Q551
60567E99916R906J1682J3005J3966J5104J6545J8176K0044K2021K3560K4275K4424
60555H12624K4260K3346K1034J7307J2648P359J555m304r412j3112j5078j5219
60543H63008j3775j1397q666n696k384J084M402P646J1162J4994J8831K2495K6112
$$ plain form
60641 540592 543503 547033 550991 554233 555827 555926 555210 553897 551732 548748 545543 542707 540278 537856 535101
60626 535101 532017 528851 525904 523464 521805 520970 520437 519254 516897 513941 511555 510250 509436 508305 506769
60611 506769 505318 504213 503201 501940 500435 499076 498440 498986 500731 503169 505625 507780 509790 511883 513931
60596 513931 515554 516619 517499 518656 520044 521178 521843 522429 523419 524879 526694 528944 531558 533944 535573
60581 535573 536850 538752 541555 544549 547122 549501 552252 555728 560340 566635 574539 583054 591365 599916
60567 599916 609822 621504 634509 648475 663579 680124 698300 718344 740365 763925 788200 812624
60555 812624 836884 860230 881264 898571 911219 918578 920133 915829 906417 893305 878227 863008
60543 863008 849233 837836 829170 823474 821090 822174 826576 834222 845384 860378 879209 901704 927816
60530I27816K9768L3328L6656L9648M1950M2879M1773L8253L2301K4348J5403
60519A304123O717r40p542j3281j8018k1407k3415k4339k4394k3486k1487j8623
60507A113908j5414j2322r437o433k818J632O529J1093J4885J8252K1884K6043
60495A167802L0539L5341M0782M6992N3585O0139O6635P3055P8803Q2994Q5047
60484A821714Q4573Q0921P3433O2308M8810L4563K0887Q812p62p147j0023r612
60472B208477o973m054l052n486j1944k2340l6013n1638o7518q2026r3641j01004
60460A722788j03636j02424r8769r3255q5814p7023o8334o0670n3753m7091m0930
60449H91089l5670l1083k6742k2736j9341j6349j3444j0965r595r327r281q649
$$ plain form
60530 927816 957584 990912 1027568 1067216 1109166 1152045 1193818 1232071 1264372 1288720 1304123
60519 1304123 1310840 1309900 1302358 1289077 1271059 1249652 1226237 1201898 1177504 1154018 1132531 1113908
60507 1113908 1098494 1086172 1076735 1070302 1067484 1069116 1075645 1086738 1101623 1119875 1141759 1167802
60495 1167802 1198341 1233682 1274464 1321456 1375041 1435180 1501815 1574870 1653673 1736667 1821714
60484 1821714 1906287 1987208 2060641 2122949 2171759 2206322 2227209 2236021 2235259 2228112 2218089 2208477
60472 2208477 2201504 2197450 2194398 2188912 2176968 2154628 2118615 2066977 1999459 1917433 1823792 1722788
60460 1722788 1619152 1516728 1417959 1324704 1238890 1161867 1093533 1032863 979110 932019 891089
60449 891089 855419 824336 797594 774858 755517 739168 725724 714759 705164 695837 686556 677907
60437F77907p417o134n208m585l976l248k495j725p27M28J106P39l39j357k193
60422F40776l299m580n240n024m681m742m683l893k725j918j543j208q68p16p06
60407E94950p52j027j477j508p97M2K80J09J82N36P35O82M61k16j416k219j645
60390E86920k24M68j41j000j050m07K87P99J133J106O02j28p42j048r29m45j6
60373E85185l4k82k39L3L3j71J18J069J807J536N89OL68J346K119K062J305O71
60355E97521P89J274J241M98k94o73q21r27q28n08k99l09j99Q7N5n49j127r06
60337E94025J59J452K322K432J919J394J384J551J014l87j691j964j325m57K61
60322F02089P39Q43O57O58J133J739K052K157K346K615K898L354L988M420M533
$$ plain form
60437 677907 670490 664356 659148 654563 650587 647339 644844 643119 642392 642820 643926 644665 644326 642969 640776
60422 640776 637477 632897 627657 622633 617952 613210 608527 604634 601909 599991 598448 597240 596372 595656 594950
60407 594950 594198 593171 591694 590186 589389 589431 589711 589820 590002 590538 591273 591955 592416 592200 590784 588565 586920
60390 586920 586696 587164 587023 586023 584973 584566 584853 585652 586785 587891 588493 588365 587623 586575 585646 585201 585185
60373 585185 585151 584869 584630 584663 584696 584525 584643 585712 587519 589055 589644 589650 590018 591364 593483 595545 596850 597521
60355 597521 598310 599584 600825 601323 601029 600356 599535 598608 597780 597272 596973 596664 596465 596552 596607 596058 594931 594025
60337 594025 594184 595636 597958 600390 602309 603703 605087 606638 607652 607265 605574 603610 602285 601828 602089
60322 602089 602828 603671 604328 604986 606119 607858 609910 612067 614413 617028 619926 623280 627268 631688 636221
60307F36221M850N810P015P832Q342R119J0334J1679J2971J4262J5647J7297J9342
60294G80721K1184K1439J9242J5198J0356M769j991r225j5201j8895k0667k1221
60282G85709k0877j9941j8784j7265j4974j2288j0313r413q678p350n836m855
60270F35135m367m080m204m853n288m733l557k784k625k413j771j013l98K00P51
60255E94000R72Q90Q90J084J222J302J579J832J442M92K5O66J622J702Q70P6j23
60238F10543NJ45L42N99O79N09L21K61K57L25O52J292K114L056M046M683M562
60221F34391M009L898M552N323N564N372N014M230K801J436J197K141L235L636
60207F86799L541L605M106M882N679O208O143N347M030K561J262L79N8J89L30
$$ plain form
60307 636221 641071 646881 653896 661728 670070 679189 689523 701202 714173 728435 744082 761379 780721
60294 780721 801905 823344 842586 857784 868140 872909 870918 861693 846492 827597 806930 785709
60282 785709 764832 744891 726107 708842 693868 681580 671267 661854 653176 645826 639990 635135
60270 635135 630768 626688 622484 617631 612343 607610 604053 601269 598644 596231 594460 593447 593049 593249 594000
60255 594000 594972 595862 596752 597836 599058 600360 601939 603771 605213 605705 605730 606396 608018 609720 610590 610666 610543
60238 610543 610548 610693 611035 611634 612313 612822 613143 613404 613661 613986 614638 615930 618044 621100 625146 629829 634391
60221 634391 638400 642298 646850 652173 657737 663109 668123 672353 675154 676590 677787 679928 683163 686799
60207 686799 690340 693945 698051 702933 708612 714820 720963 726310 730340 732901 734163 734542 734600 734789 735119
60192G35119l9j158k769m183m731m301l477k982l125l728m435m857m718m116l506
60177F82994l107k590j701r01q38j277j295n91O2o6o83j039r79r33j117j270j098
60160F63571o54j54K63N74Q25J095J484K088K980M044M896N160M922M709M921
60145G00724N450N956O286O486O562O429O015N318M417L541K968K838L075L555
60131G69620M184M821N243N277M900M124K916J319m33j943k806k842k333j909
60117G90138j997k421k650k327j428j26J160J826J623J097J024J468J788J541
60103G90716Q97J89l81n01J46J267K087K313K530L246M141M671M935N384N964
60088H27604O201N878N132L981K344M03j397k737l489l642l473l593m303n081
$$ plain form
60192 735119 735080 733922 731153 726970 722239 717938 714461 711479 708354 704626 700191 695334 690616 686500 682994
60177 682994 679887 677297 675596 674695 673857 672580 671285 670694 670756 670690 670007 668968 667989 667056 665939 664669 663571
60160 663571 662917 662763 663026 663600 664425 665520 667004 669092 672072 676116 681012 686172 691094 695803 700724
60145 700724 706174 712130 718416 724902 731464 737893 743908 749226 753643 757184 760152 762990 766065 769620
60131 769620 773804 778625 783868 789145 794045 798169 801085 802404 801971 800028 797222 794380 792047 790138
60117 790138 788141 785720 783070 780743 779315 779189 780349 782175 783798 784895 785919 787387 789175 790716
60103 790716 791613 791802 791421 790920 791066 792333 794420 796733 799263 802509 806650 811321 816256 821640 827604
60088 827604 833805 839683 844815 848796 851140 851543 850146 847409 843920 840278 836805 833212 828909 823828
60074H23828n241m931m862n095m948m232l831m442n425n578m820m301m808n807
60060G55507o321o225o184o557o976p086p057p133p017o254n073m311m354m590
60046F70369m163l020j892j375j281j027m13J24R4k87k14P28J885K231J598P33
60030F64090J52n11j698k961l424k988k556k901l784m403m457m424m811n439n628
60015F14257m992l833k759k130j918j922j841j405o43N4L92N91J071J862K611
60000E99395L085L336L434L468L719M370N037N092M526L984L887M049M212M397
59986F55991M435L827K496J206O75P05O46M17M32O98O14k26j486k442k711k507
59970F62770k349k522k778k666k080j368q67o31n98o16k65Q51K458L664M021M084
$$ plain form
60074 823828 818587 813656 808794 803699 798751 794519 790688 786246 780821 775243 770423 766122 761314 755507
60060 755507 749186 742961 736777 730220 723244 716158 709101 701968 694951 688697 683624 679313 674959 670369
60046 670369 666206 663186 661294 659919 658638 657611 657198 657322 657416 657129 656915 657643 659528 661759 663357 664090
60030 664090 664242 663731 662033 659072 655648 652660 650104 647203 643419 639016 634559 630135 625324 619885 614257
60015 614257 609265 605432 602673 600543 598625 596703 594862 593457 592814 592868 593260 593851 594922 596784 599395
60000 599395 602480 605816 609250 612718 616437 620807 625844 630936 635462 639446 643333 647382 651594 655991
59986 655991 660426 664253 666749 667955 668630 669335 669981 670398 670830 671528 672142 671916 670430 667988 665277 662770
59970 662770 660421 657899 655121 652455 650375 649007 648140 647509 646911 646295 646030 646881 649339 653003 657024 661108
59954F61108M561N290N520M910L838K874K322K137J936J328M20k20m02p01j597
59939F93324k617k894k386j927k179k970l669l789l294k652k526l074l651l524
59925F52172k698j703p75K01J125J649J718J694J839K086K323K559K747K818K862
59910F70617L008L155L130L040L094L177K947K376J777J333R20M65J19O6M17J256
59894G00897K498L753M639N144N389N193M362L256K579K531K678K666K611K638
59880G50834K590K315J962J734J632J541J358R96M98J83K84M24j35j521k947l633
59864G58115l750m090m990n908o120n565m833m341l862l024k087j655j642j146
59850G05102K38J597J807J064N16N96N94K7m16K85K172M237N484N748N664N959
$$ plain form
59954 661108 665669 670959 676479 681389 685227 688101 690423 692560 694496 695824 696244 696024 695622 694921 693324
59939 693324 690707 687813 685427 683500 681321 678351 674682 670893 667599 664947 662421 659347 655696 652172
59925 652172 649474 647771 646996 647197 648322 649971 651689 653383 655222 657308 659631 662190 664937 667755 670617
59910 670617 673625 676780 679910 682950 686044 689221 692168 694544 696321 697654 698574 699039 699158 699224 699641 700897
59894 700897 703395 707148 711787 716931 722320 727513 731875 735131 737710 740241 742919 745585 748196 750834
59880 750834 753424 755739 757701 759435 761067 762608 763966 764962 765460 765643 765927 766351 766216 764695 761748 758115
59864 758115 754365 750275 745285 739377 733257 727692 722859 718518 714656 711632 709545 707890 706248 705102
59850 705102 705340 706937 708744 709808 710324 710920 711514 711541 711125 711410 713582 717819 723303 729051 734715 740674
59834G40674O709P382P719Q320R850J1844J2865J2022R741O954M082J189j388
59821H37963l087l731l718l726m387o048q586j1470j4156j6388j8044j8831j8310
59808G07481j6352j3504j0776q918p848o916n698m322l075k090j542j649k238
59795F22553k663k552k199j950j646j148q96j262j807j903j779k072k636k740
59781E95300k343k180k524k821k737k573k423j838q02j12l22r81j366j337r73
59766E69968j48J001J776J787J586J842K330K425K176K139K405K594K636K931
59752E97448L625M311M553M372M107L983L892L497K630J605R18O19L51J0r6L2
59736F35857j59r08j580j519j077j090j570j684r86j5M98N03M40N08M79J35l48
$$ plain form
59834 740674 747383 754765 762484 770804 780654 792498 805363 817385 827126 834080 838162 839351 837963
59821 837963 834876 831145 827427 823701 819314 813266 804680 793210 779054 762666 744622 725791 707481
59808 707481 691129 677625 666849 657931 650083 643167 637469 633147 630072 627982 626440 624791 622553
59795 622553 619890 617338 615139 613189 611543 610395 609499 608237 606430 604527 602748 600676 598040 595300
59781 595300 592957 590777 588253 585432 582695 580122 577699 575861 575059 574947 574625 573644 572278 570941 569968
59766 569968 569820 570821 572597 574384 575970 577812 580142 582567 584743 586882 589287 591881 594517 597448
59752 597448 601073 605384 609937 614309 618416 622399 626291 629788 632418 634023 634941 635560 635911 635921 635825 635857
59736 635857 635698 634790 633210 631691 630614 629524 627954 626270 625284 625269 625767 626270 626710 627218 627697 627832 627484
59719F27484n67l80p3J00L91J205K312K904K558J770J271J240J439J753K152K505
59703F48064K833L490M622N683N975N510M903M547M431M663N427O350O547N650
59689G18695M411L780L689L192J732j31j351j509j070q02j123j897k615k730k121
59674G20150j289r10j107j473j856k586l669m266l666k431j803k033k084j131
59660F89846M33J690K266K371K316K420K933L644L919L513K975K904L154L194
59646G27578K875K359J588L19j403l263n025o510p422p595p333p090o861o223
59632F75994n037l759k953k665k448j950j397j370j978k521k246j429j126j775
59618F43340k563k502j727j199j431k011k325k289k199k144j866j202m97l66r31
$$ plain form
59719 627484 626917 626537 626464 626564 626955 628160 630472 633376 635934 637704 638975 640215 641654 643407 645559 648064
59703 648064 650897 654387 659009 664692 670667 676177 681080 685627 690058 694721 700148 706498 713045 718695
59689 718695 723106 726886 730575 733767 735499 735368 734017 732508 731438 730636 729513 727616 725001 722271 720150
59674 720150 718861 717951 716844 715371 713515 710929 707260 702994 699328 696897 695094 693061 690977 689846
59660 689846 690279 691969 694235 696606 698922 701342 704275 707919 711838 715351 718326 721230 724384 727578
59646 727578 730453 732812 734400 734719 733316 730053 725028 718518 711096 703501 696168 689078 682217 675994
59632 675994 670957 667198 664245 661580 659132 657182 655785 654415 652437 649916 647670 646241 645115 643340
59618 643340 640777 638275 636548 635349 633918 631907 629582 627293 625094 622950 621084 619882 619385 619019 618088
59603F18088j562j561r23j08O54J349J681J253L18l13k54O5J46j0k17m06m21j49
59585F17630Rn76j676k174j500m89k89j007j955k664l025k889k238j561j462j973
59569E92161k626k930k610j760r56p61q76m17P00J427J103M51M10P68Q00N58N71
59552E86013Q42J078J479K322L137L260K884K727K909L178L694M606N273N120
59538F28522M967O089Q106R372R590J0414J2890J5589J6167J3846R641M917O17
59525G50727k606m390m830m334l397k452j648p82K07Q53P62L72L17K12r40l131
59509G24940n160o241o774p247p445p197o915o811o409n473m608m354m363m147
59495F41796l839l564k776j180L76Q91O83Q67J650K174J975J654J923K712L494
$$ plain form
59603 618088 616526 614965 614042 613934 614588 615937 617618 618871 619189 618876 618622 618687 618833 618823 618606 618200 617779 617630
59585 617630 617639 617063 615387 613213 611713 611224 610935 609928 607973 605309 602284 599395 597157 595596 594134 592161
59569 592161 589535 586605 583995 582235 581279 580518 579642 579225 579925 581352 582455 582906 583316 584084 584884 585442 586013
59552 586013 586855 587933 589412 591734 594871 598131 601015 603742 606651 609829 613523 618129 623402 628522
59538 628522 633489 639578 647684 657056 666646 677060 689950 705539 721706 735552 745193 750110 750727
59525 750727 748121 743731 738901 734567 731170 728718 727070 726288 726495 727348 728110 728482 728799 729011 728071 724940
59509 724940 719780 713539 706765 699518 692073 684876 677961 671150 664741 659268 654660 650306 645943 641796
59495 641796 637957 634393 631617 630437 630813 631704 632387 633254 634904 637078 639053 640707 642630 645342 648836
59480F48836M009M411M970N739O372O453O133O182P077Q290Q830Q341P236N981
59466G38860M668L226J662J21j075j545j199k81J068K847M672N761N971O333P906
59451G78995J0349J2374J3297J3417J3074J2251J1195J0505J0239R584P759M804
59439I07843J168k938p260j1007j3215j3639j2982j2235j1944j1957j1699j0720
59427G89415r153p652o768o368n703m065j455J404L768N629P588R833J1706J2547
59413H00726J2750J3353J4711J6197J7272J8032J8345J7136J3349P357P63n051
59401I44940r671j3057j4970j5177j3686j0541n897p86K704K699r00o389j1796
59388H47473j6046j8828j9986j9476j7649j5068j2119r052o356m596l745k950
$$ plain form
59480 648836 652845 657256 662226 667965 674337 680790 686923 693105 700182 708472 717302 725643 732879 738860
59466 738860 743528 746754 748416 748537 747462 745917 744718 744437 745505 748352 753024 758785 764756 771089 778995
59451 778995 789344 801718 815015 828432 841506 853757 864952 875457 885696 895280 903039 907843
59439 907843 909011 906073 898813 887806 874591 860952 847970 835735 823791 811834 800135 789415
59427 789415 780262 772610 765842 759474 753771 749706 748251 749655 753423 759052 766640 776473 788179 800726
59413 800726 813476 826829 841540 857737 875009 893041 911386 928522 941871 949228 949991 944940
59401 944940 935269 922212 907242 892065 878379 867838 861941 861155 863859 866558 865658 859269 847473
59388 847473 831427 812599 792613 773137 755488 740420 728301 719249 712893 708297 704552 701602
59376G01602j399P15K451L233L396L517L694L782L977M648N692O586P142P745
59362G56781Q656R558J0007J0051J0030J0050J0013R997J0213J0711J1343J1966
59350H79376J2477J2851J3306J4160J5315J6169J6409J6459J6762J6956J6425
59339A046665J5288J4063J2686J0699Q300O139M070J237k369n541p582r329j1708
59326A082618j4157j5442j5434j5136j5281j5708j5938j5607j4524j2918j1480
59315I20993j0604r863q754p589o950o602n804m488l349k768k450k137j931j777
59301H45927j316m81K90O87R44J470K331L304M106M586M865N248N791O142O186
59286H90080O476P600R349J1042J2522J4121J5890J7508J8806J9599J9042J6034
$$ plain form
59376 701602 700203 700918 703369 706602 709998 713515 717209 720991 724968 729616 735308 741894 749036 756781
59362 756781 765437 774995 785002 795053 805083 815133 825146 835143 845356 856067 867410 879376
59350 879376 891853 904704 918010 932170 947485 963654 980063 996522 1013284 1030240 1046665
59339 1046665 1061953 1076016 1088702 1099401 1107701 1113840 1117910 1119147 1116778 1111237 1103655 1094326 1082618
59326 1082618 1068461 1053019 1037585 1022449 1007168 991460 975522 959915 945391 932473 920993
59315 920993 910389 900526 891772 884183 877233 870631 864827 860339 856990 854222 851772 849635 847704 845927
59301 845927 844611 844130 844420 845107 846051 847521 849852 853156 857262 861848 866713 871961 877752 883894 890080
59286 890080 896556 904156 913505 924547 937069 951190 967080 984588 1003394 1022993 1042035 1058069
59274A058069J0513L693l062q883j2944j4373j3146j0445p663n444l952l359l558
59261I85446l998m330m918o186p834r198j0120j0971j1958j2886j3488j3616j3164
59248H62779j2158j0923r879r119q368p366o128m778l299j635N0J372K133K599
59234G95280L097L498L443L167L413M304M929M545L618K991K475J236o85k238
59220H33073k889l271m057m991n434n249m680l834k807j913j434j238r46l16O54
59205G90668J738K581K986L145L305L323K994K662K959L859M652M953N121N381
59191H40327N306M626L941M051M861N570N760N720N703N398M380K899J813J670
59177I02025K047K060J443P24K96p9n48n29N23K081L082L347L724M777N993O491
$$ plain form
59274 1058069 1068582 1072275 1069213 1060330 1047386 1033013 1019867 1009422 1001759 996315 992363 989004 985446
59261 985446 981448 977118 972200 966014 958180 948982 938862 927891 915933 903047 889559 875943 862779
59248 862779 850621 839698 829819 820700 812332 804966 798838 794060 790761 789126 789176 790548 792681 795280
59234 795280 798377 801875 805318 808485 811898 816202 821131 825676 829294 832285 834760 835996 835311 833073
59220 833073 830184 826913 822856 817865 812431 807182 802502 798668 795861 793948 792514 791276 790330 790014 790668
59205 790668 792406 794987 797973 801118 804423 807746 810740 813402 816361 820220 824872 829825 834946 840327
59191 840327 845633 850259 854200 858251 863112 868682 874442 880162 885865 891263 895643 898542 900355 902025
59177 902025 904072 906132 907575 908299 908595 908516 907968 907439 907962 910043 913125 916472 920196 924973 930966 937457
59161I37457O020N106M486M478M613M109K925J911J506Q52j042l644n502o219
59147I57056o737p685q572q829q612q226p625o846o167n544m546l172k090j781
59133H70624k000k275k331k014j418j045j195j281o21L46O99P35J643L383M512
59118H67762M440M376N294O497P029P173P520P696P178O434O085N713M624L096
59104I50917J804O56p50k020k469k316k419l069l929m779n548n927n691n135m596
59089I04729l961l188k788l055l412l254k898l010l583m184m747n408o087o824
59075H48330p911r041r156p888o311n434m843l823k843k679k910k646k114k014
59061G78717k017j421p85j196k209k339j445q80j212j565j439j445j710j305o
$$ plain form
59161 937457 943477 948583 953069 957547 962160 966269 969194 971105 972611 973463 972421 968777 963275 957056
59147 957056 950319 942634 934062 925233 916621 908395 900770 893924 887757 882213 877667 874495 872405 870624
59133 870624 868624 866349 864018 862004 860586 859541 858346 857065 856444 856790 857489 858224 859867 863250 867762
59118 867762 872202 876578 881872 888369 895398 902571 910091 917787 924965 931399 937484 943197 947821 950917
59104 950917 952721 953377 952627 950607 948138 945822 943403 940334 936405 931626 926078 920151 914460 909325 904729
59089 904729 900768 897580 894792 891737 888325 885071 882173 879163 875580 871396 866649 861241 855154 848330
59075 848330 840419 831378 822222 814334 808023 802589 797746 793923 791080 788401 785491 782845 780731 778717
59061 778717 776700 775279 774494 773298 771089 768750 767305 766425 765213 763648 762209 760764 759054 757749 757743
59046G57743Q88M33m41l56N37J054Q04M69N45Q04Q73P95Q70J251J684J739J361
59029G71053J097J453K155K524K467K541L102L960M877N862O835P586Q089Q431
59015H32032Q439P811O556M914K974Q67q52j662j747j644j405p63M0N08P66J438
58999H58272K599L666M326M790N107N068M865M979N320N219M469L551K678J452
58985I16361k68j935l094l893m504m700m358l763l084k054n89Q30J773K489L544
58970H92755N160P097Q896J0127J0757J1321J2324J3462J3936J3503J2686J1839
58958A023863J0726R107P126M837J937j637n281q176j0007j1112j2197j3816j5737
58945I79633j6835j6159j4158j2330j1603j1543j1190j0154q687p260o240n641
$$ plain form
59046 757743 758631 759064 758623 758267 758804 759858 760662 761131 761676 762480 763353 764148 765018 766269 767953 769692 771053
59029 771053 772150 773603 775758 778282 780749 783290 786392 790352 795229 801091 807926 815512 823601 832032
59015 832032 840471 848282 854838 859752 862726 863593 862741 861079 859332 857688 856283 855520 855560 856068 856834 858272
58999 858272 860871 864537 868863 873653 878760 883828 888693 893672 898992 904211 908680 912231 914909 916361
58985 916361 916093 914158 911064 907171 902667 897967 893609 889846 886762 884708 884119 884949 886722 889211 892755
58970 892755 897915 905012 913908 924035 934792 946113 958437 971899 985835 999338 1012024 1023863
58958 1023863 1034589 1043696 1050822 1055659 1057596 1055959 1050678 1042502 1032495 1021383 1009186 995370 979633
58945 979633 962798 946639 932481 920151 908548 897005 885815 875661 866974 859714 853474 847833
58933H47833n073m237l393l032l096l059k649k062j479r43n87m82l32J09N25N40
58917H18583N37J142K093K471K157K118L005M289N087N217N062N030N459O510
58903H68760P888R055R889J0768J1969J3399J4874J6211J7124J7510J7789J8261
58891A033497J8414J7570J6170J5457J5859J6588J6926J7015J7110J6930J6109
58880A217645J4622J2432R404N803K227j102m399p521r920j1599j3361j5692j8087
58867A180452j9696k0112j9331j7673j5984j5153j5116j4983j4318j3654j3435
58856A000997j3348j3047j2766j2796j2890j2694j2220j1522j0449q997p510o285
58844H66473n422n095n388n762n471m613m033m008l929l497l288l723m328m539
$$ plain form
58933 847833 842760 838523 835130 832098 829002 825943 823294 821232 819753 818810 818223 817741 817409 817518 818043 818583
58917 818583 819120 820262 822355 824826 826983 829101 832106 836395 841482 846699 851761 856791 862250 868760
58903 868760 876648 885703 895592 906360 918329 931728 946602 962813 979937 997447 1015236 1033497
58891 1033497 1051911 1069481 1085651 1101108 1116967 1133555 1150481 1167496 1184606 1201536 1217645
58880 1217645 1232267 1244699 1254103 1259906 1262133 1261031 1256632 1249111 1239191 1227592 1214231 1198539 1180452
58867 1180452 1160756 1140644 1121313 1103640 1087656 1072503 1057387 1042404 1028086 1014432 1000997
58856 1000997 987649 974602 961836 949040 936150 923456 911236 899714 889265 880268 872758 866473
58844 866473 861051 855956 850568 844806 839335 834722 830689 826681 822752 819255 815967 812244 807916 803377
58830H03377m438m212l603k514j516j114r94n18L81J298J892K045J837J623J811
58815G95355K341K826L163L522L764L556L133L094L440L579L383L233L003K020
58801H39412L85q28j090j037j212j251r33q51j318j637j246o80n59m74J65J006
58785H27852J409J589K192L186M039M575M922N097N269N889O851P128O009M152
58771H90159K617J418j31k095l881n235o349p158p369p069o670o311n877n425
58757H30624n032m354k958j066M83J087Q87N53P02J430K266K794L284M300N712
58742H40712O679O701O146N601N319N511O359P477P978P528O711O120N675N176
58728I29693M723M292L589K687K157K197K319K170J968J828J515J169J401K247
$$ plain form
58830 803377 798939 794727 791124 788610 787094 785980 784986 784468 784849 786147 788039 790084 791921 793544 795355
58815 795355 797696 800522 803685 807207 810971 814527 817660 820754 824194 827773 831156 834389 837392 839412
58801 839412 839797 838969 837879 836842 835630 834379 833446 832595 831277 829640 828394 827714 827155 826681 826846 827852
58785 827852 829261 830850 833042 836228 840267 844842 849764 854861 860130 866019 872870 879998 886007 890159
58771 890159 892776 894194 894063 891968 888087 882852 876503 869345 861976 854907 848237 841926 836049 830624
58757 830624 825592 821238 818280 817214 817697 818784 819671 820224 820926 822356 824622 827416 830700 835000 840712
58742 840712 847391 854092 860238 865839 871158 876669 883028 890505 898483 906011 912722 918842 924517 929693
58728 929693 934416 938708 942297 944984 947141 949338 951657 953827 955795 957623 959138 960307 961708 963955
58714I63955K911K973K890K925K584J708R87P06L6j650l711n361o881q721j0267
58699I45084j0652j0190r921j0214j0703j1144j1508j1577j1194j0559r799q680
58687H18943p259o111n449m715l639k825k673k617k188j894k168k391j880j042
58673G72092m44L75K040L959M982M971M629M354M305N041O880Q954J0000R771
58659H41909Q824P326N153K749P69q89k707m427n293n193m707m180l543k960k798
58644H30033l008l090k646j648l88N11N24Pl8O85J392J545J696K384L142L338
58628H34439L188L126K954K447J963J696J048k16j093n34J081K626L697M526N183
58613H66131N732O527P471P743P030O228O081O005N204L954K793J466j83j321
$$ plain form
58714 963955 966866 969839 972729 975654 978238 979946 980933 981639 981675 980025 976314 970953 964072 955351 945084
58699 945084 934432 924242 914321 904107 893404 882260 870752 859175 847981 837422 827623 818943
58687 818943 811684 805573 800124 795409 791770 788945 786272 783655 781467 779573 777405 775014 773134 772092
58673 772092 771648 772023 774063 778022 783004 787975 792604 796958 801263 806304 813184 822138 832138 841909
58659 841909 850733 858059 863212 865961 866730 865841 863134 858707 853414 848221 843514 839334 835791 832831 830033
58644 830033 827025 823935 821289 819641 819253 819764 820288 820295 820257 820942 822334 823879 825575 827959 831101 834439
58628 834439 837627 840753 843707 846154 848117 849813 850861 850645 849552 849018 850099 852725 856422 860948 866131
58613 866131 871863 878390 885861 893604 900634 906862 912943 918948 924152 928106 930899 932365 932182 930861
58599I30861j313r05r52r41j34Q17R26P09J327K585L384L660M330N666P095Q302
58583I65417R380J0231J0846J1575J2216J1729R932Q367Q137Q069O632M617L927
58570A081075M587N041M871N139O342P892R496J1340J3048J3987J4419J4972J5307
58557A207516J4684J3357J2039J0485Q168N674L825K071n29l374n135n866o489
58544A256426o840o250n453n710o554o614o312p366r743j1499j1763j1573j1539
58531A149210j0951r616q560q306q063p127n610l693j557oL84N27J632L109L463
58516A094836K890K860L462L394K570K368L098L547L262L116L228K620J346Q16
58502A133413J394J744J150N34N68O91O48J112K126K660K276J718J428J177J366
$$ plain form
58599 930861 929548 928643 927691 926750 926616 927433 928359 929068 930395 932980 936364 940024 944354 950020 957115 965417
58583 965417 974797 985028 995874 1007449 1019665 1031394 1041326 1049693 1057830 1065899 1072531 1077148 1081075
58570 1081075 1085662 1090703 1095574 1100713 1107055 1114947 1124443 1135783 1148831 1162818 1177237 1192209 1207516
58557 1207516 1222200 1235557 1247596 1258081 1266249 1271923 1275748 1277819 1277290 1273916 1268781 1262915 1256426
58544 1256426 1249586 1243336 1237883 1232173 1225619 1219005 1212693 1205327 1195584 1184085 1172322 1160749 1149210
58531 1149210 1138259 1128643 1120083 1111777 1103714 1096587 1090977 1087284 1085727 1085721 1086105 1086632 1088264 1091373 1094836
58516 1094836 1097726 1100586 1104048 1107442 1110012 1112380 1115478 1119025 1122287 1125403 1128631 1131251 1132597 1133413
58502 1133413 1134807 1136551 1137701 1138235 1138803 1139494 1140142 1141254 1143380 1146040 1148316 1150034 1151462 1152639 1154005
58487A154005K821M958O117O094O366P471Q218Q059Q071Q791R218Q824Q636R341
58473A256990J0016R762Q947Q004O494M255K009J64j662l305l763k852j737j172
58459A292150n72O49K184L692N241O576P270P764Q875J0189J0455R576Q554P537
58445A380140N768L462J806J011K11p05j094j222j801k025m38K278L885M032M470
58430A399778N723O425O287O800Q274R016Q377P924Q661R585R907J0203J0429
58417A507389R374P007N018M110L176J870J391J853J632L41k58N94J307Q44L65
58402A546013P06Q96M22M29J411K172K305L068M649N315M516M130N173O029N467
58387A592701M649M663M679M113L909M182L367J348N86K433N055O679Q099J0219
$$ plain form
58487 1154005 1156826 1161784 1167901 1173995 1180361 1187832 1196050 1204109 1212180 1220971 1230189 1239013 1247649 1256990
58473 1256990 1267006 1276768 1285715 1293719 1300213 1304468 1306477 1306641 1304979 1301674 1297911 1295059 1293322 1292150
58459 1292150 1291578 1292227 1294411 1298103 1303344 1309920 1317190 1324954 1333829 1344018 1354473 1364049 1372603 1380140
58445 1380140 1385908 1389370 1391176 1392187 1392398 1391693 1390599 1389377 1387576 1385551 1385113 1387391 1391276 1395308 1399778
58430 1399778 1405501 1411926 1418213 1425013 1433287 1442303 1450680 1458604 1467265 1476850 1486757 1496960 1507389
58417 1507389 1516763 1523770 1528788 1532898 1536074 1537944 1539335 1541188 1542820 1543161 1542903 1543497 1544804 1545648 1546013
58402 1546013 1546719 1547615 1548037 1548466 1549877 1552049 1554354 1557422 1562071 1567386 1571902 1576032 1581205 1587234 1592701
58387 1592701 1597350 1602013 1606692 1610805 1614714 1618896 1622263 1623611 1624197 1626630 1631685 1638364 1646463 1656682
58373A656682J1942J2534J3293J4938J5939J5400J4861J5396J5616J4641J4175
58362A815417J5464J6902J6896J6524J7065J7542J6937J6376J6819J7037J6000
58351A998979J4814J4308J3330J1456J0602J1807J3202J3318J3537J5036J6353
58340B146742J6359J6593J8109J9117J8375J7891J9432K1338K1657K1523K2493
58329B359629K3420K2980K2530K3442K4251K3404K2168K1989K1655J9968J8387
58318B603823J8264J8272J7388J7216J8653J9494J8385J7670J9232K1052K1228
58307B810677K1636K3999K6081K5735K5135K6837K9147K9570K9418L0683L1771
58296C110689L0861L0119L1934L4244L4320L3965L6076L9215M0515M1016M3012
$$ plain form
58373 1656682 1668624 1681158 1694451 1709389 1725328 1740728 1755589 1770985 1786601 1801242 1815417
58362 1815417 1830881 1847783 1864679 1881203 1898268 1915810 1932747 1949123 1965942 1982979 1998979
58351 1998979 2013793 2028101 2041431 2052887 2063489 2075296 2088498 2101816 2115353 2130389 2146742
58340 2146742 2163101 2179694 2197803 2216920 2235295 2253186 2272618 2293956 2315613 2337136 2359629
58329 2359629 2383049 2406029 2428559 2452001 2476252 2499656 2521824 2543813 2565468 2585436 2603823
58318 2603823 2622087 2640359 2657747 2674963 2693616 2713110 2731495 2749165 2768397 2789449 2810677
58307 2810677 2832313 2856312 2882393 2908128 2933263 2960100 2989247 3018817 3048235 3078918 3110689
58296 3110689 3141550 3171669 3203603 3237847 3272167 3306132 3342208 3381423 3421938 3462954 3505966
58285C505966M5098M4951M4243M5698M8013M8731M9262N1979N5256N6575N7580
58274D053352O0837O4559O5970O6782O9811P3244P4027P3953P6379P9905Q1342
58263D840161Q2079Q5404R0210R3448R6046J00322J04505J05969J06957J10808
58253E815909J15564J17693J18973J23165J29094J33643J38152J45173J52510
58244F989876J57513J63318J73550J84912J92826K00135K12019K26472K38507
58235H739128K49637K64199K80389K94342L08987L29212L52268L72817L93385
58226A1584364M19732M50176M80016N11958N51207N94976O38303O85387P43250
58217A6659369Q09439Q78606R55660J048989J156658J273831J407876J570888
$$ plain form
58285 3505966 3551064 3596015 3640258 3685956 3733969 3782700 3831962 3883941 3939197 3995772 4053352
58274 4053352 4114189 4178748 4244718 4311500 4381311 4454555 4528582 4602535 4678914 4758819 4840161
58263 4840161 4922240 5007644 5097854 5191302 5287348 5387670 5492175 5598144 5705101 5815909
58253 5815909 5931473 6049166 6168139 6291304 6420398 6554041 6692193 6837366 6989876
58244 6989876 7147389 7310707 7484257 7669169 7861995 8062130 8274149 8500621 8739128
58235 8739128 8988765 9252964 9533353 9827695 10136682 10465894 10818162 11190979 11584364
58226 11584364 12004096 12454272 12934288 13446246 13997453 14592429 15230732 15916119 16659369
58217 16659369 17468808 18347414 19303074 20352063 21508721 22782552 24190428 25761316
58209B5761316J763749J984101K243338K557830K929791L355336L843238M403992
58201D8842691N027174N692439O397012P151857P963723Q849295R853596J1018350
58193A10796137J2340249J3794762J5384478J7114894J8930877K0716169K2297298
58186B31374864K3309652K3042548K0608673J5491954Q011105p57173r481646
58179C11599977j7027220k2623059k5895725k6899464k6064737k4003857k1292013
58172A47793902j8359149j5485815j2830367j0460670q387692o588472n022263
58165G0659474l648915k428883j307121k51012O40389J100718Q66890p5599j448867
58156F4107074k882476m108876m979916n409933n391575n031370m493878l903181
$$ plain form
58209 25761316 27525065 29509166 31752504 34310334 37240125 40595461 44438699 48842691
58201 48842691 53869865 59562304 65959316 73111173 81074896 89924191 99777787 110796137
58193 110796137 123136386 136931148 152315626 169430520 188361397 209077566 231374864
58186 231374864 254684516 277727064 298335737 313827691 321838796 321081623 311599977
58179 311599977 294572757 271949698 246053973 219154509 193089772 169085915 147793902
58172 147793902 129434753 113948938 101118571 90657901 82270209 75681737 70659474
58165 70659474 67010559 64581676 63274555 63023543 63663932 64764650 65631540 65555941 64107074
58156 64107074 61224598 57115722 52135806 46725873 41334298 36302928 31809050 27905869
58148B7905869l320664k787224k334952j964162j652096j388636j178109j011997
58140A2268029q69580p44451o45103n70296n06863m50937m09645l81718l56074
58131G333362l29841l09623k94781k76499k53662k33722k17502j98268j76043
58122E043421j58326j46124j33086j19023j10937j09875j09224j06870j07025
58113C942931j09315j07674j01218r5381r1409q5087p6521p0858o8418o4086n7357
58102C015607n3382n3096n1692m7848m5425m4996m2474l7438l4293l4039l2843
58091B538081k9807k8290k8561k6970k3355k1671k2402k1770j9323j8777k0417
58080B276738k0246j7733j6940j8685j8916j6405j4881j5799j5924j3956j2968
$$ plain form
58148 27905869 24585205 21797981 19463029 17498867 15846771 14458135 13280026 12268029
58140 12268029 11398449 10653998 10008895 9438599 8931736 8480799 8071154 7689436 7333362
58131 7333362 7003521 6693898 6399117 6122618 5868956 5635234 5417732 5219464 5043421
58122 5043421 4885095 4738971 4605885 4486862 4375925 4266050 4156826 4049956 3942931
58113 3942931 3833616 3725942 3624724 3529343 3437934 3352847 3276326 3205468 3137050 3072964 3015607
58102 3015607 2962225 2909129 2857437 2809589 2764164 2719168 2676694 2639256 2604963 2570924 2538081
58091 2538081 2508274 2479984 2451423 2424453 2401098 2379427 2357025 2335255 2315932 2297155 2276738
58080 2276738 2256492 2238759 2221819 2203134 2184218 2167813 2152932 2137133 2121209 2107253 2094285
58069B094285j4150j4459j2502j0908j0904j0225q251p635r019r460p894o913
58057A971965p485p099m953l921n449p170p315p097p213o355m518l613l610k430
58043A893737l90k83k173k838j404p12j987k955k563k758m174m665l677l561m969
58028A854628n397l912k992l973m849m292l739l875l037q60M35J9o3J103J676
58013A820872R36Q78K290L051K126J473K276K924K500K651M195N373N220N333
57999A862098O502P007N989N212N708N938M974M257M501M029K000K18m4J18MQ25
57983A919336K727L589K558J734K530L395L000K600L373M244M244M318N026N212
57969A967886M586M746O052O406M876L554M053N095N406N891O983O919M933L328
$$ plain form
58069 2094285 2080135 2065676 2053174 2042266 2031362 2021137 2012886 2005251 1996232 1986772 1978878 1971965
58057 1971965 1964480 1957381 1952428 1948507 1943058 1935888 1928573 1921476 1914263 1907908 1903390 1899777 1896167 1893737
58043 1893737 1893347 1893064 1890891 1888053 1886649 1885937 1883950 1880995 1878432 1875674 1871500 1866835 1863158 1859597 1854628
58028 1854628 1849231 1845319 1842327 1838354 1833505 1829213 1825474 1821599 1818562 1817702 1818137 1818156 1818093 1819196 1820872
58013 1820872 1821808 1822686 1824976 1828027 1830153 1831626 1833902 1836826 1839326 1841977 1846172 1851545 1856765 1862098
57999 1862098 1868600 1875607 1881596 1886808 1892516 1898454 1903428 1907685 1912186 1916215 1918215 1918433 1918389 1918507 1918511 1919336
57983 1919336 1922063 1925652 1928210 1929944 1932474 1935869 1938869 1941469 1944842 1949086 1953330 1957648 1962674 1967886
57969 1967886 1972472 1977218 1983270 1989676 1994552 1998106 2002159 2007254 2012660 2018551 2025534 2032453 2037386 2040714
57955B040714L962N259N055L952L520L504L083K845L316L576L112L084L983M322
57941B093287L361K746L713N060N647O417Q007R041Q798R005J0724J2136J1687
57928B189629J0914J1554J2309J1333R705R511J0297J0282R551R330R487R316
57916B313218R324R846R247O115K010l81p72q02j178j453j647k005k004j381j099
57901B337038j728k128j395n78p54r43K1J173J082N00J076K624L802M476N312
57886B349578O061O188O312P138P906P666P104P364Q102Q430Q642R261R551Q850
57872B458153Q198Q734R610R382Q397P900P839P459P097P379P591O799N726N699
57858B565963O520P170P703Q665R596R929J0410J1833J3308J3661J3531J4172
$$ plain form
57955 2040714 2044676 2049935 2054990 2058942 2062462 2065966 2069049 2071894 2075210 2078786 2081898 2084982 2088965 2093287
57941 2093287 2096648 2099394 2103107 2108167 2113814 2120231 2128238 2137279 2146077 2155082 2165806 2177942 2189629
57928 2189629 2200543 2212097 2224406 2235739 2245444 2254955 2265252 2275534 2285085 2294415 2303902 2313218
57916 2313218 2322542 2332388 2341635 2347750 2349760 2349379 2348607 2347805 2346627 2345174 2343527 2341522 2339518 2338137 2337038
57901 2337038 2335310 2333182 2331787 2331209 2330455 2329512 2329533 2330706 2331788 2332288 2333364 2335988 2339790 2344266 2349578
57886 2349578 2355639 2361827 2368139 2375277 2383183 2390849 2397953 2405317 2413419 2421849 2430491 2439752 2449303 2458153
57872 2458153 2466351 2475085 2484695 2494077 2502474 2510374 2518213 2525672 2532769 2540148 2547739 2554538 2560264 2565963
57858 2565963 2572483 2579653 2587356 2596021 2605617 2615546 2625956 2637789 2651097 2664758 2678289 2692461
57846B692461J5147J5269J4943J5411J6363J6434J5521J4627J3951J2999J2116
57835B855242J2000J2115J1358R823Q359O945N224L930M004M833N075M740M767
57822B948415N141N140M941N231N703N636N485O243P677Q767R438J0244J0990
57809C039051J1187J1290J1850J2159J1354J0202R986J0334R951Q887Q232Q116
57797C162599P889P776Q427R295R363R027R369J0018R707Q564P861P809P636P536
57783C282876Q437R965J0723J0574J0680J1261J1333J0799J0792J1646J2364J2450
57771C413900J2621J3326J4129J4856J5864J6950J7331J6969J6567J6204J5305
57760C584022J3991J3122J2888J2659J2246J1987J1664J0762R697R375R537R071
$$ plain form
57846 2692461 2707608 2722877 2737820 2753231 2769594 2786028 2801549 2816176 2830127 2843126 2855242
57835 2855242 2867242 2879357 2890715 2900538 2908897 2915842 2921066 2924996 2929000 2933833 2938908 2943648 2948415
57822 2948415 2953556 2958696 2963637 2968868 2974571 2980207 2985692 2991935 2999612 3008379 3017817 3028061 3039051
57809 3039051 3050238 3061528 3073378 3085537 3096891 3107093 3117079 3127413 3137364 3146251 3154483 3162599
57797 3162599 3170488 3178264 3186691 3195986 3205349 3214376 3223745 3233763 3243470 3252034 3259895 3267704 3275340 3282876
57783 3282876 3291313 3301278 3312001 3322575 3333255 3344516 3355849 3366648 3377440 3389086 3401450 3413900
57771 3413900 3426521 3439847 3453976 3468832 3484696 3501646 3518977 3535946 3552513 3568717 3584022
57760 3584022 3598013 3611135 3624023 3636682 3648928 3660915 3672579 3683341 3693038 3702413 3711950 3721021
57748C721021P964P427Q026R091J0075J1040J1757J1784J1553J1927J2668J2749
57736C847082J2210J2188J2946J3522J3529J3734J4465J4915J4590J4187J4497
57725C997865J5434J6504J7359J7653J7323J7005J7272J7595J7092J6082J5673
57714D182857J5999J6177J5877J5617J5526J5218J4881J5106J5669J5758J5325
57703D354010J4962J4669J4190J4269J5849J8110J9118J8489J7692J7664J7912
57692D536934J8176J8954J9955J9946J8793J7947J8263J8883J8960J8907J9279
57681D744997J9915K0883K2894K5923K8836L0978L2933L5081L6858L8182M0212
57670E077692M3797M8318N2898N7654O2996O8710P4267P8732P9727P3940N9900
$$ plain form
57748 3721021 3728985 3736412 3744438 3753529 3763604 3774644 3786401 3798185 3809738 3821665 3834333 3847082
57736 3847082 3859292 3871480 3884426 3897948 3911477 3925211 3939676 3954591 3969181 3983368 3997865
57725 3997865 4013299 4029803 4047162 4064815 4082138 4099143 4116415 4134010 4151102 4167184 4182857
57714 4182857 4198856 4215033 4230910 4246527 4262053 4277271 4292152 4307258 4322927 4338685 4354010
57703 4354010 4368972 4383641 4397831 4412100 4427949 4446059 4465177 4483666 4501358 4519022 4536934
57692 4536934 4555110 4574064 4594019 4613965 4632758 4650705 4668968 4687851 4706811 4725718 4744997
57681 4744997 4764912 4785795 4808689 4834612 4863448 4894426 4927359 4962440 4999298 5037480 5077692
57670 5077692 5121489 5169807 5222705 5280359 5343355 5412065 5486332 5565064 5644791 5718731 5778631
57659E778631L9511J6297o719k6884m1406m8592m9057m4817l7789k9637k1878
57648E527660j5030q468j951L505P060R418J1739J3959J5265J5661J6026J6990
57636E611834J8488K0110K1276K1468K0873K0383K0506K0881K1157K1665K2582
57625E841223K3263K3091K2380K1796K1419K1080K1048K1619K2418K2805K2662
57614F084804K2293K1890K1574K1642K2176K2766K3006K3046K3234K3536K3704
57603F333671K3718K3803K4111K4641K5203K5422K5114K4620K4448K4520K4310
57592F603581K3723K3309K3541K4349K5343K5982K5653K4256K2698K2161K2889
57581F867485K4209K5543K6712K7388K7226K6501K5849K5363K4773K4340K4618
$$ plain form
57659 5778631 5818142 5834439 5827720 5800836 5759430 5710838 5661781 5616964 5579175 5549538 5527660
57648 5527660 5512630 5504162 5502211 5505716 5512776 5522194 5533933 5547892 5563157 5578818 5594844 5611834
57636 5611834 5630322 5650432 5671708 5693176 5714049 5734432 5754938 5775819 5796976 5818641 5841223
57625 5841223 5864486 5887577 5909957 5931753 5953172 5974252 5995300 6016919 6039337 6062142 6084804
57614 6084804 6107097 6128987 6150561 6172203 6194379 6217145 6240151 6263197 6286431 6309967 6333671
57603 6333671 6357389 6381192 6405303 6429944 6455147 6480569 6505683 6530303 6554751 6579271 6603581
57592 6603581 6627304 6650613 6674154 6698503 6723846 6749828 6775481 6799737 6822435 6844596 6867485
57581 6867485 6891694 6917237 6943949 6971337 6998563 7025064 7050913 7076276 7101049 7125389 7150007
57570G150007K5372K5792K5738K5812K6174K6377K6367K6542K6787K6670K6575
57559G438213K7337K8677K9319K8974K8726K9125K9444K9313K9574L0722L1833
57548G761257L2045L1936L2481L3503L4113L3959L3302L2465L1829L1755L2022
57537H120667L2057L1917L2249L3014L3344L3031L2921L3352L3471L2816L2341
57526H481180L2963L4126L4728L4596L4201L3742L3341L3368L3793L3905L3331
57515H853274L2653L2451L2572L2817L3390L4132L4302L3815L3567L3933L4049
57504I220955L3433L3009L3537L4220L4047L3442L3254L3132L2349L1452L1523
57493I584353L2356L2798L2608L2614L3141L3569L3429L2981L2672L2746L3306
$$ plain form
57570 7150007 7175379 7201171 7226909 7252721 7278895 7305272 7331639 7358181 7384968 7411638 7438213
57559 7438213 7465550 7494227 7523546 7552520 7581246 7610371 7639815 7669128 7698702 7729424 7761257
57548 7761257 7793302 7825238 7857719 7891222 7925335 7959294 7992596 8025061 8056890 8088645 8120667
57537 8120667 8152724 8184641 8216890 8249904 8283248 8316279 8349200 8382552 8416023 8448839 8481180
57526 8481180 8514143 8548269 8582997 8617593 8651794 8685536 8718877 8752245 8786038 8819943 8853274
57515 8853274 8885927 8918378 8950950 8983767 9017157 9051289 9085591 9119406 9152973 9186906 9220955
57504 9220955 9254388 9287397 9320934 9355154 9389201 9422643 9455897 9489029 9521378 9552830 9584353
57493 9584353 9616709 9649507 9682115 9714729 9747870 9781439 9814868 9847849 9880521 9913267 9946573
57482I946573L4160L4726L4668L4361L4308L4450L4527L4601L4716L4630L4370
57471A0326090L4434L4924L5094L4467L3689L3619L4231L5075L6064L7114L7638
57460A0712439L7309L6705L6485L6469L6245L6001L6096L6414L6815L7426L7945
57449A1116349L7592L6431L5729L6128L6630L6354L6085L6760L7570L7233L6273
57438A1519134L6222L7132L7610L7076L6411L6376L6797L7290L7652L7570L7024
57427A1926294L6743L7284L7962L7760L6879L6230L5879L5304L4820L5212L6128
57416A2326495L6353L5616L4750L4101L3253L2432L2581L3758L4760L4822L4483
57405A2703404L4387L4390L4274L4340L4723L5002L4924L4730L4514L4048L3557
$$ plain form
57482 9946573 9980733 10015459 10050127 10084488 10118796 10153246 10187773 10222374 10257090 10291720 10326090
57471 10326090 10360524 10395448 10430542 10465009 10498698 10532317 10566548 10601623 10637687 10674801 10712439
57460 10712439 10749748 10786453 10822938 10859407 10895652 10931653 10967749 11004163 11040978 11078404 11116349
57449 11116349 11153941 11190372 11226101 11262229 11298859 11335213 11371298 11408058 11445628 11482861 11519134
57438 11519134 11555356 11592488 11630098 11667174 11703585 11739961 11776758 11814048 11851700 11889270 11926294
57427 11926294 11963037 12000321 12038283 12076043 12112922 12149152 12185031 12220335 12255155 12290367 12326495
57416 12326495 12362848 12398464 12433214 12467315 12500568 12533000 12565581 12599339 12634099 12668921 12703404
57405 12703404 12737791 12772181 12806455 12840795 12875518 12910520 12945444 12980174 13014688 13048736 13082293
57394A3082293L3737L4603L5166L4757L3985L3807L4279L4674L4460L3673L2722
57383A3458156L2108L2122L2569L2905L2754L2136L1279L0520L0158L0060K9633
57372A3804400K8547K7251K6341K5724K4952K4049K3364K2867K2200K1283K0324
57361A4071302J9530J9221J9790K0937K1513K0880J9844J9440J9426J9054J8613
57350A4289550J8895J9527J9436J8731J8511J8818J8490J7320J6682J7264J7819
57339A4491043J7043J5523J4629J4479J4187J3557J3204J3246J3003J2186J1465
57328A4643565J1477J1870J1769J0991J0227R994R875R218Q206P527P091O001
57316A4757811M024K161J229P68Q4m70k46K86O0r65j785j750j098k62M21M69k47
$$ plain form
57394 13082293 13116030 13150633 13185799 13220556 13254541 13288348 13322627 13357301 13391761 13425434 13458156
57383 13458156 13490264 13522386 13554955 13587860 13620614 13652750 13684029 13714549 13744707 13774767 13804400
57372 13804400 13832947 13860198 13886539 13912263 13937215 13961264 13984628 14007495 14029695 14050978 14071302
57361 14071302 14090832 14110053 14129843 14150780 14172293 14193173 14213017 14232457 14251883 14270937 14289550
57350 14289550 14308445 14327972 14347408 14366139 14384650 14403468 14421958 14439278 14455960 14473224 14491043
57339 14491043 14508086 14523609 14538238 14552717 14566904 14580461 14593665 14606911 14619914 14632100 14643565
57328 14643565 14655042 14666912 14678681 14689672 14699899 14709893 14719768 14728986 14737192 14744719 14751810 14757811
57316 14757811 14761835 14763996 14765225 14765993 14766077 14765607 14765361 14765647 14765707 14764742 14762957 14761207 14760109 14759847 14760268 14760737 14760490
57299A4760490r09n64N33J326J601K171L396M602N217N605O455P989R997J2110
57285A4820019J3909J5198J6090J6515J6021J4616J3302J2905J2844J2038J0617
57274A4974074R547Q867P612N441L117J300J8o43m68J68O71J317K825M780N817
57259A5024443N594N259N598N942N421M182K809J502L23n49j272k274l484m425
57245A5049069n180o356p887r038r800j1152j3502j5971j7688j8845k0083k1684
57233A4891883k3746k6232k8545l0063l1185l2767l4475l5098l4683l4751l5848
57222A4544490l6681l6372l5987l6667l7828l8417l8688l9286l9750l9387l8695
57211A4126732l8476l8279l7172l5468l4171l3193l1570k9177k6874k5068k3337
$$ plain form
57299 14760490 14759581 14759017 14759550 14760876 14762477 14764648 14768044 14772646 14777863 14783468 14789923 14797912 14807909 14820019
57285 14820019 14833928 14849126 14865216 14881731 14897752 14912368 14925670 14938575 14951419 14963457 14974074
57274 14974074 14983621 14992488 15000100 15005541 15008658 15009958 15009976 15009333 15008865 15009033 15009704 15011021 15013846 15018626 15024443
57259 15024443 15030037 15035296 15040894 15046836 15052257 15056439 15059248 15060750 15061073 15060524 15059252 15056978 15053494 15049069
57245 15049069 15043889 15037533 15029646 15020608 15010808 14999656 14986154 14970183 14952495 14933650 14913567 14891883
57233 14891883 14868137 14841905 14813360 14783297 14752112 14719345 14684870 14649772 14615089 14580338 14544490
57222 14544490 14507809 14471437 14435450 14398783 14360955 14322538 14283850 14244564 14204814 14165427 14126732
57211 14126732 14088256 14049977 14012805 13977337 13943166 13909973 13878403 13849226 13822352 13797284 13773947
57200A3773947k1514k0050j9160j8449j7525j6369j5085j3900j3259j3447j4208
57189A3590981j5139j6149j7155j7760j7897j8327j9842k2213k4457k5865k6293
57178A3369884k5854k4879k3886k3050k2035k0723j9623j9094j8804j8555j8999
57167A3134382k0827k3873k7831l3404m1737n3029o6313q0232r3255j03810j11335
57156A2478736j17054j22801j29055j34858j39368j42546j44412j44608j42880
57147A1261154j39291j33744j25910j15923j04810r4091q5024p8031p2695o8460
57137A0243175o5486o4393o5057o6376o7593o9164p1719p4834p7660q0286q3573
57126I457034q7939r2921r7654j01105j02216j00526r6382r0081q1285p0059n7860
$$ plain form
57200 13773947 13752433 13732383 13713223 13694774 13677249 13660880 13645795 13631895 13618636 13605189 13590981
57189 13590981 13575842 13559693 13542538 13524778 13506881 13488554 13468712 13446499 13422042 13396177 13369884
57178 13369884 13344030 13319151 13295265 13272215 13250180 13229457 13209834 13190740 13171936 13153381 13134382
57167 13134382 13113555 13089682 13061851 13028447 12986710 12933681 12867368 12787136 12693881 12590071 12478736
57156 12478736 12361682 12238881 12109826 11974968 11835600 11693054 11548642 11404034 11261154
57147 11261154 11121863 10988119 10862209 10746286 10641476 10547385 10462361 10384330 10311635 10243175
57137 10243175 10177689 10113296 10048239 9981863 9914270 9845106 9773387 9698553 9620893 9540607 9457034
57126 9457034 9369095 9276174 9178520 9077415 8975199 8874673 8778291 8688210 8606925 8536866 8479006
57115H479006m6554l6784k8093k0242j3282o449K048J4111L1178N4152Q3134J17569
57103H629794J57509K04365K59575L23355L96013M79905N78344O92705Q22101
57094A2543666R65654J122995J291980J467328J641661J805843J948138K056230
57086B4843495K122726K148069K137459K097513K037482J968643J893536J792113
57078D1041036J623683J350730R65880M97690p867n11026r88149j426857j817512
57069D0727608k149560k412666k599051k705076k731893k685410k575844k416987
57061B0451121k224718k014736j800542j592730j398979j223709j068012r30931
57053H196764q11315p08281o20315n45073m80437m25044l77522l36016k99037
$$ plain form
57115 8479006 8432452 8395668 8367575 8347333 8334051 8327602 8329650 8343761 8374939 8429091 8512225 8629794
57103 8629794 8787303 8991668 9251243 9574598 9970611 10450516 11028860 11721565 12543666
57094 12543666 13509320 14632315 15924295 17391623 19033284 20839127 22787265 24843495
57086 24843495 26966221 29114290 31251749 33349262 35386744 37355387 39248923 41041036
57078 41041036 42664719 44015449 44981329 45479019 45471152 44960126 43971977 42545120 40727608
57069 40727608 38578048 36165382 33566331 30861255 28129362 25443952 22868108 20451121
57061 20451121 18226403 16211667 14411125 12818395 11419416 10195707 9127695 8196764
57053 8196764 7385449 6677168 6056853 5511780 5031343 4606299 4228777 3892761 3593724
57044C593724k66181k37478k12452j90300j70568j53081j37593j23923j12114
57035A990034j01965r2799q4055p5832o8452o1835n5714n0103m5090m0437l5787
57024A277965l1058k6276k1310j6048j0593m982R66P397J4343K1941L0363L9558
57012A282266M9604O1134P4651Q9737J05975J24004J43115J57087J54904J28054
57002B370531P7051J0518o0107j23734j70636j95041j98063j86328j67026j44915
56992A212250j22902j02884q5290o9543n5759m4829l6674k9848k3382j7725j3459
56981F09955j0455q858r479j2361j5984j8755k0428k1338k1204j9598j6943j4139
56969D20413j1571r100o732m674l035j765o62P64K942N600P939R621J0958J1958
$$ plain form
57044 3593724 3327543 3090065 2877613 2687313 2516745 2363664 2226071 2102148 1990034
57035 1990034 1888069 1795270 1711215 1635383 1566931 1505096 1449382 1399279 1354189 1313752 1277965
57024 1277965 1246907 1220631 1199321 1183273 1172680 1167698 1168664 1176061 1190404 1212345 1242708 1282266
57012 1282266 1331870 1393004 1467655 1557392 1663367 1787371 1930486 2087573 2242477 2370531
57002 2370531 2447582 2458100 2397993 2274259 2103623 1908582 1710519 1524191 1357165 1212250
56992 1212250 1089348 986464 901174 831631 775872 731043 694369 664521 641139 623414 609955
56981 609955 599500 590642 581163 568802 552818 534063 513635 492297 471093 451495 434552 420413
56969 420413 408842 399742 393010 388336 385301 383536 382874 383638 386580 392180 400119 409740 420698 432656
56955D32656J1941J0423P607L729j319p182j2493j5859j6982j6456j4956j3046
56943C68063j1241r605p635n036k287J9K039M363P046R489J1261J2656J4274J6112
56929D09518J7133J5899J1859N876p41p348j3653j8809k1794k2683k2549k1985
56917C30723k0618j8286j5729j3577j1590r470p646o540n718m581l372k709k457
56904B08430j896q48J26O40R56J472K204K944L590M278N258O593P924Q770R233
56889B59674J0030J1601J3430J4633J4980J4891J4472J3096J0085N599O71l605
56877C79557o732q737r631r262p691n356k692K05L335O532R661J2715J5441J7336
56863C94681J8585K0484K4064K8494L1700L2366L0511K6223J9084R305j457j1064
$$ plain form
56955 432656 444597 455020 462627 466356 465037 457855 445362 429503 412521 396065 381109 368063
56943 368063 356822 347217 339582 334546 332259 332278 334317 338680 345726 355215 366476 379132 393406 409518
56929 409518 426651 442550 454409 460285 459544 452196 438543 419734 397940 375257 352708 330723
56917 330723 310105 291819 276090 262513 250923 241453 233807 227267 221549 216968 213596 210887 208430
56904 208430 206534 205686 205812 206452 207408 208880 211084 214028 217618 221896 227154 233747 241671 250441 259674
56889 259674 269704 281305 294735 309368 324348 339239 353711 366807 376892 382491 383162 379557
56877 379557 372825 364088 354457 345195 337504 332148 329456 329661 332996 339528 349189 361904 377345 394681
56863 394681 413266 433750 457814 486308 518008 550374 580885 607108 626192 635497 634040 622976
56851F22976j8248k2670k4294k3257k0067j5481j0266n064j13M925J0389J5918
56839E14748K0830K5198K9847L5117M0395M4990M8681N0829M9687M3259L0866
56828I34447J3719n600k4063l9206m9730n5228n5658n1596m4776l7301l0056k2625
56816E32327j4854p601j583L616Q842J4291J9700K4930K9809L3779L6051L5668
56804G14975L1369K2254R096n669j9670l1713m1024m6511m7614m5183m0678l5013
56792D64619k8716k2572j7203j2479q005l784J49M131Q225J1692J3950J5451J6733
56779D42191J7007J4741R503K376n262j2613j9179k4406k7839k9284k8872k7205
56767C11158k5131k2995k0450j7388j4525j2570j1296j0031q675p533o643n868
$$ plain form
56851 622976 604728 582058 557764 534507 514440 498959 488693 483629 483516 488441 498830 514748
56839 514748 535578 560776 590623 625740 666135 711125 759806 810635 860322 903581 934447
56828 934447 948166 942566 918503 879297 829567 774339 718681 667085 622309 585008 554952 532327
56816 532327 517473 509872 508289 511905 520747 535038 554738 579668 609477 643256 679307 714975
56804 714975 746344 768598 777694 772025 752355 720642 679618 633107 585493 540310 499632 464619
56792 464619 435903 413331 396128 383649 375644 371860 372009 376140 384365 396057 410007 425458 442191
56779 442191 459198 473939 483442 485818 480556 467943 448764 424358 396519 367235 338363 311158
56767 311158 286027 263032 242582 225194 210669 198099 186803 176772 168097 160564 153921 148053
56755A48053n302m874m016k502j136q22j296j652j736k027k455k421j888j430
56741A14496j238j019q59j156j646j503n93K68N36N20N01K03l98n75J61J171J336
56724A10205L48j068j917j640l58J167K021J871J190O88P05J061J329J168O94
56709A17464L93N04N70M6q69j411j213o13m3L90O73P62Q16J109J546J670J301
56692A23095P93N14L85J72j13k49q5L36P88R13N47j5k39P0N77Q44P39M81L76N49
56672A30478P90P64M13L7k09n23j017j323j033k89M32R69J484J930K010J667J212
56655A37792R41R12J087J411J728J842J696J386J053Q72R23R85O95J35n5N20J365
56638A55288J702J459J287J653K321K698K462J845J430J572J927J857J228M86
$$ plain form
56755 148053 142751 137877 133861 131359 130223 129401 128105 126453 124717 122690 120235 117814 115926 114496
56741 114496 113258 112239 111380 110224 108578 107075 106482 106750 107286 107806 108307 108510 108112 107537 107698 108869 110205
56724 110205 110553 109485 107568 105928 105570 106737 108758 110629 111819 112507 113212 114273 115602 116770 117464
56709 117464 117857 118361 118931 118977 118108 116697 115484 114871 114828 115218 115891 116653 117469 118578 120124 121794 123095
56692 123095 123888 124402 124787 124959 124846 124597 124512 124848 125636 126549 127096 127081 126842 126912 127489 128333 129072 129553 129929 130478
56672 130478 131268 132032 132445 132482 132273 131750 130733 129410 128377 128088 128520 129489 130973 132903 134913 136580 137792
56655 137792 138733 139645 140732 142143 143871 145713 147409 148795 149848 150720 151643 152628 153323 153458 153403 153923 155288
56638 155288 156990 158449 159736 161389 163710 166408 168870 170715 172145 173717 175644 177501 178729 179215
56624A79215j26p82j391j455r51n93p13o50N0N94M4j140j688j236m58K10Q61J296
56606A71087J016J44n69p75p37n64j12L12J18n26p71m50m06j051j543j058j35
56589A63980Q4m83p65j5J245J933J686J161J162J672J937J480O56J33J61O23J352
56572A78002K047K295K174K425L426M376M231L176K388K488L063L666M414N413
56558B23584O349O941P300P575P654P321O452N009L188J471J56r77k115k775k311
56543B74822r58K67O69L94j02n88j102j873l049m189m430l538k396j821j501q52
56527B49753k85n20j174j249q62j121k285l276l190k262j157l08j41r32k227l174
56511B25590l589l816l652k536q54J69J17k01j86j32k23q5K75K42k33m22j67k52
$$ plain form
56624 179215 179089 178307 176916 175461 174510 173917 173204 172554 172604 173198 173242 172102 170414 169178 168720 168930 169791 171087
56606 171087 172103 172247 171678 170903 170166 169602 169490 169802 169920 169394 168623 168173 167767 166716 165173 164115 163980
56589 163980 164064 163581 162816 162801 164046 165979 167665 168826 169988 171660 173597 175077 175733 175866 176027 176650 178002
56572 178002 180049 182344 184518 186943 190369 194745 198976 202152 204540 207028 210091 213757 218171 223584
56558 223584 229933 236874 244174 251749 259403 266724 273176 278185 281373 282844 283000 282023 279908 277133 274822
56543 274822 273864 274131 274800 275194 275092 274504 273402 271529 268480 264291 259861 256323 253927 252106 250605 249753
56527 249753 249468 248948 247774 246525 245663 244542 242257 238981 235791 233529 232372 232064 231923 230991 228764 225590
56511 225590 222001 218185 214533 211997 211143 211312 211429 211228 211042 210910 210687 210602 210877 211119 210886 210464 210297 210045
56493B10045q54r89j77N49K18n97q69o68o13o12k41K65M14L49M37M90K08p4N5
56474B07336L10K52K23Q17J774K249J964J438J205J370J716J843J471R12Q33J264
56458B26977J423R04M11O98J446J876J941K152K584K814K594K053J351O60K18
56443B50102J27K68O19J251J886K023J693J407J193N72k51k35Q06J482O69p95
56427B62817j290o10J54L58L07K90J96N8J41M30O64P66P74N09q6n89n40q5L34
56408B64598N86P62P78N50K94J59Pj35J60R91J633J364M77r3J37Q42J407J397
56390B75914Q39L13L98Q97J114R55R95J355J417J007Q18J142J251O67J27M35J271
56373B90915J866K146K326K242J860J698J924J843J089M47N78Q55N14J01N34J520
$$ plain form
56493 210045 209191 208202 208025 208574 208792 208195 207326 206658 206045 205433 205192 205457 205871 206220 206657 207147 207355 207281 207336
56474 207336 207646 207898 208121 208938 210712 212961 214925 216363 217568 218938 220654 222497 223968 224880 225713 226977
56458 226977 228400 229304 229715 230413 231859 233735 235676 237828 240412 243226 245820 247873 249224 249884 250102
56443 250102 250229 250497 251116 252367 254253 256276 257969 259376 260569 261141 260890 260655 261461 262943 263612 262817
56427 262817 261527 260917 261071 261429 261736 262026 262222 262280 262421 262851 263515 264281 265055 265564 265478 264889 264349 264264 264598
56408 264598 265184 265946 266724 267274 267568 267727 267734 267599 267759 268750 270383 271747 272224 272131 272268 273110 274517 275914
56390 275914 276753 277066 277464 278361 279475 280430 281425 282780 284197 285204 286022 287164 288415 289082 289209 289644 290915
56373 290915 292781 294927 297253 299495 301355 303053 304977 306820 307909 308356 308934 309789 310303 310404 310938 312458
56357C12458K119K240K356K378J955J380J029N66k21m82M75J738J973J391J114
56342C32469J138O81P5M90J866K841K838K669K904L103K968K913L176L378L309
56327C66818L214L191L149L332L967M628M785M755M996M938L802K304J982K898
56313D18759L541L106K337J957J717J431J572K311L077L491L777L947L649L122
56299D57794L225M110M932N159N249N594N782N286M149K718J422Q95J488K567
56285E10370L192L489M324N664O488O421O155O084N840N510N878O977P683P508
56271E91583P519Q629J0091J0685J0538J0719J1619J2724J3659J4568J5598J6708
56259G34640J7983J9644K1768K4166K6540K8698L0790L3276L6535M0498M4846
$$ plain form
56357 312458 314577 316817 319173 321551 323506 324886 325915 326481 326260 325778 326253 327991 329964 331355 332469
56342 332469 333607 334288 334363 334853 336719 339560 342398 345067 347971 351074 354042 356955 360131 363509 366818
56327 366818 370032 373223 376372 379704 383671 388299 393084 397839 402835 407773 411575 413879 415861 418759
56313 418759 422300 425406 427743 429700 431417 432848 434420 436731 439808 443299 447076 451023 454672 457794
56299 457794 461019 465129 470061 475220 480469 486063 491845 497131 501280 503998 505420 506315 507803 510370
56285 510370 513562 517051 521375 527039 533527 539948 546103 552187 558027 563537 569415 576392 584075 591583
56271 591583 599102 607731 617822 628507 639045 649764 661383 674107 687766 702334 717932 734640
56259 734640 752623 772267 794035 818201 844741 873439 904229 937505 974040 1014538 1059384
56248A059384M9353N3894N8463O3357O8880P4466P8890Q1752Q4017Q6400Q8119
56237A846975Q8128Q6659Q4359Q0711P4694O6371N6383M4540L0527J5508J169
56226B476024j2561k6951m1673n4464o3830p0398p5265p8656q0636q1653q1744
56215A808193q0418p7689p4229p0219o5329n9953n5205n1452m7982m4316m0633
56204A140768l6908l2931k9223k6535k4425k1778j8720j6423j4986j3262j0935
56193H94642q992p785o528n107m537n014n262m558l715l368k902j885j024q32
56179H33133p52l01J88O25J567K971L895M024M166M712N045M955N088N494N354
56164H80164M774N089O692Q159Q368P935P816Q030Q513R595J0916J1393J1039
$$ plain form
56248 1059384 1108737 1162631 1221094 1284451 1353331 1427797 1506687 1588439 1672456 1758856 1846975
56237 1846975 1935103 2021762 2106121 2186832 2261526 2327897 2384280 2428820 2459347 2474855 2476024
56226 2476024 2463463 2436512 2394839 2340375 2276545 2206147 2130882 2052226 1971590 1889937 1808193
56215 1808193 1727775 1650086 1575857 1505638 1440309 1380356 1325151 1273699 1225717 1181401 1140768
56204 1140768 1103860 1070929 1041706 1015171 990746 968968 950248 933825 918839 905577 894642
56193 894642 885650 877865 871337 866230 861693 856679 851417 846859 843144 839776 836874 834989 833965 833133
56179 833133 832381 832080 832268 832893 834460 837431 841326 845350 849516 854228 859273 864228 869316 874810 880164
56164 880164 884938 890027 896719 904878 913246 921181 928997 937027 945540 955135 966051 977444 988483
56151I88483J1243J2600J4065J4904J5718J6822J7491J7588J8122J9332K0135
56140A166503K0405K1783K5162K9279L3000L7119M2605M8799N4704O0597O7194
56129A607150P4576Q2833R2127J01313J08175J11761J12698J10717J04242R3314
56119B598906Q0549O8173N6510M6235L9138L4960L0301K2546J2656K510p752j7818
56107B966914k5525k9645l2208l5798m0652m6496n4627o5481p6248q3707q7649
56096B388878q9116q7340q1226p2136o2439n2705m2789l3975k7394k1826j5568
56085A802364r164m036l6L425N556N944O375Q430J1019J2621J4000J6198J7960
56072A890656J8006J7804J9150K0969K1505K1761K3528K5927K7137K7786K9321
$$ plain form
56151 988483 999726 1012326 1026391 1041295 1057013 1073835 1091326 1108914 1127036 1146368 1166503
56140 1166503 1186908 1208691 1233853 1263132 1296132 1333251 1375856 1424655 1479359 1539956 1607150
56129 1607150 1681726 1764559 1856686 1957999 2066174 2177935 2290633 2401350 2505592 2598906
56119 2598906 2679455 2747628 2804138 2850373 2889511 2924471 2954772 2977318 2989974 2992484 2984732 2966914
56107 2966914 2941389 2911744 2879536 2843738 2803086 2756590 2701963 2636482 2560234 2476527 2388878
56096 2388878 2299762 2212422 2131196 2059060 1996621 1943916 1901127 1867152 1839758 1817932 1802364
56085 1802364 1793200 1789164 1789128 1792553 1798109 1804053 1810428 1818858 1829877 1842498 1856498 1872696 1890656
56072 1890656 1908662 1926466 1945616 1966585 1988090 2009851 2033379 2059306 2086443 2114229 2143550
56061B143550L0767L0630L0193L1363L2815L2089L0018K9315L0032L0217K9973
56050B480962L1024L3120L4496L5128L6253L7565L8106L8802M0898M3183M3995
56039B893532M4570M7002N0425N2749N4509N7324O0197O1212O1395O3006O5562
56028C511483O7382O9217P2358P5099P5455P5392P7872Q1730Q4190Q6262R0513
56017D366953R5541R8309J00153J04660J11091J15789J18822J23248J29016J33615
56007E497197J37793J44529J53192J60616J67053J75167J84345J92098J99813
55998G011803K10768K23778K35275K46206K60096K75991K90515L05219L24206
55989I383857L46232L67192L88633M15289M45943M75843N06556N43773N86791
$$ plain form
56061 2143550 2174317 2204947 2235140 2266503 2299318 2331407 2361425 2390740 2420772 2450989 2480962
56050 2480962 2511986 2545106 2579602 2614730 2650983 2688548 2726654 2765456 2806354 2849537 2893532
56039 2893532 2938102 2985104 3035529 3088278 3142787 3200111 3260308 3321520 3382915 3445921 3511483
56028 3511483 3578865 3648082 3720440 3795539 3870994 3946386 4024258 4105988 4190178 4276440 4366953
56017 4366953 4462494 4560803 4660956 4765616 4876707 4992496 5111318 5234566 5363582 5497197
56007 5497197 5634990 5779519 5932711 6093327 6260380 6435547 6619892 6811990 7011803
55998 7011803 7222571 7446349 7681624 7927830 8187926 8463917 8754432 9059651 9383857
55989 9383857 9730089 10097281 10485914 10901203 11347146 11822989 12329545 12873318 13460109
55980A3460109O30429O76122P30583P94501Q63670R40293J031531J137813J254931
55971B1519982J387166J545635J734674J953558K210618K520685K889240L314522
55963C9076080L803523M367374N000996N686452O417139P200969Q044876Q961760
55955H8559169R989026J1167839J2502907J3975588J5593997J7384283J9324787
55948A88497596K1324575K3227809K4696301K5020678K3204883J8498368J0989472
55941C35459682J689317p950025j6597410k3304594k7551905k9283050k8890476
55934B03571539k7029485k4350799k1351027j8371763j5627131j3209975j1125380
55927G2505979r352293p870451o645597n628929m782151m083818l509949l029719
$$ plain form
55980 13460109 14090538 14766660 15497243 16291744 17155414 18095707 19127238 20265051 21519982
55971 21519982 22907148 24452783 26187457 28141015 30351633 32872318 35761558 39076080
55963 39076080 42879603 47246977 52247973 57934425 64351564 71552533 79597409 88559169
55955 88559169 98548195 109716034 122218941 136194529 151788526 169172809 188497596
55948 188497596 209822171 233049980 257746281 282766959 305971842 324470210 335459682
55941 335459682 337148999 329198974 312601564 289296970 261745065 232462015 203571539
55934 203571539 176542054 152191255 130840228 112468465 96841334 83631359 72505979
55927 72505979 63153686 55283235 48637638 43008709 38226558 34142740 30632791 27603072
55919B7603072k622890k282774j999283j755546j542901j362982j212518j080411
55911A3743767r61749q60735p77315p03661o36109n78480n31161m88069m46834
55902G759654m11461l82642l55206l27335l02910k82693k62188k40348k21670
55893D973201k07560j93770j78451j64874j54127j42725j29587j18127j09347
55884C574633r9783q8235p7854o9653o0431m9056l8484k9705j9874q339J497Q105
55872C042821J3548J7329J4678L489j2553k9892m8722o8335q4435r4232r9846
55861B653850j04086j06849j07850j08577j09140j07034j01228r4054q7275p9962
55851A647795p1753o4444n8712n2985m7144m3465m2294m0680l7040l3422l1407
$$ plain form
55919 27603072 24980182 22697408 20698125 18942579 17399678 16036696 14824178 13743767
55911 13743767 12782018 11921283 11143968 10440307 9804198 9225718 8694557 8206488 7759654
55902 7759654 7348193 6965551 6610345 6283010 5980100 5697407 5435219 5194871 4973201
55893 4973201 4765641 4571871 4393420 4228546 4074419 3931694 3802107 3683980 3574633
55884 3574633 3474850 3386615 3308761 3239108 3178677 3129621 3091137 3061432 3041558 3033219 3034716 3042821
55872 3042821 3056369 3073698 3088376 3091865 3079312 3049420 3000698 2932363 2847928 2753696 2653850
55861 2653850 2549764 2442915 2335065 2226488 2117348 2010314 1909086 1815032 1727757 1647795
55851 1647795 1576042 1511598 1452886 1399901 1352757 1309292 1266998 1226318 1189278 1155856 1124449
55840A124449k9548k6761k4601k4077k3541k1839k0324j9843j8893j6697j5076
55829H83249j5296j5908j5514j4845j4446j3214j0962r671j0358j1414j1606j1941
55817G28074j2933j2998j1360r824r759r933r147q424q580q229o220l781k318
55804F14568j263P0O85r5q50k10J041J594J497J009m54k727m276m656n522p741
55788E92670r580r417q232p644p456o809n996n387m225k209p01q14j780k511l254
55773E16655m338m949m458l423k162o0K713M647N224N674O278N155J269l541p201
55758E17483r910j2355j3592j2802j1316j0727j0595r981r589j0304j1105j0643
55746C84564r627r527j0029r801q817p961p176n860m410l667l450l048k520k241
$$ plain form
55840 1124449 1094901 1068140 1043539 1019462 995921 974082 953758 933915 915022 898325 883249
55829 883249 867953 852045 836531 821686 807240 794026 783064 773393 763035 751621 740015 728074
55817 728074 715141 702143 690783 680959 671200 661267 652120 643696 635116 626887 620667 616886 614568
55804 614568 613305 613375 614060 613965 613115 612905 613946 615540 617037 618046 617592 614865 610589 605933 600411 592670
55788 592670 583090 573673 565441 557797 550341 543532 537536 532149 527924 525715 525014 524200 522420 519909 516655
55773 516655 512317 507368 502910 499487 497325 497265 499978 504625 509849 515523 521801 526956 528225 524684 517483
55758 517483 507573 495218 481626 468824 457508 446781 436186 426205 416616 406312 395207 384564
55746 384564 374937 365410 355381 345580 336763 328802 321626 315766 311356 307689 304239 301191 298671 296430
55732B96430j989j597j628k273k717k553k688l663m499m347l921m006l973l184
55718B53392k421k417k380j473m22q5K20J237K037J563O77P99J628K047K161K548
55702B59111K515J107r78k437l531n257p107p599o602n347m522l952l727l956
55688B07718l860k651r42P8L70O46R07Q06P97J404J968J610Q43P39J024N88o13
55671B11432j686k363k980l350l064k530k368k217j459n55l34n12k84J61J85J93
55655A88269J025K369L260L687M183M315L243J436K58j3k59q35j245j307j341
55640B07045j326j153j391k570l973m437m024l656l499l012k246j708j311q07
55626A71932o99j388j916j172J19L00o71j350j221j136j442j471j061r06j106
$$ plain form
55732 296430 294441 292844 291216 288943 286226 283673 280985 277322 272823 268476 264555 260549 256576 253392
55718 253392 250971 248554 246174 244701 244279 244194 244414 245651 247688 249251 249928 250727 252355 254402 256563 259111
55702 259111 261626 262733 261755 259318 255787 250530 243423 235824 229222 223875 219353 215401 211674 207718
55688 207718 203858 201207 200265 200343 200713 201359 202266 203072 203869 205273 207241 208851 209694 210433 211457 212045 211432
55671 211432 209746 207383 204403 201053 197989 195459 193091 190874 189415 188860 188526 188014 187730 187891 188076 188269
55655 188269 189294 191663 194923 198610 202793 207108 210351 211787 212045 212032 211773 210938 209693 208386 207045
55640 207045 205719 204566 203175 200605 196632 192195 188171 184515 181016 178004 175758 174050 172739 171932
55626 171932 171233 169845 167929 166757 166876 167176 166505 165155 163934 162798 161356 159885 158824 157918 156812
55611A56812r54l89k46p71j291j482j675j750j186l94m78j371j707r53k54n59
55595A41352j181j078m21j27m95j036j216q10K5Q54J344J562J617J304O07J43
55579A42444L94Q53Q04M88O44J241J652J794K068K487K788L117L624L871L620
55564A71889L662M593N297M190J596o51j694k258k915l401l736m395n226n511
55550A61440n297n292n455n037m106l573l546l172k292j761j851j803j335j127
55536A15793j397j448j022p37p06k14P28R67Q1p08l55M64N13k62j042j405j421
55519A07829j137o66l24k34k02k16m31o47m93j40k9M4N38R94M74p33j290q69o32
55500A01836j226j786j517q97n68k53M00Q98P18K13n7q7k9K47O60Q00O67O86P44
$$ plain form
55611 156812 155858 155469 155223 154452 153161 151679 150004 148254 147068 146674 146196 144825 143118 142165 141911 141352
55595 141352 140171 139093 138672 138545 138050 137014 135798 134988 135013 135867 137211 138773 140390 141694 142301 142444
55579 142444 142838 143691 144495 144983 145627 146868 148520 150314 152382 154869 157657 160774 164398 168269 171889
55564 171889 175551 180144 185441 189631 191227 190576 188882 186624 183709 180308 176572 172177 166951 161440
55550 161440 156143 150851 145396 140359 136253 132680 129134 125962 123670 121909 120058 118255 116920 115793
55536 115793 114396 112948 111926 111189 110483 110269 110997 111964 112045 111337 110982 111446 111959 111697 110655 109250 107829
55519 107829 106692 106026 105702 105468 105266 105050 104619 103972 103479 103339 103310 103354 103892 104886 105360 104627 103337 102468 101836
55500 101836 100610 98824 97307 96410 95842 95589 95989 96887 97605 97818 97761 97674 97645 97892 98552 99352 100019 100705 101449
55481A01449J97q44j364r89m89k98J07P89P59k97j054m68N57N80k18o11k88N2
55463I7570P8J02K58L22K73K93M12N67P13O26J24l30p0N82N27l22p17n5O12L48
55443A01913j63nL15q6p28n34K63M85r2n22j77O44J441J865J549N19m38o51m78
55424A05120n96q39o80m23p09j143o55P48J752J527O74J55P2Lj44r4K89Q06J117
55405A06980J017O15K52J45K22L48M08Q6r42k342l110k625j365k73J78L3m82q87
55387I8258o38J06L64m38j536j763j000p5L85L77N7m51q47q27l95K34Q80J304
55369I3995J288J005R17R47M17p48j534j181l62k06o15n49L82J492K065J975J325
55352A00613K44q83j550j616j277p23j26K77M70P79J289J506J088M74K24J44k72
$$ plain form
55481 101449 101646 100802 99438 98449 97960 97662 97769 98558 99317 99020 97966 97498 98055 98635 98417 97806 97518 97570
55463 97570 97648 97750 98008 98330 98603 98896 99308 99875 100588 101214 101338 101008 100938 101520 102047 101725 101008 100953 101565 101913
55443 101913 101750 101745 102060 101974 101246 100712 100975 101460 101368 100846 100669 101313 102754 104619 106168 106687 106249 105598 105120
55424 105120 104524 103685 103005 102582 101873 100730 100075 100823 102575 104102 104776 104931 105003 105006 104862 104768 105057 105863 106980
55405 106980 107997 108612 108864 109009 109231 109579 109987 110073 109131 106789 103679 101054 99689 99416 99594 99627 99145 98258
55387 98258 97620 97726 98090 97652 96116 94353 93353 93278 93663 94040 94097 93646 92799 91972 91577 91811 92691 93995
55369 93995 95283 96288 97205 98152 98569 97821 96287 95106 94744 94538 93923 93374 93756 95248 97313 99288 100613
55352 100613 100857 99974 98424 96808 95531 94808 94682 94959 95429 96208 97497 99003 100091 100565 100789 100933 100661
55335A00661q72j093r25q34q94p17k10L00O33Q63R05N84N5m47j053j863k275j516
55317I1302J62J557J908J544J068O24J58k35n82j136j827k029j315k03L29Nm15
55300I0915j38O50J056O82J33R2L98M86L46L12J80m80j238j096p3O17N01O43J790
55281I5776K844K372P81l20l98k04j74K0L12P8o34q72j90O60Q41M54M7k30m63
55262A00700m72l9O63J156J117N56k59r55j290j207o40M44J608J988J279K95m4
55245A04900O0k01p98r19l95q2n01j043r36l44N6L7j10j30L2L79P71R21P84P22
55225A03203R27R63L18p59j409j182n56k44l33l46mM38O11M49O3m52q55o79J86
55206A00339J027R53rq55p56R6Q51P86j91j403j793r57K58O83K84m5L6K5j84N
$$ plain form
55335 100661 99789 98696 97771 96937 96043 95326 95116 95416 96049 96912 97817 98401 98456 98009 96956 95093 92818 91302
55317 91302 91464 93021 94929 96473 97541 98165 98323 98088 97506 96370 94543 92514 91199 90996 91325 91330 90915
55300 90915 90777 91427 92483 93165 93298 93390 93788 94274 94620 94932 95112 94632 93394 92298 92225 92842 93343 93986 95776
55281 95776 98620 100992 101773 101453 101055 100851 100677 100697 101009 101087 100453 99581 99391 100051 100892 101346 101393 101163 100700
55262 100700 100228 100189 100852 102008 103125 103681 103422 102467 101177 99970 99330 99774 101382 103370 104649 104944 104900
55245 104900 104960 104759 103961 103042 102647 102565 102064 101021 100085 99741 99797 99834 99724 99594 99626 100005 100776 101697 102481 103203
55225 103203 104130 105093 105411 104652 103243 102061 101505 101261 100928 100582 100578 101016 101627 102076 102139 101687 100832 100153 100339
55206 100339 101366 102319 102310 101455 100699 100795 101646 102432 102241 100838 99045 98088 98346 99029 99313 99268 99304 99329 99145 99150
55186I9150N78N57l35q58n3J170J409Q34N89P43L87o06j308j268r85p76l35L51
55168I9244P12N34L20L94M53K91K01L07K27k00m62q1O69J133J055O84M04M60Q06
55149A07151J058Q39J94n16j110j632j986j924j395o25J61Q07J067P76J84k23
55133A02826j99J32M92N34n5j128j940j868j106k92L23Q47J167R87M53J88N20
55116A01881J068J149M52o28j208p42K50O31Q6m55j68N33Q22P97J138J787J920
55099A09313J187K26j03L95J123J139N8j219j235J69J465J459Q30P57J008O62
55083A17234L0J77R32J037K84j56K53O23K80j59j1L55K98j06n19r55j346j230
55065A17021n48q0n31j530k044j512k38J002J546J318Q26M72P4n17q32m96j67
$$ plain form
55186 99150 99728 100285 99950 99092 99039 100209 101618 102452 103041 103784 104171 103565 102257 100989 100004 99228 98893 99244
55168 99244 99956 100490 100810 101204 101657 101948 102149 102456 102683 102483 102021 101940 102609 103742 104797 105481 105885 106345 107151
55149 107151 108209 109048 109242 108726 107616 105984 103998 102074 100679 100054 100215 101022 102089 102865 103049 102826
55133 102826 102627 102759 103251 103785 103730 102602 100662 98794 97688 97396 97719 98566 99733 100720 101173 101361 101881
55116 101881 102949 104098 104550 103922 102714 101972 102222 102853 102939 102484 102316 102849 103671 104468 105606 107393 109313
55099 109313 110500 110726 110623 111018 112141 113280 113338 112119 110884 111053 112518 113977 114807 115564 116572 117234
55083 117234 117264 117441 118373 119410 119694 119538 119791 120414 120694 120535 120524 120879 121177 121071 120552 119597 118251 117021
55065 117021 116473 116393 115862 114332 112288 110776 110538 111540 113086 114404 115230 115702 115776 115259 114427 113931 113764
55048A13764p21j722j856q19L42Q92J124J285J005K94j03J33L25ll73l19k22n13
55030A12513q18n99M5P37J326J587J103M3o55m48J14L09J85Q3o0l24l57J8L22
55011A15124Q9m34p37p27n68l73l77p54j050n09O84J375J035M90N36Q06O97N10
54993A15817P88J267J392J281J298J247P70J06l24n42o17k45N11P34j40j227j286
54976A20830m67Pl55q35p09r0N14P68P21P91J371K146K249J452O17L94K90l32
54958A29362j021r87n14m59p93p07K2P71J132J266J265J032P83Q45R93P14J41
54941A33845r6M8r5q15j478j302k40J047J817J820J518J607K135K423K086J636
54925A45956J670K070K527L252M417N433N741N745O088O428O049N278N045N133
$$ plain form
55048 113764 113043 111321 109465 108646 108988 109880 111004 112289 113294 113588 113485 113618 113943 113940 113567 113248 113026 112513
55030 112513 111695 111096 111141 111878 113204 114791 115894 115937 115282 114834 114948 115257 115442 115525 115465 115141 114784 114802 115124
55011 115124 115213 114779 114042 113315 112747 112374 111997 111243 110193 109684 110368 111743 112778 113268 113804 114610 115307 115817
54993 115817 116605 117872 119264 120545 121843 123090 123860 123966 123642 123100 122483 122238 122749 123483 123343 122116 120830
54976 120830 120363 120370 120015 119180 118471 118381 118895 119663 120384 121175 122546 124692 126941 128393 129010 129404 129694 129362
54958 129362 128341 127354 126840 126381 125588 124881 124903 125674 126806 128072 129337 130369 131152 131997 132990 133704 133845
54941 133845 133749 133797 133702 132887 131409 130107 129867 130914 132731 134551 136069 137676 139811 142234 144320 145956
54925 145956 147626 149696 152223 155475 159892 165325 171066 176811 182899 189327 195376 200654 205699 210832
54911B10832M248J946o82k527l624m494n287n999o748p367p376o695n817n006
54897A55404m001k734j702j186q22l17l3l33p84n99L83J534K147K039J638J626
54881A52260K293L176L585L525L748M769O194P218P490P219O607N541L804J563
54867B18992n64k057l040m043n156n896o036o027o229o250n637m795m455m557
54853A54250m391l761l160k840k464j751q67q2M16L11n51j677k283k249k060j879
54837A24962j382o64l92p39r68n41L2Qm29m65J51Q59J075P97L82J23Q0J40J90
54818A23219K14K18R2k10m50l15P8K26j13n89p25m69r0K79P14J138J207O85j22
54799A24987n60l33J54L83M30O76R80P68N0l70J6P37J135J227J269J100O16L83
$$ plain form
54911 210832 215080 217026 216344 213817 210193 205699 200412 194413 187665 180298 172922 166227 160410 155404
54897 155404 151403 148669 146967 145781 144959 144642 144609 144276 143492 142893 143276 144810 146957 148996 150634 152260
54881 152260 154553 157729 161314 164839 168587 173356 179550 186768 194258 201477 208084 213625 217429 218992
54867 218992 218428 216371 213331 209288 204132 198236 192200 186173 179944 173694 168057 163262 158807 154250
54853 154250 149859 146098 142938 140098 137634 135883 135016 134934 135350 135661 135110 133433 131150 128901 126841 124962
54837 124962 123580 122916 122524 121785 120817 120276 120308 120316 119887 119422 119573 120432 121507 122304 122686 122809 122889 123029 123219
54818 123219 123433 123651 123743 123533 123083 122768 122846 123072 122959 122370 121645 121176 121086 121365 122079 123217 124424 125109 124987
54799 124987 124427 124094 124248 124631 125061 125737 126717 127485 127535 127165 127181 127918 129053 130280 131549 132649 133265 133648
54781A33648R76J988K473K187J689J420J365J461J639J601J250J158J901L142
54767A57898M082M644N339O201O846P403Q325R189Q862P088M855K875P67j802
54753B32572m180n592o142o305o182n851n871o568p292p018n550l616k044j209
54739A59152j073j289j409j235q31j65Q50J941K562K640K715L106L505L568L379
54724A77416L062K547K094K388L613M963N570N479N193M753L829K376O02j427
54710B22458l618n522o656o968o702o063n352m981m937m629l780l013k946l218
54696A54073l099k684k567k627k149j145m77n19o04k36O2l50j174j684j783j885
54680A31152j994j697j009m91m33n17m01j56O7L43O94R22J027J277J524R81o34
$$ plain form
54781 133648 134624 136612 139085 141272 142961 144381 145746 147207 148846 150447 151697 152855 154756 157898
54767 157898 161980 166624 171963 178164 185010 192413 200738 209927 218789 225877 230732 233607 234374 232572
54753 232572 228392 222800 216658 210353 204171 198320 192449 185881 178589 171571 166021 162405 160361 159152
54739 159152 158079 156790 155381 154146 153315 153150 154000 155941 158503 161143 163858 166964 170469 174037 177416
54724 177416 180478 183025 185119 187507 191120 196083 201653 207132 212325 217078 220907 223283 223885 222458
54710 222458 218840 213318 206662 199694 192992 186929 181577 176596 171659 167030 163250 160237 157291 154073
54696 154073 150974 148290 145723 143096 140947 139802 139325 138806 138202 137966 138028 137678 136504 134820 133037 131152
54680 131152 129158 127461 126452 125961 125528 125011 124610 124454 124521 124864 125558 126480 127507 128784 130308 131289 130655
54663A30655k211k375j295l73k36j46L80O20L1n81k69M55M27k90n42N3O84P48
54645A25735O42Q49J153J135Q10M47K99O30J484K282K232J285K01m21o57p62p93
54628A36551q38j004j132j005q95j133j300o22O74J416J108N67N50P52O79N90
54612A34958Q45J042O59Nk53p9K0j48l27k83R8Q12J539J735J273O15N9o16j434
54593A40520j817j444q87p48p62m42n1j23m42l83rO8k86o13o79o65o23m23k26
54574A29965l38o12o17l84l49n34m97j42P3r8k14K49J166J877J850J127K97M8
54556A32867M87R87Q77K32l16l71j09J13N5l88j161j945k305k024j260m44l4j20
54538A25141k09K52J073J466J225J098J597K050J547L85k65L9N69N84J99j07j51
$$ plain form
54663 130655 128444 126069 124774 124401 124165 124019 124399 125019 125050 124469 124200 124655 125082 124792 124250 124303 124987 125735
54645 125735 126377 127226 128379 129514 130324 130771 131070 131700 133184 135466 137698 138983 139184 138763 138106 137344 136551
54628 136551 135713 134709 133577 132572 131677 130544 129244 128622 129296 130712 131820 132387 132937 133689 134368 134958
54612 134958 135803 136845 137504 137509 137256 137177 137197 137049 136722 136439 136537 137349 138888 140623 141896 142511 142570 141954 140520
54593 140520 138703 137259 136372 135624 134862 134420 134369 134246 133804 133421 133412 133480 133194 132581 131902 131237 130614 130191 129965
54574 129965 129627 129015 128398 128014 127665 127131 126634 126492 126565 126467 126253 126502 127668 129545 131395 132522 132819 132867
54556 132867 133354 134341 135218 135450 135134 134763 134654 134767 134822 134434 133273 131328 129023 126999 125739 125295 125261 125141
54538 125141 124932 125184 126257 127723 128948 130046 131643 133693 135240 135625 135360 135399 135968 136552 136751 136644 136493
54521A36493PL36P12Q29M49k66q06o46K56J236J422O99j00k49N0K12K43N28R53
54502A42358R82O04M29P60J129R53K08o97j355j516j191o86l08m7J78J37l75r41
54484A40622q42q7N26M47J1k64m03o30p78n47j09N9j10j62K25P65R53O75K90J25
54464A40766J07L2PL32R37J206O66l63j057r90n17k28k44k08J44N64N92J50l71
54445A41525o52p93r02p31j54L29K01k00j85M3l97j466j916j062K12Q46J007J266
54427A36971J284M74o30r59n15k19l27k25K90P37J018J569K227K115J094K47L46
54410A45497P63N69j08n40n34l81j06L78P99Q73Q82J193J471J109L40J10P75J577
54392A54667J680J151O24M10L74M06N36O47M80Q9q2K36O59N69k8m69l13M8m0n80
$$ plain form
54521 136493 136500 136836 137548 138377 138826 138560 137754 137108 137364 138600 140022 140721 140621 140372 140422 140634 140877 141405 142358
54502 142358 143340 143944 144373 145133 146262 147215 147423 146726 145371 143855 142664 141978 141670 141623 141801 141938 141563 140622
54484 140622 139780 139693 140219 140666 140677 140413 140010 139380 138602 138055 137946 138005 137895 137733 137958 138723 139676 140351 140641 140766
54464 140766 140873 140905 140912 141244 142181 143387 144053 143690 142633 141643 141126 140898 140654 140446 140590 141154 141746 141896 141525
54445 141525 140873 140080 139178 138447 138293 138622 138823 138623 138438 138481 138084 136618 134702 133640 133852 134698 135705 136971
54427 136971 138255 138729 138099 137140 136625 136406 136079 135854 136144 136881 137899 139468 141695 143810 144904 145151 145497
54410 145497 146260 146829 146721 146181 145647 145266 145160 145538 146337 147210 148092 149285 150756 151865 152205 152315 153090 154667
54392 154667 156347 157498 158122 158532 158906 159312 159848 160495 160975 161064 160982 161218 161877 162446 162418 161949 161636 161684 161644 161064
54372A61064r15o22j05j22q72j719j861j182l38L8J5N1J99np76j611j776j059
54354A48404Q0R16R72M17j4J89O41N28k18q23q42o81o89n27O1N24K70m13q81j058
54334A46856j168j009l57K81L12J45O23J597K069J741J380J490J706J689J648
54319A59003J624J193L75N4Q16K029K647K503K217K098J793R00m40j619k034j653
54303A71506j126j194j900k591k666k100j281o88p04j296j855j745j025k89N3
54288A51099k6m87j158j400o79N45J210J018O78O24M32j81o43m00J80M20L16L19
54270A51867N09O34O35N98L75k07q73j074n99K59J000J212P87Q9k96j69J12J69
54252A55028L5j00j73j22J61N20N39J51j30R8N24N34rp35j259j440j313j078j002
$$ plain form
54372 161064 160149 159527 159422 159300 158428 156709 154848 153666 153328 153366 153381 153432 153631 153626 152850 151239 149463 148404
54354 148404 148484 149400 150372 150789 150775 150964 151605 152133 151915 151092 150250 149569 148880 148353 148414 148938 149208 148795 147914 146856
54334 146856 145688 144679 144322 144603 144915 145060 145683 147280 149349 151090 152470 153960 155666 157355 159003
54319 159003 160627 161820 162195 162249 163065 165094 167741 170244 172461 174559 176352 177252 176812 175193 173159 171506
54303 171506 170380 169186 167286 164695 162029 159929 158648 157960 157256 155960 154105 152360 151335 151046 151099
54288 151099 151073 150586 149428 148028 147349 147894 149104 150122 150800 151424 151856 151675 151032 150632 150812 151232 151548 151867
54270 151867 152376 153010 153645 154243 154618 154411 153538 152464 151865 152124 153124 154336 155123 155212 154916 154747 154859 155028
54252 155028 155063 154963 154790 154668 154829 155349 155888 156039 155909 156007 156531 157065 157056 156321 155062 153622 152309 151231 150229
54233A50229j120j154q80l58K02O32P35M12p9l27k65k03k63k47j17q4j27L4L54
54214A47374M29K27K15N25P00N94P72J433J730Q69o88j828k172k053j619q06J8
54197A45720L61M12P56J263J137J73p31o19M52J546J714O91q61j726j213O7Q36
54180A49978O29J62K23P65J277J528J510J106L16l90n19l06n02j256j736j215
54164A51570j34N08N23N99R33P46l97j549j543o25K6Q4L01R71J353Q85mp43j326
54145A52178j674j254o0Q50O38p3j16N51J003P69K33k50o30p07k00N78R14O45
54127A53395L44L83M39J13l91n22o6O07Q66M02m11q33n51PL23L87M38M63L82M13
54107A56188P45J136J258J215J220J057M47k61m39r0K14K25K27L19J72l38p72
$$ plain form
54233 150229 149109 147955 147075 146717 146919 147551 148286 148698 148619 148292 148027 147824 147561 147314 147197 147113 146986 147020 147374
54214 147374 147803 148030 148245 148770 149470 150064 150836 152269 153999 154868 154180 152352 150180 148127 146508 145702 145720
54197 145720 146081 146493 147249 148512 149649 149822 149091 148472 148924 150470 152184 152875 152014 150288 149075 149142 149978
54180 149978 150607 150769 150992 151757 153034 154562 156072 157178 157494 157104 156585 156279 155777 154521 152785 151570
54164 151570 151436 151944 152467 153066 153999 154745 154348 152799 151256 150631 150657 150741 151042 152013 153366 154251 154247 153504 152178
54145 152178 150504 149250 149190 150040 150678 150605 150489 151040 152043 152812 153045 152795 152165 151458 151258 151836 152750 153395
54127 153395 153739 154122 154561 154674 154283 153761 153695 154302 155168 155570 155159 154326 153775 153782 154105 154492 154930 155393 155775 156188
54107 156188 156933 158069 159327 160542 161762 162819 163266 163005 162566 162476 162690 162915 163142 163461 163633 163295 162523
54090A62523o43j0N67N04l00j182j138N5J389J690R55J62j8L23Q54J322J408R81
54072A69442M68L76M90K78p0J30P91J031O04L49Q30J454J461J013O16K01n03j194
54054A77767j355j000m39K98J221J979K369K838L659M013K920R43q5P26K328L268
54038B01450L359L312L434L510L572L975M745N413N650N668N861O342O889P160
54024B70340O951O406N922N640N165M124K901K336K566K791K381J748J642K020
54010C22933K182J783J099L88l71j108j531j542j376j254j259j525k083k510k307
53995C11519j680j317j288q84J96J341K075K863M092M955M191J661j577m572p002
53980C14573q654r223q888q365q107p876p193n975m605l613l323l509l527l010
$$ plain form
54090 162523 161880 161870 162437 162941 162641 161459 160321 160376 161765 163455 164410 164572 164554 164877 165731 167053 168461 169442
54072 169442 169910 170286 170776 171054 170984 171114 171905 172936 173540 173889 174719 176173 177634 178647 179263 179464 178961 177767
54054 177767 176412 175412 174973 175271 176492 178471 180840 183678 187337 191350 194270 195213 195128 195854 198182 201450
54038 201450 204809 208121 211555 215065 218637 222612 227357 232770 238420 244088 249949 256291 263180 270340
54024 270340 277291 283697 289619 295259 300424 304548 307449 309785 312351 315142 317523 319271 320913 322933
54010 322933 325115 326898 327997 328385 328014 326906 325375 323833 322457 321203 319944 318419 316336 313826 311519
53995 311519 309839 308522 307234 306350 306546 307887 309962 312825 316917 321872 326063 327724 326147 321575 314573
53980 314573 305919 296696 287808 279443 271336 263460 256267 250292 245687 242074 238751 235242 231715 228705
53966B28705k330k031k039j879j438r76m58M68J683K416K112J132L27J67M71P75
53950B27105Q47Q51J101J569J820J574J140R91J107J114R81J107J674K298K465
53935B47744K126J720J726K138K415K077J433J362K198L250L670L436L087K909
53921B81291K961L462M522N690O409O774P245P777P947P806P852Q152Q182P700
53907C73770P152P044P470Q279R205R737R386Q310P187O381N579M340K579N64
53893D66983j214k206k361k346k807l513l836l817l992m371m511m552n223o593
53879D15641p785q206q218q220p982p272o441n869n478n154n035n037m754m236
53865C25954m071m387m503m034l557l629l949m056m104m226l943l053k381k680
$$ plain form
53966 228705 226375 224344 222305 220426 218988 218012 217554 218022 219705 222121 224233 225365 225692 225859 226330 227105
53950 227105 227952 228803 229904 231473 233293 234867 236007 236998 238105 239219 240200 241307 242981 245279 247744
53935 247744 249870 251590 253316 255454 257869 259946 261379 262741 264939 268189 271859 275295 278382 281291
53921 281291 284252 287714 292236 297926 304335 311109 318354 326131 334078 341884 349736 357888 366070 373770
53907 373770 380922 387966 395436 403715 412920 422657 432043 440353 447540 453921 459500 463840 466419 466983
53893 466983 465769 463563 461202 458856 456049 452536 448700 444883 440891 436520 432009 427457 422234 415641
53879 415641 407856 399650 391432 383212 375230 367958 361517 355648 350170 345016 339981 334944 330190 325954
53865 325954 321883 317496 312993 308959 305402 301773 297824 293768 289664 285438 281495 278442 276061 273381
53851B73381l331l178k201j388j215j293j299j356j441j312j046r43r39p72o21
53836B51046q45j141q26M9O50O04M58P67J351J839K283K850L383L668L811M059
53820B74006M468M915N128M635L059P04j526l063m144n144n820n647m640l312
53806B63619k012p60K51O15M22N51J747L587M911N205N089N251N515N363M927
53791C04281M769M938M913M503M092L872L454K517J326L18l74o72l94K41M72j57
53775C38099j089j459j246j222j930l155m311m927m871m470m271m432m498m070
53761B92148l446l151l123k883k399k194k542l087l383l403l382l424l424l252
53747B49055k875k401k023j881j964k169k335k194j573p10r9Q2R8J73K20K10K97
$$ plain form
53851 273381 270050 266872 264671 263283 262068 260775 259476 258120 256679 255367 254321 253378 252439 251667 251046
53836 251046 250201 249060 248234 248283 248933 249537 249995 250762 252113 253952 256235 259085 262468 266136 269947 274006
53820 274006 278474 283389 288517 293152 296211 296915 295389 292326 288182 283038 277218 271571 266931 263619
53806 263619 261607 260847 261098 261713 262135 262686 264433 268020 272931 278136 283225 288476 293991 299354 304281
53791 304281 309050 313988 318901 323404 327496 331368 334822 337339 338665 338983 338609 337937 337543 337784 338256 338099
53775 338099 337010 335551 334305 333083 331153 327998 323687 318760 313889 309419 305148 300716 296218 292148
53761 292148 288702 285551 282428 279545 277146 274952 272410 269323 265940 262537 259155 255731 252307 249055
53747 249055 246180 243779 241756 239875 237911 235742 233407 231213 229640 228930 228831 228913 229011 229184 229404 229614 229911
53730B29911L89J00n17q08m81j80m83q66m83M43Q69L96l47p07n82j03N45Q75N00
53711B28471j77l75p9J0k47q9Q51J785J824J109L83np1L18J168J900J878J336
53693B39990J098J426J755J694J618J986K459K293J444P24O78P65M2j490k795
53678B53687l031k413j634r50k73K17J42m35r43r04l36L97Q05M97m17j226j316
53661B41867r14p51j061j411j448j227q13j63M42M81K9j39L97J027R83M24J41
53644B37864M23P81P03K31k31l33j4M54P20P50Q97J327J670J507J054R16J189
53627B49908J379J191J023J331J866J996J629J380J673K139K161J775J591J912
53613B72954K387K656K886L379L931M040L582K950K524K307K052J576R79P08J233
$$ plain form
53730 229911 230300 230400 229883 229075 228594 228414 227931 227065 226582 227025 227894 228290 227943 227236 226654 226551 227096 227971 228471
53711 228471 228294 227919 227840 227850 227603 227514 228365 230150 231974 233083 233466 233461 233390 233708 234876 236776 238654 239990
53693 239990 241088 242514 244269 245963 247581 249567 252026 254319 255763 256487 257165 257930 257972 256482 253687
53678 253687 250656 248243 246609 245659 245386 245603 245745 245310 244367 243463 243127 243524 244329 244826 244409 243183 241867
53661 241867 240953 240202 239141 237730 236282 235055 234242 234079 234521 235002 235031 234892 235289 236316 237299 237723 237864
53644 237864 238287 239068 239771 240002 239771 239438 239424 239878 240598 241348 242245 243572 245242 246749 247803 248719 249908
53627 249908 251287 252478 253501 254832 256698 258694 260323 261703 263376 265515 267676 269451 271042 272954
53613 272954 275341 277997 280883 284262 288193 292233 295815 298765 301289 303596 305648 307224 308203 308911 310144
53598C10144K430L420L398K445J282L85k37n44l76J28M91M77K68Ll83p99r67r37
53580C20628j147j720k158k038j612j307j126r19q48j081j327j230r98j094j394
53565C00629j298o40J9J31k10n37n82m24k90l38m28j89N37J301J462J000O37J015
53547C01795K024L061L649L714L466L223L191L266L218L114L313L916M584N102
53533C50636N767O783P630P627P032O907P711Q643Q730Q112P758Q141Q798R128
53519D59403R119R171R590J0412J1477J2459J2991J2993J2819J3005J3863J5277
53507F02579J6791J7873J8335J8479J8764J9271J9674J9711J9458J9095J8652
53496H08682J8036J7192J6121J4975J4085J3710J3611J3263J2614J2323J2945
$$ plain form
53598 310144 312574 315994 319392 321837 323119 323504 323267 322723 322347 322475 322966 323443 323711 323714 323331 322532 321565 320628
53580 320628 319481 317761 315603 313565 311953 310646 309520 308601 307753 306672 305345 304115 303117 302023 300629
53565 300629 299331 298691 298710 298841 298631 298094 297512 297088 296798 296460 296032 295843 296380 297681 299143 300143 300780 301795
53547 301795 303819 306880 310529 314243 317709 320932 324123 327389 330607 333721 337034 340950 345534 350636
53533 350636 356403 363186 370816 378443 385475 392382 400093 408736 417466 425578 433336 441477 450275 459403
53519 459403 468522 477693 487283 497695 509172 521631 534622 547615 560434 573439 587302 602579
53507 602579 619370 637243 655578 674057 692821 712092 731766 751477 770935 790030 808682
53496 808682 826718 843910 860031 875006 889091 902801 916412 929675 942289 954612 967557
53485I67557J4116J4913J4857J4268J3710J3426J3322J3161J2702J1823J0623
53474A114478R374Q297P394O510N450M097K393K74k216m682o481p405q091r349
53460A120043j1145j2724j3739j4622j5661j6382j6338j5926j5897j6342j6716
53449I54551j6651j6262j5820j5532j5518j5625j5446j4873j4270j3806j2990
53438G87758j1491r970r326r272q536o483l814j552n7Q23J251J407J568J953K754
53423G37013M200O184P990Q958R435J0346J1883J3347J4442J5755J7609J9291
53411H76453K0115K0510K1378K2837K4346K5718K7248K8932L0298L1078L1550
53400A160463L2145L3025L4152L5460L6884L8395L9931M1228M1897M1890M1704
$$ plain form
53485 967557 981673 996586 1011443 1025711 1039421 1052847 1066169 1079330 1092032 1103855 1114478
53474 1114478 1123852 1132149 1139543 1146053 1151503 1155600 1157993 1158267 1156051 1151369 1144888 1137483 1129392 1120043
53460 1120043 1108898 1096174 1082435 1067813 1052152 1035770 1019432 1003506 987609 971267 954551
53449 954551 937900 921638 905818 890286 874768 859143 843697 828824 814554 800748 787758
53438 787758 776267 766297 756971 747699 739163 732680 728866 727314 727257 728080 729331 730738 732306 734259 737013
53423 737013 741213 747397 755387 764345 773780 784126 796009 809356 823798 839553 857162 876453
53411 876453 896568 917078 938456 961293 985639 1011357 1038605 1067537 1097835 1128913 1160463
53400 1160463 1192608 1225633 1259785 1295245 1332129 1370524 1410455 1451683 1493580 1535470 1577174
53389A577174M1832M2129M2008M1193L9988L8792L7679L6496L5161L3681L1983
53378A998116K9838K7016K3586K0056J7028J4600J2142Q865M593qm062p310j0374
53365B134086j4082j8572k3075k6753k9605l2395l5710l9280m2238m3964m4561
53354A783851m4650m4737m4791m4491m3738m2728m1544m0109l8585l7388l6571
53343A324519l5674l4534l3729l3663l3675l2807l1177k9766k8922k7968k6376
53332I76228k4558k3146k2133k1041j9523j7577j5520j3885j2999j2593j2156
53321G81097j1546j0853r868q385o845n890n276m129k323o85L55J338K698M128
53307G23816N412O884Q531R646J0070J0835J2695J4817J5878J5804J5543J5707
$$ plain form
53389 1577174 1619006 1661135 1703143 1744336 1784324 1823116 1860795 1897291 1932452 1966133 1998116
53378 1998116 2027954 2054970 2078556 2098612 2115640 2130240 2142382 2151247 2155840 2155832 2151770 2144460 2134086
53365 2134086 2120004 2101432 2078357 2051604 2021999 1989604 1953894 1914614 1872376 1828412 1783851
53354 1783851 1739201 1694464 1649673 1605182 1561444 1518716 1477172 1437063 1398478 1361090 1324519
53343 1324519 1288845 1254311 1220582 1186919 1153244 1120437 1089260 1059494 1030572 1002604 976228
53332 976228 951670 928524 906391 885350 865827 848250 832730 818845 805846 793253 781097
53321 781097 769551 758698 748830 740445 733600 727710 722434 718305 715982 715297 715652 716990 719688 723816
53307 723816 729228 736112 744643 754289 764359 775194 787889 802706 818584 834388 849931 865638
53295H65638J6396J7744J9557K0826K0727J9893J9662K0255K0742K0641K0453
53284A082534K0530K0398J9535J7995J6106J4066J2072J0293Q621O807M849K805
53272A236611L95k603n741q277j0112j1696j3199j4420j5424j6500j7570j8337
53260A103127j8992j9916k0822k1041k0758k0957k1996k3110k3587k3571k3365
53249H65012k2940k2451k2386k2642k2362k1341k0693k1309k2340k2240k0863
53238F23445j9461j8838j8487j7677j6503j5546j5043j4716j4167j3262j2298
53227D47447j1766j1747j1619j0668q995p431o571o158n653n088n002n563o088
53214C45098n787m827m269m740n548n535m565l648l587m098m428m337m090l892
$$ plain form
53295 865638 882034 899778 919335 940161 960888 980781 1000443 1020698 1041440 1062081 1082534
53284 1082534 1103064 1123462 1142997 1160992 1177098 1191164 1203236 1213529 1222150 1228957 1233806 1236611
53272 1236611 1237006 1234403 1228662 1220385 1210273 1198577 1185378 1170958 1155534 1139034 1121464 1103127
53260 1103127 1084135 1064219 1043397 1022356 1001598 980641 958645 935535 911948 888377 865012
53249 865012 842072 819621 797235 774593 752231 730890 710197 688888 666548 644308 623445
53238 623445 603984 585146 566659 548982 532479 516933 501890 487174 473007 459745 447447
53227 447447 435681 423934 412315 401647 392652 385221 378650 372492 366839 361751 356749 351186 345098
53214 345098 339311 334484 330215 325475 319927 314392 309827 306179 302592 298494 294066 289729 285639 281747
53200B81747l696l480l248k885k260j444o87j71L6j28p12j611k481k840k384j330
53184B52426m18k97r50j776k192j995j270l55J48k51j365k389k644k053r46K48
53168B33921J042J067M01n16j351j945j963j078K95R88L20j031j822j602r19m01
53152B25406j78j70l75p12q67n47J42P24Q13N71N21P50N88n02j963k628k186j456
53134B17931j069o62J73R67J052N83J63j31n53q61n59J55N20K68j85n64r79j283
53116B14966j037k98L30O14R03J164P41m22j171n49P76J325O98k01n64m35j45
53099B16695J67L10j7p19j238j234r78r18j181j582j860j734j107k71L29O31Q41
53082B06134Q45K73p37j396j242p13l68j01K94L13o51k100k736k082j006m67m02
$$ plain form
53200 281747 278051 274571 271323 268438 266178 264734 264047 263876 263912 263784 263072 261461 258980 256140 253756 252426
53184 252426 252008 251711 250761 248985 246793 244798 243528 243173 243321 243070 241705 239316 236672 234619 233673 233921
53168 233921 234963 236030 236431 235915 234564 232619 230656 229578 229873 230861 231181 230150 228328 226726 225807 225406
53152 225406 225228 225058 224683 223971 223104 222557 222699 223423 224236 224807 225328 226078 226666 226164 224201 221573 219387 217931
53134 217931 216862 216200 216373 217340 218392 218975 219138 219007 218454 217593 217034 217189 217709 217977 217792 217228 216249 214966
53116 214966 213929 213631 213961 214575 215478 216642 217383 216961 215790 215241 216017 217342 218040 217839 217275 216840 216695
53099 216695 216862 217172 217155 216436 215198 213964 212986 212068 210887 209305 207445 205711 204604 204333 204662 205293 206134
53082 206134 206979 207252 206515 205119 203877 203164 202796 202695 202989 203302 202651 200551 197815 195733 194727 194260 193858
53065A93858k00K66O40O89M47o3p61j286j262q01l89k71k20K2L49N13N29O53R82
53046A93695J261J198Q40N01L52K60J14K2N1rl82r26j340j583j761j688j106l05
53028A89194k4m78r98r07l73m7j26k53j91j53m19q63r75k88J050K134J982N49
53010A88814j117j916j708j127p01m02M5P30J410J635J145K07n29o64l16J81N47
52993A86234N09p2q12j015o00k93o24j116r58o6R84J684J776J162K14k01L05R70
52975A88081Q89L08R0K23r3r54j457j067l10K35O74J151J332J078R65J475K137
52958A94757K041R39n77j691j895j250m00n1j94k74j75l97j057j465j186q12j056
52941A85257j671j930j728j421j000l00K72J63l51m42pK72J71K67P44P99j24j183
$$ plain form
53065 193858 193658 193924 194564 195253 195700 195637 194876 193590 192328 191527 191138 190867 190647 190669 191018 191531 192060 192713 193695
53046 193695 194956 196154 196994 197495 197847 198107 198221 198243 198294 198285 197903 196977 195637 194054 192293 190605 189499 189194
53028 189194 189170 188692 187694 186787 186414 186367 186241 185988 185797 185644 185225 184362 183387 183099 184149 186283 188265 188814
53010 188814 187697 185781 184073 182946 182245 181843 181888 182618 184028 185663 186808 187015 186486 185822 185506 185687 186234
52993 186234 186743 186671 185859 184844 184244 183951 183327 182211 181253 181187 182171 183855 185631 186793 187007 186806 187111 188081
52975 188081 188970 189278 189368 189591 189498 188544 187087 186020 185710 185945 186619 187770 189102 190180 191145 192620 194757
52958 194757 196798 197737 197160 195469 193574 192324 191924 191873 191679 191405 191230 190833 189776 188311 187125 186313 185257
52941 185257 183586 181656 179928 178507 177507 177207 177479 177642 177291 176849 176842 177114 177285 177552 178296 179095 178971 177788
52923A77788j060L02J597J686O35p15j572j557p43K64P04M34Q5K13N85P09P09
52906A80064J046J496J251J86p07o58j51n9k90j77K24K03l24o12k75K33M98O64
52888A82612P45L49m82r59o70l05n71j032r06m34m66r82j102n41o1k32o00m67
52870A73896J47P57J183J567J872J859J486J051R06J162J666K192K591K802K808
52855A97945K640K435K320K207J823J049N8q80j601j966j909j640j533j646j646
52840A97656j401j291j619k051k108j898j881k058j957j391o44J03R85J937K368
52825A84750J714J92j237j637q52L91J129J005M45K4j03o0P5J42k06j020j653
52808A83099j375l05P95J524K056K379K133J360P37O24M54l84j513k011j689j230
$$ plain form
52923 177788 176728 177030 178627 180313 180948 180233 178661 177104 176361 176625 177329 177763 177848 178061 178646 179355 180064
52906 180064 181110 182606 183857 184043 183336 182678 182527 182468 182178 182001 182225 182428 182104 181492 181217 181450 181948 182612
52888 182612 183357 183706 183224 182265 181595 181290 180719 179687 178781 178347 177881 176899 175797 175256 175195 174963 174363 173896
52870 173896 174043 174800 175983 177550 179422 181281 182767 183818 184724 185886 187552 189744 192335 195137 197945
52855 197945 200585 203020 205340 207547 209370 210419 210477 209597 207996 206030 204121 202481 200948 199302 197656
52840 197656 196255 194964 193345 191294 189186 187288 185407 183349 181392 180001 179357 179460 180445 182382 184750
52825 184750 186464 186656 185419 183782 182930 183321 184450 185455 185900 185924 185821 185761 185836 185978 185772 184752 183099
52808 183099 181724 181419 182214 183738 185794 188173 190306 191666 192403 193027 193481 193097 191584 189573 187884 186654
52792A86654j143j219j129j011j129j281j070n39j68j20k9L23M24l58j756k677
52776A73772k405j274j2J105K039K450J978R75K90K71N21O76Q65J181J239O77
52760A84348k06p64p73n19l22k62l27m78n31k91J81O05P76O64L17j05k38J26O24
52741A82825O05Q1n0Q77K242K753K030J030O97P75L88n56j197q84K6O89P14L27
52723A93372l6j00J50M75N56L19Rj84m46j057j840k174j681p25n5k2k95m11l82
52704A85473n35q59r17m82O4K89K89M00N46M02M4j49k39p15j590k119j722p51
52686A77429kJ89K3j67o0N41J391J845J669J480J917K595K505J340q0p73n32J49
52668A91459O54O48J96k91m33k14K6n6n12j014r80j00J122J670J139K34j47K4
$$ plain form
52792 186654 185511 184292 183163 182152 181023 179742 178672 178133 177965 177845 177816 178139 178563 178205 176449 173772
52776 173772 171367 170093 170081 171186 173225 175675 177653 178628 178918 179189 179710 180386 181251 182432 183671 184348
52760 184348 184142 183378 182605 182086 181764 181502 181175 180697 180166 179875 180056 180661 181437 182101 182418 182313 182075 182201 182825
52741 182825 183430 183511 183461 184338 186580 189333 191363 192393 193090 193865 194253 193697 192500 191616 191642 192331 193045 193372
52723 193372 193336 193236 193386 193861 194417 194736 194745 194561 194115 193058 191218 189044 187363 186638 186583 186561 186266 185855 185473
52704 185473 184938 184079 183162 182680 182744 183033 183322 183722 184268 184670 184714 184565 184326 183611 182021 179902 178180 177429
52686 177429 177427 177616 177639 177472 177412 177953 179344 181189 182858 184338 186255 188850 191355 192695 192615 191842 191310 191459
52668 191459 192113 192761 192957 192666 192233 192019 192045 191989 191477 190463 189483 189383 190505 192175 193314 193548 193401 193425
52650A93425K49M65R67J590J752J452J371J777J958J269J72l54j53o2p23j744
52634B03411k204j710o81K38P98J058R76M70k07m94j57L77N77M47L64M03J99n09
52616B03356j454k047j898j187n49m18n25k45M60R37P78L54J08j00m28m35J96
52599A96903P70L89n72q07O7R71J021O72P70J221J342J018P99J029J416J476J052
52582B09537L93r9k26r0K31R23J964K600K028O48o7O34J767J897Q89k41p31o81
52564B21376m14p1J88J93J17K96N66L09o15j392j131k9P50L60q44j797j893j467
52546B14502j161j125j001o05k73m07q50r85m69L23P89Q45R51J305J454R61K52
52529B14506J92Q68J418J203O06K83K07k0l75n37n13m30k6Q89J672J473O13M02
$$ plain form
52650 193425 193674 194139 195106 196696 198448 199900 201271 203048 205006 206275 206447 206093 205940 205878 205155 203411
52634 203411 201207 199497 198816 199054 199852 200910 201886 202356 202149 201655 201498 201875 202452 202899 203263 203666 203865 203356
52616 203356 201902 199855 197957 196770 196221 195803 195278 195033 195493 196430 197208 197562 197670 197570 197142 196707 196903
52599 196903 197673 198062 197490 196683 196750 197721 198742 199414 200184 201405 202747 203765 204564 205593 207009 208485 209537
52582 209537 209930 209831 209605 209515 209746 210669 212633 215233 217261 217909 217842 218476 220243 222140 223029 222788 222057 221376
52564 221376 220962 220891 221079 221272 221389 221685 222251 222560 221945 220553 219422 219393 220143 220503 219659 217862 215969 214502
52546 214502 213341 212216 211215 210610 210337 209930 209080 208095 207626 207949 208738 209583 210534 211839 213293 214254 214506
52529 214506 214698 215566 216984 218187 218793 219076 219283 219263 218888 218351 217838 217408 217382 218271 219943 221416 222029 222431
52511B22431J319K281K187J385R96J331J703J562J087P13N36L33j23p95j408j729
52495B33809j825j901j932j719j288q86o16l76k43m13p02n30L17J315J810J718
52479B26538J392J116R47P84M91J19N6N43J154J207P68N55P97R51P96R31J670
52462B40815K248J921J171R56J203J027K47k92n8L54M7j090k418l316l694l817
52446B35304l875l749l236k448j745j252p25l8N97J001J272J425J274Q79O70P65
52430B26119O54k3q41j219j147q39j80P60J221N86m87o86L15J538J937J291L1
52413B29030j114j334l44J128K033K118J857J514J058Q24J348K451L323L629L799
52398B51320M120M404M580M782M616L360J194o71j549k056k862l565l468k756
$$ plain form
52511 222431 223750 226031 228218 229603 230599 231930 233633 235195 236282 236995 237531 237864 237741 236946 235538 233809
52495 233809 231984 230083 228151 226432 225144 224258 223642 223266 223023 222610 221908 221378 221695 223010 224820 226538
52479 226538 227930 229046 229993 230777 231268 231387 231443 231986 233140 234347 235115 235670 236467 237418 238214 239145 240815
52462 240815 243063 244984 246155 247111 248314 249341 249588 249296 249238 249592 249639 248549 246131 242815 239121 235304
52446 235304 231429 227680 224444 221996 220251 218999 218274 218236 218833 219834 221106 222531 223805 224684 225354 226119
52430 226119 226773 226750 225909 224690 223543 222704 222524 223284 224505 225091 224604 223918 224233 225771 227708 228999 229030
52413 229030 227916 226582 226238 227366 229399 231517 233374 234888 235946 236770 238118 240569 243892 247521 251320
52398 251320 255440 259844 264424 269206 273822 277182 278376 277705 276156 274100 271238 267673 264205 261449
52384B61449k058j531j116j071j379j150L15K212K985K312J369J132J371J507
52370B66347J586J975K649L224L356K838J662K96m52j88N77R05L15q84j920k156
52354B80130j515n66mk3k44k76r1K17O91J327J851J944J628J150O49J29k64k62
52336B86471K33J047J979K939L757M177M183M121M321M714N050N307N578N702
52322C39579N485N202N477O431P395P679P297O676N996N208M422L852L517L386
52308D17602L644M407N259N572N251M779M531M497M648N106N739O117N991N544
52294D88687M960M156L155K326J959J824J451O52l79j299j740j529j009q42j243
52279E01129j639j394o47q2m5j92Q6J140K806M431N291N247M879M769M880M859
$$ plain form
52384 261449 259391 257860 256744 255673 254294 253144 253459 255671 258656 260968 262337 263469 264840 266347
52370 266347 267933 269908 272557 275781 279137 281975 283637 283933 283481 283293 283870 284775 285090 284206 282286 280130
52354 280130 278615 278049 278045 278022 277778 277502 277411 277628 278319 279646 281497 283441 285069 286219 286868 286997 286733 286471
52336 286471 286704 287751 289730 292669 296426 300603 304786 308907 313228 317942 322992 328299 333877 339579
52322 339579 345064 350266 355743 362174 369569 377248 384545 391221 397217 402425 406847 410699 414216 417602
52308 417602 421246 425653 430912 436484 441735 446514 451045 455542 460190 465296 471035 477152 483143 488687
52294 488687 493647 497803 500958 503284 505243 507067 508518 509170 508791 507492 505752 504223 503214 502372 501129
52279 501129 499490 498096 497449 497367 497322 497130 497216 498356 501162 505593 510884 516131 521010 525779 530659 535518
52263E35518M691M654M850N257N972O951P585P196N970M902M652M993N417N724
52249F14332N827N540M989M737M971N031M229K926K095K011K017J647J346J808
52235F63506L041M387N189N132M337L412L284M431O345P964Q692Q765Q698Q709
52221G45892Q739Q681Q448Q015P629P734Q421R105R134Q622Q339Q656R012Q702
52207H65129P832P158P071P247P304P354P649Q008P966P362O493N736N275N169
52193I62753N370N653N802N954O456P283P833P573O640N534M411L017J339j29
52179A035489r34j276j820k898m084m677m540m302m607n307n673n393m965m884
52165I80129m820m018k401q65l35p95j335j048J75J585K282K003J201L65m11j089
$$ plain form
52263 535518 540209 544863 549713 554970 560942 567893 575478 582674 588644 593546 598198 603191 608608 614332
52249 614332 620159 625699 630688 635425 640396 645427 649656 652582 654677 656688 658705 660352 661698 663506
52235 663506 666547 670934 676123 681255 685592 689004 692288 696719 703064 711028 719720 728485 737183 745892
52221 745892 754631 763312 771760 779775 787404 795138 803559 812664 821798 830420 838759 847415 856427 865129
52207 865129 872961 880119 887190 894437 901741 909095 916744 924752 932718 940080 946573 952309 957584 962753
52193 962753 968123 973776 979578 985532 991988 999271 1007104 1014677 1021317 1026851 1031262 1034279 1035618 1035489
52179 1035489 1034555 1033279 1031459 1028561 1024477 1019800 1015260 1010958 1006351 1001044 995371 989978 985013 980129
52165 980129 975309 971291 968890 968025 967690 966895 965560 964512 964687 966272 968554 970557 971758 972123 971712 970623
52149I70623j321q38k0M99O03O74Q97J150J481K040K470K133J095J74k17n76j219
52132I79648j571j205q32j272j924j363O99L025M537N396O180O880P202P265P380
52117A020045P543P587P597P683P554O760N313L629J920M6j970l603m327m257
52103A061520m042m076m029l242j436R69L209M686N183M847M025L110K444K235
52089A075403K310J950M06k081m129m625m046l819m392m795m158k858j742j032
52075A042392n64m03m61p4J209K739L478L391L308L615L917L996M179M589M812
52060A080123M526L909L242K643K302K377K541K243J528R79O98J28q98j802k330
52045A102209l097m485n792o298o510p412q830r592r231q508q149p890p151o031
$$ plain form
52149 970623 969302 968464 968444 968943 969546 970220 971117 972267 973748 975788 978258 980391 981486 981660 981443 980867 979648
52132 979648 978077 976872 976040 974768 972844 971481 972180 975205 979742 985138 991318 998198 1005400 1012665 1020045
52117 1020045 1027588 1035175 1042772 1050455 1058009 1064769 1070082 1073711 1075631 1075677 1073707 1070104 1065777 1061520
52103 1061520 1057478 1053402 1049373 1046131 1044695 1045664 1048873 1053559 1058742 1063589 1067614 1070724 1073168 1075403
52089 1075403 1077713 1079663 1080069 1077988 1073859 1069234 1065188 1061369 1056977 1052182 1048024 1045166 1043424 1042392
52075 1042392 1041828 1041425 1040964 1040890 1042099 1044838 1048316 1051707 1055015 1058630 1062547 1066543 1070722 1075311 1080123
52060 1080123 1084649 1088558 1091800 1094443 1096745 1099122 1101663 1103906 1105434 1106413 1107111 1107239 1106341 1104539 1102209
52045 1102209 1099112 1094627 1088835 1082537 1076027 1068615 1059785 1050193 1040962 1032454 1024305 1016415 1009264 1003233
52031A003233n199n021n198n035m017k259n20M52O50P24J225K198L512N099O602
52016I96446P234O480M853L554L306L778M174M082L587K853J892P08o28k133l990
52001A036196o381r286j2443j5416j7751j9190j9836k0025k0058k0077k0069j9884
51989H35780j9295j8350j7524j7259j7328j7137j6619j6368j6597j6575j5488
51978F47240j3538j1744j0873j0918j1313j1312j0423q960p894p668p450o097
51966E29050l642j155O38J940L159M379N627O962Q132Q717Q761Q630Q175O743
51952E96116M303J816J02j107k492m016m992m877l610j440J114L428N299P138
51938E96782R287J1343J2546J2718J2390J2097J1767J0905R226O978M614K179
$$ plain form
52031 1003233 998034 993013 987815 982780 978763 976504 975984 976436 977086 977810 979035 981233 984745 989844 996446
52016 996446 1003680 1010160 1015013 1018567 1021873 1025651 1029825 1033907 1037494 1040347 1042239 1042947 1042319 1040186 1036196
52001 1036196 1029815 1020529 1008086 992670 974919 955729 935893 915868 895810 875733 855664 835780
51989 835780 816485 798135 780611 763352 746024 728887 712268 695900 679303 662728 647240
51978 647240 633702 621958 611085 600167 588854 577542 567119 558159 550265 542597 535147 529050
51966 529050 525408 524253 524891 526831 529990 534369 539996 546958 555090 563807 572568 581198 589373 596116
51952 596116 600419 602235 602337 601230 598738 594722 589730 584853 581243 579803 580917 584345 589644 596782
51938 596782 606069 617412 629958 642676 655066 667163 678930 689835 699061 706039 710653 712832
51926G12832p02m060p138r243j0792j2824j5536j7972j9274j9502j9056j8052
51914E58681j6660j5291j4064j2619j0931r602q824p766n751l455k042j444m93
51901D49739J361L307M344M460M387M587M777M293K845R00q60k459m560p245r415
51886D60461r908q806p080n307l433j583k09O45J558K925M460N762O964Q501J0405
51871D65355J2073J2824J2601J2126J2119J2388J1946J0164P523N029L224K026
51859E79398J142K71q88k410m106n913p976j0104j1588j2037j1936j1860j1550
51846D90443j0474q922p783p405p401p430p431p193o483n623n220n183m799l835
51832C95261k861k263j680o82N76J717K577K991K647J583M21k67n24p38j119j650
$$ plain form
51926 712832 712130 708070 700932 691689 680897 668073 652537 634565 615291 595789 576733 558681
51914 558681 542021 526730 512666 500047 489116 479514 470690 462924 457173 453718 451676 450232 449739
51901 449739 451100 454407 458751 463211 467598 472185 476962 481255 484100 485000 484140 481681 477121 469876 460461
51886 460461 450553 441747 434667 429360 425927 424344 424135 424780 426338 429263 433723 439485 446449 454950 465355
51871 465355 477428 490252 502853 514979 527098 539486 551432 561596 569119 574148 577372 579398
51859 579398 580540 580811 579923 577513 573407 567494 559518 549414 537826 525789 513853 501993 490443
51846 490443 479969 471047 463264 455859 448458 441028 433597 426404 419921 414298 409078 403895 399096 395261
51832 395261 392400 390137 388457 387775 388351 390068 392645 395636 398283 399866 400287 400020 399496 398758 397639 395989
51816C95989k180k376j965j171n27q0P21K101L424L938L600K780J587Q0j222j719
51800D02980j534j434j897k622l030k844k115j047k0M94K78l71q79r66q38q08
51784C83347q21m97K97J126J345P01m45j447j831j643j404j597k020j921r47L77
51768C72620J363K079L004M095M792M977N237N930O509O094M423K033k33j718
51754D21205k285k411k845l919n212n964n738m765l815l592l989m034k958j216
51740C68462J0L08M23J053J935K543L086M155N646O771P127P156P337P353O495
51725D29860M686K771J662J479J702J977K455L210L779L545K460J068j68j198
51711D59288k101k762l012k934k839k973l279l499l504l514l721l779l051j565
$$ plain form
51816 395989 393809 391433 389468 388297 387770 387690 388411 390512 393936 397874 401474 404254 405841 405921 404699 402980
51800 402980 401446 400012 398115 395493 392463 389619 387504 386457 386437 386931 387209 386838 385959 384993 384155 383347
51784 383347 382526 382029 382326 383452 384797 385498 385053 383606 381775 380132 378728 377131 375111 373190 372243 372620
51768 372620 373983 376062 379066 383161 387953 392930 398167 404097 410606 416700 421123 423156 422923 421205
51754 421205 418920 416509 413664 409745 404533 398569 392831 388066 384251 380659 376670 372636 369678 368462
51740 368462 368472 368780 369203 370256 372191 374734 377820 381975 387621 394392 401519 408675 416012 423365 429860
51725 429860 434546 437317 438979 440458 442160 444137 446592 449802 453581 457126 459586 460654 460486 459288
51711 459288 457187 454425 451413 448479 445640 442667 439388 435889 432385 428871 425150 421371 418320 416755
51697D16755k04L39M14O93J009O14n46j647k072j991j676j035j51L47n6j034j878
51680D07881k387k911l642m267m297l507k117o88K17M81N28R06J758K716L286
51665C93957L300L074L098L560M323N360O803Q446R488R213P710N536K953j6k963
51650D63842n161o305o672o583o151n518m786l778k373j121q99j829l167m362
51636D05137n569o945q053q352p818o806n696m821m299l765k840j934j903k682
51622C33654l045k184q14r9q2N6O04J006Q10L12J32N29J168J444J118N90L35J43
51604C35677n14j393j545o83L26O91O84Q28R74R43J310K604M200N069N313N927
51588C60411P204Q416R024R249R266Q752P468N724L939K354J287J125J835K974
$$ plain form
51697 416755 416551 416890 417304 417997 419006 419620 419074 417427 415355 413364 411688 410653 410502 410849 410793 409759 407881
51680 407881 405494 402583 398941 394674 390377 386870 384753 384065 384282 384763 385291 386197 387955 390671 393957
51665 393957 397257 400331 403429 406989 411312 416672 423475 431921 441409 450622 458332 463868 466821 466805 463842
51650 463842 458681 452376 445704 439121 432970 427452 422666 418888 416515 415394 414495 412666 409499 405137
51636 405137 399568 392623 384570 376218 368400 361594 355898 351077 346778 343013 340173 338239 336336 333654
51622 333654 330609 328425 327611 327512 327430 327486 328090 329096 329906 330218 330350 330879 332047 333491 334609 335199 335534 335677
51604 335677 335163 333770 332225 331542 331868 332559 333243 334071 335045 335988 337298 339902 344102 349171 354484 360411
51588 360411 367615 376031 385055 394304 403570 412322 419790 425514 429453 431807 433094 434219 436054 439028
51574D39028M289N931P956J0136J2334J4580J6653J8163J9217K0384K1777K2844
51562F13292K3351K3896K4955K6015K6397K6497K7350K9080L0625L1130L0743
51551I13331K9725K7438K2953J6298Q432Q2q631j7331k5019l0986l5590l9498
51539H61204m2518m3887m3474m1905l9579l6373l2497k8775k5622k2416j8497
51528D85661j4324j1061r224q313p606o760n757m732l895l372l094k948k915k919
51514C98741k807k650k712k925k821k293j922k077k169j498n02l15j220k339k914
51499C67577l105l278l253k710j857j201q89o95n06m48n29m50O4Q33J310J156
51483C52019O30K21O6r2m08p41r85j176j220r75p15r92j690j862r59K50O55K88
$$ plain form
51574 439028 443317 449248 457204 467340 479674 494254 510907 529070 548287 568671 590448 613292
51562 613292 636643 660539 685494 711509 737906 764403 791753 820833 851458 882588 913331
51551 913331 943056 970494 993447 1009745 1018177 1018259 1009628 992297 967278 936292 900702 861204
51539 861204 818686 774799 731325 689420 649841 613468 580971 552196 526574 504158 485661
51528 485661 471337 460276 451052 442739 435133 428373 422616 417884 413989 410617 407523 404575 401660 398741
51514 398741 395934 393284 390572 387647 384826 382533 380611 378534 376365 374867 374365 374050 372830 370491 367577
51499 367577 364472 361194 357941 355231 353374 352173 351284 350589 350083 349635 349106 348656 348720 349553 350863 352019
51483 352019 352649 352870 352936 352844 352436 351695 350710 349534 348314 347339 346624 345632 343942 342080 341121 341371 342026 342314
51465C42314J73Q54J838K418K446K201K029K168K491K449J655N28r3R1O30R93
51449C65185J007O61J8o25q66n91O5J012K211L463M636N876P202Q103Q054P246
51433D12657O209M924K997O98r33j168k10J308K708L156K016l19k582l914m504
51418D23043m824m878m658m559m816m955m338k990j433l0J048J527J231M93n3
51403C89808n7L78R83J513J801J804J613J326J116J377K481M245N942P074P875
51388D29279Q920J0474J2399J4454J6418J8115J9565K1067K2928K5244K7958L1034
51376F57855L4431L8005M1424M4147M5618M5737M4890M3214L9934L4016K5420
51365A094691J5233M561o087j6357k5676l3665m0370m5791m9667n1893n2649n1826
$$ plain form
51465 342314 342487 343341 345179 347597 350043 352244 354273 356441 358932 361381 363036 363564 363471 363562 364192 365185
51449 365185 366192 366853 366871 366246 365380 364789 364854 365866 368077 371540 376176 382052 389254 397357 405411 412657
51433 412657 418866 423790 426787 427485 426552 425384 425174 426482 429190 432346 434362 434043 431461 427547 423043
51418 423043 418219 413341 408683 404124 399308 394353 390015 387025 385592 385562 386610 388137 389368 389861 389808
51403 389808 389751 390129 391112 392625 394426 396230 397843 399169 400285 401662 404143 408388 414330 421404 429279
51388 429279 438199 448673 461072 475526 491944 510059 529624 550691 573619 598863 626821 657855
51376 657855 692286 730291 771715 815862 861480 907217 952107 995321 1035255 1069271 1094691
51365 1094691 1109924 1114485 1108398 1092041 1066365 1032700 992330 946539 896872 844979 792330 740504
51353G40504m9041m4594l9746l5507l1650k7580k3590k0444j8098j5759j3232
51342D21263j1282j0485j0410j0213r515q404o999n456m157l464l287l108k538
51329C31945j695r92o56n36m01k05n2K0oj83m63n52k22K96N36L70P9o6O0N76J395
51308C29248J938J673J039J099K005K546J757L36k50L30J034Q63j78j487k499
51293C39454k859k563k187k472l428m161l843k610j317n66k67m6J92K56Q6nL91
51276C14055J315K415L321L894M150M142L974L780L649L693M051M603M757L923
51262C65722K269O10m47r21j024q89q34j303k195k832k999l357m381n303m918
51247C37198l178j317m82p52j469j918j699r43k29Jo3rJ18J6j59N4N64P02K41
$$ plain form
51353 740504 691463 646869 607123 571616 539966 512386 488796 468352 450254 434495 421263
51342 421263 409981 399496 389086 378873 369358 360954 353955 348499 344342 340878 337591 334483 331945
51329 331945 330250 329258 328602 328066 327665 327460 327408 327428 327422 327239 326776 326224 326002 326298 326834 327204 327283 327217 327277 327853 329248
51308 329248 331186 332859 333898 334997 337002 339548 341305 341641 341391 341721 342755 343618 343440 341953 339454
51293 339454 336595 334032 331845 329373 325945 321784 317941 315331 314014 313448 313181 313135 313327 313583 313669 313664 314055
51276 314055 315370 317785 321106 325000 329150 333292 337266 341046 344695 348388 352439 357042 361799 365722
51262 365722 367991 368601 368154 367233 366209 365320 364486 363183 360988 358156 355157 351800 347419 342116 337198
51247 337198 334020 332703 332221 331469 330000 328082 326383 325440 325211 325212 325149 325140 325258 325274 325115 325169 325733 326435 326676
51228C26676j70Q0P34J117J048Q83R23J244J865K702L352L282K357J012j30o25
51212C46350l80L32J007J288J359J708K461L153L316L136L147L423L391K682J767
51197C78140J468J957K580K593J863Q56K02K12N86O22j3q18j064q10p94j306j731
51180C84543j508r71q30j106j241r81o70o16o78n89l89k60j77RK42K05l14j050
51162C73619j466j355j093j162j579k012k277k405k305j822j164q36j019j286
51148C51838j214r24p87q20o32N1J015J649J491P41J23M3J62N6j4M02R71R84O73
51129C55808J109K467L447K969J596O43M83N72N33M47M17O48J546L007L979L617
51113C83288K560K183K797L555L939M292M736M663L650K099O25n38j200j046k75
$$ plain form
51228 326676 326506 326586 327320 328437 329485 330368 331291 332535 334400 337102 340454 343736 346093 347105 346975 346350
51212 346350 345970 346302 347309 348597 349956 351664 354125 357278 360594 363730 366877 370300 373691 376373 378140
51197 378140 379608 381565 384145 386738 388601 389457 389659 389871 390457 391079 391066 390248 389184 388374 387580 386274 384543
51180 384543 383035 382064 381234 380128 378887 377906 377236 376620 375942 375353 374964 374704 374527 374536 374778 374983 374669 373619
51162 373619 372153 370798 369705 368543 366964 364952 362675 360270 357965 356143 354979 354143 353124 351838
51148 351838 350624 349700 348913 348093 347461 347512 348527 350176 351667 352408 352531 352574 352736 352792 352778 353180 354151 355135 355808
51129 355808 356917 359384 362831 365800 367396 368039 368522 369094 369627 370074 370491 371139 372685 375692 379671 383288
51113 383288 385848 388031 390828 394383 398322 402614 407350 412013 415663 417762 418387 417849 416649 415603 415328
51098D15328K27j19q17j055q69j026j885k923l404l128k478j954j758j714j472
51083C90953q53L4Q73J418J642J744J911K134K317K466K581K450J911J280J088
51068D13949J346J608J801K280K818K529J328N89J407K952L671L551L809M768
51054D48406N536N822O413P424P607O191M215L098K837K680K769L896N937P747
51040E20578Q563Q643Q525Q348Q008P388O293M672K989J883J360P22n34k159l668
51025E81611n076o724q579j0014j0363r500p825n845l908k261j066k53M69J312
51011E11978K168K765K983K910K744K722K979L346L518L540L826M371M439L517
50997E57806K231J643J835J901J344O51L88N08Q48J590K719L631L805L576L729
$$ plain form
51098 415328 415555 415436 414619 413564 412695 411669 409784 406861 403457 400329 397851 395897 394139 392425 390953
51083 390953 390100 390134 391007 392425 394067 395811 397722 399856 402173 404639 407220 409670 411581 412861 413949
51068 413949 415295 416903 418704 420984 423802 426331 427659 428248 429655 432607 436278 439829 443638 448406
51054 448406 453942 459764 466177 473601 481208 487399 491614 494712 497549 500229 502998 506894 512831 520578
51040 520578 529141 537784 546309 554657 562665 570053 576346 581018 584007 585890 587250 587972 587438 585279 581611
51025 581611 576535 569811 561232 551218 540855 531355 523530 517685 513777 511516 510450 510197 510666 511978
51011 511978 514146 516911 519894 522804 525548 528270 531249 534595 538113 541653 545479 549850 554289 557806
50997 557806 560037 561680 563515 565416 566760 567411 567799 568307 569155 570745 573464 577095 580900 584476 588205
50982E88205M583N859P250Q648R872J0610J0713J0420J0171J0142R918Q731O292
50969G01414L178J73k602n462q213j0112j0793j0542r503p274l694M89M156O703
50955F47918Q175R019R955J1651J4099J6650J8897K1132K3663K6265K8648L0990
50943H67062L3536L6195L8868M1709M4543M6653M7732M8458M9355M9587M7739
50932A351437M3509L7755L1225K4198J7212J0987N517Q6n571j0971j5953k1136
50920A468295k6832l2301l6645l9856m2429m4369m5226m4855m3608m1852l9761
50909A030561l7466l5052l2464k9806k7541k6029k4881k3185k0527j7522j5162
50898G40926j3795j2919j1844j0361q802p563o735o110n441m670l932l397l031
$$ plain form
50982 588205 592788 598647 605897 614545 624417 635027 645740 656160 666331 676473 686391 695122 701414
50969 701414 704592 704765 702163 696701 688488 678376 667583 657041 647538 640264 636570 637059 641215 647918
50955 647918 656093 665112 675067 686718 700817 717467 736364 757496 781159 807424 836072 867062
50943 867062 900598 936793 975661 1017370 1061913 1108566 1156298 1204756 1254111 1303698 1351437
50932 1351437 1394946 1432701 1463926 1488124 1505336 1516323 1521840 1521926 1516355 1505384 1489431 1468295
50920 1468295 1441463 1409162 1372517 1332661 1290232 1245863 1200637 1155782 1112174 1070322 1030561
50909 1030561 993095 958043 925579 895773 868232 842203 817322 794137 773610 756088 740926
50898 740926 727131 714212 702368 692007 683205 675642 668907 662797 657356 652686 648754 645357 642326
50885F42326k642k192k003k368k935k782j425M86J732J782J177P00N46M74M83
50870F33359R20J870K794L057K751K734L662N180O285O403N901N547N736O261
50856F92460O674O768O803P267Q235R164R614R991J1045J2596J3516J3314J3060
50843H20507J4113J6333J8383J9632K0925K3245K6349K9189L1287L3167L5554
50832A088684L8630M2158M5964N0017N4212N8462O3020O8279P4007P9129Q2748
50821A745310Q5184Q7465Q9824R1292R0920Q8723Q5144Q0067P2947O3460N1592
50810B631928L7400K1277M220j2656k8830m4141n8165p0287q0321q8431r4450
50799B217544r7911r8763r7557r4736r0283q4261p7302p0209o3422n6994n0855
$$ plain form
50885 642326 639684 637492 635489 633121 630186 627404 625979 626465 628197 629979 631156 631856 632402 632876 633359
50870 633359 634279 636149 638943 642000 644751 647485 651147 656327 662612 669015 674916 680463 686199 692460
50856 692460 699134 705902 712705 719972 728207 737371 746985 756976 768021 780617 794133 807447 820507
50843 820507 834620 850953 869336 888968 909893 933138 959487 988676 1019963 1053130 1088684
50832 1088684 1127314 1169472 1215436 1265453 1319665 1378127 1441147 1509426 1583433 1662562 1745310
50821 1745310 1830494 1917959 2007783 2099075 2189995 2278718 2363862 2443929 2516876 2580336 2631928
50810 2631928 2669328 2690605 2694825 2682169 2653339 2609198 2551033 2480746 2400425 2311994 2217544
50799 2217544 2119633 2020870 1923313 1828577 1738294 1654033 1576731 1506522 1443100 1386106 1335251
50788A335251m4845l8817l2904k7504k2793j8535j4533j1046q466o731n392m239
50776A099446l597l902n028o211o675o373o007o297p377q945j0805j2870j4813
50763A000546j6119j6592j6538j6283j5818j5047j4158j3473j3028j2509j1650
50752H39331j0512r386q456p628o694n584m403l160j618M35K848N156O969Q184
50738H05482Q960R657J0734J2427J4403J5993J6811J7088J7297J7611J7849J7803
50726I82115J7476J6962J6282J5463J4737J4416J4435J4210J3263J1976J1333
50715A142668J1864J3088J4214J5067J6116J7799K0201K3135K6290K9339L2235
50704A362016L5269L8582M1735M4120M5655M6661M7122M6486M4277M0548L5612
$$ plain form
50788 1335251 1290406 1251589 1218685 1191181 1168388 1149853 1135320 1124274 1115808 1109077 1103685 1099446
50776 1099446 1095849 1091947 1086919 1080708 1074033 1067660 1061653 1055356 1047979 1039034 1028229 1015359 1000546
50763 1000546 984427 967835 951297 935014 919196 904149 889991 876518 863490 850981 839331
50752 839331 828819 819433 810977 803349 796655 791071 786668 783508 781890 782325 785173 790329 797298 805482
50738 805482 814442 824099 834833 847260 861663 877656 894467 911555 928852 946463 964312 982115
50726 982115 999591 1016553 1032835 1048298 1063035 1077451 1091886 1106096 1119359 1131335 1142668
50715 1142668 1154532 1167620 1181834 1196901 1213017 1230816 1251017 1274152 1300442 1329781 1362016
50704 1362016 1397285 1435867 1477602 1521722 1567377 1614038 1661160 1707646 1751923 1792471 1828083
50693A828083K9571K2269J3565L591o945j6799k4845l0845l5337l8754m0896m1339
50681A661319m0040l7430l4158l0945k8399k6685k5476k4310k2899k1038j8461
50670A351478j5055j1105p135l452k4L199O027Q259J0070J1908J3836J5151J5106
50657A398263J3986J3079J3335J4419J5373J5781J5877J5834J5645J5613J6291
50646A563496J7787J9581K1219K2747K4386K6196K8250L0676L3294L5602L7375
50635A860609L8873M0199M0773L9913L7638L4538L1020K7156K3115J9278J5820
50624B208932J2584R552P116N630M688L067m20o018j2845j9580k5214k9170l0995
50611B127327l0342k7287k2493j6941j1593p240m367l082l325n227q991j4374
$$ plain form
50693 1828083 1857654 1879923 1893488 1897079 1890134 1873335 1848490 1817645 1782308 1743554 1702658 1661319
50681 1661319 1621279 1583849 1549691 1518746 1490347 1463662 1438186 1413876 1390977 1369939 1351478
50670 1351478 1336423 1325318 1318183 1314731 1314707 1317906 1323933 1332192 1342262 1354170 1368006 1383157 1398263
50657 1398263 1412249 1425328 1438663 1453082 1468455 1484236 1500113 1515947 1531592 1547205 1563496
50646 1563496 1581283 1600864 1622083 1644830 1669216 1695412 1723662 1754338 1787632 1823234 1860609
50635 1860609 1899482 1939681 1980454 2020367 2058005 2092543 2123563 2150719 2173834 2193112 2208932
50624 2208932 2221516 2231068 2238184 2243814 2248502 2251569 2251149 2245131 2232286 2212706 2187492 2158322 2127327
50611 2127327 2096985 2069698 2047205 2030264 2018671 2011431 2007064 2003982 2000657 1995430 1986439 1972065
50599A972065k0623k7117l3827m0902m7927n3871n7774n9350n9031n7562n5470
50588A458611n2807m9391m5282m0925l6743l2769k8828k4903k1108j7411j3629
50577A094815r750o043k761J52K984N866Q542J0589J1838J2547J3046J3328J3042
50564A168195J1986J0490R231Q612Q354P780O668N672N673O718Q089R494J1674
50551A278636J5263J9527K2947K5024K6749K9074L1593L3106L3063L2021L0914
50540A577917L0320L0298L0701L1587L3354L6328M0274M4643M9301N4582O0462
50529B019767O6199P1187P5759Q0622Q5761R0468R4363R7774J00943J03277J03736
50518B989856J01762R7641R2027Q5208P6822O6302N3522L9048K3670P856q266
$$ plain form
50599 1972065 1951442 1924325 1890498 1849596 1801669 1747798 1690024 1630674 1571643 1514081 1458611
50588 1458611 1405804 1356413 1311131 1270206 1233463 1200694 1171866 1146963 1125855 1108444 1094815
50577 1094815 1085065 1079022 1076261 1076413 1079397 1085263 1093805 1104394 1116232 1128779 1141825 1155153 1168195
50564 1168195 1180181 1190671 1199902 1208514 1216868 1224648 1231316 1236988 1242661 1249379 1257468 1266962 1278636
50551 1278636 1293899 1313426 1336373 1361397 1388146 1417220 1448813 1481919 1514982 1547003 1577917
50540 1577917 1608237 1638535 1669236 1700823 1734177 1770505 1810779 1855422 1904723 1959305 2019767
50529 2019767 2085966 2157153 2232912 2313534 2399295 2489763 2584126 2681900 2782843 2886120 2989856
50518 2989856 3091618 3189259 3281286 3366494 3443316 3509618 3563140 3602188 3625858 3633714 3625448
50507C625448k4438l9981n3995o5864p5480q2927q7923q9802q8210q3614p6810
50496B856404o8057n7136m4265l0459j6871m261O695J5207K0846K3790K4085K0975
50484B746953J3573J996j2624k8984m5937o2182p6452q8113r7063j03016j05446
50473B142705j04406j00856r5889r0068q3724p7340p1305o5633o0307n5472n0968
50462A286737m6111m0522l4869l0158k6459k2956j9145j5331j1901q821o069l924
50450A020471k475j341k50O35J442L027N875Q895J0318R890R272R983J1707J3080
50436A100529J3407J2973J2220J1446J1066J1330J1748J1532J0675J0041J0171
50425A227138J0645J0883J1074J1817J3291J5196J7284J9487K1642K3641K5841
$$ plain form
50507 3625448 3601010 3561029 3507034 3441170 3365690 3282763 3194840 3105038 3016828 2933214 2856404
50496 2856404 2788347 2731211 2686946 2656487 2639616 2635355 2642050 2657257 2678103 2701893 2725978 2746953
50484 2746953 2760526 2762522 2749898 2720914 2674977 2612795 2536343 2448230 2351167 2248151 2142705
50473 2142705 2038299 1937443 1841554 1751486 1667762 1590422 1519117 1453484 1393177 1337705 1286737
50462 1286737 1240626 1200104 1165235 1135077 1108618 1085662 1066517 1051186 1039285 1030464 1024395 1020471
50450 1020471 1017996 1016655 1016405 1017040 1018482 1021509 1027384 1036279 1046597 1056487 1065759 1075742 1087449 1100529
50436 1100529 1113936 1126909 1139129 1150575 1161641 1172971 1184719 1196251 1206926 1216967 1227138
50425 1227138 1237783 1248666 1259740 1271557 1284848 1300044 1317328 1336815 1358457 1382098 1407939
50414A407939K8850L2775L6957M0738M4160M7737N1598N5144N7573N8550N8399
50403A920420N7725N6836N5388N2598M7943M1737L4767K7409J9393J0533J246
50392B325995q078j7747k8088l8360m7212n4285o0364o5547o8316o7239o2894
50381A807865n7179n1111m4358l6653k8520k0553j3008o345j262K176M676O598
50369A562326P302O008K655k469r273j7355k5546l2611l8181m2497m5592m7288
50357A317479m7734m7231m5722m3000l9440l5951l3066l0517k7764k4691k1670
50346I20693j9202j7511j6275j4818j2771j0580r061q452q084p085n318l560k743
50333G85233k994l479l283k347j335p17l43Q5N82J087J669K296K727K922L268
$$ plain form
50414 1407939 1436789 1469564 1506521 1547259 1591419 1639156 1690754 1745898 1803471 1862021 1920420
50403 1920420 1978145 2034981 2090369 2142967 2190910 2232647 2267414 2294823 2314216 2324749 2325995
50392 2325995 2317917 2300170 2272082 2233722 2186510 2132225 2071861 2006314 1937998 1870759 1807865
50381 1807865 1750686 1699575 1655217 1618564 1590044 1569491 1556483 1550138 1548876 1551052 1555728 1562326
50369 1562326 1569628 1575636 1578291 1575822 1566549 1549194 1523648 1491037 1452856 1410359 1364767 1317479
50357 1317479 1269745 1222514 1176792 1133792 1094352 1058401 1025335 994818 967054 942363 920693
50346 920693 901491 883980 867705 852887 840116 829536 820475 812023 803939 796854 791536 787976 785233
50333 785233 782239 778760 775477 773130 771795 771078 770735 770820 771402 772489 774158 776454 779181 782103 785371
50318G85371M114N314O440P229P566P401O876O366O102O052O226O750P470Q006
50304H77283Q374R035J0023J0739J0971J1393J2398J3231J3169J2909J3632J5133
50292A018290J6057J5868J5310J4860J4045J2546J0829R169P163M876L544M088
50280A146645N448N302K204l580j0865j8216k4009k6883k6657k4397k1298j7760
50268I85934j3725r476n635k496J90K612M402N102M914M568M362L891K990K398
50254I90031K960M409N564N668N029M330L835L408K797J777L09j276k560l500
50240A022781m296m885n053n027n327n935o196n771n052m414l688k810k283k391
50226I59653k521j929q75j99m4J64N59N85N7l07J19R01J086M18m93r91r17m33
$$ plain form
50318 785371 789485 794799 801239 808468 816034 823435 830311 836677 842779 848831 855057 861807 869277 877283
50304 877283 885657 894692 904715 915454 926425 937818 950216 963447 976616 989525 1003157 1018290
50292 1018290 1034347 1050215 1065525 1080385 1094430 1106976 1117805 1126974 1134137 1139013 1142557 1146645
50280 1146645 1152093 1157395 1159599 1156019 1145154 1126938 1102929 1076046 1049389 1024992 1003694 985934
50268 985934 972209 962733 957098 954602 954792 957404 961806 966908 971822 976390 980752 984643 987633 990031
50254 990031 992991 997400 1002964 1008632 1013661 1017991 1021826 1025234 1028031 1029808 1030117 1028841 1026281 1022781
50240 1022781 1018485 1013600 1008547 1003520 998193 992258 986062 980291 975239 970825 967137 964327 962044 959653
50226 959653 957132 955203 954328 954129 954085 954249 954808 955393 955450 955143 955262 956163 957249 957667 957174 956183 955266 954833
50208I54833J94N43K31n19p53K94K267L956M536M197L483K498J138k08q14m86
50192I75390K15O90Q51P50J66j044k442l401l919m727o406q720j0935j2552j3547
50177I10369j3973j3735j2781j1367r857q356o745n039l470k188j185n67o48j548
50163H18910l000m742o810r040j0641j0820r755q374p219o105m951m240m194m039
50149G24980k783n45J368J787Q39l66r37j016j377k416l661m383m441m287m229
50134F98533m091l667l112k591j887o38J029K428K930K586K110K201K814L192
50120G01837K723J744J173J421J948K071J836J835K331K965L353L650M252N126
50106G38265N796O066O416P341Q482R009Q811Q768R508J0531J0977J0777J0448
$$ plain form
50208 954833 955027 955570 955801 955282 954529 954823 957090 961046 965582 969779 973262 975760 976898 976690 975876 975390
50192 975390 975605 976295 977146 977896 978062 977018 974576 971175 967256 962529 956123 947403 936468 923916 910369
50177 910369 896396 882661 869880 858513 848656 840300 833555 828516 825046 822858 821673 821106 820458 818910
50163 818910 815910 811168 804358 795318 784677 773857 764102 755728 748509 742404 737453 733213 729019 724980
50149 724980 722197 721652 723020 724807 725646 725280 724343 723327 721950 719534 715873 711490 707049 702762 698533
50134 698533 694442 690775 687663 685072 683185 682547 683576 686004 688934 691520 693630 695831 698645 701837
50120 701837 704560 706304 707477 708898 710846 712917 714753 716588 718919 721884 725237 728887 733139 738265
50106 738265 744061 750127 756543 763884 772366 781375 790186 798954 808462 818993 829970 840747 851195
50093H51195J0142R709R436R916J1157J2581J3895J5315J6820J8058J9106K0471
50081A017801K1958K2367K0934J8410J6175J4755J3864J3379J3484J4020J4388
50070A201535J4114J3078J1258Q639N388J779j877n184p766r699j1469j3271j4672
50057A191853j5326j5515j5564j5193j4073j2649j1653j1038j0211r198q734r024
50045A043675r289q875q205q119q635q936q393p242o159n401m537l059j113N14
50031I56226J286J515J983L097M637O056O847O858O503O409O559O107M537K645
50017A021265J705J842J956J317M12j06n78j911m312p005r085j0273j0900j1446
50003I72881j2117j2737j2976j2676j1859j0527q672o463m256k277n55Q25J544
$$ plain form
50093 851195 861337 871046 880482 890398 901555 914136 928031 943346 960166 978224 997330 1017801
50081 1017801 1039759 1062126 1083060 1101470 1117645 1132400 1146264 1159643 1173127 1187147 1201535
50070 1201535 1215649 1228727 1239985 1248624 1254012 1255791 1253914 1248730 1240964 1231265 1219796 1206525 1191853
50057 1191853 1176527 1161012 1145448 1130255 1116182 1103533 1091880 1080842 1070631 1061433 1052699 1043675
50045 1043675 1034386 1025511 1017306 1009187 1000552 991616 983223 975981 969822 964421 959884 956825 955712 956226
50031 956226 957512 959027 961010 964107 968744 974800 981647 988505 995008 1001417 1007976 1014083 1018620 1021265
50017 1021265 1022970 1024812 1026768 1028085 1028497 1028391 1027813 1025902 1021590 1014585 1005500 995227 984327 972881
50003 972881 960764 948027 935051 922375 910516 899989 891317 884854 880598 878321 877766 878591 880135
49990H80135J374N23m38j056j363j813k737l903m767n197n654o487p389p920q224
49975H25084q652q833p938n933l823k375j177N04K538M220N429O777Q606J0467
49961H24894J1758J2378J2582J2497J2142J1690J1429J1456J1673J2016J2532
49950I57047J3154J3597J3472J2429J0193O687K254k441o938j1191j5137j8267
49938I74859k0080k0804k1179k1521k1548k1185k0934k1128k1364k1162k0719
49927G43235k0426k0002j8795j6736j4333j1828r181o842n604n444n186l847j834
49914F03177k48N86J345K579L979M811M819M435M281M525M887N198N754O872Q302
49899F65302R497J0399J1438J2597J3121J2450J1006R557Q130O191L668J156r45
$$ plain form
49990 880135 881509 882032 881594 880538 879175 877362 874625 870722 865955 860758 855104 848617 841228 833308 825084
49975 825084 816432 807599 799661 793728 789905 787530 786353 786857 789395 793615 799044 805821 814427 824894
49961 824894 836652 849030 861612 874109 886251 897941 909370 920826 932499 944515 957047
49950 957047 970201 983798 997270 1009699 1019892 1026579 1028833 1026392 1019454 1008263 993126 974859
49938 974859 954779 933975 912796 891275 869727 848542 827608 806480 785116 763954 743235
49927 743235 722809 702807 684012 667276 652943 641115 631934 625092 619488 614044 608858 605011 603177
49914 603177 602929 603515 604860 607439 611418 616229 621048 625483 629764 634289 639176 644374 650128 657000 665302
49899 665302 674799 685198 696636 709233 722354 734804 745810 755367 763497 769688 773356 774512 773567
49886G73567k944n240p666r758j1388j2757j3876j4426j4209j3471j2635j1896
49874F43301j1191j0452r651q669p344n774m345l329k563j737q69k43Q3M52J267
49859E78936K603M208N714O826P475P925Q578R616J0836J1872J2422J2308J1486
49846F90805J0104Q453O713M854K831P95r40k188l062l886m933o215p541q767
49832F87023r843j0565j0497r422p754o212n060l946k571j199k72K10O51J329
49818F21872K253L497N247P363R163J0045J0222J0495J1169J1571J0842Q994O842
49805G29575N058L669K437J279K10p40j486k056k838m228n875o803o633o211o601
49790F98757p752q697q802q308p781p479p300o926o081m863l691k728j691n20
$$ plain form
49886 773567 770623 765383 757717 747959 736571 723814 709938 695512 681303 667832 655197 643301
49874 643301 632110 621658 612007 603338 595994 590220 585875 582546 579983 578246 577377 577134 577217 577669 578936
49859 578936 581539 585747 591461 598287 605762 613687 622265 631881 642717 654589 667011 679319 690805
49846 690805 700909 709362 716075 720929 723760 724555 723615 721427 718365 714479 709546 703331 695790 687023
49832 687023 677180 666615 656118 646696 638942 632730 627670 623724 621153 619954 619682 619892 620543 621872
49818 621872 624125 627622 632869 640232 649395 659440 669662 680157 691326 702897 713739 722733 729575
49805 729575 734633 738302 740739 742018 742228 741488 740002 737946 735108 730880 725005 718202 711569 705358 698757
49790 698757 691005 682308 673506 665198 657417 649938 642638 635712 629631 624768 621077 618349 616658 616138
49776F16138K19J53p9L82J330J857J851K170L206M295M880N379O364P525Q021
49761F63691P472O126M439K803J430K17j003j976k241k044k417m012o289q243
49747F57953r488j0240j0651j0659j0206r225p706n961m541l574k626j476n31
49734E71069j59j48k13m03n55M9J760L826N255O002O563O867O531N842N542N759
$$ plain form
49776 616138 616357 616510 616431 616813 618143 620000 621851 624021 627227 631522 636402 641781 648145 655670 663691
49761 663691 671163 677289 681728 684531 685961 686178 685175 683199 680958 678914 676497 672485 666196 657953
49747 657953 648465 638225 627574 616915 606709 597484 589778 583817 579276 575702 573076 571600 571069
49734 571069 570910 570762 570549 570146 569591 569640 571400 575226 580481 586483 593046 599913 606444 612286 617828 623587
$$ [...]
##END NTUPLES=NMR SPECTRUM
##END=
