##TITLE=AC1668_DOMRH14359_8570861_kikC9f9SbG
##JCAMPDX= 6.0         $$ Bruker NMR JCAMP-DX V2.0
##DATA TYPE= NMR SPECTRUM
##DATA CLASS= NTUPLES
##ORIGIN= BRUKER
##OWNER= Administrator
$$ 1.72 TOPSPIN		Version 2.1
$$ 2014-04-11 16:14:57.902 -0700  Administrator@X
$$ Compression mode = diff/dup
##.OBSERVE FREQUENCY= 400.02188249412
##.OBSERVE NUCLEUS= ^1H
##.ACQUISITION MODE= SIMULTANEOUS (DQD)
##.ACQUISITION SCHEME= undefined
##.AVERAGES= 8
##.DIGITISER RES= 22
##SPECTROMETER/DATA SYSTEM= spect
##.PULSE SEQUENCE= zg30
##.SOLVENT NAME= COFFEE_meoh
##.SHIFT REFERENCE= INTERNAL, COFFEE_meoh, 1, 14.98509
##AUDIT TRAIL= $$ (NUMBER, WHEN, WHO, WHERE, PROCESS, VERSION, WHAT)
$$ ##TITLE= Audit trail, TOPSPIN		Version 2.1
$$ ##JCAMPDX= 5.01
$$ ##ORIGIN= Bruker BioSpin GmbH
$$ ##OWNER= Administrator
$$ $$ E:\/data/COFFEE/nmr/AC1668_DOMRH14359_8570861_kikC9f9SbG/10/pdata/1/auditp.txt
$$ ##AUDIT TRAIL=  $$ (NUMBER, WHEN, WHO, WHERE, PROCESS, VERSION, WHAT)
(   1,<2014-04-11 16:14:50.949 -0700>,<Administrator>,<X>,<go>,<TOPSPIN 2.1>,
      <created by zg
	started at 2014-04-11 16:13:45.308 -0700,
	POWCHK enabled, PULCHK disabled,
       configuration hash MD5:
       C8 4E 4E 5D D3 5C D8 9E 9F 52 82 E0 59 8A DE 15
       data hash MD5: 64K
       46 56 F1 3E 03 15 6D 6E 39 59 2B 12 73 CF 01 DD>)
(   2,<2014-04-11 16:14:54.011 -0700>,<Administrator>,<X>,<proc1d>,<TOPSPIN 2.1>,
      <Start of raw data processing
       efp LB = 0 FT_mod = 6 PKNL = 1 PHC0 = 0 PHC1 = 0 SI = 32K 
       data hash MD5: 32K
       86 CD D0 0B FA 81 A5 4A 84 CB 2C CB EC 81 6C CC>)
(   3,<2014-04-11 16:14:54.324 -0700>,<Administrator>,<X>,<proc1d>,<TOPSPIN 2.1>,
      <pk PHC0 = 94.87793 PHC1 = 0 
       data hash MD5: 32K
       87 B3 CB 88 F6 60 A6 C0 DA BC 9A 51 C0 B6 74 DB>)
(   4,<2014-04-11 16:14:54.418 -0700>,<Administrator>,<X>,<proc1d>,<TOPSPIN 2.1>,
      <abs ABSG = 1 
       data hash MD5: 32K
       A1 E2 12 79 F8 ED 09 02 9A C7 F5 AD 09 30 3F 11>)
(   5,<2014-04-11 16:14:54.496 -0700>,<Administrator>,<X>,<proc1d>,<TOPSPIN 2.1>,
      <abs ABSG = 2 
       data hash MD5: 32K
       94 01 82 2B 25 2C C9 9A 9E 2E 6C DB B6 1F 59 BA>)
(   6,<2014-04-11 16:14:54.574 -0700>,<Administrator>,<X>,<proc1d>,<TOPSPIN 2.1>,
      <abs ABSG = 3 
       data hash MD5: 32K
       81 A8 CA F2 00 9C E7 61 89 C5 BC 56 34 97 57 75>)
(   7,<2014-04-11 16:14:54.636 -0700>,<Administrator>,<X>,<proc1d>,<TOPSPIN 2.1>,
      <abs ABSG = 4 
       data hash MD5: 32K
       D9 B7 9C DA 01 DF 4E B9 B4 0B 7B 11 04 14 60 35>)
(   8,<2014-04-11 16:14:54.699 -0700>,<Administrator>,<X>,<proc1d>,<TOPSPIN 2.1>,
      <abs ABSG = 5 
       data hash MD5: 32K
       FD A6 65 3D DA E2 E8 7F 6E 36 40 A8 E6 91 73 9E>)
$$ ##END=
$$ 
$$ $$ hash MD5
$$ $$ 67 49 5F 7E CD 67 55 39 17 91 EA C8 2F AA 22 33
##$RELAX= 
##$RELAX= 
##$RELAX= 
##$RELAX= 
##$RELAX= 
##$RELAX= 
##$RELAX= 
$$ Bruker specific parameters
$$ --------------------------
##$DU= <E:\>
##$EXPNO= 10
##$NAME= <AC1668_DOMRH14359_8570861_kikC9f9SbG>
$$ [...]
##$TP= (0..7)
150 150 150 150 150 150 150 150
##$TP07= 0
##$TPNAME0= <>
##$TPNAME1= <>
##$TPNAME2= <>
##$TPNAME3= <>
##$TPNAME4= <>
##$TPNAME5= <>
##$TPNAME6= <>
##$TPNAME7= <>
##$TPOAL= (0..7)
0.5 0.5 0.5 0.5 0.5 0.5 0.5 0.5
##$TPOFFS= (0..7)
0 0 0 0 0 0 0 0
##$TUNHIN= 0
##$TUNHOUT= 0
##$TUNXOUT= 0
##$USERA1= <user>
##$USERA2= <user>
##$USERA3= <user>
##$USERA4= <user>
##$USERA5= <user>
##$V9= 5
##$VALIST= <valist>
##$VCLIST= <CCCCCCCCCCCCCCC>
##$VD= 0
##$VDLIST= <DDDDDDDDDDDDDDD>
##$VPLIST= <PPPPPPPPPPPPPPP>
##$VTLIST= <TTTTTTTTTTTTTTT>
##$WBST= 1024
##$WBSW= 4
##$XGAIN= (0..3)
0 0 0 0
##$XL= 0
##$YL= 0
##$YMAX_a= 640530
##$YMIN_a= -542212
##$ZGOPTNS= <>
##$ZL1= 120
##$ZL2= 120
##$ZL3= 120
##$ZL4= 120
##$ABSF1= 14.98509
##$ABSF2= -5.573092
##$ABSG= 5
##$ABSL= 3
##$ALPHA= 0
##$AQORDER= 0
##$ASSFAC= 0
##$ASSFACI= 0
##$ASSFACX= 0
##$ASSWID= 0
##$AUNMP= <proc_prof1d_extract_pilot.lims>
##$AXLEFT= 0
##$AXNAME= <>
##$AXNUC= <1H>
##$AXRIGHT= 0
##$AXTYPE= 0
##$AXUNIT= <>
##$AZFE= 0.1
##$AZFW= 0.1
##$BCFW= 0
##$BC_mod= 0
##$BYTORDP= 0
##$COROFFS= 0
##$CY= 15
##$DATMOD= 1
##$DC= 0
##$DFILT= <>
##$DTYPP= 0
##$F1P= 0
##$F2P= 0
##$FCOR= 0.5
##$FTSIZE= 32768
##$FT_mod= 6
##$GAMMA= 0
##$GB= 0
##$INTBC= 1
##$INTSCL= 1
##$ISEN= 128
##$LB= 0
##$LEV0= 0
##$LPBIN= 0
##$MAXI= 10000
##$MC2= 0
##$MEAN= 0
##$ME_mod= 0
##$MI= 0
##$NCOEF= 0
##$NC_proc= -8
##$NLEV= 6
##$NOISF1= 0
##$NOISF2= 0
##$NSP= 0
##$NTH_PI= 0
##$NZP= 0
##$OFFSET= 14.98509
##$PC= 1
##$PHC0= 94.87793
##$PHC1= 0
##$PH_mod= 1
##$PKNL= yes
##$PPARMOD= 0
##$PPDIAG= 0
##$PPIPTYP= 0
##$PPMPNUM= 2147483647
##$PPRESOL= 1
##$PSCAL= 4
##$PSIGN= 0
##$PYNMP= <proc.py>
##$REVERSE= no
##$SF= 400.02
##$SI= 32768
##$SIGF1= 0
##$SIGF2= 0
##$SINO= 400
##$SIOLD= 32768
##$SPECTYP= <>
##$SREGLST= <1H.CDCl3>
##$SSB= 0
##$STSI= 32768
##$STSR= 0
##$SW_p= 8223.68421052631
##$SYMM= 0
##$S_DEV= 0
##$TDeff= 65536
##$TDoff= 0
##$TI= <>
##$TILT= no
##$TM1= 0
##$TM2= 0
##$TOPLEV= 0
##$USERP1= <user>
##$USERP2= <user>
##$USERP3= <user>
##$USERP4= <user>
##$USERP5= <user>
##$WDW= 1
##$XDIM= 32768
##$YMAX_p= 453800105
##$YMIN_p= -789163
##$CURPLOT= <Network HP LaserJet P1505>
##$CURPRIN= <$Network HP LaserJet P1505>
##$DFORMAT= <normdp>
##$LAYOUT= <+/1D_H.xwp>
##$LFORMAT= <normlp>
##$PFORMAT= <normpl>
##$SURQMSG= 1
$$ End of Bruker specific parameters
$$ ---------------------------------
##NTUPLES= NMR SPECTRUM
##VAR_NAME=  FREQUENCY,     SPECTRUM/REAL,   SPECTRUM/IMAG
##SYMBOL=    X,             R,               I
##VAR_TYPE=  INDEPENDENT,   DEPENDENT,       DEPENDENT
##VAR_FORM=  AFFN,          ASDF,            ASDF
##VAR_DIM=   32768,         32768,           32768
##UNITS=     HZ,            ARBITRARY UNITS, ARBITRARY UNITS
##FACTOR=    0.250966925370066, 1,           1
##FIRST=     8223.43324360094, -351950,      -52285
##LAST=      0,             36513,           8605
##MIN=       0,             -789163,         0
##MAX=       8223.43324360094, 453800105,    0
$$ Real data points
##PAGE= N=1
##DATA TABLE= (X++(R..R)), XYDATA
$$ [...]
23826 -72399 113034 -135427 -80599 95429 180590 30142 -11312 134122 66632 -58521 -229000
23815 -229000 -24164 -285082 261155 -309293 -30923 -294267 -36938 -99156 247459 304353
23805 304353 -182931 15943 -59997 163733 -202532 170004 77429 -284769 -171533 -105493
23795 -105493 212468 244925 -165112 -31543 -234238 -231102 -482487 186400 -9389 159865 -431596
23783 -122845 65272 50033 289985 -152490 34013 -94145 109401 86616 123672 -95404 62595
23771 -28952 -294537 -172515 238231 269053 -111447 121662 382787 77145 290103 57108
23760 -245996 -63075 -92828 102414 87466 -171431 59812 79282 -81894 -122972 -399696 431968
23748 -73899 -29792 166627 -312241 -162722 209481 -75610 65370 208556 -315936 -187894
23738 -187894 -262824 85283 17435 207457 -14940 -271270 -33490 -192020 -151496 -151289 -73564
23726 -4848 -254637 16253 147533 91599 240167 -20874 59044 -143863 -78310 4048 -184827
23714 -181495 78922 44167 -129304 106134 -1179 -313477 -95313 -90721 -228843 125238 -25015
23702 -167391 -171865 145928 -493288 138726 -129382 317389 -160487 -114709 32639 -150437
23691 -12387 79375 -66995 -9768 -425868 216334 313499 144222 -315596 -399222 -31709 -2486
23679 -113055 15420 -56065 49185 -3642 2021 -315273 24187 -229222 -406703 -106281 -122000
23668 -122000 -50592 -381517 201954 -86831 -163549 47615 -6927 -174998 -143723 -73803 -9980
23656 25456 117526 -126380 -156290 35353 -178862 -69818 -53475 -90721 327078 8981 -303793
23644 51702 193620 -14726 -102897 20594 -182784 134682 -12096 -41128 97667 16871 -231448
23632 251543 -126814 11840 -86410 -123683 -64074 443408 -187332 -269215 27764 -356347 -139461
23620 99293 112886 -239469 -181691 52892 -237920 160777 -61373 41826 170814 56312 291897
23609 291897 -3853 93258 -54142 137027 109727 40918 363693 -35219 -220241 -218361 -272527
23598 -272527 156994 -1993 14125 13344 -72695 -105554 228889 130276 -139618 -183654 -217572
23587 -217572 170327 158147 148578 -291223 193901 347018 182192 -218831 -81763 37667
23576 -114393 -171370 15974 197148 -40226 -143377 184450 -189900 -125603 -185948 83258 -216316
23564 73606 -286997 -6440 -165168 181837 76704 -323852 -151747 -55135 -127991 -257603 -140509
23553 -140509 203936 261880 -279492 -371825 -81197 -64874 249612 -95371 -63233 -250815 156827
23541 -219532 -41282 101845 -424356 -138762 18586 79643 427407 -199089 -85411 -246660
23531 -246660 63773 -89439 -57569 -212125 -47815 33635 -167870 -19343 -175459 -84938 -242762
23520 -242762 -57307 -135396 164218 -250214 50801 188915 173546 -179669 64130 -150645
23509 -143581 -75792 273888 317017 222912 311833 -29461 -44223 38720 178740 -347958 -79372
23497 239477 71028 -205169 100091 106121 199489 -148856 -64591 229032 -228403 -248464 43497
23485 -33683 188422 -143244 -213519 104336 291915 59084 -478782 79472 -209840 -375477
23475 -375477 85211 -33345 148835 -48750 -245459 -205 -164854 45834 -59472 -119115 -248673
23464 -248673 135342 -117490 -15466 224137 -62882 -71564 -224087 -94387 235526 -63315 508711
23452 210945 -78527 128528 25464 28524 133328 -122248 -192569 -86677 -6357 -224226 21619
23440 -203760 106625 -112011 211534 -50826 -32353 -297123 -337913 -185877 508 -323330 -277396
23429 -277396 68110 10491 28406 96298 -5307 -145247 -160543 -82815 -42150 482924 -163158
23417 -29418 -200958 28537 -229710 -53954 192951 69920 227894 -128546 -157190 69921 -126701
23405 -73730 -343603 301044 29391 -218328 407191 -33654 -321296 133230 -108382 162632
23394 55651 -191214 158940 47463 21764 -161640 224963 -79267 -180633 -295331 -26909
23383 -281762 129775 77175 -4272 -228347 -294680 200434 -286942 -94291 121291 109501 92489
23372 92489 -5457 28701 57816 186738 23867 189275 375453 -46774 -83736 -63823 -135071
23361 -135071 -5838 211554 -59794 123905 285724 130343 -191071 20023 62218 42110 -151768
23349 -398730 -257024 -515902 15474 -17675 518817 -54084 48569 -35481 -50399 89225 -367391
23337 -23446 -354824 57430 -179646 169737 129591 -141385 176956 -466283 -304163 64434
23326 -37045 -15678 -190025 -406295 99425 -64810 46453 -183428 -220590 -287226 -378969 -148149
23314 87791 158070 45017 -171261 219074 -89296 184611 192231 -43681 34766 30870 -81060
23302 292222 -245148 199513 -142189 -111222 -5302 -120114 15987 -250026 -120469 150400
23291 64533 19414 258125 370048 -314202 -323711 -101966 -55820 213518 -103439 -87701 278338
23279 21371 189623 176568 182690 -147125 -27495 94236 -88551 262529 -254762 -40748 -218858
23268 -218858 -242833 47355 243117 -17514 78341 50756 44849 206324 -238796 -44188 -359912
23257 -359912 51481 299558 -72396 130122 -161968 5599 8709 231697 -272713 -285391 129640
23245 277743 98402 -445217 -38860 -86701 -155958 187580 -158695 131728 116450 -3201 -140142
23234 -140142 -295928 -323261 -298726 -294919 73483 -6563 -351673 -70348 -147804 -32438 -48177
23223 -48177 -44292 -53348 -25593 202335 115294 -81539 5241 -182773 228688 -75110 -96943 211251
23210 -316654 126902 94662 118126 -49488 -93200 67707 101080 -79186 -128981 -41701 -11373
23198 213280 102812 -284619 -198566 -156176 -80856 110875 95689 -48690 203876 76498 -145906
23186 -85407 -7646 -187782 -324027 -55017 -221852 52523 33817 149181 -253119 135970 -196229
23174 142514 -98919 364811 -385265 202146 32198 15243 86351 70690 -46660 2742 -197251
23162 -271767 -160346 70128 -1383 -259687 10133 102700 -126371 -308055 -111374 50403 -214175
23150 354112 336533 229812 73370 13455 -90906 254554 -124828 -87765 -80542 -118562 51275
23138 322080 280782 -298963 -221859 -254503 -123347 -40943 -162568 -9514 -182759 -108817 23305
23126 -68187 -55428 165712 -122 -186695 34819 342321 -3562 299116 40805 239704 -24986
23114 -223401 -264985 -144916 -377290 -405371 -230653 -13253 -198786 -264553 8612 187668 -72900
23102 -169125 -65388 -32367 79708 -229867 36480 156607 -375641 -51444 -21924 153746 239714
23091 239714 -43023 39298 12746 -212694 138332 -63018 254451 121580 -142267 300416
23080 -118034 129331 -89787 -25754 74879 -292290 -244062 12672 182920 -163789 -177271 241547
23068 15422 4853 122214 35351 36446 87925 -22163 -370505 -9753 51308 162277 217457 21910
23055 -31713 183925 19653 209317 -52482 -63574 85276 7325 -176646 -56046 86450 317204
23044 317204 187324 236193 -182282 1601 80909 -173945 -83095 33536 177449 17610 -130254
23032 -108330 165274 31303 -369167 95717 34186 -174696 -26473 164632 -157595 -9096 -238226
23021 -238226 70546 99280 -159704 242092 190052 -337687 91916 923 291025 97546 107804
23010 107804 222176 -22752 -24832 79887 34993 9463 49179 -160132 82950 36589 164164
22999 164164 153964 -66832 64350 42061 -48367 -13761 193529 -418245 -174842 -30389 -220411
22988 -220411 65053 2144 -151034 338565 -19267 -45081 -49778 -118597 -85455 -26405 92739
22976 -29748 -218737 -38582 109544 -270912 -293777 -85106 -250188 17432 61323 -119547 -186930
22965 -186930 -123571 -15304 -16696 -145775 -127071 -62272 -128069 27550 -188093 -71458 2746
22953 98642 -282591 -95998 80804 -185472 280141 -239570 -60144 -146690 109805 184265 -208911
22941 -436989 161357 30313 130108 -83549 183634 -71596 -133820 -18064 -112573 -97338 156020
22929 -165934 -64998 -86766 85258 145478 -37904 125626 -129872 21056 -11610 -143629 168658
22917 -57071 -292538 -171451 -112813 64801 -99002 -12160 -87900 -122875 361011 -22367 -168761
22906 -168761 -178687 65252 55522 -178981 -203418 -246272 -53474 229800 -201337 -74392 -154277
22895 -154277 58247 -233715 -168627 86304 -7027 -13863 167481 -130319 38954 201 -21916 144726
22882 -192908 -167508 -162257 -82961 -19144 -103552 -124424 275680 -104907 82936 -254955 -29601
22870 109806 51228 -5280 -71138 21628 -14695 188855 323062 179744 34419 -136094 -113042
22859 -113042 -271051 -34329 -214542 -215115 102757 -63963 99756 -70412 85716 96507 -113787
22847 -191364 -116086 -69599 -263922 120421 56943 -169519 -401338 86229 -394740 -119870
22836 -158501 -68347 14004 67014 303364 -433867 247670 137565 -29415 -97100 -120170 -121872
22825 -121872 -20268 -82300 -172511 -57249 376525 -187377 98147 -340696 120285 4953 -258810
22813 26160 -53079 163610 -136279 -7916 112605 -168894 93622 -82057 71601 217863 102520
22801 -313331 -9131 136196 -215136 155467 -371169 -211270 -269059 -76170 -45995 169425
22790 227240 83844 28148 157183 -257139 179524 83544 -143650 -100792 -199580 -16630 91379
22778 237988 -110032 143505 -170808 304517 -39025 230877 -233212 29218 63242 -47196
22767 -90098 -214787 341196 76066 -218885 182559 470129 -9799 31176 384397 198707
22757 198707 -83044 -224149 -35567 -52244 -64667 -288562 35770 -211775 -320127 -126367
22746 93606 -244152 -102974 -131516 63563 5785 -4235 -201437 -191771 -264833 18537 -362465
22734 157056 -255548 -63002 -151373 -33893 -196192 119418 -296135 63252 118313 -161432
22723 -104209 -104788 -431202 356769 79363 6791 -192012 -40286 58192 231388 190636 156052
22712 156052 -224545 -270297 -102500 36682 -193428 75801 -229911 -52439 -60389 -42904 61196
22700 35004 5532 -323837 -93050 -92553 -72196 42460 -104739 145513 -64430 -190978 72920
22688 -25707 -177615 96213 1686 21054 12305 -1331 206025 -344475 -81785 74629 -26403 -195577
22676 -195577 59553 46256 32260 31171 170305 44579 -13474 316974 -122819 -18000 -433363
22665 -433363 14122 88088 -206889 -29766 -94394 -15614 -152965 3460 16157 13265 168288
22654 168288 -281923 -61890 -23276 153259 147995 -131478 47430 193127 -72145 -209813 49785
22642 -204012 -102202 93297 -1728 140804 33089 8052 -345437 219997 -33203 -188800 152239
22630 -86858 130085 62885 -45469 -265082 -142526 -470902 174588 240835 -365018 -89541
22619 128886 -83630 -212208 63834 149590 -82330 -229894 -14440 -12213 -372613 -182282 -64835
22607 -155143 -93825 -76016 110632 77441 116962 191029 -108009 136641 181373 5821 155322
22596 155322 280015 286499 4525 -160801 26083 -332300 170063 -112860 -377496 163630
22585 189938 134635 -393222 214416 -170423 48645 30692 75287 41842 272875 -146627
22574 238702 -139532 -160343 -224431 278873 -244143 -233559 192859 217531 -321269 75980
22563 -152625 -51768 -332559 -146282 -143912 45370 50548 232765 313230 -119884 -206436 -108812
22552 -108812 105346 -90123 -171475 -260977 -281265 45118 134008 23723 69964 193775 -165202
22540 -52039 138399 142512 -36254 -225296 49215 -29644 196952 244040 192772 -339141 -55632
22528 67837 139451 321196 216361 -112253 59868 167503 -140103 142915 -210168 -220532
22518 -220532 -266947 -18321 -309286 -338817 -289235 -235733 -170445 337656 -175520 -163517 -128709
22507 -128709 -193660 25818 -74569 327 127953 -224851 18451 26430 -384892 90660 -439130
22495 -371499 -129012 192419 214032 -135373 6254 -147346 7201 -123738 138571 -156880
22484 -91928 -11714 -351459 225089 -45399 -11904 -416913 14945 -275767 42606 13704 -139232
22472 -93544 1504 1583 111746 -62652 340913 -425638 -21087 -103566 -304177 -381801 24396 -150185
22459 64040 -94140 -94580 523240 195042 -118126 69709 20198 -395297 -22165 130907 -78733
22447 -40774 202376 -76283 -97647 80636 -120774 53268 -78295 235618 -211615 -51045 137358
22435 269604 -92829 9971 -176022 17216 -192049 -12217 343284 85867 -150934 -257168 42916
22423 -107558 100361 -832 -72317 269806 178011 -22941 18859 123136 -193068 -23384 -142159
22412 -142159 -186137 41709 247382 91895 -50671 -296815 -271628 244561 317919 -11151 61465
22400 -280873 -69960 -186803 96266 214653 199271 -7437 -48487 56169 40659 -32768 -28113
22389 -28113 -93673 287046 -294599 139964 187627 160046 115438 -179725 164629 -33261 -141797
22378 -141797 -23485 -108578 -80964 136398 -200367 87730 -74046 -109862 -57518 43964 55352
22367 55352 -138953 60463 -187632 -1920 323641 85289 311224 -262534 -48352 21108 62899
22356 62899 170592 -154832 -369150 109739 185479 53227 -461758 -227700 163299 -174576
22345 58268 -185676 -52958 -120537 -377176 -30479 -7098 -151203 -94660 -48599 -2348 307224
22333 -58804 -233871 -186944 -231779 116105 267931 57196 -160483 32953 186656 223995 -148563
22321 44676 98354 59051 83740 -24844 135754 187014 91017 -365878 -68292 -153255 -62118
22309 -3076 -6270 36400 -73535 -18405 -354938 -17577 127053 -355838 231886 -80407 -150767
22298 -150767 346846 -128173 -30372 -130506 -109319 -4206 -44999 58556 114429 -12998 -1934
22286 -172241 15080 -389 145892 -75206 52976 -60499 68988 190505 -319569 -94060 -71728
22275 -71728 -112794 28458 -168600 -68689 227741 72727 -38571 -116476 -383690 -15263 -250806
22264 -250806 -97735 -289283 271569 -51440 145497 212856 138554 39506 -12367 -442668 -70719
22252 -86702 224792 69428 -291871 -171677 -65801 106561 145685 -412731 -71115 -62348 -37891
22241 -37891 -126540 -176574 30489 -212431 -150008 9778 45973 -95247 28593 -71526 166101
22229 -180712 39418 77638 -7030 -386924 -376554 127719 -501243 161759 157883 93103 8857
22217 37549 188806 -183306 -168642 11295 9688 -307656 113 -24686 -132827 -169438 -190830
22206 -190830 442684 143841 74312 -341472 -114506 207057 93893 -9108 52023 149774 133375
22195 133375 -188858 5107 -483422 99217 74970 -41200 -277186 -370930 -299657 146330 -273970
22183 -8974 119802 30209 -159693 266547 -77776 23370 204074 -169682 66270 -120234 129242
22171 48121 233109 -103627 -402198 -267512 12010 -65159 92656 93570 -62781 -154020 17659
22159 -190596 209044 -40641 45466 -116195 -249087 -216465 -119633 333053 -130867 140274
22148 123385 -6356 100665 -109572 18658 -235144 273097 -451325 82449 -19880 15520 -331521
22136 136119 69936 -160627 130892 -125603 278905 -82389 82314 160633 83402 -152115
22125 -316561 107090 -174289 146243 476307 216282 -308105 -100053 -360439 41203 -121676
22114 -98776 70532 65885 -2936 49540 -245137 -318180 -135868 -223520 13171 58630 -38287 -140565
22102 -140565 255764 -293701 -74967 -239293 168 12749 9891 -219994 -34438 64339 -134668
22090 291040 185240 -210662 22514 -3278 -338620 -270959 -271901 270331 -47021 -26370 4844
22078 -14466 -203970 -337548 46141 -300309 -142620 -154961 8030 -100417 -110982 11631 -160851
22066 133046 -115599 161031 -100604 -22022 157289 -80327 303886 -164169 -105945 -13638
22055 -208201 59550 179666 71506 213128 314330 -30258 -166851 118266 -344259 126770
22044 -152048 47113 -211624 110723 -160330 -7398 -22796 93864 -156827 -272867 78233 -229478
22032 -159325 55892 36617 -52580 -133270 -347782 -257428 -100682 105645 -28522 -130894 97793
22020 -256039 70973 50156 -171685 -271506 -325457 -275826 -199576 82262 -49976 -318062 119993
22008 116635 -98329 -41611 69849 -313459 -47704 -160009 -128390 -181202 -438530 -267096 -30061
21996 34676 167771 -139390 -266832 94630 -143292 194239 -92811 269837 147864 -15641
21985 -279445 -164621 -114706 -173616 -336704 -59630 -361392 -22709 -113667 234225 -99880 -23610
21973 -126797 -173216 118849 -342190 -109158 -21371 -7100 -7110 -301 -61176 -196078 140321 -42533
21960 -43935 184559 128268 -17783 -188612 59753 -139284 163489 -224178 59591 168531
21950 168531 36246 -230207 12100 105085 -38112 60062 61298 -52524 -130085 -102413 172836
21938 -110560 -56743 -13618 60650 220095 -67814 212360 -31275 -349782 -173053 -220516 147895
21926 -83641 14621 -137248 128068 104753 59375 -348857 56402 200519 132673 -189444 138600
21914 -34228 -167075 -36371 63071 110813 98053 49527 36383 -119696 199052 -19215 145554
21902 -171512 95782 41618 -7779 -122059 90163 220462 330676 45848 -431089 -224135 30409
21890 48746 -137862 -14621 -341189 -279700 -239805 53716 52126 -136692 -44776 -102637 -169392
21879 -169392 -365520 241563 17751 -16727 -390369 145042 -151480 -90376 -235128 -66042
21868 -284208 65003 261003 -28576 -103937 237985 -202692 331871 -78353 57500 -95524 -116088
21857 -116088 -111562 -72764 86798 -212431 -21031 -244407 -31623 93354 100210 69132 10556
21845 -236747 -339247 -96932 123701 55291 186232 154797 -302632 236138 -23883 -83265
21835 -83265 71664 -239152 -334457 -4425 170994 230910 5107 207886 -77688 -179397 299532
21823 -72788 -129338 -62276 82111 -192427 -201984 -44441 274372 66876 -156595 212481 -34632
21811 -88165 -168635 -74001 -165615 94365 -164828 423847 124804 -63230 -204699 -88580 -388155
21800 -388155 25455 -155506 12651 -62994 -17691 -251119 -183471 -340539 -69584 -100031 148134
21788 -96606 204142 87616 191559 -216561 205867 109210 47616 -202658 122279 252693
21778 252693 200949 19874 36267 -17714 -70886 22294 -212596 -187588 132189 -65552 -227753
21767 -227753 -23526 -147268 12393 -23288 88238 -56561 -192036 -182486 -133898 -59653 -297501
21756 -297501 253668 151883 -88959 -124056 -241046 16347 -63654 147573 60257 161539
21746 161539 275346 -5625 -123768 330452 -532699 -322478 41553 -217173 -409497 22242
21735 -131032 40789 -112508 -187361 107870 209807 -202086 52412 -26063 70563 117252 -163269
21723 -367189 -96499 -185104 187576 -153617 -77938 -106261 -36900 -188040 -21930 33852 35561
21712 35561 112928 -160659 -380111 -105394 100240 -170895 -30247 -134741 47460 96203
21702 96203 -90957 -208763 -161332 68848 53714 62784 8903 357991 583933 440254 162318
21690 274815 393866 137135 -181544 -60837 46621 -50199 -72271 -4430 -231323 23917 -49638
21678 62742 -211073 184158 -42318 3759 -145435 177219 -85493 -14967 129335 28058 -219458
21666 -50936 -205893 -18308 -207800 -113583 -42377 -77833 119499 -16877 -209254 -82152 -91475
21655 -91475 -288661 155093 -33741 -391925 -21206 -34715 -145950 194158 264595 -152548
21644 -6056 28951 -162215 -172581 4481 -221842 231930 92845 120204 67706 -127990 -354596
21633 -354596 -168317 9769 -166459 69780 69949 73645 22199 -46335 27310 -239643 342026
21621 113694 -41631 58424 9496 -118239 -74820 329515 126607 -213896 221874 -425782
21610 71657 279073 57019 21626 -207005 161596 -26232 -131992 -50871 -163726 223542
21599 -201355 101702 -101015 -101128 216623 -139713 -235246 236649 -60208 75711 167420 109818
21588 109818 -27858 56598 -138119 -144271 -194111 -131688 54746 86624 145172 -278294 126688
21576 219362 -64677 -179147 -42390 -134587 -38102 -203024 -23725 -28641 176028 -121446 104629
21564 -116376 -51504 66797 -26386 -209870 -276256 32318 90710 -114418 237306 196402 47104
21552 149132 -221945 245493 -209289 149817 59852 -63888 245954 -118211 -69869 28171
21541 -56997 -181130 -98080 -263414 -40155 174357 -113618 4283 -221366 -16767 82710 63732
21530 63732 -189595 107096 -183313 163984 -110900 -56119 141584 -103478 -189842 -189510 -300756
21519 -300756 -39873 -11931 -108292 20465 61039 -51273 -291451 -154763 -106039 9894 110573
21508 110573 -34853 20505 279333 -201441 -265820 -56132 -152243 -235008 27630 -65879 240674
21496 159615 54604 -9409 -165983 -131095 -47282 27004 -421381 -27803 -61018 -73831 -88414
21485 -88414 42059 -25724 -83163 -186139 -67585 -369103 -134860 311750 -217059 -126872 235872
21473 87536 -294419 272289 218384 -44675 -85397 -64823 -411345 -49147 -76176 13973 -106699
21461 -249897 176742 -102120 249344 -33309 230564 117945 4106 -111040 24145 -374593
21450 -251174 -62752 234551 -60559 -94125 -400738 -205334 163501 -98254 164506 -141410
21439 -93280 248838 147693 164755 211477 335207 482361 269750 548385 474332 192036
21428 288195 276590 -62513 218656 9520 23465 -8401 152644 -154019 -203876 63473 35372
21417 35372 11199 -173795 208924 -209846 265492 28878 105582 -42988 -104005 -105142 121311
21405 237808 -226407 -282740 24823 -235429 -147247 -643030 -68679 -175719 -25515 178442
21394 -282919 -188566 183124 -128782 16180 -173201 -321668 144675 278588 -334745 -41232
21383 122562 -13744 107357 304102 -121945 -101066 37195 -18596 -174296 -150138 -131525 -137765
21372 -137765 -207532 -438965 1278 239292 -144723 -118835 -179030 -182325 -84128 157117 88028
21361 88028 100365 -28423 -31800 -280461 -132178 143735 -125224 -141226 121063 136702 45602
21349 136827 -35091 116514 235083 -71567 -208292 63606 -121331 -124437 31226 208332 87562
21337 139851 63664 -90670 36563 215746 -324892 297474 -254367 -161621 23818 183792
21327 183792 -254818 -322384 -144612 -147947 55103 271817 -188654 -131761 -243261 -53530 145541
21315 -202344 -252443 6612 -114982 -140841 47399 -84006 192956 -325143 -77994 3035 24709
21304 24709 258003 -108610 -164297 -313 271 135601 77562 -126378 -206327 -84932 49781 -502861
21291 -1021 47277 86153 156425 154636 90846 90609 51692 -43604 -123911 71405 47349 -98436
21278 -107022 -245878 -161244 -160362 -110706 79859 -266382 -236854 -86217 -3926 158011 -277226
21266 -71956 262251 49632 88890 125723 175312 -30877 267447 -215765 178466 -101055 -515201
21255 -515201 -59858 -252110 59768 41935 199246 54537 -353204 129223 -26031 -432168
21245 -432168 -151721 -136258 -15795 30870 -12570 -109870 -55367 302748 376009 779 -15878
21233 -160690 -162953 -227991 -58650 -51537 51406 -146718 -229250 151225 52256 40762 -272923
21221 -49999 -53516 219142 -63482 -393936 -87128 -121690 -265216 -72783 -12774 -79085 66455
21209 -262756 172320 6421 -236755 -96586 -152441 -14140 68680 -320545 183120 -163373 -61316
21197 -319746 -42746 -243058 -208340 284420 -89953 -36774 -224794 -45824 131451 98217 270916
21186 270916 -78615 -82493 -213398 108310 -1607 -34006 -620200 248175 -263006 -43735 199314
21174 -88890 130891 -326241 -50582 -97548 -277490 -72965 -95853 -225843 23279 -85440 -242242
21163 -242242 -379626 -171254 24004 255911 -20010 -18755 -90716 136898 -44150 -228909 -471
21151 98118 -154055 125400 178050 83059 99862 -50692 -478972 343940 -238142 -316718 -128418
21139 -109175 -84906 30118 86633 -106265 84688 160670 63978 -265985 -398420 12907 26719
21128 26719 131847 -419972 271872 -7008 21036 342488 -81587 -173555 -246844 -244157 16670
21116 -50336 143555 57402 73911 -87258 -96003 102585 -145546 -634712 -27161 10203 -134484
21104 -5165 -237011 -313296 -66605 -329448 209767 -57051 46741 -42716 32671 -196748 -103545
21093 -103545 90938 138256 -87569 -328814 -42814 -269877 -161330 -28253 288063 -95575 -142624
21082 -142624 -12685 45862 -195763 65119 -103346 160447 -393367 -67056 -80622 -240998
21072 -240998 9865 227507 -224312 -402067 -129925 -8931 106421 -306958 -79802 325404
21061 8446 -278942 -321855 268423 -79745 -161089 121048 167375 113635 -88412 252154 -155145
21049 -25581 -142455 165388 94866 110736 -186259 65940 -47584 -38169 347044 352749 144460
21037 261487 404416 -111206 -179412 30926 125778 -92912 -145529 147938 53023 -151221 -103069
21026 -103069 120920 -200820 -125463 109690 25561 -193383 20197 -8197 -32026 126791 -38000
21014 -221815 -110573 -17384 152888 232087 27746 8150 -183299 -159740 230791 -5673 -84574
21003 -84574 64266 101655 -689 -257058 -327274 -347534 98492 -178238 -98635 -213578 -91568
20991 -69205 -83718 -244197 51069 4232 -51435 -243944 70192 -45117 203605 -191572 -47374
20979 203481 -216437 -263869 -236381 -220911 -110168 46217 -68194 -207119 -177126 242794 161788
20968 161788 31125 14467 -209850 -73507 -171898 138351 -79743 49404 -9922 -77943 142346
20956 -145276 -111259 -193152 77049 -64922 -31784 -199609 91577 -186542 30367 64607 163061
20945 163061 141022 -5455 70252 -201441 -238124 40792 -92458 -133148 -131067 -415048 1542 -9754
20932 -222229 -3317 50931 -354991 87658 -181851 274287 418 80471 -283782 27529 -223617
20920 -58420 184594 -156740 100088 215877 -265023 31196 7496 -18378 -116723 -177366 -34679
20908 -109769 -30434 -291836 -3942 28525 149449 16534 234586 -142402 -204028 -138987 308366
20896 10119 195125 40102 -12413 -196302 153633 -66802 -190754 299677 90758 20686 -392503
20884 -109854 101300 -137505 -83500 -98083 122716 -417831 149335 -62160 -228339 120462
20873 -125132 77940 272690 -249474 166654 -35936 -140062 -127762 -172088 40260 220164
20863 220164 77585 185849 100730 58708 -7999 -32339 -124332 -61495 102527 -170094 215426
20851 -16062 -240788 -144461 166931 -38447 -125753 13195 -56837 -331277 25437 185865 -32604
20839 12649 222844 -57499 84495 50032 38820 -201018 120592 -86954 -323041 80525 -45625
20827 167348 132147 -391073 -58696 -10764 -22561 78124 -528759 -38712 81653 -302256 -86191
20815 -118535 -365345 -18593 -39063 -127502 -162681 190152 -73391 126567 -99513 -122321 -46801
20803 -325862 -91581 115387 161320 -320563 -286436 -120190 -29371 -53606 -87688 73082 -285250
20791 227714 -154941 -192179 -383394 129040 -202508 -72947 -159523 304367 -152247 -89015
20781 -89015 171484 325574 43990 60031 92328 -267748 -90889 -89395 111875 -36678 97969
20769 -34703 201968 62471 -41681 -281440 45037 5623 163894 -72009 194436 -303375 73993
20757 -136559 162261 27388 178822 -8102 -70665 -290214 -423887 -455913 30095 -370857 149788
20745 -82697 93112 -275687 119048 -114500 143871 -34006 225919 -16043 -12274 -127194 87082
20733 -217535 -119525 -84241 -289446 154400 -12947 -220702 -446122 -282991 -289960 -128 99304
20721 -160497 158388 68239 27401 -50237 -51595 -196711 -261056 -269622 211481 -168305 195306
20709 198201 152522 -319032 -170650 176206 -70728 -57496 -31737 95219 -38686 77162 -219331
20697 -611398 -31015 -81102 117545 -32495 -152942 -26924 -15027 109594 -142158 -20161 -65718
20686 -65718 64558 136617 -230020 -215387 -116913 23634 257138 -30260 -149818 -13496 17955
20674 -250191 276049 -13727 -188476 -371330 49421 177417 200514 -205730 -152263 -85399
20664 -85399 154802 -215640 90627 -99311 -51460 -36640 -38349 -64605 -98680 66043 182849
20653 182849 188441 165582 -167552 -262914 5382 223404 -163676 391284 94028 -48752 28969
20641 -185312 383358 35552 -142718 -187251 -72112 310124 -26890 -34053 -106072 15334 -360390
20629 -156211 -9791 -2369 -4027 -243879 232162 181924 -141722 -298297 134167 -92007 -176739
20618 -176739 -159561 -56080 -294743 -333798 -170667 -114144 -121880 -182378 123200 6187 -39963
20606 -67653 13022 115903 -280186 -4434 -41046 79345 -60905 -119149 -71543 -167513 -144919
20595 -144919 -157615 -246910 164147 196735 -136056 -154197 -16871 -40923 -26281 177350 -61525
20583 -6692 23707 -287814 15127 -105588 115848 -384727 -129291 -429971 -91065 251800
20572 62853 -306880 4552 348668 -351774 22774 -137476 -140329 -295530 169810 -39538 68342
20560 -61472 265809 -39575 -115827 -199848 40302 -268792 -67823 -272924 -75345 37451 31908
20549 31908 -205494 -59051 307790 -279139 -61726 -83753 -57683 -146362 44772 100619 -245405
20537 298606 288712 -212825 -185140 -152813 -239327 -55138 -225143 70408 -771 -504153 -419296
20526 -419296 -142462 -185391 -92515 -77035 -315842 102957 -213811 229120 132274 77121
20516 77121 -285375 -132516 205782 77693 -20614 250402 -104376 -11728 -171051 -310245
20506 -310245 33883 -151860 -150716 -144604 -89728 -419401 -80741 -88833 -22706 92840 209240
20495 209240 -171662 -101250 23282 -310726 -87614 7113 334366 -95383 -112310 -24032 -64865
20484 -64865 -107483 -2738 61735 160600 -283313 63685 -166816 -70282 -304165 95788 -147112
20472 -134257 28269 -232417 -2452 178741 -114374 -169823 -43154 -199871 199425 -180288
20461 161465 -56064 -133532 147432 153693 36150 -149654 16571 254563 240581 162032 -74630
20449 -108452 52389 -231156 -410694 42270 -393285 -363424 -373535 49078 -123317 134927
20438 -47491 5758 111489 -270549 -35960 188232 -128262 138596 -160506 43770 -125817
20427 -7427 -72903 -83396 140158 18443 58770 109099 -336391 -307390 -49801 -153851 -268299
20416 -268299 -91183 -128428 94833 178749 128619 -11940 -15180 238656 -67529 12191 -208527
20404 -101814 -390203 -229645 321086 99001 74607 -203651 -282424 119445 -86471 15987
20393 227318 -202965 -42616 22821 -114504 -143171 30405 26553 6455 114048 -155864 128915
20381 220795 218400 138384 -280617 -341399 145969 -79330 -35948 -147713 -185250 280138 -47446
20369 76418 27838 52696 71225 -100713 -264810 174838 -361436 59497 298471 -37708 -49247
20358 -49247 209243 -14188 -182143 16906 -311389 368798 26117 209874 -10143 -46950 -33489
20347 -33489 -223121 14610 -274157 -5028 -236622 -296822 133014 17326 -120993 21413 18148
20336 18148 -213065 -41295 1823 -124821 -37855 -85655 156620 247153 -199747 -237613 -194575
20325 -194575 75689 19198 -72605 -144292 345514 -205114 -89458 -71891 -192367 -100381 -107449
20314 -107449 158340 -111953 121347 -164016 -246414 -113739 152097 58909 -255999 -115716
20303 -294581 -179088 -269419 -425381 -64321 -83368 133336 -144242 66356 145173 127888 -19244
20291 -90446 55104 -203046 241672 -172578 -26350 245493 -357897 182571 -284741 315518
20280 67963 -28025 -555080 -60824 52217 -100245 58542 73601 -259753 -55480 294627 -49136
20268 40521 -346690 116868 -264406 -59082 12396 245743 -9434 46995 -66987 -53932 10345
20256 -234864 -68022 37549 114101 85822 -203561 88335 32183 -137002 -84247 123912 -249991
20244 90408 -165592 -240660 -80153 -186586 53680 -162900 -257861 -232944 -116619 75174 382993
20233 382993 82353 -38996 115268 -65963 -152107 223965 -101510 179839 -178240 171075
20222 -12362 -72990 -34245 111642 187049 -120213 20785 134884 -101412 -224758 -72620 86722
20210 -270828 -180983 -232174 58798 -167744 -68070 -145608 1880 208425 120784 -110932 281828
20198 -2063 215571 -92208 146868 58843 -131073 -62043 249446 -127431 2853 82214 95366
20187 95366 -111329 -339187 -242515 -60735 -38304 -52813 234942 110480 201218 -328412 62854
20175 -239099 -10 -297538 -193211 -28912 -279031 4757 126810 -19792 -322027 100755 -29762
20163 8914 -41267 -272914 211267 41269 140222 24735 184848 -906 -115699 -169390 -24519
20151 -201121 -107003 -494090 -233107 125637 689 -384122 -276026 382750 226936 309487
20141 309487 -104354 18976 -22236 4534 19515 -103404 21080 30162 -150916 -122435 101047
20129 194183 65916 -110152 204668 78736 119420 51177 64888 -30174 114383 -120852 123514
20117 139775 -324052 -65247 218162 -241214 -198216 91230 -246585 301068 262802 112560
20106 -109640 18437 -628374 95477 135681 -258646 -258777 -147032 72867 -111268 -131050 -143314
20095 -143314 -297155 165042 -197430 -70074 -159724 -97281 44161 -186578 -132176 77225 -133587
20083 282993 132205 474720 -297985 -277464 118087 -335683 -114899 113445 -53209 -199516
20073 -199516 -48239 -11356 138627 -287480 -27293 -275334 -172922 -366567 6677 36584 -211271
20061 -222442 -247994 67779 152795 -56721 64005 15571 186890 -98580 -167359 131789 61250
20049 82188 2983 94399 116640 -25484 271269 -165947 93803 -59535 -234709 186626 57226
20037 -18131 -58763 110685 -64240 299091 -39186 -470388 -134621 -513849 -22270 8875 -190303
20025 -427015 4416 -90184 -5253 -146110 51632 -31291 -163157 -549015 -54758 -144305 153991
20013 93950 -184876 -203658 -227081 -84421 -153375 153948 -377192 -25076 93291 130986 -23364
20001 -1015 -228941 90226 -285793 306469 -280114 -334852 83340 -80305 -255678 -325404 -54483
19989 -158823 -3461 -44083 108411 192288 -62385 103106 53871 30635 94547 -5694 -128844
19978 -128844 -41431 128460 -513028 -58243 -314912 282328 283195 107285 53439 -257893 -59121
19966 154330 -248333 139810 -62345 -266680 165141 196285 124113 74859 51405 133143 14777
19954 -40885 -299413 -218765 -193489 99111 -113181 145602 -113505 -68371 229957 -221901
19943 -68085 -47657 16620 -424163 -139503 -41897 336462 -126595 -271695 121770 72876
19933 72876 28938 353281 273526 -104697 -11427 124225 -182410 69105 -380728 -45801 79048
19921 36399 17123 -60697 35523 28413 40133 -307861 -27773 28487 -65740 17850 -102775
19909 171227 79763 -79436 145770 132974 -330925 -40208 -40956 234661 -83494 -138250 -201707
19898 -201707 -225427 -27180 -365861 -68478 -131837 29544 67570 -135626 -129318 -91784 -187664
19887 -187664 82499 191264 -294742 74062 -126203 -139908 61377 -269746 203729 193956 -315511
19875 -294769 -12833 -30461 -249010 68497 -402731 -450 -318137 48527 -12490 3105 98500
19864 98500 -141024 42197 31563 91504 175711 -111203 416344 -76273 -37531 -58351 137023
19852 -282669 -102958 8907 -48785 313069 228274 -174765 -196453 -96346 -325455 -267614 -20530
19840 -58709 -14292 116247 265490 -58260 -411689 120571 -126037 186921 -137348 46850
19829 -225296 57032 130558 -210236 -191405 229922 18684 -114586 -99956 63477 136162 -136557
19817 60511 313310 -84149 27251 70869 49212 -257050 -71581 -35071 -142511 -141196 175073
19805 -209053 -345045 262486 23819 -186727 228 -3223 135236 80316 -121940 -244947 207345
19793 686 -35370 -90215 -116686 -120879 -148621 13007 -308679 -279731 -208860 71463 -35643 -226052
19781 -226052 -92859 -232771 118785 -149066 -65670 -190146 181172 -80388 141708 -322838
19770 -210852 -35111 18363 -99411 -169657 289981 221654 -95079 186479 -172684 -21808 -54516
19759 -54516 -24743 107547 71435 -43914 -238436 -124531 140387 -29846 279578 -171958
19748 -85946 -219660 -123098 228408 189272 106903 125322 17911 98344 71047 1257 132632
19737 132632 -306899 -153482 -110186 -325750 34904 237528 -182970 266590 -39388 132742
19726 137895 -153635 12238 -119203 -33381 -285921 303543 -162458 115013 -198642 -24210
19715 -92881 -113354 86968 -37571 94219 -7419 -159389 -87377 -239364 41101 -108852 -130511
19704 -130511 -77087 54034 149900 -457141 2889 -299435 13472 132116 -186078 335897 -29022
19692 -63860 -476504 -161142 -222271 -214314 -162625 -140307 -97585 -60053 90369 19734 139853
19681 139853 82619 -31597 -270639 11544 124380 44031 -156077 39796 34315 73939 240152
19670 240152 53396 -58717 39773 -150580 62567 168305 -24794 98950 49928 -3739 -249494
19659 -249494 149645 -32528 9134 -257401 55806 8624 -124216 -79982 -204383 -43942 -17105
19647 175098 -126326 116856 119655 76797 -48864 -246659 -232925 -53614 97548 157465 123495
19636 123495 91476 -181905 112942 -205525 202318 -170090 -141117 -229508 -192194 -129385
19626 -129385 -62587 88520 -90209 -112115 6157 -210984 -209517 -320318 165025 -194658 81734
19614 -35363 17247 -182145 -276596 29235 133901 234248 -9224 16039 -129575 138296 52363
19602 88678 -236515 202956 -222235 -182139 122253 -88801 271662 -126920 45314 -98331
19591 10298 -310735 14613 138829 -127125 -228090 -229148 -274981 -113796 40076 13251 -24817
19579 52910 336951 21782 -137590 -198293 47088 38774 -289785 401027 -177087 -26607 -169884
19568 -169884 -332800 347481 68678 -146064 -190033 33863 57714 30197 -144441 -58090 -273982
19557 -273982 183841 -279041 -129851 -9064 217864 76941 75579 -125501 269271 -51218 135250
19545 -90953 -172941 -103740 -177633 48851 232241 97941 -13598 -119790 322081 -127246 -15766
19533 140 -312930 -27193 -147419 -2840 190284 -255724 -144950 -6666 113275 -234030 25529
19521 224271 -153999 31532 -337975 -197302 -259508 408226 -130384 -97248 -373326 -172333
19510 150661 -137718 -63981 151595 -34170 -21429 -189723 -212134 -330003 5566 21920 -197011
19498 222473 -97110 141118 -43627 -184781 -131502 -221619 128703 82302 82584 72574 46296
19487 46296 -15805 -278781 144120 -27999 78175 283133 -148792 394043 163818 -138242
19476 51319 -71359 -27754 39180 141741 103349 116615 123475 -131005 260107 -140751 -155981
19465 -155981 -151293 121065 -289808 125926 215807 -11207 40862 -307262 -6691 203224 -101153
19453 -84226 -52667 -292332 -78992 -291540 -83647 180925 -102554 46393 -247962 -194450 -72949
19441 37600 -54198 201081 51730 -153654 -78632 -413267 -325088 -198581 -290508 143511 157435
19430 157435 133790 -63425 10371 240875 -71804 238268 -290057 -177468 -100878 -8627 -130676
19419 -130676 -169427 9153 90379 -150351 -115319 -266561 -77604 46770 -230522 -285819 -252532
19408 -252532 -110694 -165646 11951 -48301 -352481 -150434 -101724 -481010 236189 -322405
19397 -177282 15694 -343346 -166415 147177 215541 46908 75090 54361 -314451 -282948 -48552
19385 122428 -71138 -35595 -298704 -71123 -271368 -149360 -71477 -270153 117259 -266536
19374 112746 -83068 -97812 32063 169049 82361 119 303983 -372645 -63322 205063 -60055
19362 -98869 -129749 -57155 62777 -214139 -329038 -47439 -214244 151989 -134461 -299695
19352 -299695 -74354 141673 -191806 -367551 -118767 37217 27500 -56918 36877 32038 -115651
19340 14845 -57848 -145681 155119 75859 107625 -383670 -159449 101446 -110656 133296
19329 18587 -86299 -115308 -310263 234621 -108693 175194 109985 -89700 -255505 51751 -121463
19317 -109305 132744 100079 -71064 163287 137286 44675 -248505 -126353 -60932 197291
19306 -169032 -10940 -138956 -21215 -156793 -139138 41936 221398 -39260 -13742 -143140 363653
19294 -111053 23410 -351168 76017 -135168 -37996 190510 -230368 -124272 -110011 17203
19283 51035 -215434 -52328 134271 51795 59697 79630 1366 -76453 -32038 -61479 62171 29038
19270 199577 -34217 52560 51219 -62453 -68825 110273 107090 -262121 -77731 -53507 -7270 -80944
19258 -80944 29624 -3523 89557 -224553 29915 63004 -235756 194874 -192536 -419459 72143
19246 -62903 75889 -14952 18512 68547 144416 297715 -40136 124489 -339357 287580 81199
19234 198271 -318618 -191932 222491 -46603 106794 235278 -150331 -66176 119865 -233008
19223 -25783 156416 182747 -84274 -168168 -374456 -230062 -213053 35354 -249954 -46449 -203872
19212 -203872 -82662 79511 -155275 152437 -190796 -117215 -267349 -153757 169457 28739
19201 84743 134302 -558731 139988 -324741 -310785 -115968 -161121 202009 -170405 -278626
19191 -278626 -290893 -20238 -37174 -188997 -7333 -22531 -89112 15368 -364459 -138752 -93068
19180 -93068 -295303 -144304 -278650 -257265 -181280 46248 -193391 -75247 -68003 -36210 134166
19168 127877 112787 -146986 -68987 -229353 71469 -483215 -320022 -13809 -272921 -321553
19158 -321553 -140498 -128931 169342 -307525 -87812 -234747 34161 -35238 -416040 -31998
19147 -219742 -218862 18227 14191 -159647 -87080 -196742 -4962 -124230 -53972 -67549 -520096
19136 -520096 97361 113030 59604 34553 -235118 -100810 161091 -169530 248404 129336
19126 129336 -138304 -140008 154647 181110 -129290 -280990 403304 36990 148317 349953
19116 349953 99841 -31514 -87058 75825 -316833 -2647 47509 -271700 184977 162310 85699
19105 85699 41919 -155783 141178 -216287 -104986 -70143 -351254 26284 383101 48293
19094 -186899 -159779 56397 96330 -246258 -307786 116062 -165305 10271 -70055 8663 -36912
19082 176812 -59100 -115910 -107101 154408 -238024 -55985 42877 423828 -70774 -14476 -70909
19071 -70909 192871 -71279 142199 39739 -226359 -259442 -197667 75297 -105546 137420 63798
19059 177565 28534 -46459 32672 -154749 -138605 -228013 1900 -88730 -298550 62312 -368819
19047 22933 124766 -226267 -64459 64034 -167270 178221 -241141 256499 2821 -145813
19036 155446 9635 126944 -257275 -298831 33254 29115 29511 -284705 173739 -13605 14953
19024 45030 -12761 -118143 -103285 244482 -107615 168995 -118926 -56313 -209941 -40900
19013 -228196 -9697 -21774 318991 115967 -157281 126596 51957 -53549 -148156 -311437 -106116
19001 -105250 -223399 -23767 -62094 135804 -238558 -57765 29170 221238 -389747 -271904
18991 -271904 179367 -222326 -133742 -162083 -4101 -68221 49272 -235705 135528 -148050 -111898
18980 -111898 47948 -202760 75596 -35298 -148194 -34810 -24113 -161801 -284851 -194044 -294738
18969 -294738 69141 -188876 -133546 311034 252187 -216699 217755 305686 33704 159181
18959 159181 -428793 186031 -175789 235914 -152608 -116460 58343 35617 -125666 58038
18948 131552 34896 -80570 -73314 -260918 -455756 405123 -31934 -245139 48060 -125165 -39176
18936 -330285 32480 249394 -190535 -143462 97897 -202760 -267592 12553 -65789 -246368 204672
18924 95965 -382964 86285 -218948 259218 -320009 -238808 -255553 59135 -387832 198402
18913 132095 101005 -40679 -114002 13160 259118 12646 -65792 -148849 -245442 -175160 -296960
18902 -296960 205912 -180908 -349097 29829 -109395 -12372 -78406 -143956 13775 -105 -242926
18891 -242926 44818 -265069 -47652 107345 -51165 -168325 -9646 -79352 64446 -122531 213837
18879 -60490 26646 -54599 -234739 -132248 -42805 250406 20447 -367272 -48218 -52185 -282088
18868 -282088 153143 146666 227451 63973 -107109 -264393 95006 -297169 -264819 -280449 52205
18856 102301 -272641 -193240 241560 51208 -170573 -281891 -413139 -200684 334573 116070
18845 -200811 -141577 -32812 155487 -149972 20770 268606 -115981 -319439 -296364 -117603
18834 70460 -64565 73746 112723 -366891 -131184 -350577 63206 -30166 4942 -249382 56818
18822 -155495 -263504 -12860 -49908 61188 189998 215596 280505 -182874 -24940 -207106 -37460
18810 36647 329264 79561 174582 -139838 -57745 113 -249558 -144897 -107743 -1637 62218
18798 -73228 -229133 -71006 -147854 195150 38401 -197458 -38830 20000 135068 87311 -315462
18786 -175899 -90099 -200933 -211516 159403 -98741 -46278 -74466 57540 -271640 168834 46317
18774 -45516 111258 -371336 423061 75496 -69065 -41672 142784 -59244 380229 -52616 -384977
18763 -384977 -116456 166715 77636 -127625 -113133 -89942 -48010 -168255 -257239 30554 163189
18752 163189 2132 -21110 -217066 -8507 13402 369253 3980 227682 -55532 -116139 280538
18740 117994 -47154 -224953 -1546 -219516 219328 -196774 18480 -142675 272499 34132
18729 77410 -234767 172114 -23187 -205242 -224866 -365519 -132710 -152137 98376 -129703
18718 53984 -42514 -186235 49169 -28095 118859 285430 271162 -71203 -230140 20692 -92871
18706 214289 177559 139066 -265893 -106794 -68960 -26620 376482 -385558 -140479 -129835
18696 -129835 131156 -100690 84657 263132 -228252 182014 -158459 193728 -213797 194992
18685 -465759 -27330 -221353 -42497 -255465 -36903 -47032 -208290 -72644 92390 263650 127191
18673 31547 -25096 -539100 -180624 2125 -120095 -133322 -30631 -13418 258051 -32517 128604
18661 300722 307019 84061 -4066 -85388 -152711 112008 -95149 -5071 70484 -149499 -428167
18650 -428167 5958 9358 -194697 -103488 32982 -177216 -47785 91625 94174 -2129 -124913 -73415
18638 -73415 -20865 -145889 -5709 -17047 -253436 -279863 -192492 -295560 -225617 -223876 -159104
18627 -159104 196261 -253879 -103066 128420 -51929 -74882 139011 -186773 -37078 52376
18616 -134885 403922 -321886 146041 20414 -54377 16842 193015 -167733 125 133248 150585
18605 150585 -127261 65357 -137133 -114835 58981 -263411 -23884 -28284 -3503 -201029 130903
18593 109384 63208 -111283 -147493 -201741 -16764 104774 80094 -193317 -138102 -137381 205293
18581 -38739 -184828 -30382 50449 158202 -228737 -116970 -172063 145 -74723 55802 248958
18570 248958 -114768 -370313 48547 -191547 84297 174773 -186895 275346 70208 239492
18560 239492 31222 100953 209594 -124705 -17635 -209822 -36052 -270033 -14483 -50837 100059
18548 -105613 23632 -170468 -89616 405082 69737 -186940 -357513 -292511 87994 -125410
18537 61024 -15500 -203749 115337 10045 45217 -544693 -178856 65600 -2167 130310 -9149
18525 -167681 257620 -137762 44411 -151170 142524 37991 15909 21693 -98006 217729 36695
18513 -171405 57044 42334 -155993 -159869 229817 -67389 -283461 -290182 142786 5699 -135960
18501 78103 -38290 1534 93627 81788 221927 13985 110495 248129 -215958 -358563 145784
18489 -74059 -31220 -100371 46243 -5399 -105419 -134504 -256954 -216613 -148220 133014 -195873
18477 113489 265121 -49582 -111778 -4236 106047 -32005 -273695 -136580 -137028 -310828 23013
18465 -263908 245205 -10930 150150 -232801 -410658 44586 49801 -140643 -7423 -163943 -154369
18454 -154369 -126142 136595 -290897 -26253 161991 -81833 -135080 130060 -147519 370950
18443 -268401 29065 19909 119875 -199692 37832 194229 81068 -74615 243808 -194746 -151719
18432 -151719 -94060 319074 97710 -374913 223999 197852 212382 316881 -23665 -214618
18422 -214618 -85563 -72828 -56987 -141526 141962 128140 -77003 -221496 -19446 -36829 190682
18410 397 -94281 271641 -299043 -307949 131724 131691 -5081 -68010 -90380 50092 -124587 -102139
18398 -102139 142549 -125406 71641 48127 -88995 73349 112695 -262295 32855 -48149 43683
18386 -40256 166088 -150166 124558 -500869 -97255 -203770 243116 -49745 -195102 -32043
18375 321687 136590 -130278 154594 -155137 40584 -147962 -334770 62738 -66848 -104491
18365 -104491 303832 63796 813 -101731 154930 106862 -325020 -276346 -43441 272110 171125
18354 171125 -100076 -154689 -155476 -42437 -115802 93781 -200414 -89133 152589 72923 100443
18343 100443 -574232 -56995 -680 -268254 -60862 -22059 54636 -202759 -69931 -130551 -12452
18331 -73779 -147306 -122215 -88749 75243 35962 -357678 58040 -240483 163606 -18259 272147
18319 306552 -161301 98747 -220674 -489570 -65886 77622 4594 -145749 -68040 92692 34570
18307 -87739 -372277 116425 42342 -136887 -270274 -25554 131797 -199775 -34649 -189364
18297 -189364 -19644 -110758 -80517 -310431 375732 74007 66143 54101 105492 -118610 -238196
18286 -238196 -318118 -33855 -267797 272881 -43687 129414 -124212 -54729 -32065 100864
18275 50241 -60710 149519 -263606 -106905 -143865 -9431 25390 21438 -402179 41656 64644
18264 64644 9591 55289 100342 -327578 -107674 -180691 65701 -137842 -201521 66048 -182782
18252 -20194 -83142 47263 -18880 -58481 -144446 -204088 -189075 -73941 -78902 5651 -128641 -60541
18239 23628 -93402 47138 55562 161112 111578 75073 -497797 -191184 -365074 213656 158047
18228 158047 72764 -48519 34498 427484 277292 -44868 11090 235852 -7918 42052 -67311
18216 255714 -368340 -82087 7297 -297218 26086 -206259 -160255 -69400 -337234 -282213 -339511
18205 -339511 -262638 61713 41157 -129387 -88836 30588 -45927 36149 111194 -33778 -133344
18194 -133344 148376 -160174 109766 -348878 36301 -63853 -149846 117068 -154300 -247033
18184 -247033 67710 -64917 -51149 -2794 -65266 2154 -201899 85672 -233354 -294198 -100696
18172 -167617 -329546 -67864 270630 87327 -74001 108156 -147381 -227765 -85859 -275547
18162 -275547 97653 124361 -485135 137110 9865 263088 -138704 -292894 -789163 -37206
18151 -22708 -96324 10871 8334 -78152 -142946 352344 285049 -95156 -265296 -153779 166647
18139 -368472 275037 337847 -278363 125304 -12717 -168054 -150831 60381 44616 27245 -121590
18127 143699 133716 -190141 -345128 183250 164893 78277 -5868 -117190 -5687 -78767 -174252
18116 -174252 -155553 216303 136486 -45778 22221 260215 -165587 171748 25888 106539 -131631
18104 169624 -404905 284401 -207735 -498115 391344 23786 -158905 -88424 4061 97359
18094 97359 -116924 254939 -215559 177908 137227 10981 297154 -237180 -412777 -50098
18083 44412 158325 -5004 -117354 97215 191132 11107 190599 8208 97794 132656 -27421
18071 250445 -60538 60588 -223468 -242029 58322 -319277 -45856 329567 67057 -202143 10662
18059 -230829 -7656 222307 -70082 -470426 228934 71985 -19696 71716 54766 -44136 -183872
18048 -183872 84507 130878 194172 33844 -214083 -140560 169653 -143235 -18651 -138108 45364
18036 -405822 202565 80324 2195 138281 -18209 106755 -51161 -241887 -229562 -62868 -34162
18025 -34162 -119085 299566 -9775 166706 16928 -16024 -96868 23735 -100647 78945 167535
18014 167535 53436 53470 -182667 -543688 -41681 207832 171199 54333 -339703 39196 -72225
18002 100444 356196 79885 -132285 -40668 -392156 60228 170187 149817 7812 282729 130117
17990 112745 200881 374937 -231798 35595 239699 -112938 -245547 213171 186930 26222
17979 -126655 -350791 -168269 -179243 242573 38475 539640 16510 214153 -91038 -59329
17969 -59329 144576 -205761 -9589 160328 -60479 -206400 -332040 4976 111516 -38476 116645
17957 294487 125846 74050 -188810 -82247 -29809 -206416 305905 -356915 8886 29312 -90436
17945 -48793 15814 -158417 219434 353796 -265309 14020 -101515 33020 -20768 21434 22523
17934 22523 91065 66402 -96579 -82445 111530 -348423 -41977 32886 174550 -94132 -204435
17923 -204435 -253467 15573 144603 -25934 70882 153747 -151096 177633 138252 -106444 -186916
17912 -186916 -38324 -35909 13117 -103566 331721 -240169 -195220 193953 -82481 199586 -450469
17900 -151183 -168080 -92107 89308 -102455 -116229 138932 243591 -33078 145154 410594
17890 410594 -81387 -21914 -95190 31292 132372 110366 -68626 -182005 -85882 -273320 -155310
17879 -155310 343836 -36292 -262067 292230 71335 -171086 206459 -72777 -181426 389294
17868 194991 -187544 -87962 -57441 266360 -311186 93405 -61517 131524 -12113 296893
17857 97753 37772 -229427 -64078 -167715 -206768 102540 67417 246053 -243179 266765
17846 46807 175902 -193765 -26961 108547 -66259 216638 -130105 2293 -169754 55046 154485
17835 154485 -78980 54395 126926 68829 28522 68235 -148125 93264 -333813 -119383 139880
17823 19651 181249 -4760 -39256 -158528 167910 -243296 76878 -150271 -174438 80577 -149956
17811 234922 66706 79438 211113 180666 311024 127872 45226 132605 -172860 -155487 -77177
17799 216530 215743 123025 -12686 -172382 75951 -174122 -163060 -31913 182427 114957 248970
17788 248970 -206552 42556 220269 -35892 -50828 51079 195631 15307 174461 -107362
17777 -43663 -223032 155733 132516 -134040 153044 -366764 144715 -272346 -57046 -101623
17767 -101623 -76685 164563 213436 27032 33533 -289825 -254464 263610 12294 204706 -242955
17755 -155255 -84496 41928 92613 -95046 37713 -227276 275578 -195753 326879 85349 -102308
17743 -30444 -178319 369822 277893 -336775 -67726 177634 -38321 -153972 44822 183436
17733 183436 -151672 -226863 57294 128358 535679 -158093 474512 100988 145216 -39711
17722 -85660 43252 -181340 96293 52633 -56134 185585 378233 -51634 -241831 342530 73901
17710 -302690 211875 -356291 -12922 117946 270957 233461 -131008 451202 -28998 33440
17699 -72422 -68238 -228915 308226 21543 126795 65565 183541 -408260 -115952 -9694 -17443
17688 -17443 39765 58988 -192616 -200387 -43049 -56225 -305771 -32168 -44719 131637 141253
17677 141253 189595 -5069 311386 35965 -60368 -49539 461668 -144832 258928 33557 79024
17666 79024 -399226 300451 -74950 90560 32151 -144557 31813 120150 -456 146314 -65636
17654 31604 -18996 137612 234404 -84547 -18398 -238561 333138 4632 365769 50521 7412
17642 68801 -353352 -208489 273782 92115 -87114 19538 -301324 -372432 -38559 -204894 81797
17630 207849 -32020 -94217 -21598 63894 -70416 -149325 -50120 101437 29492 28409 59973
17619 59973 40090 -36645 82138 281125 -290186 52395 98334 -241976 -173123 92695 204433
17608 204433 375409 135248 200608 -238195 -113988 403787 -136246 -4253 81448 -123849
17597 -245470 34115 -237950 -4645 -334344 -27046 103925 90860 368456 49884 -67362 -206572
17586 -206572 170975 100014 156456 119700 58350 25917 -86425 -111673 -184989 -168663 51527
17574 -218902 240645 77759 86712 180477 -381262 -72481 224549 240355 -354131 -79307 -155551
17563 -155551 -90365 143405 455676 -67705 16145 -149468 -241738 -25744 -137366 80518 -72496
17551 -49026 308117 257379 -95076 29649 362210 233516 254734 234622 155881 86354 -161961
17539 -97461 431818 -4915 -68042 171474 -204925 60468 -138084 384088 58188 -50336 -71357
17528 -71357 -47408 41006 272214 427935 203727 -30240 37181 140021 117757 211743 307203
17517 307203 225428 258597 -360828 207545 -16596 -59135 173676 -18509 134634 -25232 -224653
17506 -224653 615524 120533 -190789 76831 318605 191252 205645 18931 185681 96285
17496 96285 282054 371146 17844 -380207 -118666 195299 -93702 184822 33821 -115825
17485 -56661 -37711 243915 89573 15785 -5925 122166 -78689 -6450 64317 104900 273376
17474 273376 195788 410178 347538 38912 252126 -77246 343633 286883 326714 141471 -54750
17462 101698 -150410 63870 360691 117320 79729 396066 25362 60436 423819 318987
17452 318987 197711 328560 447871 129982 270514 184554 256526 281254 202863 286120
17442 286120 178543 126766 151308 -46192 256165 119886 184357 -48289 288065 147414
17432 147414 -139884 116011 215430 173585 151783 424877 77615 312834 127452 614095
17422 614095 115886 233659 278549 205259 -21085 300305 1996 393346 183640 199271 356144
17411 356144 276297 165906 172727 62234 288796 234703 -268973 79534 305052 -221824 240460
17399 22668 -64430 255006 -243658 451045 128346 467216 -137099 283257 476012 213778
17388 -52430 503763 349899 -211502 17746 377055 206635 158602 -15774 35554 -41857 254180
17376 84784 115481 125774 128119 161912 -35489 170900 33313 12260 101323 190609 -119920
17364 39109 229899 180118 -40338 155024 265423 126849 -122062 214358 282548 61001
17353 135424 -88879 93892 95603 181349 -14822 193009 231115 217205 190886 -70857 -30279
17341 317921 509609 54145 66629 234676 -3957 47718 -12332 48060 182477 183882 104157
17330 104157 113333 491051 219544 -10489 164752 -142152 53502 79646 -21420 163099 182151
17319 182151 176108 48944 -137097 288384 288270 49758 146902 377319 343298 -93918 161996
17307 119834 347540 -219644 78186 192245 165086 220214 33615 368235 116177 242033
17297 242033 -111333 197275 431885 344386 131407 262609 167711 -179384 178805 356555
17287 356555 306238 56190 92181 58874 66533 -303289 68933 161034 -153926 463092 513859
17276 513859 201354 243031 432067 -25479 231213 76388 -11328 125179 164138 278916
17266 278916 -42844 -144242 114621 151276 215264 299616 321718 120850 -219885 202686
17255 336133 388573 -85492 267610 105392 195265 383317 333131 35624 110749 -176028 -140263
17244 -140263 547331 -3244 366969 263540 313038 19427 167055 80950 316123 54102 -71782
17232 247702 24383 341552 456397 -121017 496152 263368 65794 270479 169671 162941
17222 162941 79026 -366287 276416 -41825 241670 395211 292705 145652 87765 129954
17212 129954 142926 259513 112514 469728 333938 563802 198655 392854 337055 113981
17201 163907 291452 100640 208134 -20202 384489 342665 467755 357591 492970 395214
17191 395214 506045 447550 334899 106729 372774 213712 337498 237045 279271 177200
17181 177200 341561 488173 253891 627635 288982 146653 316361 -49982 341167 266892
17171 266892 238196 321302 172050 558315 396507 316717 93453 136977 126508 295685 524204
17160 524204 446469 549070 284081 478006 64512 119960 108722 227497 414416 317647
17150 317647 -119552 498960 255661 432561 397628 134376 319008 386004 291624 172099
17140 172099 -35371 103756 399506 519193 215334 960524 269945 154821 318696 278950
17130 278950 679565 444129 323297 430008 412034 323770 65268 408986 476767 74201
17119 500275 435699 -114391 256064 120875 213127 518833 367003 475582 375592 603414
17109 603414 102606 423469 298512 268029 282422 323348 137038 481541 423710 115188
17098 275024 490581 424902 693583 473848 232950 381361 584826 502801 204283 565042
17088 565042 614902 386860 178720 400433 466585 700831 319921 482313 622976 459168
17078 459168 300128 638119 446539 668347 -35577 478370 295834 191731 174248 299588
17068 299588 582516 280157 366251 664403 169745 409295 222562 365033 604100 740254
17058 740254 575906 648513 561910 317156 634717 599552 612277 507250 696719 544876
17048 544876 791281 660222 320341 665277 598368 511832 662926 503276 395173 392602
17038 392602 692122 721112 511932 515555 586654 181972 534979 673405 340405 565276
17028 565276 593801 708058 484622 662729 788976 517990 722770 326353 401068 831141
17018 831141 798483 582680 537888 499209 927321 714154 736461 511767 742057 462852
17008 462852 554551 618955 723010 867774 792127 805171 884598 353097 593349 810973
16998 810973 757937 716362 591872 706371 783328 606908 989293 702107 729236 791796
16988 791796 534365 921009 840766 741952 950577 690470 969569 1040371 992971 872418
16978 872418 891526 940233 1003684 892869 486462 667863 1201556 748776 727091 919434
16968 919434 987854 904114 1126413 1264405 1040456 687692 1093606 961112 1132219 1120226
16958 1120226 815700 1351922 1126885 1016550 817361 1178998 1077545 973336 907765 860742
16948 860742 827750 1298775 919492 1018162 1146364 1112032 1360467 1180067 1056705 1196153
16938 1196153 1129314 1376137 1459331 1022718 1237364 1130868 1259920 1127400 1053873 1003274
16928 1003274 1382357 1281402 1598252 1283910 1468447 1336047 1195814 1497735 1475598 1513288
16918 1513288 1530105 1373050 1381948 1441543 1559493 1426346 1469683 1648081 1733573 1828127 1497759
16907 1497759 1444814 1534591 1391073 1535213 1562304 1698206 1714300 1424305 1683927 1661071
16897 1661071 1824226 1641610 1995226 2148105 1545632 2016183 1972818 1880263 1746705 2152784
16887 2152784 1978406 2007209 1994342 1897525 1805408 2063320 2209810 2264940 2335817 2565826
16877 2565826 2215935 2216757 2664715 2641666 2262203 2641730 2449778 2410079 2524184 2423681
16867 2423681 2741719 2694476 2916688 2594331 2838289 2647545 2834661 2957159 2860305 2696567
16857 2696567 2916007 2995987 3158867 3020781 3138843 3078389 3315973 3210404 3001685 3221211
16847 3221211 3328325 3393707 3892405 3505746 3379955 3614647 3919002 3760701 3734109 4003529
16837 4003529 4174073 4179386 4512089 4169185 4570413 4348443 4388353 4713452 4595829 4364236
16827 4364236 4994418 4821232 4560839 4977653 5075525 5320347 5379355 5512952 5391995 5423699
16817 5423699 5376741 5656481 5948319 6110402 5988729 5940289 6444516 6269106 6342483 7055411
16807 7055411 7018207 6952838 7125555 6916044 7498725 8012547 7768114 7991471 8107180 8494633
16797 8494633 8777141 8615239 8937154 9153489 9318866 9213379 10178104 10247907 10519496 10563783
16787 10563783 10807328 11095905 11421340 11939951 12369472 12742664 12834664 13381928 13533555
16778 13533555 14067462 14166995 14802312 15425581 15661854 16497335 16894530 17301402 18032880
16769 18032880 18907683 19067016 19918082 20826738 21469747 22195021 23103980 23865552 25267357
16760 25267357 25898958 26946204 28070734 29180508 30466229 31661515 32890071 34208283
16752 34208283 36043723 37431427 39228437 40892115 43043453 45170998 47552611 49676547
16744 49676547 52297230 54622759 57573631 60489660 63966356 67169527 70812448 74736057
16736 74736057 79088256 83025462 87671807 92716865 97749892 103147739 108669819 114612027
16728 114612027 120306539 126468873 132423230 138628602 144899701 150372627 155837639 161378286
16720 161378286 165622150 169112630 172204018 174615483 176006457 176418308 175514792 174237798
16712 174237798 171707976 168246310 164504907 159630021 154544929 148829743 143194270 136793666
16704 136793666 130468842 124182414 118169701 112140804 106477877 100791394 94922426 90137217
16696 90137217 85122025 80791528 76102178 72012889 68442812 65092831 61047853 58196116
16688 58196116 55110629 52434215 49860273 47499385 45055381 43043920 40920183 39232313
16680 39232313 37419100 35685747 34221683 32438944 31127573 29819634 29171986 27436383
16672 27436383 26396106 25308572 24934251 23341014 22605645 22132673 21093132 20293675 19735709
16663 19735709 18954022 18178563 17482259 17021532 16634612 16162998 15736657 15037973 14772733
16654 14772733 14105809 13992217 13476452 13105493 12621900 12085984 11937282 11501284 11306689
16645 11306689 10680761 10656266 10556217 10139659 9438588 9590490 9302030 9117617 9236211
16636 9236211 8841603 8321094 8366076 8277723 7796496 7801320 7751102 7354254 7051851 7195042
16626 7195042 6495692 6676711 6638886 6328670 6300429 5979126 6237491 5999989 5753653 5684450
16616 5684450 5570435 5429925 5413205 5207789 5148257 5008616 4942301 4678206 4928716 4723536
16606 4723536 4506112 4640958 4601584 4511888 4309146 4408014 3979521 3915382 3801241 4063541
16596 4063541 3846348 3429190 3579873 3765693 3502523 3446686 3432599 3447894 3216583 3487704
16586 3487704 3580172 3298609 3096162 3351046 3002946 3001014 3047729 2841764 2876006 2863379
16576 2863379 2754580 2793253 2693388 3176285 2780928 2647878 2671619 2532920 2593493 2549116
16566 2549116 2493929 2310043 2580356 2372326 1988006 1986149 2356857 2470761 2162107 2401658
16556 2401658 2155928 2228569 2054419 1980242 2343947 1730871 2109235 1869991 2181806 1757714
16546 1757714 1732739 1845625 1670594 1828727 1678913 1647279 1668488 1789602 1558045 2001213
16536 2001213 1857614 1663530 1560924 1485545 1571364 1777255 1800966 1708507 1436190 1764628
16526 1764628 1430935 1506153 1394727 1287420 1523749 1713127 1482992 986530 1394057 1069522
16516 1069522 1404043 1338067 818510 1306516 1138523 1114975 1265131 1188580 1236882 1190815
16506 1190815 1192942 1135740 1117037 1163108 1362249 1203708 1329214 1314321 943552 1258117
16496 1258117 934765 1307257 1042144 951265 1054273 1015084 1311372 1262682 1464086 889799
16486 889799 979180 843160 643591 1022510 1331007 782543 858869 860901 1083810 583184
16476 583184 1029998 609302 647455 839474 902736 1010785 898065 799497 864808 376282
16465 874540 594063 625752 1098782 732889 1072372 945955 705917 1012576 602756 746834
16455 746834 835126 828206 865639 636813 611486 676494 483710 694541 1070319 464925 950710
16444 950710 546730 800611 660296 774757 533384 587482 1150933 577853 742675 771714
16434 771714 780456 836809 535834 644262 702575 743198 533879 618701 839537 727986 797697
16423 797697 195239 332428 672662 374410 398358 759929 516838 433744 678181 573111
16413 573111 466461 562525 740047 536860 818611 610369 338581 613497 719710 395665
16403 395665 413924 473804 220456 689691 687874 518114 448279 47739 688010 550491 570115
16392 570115 650323 481077 643547 576230 248389 254675 637903 676512 642475 570783 375605
16381 375605 208355 156231 371694 688480 393402 424842 177504 -51302 288128 533379
16371 533379 617396 457537 387000 356012 171302 195460 588263 390323 264792 571883
16361 571883 744627 260000 508644 726934 371113 79915 304860 576876 181081 806126
16351 806126 359789 434164 360010 659325 591858 415757 240655 443345 436930 465573 -32927
16339 420966 93490 301312 403422 174346 258927 410378 338307 495641 499805 -29955 193395
16327 118298 274202 388805 67911 404020 267958 529761 359635 260744 113437 319004
16317 319004 203061 -8083 166633 218647 632743 565223 514523 451092 424569 -166017 351017
16305 198374 31492 276898 250267 560524 386480 5520 375128 222934 270775 315276 409668
16294 409668 544728 103342 143560 349808 201555 186999 -278994 278828 323615 478806
16284 478806 169904 192016 328975 556606 429543 222443 153943 546074 231918 31097
16273 206763 16591 28470 72470 127896 312626 287275 231962 149198 266946 14533 166972
16262 166972 134817 155364 445954 212010 288152 -8772 158274 306308 248114 -71770 266906
16250 390737 344355 -108754 293212 -99464 -247074 446708 212127 171939 44708 68956
16240 68956 373908 328562 99299 -182000 281962 274188 92955 42731 23588 83482 128456
16229 128456 222274 188832 24116 389580 79384 48510 236144 336419 343295 12090 54088
16218 54088 57719 -168577 139149 294809 326998 496659 64535 369079 171723 381356
16208 381356 298831 61586 11126 45184 365386 257040 103909 -191050 -12979 184411
16197 204797 202220 407234 -78388 58035 185451 68782 134063 85380 165020 304148 232748
16186 232748 74687 351852 196642 175310 46968 288777 -48039 -11749 161338 182598 170022
16175 170022 -16485 -73030 -21844 118811 -80094 -112571 48407 -42997 266583 -128168 46012
16163 59681 348359 107985 452122 403994 63114 -101114 113458 86417 -20112 -62285 267094
16151 -72739 -48305 486594 -23148 136002 -44756 197366 12371 41418 174398 2628 230593
16140 230593 51491 5279 -176595 94857 131644 129096 64985 131003 207739 101219 -1478 194068
16127 -37461 107011 -93056 69863 406718 57491 20103 -28977 -394051 -160197 184937 61059
16115 -97440 -145374 -147941 140105 21998 148633 29317 -5879 171231 417950 178783 32322
16103 -4299 214316 -161789 -35668 -61553 -142426 -182063 319508 225431 -20481 22568 335257
16092 335257 -83205 -26871 -170767 -60674 108587 149736 254636 473323 315556 146145
16081 -35470 -152156 164733 269412 10660 -11199 199942 447812 269098 112095 -74689
16070 174221 -44529 22772 -30103 6764 151488 106446 -15050 -120421 -44224 -191964 58876
16058 109357 238885 91847 -23463 -398273 -64002 23100 -391982 328046 -35708 -272407
16048 -272407 83889 -18455 332061 -123438 -208821 344869 240457 -122194 -40320 -221489
16038 -221489 -114779 -26749 258036 -38267 -36963 19222 137361 56254 -158180 53539 -68515
16026 58402 344646 57856 84348 -23025 -12576 313654 -138781 -277895 33256 -121427 30590
16014 -192017 -107886 -62071 -152992 -80418 -71444 3754 -75660 -41673 -10312 171363 13995 -170790
16001 -195203 136508 198723 -9163 -97011 171797 -251849 -207000 55932 -363 -97744 -34261
15989 138450 -1739 121581 -195279 -153361 288068 -44876 303088 -146471 155697 369776
15979 369776 413879 234262 450299 -114990 -147625 286279 70490 412959 136155 99238
15969 99238 -146765 -91623 -229322 -239667 -30867 -80097 -204847 -72704 409185 -86157 35124
15957 145280 -83427 -124003 22928 -115243 -69916 -379571 8643 -73296 -134734 -343128 -137686
15945 31165 -37846 -142256 -232513 -34987 -174232 -45201 211391 21422 23655 -52846 -179533
15934 -179533 206123 -321511 181505 13439 285895 137275 197892 60517 392873 -127684
15923 -276936 252624 135000 157879 45435 -515296 -121218 104689 105184 -168316 215301
15912 -27412 -66782 -324477 -60840 20676 -175340 252754 -242065 -13665 239850 -132158
15901 67007 68537 138326 95918 15573 -21346 55204 -126116 -132073 -65638 -490141 193041
15889 1679 33493 48237 -1152 11175 171122 2189 269647 -324940 -22470 -47878 55150 -3421
15876 -200097 -108436 203086 109752 153445 39406 -246212 -140313 202990 -214269 -172593
15866 -172593 11115 -232306 -240908 -117344 -76184 -234681 69295 147945 -80477 -132836 70798
15854 83303 -143643 -228648 -383025 -104706 26281 -149604 176662 -70350 -95738 -64321 -124961
15843 -124961 -12208 198274 -220539 -242309 218648 19885 -23945 -55386 399706 -114000
15832 -501698 -62794 -297469 -139359 168273 -297667 -130641 120838 -223659 -30348 -192053
15822 -192053 17475 -41345 -198680 -69575 34745 -278309 -246529 -74886 10832 -54816 77530
15810 9280 -132248 116902 109323 -80880 -220945 -77364 -142543 -324909 -124250 -61131 -231447
15799 -231447 133961 49904 -150456 67920 1991 302461 -76641 237825 30122 -18777 -155498
15788 -155498 115227 239112 -23126 -57245 44337 130650 302690 115920 195744 -108152
15777 122911 287933 31918 153132 -229375 -104990 45205 152165 7729 154416 -120493
15766 214718 55819 -69974 -278724 -278093 245934 258392 -53979 -225863 -254443 205544 -74528
15754 355852 56333 -685 188324 -357015 92034 -13121 -156095 -223721 -6164 206104 51427
15742 138494 84533 301082 4719 110590 155960 218263 -240355 242608 264095 -336505 -102769
15730 -87148 -208917 -304652 -275187 -160387 514410 -87685 -61663 -180713 179753 -307218
15719 287054 -93857 -72721 135759 206009 -11810 -122368 17699 -64817 -132589 -181606 -310399
15708 -310399 -417952 -218128 -145404 140746 -177982 -214769 -17056 221165 -95217 -46747
15697 96633 -59279 283046 -155708 16887 -67200 -240207 102720 448240 -418066 -143009
15686 -369645 197099 -164563 -6984 -438097 -112006 16267 -45782 259395 -310883 -23122
15675 3563 -7783 28439 175644 -141378 -181191 -44091 -184496 -297910 -139392 125450 15689
15663 -8626 -106047 -18367 -315211 -236375 -5142 93654 -114764 273668 -180087 -6363 116536
15651 319422 66504 25283 -368996 277622 -280260 49503 12641 -189813 -449368 160925
15640 -217246 -265719 -416610 116002 -24320 -101712 34822 -77323 239182 54735 -225628 178491
15628 310205 96411 73194 -372942 176344 -163985 -219895 -73051 222755 43985 -141153
15617 381619 -98160 -18823 -21328 190312 64580 79685 170511 -202943 153438 127639 92779
15606 92779 143395 282575 112121 -33981 39485 -203940 109282 -32585 33556 -122206 -147145
15595 -147145 268776 -164271 -344532 -556858 -308541 -36585 -133569 -120646 -150984 12588
15584 255036 257043 -139064 -304164 -213907 183346 -210352 71439 187809 -108789 -132552
15574 -132552 162059 -100794 -34158 54545 -55439 101724 -86053 -176304 275848 104835
15563 -384064 155072 115827 315655 -225444 161449 180710 -114190 -238110 -46414 -29514
15553 -29514 -84329 -3618 -134612 242099 240214 50315 -81901 198016 -73590 94509 -262085
15541 -50475 -213753 139007 -1694 36252 169547 -120750 -209401 92374 -90348 -3772 196915
15529 -67775 10020 44443 242254 -202675 22951 -182091 -151208 -322006 -181136 -69702 189408
15517 -80758 -159708 31510 61022 127591 -8506 -7355 -244004 45430 765 -49669 11662 608 8374
15504 8374 86699 26769 -85676 10221 86546 -25846 -154301 111306 -16824 98415 105504 -320736
15491 -129127 -136626 -253435 31311 -73141 -198894 192111 253313 23462 -146526 448865 45257
15479 461067 39717 -49231 -41813 186707 46818 -94957 193596 -163420 133158 114056 -169273
15467 -130720 -105291 107881 12997 61192 -136005 184398 -281906 -66059 -151169 248986
15456 -180750 182792 -120794 323210 128947 105433 47194 -291774 -351995 26672 -185345
15445 -349747 -94988 39957 -337412 -74442 -178377 -370939 -2184 -110067 66974 206989 17680
15433 51067 23048 -99925 125404 412480 402471 51361 339860 124394 130728 -416704 21938
15421 9545 -333252 -65435 91853 28571 67933 31493 -79386 223591 -343600 -185200 104752
15409 47291 -33934 -46452 217305 -38565 23706 100641 -188750 -367798 213213 -270923 63729
15397 -153388 7083 23513 44397 -76971 -200388 -69587 -147343 -193383 159912 115750 -323133
15385 59019 -297053 128288 -201812 -152788 -111381 518733 -83076 -383670 -197286 -78446
15374 116633 -31247 113668 -186657 -97217 -52927 99217 -163152 -6481 317718 -184669 234847
15362 122673 345923 -186943 60699 74283 248944 -45320 251483 208823 -96873 141987
15351 -254750 64606 433929 379736 -215085 266937 35941 115347 -280889 -344801 166476
15340 71268 196962 -202709 149027 251394 4305 412612 85247 138587 165223 15333 -297396
15328 -37100 -119154 267602 37192 59469 -345777 -119664 225227 80322 -50616 76477 315961
15317 315961 -254998 118821 139199 -276880 127169 152948 -3533 -206471 277592 -52250
15306 -149299 199393 -137 -182689 27812 4265 110630 -98261 158302 117575 115782 135774
15295 135774 19967 378503 -171416 -80828 -94725 125025 52283 291139 52638 216604
15285 216604 -6418 105389 94675 165192 422522 153974 69201 203140 14348 242345 -111511
15273 18185 72824 71381 114934 185468 137700 35047 -129403 -434 7782 -9428 208473 -107964
15260 65034 286306 44735 123214 -19194 53484 -2097 153845 430415 155998 188690 259292
15249 259292 233260 188609 557093 688557 1273816 2284900 2644436 2354514 2176460 1608801
15239 1608801 513827 365906 -105247 148028 141840 45360 -22846 208383 -121002 303854
15228 20533 -56688 138349 -179611 374282 242705 117385 247686 369667 242544 -31536
15217 -238739 250022 33812 -91185 -109296 -126351 112421 186369 50183 174227 -56018 -8212
15205 137028 -171204 138860 201343 87902 333822 -163435 240267 5184 33578 93929 -181898
15193 -145197 125338 166109 151358 124168 34359 -130667 -17407 -56844 118235 141081 -207445
15181 -198476 -224444 127371 -143341 56824 126713 -81692 66140 250229 -108042 -60156 -175436
15170 -175436 166119 233170 258687 183460 -18496 108923 74574 129408 -11033 343568 -75658
15158 275336 463517 181033 307164 -212033 107777 163639 -157909 -172085 -183289 287942
15147 261738 321804 -171413 -30813 -219629 -51113 -168768 216653 -142405 -24309 271123
15136 240895 -9409 77473 460462 -144786 175902 394791 27479 65246 139035 187919 213731
15125 213731 -224446 290838 49334 270886 -128221 230632 324216 405797 235540 148087
15115 148087 260502 76635 71998 -154575 144729 142211 -4414 80520 310338 -25229 402128
15103 129505 331287 236800 40727 16721 286331 -23061 136416 137147 -6861 -171753 208156
15091 97946 199223 104904 58136 309711 277208 66635 -115116 43630 56707 -78232 61904
15079 70433 435850 310921 -53332 249527 36781 255895 335081 162320 104523 3241 107314
15068 107314 194892 146457 444686 -32565 238941 525613 -245630 -106488 525257 68930
15057 78070 80638 270393 309612 230071 540120 -17209 201488 200968 607120 -123516 142737
15045 310577 -167736 -137882 350360 -84969 308773 253457 168897 159290 174785 206672 254577
15034 254577 269247 178271 233611 111174 288120 166706 137468 185517 369136 447213 88811
15022 128833 370856 439216 374659 276246 515767 393909 160427 276862 -45223 225508
15011 39303 180892 171169 111721 595448 75605 -162774 -2871 228374 116494 228032 174313
15000 174313 -121312 138179 472940 360753 -110459 97985 327788 326581 611084 -1649
14989 186164 229576 292800 545681 -105141 278313 311515 469703 275950 91530 413422
14979 413422 109708 427306 591091 232211 629188 176093 228049 315641 415790 258361
14969 258361 104073 -87287 245654 291731 -18146 433221 366081 356317 -30272 318667 203110
14958 203110 206346 555351 621589 65382 66061 476058 13224 352478 481358 382479 -52852
14946 436352 628063 152860 84795 347007 287632 266456 300925 70137 321137 161231
14936 161231 76842 255149 358531 94006 424144 401388 578589 163366 256526 426741
14926 426741 301359 375785 203693 246448 320007 490999 -16187 175097 -53024 168219
14915 570749 364703 638191 458109 486032 259779 175621 284720 250948 -35095 84691
14904 420543 286795 273370 193881 93336 356664 160645 213438 176880 475264 461702 286527
14893 286527 251219 275664 139735 513641 380362 432610 403587 706131 217147 280857
14883 280857 566405 488301 376294 318752 509231 396321 496502 223586 192677 369407
14873 369407 384899 541151 167599 338520 499174 107965 397005 426575 394048 215782
14863 215782 571380 456699 755663 281379 843111 203432 313321 700819 489604 556022
14853 556022 288181 559627 530736 532622 515404 420663 459989 576348 175910 834155 135768
14841 371076 525733 382978 318627 468125 484697 521042 464910 612245 462607 111124
14830 310474 287983 560112 624327 366445 404018 518133 352519 688079 232820 520627
14820 520627 617069 446296 282862 350396 162216 290096 335584 545731 541696 482694 249962
14809 249962 466659 746562 778303 743910 524103 152611 555621 496312 350398 343531
14799 343531 352522 603999 384886 463139 731308 698687 350795 293140 861219 347480
14788 656440 161126 803007 543164 521325 502790 572921 310565 741556 685593 499348
14778 499348 818214 376402 608173 675225 783694 536740 540065 678288 624690 885523
14768 885523 350952 505958 463608 371435 583473 563611 650944 313162 589086 776711
14758 776711 543248 549789 554585 518005 801083 394999 766517 677251 421360 579016 760801
14747 760801 580747 476516 834452 210671 673948 643870 698525 758978 544928 588149
14737 588149 634907 548260 585048 1205638 800531 733468 743507 504008 896677 622178
14727 622178 892896 725086 498212 776065 795174 870386 947515 668040 618376 800370
14717 800370 654838 813812 729291 1050671 1088924 1105969 542144 488608 756784 930590
14707 930590 695595 561154 912159 861360 617943 796704 848269 812422 685930 1045174
14697 1045174 981921 808885 682740 840862 672239 1034747 1016886 988038 909848 745675
14687 745675 1036111 1099498 1120716 1017376 1056617 441373 1030599 1493780 1120843 851733
14677 851733 730734 1109931 846506 721795 692925 938588 755212 979581 916543 1069481
14667 1069481 685863 851085 887885 1130958 1125551 1327785 975371 1017872 1039681 1145770
14657 1145770 1138575 1101273 1187267 1276475 901509 969331 1158088 970684 1250218 1154893 1130033
14646 1130033 1197168 1423593 1152966 1159059 1323742 1267892 1108861 1175917 1238578 1189706 1425999
14635 1425999 1515996 1474033 1284976 1180545 1362690 1550008 1789591 1146616 1416666 1841924
14625 1841924 1216477 1480700 1319863 1454328 1662755 1653874 1458136 1399553 1420363 1225282
14615 1225282 1220979 1555801 1424924 1238904 1847885 1799414 1715277 1672355 1391797 1630145
14605 1630145 1807090 1409508 1806605 1520773 1865668 1678741 1676268 1563963 1894136 1703910
14595 1703910 1296596 1720670 1732321 2111361 1686382 1957150 1873059 1860137 1878933 1909281
14585 1909281 1739485 1770812 1821630 2096052 1860955 2085164 2042113 1824697 2190278 2277842
14575 2277842 2432759 1925818 2184966 2276544 2280453 2530743 2609959 2327118 2200013 2629366
14565 2629366 2473388 2710501 2254466 2423773 2470945 3038442 2812967 2950925 2876066 3218276
14555 3218276 3134098 3346870 3626141 4093252 4762703 6555346 9001499 14530427 23409841
14546 23409841 30789491 37142854 22268911 10100352 5938478 4824956 5700039 6323151
14538 6323151 4748865 2825327 2516025 1918794 2309183 2027269 2286792 2241702 2172271
14529 2172271 2080602 2180071 2116866 2190427 2346331 2377931 2723781 2433089 2363770 2548073
14519 2548073 2468226 2813216 2701420 2522076 2567734 3026949 2580114 2746533 2908532 2682313
14509 2682313 2679762 2786201 2850334 3190683 3098813 3007971 2936282 2886107 3041549 3265032 3194255
14498 3194255 2806824 3722847 3090782 3360163 3239986 3710488 3060676 3499754 3495749 3663757
14488 3663757 3390141 3700498 3749730 3308863 3351207 3788560 3568780 3923118 3776100 3826801
14478 3826801 3831795 3985385 4180776 4094985 4131726 4113107 4345947 4345431 4430942 4158747 4478814
14467 4478814 4376980 4503822 4274128 4290868 4597774 4681955 4802326 4598972 5027694 5039763
14457 5039763 4869257 4888196 4953268 5024293 5315934 5349325 5200993 5781524 5759575 5333245
14447 5333245 5468898 5355852 5599889 5629208 5669573 6032696 5885325 6304758 6396399 6617490
14437 6617490 6506878 7110286 6613122 6128650 6723705 6713114 6517453 7238293 6917503 7305795
14427 7305795 7054668 7376612 7268361 7326424 7705773 7702381 7542043 7961981 7974982 7793766
14417 7793766 8454645 8427160 8593950 8710479 8667475 8592128 8955463 9052334 8946738 9357879
14407 9357879 9649910 9591394 9710109 9920342 10267162 10152017 10480214 10243950 10576463 10553019
14397 10553019 11248117 11315927 11476841 11709576 11984366 11881869 12058951 12097497 12755933 12760400
14387 12760400 13240441 13259411 13499310 13882237 13838611 14131324 14170037 14871744 14686933 15264204
14377 15264204 15259487 15863309 16147808 16399888 16613427 17177453 17395130 17585649 18114010 18752056
14367 18752056 18814109 19361261 19864021 19906487 20516729 20637850 21124319 21878743 22136723 22605981
14357 22605981 23285627 23596714 24074121 25048495 25517540 26112156 26928942 27263804 27714436
14348 27714436 28446557 29272878 30300877 31031398 31656850 32382582 33448114 34152928 35311845
14339 35311845 36035638 37398952 38423424 39315376 40602127 41658094 42708759 44252661
14331 44252661 45580546 47006444 48424141 50127446 51569095 53384147 55263890 56827536
14323 56827536 58994228 60930336 62989321 65339695 67677240 70290075 73179509 76031135
14315 76031135 78676570 81664867 85123027 88491117 91931425 95992262 99711738 103991638
14307 103991638 108577581 113209190 118355149 123898533 130048073 135927697 142073210 149038000
14299 149038000 156305102 163975894 171987804 179988265 188736158 198422936 208435179 218896262
14291 218896262 229730193 241265156 253541429 266489464 279638527 293371950 307438295
14284 307438295 322039973 336529124 351276386 365992284 380442563 394691696 407832616
14277 407832616 420605554 432291241 442662525 450385306 453800105 451475034 447183572
14270 447183572 446312745 450129371 450640743 446574864 441299150 432787471 423113829 411382518
14262 411382518 398179129 384216229 369222083 353942172 338516350 323246200 307881468
14255 307881468 293232047 278739411 264902009 251792575 239126338 228018116 218082879
14248 218082879 207026756 196491143 186693240 177592494 169661385 161386653 153861384 146413432
14240 146413432 139805822 133234456 127672782 122338407 116903704 111751384 107196107 102553564
14232 102553564 98259078 94651340 91429424 87704822 84192126 80633188 77671174 74917206
14224 74917206 71937048 69483003 67094238 64716806 62842655 60487952 58616138 56781416
14216 56781416 55181039 53043433 51713590 50148456 48835425 47077936 45713130 44176811
14208 44176811 43233498 42011207 41122720 39332094 38701985 37611034 36582378 35552271
14200 35552271 34860880 34029530 33034757 32132283 31123224 30718578 29839371 29214934 28544136
14191 28544136 27745685 26850131 26324635 25468395 25197229 24315671 24011402 23469873 23109524
14182 23109524 22304639 22260071 21260582 20875855 20681523 19899326 19593657 19083979 18848361
14173 18848361 18270282 17854551 17557715 17570493 16913964 16792051 16326282 16211030 15792393
14164 15792393 15832444 14983653 14831672 14801404 14632772 13784187 13899115 13538272 13679931 13411609
14154 13411609 13180752 12761375 13062317 12614417 12091576 11972314 11606280 11505723 11689320
14145 11689320 11042796 11070392 11002146 10892238 10473096 10309421 10124076 10144484 9782547 9847190
14135 9847190 9579243 9589169 9216691 8992042 9364942 9049602 8734747 8714148 8463866 8480673
14125 8480673 8335338 8268073 7889216 8212188 7853456 7931613 7453624 7554593 7482242 6963960
14115 6963960 7075451 7159652 7169498 6951611 6949224 6753350 6926478 6901924 6610299 6824467
14105 6824467 6245718 6152626 6012784 6084369 6266473 5986730 5966870 5942763 5975940 5852994
14095 5852994 5946040 5633588 5288300 5347913 5581673 5599270 5141012 5445935 4930628 4973126
14085 4973126 5076924 4920595 4913822 4873915 4949564 5009439 4713607 4829433 4632438 4836035
14075 4836035 4486894 4424857 4634840 4358821 4617814 4363177 4335802 4413665 3983688 4219869
14065 4219869 3982720 4436549 4338417 3613538 3929891 4071046 4143476 4086790 3814619 4074670
14055 4074670 3724081 3810760 4014268 3470985 3620814 3683843 3501168 3690675 3707223 3318583
14045 3318583 3470843 3269933 3248455 3182210 3408713 3592026 3019725 3040485 3037887 3407848
14035 3407848 3134803 2633573 3077320 3342651 3050553 3125951 3215114 2905889 3110210 3123855
14025 3123855 2520629 3088608 2937051 2910619 2767418 2675747 2536026 2499300 2632709 2508179
14015 2508179 2692023 2660014 2752651 2604777 2463906 2357246 2295712 2572026 2344568 2664994
14005 2664994 2129914 2447311 2422214 2162380 2357888 2251046 2435685 2326414 2155803 2334009
13995 2334009 2245668 2101963 2482179 2634783 2394327 3106707 4505391 9875454 17959929
13986 17959929 26290761 36679244 27942808 15234856 9260875 6394932 4893477 3981383
13978 3981383 3776269 3675140 2974255 3143633 3077000 2878937 2626309 2851274 2561488 2491716
13968 2491716 2589159 1947139 2481544 2535745 2220202 2213605 1808833 2113927 1894293 2279029
13958 2279029 1793692 2051782 2111522 1814434 2019703 1885129 1993959 2247419 2038794 2172591
13948 2172591 2058855 1976212 1904731 1688084 2078886 1966203 2047224 1733925 1527167 1660044
13938 1660044 1784328 1880436 1549704 1857357 1990254 1725640 1869629 1652332 1662489 1536525
13928 1536525 1659733 1393787 1409597 1705525 1724586 1293745 1521338 1659545 1748329 1439158
13918 1439158 1543362 1686453 1481923 1529400 1567153 1472184 1376516 1116172 1366476 1580339
13908 1580339 1412593 1179920 1354391 1405613 1560107 1395922 1554945 1597351 1428228 1450469
13898 1450469 1542531 1231891 1560427 1125130 1193771 1257685 1460927 1519579 1447667 1177574
13888 1177574 1449223 1103543 1337163 1002094 1015099 1309363 1340842 1371423 1031783 1470398
13878 1470398 1072856 1227380 1419030 867912 798947 1219094 1068238 1322918 1144064 1234813
13868 1234813 964826 990719 1156722 1223185 1190241 1212569 1300532 1407482 1091078 857259
13858 857259 1201716 763081 1190914 1360995 1007286 1121207 1203432 1085010 617746 1125782
13848 1125782 450281 1304098 1102783 1039209 1126965 1086776 853722 506754 800732 1438049
13838 1438049 808563 815167 609417 1047994 962525 948645 471327 993954 737416 674209
13828 674209 1076535 923954 816452 1118894 813652 1097376 674182 537851 799353 669799
13818 669799 1199815 591918 559492 833105 1003953 601742 732508 764042 714936 661158
13808 661158 826934 1006791 612427 858448 935645 889974 902630 768220 740856 618672
13798 618672 735158 1210910 738188 758043 912583 618482 490737 974863 1105322 1055226
13788 1055226 426561 853425 633270 760299 394161 585816 518509 911916 664453 925826
13778 925826 806631 817652 542011 505740 930939 959327 608327 795066 737032 632518
13768 632518 761180 883819 296314 576010 799893 611311 897211 592570 521201 436062
13758 436062 969206 646468 682056 485071 576856 774484 815246 731430 538977 754359
13748 754359 610534 655475 300625 570799 359171 449012 508215 565344 447276 845328
13738 845328 590908 570569 743571 600574 701743 601685 512994 506474 503332 428489 450681
13727 450681 635917 826575 654819 674247 490488 634209 638749 521415 575761 491374
13717 491374 556969 335470 617966 680298 388506 418329 575055 701444 736817 589069
13707 589069 356236 394905 812334 583690 370472 572310 416509 503275 277577 354929
13697 354929 545340 346990 449459 656693 525545 512215 592619 201849 508530 377144
13687 377144 470604 613927 512683 635132 158474 448147 510869 634018 386216 587486
13677 587486 967967 284208 675490 562778 614807 469125 483774 401826 542080 358595
13667 358595 178260 402584 208442 606014 348499 483687 451620 443115 540717 340749
13657 340749 760645 407580 596357 422893 462139 571922 236983 442504 500738 373921
13647 373921 602807 587590 530615 574560 464144 172511 394800 341139 527208 336638
13637 336638 528323 176507 452417 694618 642240 479609 14952 269986 287820 261095
13627 261095 160576 298839 548755 227409 505240 332813 270130 235006 376377 502720
13617 502720 488238 439342 674583 390140 238491 508807 687678 389155 311583 120831
13606 209424 235387 73179 618191 190616 576578 -42549 591549 460133 461992 271173
13596 271173 524742 589468 283751 466126 596950 277771 152415 77396 188111 109971
13586 109971 439771 383020 154071 405324 339398 498520 119352 279056 614351 530033
13576 530033 438832 558758 200286 -16813 346158 226982 44476 234119 393106 334081
13566 334081 288009 285417 270007 233348 201446 170924 636328 170234 -57748 502311 478095
13555 478095 372356 17533 162425 341487 392255 696172 11991 396201 417391 424277 264722
13544 264722 381358 415073 108920 317652 278281 143097 395405 348859 225348 563706
13534 563706 533716 243687 408786 -24269 208757 126040 157735 356834 -153003 183187
13523 256260 216967 134550 94831 464401 286402 444629 356358 355143 216606 212833 115823
13512 115823 311228 41233 451006 302223 171992 99282 434626 242073 384493 304131
13502 304131 146355 493359 179546 320432 311768 475604 252975 25585 456712 -87938
13491 234218 283440 340819 131000 229413 312357 249666 261526 562787 293266 -9511 306239
13479 340761 178782 -131495 380543 273166 523915 113343 171172 -138044 408697 362805
13469 362805 129561 -57423 295737 46039 246448 199570 73606 306565 123051 132727 223834
13458 223834 5783 127624 116657 -84805 127905 -71690 101539 157400 659152 215678 101475
13446 185547 356421 121664 -59059 237766 -59620 120786 281860 471795 237736 523082
13436 523082 130847 295983 123021 218400 283468 102655 -26646 357510 508465 141819
13425 201149 275780 174486 345112 410167 206401 41895 314295 93407 -80094 163976
13414 -6221 207740 555449 329961 166423 9458 91496 505302 -102112 292394 94348 37617
13402 68462 203755 108600 -59330 369463 153104 72047 229961 267328 235052 447186 5400
13390 220616 100489 38920 47063 -131178 152875 180780 112050 170211 387832 278625 315684
13379 315684 333916 144750 351448 308993 -61568 280215 115626 309278 121617 251166
13369 251166 165889 233985 20347 459221 91175 7234 211180 151869 -7778 125888 -20134
13357 467713 10094 155613 -25862 209114 354630 413352 419795 53267 395622 156105 371765
13346 371765 282451 352457 44591 1985 410579 137216 228763 432299 -16708 190641 162980
13335 162980 127596 4150 208576 150723 231480 91227 312136 122516 231787 298499 341465
13324 341465 59255 49589 105522 180004 501595 273644 165513 295890 -54092 389554 -29932
13312 184993 145209 73848 242135 173210 299504 246222 167404 219179 377636 145149 353238
13301 353238 174018 86446 158336 221645 63498 122956 52931 146992 317517 268643 -1736
13289 -79228 202228 41588 84092 206757 23402 63069 310949 467096 387213 115529 -97025
13277 -13325 -11423 480791 112283 141212 324505 14277 145775 167333 128501 -49911 454684
13265 -99283 -89920 -202194 -64091 294165 198320 239369 76684 277556 319840 358567 119558
13253 157108 -2681 49093 -170102 -50879 -219700 -188554 311707 -171770 177989 80677 482879
13242 482879 60880 50499 205672 -187178 217909 150170 208169 -172366 -204612 130345
13231 -134578 139290 -70847 56180 -10021 87387 -17384 156224 67000 52450 41181 12121
13219 257701 52443 -104867 -5625 97403 -300487 -205666 349191 -20828 187254 142708 -59324
13207 275733 426634 324547 206260 -276456 202082 -86561 -117014 214416 237971 31730
13196 359236 58903 244283 84023 109878 232993 -18639 17199 72008 454534 -80408 347572
13184 -49284 -38904 135083 -49326 159520 341191 90501 94084 -18896 87105 317043 329288
13173 329288 -311645 227963 23683 56789 460473 -36223 413928 -179650 143140 -265146
13162 161963 -136667 90284 -296408 421835 -67561 11666 501992 161275 -5363 1853 145001
13151 145001 -52091 -102061 433654 -202684 56673 -53038 557085 266297 202571 106008 241734
13140 241734 85291 107764 82862 -1816 248393 304126 112186 -126553 103716 82475 -10710
13128 543703 16635 181716 125276 187799 111820 52050 162962 101107 40150 157081 -225650
13116 -214791 -90274 -75267 88020 15204 78931 259643 -77414 292861 19158 -47055 19686
13104 443593 121334 -19966 120083 221662 60069 -168905 44847 -247074 424288 -168646
13093 74852 192868 248758 122939 245934 138954 -189353 -299109 301567 359410 70386
13082 306982 -363237 -225466 355664 515918 133016 -43466 286780 -194116 455371 -3247
13071 263773 36402 256402 60182 -43179 89398 366226 260373 6275 -78739 346251 367920
13060 367920 -75539 -203509 137174 80012 -286230 -52736 281226 321371 239259 252465 19998
13048 350311 161293 145201 -31707 -239748 111819 368384 -229556 189671 -37076 107973
13037 232078 183037 256137 72014 2670 -25432 -87731 -292984 19849 -35624 568892 -96606
13025 -205361 -38359 156736 139552 -70949 112726 161186 530229 -83581 307797 64396 93272
13014 93272 263587 105120 -42019 377355 13842 110564 -74565 137122 -137777 -131156 -32278
13002 46495 -43141 100202 -47896 77950 -109706 344444 -124490 -88165 242730 -2363 308910
12990 -73660 371364 217536 -38556 -77367 18803 386367 222530 222449 -141887 9146 -15518
12978 -14027 239942 213542 156554 -98956 111885 -171997 -175378 80055 -45307 -41363 201759
12966 446220 -302830 346310 -22243 200009 -459236 490513 344454 -304561 190585 330318
12956 330318 220431 36727 -74595 114514 281065 146004 58398 60122 20846 82121 76884
12945 76884 101718 -195892 159958 -35972 -130175 92059 216997 305321 -32006 96374 248066
12934 248066 -144455 83162 183748 190010 185624 -127939 -54158 107400 352373 32106 41118
12923 41118 136969 5754 -78972 73452 54533 -61017 77305 173088 -8164 152887 111942 -75003
12910 65649 26864 -158116 -210288 241399 70384 47994 -23254 -18710 135870 108641 -63780
12898 144053 -148573 357122 151602 -67535 -115154 -160071 149196 27078 -83458 234829
12887 -5376 -21605 170456 -217900 316683 -187647 -394567 63483 -56690 -393204 292996
12876 110710 -71828 20467 169032 -158880 185225 302019 52698 117805 134156 -22229 -112046
12865 -112046 54134 -192158 -306308 47511 -116231 65278 -62231 -384598 -135570 158142
12854 280626 218937 -208194 -251107 414812 15173 70240 141435 -104740 34850 -154870 -385975
12843 -385975 -202549 -47752 -26163 110075 184963 -76356 299980 -195367 -20185 -271750
12833 -271750 -71770 78742 -240640 -87406 -400293 -135808 20900 -103286 -59806 124089
12822 255459 210906 -74241 -142841 68170 -202161 -184729 151827 298632 177388 396941
12812 396941 -40779 -2917 -50413 104018 147017 55266 36640 -78155 180912 -149546 -288829
12801 -288829 -156282 285826 -70432 -50831 -128494 31990 -35852 -18513 -60832 39284 421407
12790 421407 -22858 12701 -19621 -129506 262741 135067 -136992 1878 -202587 99111 61930
12779 61930 214047 -699 35647 -153440 126816 318843 -313162 134258 -19934 50046 -226357
12767 1246 280674 119182 137799 24609 -325824 -222947 330523 -364675 36450 197784
12757 197784 -31575 117244 121088 50163 -81803 -29251 53406 509848 32393 -110650 -50686
12745 -175406 -141589 258740 95242 75999 139140 -112234 -95230 -146439 -3530 151717 -83633
12733 138079 417251 257219 -6041 -177775 -130545 71313 250802 138950 -141814 -110451
12723 -110451 35034 -435951 71911 25298 24313 -147758 34167 79259 -265043 -46126 -27790
12712 -27790 -21612 69001 -128780 -186761 383322 -37182 301088 270990 -245169 -35125 132966
12700 257737 -7210 405964 -219 37317 71162 78281 -50158 151711 224123 20578 363617 167736
12687 -57473 78411 -213857 -58104 41575 -74474 -390421 47619 -221931 -74574 -11201 41046
12675 279985 420377 -19975 50150 -9409 132145 10800 168184 -57194 367330 -89833 321268
12663 279567 179239 238060 31090 -221416 16357 -11161 20076 98680 245295 -12788 61529
12651 -72244 40957 -17495 166584 93161 207571 -264678 -67956 -80026 280020 25124 273447
12640 273447 86703 137598 40359 427167 31933 143346 93456 -9495 228256 -45614 50277
12628 72901 -168697 25932 387428 412557 -33266 -12694 593233 87654 293618 198875 23950
12616 115497 93563 -260786 81927 -178044 306990 -126726 61993 -97957 136351 -145992
12605 -111279 68420 -259719 52925 -114538 37106 204653 247117 168654 139396 -52388 -118564
12594 -118564 285632 57015 576291 65229 9112 128038 -32930 311348 -8121 -147063 57071
12582 -114621 -65043 -200174 -206387 173577 97184 -85662 -50253 56457 15548 321271 135970
12570 492967 -201556 163619 -156670 50392 153062 85983 6226 43819 -280725 98538 177527
12559 177527 -32725 -91226 50184 -236939 -158260 -13537 68991 -146533 18941 253902 -12001
12547 272386 -7437 -89108 -230409 -98335 -139421 -109048 -150608 -133058 239283 567543 -35688
12535 113569 -116684 -28104 134686 -68212 103064 -150801 -244875 -206733 47295 -57125 -20850
12523 -189379 -114663 -80849 -80836 229187 174120 -21559 162556 29164 237404 115248 65267
12512 65267 170276 234919 99225 -104197 135444 -355265 227064 386617 -153855 52396
12501 203918 -188434 84439 -168494 -113560 -16450 -8258 -64543 63502 -69533 17427 82133
12490 82133 66754 112700 -61286 -40150 -98173 -90731 169180 -194925 142971 -367302 93740
12478 287846 321513 -231314 -111564 -89046 269671 -123438 149773 -113891 84580 -103500
12467 -86798 308838 -139543 45994 -234797 180116 -125147 145564 -260660 106983 -137510
12456 -33268 -27490 345355 -6842 78587 -6554 132842 -146872 -29353 -252809 -166346 285178
12444 372543 232889 20725 11916 -58400 -171144 -38103 -167875 -192558 -67151 35761 -237455
12432 -124518 24117 -85162 -116227 97811 28852 77106 -55209 60423 -145315 -78339 70794
12420 90965 -27523 403017 -52990 77510 -326847 165457 90956 45042 82502 -153528 -243741
12409 -243741 24283 -92440 -145623 -24881 -196805 7313 -49086 14228 43735 119820 -198018
12397 88552 -8057 -238752 -160499 272846 58332 -226226 143946 -93667 182280 66280 -227739
12385 41043 -337125 78348 -163013 94577 128683 51750 183505 78160 -229766 141756 -63312
12373 -132765 144057 154568 259657 224941 10212 198070 -471491 50702 -158990 322143
12362 -48216 -75284 118765 -67401 -77425 243164 -46465 56001 258457 35443 -16829 261714
12350 -21550 18116 254748 160650 -16591 39295 63889 186928 -68521 408846 79211 376685
12339 376685 -140820 -102852 -42447 71763 -16104 266418 327784 60782 -228436 65169 -389754
12327 128428 15642 -142278 37330 419904 -52492 207492 -194836 -163314 6939 67828 137247
12316 137247 -11409 313235 314197 96921 -99076 52479 95711 108973 130020 293528 84614
12304 165916 -4848 34542 -68126 -106450 -108117 -135642 86082 10176 -193257 -48184 -29596 -42227
12292 -42227 -122641 114093 1018 -143786 96454 106102 -272131 -194778 44649 -92995 -228776
12281 -228776 -58861 -78653 61867 -206312 -33717 80074 284429 374692 -62451 -28377 193061
12269 -45251 58231 -186150 200562 -31115 14918 -86320 -98270 93437 200522 36984 -154567
12257 31806 -243809 153615 63962 -139113 266829 26065 26605 -55294 -25161 42114 110237
12246 110237 364165 -50901 26643 52178 158643 -18004 76366 65428 142815 -166290 -145841
12235 -145841 209698 160014 169591 -2301 12494 -105766 108745 92331 348758 207191 -44608
12223 -14024 273257 -159495 170438 148517 145738 -51395 241215 296525 170254 -58835 138020
12211 178711 187053 -339330 74569 -120394 244394 47086 -54607 15286 29000 -9281 221475
12199 -36885 -40443 242218 -116960 83218 181028 96748 156716 84013 -77962 213033 446312
12188 446312 219535 113470 -889 -309875 239434 262171 204394 -41744 213842 18442 119315
12177 119315 201165 81127 144094 -119268 117976 251746 -248098 -36990 555417 361226
12167 361226 -273831 -88718 -147734 -35400 198066 164109 118191 178894 298252 32397 282745
12156 282745 269065 -66328 82632 216250 95319 413384 2143 -104728 213725 312330 248034
12145 248034 178372 -53276 99133 -184334 132619 -12197 288139 323927 307799 224739 323604
12134 323604 -197747 -234170 81412 -272692 78578 -192175 -165696 48807 48326 377636 457665
12123 457665 -64684 -94626 -30117 -177954 105182 183377 -339227 -82916 16953 74680 267528
12112 267528 339131 -1137 30284 219107 -130273 72661 -27214 65960 8016 -221896 185808
12100 171422 17060 -64401 406198 128722 307330 297871 96398 -141401 -410616 -225080
12090 -225080 49399 124904 81839 399260 103005 -222862 35966 -79284 48664 -114171 -37135
12078 320413 -143197 -62576 -71927 -201914 141318 -145837 -29667 -89964 -197279 -32788 -71151
12067 -71151 144342 -314547 -40449 227579 -87533 149546 -11488 97170 142398 74116 -271718
12055 1272 20989 248343 507805 555683 1411720 382585 87387 110954 -155001 -42838 111521
12043 107530 -99307 61675 215759 -74383 -31736 -425987 477707 -92833 -8648 -34872 -223242
12032 -223242 110009 23151 -240940 178877 132872 -63785 186390 50902 -133781 -113145
12022 -113145 195227 63262 38547 77225 41420 -12125 74217 155670 25378 -205006 -271434
12011 -271434 -113198 -238452 173204 -173348 35824 -134269 -278355 -188573 -23627 263641
12000 183797 -6304 -135306 -199366 -161552 3770 -30417 280015 -85184 83438 -300384 -136927
11988 62220 -260845 343305 -89464 12993 127646 57096 -43070 131018 -76408 -147344 147827
11976 -156826 -64126 -194088 -26187 212776 316691 135108 -290244 -146794 52756 198462
11966 198462 60628 100599 -378090 -22332 -147174 -11187 -306738 269364 -328921 -245978
11956 -245978 -108812 22558 68456 -132306 -162083 -26742 127703 -80572 -4583 101643 -60634
11944 -99697 -570252 -51714 -234822 237415 52914 34956 -49499 -359835 -103028 9966 130168
11933 130168 -84630 80382 259735 144202 -94022 155761 -144278 125133 -137998 50311
11922 115962 68610 -270770 -163274 -185593 310584 -42723 -195675 -54833 44273 54639 17095
11910 -17703 -12425 156690 48027 137598 117436 209539 302902 34959 389991 -98525 -128104
11899 -128104 -23854 -89583 -135973 -306031 76500 -154621 153533 -107193 64130 -13075 130107
11887 6579 -315067 85929 74008 -215967 91589 92471 21063 -96911 -254327 -116695 88912
11875 -29648 474579 242282 -170535 -39307 -179362 -64586 66306 51174 174172 22068 -232541
11863 -145728 -27668 93160 147725 45866 363389 8914 211684 82358 156657 -170693 24739
11851 -135350 -57834 40351 -215083 -71289 -26405 145375 -347598 -445030 226036 210945 -33386
11839 165967 111488 -331986 -188067 -20183 32322 -132857 144374 -11878 251830 24125
11828 -301968 13591 -200006 -315054 -106226 -55381 -178339 -86335 -201171 -287618 -76160
11817 -149981 139112 32331 -184362 -142571 -132480 -66829 -78403 33875 -229322 -134448 62428
11805 -68226 -31078 -100139 -110065 -207465 166412 157309 -228807 -49247 35985 213002 -47248
11793 -111239 347715 208608 38341 -6448 83917 100467 53510 -261266 -80943 -104965 140543
11781 -148630 96537 -279647 -317132 46356 -359885 69154 11312 24134 109599 68417 -219377
11769 70506 82546 -151545 -6848 -144213 -254168 179192 -317175 -148864 -147569 -238437 -37709
11757 112866 98445 -135615 187648 -78801 40599 -145694 -111914 -166498 -223524 -366771 134296
11745 -125038 -180233 162992 -297274 -111806 -89452 149104 -56754 -22573 -76492 18034 -312488
11733 -51558 -237127 -218734 -263150 135271 10923 -260240 -65650 31732 -196935 25468 -120019
11721 -59903 -208923 114764 -148713 94685 -280975 271741 -115383 114976 24593 -78996
11710 -67112 -117254 40021 191605 -317328 -119337 186793 -6915 58868 60058 313099 144538
11698 69643 -144583 -40488 -104525 179929 85932 80391 -20488 -92035 -93691 35361 -103204
11686 -33026 73123 -59795 -181779 -538486 -91213 -144289 -256018 281824 126011 44731 189455
11675 189455 -152818 158750 5620 -407284 -54037 -43170 -121305 -513414 115030 221054
11665 221054 312984 2011 -116349 -208554 -167545 -274297 -113466 -30092 66761 -109822 43362
11653 -388231 -173069 1524 87405 -49839 -92327 534238 84594 13873 169390 -108873 -75128
11642 -75128 92873 -150119 -32551 118144 -118020 -132913 -118861 183086 -67428 -101061 179066
11630 92519 427498 157082 21669 -84579 243895 -349913 178743 111666 -297131 170121
11619 -415607 -60290 80348 -121563 -64595 -179810 175428 -258755 -11340 104307 60925
11609 60925 6373 -331931 14871 232523 207286 -114621 157502 162394 30407 -126196 -272648
11598 -272648 110388 294302 42920 -259740 -9673 -13370 -75347 65301 -400790 166442 -2160
11586 -53072 -215930 -107750 -84615 -16042 -49104 194192 -22478 -169086 -26540 301346 -79388
11574 -111381 189126 -206228 -49705 286909 -117120 142478 140148 150612 73823 49769 -49525
11562 -264847 -146935 223649 164537 -267833 326970 19715 -31074 163186 153135 -156495
11551 194687 -114408 -212919 190385 -9836 80041 104584 84527 -148096 144759 -203693 -1681
11539 245059 272127 -296245 183992 68929 -60259 30164 -310986 108160 -134024 15778
11528 -35050 234501 326339 70258 -261335 -143649 -189043 363788 -12586 -232698 141008
11517 240088 -86980 -34714 -288655 -488 36627 -65819 179788 95630 45487 88620 -48476
11505 -139971 7240 19219 -139552 27411 198523 435920 313205 184013 -36286 400442
11494 86830 11137 26186 77898 -171870 -111112 159834 62711 108573 126953 -404268 214636
11482 97365 -84426 123405 242841 -88643 -6306 335340 -320027 118925 -13259 109829 104054
11471 104054 -29007 -24546 173197 193884 22266 -204097 121223 87531 -6401 -37056 140092
11459 84853 53891 -115313 -16878 115738 41385 -147532 -202033 184647 89643 236709 -337155
11447 -336428 113849 105990 -137342 94635 -99778 1673 -87455 -52197 -277933 95120 13033
11435 48120 251671 40915 55322 53372 -333701 -205664 -118046 -308910 -251995 107175 -279893
11423 298820 96838 -101067 309527 59032 137782 114983 -175350 -34004 -385192 -100099
11412 -156010 32672 44600 206007 -212928 229747 19864 17002 -107969 101867 -203155
11401 796 191689 48804 34877 48937 68455 32544 28208 78829 -153477 81309 164403 -238834
11388 79005 10089 22817 -325950 -46219 359681 -285618 -34453 -143265 -10578 -20730 -8787
11376 -11833 293097 -50099 -164585 160330 -71236 -33792 72939 -25838 -98478 -292376 -431307
11365 -431307 113382 -32841 -128583 -86769 55171 55321 -27348 79595 -20348 -186692 -149393
11354 -149393 -148814 74847 33058 -349206 -266278 -106269 138537 -32862 14335 35897 99218
11343 99218 154218 78370 -25841 -50405 221641 -77959 76483 83563 -157517 138546 61571
11331 -386882 178005 193107 -56726 74502 115335 63723 -264475 45108 -61164 -280595 -247770
11320 -247770 -89046 208039 -135580 -313828 133236 210540 -139892 41469 79237 6827 12873
11309 12873 -209027 -84777 -3153 134822 29559 -27925 -144219 404315 -60069 -210799 -201904
11298 -201904 72298 211897 -215978 -136868 215784 -55365 -43085 -58675 -126386 -56575 128839
11286 -176085 -163095 -37784 182985 -18395 -407429 184874 4467 33694 -138233 283043 -133003
11274 183373 75790 136425 -163009 -155665 -308351 -113011 225032 -219480 9033 -184921 56365
11262 -51548 40659 169339 -103868 -68208 118706 251266 60050 232407 165107 39147 69396
11251 69396 -140118 367530 296066 -147884 208839 -86333 -242992 128756 120802 25653 310173
11240 310173 -95953 66791 -243502 -208177 -268760 88339 -49909 -303697 -102302 -173622 -116479
11229 -116479 43218 -11560 -370268 -51612 -126634 -168880 116260 -84664 137747 217238 80339
11217 -7687 -6175 292141 68884 -193387 -179201 208881 -152452 -77455 75894 -145019 -21109
11205 -307436 -13452 -331533 42731 -155744 -53580 -30229 -216497 -141100 136756 -81005 -278798
11194 -278798 -118464 -239385 55946 220640 154058 -104104 -124888 -335246 -183234 -153132
11184 -153132 -2734 -422558 -13250 114920 -175865 -49040 -298287 -192236 -31853 -157620
11174 -157620 -43301 57966 -54568 32313 -369 -170703 -154254 -116278 -208978 29064 195260
11163 195260 -35470 118043 71749 -136576 -112863 -133801 183076 140649 140200 -309626 -69582
11151 106749 -199469 -139775 139195 92834 277892 158371 28083 -234118 424898 -121340
11140 62100 -159281 -32552 -179850 60700 53765 108626 75427 214518 36819 162767 -296324
11128 24798 195431 -420022 44276 -176520 66702 33272 -222790 -296461 205258 135896 -219165
11116 -93838 254972 -81100 -297028 106806 231585 -352343 -156939 -59223 43332 -112270
11105 114719 -129139 -56880 -27162 106539 -90339 -111736 123998 -24596 85466 283172 280905
11094 280905 -16022 -106211 143746 -232569 169121 -9926 60524 157537 132698 -28727 234904
11082 117542 -174021 107857 71958 61900 150367 -90203 427116 -375591 232791 213553
11072 213553 119747 62300 189533 -32801 404719 -66298 35706 64898 245060 285293 2796
11060 593709 312469 490794 187643 756704 48949 585155 137172 473545 324412 411402
11050 411402 419629 624318 853581 611793 214117 572881 1010516 358562 626546 522483
11040 522483 970025 660742 321206 561558 646747 506316 758121 485187 502871 518111
11030 518111 336695 149957 494197 760680 227365 545300 404303 523927 762666 326500
11019 508068 117378 501383 271776 487954 388724 675434 336544 136728 420303 86495
11008 654884 718949 722125 417827 315008 547254 717781 469699 356187 358559 866485
10998 866485 472090 209095 279508 603402 400380 524676 201414 669250 292437 408245
10988 408245 452211 255205 537765 448912 346647 616087 499585 693044 836914 760278
10978 760278 795524 1424434 1285509 1429998 1797274 1774054 1767877 2056194 2068650 2171719
10968 2171719 1777559 1804330 1572784 1684071 1452276 1065442 1336142 1397748 680272 912045
10958 912045 979322 923202 892190 778244 533884 566412 716503 582492 330002 229134
10948 229134 406508 112433 171029 245120 562334 273754 135968 34520 187881 224239
10938 224239 93943 192714 83302 363109 18021 265319 14784 211773 120066 -87370 -8890
10926 65613 -424311 128746 149437 59481 6515 117790 273123 -146598 -162796 -120681 4375
10914 -407629 181458 98155 -54184 18819 -41523 37438 59647 107662 -79519 -278446 -64874
10902 15199 27869 68278 -315731 -205516 120226 143283 91521 -24165 152659 -382293 74487
10890 -157233 14930 -196995 -29198 -60766 -81325 165873 159868 6464 144977 -114589 -45603
10878 -536 290228 -110655 -105130 -80000 -88343 26165 -55322 69576 211166 -237093 223814
10866 -135583 -99142 -87476 -45307 217527 131494 39067 34713 -222038 -348928 29821 73217
10855 73217 205402 -135600 72706 39918 -185500 -185873 -7656 -2941 70463 -312562 -232836 30292
10842 122731 115387 -133985 -27308 51928 -223055 165797 -203738 124429 284143 63517
10831 -257285 -204227 -63211 -57820 -68628 -143914 130431 -200064 -64671 -395760 -157452 413811
10819 66522 181977 -39472 -121787 76180 -58847 -39550 309737 -33780 200010 -103105 -42393
10807 -16076 124268 41204 165549 100071 152554 104258 131650 -21478 -31947 -167502 116944
10795 78697 -2099 90261 242252 -101311 10814 -100068 101219 -193812 107563 63687 262266
10784 262266 264164 -253897 -145668 42956 -141397 -261832 266427 131130 -165876 124093
10773 -92401 -120987 140827 -236056 118338 44759 6450 -185400 252652 -8313 -57181 -56992
10762 -56992 -205599 -10690 -70905 -98945 38077 98591 -109414 -296470 -8587 67985 -177145
10750 -124082 -233317 -112066 -65891 196861 256209 -355155 -20195 -91019 -93954 39040 -160631
10738 -315956 -208311 -19944 53682 -208360 -440913 140237 -167578 -137963 -144875 66603 -214897
10726 192111 242817 170586 -186855 -256597 -217210 -171988 -150698 -216734 -21206 -22218 -82808
10715 -82808 -13901 218560 -262511 -129211 -73785 -34531 198009 -11482 107501 88238 219604
10704 219604 158142 -445924 -374104 -248355 -135554 26631 105002 -245764 -104366 -96526 3361
10692 -167062 -359073 63631 32694 -157680 -314605 -149353 -3320 -82059 27428 231321 -30618
10680 101653 -83379 -164968 -92112 -194969 474822 -110310 -22419 190409 -115547 35370
10669 -125869 -185260 26767 -258835 107499 -250440 -298956 -131752 150137 -266897 -106398
10658 -406031 -102641 106043 -61089 -85459 420361 -71517 -480266 -353963 68615 -199905
10647 -101760 193820 63832 -113437 136406 -211677 -181534 139366 61108 -118434 -142044
10637 -142044 -52701 -91711 -14099 -237404 155770 -307796 -234842 -120569 -55840 -84847 -88935
10626 -88935 -46947 -308288 -115277 182495 156257 6524 150062 89614 -128877 -3404 164200
10614 104821 -91675 147191 -169405 102848 62674 -216262 -138111 121422 -416485 -337407
10604 -337407 -245969 73378 -377807 41786 109164 -84638 -654 126030 209444 -333251 122742
10592 254925 170990 -47605 79793 -124911 123691 -211457 136949 -169753 -150331 -163114
10582 -163114 -528633 -69735 -116598 438646 54493 295030 -181880 -497130 297756 -78137
10571 -141796 -134691 -279901 -175013 -40174 189236 6981 -278925 -25281 -310640 -271403 -402599
10560 -402599 21163 18709 -110294 -136248 108286 46864 3342 -53504 15010 54098 278208
10549 278208 44773 -162798 -183329 432970 -179513 47927 -127766 9761 -171444 -487354
10539 -487354 -126117 -124208 30341 52266 -230915 224715 21789 -26012 -197675 -61268 -202476
10528 -202476 64901 -276785 -43908 -175784 6649 81428 -132619 -122466 53967 -105250 156108
10516 -67635 -2611 -123975 -68305 -189019 23535 -80605 -422275 -271387 -35265 110604 -139101
10504 -318179 84833 118318 -124067 -60551 -325293 20742 73955 -130464 271507 -278481
10493 213818 -80897 -24044 -7363 -65825 -34284 -187699 -194644 50203 317091 -131078 283670
10481 119918 -78515 -183177 241313 -292001 -212571 147808 172214 100173 30646 -190819
10470 -177678 148526 -69736 66758 -93312 -21367 35292 82815 -451074 -82721 95794 22522
10458 -21882 -114335 324234 84795 -45106 318025 -62013 -18370 -129259 -268596 -38734 104173
10446 95876 -261538 -10289 197076 -180147 -151983 -425872 -338957 -315848 -14258 -81665 55903
10434 333840 116331 -75560 99010 -132601 -164754 -6164 -95492 138450 -111701 -375714 158830
10422 -212280 -87578 66365 -99826 -177688 154086 -145740 -24253 -149570 35413 -220987 -429782
10411 -429782 128556 132078 -10503 -348596 -45309 -52372 -199551 50387 -39121 -97038 15200
10399 -32873 57362 28810 -174382 108960 -265815 -237973 650558 45097 73808 -116438 -4572
10387 56896 163009 -61393 -27885 196427 -166932 -231791 158430 456367 -49019 127869
10376 110301 53547 401372 -43549 42302 157912 22739 158290 86878 -13706 185806 338077
10365 338077 452154 119030 144142 79014 -123978 171616 68057 130826 228461 -122564
10354 24730 109758 507911 92337 472770 354001 531985 103385 -13239 171251 -121159
10343 269603 141832 230838 68210 39421 5117 263947 257818 232792 163946 -115051 -46719
10331 -244700 -124750 -241411 45723 148444 142456 174574 -73112 82570 291690 121953 258004
10320 258004 197118 -199617 75696 -63700 -60693 358192 -49654 173269 -70273 -234794 -309647
10309 -309647 -68223 -45606 -69512 -34019 273893 86250 172455 106700 378492 -127549 80426
10297 -433469 33410 -19444 106566 306668 -140111 73575 92740 221137 -423179 97291
10286 -309227 81272 182513 146738 23859 -54133 190477 -1583 184994 -151151 117345 -299038
10274 -157686 -93661 -22773 -450358 -37219 -147906 201765 -46786 -123985 87920 -34333 141286
10262 92735 -47009 -203670 41775 -103316 -137670 -138304 423871 259657 110210 349799 157166
10250 325671 101462 73081 18583 145721 82303 22966 -48190 -222080 39490 -59155 265037
10238 79517 -30771 -137635 3379 13724 -139262 -187206 -187257 -262086 -204604 -167546 -40257 293882
10225 -77076 -17409 -181102 -208186 -34056 227560 119129 -136026 122174 242386 -48419
10214 -121592 -263219 103427 -408858 -190766 -233481 119170 -328933 262493 -53271 134388
10203 -290424 31021 -250236 44464 90305 167643 -197464 -16574 -10465 -85134 -17463 -109597
10192 -109597 -307485 80870 139113 -191775 77523 -27696 197977 -127714 -123708 62609 -134248
10180 -394998 -170966 164659 98997 63510 -203850 55756 -337785 -86355 -46376 -247983
10170 -247983 -200650 135339 -296556 -233781 -50521 -147152 -127746 51033 26410 17485 -223967
10158 63335 6160 97422 -314723 -36183 -131139 -11323 -352378 -82807 127596 23424 -45088
10146 129666 -188106 260 76479 40797 -69980 -78958 -265287 118104 82070 -59827 -66942 83874
10133 -265141 -14732 -61055 -116033 15721 -428683 -80454 -200786 -126444 -20092 -293031 -335667
10122 -335667 21457 203159 40251 16634 31001 -35456 -148216 80423 7206 132070 -143116
10110 -379249 -103165 -4468 145150 1923 295039 161062 -5368 -278161 -388768 -139211 -83329
10099 -83329 -179324 -19845 -262155 46154 341354 -109896 -38806 287425 90312 -122632 -11591
10087 -202793 96725 -373364 138647 -131685 -298591 13357 40499 -168099 -137037 -116293
10077 -116293 102914 121244 -43316 -28118 233423 -46694 -177707 -161795 269397 -12422 90536
10065 -196381 313255 -285265 -137357 3525 -68889 47675 50551 -62321 -5182 -150639 -94420
10054 -94420 -37063 -248461 -144580 -39401 -155496 -49999 -72626 128475 -43245 241428 -341227
10042 55324 108009 -390194 113945 -199182 310674 -159677 82261 -328990 164227 76751
10031 -113404 206719 62188 -188569 -47487 -59013 -264149 -425808 -7001 113801 -333714
10020 158939 42922 -135979 26367 -191102 -23286 222486 -60545 53369 -296921 -140687
10009 -257215 117440 -62336 74962 -290777 -222042 -143401 -117288 182272 -41515 -39549 174515
9997 -174906 -18012 39917 -112083 249933 -224501 133149 41567 -1268 -200828 131187 125366
9986 125366 -424023 116834 165662 -257635 -310840 -157041 -527578 204239 41312 -105074
9975 -17888 159208 38911 181455 223276 -48476 -34749 7322 -233002 325822 354784 -161716
9963 -190043 -35602 -47049 -269218 26115 49010 81809 174641 185623 71087 111652 -253615
9951 -43907 -136156 -67736 -116226 -242778 15832 -62442 -48207 43694 -33866 -267462 66891
9939 103243 -85726 -106787 48159 160935 10356 59828 22153 -334976 1598 -102518 -135516
9928 -135516 -20908 45183 274169 -9290 12888 -288710 194024 -45186 -328283 -38047 -47435
9917 -47435 54533 -356644 407564 386569 -89471 -310955 -76201 -178322 182184 -82097 -67790
9906 -67790 -55967 -83725 -16816 -60666 -151332 151436 -79224 5580 -377638 -151951 103102
9894 -52527 30701 -193030 -96266 -430420 -82457 170780 -218357 257359 -410858 -313143 -204454
9883 -204454 -132377 -48914 26078 -272378 -408906 27108 132487 -9541 -38190 -92547 217492
9871 -46005 -40471 93393 -48124 -247670 -299902 210540 -302303 44513 12994 -37610 -101763
9860 -101763 35229 201299 -33125 168093 -226348 -132031 119863 -94376 570 -105400 -491904
9849 -491904 -162188 -198525 20517 -29256 -312334 7832 84192 -142855 301742 -27996 -194451
9838 -194451 -139695 -734 -12575 81664 1814 -212009 -129739 18871 4741 -98400 -68673 -106981
9826 -106981 -35720 -152398 -177555 -87428 -351710 -248372 7350 -221222 -423936 -208435 -127916
9815 -127916 5736 -189222 296781 -117584 -298639 86312 -2403 -14666 -859 239922 74567
9803 -453247 164223 -5768 -92804 143815 -169546 106562 55441 179870 -87364 -144797 -37352
9791 -210207 20687 -16020 207881 -148847 103047 26321 -231367 -189166 -98591 362210 -80719
9779 -100154 -33033 43677 -253526 -154399 -216604 -350802 -272017 -250799 -135719 -15815 162925
9767 168828 -259731 -166018 -108590 -155208 -124796 -212511 157690 211341 52911 -181141 -339410
9756 -339410 9690 8257 282191 -189128 29722 83033 -159132 -387107 -128457 -153525 -21522
9744 -6027 -113838 -193728 -137187 -84489 51189 34594 -268166 203172 -250319 -364166 263643
9732 -194429 -272934 -54401 266611 282225 -203544 64193 -173109 237143 143064 -63398 -41731
9721 -41731 -122089 -51747 -29756 159743 -245277 -157008 -76969 32772 -29675 -254991 -164902
9710 -164902 -52910 -240907 -307660 134425 141298 -106806 180969 -419342 243343 -77198 -15580
9698 -292811 130908 100477 347778 6656 89247 329000 -25816 182091 285388 -92663 -65290
9687 -65290 150938 -71344 -285560 -84892 -178664 -96761 -23969 -124492 -24478 44193 -78607
9675 -221908 167216 -96712 104556 162425 -103705 8047 -35199 -76659 22214 -107473 -78869
9664 -78869 -170220 -107724 -454990 214998 110087 261214 -8616 112607 22119 -191765 96342
9652 -103000 -187565 39268 29622 11785 230484 -38256 -43152 -352451 -200070 -187571 146705
9640 -105023 -74805 -171642 1352 -157419 -227599 28753 -72599 -300864 -218739 -189493 -100441
9629 -100441 -393816 118521 -122919 172717 20293 -27862 -1109 -171444 -22365 -63084 70015
9617 276502 232858 -1507 -92365 -222140 -187180 75290 -130543 -151870 -3845 26897 -37405 -63591
9605 -63591 587 5550 -467847 -157630 -24313 -19901 -297571 -15032 43084 -165804 -283225 41530
9592 -397966 75688 -182806 -282634 151758 -28563 -164421 41538 40484 -232193 -23780 -233659
9581 -233659 -231567 -370653 -832 -14607 -215368 -47655 -421458 180649 65382 -170945 -330375
9570 -330375 65520 162922 88707 -16258 252280 27028 55734 -52678 171580 -30680 -32008
9559 -32008 62533 483780 -30109 -201885 46244 -73678 -40426 -191535 -15059 -348481 109346
9547 -303674 -187025 -103225 -159075 5709 -12864 68304 42581 -204885 -173735 120650 -460618
9535 -240245 -175788 129982 -431450 -374638 -228118 81149 -261179 195341 -183015 -59299
9524 -261039 165956 179330 -259976 67825 -232214 -96573 -89018 -83052 -174734 -389562 91765
9512 5505 -513177 -152132 179230 -245608 -6992 269462 -126149 -39206 -123059 -141966 9358
9500 10299 103413 68127 -235557 -104523 61512 16841 157713 69583 -249761 -58942 -31517
9489 -31517 145445 -282532 -66112 -289772 77983 -226836 -127764 -88818 20475 89168 -255139
9477 -147577 71604 -148275 -275088 -527672 -38861 58002 -88230 -247331 -40469 -163589 -270178
9466 -270178 488716 -189756 34943 -87770 46302 -84411 -62863 62790 -72307 310158 -46280
9454 -112892 72934 -134995 14072 -139312 183593 168703 18341 -451578 -8989 -170898 -320046
9443 -320046 -35214 -177350 2990 9737 -128228 -37222 -190866 17463 -127917 15550 -113872
9431 -110973 -105376 -184148 -529062 -152910 107308 -140729 -11484 -187276 85856 -268068 156109
9419 -1174 38629 -136822 338114 -256893 -884 -81292 -252892 125383 -237603 -25646 -178414
9408 -178414 -242417 41469 -161714 -201986 -136886 -204933 -203797 -35778 1846 10295 221221 -47832
9395 -32264 46693 -208437 -90367 -94372 273362 -126425 -175925 19997 313337 164946 -382891
9383 82589 -343162 -42419 252623 -170640 -178769 -273080 -242517 -127793 -78898 -100761 141601
9371 -55344 28623 22761 -274597 201215 49376 -162657 -167885 -121201 -23010 -111521 67570 -45665
9358 257934 -85833 24172 -147259 -121620 6838 149334 -60411 2655 -233525 -11273 -55060
9347 -55060 -14656 115597 -251523 -67456 -29014 290584 -76501 -264413 95141 88441 -215947
9335 60257 -191431 -19682 102836 -232815 -324336 184760 -491828 344244 30469 122663 -30640
9323 388470 -49112 135789 174832 178422 -237151 -223679 -172215 -276112 17332 75343 -270387
9311 -116496 300818 -122482 -314015 130339 5010 -221027 145394 -47145 27279 -56949 -162327
9300 -162327 54266 36996 170338 -53615 -30427 245630 26977 -176799 -277557 226957 -287011
9288 171539 -72344 456410 242261 208113 -189865 -12579 130351 -279756 -178237 -95994
9278 -95994 -277800 110755 161218 112847 -87435 23009 -194157 -60559 -108234 -12463 -1684
9266 -21595 -185620 58187 281141 20439 225919 -222122 -17571 246698 -135719 -191237 -224949
9255 -224949 129085 -407769 86030 -120934 -79999 203888 -170694 -91517 -346677 9285 148624
9244 148624 -437950 -27402 -197655 -27536 -48798 118649 38390 -158899 298435 320621 -375150
9232 -247305 -348218 143790 -392200 -345415 -274635 173680 -423835 21433 198606 -148788
9221 -77622 -692 131205 161228 -7260 31671 -73444 270147 -46211 87530 144834 -33441 172366
9208 196489 30621 65207 121573 -34585 -56438 185354 -74031 21097 -265326 -129302 37662
9196 -176836 -449138 169824 -267966 23972 -257824 -180470 -360595 -33496 19005 -178412
9185 -21011 -266891 -75906 204648 26469 56172 181631 -149772 -243296 49265 -53586 328771
9173 4711 -33106 -143543 -237586 162955 -75130 -3930 -210196 -8968 -30506 -205513 166154
9161 -21326 231559 -86088 -192988 -39144 -132657 242570 -156249 -242730 -202841 -185178 -50845
9149 148190 -256539 -148966 -356612 108455 -107946 12986 -255653 -77894 -4363 -160290
9139 -160290 -163299 -154286 -55165 65858 -200256 -109175 16146 -7160 -135958 -285709 170834
9127 -23180 24331 765 -247053 149377 -342960 -236884 16810 -258938 -85527 -8014 -39279
9116 -39279 -80526 -174596 -66871 -22335 -89258 32871 -124794 -242552 102681 -73546 -59202
9105 -59202 -25254 -36067 673 -136605 -187197 -195759 558810 -70787 -48991 -461481 -206896 287183
9092 34272 71447 -69451 -192163 30985 117256 -22783 -390417 110584 156068 -242725 -165336
9081 -165336 -353947 -85413 -28557 -318471 -8374 368170 -7603 83205 -39978 -5625 13197 -77888
9068 -172749 -49384 -92249 -54824 -218553 159178 -165524 156752 -11699 -123831 -259854
9058 -259854 71170 54459 70435 -121336 -137290 -149430 -106856 -290345 9857 66227 294509
9047 294509 181397 27734 -92208 49237 -125664 -149791 92208 -441788 -130796 -147959 -212688
9036 -212688 -146091 127003 37658 -284155 -324100 -279994 63244 -111588 -34774 -283223 48781
9024 -103354 125751 -153621 69436 -131767 334019 -98949 -324196 -150891 417185 145622
9013 28022 94770 -350296 -133883 -241940 -258762 -235178 15547 -331843 29554 74996 -240087
9001 -78989 18590 -304976 -236264 92502 -212114 122751 -122913 132849 -68053 -271638 462075
8989 43461 222382 -306741 -17373 237892 245031 -347297 11952 -36822 17113 287588 -106866
8977 123228 78720 -81454 -25883 19945 224272 -302987 -101491 -224702 -222581 -197169 -241542
8966 -241542 147 207616 -192435 -338585 168395 -27502 256021 279960 -10534 -241326 -33192
8954 278152 -264935 -240500 -403097 -71721 -341298 85001 -392689 -291562 -61831 -50949 27446
8942 107577 -121115 -87779 -35433 -65103 148849 -96261 93660 137881 197481 267416 97113
8930 102414 64129 -129906 -49753 -49696 -50376 -27280 361586 740920 1966175 3065519 3715741
8919 3715741 1075587 538183 289233 224101 201923 -243094 43042 -98456 -215936 30455
8908 174549 -71539 -418108 -33482 -100934 165849 -263454 9220 23725 184954 120539 -147997
8896 -110901 208435 -66439 -322594 -136975 256391 -117103 97148 315073 -330519 54482
8885 27663 -177320 138421 145637 -93930 301825 -335147 -39322 -145446 -224264 -82029 131916
8873 10915 -139881 165112 -246 -277019 -407479 172385 -191722 -219179 -371555 154096 -38436
8861 -374106 -355323 227829 -262814 -22334 -208456 -305847 -261158 30107 -53400 -325654 119970
8849 -238189 22761 -375562 -137566 -52272 -297663 97781 -318461 125273 27437 -189760
8838 -23202 -125344 42509 -3407 192655 -167863 -191037 37297 -142246 -130108 238914 -82756
8826 -100516 -154133 59650 -99849 79936 -275821 270182 -187883 -394996 279632 159244
8816 159244 -22337 317860 101142 -143329 -156990 75442 -115182 125234 100627 -111333
8805 -92231 -100947 -83414 54527 -153196 7677 -60285 -56800 154215 -41961 286289 152105 1459
8792 73694 -117126 340261 41279 164858 -356754 -29047 -387580 -84880 -60932 -392549 -132071
8780 98101 -85929 -197489 95456 283798 -292333 -16270 -50244 -124082 -236782 -216998 -96796
8768 391297 201176 89907 89249 89844 396529 297804 -11369 105922 139626 112430 -224607 -68822
8755 96775 -169276 41704 -335896 -244515 102039 -392092 253921 -245310 117308 22018
8744 -58513 -119986 -32374 52195 116370 -34999 -95969 -199996 252110 97060 214869 -152523
8732 156033 -54710 76743 -380801 -152160 -378785 -297812 -252549 -5396 -86455 283448 232411
8721 232411 124185 238515 240560 282989 -318402 123922 37107 18655 -322165 -21447 219005
8709 -228866 -25336 -117457 -275031 -103447 -133765 107915 -187384 -344654 288560 -144676
8698 -84548 -77006 -228389 133242 340745 36650 -65181 -6928 -102958 16845 -478233 -221794
8686 -330603 -86667 -51125 282690 -160928 -13291 226086 -85849 -87555 -162087 70066 -274021
8674 -29913 122166 -120193 -138800 -172278 -86453 -1072 41317 144471 -456433 -83921 -275370
8663 -275370 -43389 246561 67935 -141396 -60431 136431 -240093 -162574 137669 -21512 214772
8651 42569 -205529 103801 306187 -349161 -224338 200437 -363276 -171652 69572 60134
8641 60134 -162230 -6759 -21313 -136631 -142106 -73868 113976 -329459 -128380 -31330 -267877
8630 -267877 -84022 -76886 391978 -46308 199013 -143790 -191623 249062 42325 216791 -40486
8618 -4814 -104600 -178362 430336 121810 -251635 -54202 331784 -348538 -152256 -13983 268158
8606 1213 -95383 -118475 -172696 32204 -298197 59346 245114 -505311 -144763 -93176 -75216
8595 -75216 92101 222020 -243151 71993 79370 -478116 -127440 -64088 -145075 -203383 -232127
8584 -232127 -81943 -235788 -80788 18255 -641196 12304 -185249 10206 -114086 237829 -320325
8572 -88822 -134771 -35319 -208558 -55282 -207117 -124956 -164844 -272750 -147100 -41856 168478
8560 235290 44435 -77730 142681 355212 -109374 9813 -51274 115293 -32300 -155753 -125444
8549 -125444 223856 -200472 135813 -81377 -182038 -291095 -4892 -255952 -14150 -74398 -141359
8538 -141359 123005 60284 100591 -28617 63927 258756 -258564 9148 -251380 -240789 65278
8526 35094 172974 171831 42924 287719 32663 -30852 17105 -113740 -211939 82020 -81007
8514 -369250 -127556 87644 -15914 179287 92546 -133261 -66043 -65790 63618 68282 -558859
8502 210862 -200994 -16595 -87969 -61733 -133236 -313929 145493 -129230 -241037 -169138 -138702
8491 -138702 99586 -119479 37884 319079 -541242 -118003 -46292 228088 -15704 -223487
8481 -223487 -78191 -32849 -264780 24365 -23711 -189883 71729 68980 122617 -99945 -88228
8470 -88228 40122 -128779 -286846 -156782 34665 -174579 68171 -200358 -79479 -110194 -225839
8459 -225839 -97692 -125288 -32856 -321940 39581 68287 -55542 64088 -388400 98928 -61376
8447 -488548 -310053 -184811 183435 103824 83968 132860 58618 239868 43133 -256701 -62066
8435 -316952 121517 -3236 172910 194344 -103400 -33260 206636 -68807 155247 90745 228215
8424 228215 -195353 42834 114051 -220677 -75462 18799 -11745 -178025 -84803 -24655 167614
8412 116955 105460 121356 -254087 -122421 5996 -103952 127662 -196039 102310 36525 -355020
8400 -10208 155368 -267932 -178999 -261749 31103 37698 16439 100855 -154302 -137363 -112446
8389 -112446 90829 81908 -143907 180523 -100331 -162683 -225157 257449 -120296 135310 -196247
8377 -301056 -177752 -198686 129257 -80258 -129492 114784 83841 -109704 165922 -65732 75456
8365 -351055 -138945 -46419 72644 -45377 -211602 121493 204828 -206090 -123027 87497 -187465
8353 -138014 144252 86136 -14715 113477 83665 174992 -132444 8368 96773 115378 220536
8342 220536 -83758 274448 -265562 176408 38590 114109 95475 -154583 -182328 34426 -140277
8330 91290 -215053 -51924 263821 89025 47786 -97824 59933 -327983 53746 -176180 -140600
8319 -140600 -245125 -189362 -18065 -212945 -153070 239396 165412 -148970 -70031 -216428 -298530
8308 -298530 -177712 -50345 -79866 -36274 -159559 -110223 -93850 62779 -137590 -86325 -194231
8297 -194231 -67031 -307925 52555 -129101 -161125 286997 141409 206670 16 -234960 244449
8285 52099 -144251 -208645 -96875 -65960 375769 48373 -72477 -156340 189933 76557 -97046
8273 29407 -115538 -257793 -173349 -168984 -107080 216788 -114165 -132910 -204722 19141 9705
8262 9705 -70441 120039 160100 -186079 202313 -144098 -233991 -349579 64122 127175 -494429
8250 -224219 338522 -148105 104554 -178110 64782 -201276 76019 -189942 34135 -179561
8239 -327153 -29639 -160515 -203182 -290965 -41624 -86136 -13495 47023 -25952 -12990 -170605
8228 -170605 20559 47245 -49494 -56480 -233212 -123813 -114796 247646 -53898 37656 -199831
8216 -49208 177707 -194165 -159312 -16611 206153 -82985 21262 37960 123575 316771 164230
8205 164230 -253535 -52831 -123514 129584 41200 -34786 159864 -95050 175276 162356 57437
8193 -226580 -164602 -10667 235119 -170945 -350725 -7493 -271140 -139396 -143016 -219041 -60133
8181 -65184 -68679 -35060 -76979 -200831 168053 -14589 130193 140873 57070 -320542 -229482
8170 -229482 34429 168174 -231490 137599 -77156 -261291 -81959 256588 62437 -53348 -22696
8158 -21729 -287392 184693 -41013 -108719 233266 85924 -8026 61565 -74178 37027 -204151
8146 -27005 -19704 26888 -164583 -209544 -127621 195268 -262662 72145 62703 87849 -124127
8134 -120030 35633 216669 30910 286746 -49740 -12679 32748 -56238 220194 -260179 -12105
8122 47798 38117 -54160 247619 60573 204418 -121353 -87341 -429029 159942 349711 -165984
8110 404 188620 -239736 252578 -116398 -79859 25011 10047 -26274 -27179 7133 -239023 141718
8097 -407230 311263 -111810 33402 353889 -35411 51385 197475 -188427 19824 -182263
8086 38876 217039 -132664 20172 121368 79957 170601 -235188 215847 270147 81198 12608
8074 -265096 -29525 -307386 26273 291902 300660 4176 -367049 -2962 138485 -194970 -140099
8063 -140099 -83260 -423499 41195 9748 100591 143445 -206608 -213257 395855 35583 -405228
8051 -47127 105645 98450 -112528 81716 -169772 -273396 56756 -127568 -276110 -107769 172535
8039 -224561 -121817 -17977 -181122 -357136 -238153 -223387 -232847 91926 94455 -18214 -202956
8028 -202956 37628 34165 137109 308834 275598 -92106 15236 92955 -152208 -146391 81604
8016 -576592 -109410 -45842 32609 -76895 79511 -245242 100781 -310387 180408 -32964 -225712
8005 -225712 399992 -214525 193394 69978 -120924 -153644 -148048 -81361 88486 43151 -147347
7993 -76416 56572 241586 143594 -78482 -524066 -128012 -227610 -17014 -7595 249450 -183263
7981 -114994 -42232 -234926 23342 -236965 -66455 293479 353660 -242467 14214 -393942 -330025
7970 -330025 -213822 8105 -108926 28386 140906 -26801 35959 27636 -410960 -77693 31189
7958 -184195 24706 -66433 -192834 25406 53480 -87248 88977 -18910 -178618 -318850 -85014
7946 -20126 145032 186838 -5830 139276 -63311 174366 -111600 31199 28200 -222548 -138938
7935 -138938 -134993 -428411 76910 -514556 -159543 172456 356864 -588116 83073 17866 318148
7924 318148 123520 157254 -558 -7608 87886 -182664 -184952 284783 -100843 226794 152797
7913 152797 80057 -143567 -119105 -155423 -7544 278115 -173516 -120757 -106190 -125966 -255654
7902 -255654 -221239 69121 56486 -316648 84017 98040 -86149 -293698 81417 192093 -182524
7890 102011 -314728 -211048 -7378 -114482 -116604 -136266 -333566 -258601 -60565 -32827 11005
7878 -39405 -105232 -283505 -99123 394587 -243001 148824 260010 -71280 -180535 -428662
7868 -428662 -24066 218521 -8144 -311319 -166752 -60155 -88836 181972 -186677 -95770 -37125
7856 178833 -81577 113214 -112351 -125890 27586 -28316 211059 -89972 -55359 20021 117042
7845 117042 144444 -54283 87800 277785 8600 -38829 66856 -93604 276953 177308 -47511
7833 -159688 -296228 22758 -66703 122293 -51220 -3550 -4839 -173729 51971 82533 -14787
7821 130381 -6086 -22134 -98546 -11736 46954 -53579 -149942 -139740 152647 -20262 -427366
7810 -427366 -89892 -275188 -38875 -20120 -247245 83787 137074 -26677 59208 -177386 191433
7798 -4732 159264 155518 31820 -31815 -188490 135255 -85579 105266 -377367 339422 -111838
7786 -102101 54109 74684 -198510 -181431 143322 -380099 -14694 -51684 -92449 142802 -99489
7774 295061 -229915 49306 -215425 43829 138753 -244243 -141534 278730 5009 273513 10742
7762 -109773 19443 -239686 -217887 -299032 65944 -11472 -192881 60173 314186 141760 -246981
7750 -302652 -38334 158414 28125 -169669 143920 -227672 242712 -16834 -185450 14859
7739 150503 -91622 -388305 -117487 189919 117187 14272 387058 -74927 -169801 37781 -9143
7727 -40712 -119796 -13596 -87249 -227809 -16791 -367934 63815 -73759 -209141 -56733 -158359
7716 -158359 168273 -358367 -212998 152538 -135975 -342442 -75664 -80294 -368904 -33030
7705 46275 -29495 224594 -53931 -248066 38990 231243 -38935 62486 -347204 -222113 126798
7693 323178 -147472 -69777 -18999 -179880 -292446 167991 159347 159825 12169 31095 -20829
7681 -30078 -94389 133274 -82752 59931 -6433 -243066 -336125 48506 -39380 -98367 20291 -168796
7668 -86391 -6628 -301539 101844 -232379 -66544 -192256 74718 -244332 93243 -169600 -20646
7656 -18641 281075 -151039 -258529 194497 84878 87556 -119888 -306195 180212 156600 -132264
7644 16293 -136659 -255799 310055 206443 109942 -256397 121129 -217065 86625 122342
7634 122342 290326 -26000 27034 256310 -359271 344486 -89146 -158493 130883 119503 -16246
7622 143052 245248 10013 -476470 60671 -295053 -139948 -304624 -187054 -139974 24959
7611 -178665 7443 -137095 -61385 155444 196 -59637 24237 157415 -251586 25891 -26663
7599 185989 39462 38746 57147 -176743 -7459 98108 -219775 64191 -152570 216193 49246
7587 311760 -252740 -310657 140236 -215245 279652 -35200 -323448 -127722 27230 -196699
7576 -134212 -133729 -16828 -134408 264312 205941 50219 -297017 -123829 -112483 -212902 -187829
7565 -187829 126360 138150 280251 -23786 -78362 51978 -283617 177042 -290792 -44290 -6846
7553 -291103 -164069 2403 -31317 -11330 -250230 -258628 -98218 334592 -278091 133413 -220628
7541 384914 -94141 -116579 233865 -63821 -238304 -19319 -54183 -127835 191161 -25126 91272
7529 156939 -375596 283723 -170068 -139432 -217460 -35909 -167513 53422 271755 297568 242302
7518 242302 26051 73280 -449175 -337026 -34296 137147 39549 -36203 -97203 -98467 354337
7506 -112480 -218025 87589 -174038 -353177 257528 138373 86075 109822 -91057 80945 -253984
7494 129787 152053 111227 -46669 138188 159375 145772 11198 226023 -134929 31346 225488
7483 225488 273382 121714 -67799 -213380 -193498 -140108 -237551 -53652 313187 159756 -78892
7471 -13910 30557 -16309 -380064 -265228 -157978 -308316 45698 140407 -306628 136766 -597289
7459 104239 -82024 -166272 77621 -62864 78788 105339 -126109 -131860 -245979 -287979 -3243 306341
7446 -143769 -150848 -146467 -211698 -72423 -284167 -399396 -186227 -115064 -137629 -256605 -163718
7435 -163718 52263 -123558 53449 -316832 38030 -16747 204024 45434 -66027 195264 -32148
7423 44983 74592 -185340 -479168 -170550 54549 72458 62352 -170726 107286 178350 164829
7412 164829 344506 -101914 165870 -191762 61964 93535 -429701 -111251 -57706 10631
7401 3957 433037 -337410 124239 65387 219420 178632 -83527 4510 274738 -27446 299850
7389 -117250 -30475 85658 4599 -193410 -267912 185807 -269952 53637 173992 -97384 15599
7377 -162251 124658 98818 -46670 15693 26140 13891 178688 135158 179564 296212 199926
7366 199926 -288376 -389503 112989 -13497 -241168 28735 28807 195768 180198 410165 198634
7354 -159942 -143873 385671 62606 -191528 -16787 12122 -85622 19396 -190206 45117 -365888
7342 30653 991 -15102 -184595 -264476 -181335 -155269 30092 -126469 -45636 -368501 -129207
7330 -50857 -347067 -102535 129002 -65492 50121 6296 116858 -400801 -100030 51529 144173
7319 144173 -319210 -103466 103900 -14763 -65696 -292643 -131311 -161111 -129534 41614 60688
7308 60688 130667 204237 -47486 272286 -174443 -381801 190836 -343127 -26047 352665 -125794
7296 37059 138579 -49893 -9837 263 -130911 126528 -108136 125301 93027 -98716 -201905
7285 -201905 -106722 -168160 -197634 259812 -254700 -160086 212685 127242 -324184 -205501 74307
7273 126454 -296207 -88613 4865 140242 346389 -4931 -252407 -164013 227395 49228 -76246
7261 153039 14299 65867 82805 107878 -87745 -67731 -161118 -204136 -245599 10582 -189066
7249 390405 -418445 -169211 -64683 46183 -15854 -19541 -124277 -250508 -15137 -134830 65337
7237 82561 237887 44575 8766 -177497 -100747 209966 -161931 -160862 -56127 -129549 -25471
7225 -328903 300523 48841 75101 176898 -74298 -53458 138958 -18877 204185 126219 135076
7214 135076 216340 128387 -35350 -190614 -237462 1232 -48185 -111932 6406 -60492 -173508 -40683
7201 132576 -1101 61924 -97027 -366849 35647 -32752 82206 73843 10987 410 229942 -315725
7188 65946 83602 174497 -26607 62763 -10935 275265 -71766 33249 136973 90490 -166173
7176 -58001 -89128 -216078 -387802 182807 171119 142922 -402741 -220654 -254540 -122492 327163
7164 198475 -104091 -57038 -50304 -25360 54459 -77373 118239 124165 287836 -54481 -25940
7152 -205317 -130979 -250394 8762 147897 -70696 -4661 -273957 -402000 30625 9484 -151510
7140 -160697 -116984 -27221 -329656 -73400 -36594 193315 -171538 -211008 -190437 113678 130170
7129 130170 104837 -35512 153235 -69487 178942 -94170 -168931 53644 65703 -311438 131359
7117 17811 -36780 -73035 134224 -56045 131939 -34926 65738 48993 -138485 83519 -75695
7105 -35328 267944 102372 -109710 -279256 -206110 -109845 -217345 -202992 -34617 -286297 -313690
7094 -313690 -206039 -28984 -164591 16576 102330 -185726 4342 -79892 248354 -30152 121189
7082 -143621 -99954 -286380 -106562 -329730 160629 88827 11604 199764 -305778 34024
7071 -37354 60270 34875 178908 93011 198858 97803 72964 280492 -208211 -33058 -63067
7060 -63067 186089 -39707 126690 -119326 -237837 185005 34095 -70822 -40760 94386 -219643
7048 -125224 -49844 -22534 338616 -351907 118430 -71260 -176980 -218183 -208904 245778 -144700
7036 341716 -87619 -201870 3812 323966 -93955 -13885 2548 31132 141530 30554 134127
7025 134127 185244 -367673 106677 -71257 -398753 -656471 69499 -36908 -205961 246382
7014 188603 -65513 -82344 96340 -46421 -172496 201765 234596 22779 465276 16645 -11311
7002 -146355 -195087 232788 -26902 -36437 88201 -189571 154387 -116050 58630 175952 116848
6991 116848 -42994 305958 -186853 207284 66775 -48904 -108693 -146426 -178622 98273 -89602
6979 -200697 -260424 -143479 -175133 -112601 241892 165481 -163375 -238468 -70895 85929 79999
6968 79999 -53612 -170008 199635 -319230 -295084 -156416 -128867 342400 85998 -275034 6970
6956 138545 375001 81780 -96870 -310548 58979 -154354 -113416 191376 -119708 12683 -284113
6944 -133706 250674 -52318 -87408 97370 152355 16601 71272 342125 -79348 25146 23136
6933 23136 138443 -261260 -63537 3374 -244187 -100667 43039 -169990 -59343 164820 -17926
6921 -297637 156376 147507 8991 297340 71787 42918 -334260 -161137 -147309 152893 -162510
6909 128574 137963 163836 73203 418427 204322 -157644 23420 105933 -360229 49529 94767
6898 94767 131070 183874 358348 -34039 166865 -12882 -69720 6043 -59364 321781 -126303
6886 -259434 -143251 -29633 17104 -248463 140904 -209865 -27663 109546 -216919 -177485
6876 -177485 81087 49201 43569 -109991 146754 112712 -176869 206451 225255 236781 467497
6865 467497 -382836 -324494 -461779 -420302 278954 -254522 146456 22242 -100049 -78254
6855 -78254 104671 -195632 -49017 -72417 -240167 79824 -35914 130219 -78746 -200002 -88761
6843 -21997 197957 116276 -209080 -155159 16214 17649 182783 -331889 -332594 -124366 60314
6831 215993 -157112 20489 15110 215117 88995 -53557 176687 92090 -467423 167457 -66980
6819 -8351 221812 73995 -268316 207741 -24180 123605 -27003 383325 31631 221842 -235258
6807 120310 -275873 -84500 79828 36323 -57584 -12962 -14586 29631 123890 -139398 -9415 54063
6794 -4838 96368 234667 -61942 -282329 -88611 -333232 -49709 -58211 138267 -258064 46699
6782 31963 172361 209216 42343 84178 65897 -265298 12844 93833 -423549 -183808 27801
6770 119616 -202145 4940 29359 32422 -161631 -47856 -59593 -18582 255043 337788 -114479
6758 -231234 -164255 92896 116874 -121243 -54864 -235517 -7141 -298180 208764 -155579 -70783
6746 138837 92811 248386 83351 229738 74477 287524 -87462 242159 -221168 94502 -23496
6734 133982 54712 13556 -396433 400844 -331342 -82644 20770 -68976 55768 -260880 2772
6722 178313 452185 -118573 -31634 -192945 -311452 128837 -98917 224515 38892 171053
6712 171053 -43814 -7912 179839 -27041 -13071 -120428 -16370 -1678 202532 128825 210815
6701 210815 -32954 -65212 220463 -290677 -63187 75969 10100 2576 -153433 185508 -24672
6689 -51637 161172 -161066 170705 125399 -67286 89508 156444 212618 -431721 125412 54637
6677 32250 35732 46009 -39802 111692 -178902 9061 324853 -244889 -195897 130964 76950
6666 76950 58697 -80560 132086 96184 -109116 -141812 -124780 112839 260 -42655 -13473 -31517
6654 -31517 90836 -268306 -59529 78039 -81063 54078 -29864 118982 -273249 -237182 -4996
6642 -375145 48802 66859 -175927 -45320 40978 176295 214578 167474 -177769 -152296 -172010
6631 -172010 -56176 -7174 227781 131050 -357042 68322 137918 -92066 -100477 -175860 73034 -167868
6618 -239875 -31279 -162642 190814 -1547 -132555 -47488 -95562 16319 247057 91628 -66301
6606 -59632 -233189 82128 -265537 -126269 -67067 212823 7990 136986 189229 -57659 -94431
6595 -94431 -167181 -101765 -48834 115413 87016 306298 -36506 -18544 -210062 76165 12795
6583 -33475 54596 9104 413859 79364 -39582 -174375 -159971 -90811 -49772 37294 -73675 8307
6570 117324 -58239 -96065 57958 157023 21410 -94369 -16909 7212 -377429 138284 232437
6559 232437 91865 348197 -17349 -119579 -219068 -11858 -92274 -206844 -88312 -75494 -339588
6548 -339588 83759 -30706 -36898 -121616 -94416 18769 163019 -250688 179661 110920 -40920
6536 -245917 -197361 -71083 105799 -318866 158524 191094 250813 284791 -200303 -84724 146655
6524 151426 -1341 204979 101312 -368577 6805 -216599 -3325 15462 -137478 98204 -124051
6512 -192910 -71626 -62483 -103921 -253309 92240 -343163 -124231 -325782 -161444 -24473 -89367
6501 -89367 58784 346793 -300815 -82804 332209 -178130 172458 64135 123441 113421 -333
6489 -114437 146349 -56089 -179153 126674 44701 -80160 -85697 -248476 -311853 397117 317625
6478 317625 70040 -19133 104824 -52586 -214984 -322380 115078 -44235 -89901 56572 -328791
6466 20815 137369 196306 -290237 141538 2139 372603 17579 43316 128410 38657 -94455
6454 -114055 119009 -239167 118468 -80250 -154467 485123 -9006 -289897 120067 65681 -93105
6442 -32119 -19706 398601 -17486 279670 329786 21689 12790 216418 -195617 -170725 153721
6430 -41666 7373 -230755 194633 105798 28046 195197 -35503 -220612 -40626 -71046 225209
6418 -161167 91430 -117445 255132 -427410 -131153 -79028 30810 71454 -20094 -1281 -207798
6407 -207798 365625 292115 -90899 -334178 -68898 -7009 -318421 -257582 -160413 -100670 -134721
6396 -134721 108623 -148417 138748 -1764 153738 89888 -162898 -19464 -143742 39237 304701
6385 304701 -29891 -32705 -190615 -296880 48259 -40349 -134464 -38861 -41532 -7197 -107531 -249284
6373 -249284 -10978 -225469 -71260 153161 132578 66954 -127611 -285725 -258967 91080 -84213
6361 328420 -19062 93510 59895 167535 -64982 189677 -882 234880 -7493 80442 4816 -131441
6348 79655 -122250 -270449 256977 101628 -54539 -186824 -137502 -320360 42293 -305036
6337 149645 47310 168143 -5385 207528 -36188 180683 44975 -142486 -98250 61210 -22323
6325 -123509 -39162 190913 24604 18117 71735 131882 -48074 450676 26305 281709 -456018
6313 -79984 -30150 -79209 -261925 117240 1745 -312037 -106336 106547 -114384 -10224 67797
6301 116296 -70086 257868 -34812 533 85399 -170414 37408 -218787 126249 -226869 -357255
6290 -357255 -25861 -97745 29255 -251673 -53017 -467887 -433548 127577 40316 1358 -52190
6278 -127176 146035 104319 -125436 -20987 92216 -262839 -227433 52109 137668 61385 -62588
6266 -203849 265687 352667 233915 -75769 -5244 424619 155974 -97654 -68637 280853 182550
6255 182550 -8831 183147 -81863 -130997 11067 -127624 -190386 65271 39948 195024 -338673
6243 27500 -206593 -182104 -273024 12041 35439 -19067 -126673 -86646 252922 32797 21956
6232 21956 -97048 -142796 198749 92602 137667 58449 8952 294790 -25327 -4783 -374020 100212
6219 -111248 7857 -239295 183030 3302 94408 -77452 152702 -155211 -34965 23331 -242115
6207 -96863 425075 8670 -12283 109471 -217509 -8547 -187525 212570 -66123 9824 -45978
6195 12130 -20251 -46734 354411 -9791 13562 264150 148952 79151 -109410 -269167 48591
6183 -46727 -131066 133930 -128356 -77311 -40028 -142085 149287 137230 -133420 78487 6120
6171 -85350 197197 -145368 175469 -198073 174234 32953 -104884 65874 101022 95257 229249
6160 229249 222464 86707 -237840 -315431 123941 -234848 229071 -315857 40107 52803 -193663
6148 -123100 -44834 -23765 -88558 123819 168322 -152398 -299417 -18550 54891 -213438 232040
6136 -56262 31778 -200873 -60379 -135677 288964 48332 -14507 121845 310934 -87281 -16667
6124 10685 185679 120533 55519 -87088 308772 23971 92643 309514 196053 266263 -157383
6112 305258 7246 -78338 -234772 -19936 124548 82527 -141240 -337131 220772 -269427 -109906
6100 137455 -362026 -17280 58040 -270729 -185235 107713 123914 347724 -194758 -4008 156229
6088 -237224 -365083 -156411 40015 -81106 -288412 -9390 -292728 3349 -217585 -208352 -183062
6077 -183062 -67974 11102 105448 55098 341316 -134295 -20180 132120 -34599 -114910 19365
6065 -64735 7604 -159429 343262 -8618 -184734 180980 4718 -166682 39249 154200 -122539
6053 91733 119006 100319 99553 34443 194273 176371 86873 96322 53528 225239 134008 -598522
6040 250431 -143800 -92846 205778 62982 -93667 -247806 -129331 22415 86766 26562 156908
6029 156908 -119856 -182724 269904 24622 204913 -136198 15792 -268513 -156829 175657
6018 -362342 -39599 -147447 -52934 -128443 -142291 -81258 -42842 -186484 259962 95859 154438
6007 154438 150818 -6456 119665 -31495 -185835 -187529 82722 44716 -162148 102216 -8275 -250429
5995 -250429 -30680 -46435 -193502 -266514 53178 -336471 -195049 198734 -384555 -27452 -250257
5984 -250257 -244067 11073 -304221 -11767 28909 131336 64064 42831 -133682 275751 32458
5972 122 -222194 -77085 -308185 141080 72743 215169 13951 -27014 -70532 148220 -96527
5960 82284 -138032 -18557 -210772 30999 -10650 -31968 -120127 -71392 110686 -26983 193040
5948 -37554 -42634 -185251 -5408 -64800 58230 -76707 -184306 -196367 16176 77090 116029 -72820
5935 83128 -191445 -189122 -83200 -129418 -138080 -42831 143889 43196 174621 81276 -104130
5923 -6169 -273140 10373 -41401 -222536 439113 -119451 292846 152174 167697 -346934 -140887
5911 283262 -153427 -22033 -355177 265057 -88215 -74836 241435 287988 297222 58961 -131772
5899 122670 -197402 210636 -67937 141267 -244589 102545 -340599 -112805 64620 82759
5889 82759 -46641 -45847 91141 -22326 231791 -345538 71946 86035 361929 34883 95453 286941
5877 286941 376444 -205706 106843 -237644 -96890 69954 -99233 -61768 42442 -127102 172486
5865 831 -125485 -73198 -55316 -83754 -195410 65383 355820 -141109 -298415 145116 289651
5854 289651 40519 166295 29700 -150578 -207946 85727 -91214 10275 -89829 131676 -103180
5842 -328280 36668 147192 92836 474973 -9124 368897 333952 -20639 -110010 153238 -156855
5830 -55964 64674 160171 145735 18615 25692 -244561 -355910 4510 -222916 -18107 181734
5818 91132 54088 -90803 44523 -61289 219173 86635 23862 3864 13033 -159997 -22899 5767
5805 21757 -266501 85224 17679 -19574 5677 -12566 316960 136422 62567 -198889 -123401
5794 -123401 -262145 195954 102920 -221213 89968 -12442 96506 -105021 -187752 278089 -28993
5782 -106619 167452 224584 -166684 -68051 237184 160800 271767 -44297 145256 113278 63510
5771 63510 -223742 1992 -24429 -19001 87299 165756 79515 11991 -167864 -50336 -250995 -169897
5759 -169897 322215 -134580 -205257 299510 -37700 -46842 55276 -50717 -209042 -201018 395318
5747 163235 41854 -70938 -131814 -144789 268116 6542 -114190 445414 8217 92799 -97497
5735 23502 -184794 -94237 -22485 -19722 -188372 52747 180665 402930 199327 195021 -126377
5723 95692 -41045 -245958 -9666 349393 -78117 39603 142820 328344 360522 173345 -75487
5711 -94760 118020 -1526 -69131 -176621 -213220 -13791 -84235 86345 7363 -209770 -176839 73477
5698 -171181 162698 110920 -59012 318321 -173203 113640 78992 -286212 -120091 -84088
5688 -84088 -64413 86493 -111523 199880 293695 -31946 -117616 407683 126329 -188158 -259622
5677 -259622 63698 -110737 166271 -177314 -164873 -265468 -425843 125820 20284 92817
5667 92817 -21239 -63823 5687 244638 22131 -76246 262063 -217648 115730 236543 -71570
5655 -6644 224493 -198915 -51255 42539 2729 283219 252849 -235013 136106 -51698 139853
5643 87022 200675 -188459 -44206 -16607 7205 134420 -68211 180259 89120 -55027 -133398
5632 -133398 -122825 193243 -72456 -152378 226608 170222 -155589 -30349 82818 -313964 -3976
5620 212513 39765 -5736 -201588 105507 -391508 -66245 206663 115547 248802 45298 143846
5609 143846 95837 91683 -99410 46192 126504 -52062 -158221 91967 -294192 -235602 100765
5597 -146647 -17804 129616 38257 -60320 345783 104043 -269287 130275 94074 -208023
5586 -56100 -191981 142367 132101 -148096 -35646 285822 12362 -134412 50788 -301784 -235853
5575 -235853 -71748 72221 168388 91275 -198357 -27518 63894 -47745 -177887 134552 137480
5564 137480 -298945 -263015 -301995 -77967 -90457 211167 -33412 43959 -176511 16951 -368802
5552 -364713 264157 238000 48930 -165452 -285603 115487 47850 -50373 -103386 -33555 166021
5540 -142483 -161913 -207365 -7886 153831 194069 303004 -168508 245765 229053 169135 64013
5528 39260 82301 19389 -739838 -21518 60091 -245286 104133 -291265 328403 -56164 -28967
5517 -28967 -129088 -245073 73179 181145 -198759 159854 -82654 293483 -115407 215297
5506 -216197 266351 -38775 -58533 -88267 114934 -152761 218244 -291783 383099 -379850
5495 -999 -68881 235948 -257548 181634 179300 -126471 112179 62096 -44658 177534 10236
5483 -124419 199842 107029 -187536 260611 -245450 110269 88912 -243871 -11678 -183302
5473 -183302 244589 86657 104552 -7184 -91624 -93480 34304 57265 76330 1259 -24196 359135
5460 162883 30327 -6132 -137012 67331 -27488 84080 -114809 -248569 76793 -250216 489680
5448 -112254 102814 7929 7091 139809 241941 -30917 232598 262629 30918 60074 1687 78676
5436 78676 -121909 83140 -246326 -188572 53491 -146113 90702 -247752 -227560 382466 -33184
5424 28608 -83932 -145652 78617 102169 -212972 154317 -32419 278759 249612 64770 28918
5412 -120922 113360 -493132 -80350 -31866 133817 -69706 300424 205027 -18224 226187 -128198
5400 310123 173843 -151379 -61265 -306599 246472 169295 165952 -83083 -18759 -183233 91522
5388 256717 -298194 125226 -94071 228992 -17350 277931 -96909 -226119 -104230 -118538
5378 -118538 289272 205579 -297747 46685 30935 -122647 -96201 27960 144723 -67141 245823
5366 -27393 48007 -100940 -50551 -156805 416601 -55357 51907 122081 -44353 -187986 192886
5354 -21828 -390500 12514 50634 -105126 109051 9777 -321777 88378 -302704 260868 243750
5343 243750 -150557 -78982 67721 429919 3057 -76138 -190219 -233073 165464 156990 -220973
5331 20719 48749 280913 -169070 225537 138685 2716 289629 -134589 -409066 -58613 -175349
5320 -175349 9800 -102677 -490777 142313 234918 -333140 143040 -178791 6103 -263641 119013
5308 114354 211992 -55576 -303116 56424 -178519 -83753 77733 -3744 448443 29777 -126666
5296 -12070 340469 -28702 -131038 -35494 112720 -605 172574 235397 -174152 -242562 -228146
5285 -228146 53323 48266 -69700 -58020 106963 199725 -33226 321173 -170012 165474 9608
5273 -374257 -7466 387129 -55685 -5742 -275749 -26418 72502 200030 85733 119761 -235432
5261 -170948 -127361 -202921 158923 47690 16276 9302 120554 157595 53487 94203 -130319
5249 -108033 -66589 259676 99264 -186340 -118008 -26983 181837 -228968 -68868 35797 74319
5238 74319 155288 -117963 85568 -248890 -398137 -102968 145237 133328 88486 27898 245495
5227 245495 -325141 -25758 92752 -44133 -111188 50494 439080 -32716 -128795 62944 -212712
5215 97474 3580 -75844 308796 82764 -33274 -26329 -123848 -2538 -145835 -89304 -277474 349948
5202 3946 -149221 -39385 -81606 -150024 -201561 -119620 -269913 -238660 219311 -4900 -29841 290708
5189 196515 250226 -150353 -345439 -128958 115964 49618 -139337 30322 -224488 79454
5178 178523 94690 -31911 -27567 278658 -266799 -36254 -53544 435784 -9117 -31820 4043 128904
5166 128904 -64246 -168880 10132 304246 151856 -292244 53767 551621 -403427 -190731
5155 -212787 68759 41145 -257040 -246998 223181 9992 -109964 -276255 -126539 26906 175037
5144 175037 50174 241440 71934 -21848 -13111 184693 153247 263806 -88043 32522 -25616
5132 56998 42365 -219540 -7143 -45273 -97224 99135 176950 274660 130822 268644 -19122
5120 274391 -92573 380482 -85418 66965 -73752 69469 226553 -18962 -10180 -31130 -183967
5109 -183967 106330 170587 135011 -167482 -191213 154794 -33243 -50442 18572 81440 -145941
5097 -220804 -35281 -2247 -37247 257990 -100357 14756 -19943 84173 269750 47553 -271656
5085 239262 68627 101457 -38004 48264 -9549 -328421 -91424 232984 -72798 -233592 -174606
5074 -174606 -76272 -289851 -73636 -311809 93474 -103771 -38647 80879 53203 270451 -7051
5062 -177874 46497 204152 237766 187489 99300 200872 -111911 -112359 54626 -668 -144166 -48215
5049 55035 -226531 113209 305206 126042 81507 -105590 -136502 -181682 -252140 91537 -274503
5037 -288773 -324523 19965 -67804 -17579 -166684 -22345 224715 323914 129897 -30543 233186
5025 157859 264362 -295284 79285 175288 -112952 -297026 -194322 -200548 11799 -202130 164953
5013 220831 -92933 -39971 -166718 -358059 -55456 -287299 161402 -94575 79853 68338 197775
5002 197775 91102 -130050 220251 -19736 -156377 8395 -128742 -309 303763 -41048 378990
4990 56592 182584 257744 -110659 114633 -205584 -313970 -52068 -255527 68745 -145842
4979 243995 283438 165098 19491 -142880 -120492 -188026 76426 -89491 162766 -32085 32290
4967 -121522 -412795 -106704 215374 26595 112191 -123703 -48071 -246989 -93018 -42297 -183831
4956 -183831 -196607 121018 23441 -45550 -63402 114539 187373 123329 46730 99280 79276
4945 79276 200302 91433 337712 -231855 200385 -236179 -239000 -60704 229551 171387 -200794
4933 -69227 -42919 -8811 41364 114274 77440 148890 -59705 -51911 -331386 46900 -230256 129589
4920 -23251 -168241 84787 -199275 -255131 -130034 171343 81781 338417 214435 -180520
4909 193588 86469 337569 96365 153938 246747 89435 11695 -64961 -106738 242778 186836
4898 186836 -9078 -54079 22919 -173153 -326867 -204453 156800 -183294 80918 242494 71874
4886 79866 28604 111541 -109101 -19635 5987 127044 24389 -148752 153187 -118922 174437
4874 177603 378146 146788 -31591 -77946 26884 -102504 2542 -241916 -2643 -172395 207013
4862 -15270 45513 138889 271326 36273 -27882 177108 199035 173807 149535 74085 -145728
4850 -44769 -138808 -83165 122576 -203654 -98650 51952 177403 -227349 -258158 313329 -109517
4838 -133211 -57020 -63442 188909 -21785 -114299 137295 -145011 -61584 -115236 264802 98969
4826 30846 57173 27376 -135253 26745 -192285 -127680 -60677 -325700 43642 107321 213661
4815 213661 200265 45491 363615 -10656 -228653 94646 -89793 307862 -29166 141671 152294
4804 152294 -47597 74103 68086 -60069 153242 11525 227000 -231504 -52866 -36455 -86589
4793 -86589 19924 -375072 -321971 -92504 272798 16654 73786 -271990 -186176 -209552 -4984
4781 -91071 157726 86676 222465 136361 54282 228311 -52418 -123659 129719 32336 278593
4770 278593 3349 164951 136335 109012 114454 207923 -3494 147766 -23327 -151249 34431 -185382
4757 172211 -49374 192839 -57206 6228 -41942 178810 -31236 -228644 -77389 -262944 -92409
4745 198357 -120446 49647 256227 154820 -51974 125999 -143050 -94318 62913 -126835
4734 -65167 288938 -117385 117351 310756 -166224 218451 122286 -44561 -88641 -108457 -53719
4722 -236941 334531 49682 295252 39641 26884 149593 321515 -146882 -373385 -189305
4712 -189305 2621 74614 126870 30006 382292 -247146 -45022 -109585 68046 -286609 205836
4700 -200234 -139418 -13142 22329 -171489 122594 14702 166650 295576 91779 218831 103080
4688 -179185 247920 61051 -87818 14632 62042 26738 -70776 -245374 -178768 -61901 -64274
4677 -64274 -19741 -46779 80051 -220262 139762 37016 -91561 89255 82722 -300217 -139084
4665 -44661 223924 61394 -357649 -110209 -241437 156953 -37580 -53573 -25226 -268207 -161313
4654 -161313 -358811 293291 98907 252311 -142396 290284 218082 24313 260534 -306223
4643 343950 -245478 -132875 -120649 -301934 -89674 -54049 -61222 137006 249630 -94372 144918
4631 -49357 146308 178577 -220651 -202132 -115523 -166490 -187360 93194 -156187 182462 151783
4620 151783 144829 -296028 -67492 194660 -132899 -60410 13724 8777 -95492 48546 -128492
4608 -24489 260287 111739 79028 89140 -261705 64374 109766 4247 -16017 -32516 3476 41622
4596 41622 -228957 -24091 -123134 135161 -90664 88161 208363 279980 168198 201297 266785
4585 266785 -209039 191519 -100058 -186538 44107 -82492 -120702 127970 -63042 -305712 108277
4573 56557 -68641 294876 47244 -90713 -290259 -10828 -244365 -81861 225955 41341 152379
4562 152379 -240886 46697 84805 72220 240730 -19617 -125878 -59928 248759 -124969 269645
4550 441219 151383 1469 46862 526095 121580 -67696 240374 62555 287515 -200950 54977
4538 125633 -189751 -48195 -139018 85653 218706 49477 104786 -298924 94776 -192949 -62065
4526 -13297 -63486 5071 49898 275734 130811 235510 22448 149296 -3963 329903 123716
4514 139411 360492 210579 58674 14165 -131191 -36678 94801 -245561 86166 3301 -55359
4502 -111547 -191096 70372 181272 -194178 451050 -167815 318774 252097 38462 90057 -35015
4490 -120968 -143616 158133 -69361 118340 150166 261858 -196827 229353 273209 -133925
4479 -267542 -208303 79971 -47731 129706 83255 28648 160027 -141147 208751 212366 84048
4467 353209 130760 -17876 -53525 -157179 -6401 110895 17 26260 -176310 81509 87706 205479
$$ [...]
##END NTUPLES=NMR SPECTRUM
##END=
