##TITLE=AC1668_DOMRH14359_8570861_kikC9f9SbG
##JCAMPDX= 6.0         $$ Bruker NMR JCAMP-DX V2.0
##DATA TYPE= NMR SPECTRUM
##DATA CLASS= NTUPLES
##ORIGIN= BRUKER
##OWNER= Administrator
$$ 1.72 TOPSPIN		Version 2.1
$$ 2014-04-11 16:27:57.152 -0700  Administrator@X
$$ Compression mode = diff/dup
##.OBSERVE FREQUENCY= 400.02188249412
##.OBSERVE NUCLEUS= ^1H
##.ACQUISITION MODE= SIMULTANEOUS (DQD)
##.ACQUISITION SCHEME= undefined
##.AVERAGES= 64
##.DIGITISER RES= 22
##SPECTROMETER/DATA SYSTEM= spect
##.PULSE SEQUENCE= noesygpps1d.comp
##.SOLVENT NAME= COFFEE_meoh
##.SHIFT REFERENCE= INTERNAL, COFFEE_meoh, 1, 14.96145
##AUDIT TRAIL= $$ (NUMBER, WHEN, WHO, WHERE, PROCESS, VERSION, WHAT)
$$ ##TITLE= Audit trail, TOPSPIN		Version 2.1
$$ ##JCAMPDX= 5.01
$$ ##ORIGIN= Bruker BioSpin GmbH
$$ ##OWNER= Administrator
$$ $$ E:\/data/COFFEE/nmr/AC1668_DOMRH14359_8570861_kikC9f9SbG/12/pdata/1/auditp.txt
$$ ##AUDIT TRAIL=  $$ (NUMBER, WHEN, WHO, WHERE, PROCESS, VERSION, WHAT)
(   1,<2014-04-11 16:27:52.246 -0700>,<Administrator>,<X>,<go>,<TOPSPIN 2.1>,
      <created by zg
	started at 2014-04-11 16:16:23.011 -0700,
	POWCHK enabled, PULCHK disabled,
       configuration hash MD5:
       C8 4E 4E 5D D3 5C D8 9E 9F 52 82 E0 59 8A DE 15
       data hash MD5: 64K
       CD ED 77 8A 7C BA 1B EC DA 8D A9 20 9F F3 A2 95>)
(   2,<2014-04-11 16:27:55.262 -0700>,<Administrator>,<X>,<proc1d>,<TOPSPIN 2.1>,
      <Start of raw data processing
       efp LB = 0.3 FT_mod = 6 PKNL = 1 PHC0 = 0 PHC1 = 0 SI = 128K 
       data hash MD5: 128K
       9E B8 DB E8 52 D8 9D 0A 49 DE 7B 64 19 E8 DB DC>)
(   3,<2014-04-11 16:27:56.183 -0700>,<Administrator>,<X>,<proc1d>,<TOPSPIN 2.1>,
      <pk PHC0 = -83.45215 PHC1 = 0 
       data hash MD5: 128K
       C2 14 B3 25 D1 AA 2B 78 75 F3 0C C3 84 3C F0 EA>)
(   4,<2014-04-11 16:27:56.574 -0700>,<Administrator>,<X>,<proc1d>,<TOPSPIN 2.1>,
      <abs ABSG = 1 
       data hash MD5: 128K
       3D 11 C3 DF 09 03 32 7F 5F 00 41 26 4D FC 64 02>)
(   5,<2014-04-11 16:27:56.668 -0700>,<Administrator>,<X>,<proc1d>,<TOPSPIN 2.1>,
      <abs ABSG = 2 
       data hash MD5: 128K
       98 21 2E 96 2E EC FB FA F4 24 43 1C EB F0 10 E0>)
(   6,<2014-04-11 16:27:56.762 -0700>,<Administrator>,<X>,<proc1d>,<TOPSPIN 2.1>,
      <abs ABSG = 3 
       data hash MD5: 128K
       B0 64 B4 0F D6 FE DC 89 29 F3 C8 D7 03 91 3A 1F>)
(   7,<2014-04-11 16:27:56.840 -0700>,<Administrator>,<X>,<proc1d>,<TOPSPIN 2.1>,
      <abs ABSG = 4 
       data hash MD5: 128K
       2E B1 96 EF D9 46 2E 85 8B F1 89 6E E8 8C 5B 76>)
(   8,<2014-04-11 16:27:56.933 -0700>,<Administrator>,<X>,<proc1d>,<TOPSPIN 2.1>,
      <abs ABSG = 5 
       data hash MD5: 128K
       6A 92 58 21 0F DD 67 05 2B 84 FF A1 94 1A 6D A7>)
$$ ##END=
$$ 
$$ $$ hash MD5
$$ $$ DC 25 6F 84 5B 4A 6F 88 40 E1 0C 4A F8 CF 69 9C
##$RELAX= 
##$RELAX= 
##$RELAX= 
##$RELAX= 
##$RELAX= 
##$RELAX= 
##$RELAX= 
##$RELAX= 
$$ Bruker specific parameters
$$ --------------------------
##$DU= <E:\>
##$EXPNO= 12
$$ [...]
##$TP07= 0
##$TPNAME0= <>
##$TPNAME1= <>
##$TPNAME2= <>
##$TPNAME3= <>
##$TPNAME4= <>
##$TPNAME5= <>
##$TPNAME6= <>
##$TPNAME7= <>
##$TPOAL= (0..7)
0.5 0.5 0.5 0.5 0.5 0.5 0.5 0.5
##$TPOFFS= (0..7)
0 0 0 0 0 0 0 0
##$TUNHIN= 0
##$TUNHOUT= 0
##$TUNXOUT= 0
##$USERA1= <user>
##$USERA2= <user>
##$USERA3= <user>
##$USERA4= <user>
##$USERA5= <user>
##$V9= 5
##$VALIST= <valist>
##$VCLIST= <CCCCCCCCCCCCCCC>
##$VD= 0
##$VDLIST= <DDDDDDDDDDDDDDD>
##$VPLIST= <PPPPPPPPPPPPPPP>
##$VTLIST= <TTTTTTTTTTTTTTT>
##$WBST= 1024
##$WBSW= 4
##$XGAIN= (0..3)
0 0 0 0
##$XL= 0
##$YL= 0
##$YMAX_a= 5305059
##$YMIN_a= -11370579
##$ZGOPTNS= <>
##$ZL1= 120
##$ZL2= 120
##$ZL3= 120
##$ZL4= 120
##$ABSF1= 14.96145
##$ABSF2= -5.596732
##$ABSG= 5
##$ABSL= 3
##$ALPHA= 0
##$AQORDER= 0
##$ASSFAC= 0
##$ASSFACI= 0
##$ASSFACX= 0
##$ASSWID= 0
##$AUNMP= <proc_prof1d_extract.lims>
##$AXLEFT= 0
##$AXNAME= <>
##$AXNUC= <1H>
##$AXRIGHT= 0
##$AXTYPE= 0
##$AXUNIT= <>
##$AZFE= 0.1
##$AZFW= 0.1
##$BCFW= 0
##$BC_mod= 0
##$BYTORDP= 0
##$COROFFS= 0
##$CY= 15
##$DATMOD= 1
##$DC= 0
##$DFILT= <>
##$DTYPP= 0
##$F1P= 0
##$F2P= 0
##$FCOR= 0.5
##$FTSIZE= 131072
##$FT_mod= 6
##$GAMMA= 0
##$GB= 0
##$INTBC= 1
##$INTSCL= 1
##$ISEN= 128
##$LB= 0.3
##$LEV0= 0
##$LPBIN= 0
##$MAXI= 10000
##$MC2= 0
##$MEAN= 0
##$ME_mod= 0
##$MI= 0
##$NCOEF= 0
##$NC_proc= -2
##$NLEV= 6
##$NOISF1= 0
##$NOISF2= 0
##$NSP= 0
##$NTH_PI= 0
##$NZP= 0
##$OFFSET= 14.96145
##$PC= 1
##$PHC0= -83.45215
##$PHC1= 0
##$PH_mod= 1
##$PKNL= yes
##$PPARMOD= 0
##$PPDIAG= 0
##$PPIPTYP= 0
##$PPMPNUM= 2147483647
##$PPRESOL= 1
##$PSCAL= 4
##$PSIGN= 0
##$PYNMP= <proc.py>
##$REVERSE= no
##$SF= 400.020009456351
##$SI= 131072
##$SIGF1= 0
##$SIGF2= 0
##$SINO= 400
##$SIOLD= 131072
##$SPECTYP= <>
##$SREGLST= <1H.CDCl3>
##$SSB= 0
##$STSI= 131072
##$STSR= 0
##$SW_p= 8223.68421052631
##$SYMM= 0
##$S_DEV= 0
##$TDeff= 65536
##$TDoff= 0
##$TI= <>
##$TILT= no
##$TM1= 0
##$TM2= 0
##$TOPLEV= 0
##$USERP1= <user>
##$USERP2= <user>
##$USERP3= <user>
##$USERP4= <user>
##$USERP5= <user>
##$WDW= 1
##$XDIM= 131072
##$YMAX_p= 367260168
##$YMIN_p= -11693
##$CURPLOT= <Network HP LaserJet P1505>
##$CURPRIN= <$Network HP LaserJet P1505>
##$DFORMAT= <normdp>
##$LAYOUT= <+/1D_H.xwp>
##$LFORMAT= <normlp>
##$PFORMAT= <normpl>
##$SURQMSG= 1
$$ End of Bruker specific parameters
$$ ---------------------------------
##NTUPLES= NMR SPECTRUM
##VAR_NAME=  FREQUENCY,     SPECTRUM/REAL,   SPECTRUM/IMAG
##SYMBOL=    X,             R,               I
##VAR_TYPE=  INDEPENDENT,   DEPENDENT,       DEPENDENT
##VAR_FORM=  AFFN,          ASDF,            ASDF
##VAR_DIM=   131072,        131072,          131072
##UNITS=     HZ,            ARBITRARY UNITS, ARBITRARY UNITS
##FACTOR=    0.0627417313425164, 1,          1
##FIRST=     8223.62146879497, 1120,         -44109
##LAST=      0,             1857,            -44163
##MIN=       0,             -11693,          0
##MAX=       8223.62146879497, 367260168,    0
$$ Real data points
##PAGE= N=1
##DATA TABLE= (X++(R..R)), XYDATA
$$ [...]
61568D51985k081k318k975l172k697k207k178k213j688p40j61m25j210j853j977
61553D24090j624j058n37j62J52M45N80N47O55J070J337Q80l8n16k46R6j7j48
61535D25506K79R45J150R07P40O32J24o30q27k80J12m22j476k169k336k442k637
61518D17176k552j946j000K2R40J429J059j73j665k724l096k897k273j406o63
61503D00231l85m92n49k96M1J18m3q1K63R18J607K031K044J800J692J885K017
61486D12801J651J034R10J465J946J625P31l5n22j059j563j472o75J26L01P2K
61469D17338J19K1l76o78n92k64J6J60K48L42M89O60O39J39p88j602j723j165
61451D12983m67r7l0J6J92M49P21R58J077J041R58R62J078J318J797K502L111
$$ y = [451985, 449904, 447586, 444611, 441439, 438742, 436535, 434357, 432144, 430456, 429716, 429555, 429130, 427920, 426067, 424090, 422466, 421408, 420871, 420709, 420861, 421306, 421886, 422433, 423088, 424158, 425495, 426375, 426337, 425821, 425575, 425671, 425654, 425506, 425785, 426730, 427880, 428787, 429527, 430159, 430283, 429653, 428826, 428546, 428658, 428236, 426760, 424591, 422255, 419813, 417176, 414624, 412678, 411678, 411700, 412640, 414069, 415128, 414955, 413290, 410566, 407470, 404573, 402300, 400894, 400231, 399846, 399354, 398805, 398509, 398550, 398668, 398625, 398544, 398807, 399725, 401332, 403363, 405407, 407207, 408899, 410784, 412801, 414452, 415486, 416396, 417861, 419807, 421432, 422163, 422128, 421606, 420547, 418984, 417512, 416837, 416963, 417264, 417336, 417338, 417457, 417478, 417102, 416424, 415832, 415568, 415584, 415744, 415992, 416334, 416823, 417483, 418122, 418261, 417473, 415871, 414148, 412983, 412516, 412419, 412389, 412405, 412597, 413046, 413767, 414725, 415802, 416843, 417801, 418763, 419841, 421159, 422956, 425458, 428569]
61434D28569L321L333L601M034L942K950J600P02L97K30m9k00Q1Q45J858K653
61418D57867K663J752N72j7P9K10jj94oJ96k29j264k223k598k522k331k059j582
61400D48313j080r84j434j974k029j587j202j257j478j336p64k14n0j71k33n0
61384D32470K91N21L70k09q82j112n89N51J861K828L123K815K368K243K415K502
61368D51566K266J829J398J098J133J729K691L362L319K946K920L248L252K560
61354D85317J707J475J970K668L277M074N310O665P656Q353R229J0292J0895J0661
61340E69549J0112R927R828Q873O853M706L246K052K06k228m137m809m776m962
61326F04440n421n431m561l168j829p94j26K0l05n79k56N66J280J617J950K656
$$ y = [428569, 431890, 435223, 438824, 442858, 446800, 449750, 451350, 452052, 452449, 452679, 452630, 452430, 452511, 453356, 455214, 457867, 460530, 462282, 462854, 462837, 462916, 463126, 463125, 462931, 462925, 463121, 462892, 461628, 459405, 456807, 454285, 451954, 449895, 448313, 447233, 446249, 444815, 442841, 440812, 439225, 438023, 436766, 435288, 433952, 433188, 432974, 432924, 432753, 432520, 432470, 432761, 433282, 433652, 433443, 432561, 431449, 430860, 431411, 433272, 436100, 439223, 442038, 444406, 446649, 449064, 451566, 453832, 455661, 457059, 458157, 459290, 461019, 463710, 467072, 470391, 473337, 476257, 479505, 482757, 485317, 487024, 488499, 490469, 493137, 496414, 500488, 505798, 512463, 520119, 528472, 537701, 547993, 558888, 569549, 579661, 589588, 599416, 608289, 615142, 619848, 623094, 625146, 625352, 623124, 618987, 614178, 609402, 604440, 599019, 593588, 589027, 585859, 584030, 583236, 583110, 583130, 582825, 582246, 581990, 582556, 583836, 585453, 587403, 590059]
61310E90059L586M375M949N456N907O298O889P970R356J0464J0925J0903J0748
61297F87885J0636J0562J0375R671P949N096J654j627m412o796q768r958j0093
61284G02174r504q905q631q314p483o227m993l934k826j592m44N44J490K261K508
61269F46124K415K811M119N720O848P598Q350Q736Q187P307P494R031J0602J1118
61255G46460J1050J1355J1892J1803J0974J0165R752R161P653N117J946j423m596
61242H41309p196q992r959j0151r681q818p907p032n923m374k609j159l57m7K23
61227G57327Q72K090L793N567O815P257P304P707Q675R584R747R176Q326P329
61213H51569N995M421L123K433K172K032J985K082K243K424K760L321L857M050
$$ y = [590059, 593645, 598020, 602969, 608425, 614332, 620630, 627519, 635489, 644845, 655309, 666234, 677137, 687885, 698521, 709083, 719458, 729129, 737078, 742174, 743828, 742201, 737789, 730993, 722225, 712267, 702174, 692670, 683765, 675134, 666820, 659337, 653110, 648117, 644183, 641357, 639765, 639321, 639865, 641355, 643616, 646124, 648539, 651350, 655469, 661189, 668037, 675635, 683985, 692721, 700908, 708215, 715709, 724740, 735342, 746460, 757510, 768865, 780757, 792560, 803534, 813699, 823451, 832612, 840265, 845382, 847328, 845905, 841309, 834113, 825121, 815162, 805011, 795330, 786512, 778605, 771573, 765650, 761276, 758667, 757508, 757151, 757104, 757327, 758199, 760289, 764082, 769649, 776464, 783721, 791025, 798732, 807407, 816991, 826738, 835914, 844240, 851569, 857564, 861985, 865108, 867541, 869713, 871745, 873730, 875812, 878055, 880479, 883239, 886560, 890417, 894467]
61199H94467L973M144N022O541Q150R434J0687J2599J5294J7945J9693K0615K1373
61186A049937K2097K2249K1469J9971J8041J5788J3464J1355R205O363K853m06
61174A212386k825m867p093r150j0485j1502j3129j5467j7746j9475k0830k1898
61162A057919k2398k2392k2487k2938k3062k2048j9961j7514j5144j2802j0516
61151H46657q616p250o091m711l138j726n76P08K504M576O206O931O878O417N691
61136H54460M657L405K144R56j86j040j001L77K735N026O567P798R705J2516J5394
61121I23513J7582J9398K1663K4482K7164K9140L0431L1226L1602L1727L1832
61110A219760L1799L1235L0037K8464K6522K3863K0487J7080J4241J1758Q957
$$ y = [894467, 898440, 902584, 907606, 914147, 922297, 931731, 942418, 955017, 970311, 988256, 1007949, 1028564, 1049937, 1072034, 1094283, 1115752, 1135723, 1153764, 1169552, 1183016, 1194371, 1203576, 1209939, 1212792, 1212386, 1209561, 1204694, 1197601, 1188451, 1177966, 1166464, 1153335, 1137868, 1120122, 1100647, 1079817, 1057919, 1035521, 1013129, 990642, 967704, 944642, 922594, 902633, 885119, 869975, 857173, 846657, 838041, 830791, 824700, 819989, 816851, 815125, 814549, 815257, 817761, 822337, 828543, 835474, 842352, 848769, 854460, 859117, 862522, 864666, 865622, 865436, 864396, 863395, 863772, 866507, 871533, 878100, 885898, 895603, 908119, 923513, 941095, 960493, 982156, 1006638, 1033802, 1062942, 1093373, 1124599, 1156201, 1187928, 1219760, 1251559, 1282794, 1312831, 1341295, 1367817, 1391680, 1412167, 1429247, 1443488, 1455246, 1464203]
61099A464203N530J764j798m781p352j0270j4178j8765k3054k6644k9997l3267
61087A301391l5642l6382l5999l5642l5595l5054l3311l0593k7735k5340k3313
61076I46785k1044j8139j5035j2615j1158j0050q636o914n190l625k452j964j877
61063H28086j246L85K202L092L043L080M051N997Q291J0018J0630J0722J1750
61050I00101J4358J7482J9717K1031K2409K4235K5990K7273K8198K8861K9187
61039A158842K9366K9692L0033K9970K9507K9072K8847K8558K7873K6724K5400
61028A473884K4496K4419K4679K4293K3219K2590K3067K3852K4163K4660K6397
61017A739719K9211L2383L6082M0855M6359N2025N8286O5564P2729P8362Q3115
$$ y = [1464203, 1469733, 1471497, 1469699, 1464918, 1457566, 1447296, 1433118, 1414353, 1391299, 1364655, 1334658, 1301391, 1265749, 1229367, 1193368, 1157726, 1122131, 1087077, 1053766, 1023173, 995438, 970098, 946785, 925741, 907602, 892567, 879952, 868794, 858744, 850108, 843194, 838004, 834379, 831927, 829963, 828086, 826840, 827225, 829427, 832519, 835562, 838642, 842693, 848690, 856981, 866999, 877629, 888351, 900101, 914459, 931941, 951658, 972689, 995098, 1019333, 1045323, 1072596, 1100794, 1129655, 1158842, 1188208, 1217900, 1247933, 1277903, 1307410, 1336482, 1365329, 1393887, 1421760, 1448484, 1473884, 1498380, 1522799, 1547478, 1571771, 1594990, 1617580, 1640647, 1664499, 1688662, 1713322, 1739719, 1768930, 1801313, 1837395, 1878250, 1924609, 1976634, 2034920, 2100484, 2173213, 2251575, 2334690]
61006B334690Q8955R6554J05530J16890J32649J52791J75160J99023K26391K59267
60996C887900K98035L43738L99540M68204N49822O43452P49566Q70133J008713
60987I219103J172230J370440J610568J891746K203748K528114K839628L109633
60979B5945210L306991L387446L280060K904651K236990J375469N30283q2913
60971D2884187l62648l53820j84649O594Q9465o4954n45458j322325k217739k985444
60961C4943209l446041l564320l419511l123194k763821k398226k060100j763539
60953A2404457j507038j283755j089647r22907p80847o60660n61062m80750m16561
60944D701230l64621l22151k87095k57414k31710k09303j89040j69460j50863
$$ y = [2334690, 2423645, 2520199, 2625729, 2742619, 2875268, 3028059, 3203219, 3402242, 3628633, 3887900, 4185935, 4529673, 4929213, 5397417, 5947239, 6590691, 7340257, 8210390, 9219103, 10391333, 11761773, 13372341, 15264087, 17467835, 19995949, 22835577, 25945210, 29252201, 32639647, 35919707, 38824358, 41061348, 42436817, 42967100, 42884187, 42521539, 42167719, 41983070, 41989664, 42079129, 42014175, 41468717, 40146392, 37928653, 34943209, 31497168, 27932848, 24513337, 21390143, 18626322, 16228096, 14167996, 12404457, 10897419, 9613664, 8524017, 7601110, 6820263, 6159603, 5598541, 5117791, 4701230, 4336609, 4014458, 3727363, 3469949, 3238239, 3028936, 2839896, 2670436, 2519573]
60935B519573j35362j23787j14211j04795r6464r1079q8155q5255q0959p5767
60925A523739p0470o5157n9760n4427m9236m4316m0050l6630l3712l1010k8705
60914A010266k6704k4249k1044j8086j6460j5801j4913j3421j1812j0260q626
60903H28890p307o954p303p314o574n699n232n020m800m653m597m422m196m367
60889G50452n049n708n836n569n314n135m765m082l367l067l421m186m866n277
60875F84810n770o724p956q915r364r573r873j0197j0129r298p787o186n093m473
60861E73472l776k708j563o45K27J340K535L414L831L903L750L611L841M495N132
60846F00859N490O005P145Q459Q896Q020O426M948L924L241K688K106J501J006
$$ y = [2519573, 2384211, 2260424, 2146213, 2041418, 1944954, 1853875, 1765720, 1680465, 1599506, 1523739, 1453269, 1388112, 1328352, 1273925, 1224689, 1180373, 1140323, 1103693, 1069981, 1038971, 1010266, 983562, 959313, 938269, 920183, 903723, 887922, 873009, 859588, 847776, 837516, 828890, 821583, 814629, 807326, 800012, 793438, 787739, 782507, 777487, 772687, 768034, 763437, 759015, 754819, 750452, 745403, 739695, 733859, 728290, 722976, 717841, 713076, 708994, 705627, 702560, 699139, 694953, 690087, 684810, 679040, 672316, 664360, 655445, 646081, 636508, 626635, 616438, 606309, 597011, 589224, 583038, 577945, 573472, 569696, 566988, 565425, 564780, 565007, 566347, 568882, 572296, 576127, 580030, 583780, 587391, 591232, 595727, 600859, 606349, 612354, 619499, 627958, 636854, 644874, 651300, 656248, 660172, 663413, 666101, 668207, 669708, 670714]
60832F70714N26l85j947l596m475m439m142m114m235m138l723l113k502k197k417
60817F25817k896l028k695k654l686n532p008p353p153p575q784r557q789o984
60803E42123n650n433n566n282m836m665m385l471k395k135k717l167k927k358
60789D87136j813j019K41J485K077J910J334O81K15J85O00J161J574J800J933
60774D99500K192K939M274N566N928N408N081N649O489O601O022N689O144P011
60760E74493P643P772P460O844O032N005L694K322J518J683K351K622K222J686
60746F33347J471J333P96k20j489k823m019m748m977n262o182p521q486q771q888
60731E73561r253r502r061q021o993o250n524m592l607k824k334k138k113j872
$$ y = [670714, 671240, 670855, 668908, 665312, 660837, 656398, 652256, 648142, 643907, 639769, 636046, 632933, 630431, 628234, 625817, 622921, 619893, 617198, 614544, 610858, 605326, 598318, 590965, 583812, 576237, 567453, 557896, 549107, 542123, 536473, 531040, 525474, 520192, 515356, 510691, 506306, 502835, 500440, 498305, 495588, 492421, 489494, 487136, 485323, 484304, 484545, 486030, 488107, 490017, 491351, 492032, 492247, 492432, 493032, 494193, 495767, 497567, 499500, 501692, 504631, 508905, 514471, 520399, 525807, 530888, 536537, 543026, 549627, 555649, 561338, 567482, 574493, 582136, 589908, 597368, 604212, 610244, 615249, 618943, 621265, 622783, 624466, 626817, 629439, 631661, 633347, 634818, 636151, 636947, 636727, 635238, 632415, 628396, 623648, 618671, 613409, 607227, 599706, 591220, 582449, 573561, 564308, 554806, 545745, 537724, 530731, 524481, 518957, 514365, 510758, 507934, 505600, 503462, 501349, 499477]
60717D99477j108o8O50Q88J086J533K020K447L211M497N720O191O127O343P158
60702E46172Q055Q356P799O652N646N526O201O612N992M971M678N106N204M515
60688F31485L634K994K325J663J773K927M157M521M371M629N382O119O856P991
60674F90827R331J0264J0886J1968J3698J5287J6049J6231J6411J6703J6869J6833
60662H61357J6721J6714J7002J7600J8011J7490J5795J3422J0923Q460O177M496
60650A024168L527K464K24l287o884r224j0065j0332j1088j2548j4119j5252j5966
60637I21618j6462j6501j5693j4295j3103j2399j1560j0047q316p212o775o290
60625G82965n394m519m110m012l806l445l243l423l896m413m818n268o122p490
$$ y = [499477, 498369, 498301, 498951, 499839, 500925, 502458, 504478, 506925, 510136, 514633, 520353, 526544, 532671, 539014, 546172, 554227, 562583, 570382, 577034, 582680, 588206, 594407, 601019, 607011, 611982, 616660, 621766, 626970, 631485, 635119, 638113, 640438, 642101, 643874, 646801, 650958, 655479, 659850, 664479, 669861, 675980, 682836, 690827, 700158, 710422, 721308, 733276, 746974, 762261, 778310, 794541, 810952, 827655, 844524, 861357, 878078, 894792, 911794, 929394, 947405, 964895, 980690, 994112, 1005035, 1013495, 1019672, 1024168, 1027695, 1030159, 1030383, 1027096, 1020212, 1010988, 1000923, 990591, 979503, 966955, 952836, 937584, 921618, 905156, 888655, 872962, 858667, 845564, 833165, 821605, 811558, 803242, 796030, 789255, 782965, 777571, 773052, 768942, 764930, 761124, 757679, 754436, 751013, 747117, 742704, 737886, 732618, 726496, 719006]
60611G19006q853r472r214q682q443q434q274p807p068o050m874l917l431l189
60597F21298k951l014l770m799n111m392l421k958k832k532k173k243k593k427
60583E76082j335J72J253J519J111M25q0k2N89J423K230L083M114N250O350P438
60567F09602Q591R775J0979J2435J4398J6765J9105K1081K2681K4004K5071K5862
60555H20349K6379K6429K5435K2687J7900J1553M659j817p328j1627j4497j5737
60543I04385j5460j4089j1996r147n390r84L384P304J1198J5865K1465K7151L1775
60530I65461L4869L6768L7905L8119L6697L2995K6988J9360J1043K745n037j1639
60518A226274j6217j8376j8644j7956j6727j4829j2468j0458r362q792q024o886
$$ y = [719006, 710153, 700681, 691467, 682785, 674342, 665908, 657634, 649827, 642759, 636709, 631835, 627918, 624487, 621298, 618347, 615333, 611563, 606764, 601653, 597261, 593840, 590882, 588050, 585518, 583345, 581102, 578509, 576082, 574747, 574919, 576172, 577691, 578802, 579227, 579147, 579125, 579714, 581137, 583367, 586450, 590564, 595814, 602164, 609602, 618193, 627968, 638947, 651382, 665780, 682545, 701650, 722731, 745412, 769416, 794487, 820349, 846728, 873157, 898592, 921279, 939179, 950732, 955391, 953574, 946246, 934619, 920122, 904385, 888925, 874836, 862840, 853693, 848303, 847319, 850703, 858007, 869205, 885070, 906535, 933686, 965461, 1000330, 1037098, 1075003, 1113122, 1149819, 1182814, 1209802, 1229162, 1240205, 1242950, 1237913, 1226274, 1210057, 1191681, 1173037, 1155081, 1138354, 1123525, 1111057, 1100599, 1091237, 1082445, 1074421, 1067535]
60506A067535n596m012j759J050L857O542R601J3228J6891K0155K3448K7614L3045
60493A211599L9695M7523N6407O5826P5146Q4064R2299R9017J03108J04071J01996
60482B080751R6715Q7651P4891N9854M4332K9083J3708k250j8488l4197m8799
60471B383251o2363p5339q7824r8976j07322j11770j12267j09436j03917r6387
60461A417650q7888p9481p1595o4091n7006n0734m5305m0113l4792k9976k6576
60450H30093k4438k2371j9565j6493j4123j2766j2010j1433j0830r902q337o385
60438F61440m893m400m429m028k875j509n46j02J6m7j18N1L87K98o29j910k604
60421F34102k502k285k421k582k395k163k293k513k374k139k348k722k440j540
$$ y = [1067535, 1061939, 1057927, 1056168, 1057218, 1061075, 1067617, 1077218, 1090446, 1107337, 1127492, 1150940, 1178554, 1211599, 1251294, 1298817, 1355224, 1421050, 1496196, 1580260, 1672559, 1771576, 1874684, 1978755, 2080751, 2177466, 2265117, 2340008, 2399862, 2444194, 2473277, 2486985, 2484735, 2466247, 2432050, 2383251, 2320888, 2245549, 2157725, 2058749, 1951427, 1839657, 1727390, 1617954, 1514037, 1417650, 1329762, 1250281, 1178686, 1114595, 1057589, 1006855, 961550, 921437, 886645, 856669, 830093, 805655, 783284, 763719, 747226, 733103, 720337, 708327, 696894, 686064, 676162, 667825, 661440, 656547, 652147, 647718, 643690, 640815, 639306, 638760, 638658, 638674, 638627, 638509, 638560, 638947, 639245, 638616, 636706, 634102, 631600, 629315, 626894, 624312, 621917, 619754, 617461, 614948, 612574, 610435, 608087, 605365, 602925, 601385]
60407F01385j012j220j193r2J433K101J638P46r5q30j131n67M71R10L17n35o77
60390F01649P4J244K210K371J471J14n80j67O64J099J139J169J126O94j9n85q90
60373F12783j133j311j117l99O01J490K020K241K426K746K955K692K096J712J710
60358F31512J679J466J508J955K151J694J369K070L256L485K384J056N61R19J751
60343F58816K847L826M162M006M263N379O770P867Q896J0001J0373R119O588M017
60329G46930K063M29j339l353n565p697r054r099q201p218o331m983l074j439
60315F82069p44n55NJ048J963K479L034M008N110N838O331P336R235J1511J3440
60300G52108J5048J6978J9356K1445K2678K3496K4489K4948K3107J8070J0957
$$ y = [601385, 600373, 599153, 597960, 597868, 599301, 601402, 603040, 603786, 603691, 602861, 601730, 601163, 601634, 602544, 602861, 602326, 601649, 601723, 602967, 605177, 607548, 609019, 609133, 608553, 608386, 609050, 610149, 611288, 612457, 613583, 614277, 614258, 613673, 612783, 611650, 610339, 609222, 608823, 609424, 610914, 612934, 615175, 617601, 620347, 623302, 625994, 628090, 629802, 631512, 633191, 634657, 636165, 638120, 640271, 641965, 643334, 645404, 648660, 652145, 654529, 655585, 656146, 657065, 658816, 661663, 665489, 669651, 673657, 677920, 683299, 690069, 697936, 706832, 716833, 727206, 736325, 742913, 746930, 748993, 749422, 748083, 744730, 739165, 731468, 722414, 713315, 705114, 697896, 691565, 686582, 683508, 682069, 681325, 680770, 680775, 681823, 683786, 686265, 689299, 693307, 698417, 704255, 710586, 717922, 727157, 738668, 752108, 767156, 784134, 803490, 824935, 847613, 871109, 895598, 920546, 943653, 961723, 972680]
60289I72680L757k586q475j4322j9549k3081k4382k3684k1444j8106j4332j0962
60277G95514q377o264m320k978k973m290o101p697q978r991j0561j0657j0586
60264G01741j0445r902q813p601o570n356l696k249j850k219k190j274j63K92
60250F39705k6p65j522j801j212l8Q12P55Q8n14o70l65J87N35L44j17k68p8n7
60231F34993k86j51O64J673K508L529M918N910N791N140N076N629N832N290M628
60216F91144M329M148L835L601L482L077K379K174K989M160M603M220L855L989
60202G41985M190L938L427L192L176K666J175q14k276k744k733k994l674m394
60188G44120m903n219n237m739l902l302l249l408l375l293l517l859l657k597
$$ y = [972680, 976437, 973851, 965376, 951054, 931505, 908424, 884042, 860358, 838914, 820808, 806476, 795514, 787137, 780873, 776553, 773575, 770602, 766312, 760211, 752514, 743536, 733545, 722984, 712327, 701741, 691296, 681394, 672581, 664980, 658410, 653054, 649358, 647109, 645259, 643040, 640850, 639576, 639413, 639705, 639679, 638914, 637392, 635591, 634379, 634341, 635153, 635908, 635996, 635482, 634812, 634447, 634634, 635169, 635513, 635396, 635128, 635050, 634993, 634707, 634556, 635220, 636893, 639401, 642930, 647848, 653758, 659549, 664689, 669765, 675394, 681226, 686516, 691144, 695473, 699621, 703456, 707057, 710539, 713616, 715995, 718169, 721158, 725318, 729921, 734141, 737996, 741985, 746175, 750113, 753540, 756732, 759908, 762574, 763749, 762935, 760659, 757915, 755182, 752188, 748514, 744120, 739217, 733998, 728761, 724022, 720120, 716818, 713569, 710161, 706786, 703493, 699976, 696117, 692460, 689863]
60174F89863j161q0L69M24L68K62J51K68Q57J790K641L110L259L188K828K249
60158G10386K003K650L982N101N410N150M811M428L798L110K804K845K630J827
60144G60935R39P26J291K076K635K998L278L377L319L495M189N123N858O519P511
60129H14269Q589Q871Q007O655N504M397K845R41r15k711m518n798n846m903l994
60114H31393l619l299k571j676j013o11m31o25j114j503j669j903k098j510J16
60099H07867J859K726K963L432M244M915N534O626P843P991O666M915L782K996
60085H74359J788L04o02p55r01j586k400k591k053j435j486k472m096n786p107
60070H43181p970q543q938r019q521p408o102n207m875m587l838k928k761l709
$$ y = [689863, 688702, 688622, 688991, 689415, 689783, 690045, 690196, 690464, 691321, 693111, 695752, 698862, 702121, 705309, 708137, 710386, 712389, 715039, 719021, 724122, 729532, 734682, 739493, 743921, 747719, 750829, 753633, 756478, 759108, 760935, 761874, 762600, 763891, 765967, 768602, 771600, 774878, 778255, 781574, 785069, 789258, 794381, 800239, 806758, 814269, 822858, 831729, 839736, 846391, 851895, 856292, 859137, 860078, 859163, 856452, 851934, 846136, 840290, 835387, 831393, 827774, 824475, 821904, 820228, 819215, 818604, 818173, 817548, 816434, 814931, 813262, 811359, 809261, 807751, 807867, 809726, 812452, 815415, 818847, 823091, 828006, 833540, 840166, 848009, 856000, 862666, 867581, 871363, 874359, 876147, 876451, 875849, 875094, 874193, 872607, 870207, 867616, 865563, 864128, 862642, 860170, 856074, 850288, 843181, 835211, 826668, 817730, 808711, 800190, 792782, 786680, 781473, 776598, 772011, 768173, 765245, 762484, 758775]
60056G58775n080n883n807n211m373l358k446k137k473k845k771k434k112j434
60042G10411N3J830K649K108J263J306K127K687K439J653O78m15j377j738j489
60027G24185j297j701k512l222l714m167m644n080n453n684n500m805m015l696
60013F68695l915m212m115l495k560j784j690k377l299l768l620l152k529j609
59999F26570l74P70J294J053M69K87R96K350L593M238M497M793N155N344N360
59984F66395N394N409N174M646L948L046J858N95l84j060j712k411k956l321l669
59969F80952l906l683l009k358j977j559q46j73J9j38r5L71R60J276J242J064
59953F68140R66R19O98K26k06l47m58j012j863k256j851j274j280j708j719q93
$$ y = [758775, 753695, 747812, 742005, 736794, 732421, 729063, 726617, 724480, 722007, 719162, 716391, 713957, 711845, 710411, 710464, 712294, 714943, 717051, 718314, 719620, 721747, 724434, 726873, 728526, 729204, 728789, 727412, 725674, 724185, 722888, 721187, 718675, 715453, 711739, 707572, 702928, 697848, 692395, 686711, 681211, 676406, 672391, 668695, 664780, 660568, 656453, 652958, 650398, 648614, 646924, 644547, 641248, 637480, 633860, 630708, 628179, 626570, 626196, 626966, 628260, 629313, 629782, 630069, 631065, 633415, 637008, 641246, 645743, 650536, 655691, 661035, 666395, 671789, 677198, 682372, 687018, 690966, 694012, 695870, 696465, 696081, 695021, 693309, 690898, 687942, 684621, 680952, 677046, 673363, 670354, 667996, 666019, 664460, 663614, 663441, 663460, 663322, 663227, 663598, 664558, 665834, 667076, 668140, 669106, 670025, 670723, 670949, 670743, 670396, 669938, 668926, 667063, 664807, 662956, 661682, 660402, 658694, 656975, 656082]
59937F56082K72Q62L85q22j804j773q70J3L00L34O81J243J507J428J573K271L114
59920F64796L398K855J865J057P89Q81R42R01J066J572K005J887J270O11J90j3
59904F86072l3J12K38J49p4k22l51o27q17l52R27K399L286L450L424L754M471
59887G05806N145N434N522N908O685P344P490P460P811Q405Q585Q220P872P704
59873H05391O949M982K444O00k81j172k852m848o181o760p403q601r823j0292
59859G62153r977r381q573p164n329m171m526n754o347n601m133k800j804j030
59845F85563n74m69k93M05J418K116K358K769M007O044Q261J0169J1800J3490
59831G47064J5318J6904J7790J7870J7204J5492J2243P686L149N2j398k115k924
$$ y = [656082, 656354, 657216, 657601, 656779, 654975, 653202, 652332, 652345, 652645, 652979, 653660, 654903, 656410, 657838, 659411, 661682, 664796, 668194, 671049, 672914, 673971, 674760, 675641, 676583, 677484, 678550, 680122, 682127, 684014, 685284, 685895, 686085, 686072, 686039, 686151, 686389, 686538, 686464, 686242, 685891, 685264, 684447, 684095, 685022, 687421, 690707, 694157, 697581, 701335, 705806, 710951, 716385, 721907, 727815, 734500, 741844, 749334, 756794, 764605, 773010, 781595, 789815, 797687, 805391, 812340, 817322, 819766, 820366, 820085, 818913, 816061, 811213, 805032, 798272, 790869, 782268, 772445, 762153, 752176, 742795, 734222, 727058, 721729, 717558, 713032, 707278, 700931, 695330, 691197, 688397, 686593, 685563, 684989, 684520, 684227, 684632, 686050, 688166, 690524, 693293, 697300, 703344, 711605, 721774, 733574, 747064, 762382, 779286, 797076, 814946, 832150, 847642, 859885, 867571, 870720, 870772, 869374, 867259, 864335]
59818H64335l861m746n922q041j1295j5050j8246k0056k0317j9467j8017j6130
59806G03187j3787j1313r352q223p528o665n542m530l859l375k883k434k205k280
59792F19211k650l196l657l814l730l611l412k857k019j506j788k546k996k707
59778E78722j861q56k5L52K24K1K79Q89J107M93m99j165j341j234p53L26J675
59761E76354K458K201J339P20Q34J584K496L021K940K651K877L863N064N740N695
59746F19837N253M692M001L072J899O87j43j73M70R81O13m93j511j911j809j396
59730F34069o09L35O15l28j887k769k451j641j211j137q44j79L98N44M57N13P38
59713F24613Q81Q40P15N04K6o59r30j48J453K727K785J948J310J467K115K758
$$ y = [864335, 860474, 855728, 849806, 841765, 830470, 815420, 797174, 777118, 756801, 737334, 719317, 703187, 689400, 678087, 668735, 660512, 652984, 646319, 640777, 636247, 632388, 629013, 626130, 623696, 621491, 619211, 616561, 613365, 609708, 605894, 602164, 598553, 595141, 592284, 590265, 588759, 586971, 584425, 581429, 578722, 576861, 576005, 575980, 576332, 576556, 576577, 576856, 577745, 578852, 579345, 578846, 577681, 576340, 575106, 574353, 574679, 576354, 578812, 581013, 582352, 583072, 583906, 585490, 587986, 591007, 593947, 596598, 599475, 603338, 608402, 614142, 619837, 625090, 629782, 633783, 636855, 638754, 639441, 639298, 639125, 639595, 640576, 641189, 640696, 639185, 637274, 635465, 634069, 633460, 633795, 634410, 634082, 632195, 629426, 626975, 625334, 624123, 622986, 622142, 621963, 622361, 622905, 623362, 623875, 624613, 625494, 626334, 627049, 627553, 627579, 626920, 625990, 625842, 627295, 630022, 632807, 634755, 636065, 637532, 639647, 642405]
59697F42405L313L846M203M279M320M560M756M442L582K548J498K01j351k568
59683F80034k752j913r00o34j215j797j482m39J49n57j903k423j566k97J43m34
59667F62014j331k002k453k767k818k554k215k003j700q41O56K252L265L551L541
59652F54595L615L695L577L371L325L311K874J837M78r05k351l927n354o174o202
59637F55765n638m834m013l239k533k063k070k484k738k272j170p8N44P33O73
59622F24583M67K90L20L58M0m13k14Q03J593J126j97j053r40o36q86j374j249
59605F22618k25J174K185K401J958J342R19N88M4p05j300j513j552j717k013k172
59589F22032j982j505r81n95l16j3K49J42n45j599k558l067l002k435j721j384
$$ y = [642405, 645718, 649564, 653767, 658046, 662366, 666926, 671682, 676124, 679706, 682254, 683752, 683953, 682602, 680034, 677282, 675369, 674469, 673835, 672620, 670823, 669341, 668902, 669051, 668494, 666591, 664168, 662602, 662305, 662448, 662014, 660683, 658681, 656228, 653461, 650643, 648089, 645874, 643871, 642171, 641330, 641986, 644238, 647503, 651054, 654595, 658210, 661905, 665482, 668853, 672178, 675489, 678363, 680200, 680678, 679773, 677422, 673495, 668141, 661967, 655765, 650127, 645293, 641280, 638041, 635508, 633445, 631375, 628891, 626153, 623881, 622711, 622633, 623177, 623910, 624583, 625050, 625340, 625660, 626018, 626058, 625645, 625431, 626234, 627827, 628953, 628756, 627703, 626763, 626127, 625241, 623867, 622618, 622393, 623567, 625752, 628153, 630111, 631453, 632372, 632960, 633004, 632299, 630999, 629486, 627934, 626217, 624204, 622032, 620050, 618545, 617564, 616969, 616653, 616640, 616889, 617031, 616486, 614887, 612329, 609262, 606260, 603825, 602104, 600720]
59573F00720j626k030k038j618j190r91q91p85p62p93o39j69L45M81R5m80o59
59556E86970j49O84J139J010P74P89Q14O59Q47J799K765K543J258M76J274L122
59540F06774N065P018R207J1084J1884J1939J2506J4253J6506J7893J7201J3795
59528G55125Q098J899k525m089l448j835J33K262M100N081N196M858M217K988
59514G82060J081j029k787m122n324o611p952r182j0078j0419j0202r706r227
59501F96502q785q262p664p014o191n177m369m184m371m139l126j850j055r49
59487F29366j264j617j581q30M67J714K638L557M599N221N057M733N106O058O852
59472F70076P394Q147Q865Q464O517M001K171J376J258J485J782J854J842K454
$$ y = [600720, 599094, 597064, 595026, 593408, 592218, 591227, 590336, 589551, 588789, 587996, 587357, 587188, 587533, 588014, 588109, 587629, 586970, 586821, 587505, 588644, 589654, 590428, 591217, 592031, 592690, 593537, 595336, 598101, 600644, 601902, 602378, 603652, 606774, 611839, 618857, 628064, 639148, 651032, 662971, 675477, 689730, 706236, 724129, 741330, 755125, 763223, 765122, 762597, 758508, 755060, 753225, 753358, 755620, 759720, 764801, 769997, 774855, 779072, 782060, 783141, 782112, 779325, 775203, 769879, 763268, 755316, 746134, 736056, 725637, 715435, 705729, 696502, 687717, 679455, 671791, 664777, 658586, 653409, 649040, 644856, 640485, 636346, 633220, 631370, 630315, 629366, 628102, 626485, 624904, 624074, 624541, 626255, 628893, 632450, 637049, 642270, 647327, 652060, 657166, 663224, 670076, 677470, 685617, 694482, 702946, 709463, 713464, 715635, 717011, 718269, 719754, 721536, 723390, 725232, 727686]
59458G27686M106O231P934R025J0048J1482J3348J5358J7113J8208J8532J8279
59446H77350J7547J6118J3904J1245Q439N135O84n029j1258j6778k0476k1859
59434H75022k1335j9853j8066j6028j3794j1851j0616r809q723o898m306j166
59422G32577K034M760P019R486J2555J5670J8081J9888K1657K3317K4243K4349
59410I15636K4217K3994K2849J9733J4182O282l292j2826j9880k2827k1976j8920
59398I27172j5043j0967o995l556j352j472n022j1907j9911k5723k7409k5791
59386G72024k3168k1024j9222j7093j4552j1986r630p539n926m937m174k965j288
59373F28520Q5N65N42Q13J607K529L323M111M902N347N203M818M912N923P646
$$ y = [727686, 731792, 738023, 745957, 754982, 765030, 776512, 789860, 805218, 822331, 840539, 859071, 877350, 894897, 911015, 924919, 936164, 944603, 949738, 950422, 945393, 934135, 917357, 896881, 875022, 853687, 833834, 815768, 799740, 785946, 774095, 763479, 753670, 744947, 738049, 733743, 732577, 734611, 739371, 746390, 755876, 768431, 784101, 802182, 822070, 843727, 867044, 891287, 915636, 939853, 963847, 986696, 1006429, 1020611, 1026893, 1023601, 1010775, 990895, 968068, 946092, 927172, 912129, 901162, 894167, 890611, 889259, 887787, 882765, 870858, 850947, 825224, 797815, 772024, 748856, 727832, 708610, 691517, 676965, 664979, 655349, 647810, 641884, 636947, 632773, 629808, 628520, 628605, 629170, 629712, 630525, 632132, 634661, 637984, 642095, 646997, 652344, 657547, 662365, 667277, 673200, 680846]
59358F80846R415J0656J1255J1486J1689J2141J3079J4506J5973J6978J7705J9009
59346H44738K1271K3656K4945K4901K4289K3729K3072K1970K0474J8790J6797
59335A088632J4102J0498O158J534k845o631r860j2829j5642j7928j9149j9212
59323A016828j8702j8386j8485j8452j7606j5907j3988j2520j1711j1329j0898
59312H48844r976q588p415p099p323p090o063m957m363l837k802j734j576k231
59298G73790k555j833n12O72J611K610L764M916N910O717P452Q372R682J1325
59284H31921J3167J5313J7926K0865K3773K6498K9100L1556L3618L4618L3170
59273A111525K7722J8365P867j38m125n249n125m222k698j480j565k885m665o507
$$ y = [680846, 690261, 700917, 712172, 723658, 735347, 747488, 760567, 775073, 791046, 808024, 825729, 844738, 866009, 889665, 914610, 939511, 963800, 987529, 1010601, 1032571, 1053045, 1071835, 1088632, 1102734, 1113232, 1119390, 1120924, 1118079, 1111448, 1101588, 1088759, 1073117, 1055189, 1036040, 1016828, 998126, 979740, 961255, 942803, 925197, 909290, 895302, 882782, 871071, 859742, 848844, 838868, 830280, 822865, 815766, 808443, 801353, 795290, 790333, 785970, 782133, 779331, 777597, 776021, 773790, 771235, 769402, 768890, 769562, 771173, 773783, 777547, 782463, 788373, 795090, 802542, 810914, 820596, 831921, 845088, 860401, 878327, 899192, 922965, 949463, 978563, 1010119, 1043737, 1078355, 1111525, 1139247, 1157612, 1165479, 1165341, 1161216, 1155967, 1150842, 1146620, 1143922, 1142442, 1140877, 1137992, 1133327, 1126820]
59259A126820q555j0888j3425j6102j8666k0591k1653k2328k3046k3423k2775
59248I25368k1119j9081j7028j4912j2858j1180r746p985n642l141j013N97J865
59235H04125L055M418N914O976O940N830M387L211K265J255M8j505l628o216q622
59220H28453j0284j1307j2090j2610j2471j1553j0272r136q343p778p178o294
59208G09137n190m279l792l276k092m95L85n4r38q84L68J818K567K681K691K884
59192G01531L346M151N104N612N317M709M673N495O565P093O903O521O623P359
59178G81002Q180Q415Q000P450P141P039P173P840R027J0126J0666J0936J1360
59165H94355J1695J1483J0984J0822J0893J0455R269P749N911L178m30l826o112
$$ y = [1126820, 1118265, 1107377, 1093952, 1077850, 1059184, 1038593, 1016940, 994612, 971566, 948143, 925368, 904249, 885168, 868140, 853228, 840370, 829190, 819444, 811459, 805817, 802676, 801663, 802260, 804125, 807180, 811598, 817512, 824488, 831428, 837258, 841645, 844856, 847121, 848376, 848424, 846919, 843291, 837075, 828453, 818169, 806862, 794772, 782162, 769691, 758138, 747866, 738730, 730387, 722609, 715431, 709137, 703947, 699668, 695876, 692600, 690508, 690013, 690398, 690344, 689406, 688522, 688890, 690708, 693275, 695956, 698647, 701531, 704877, 709028, 714132, 719744, 725061, 729770, 734443, 739938, 746503, 753596, 760499, 767020, 773643, 781002, 789182, 797597, 805597, 813047, 820188, 827227, 834400, 842240, 851267, 861393, 872059, 882995, 894355, 906050, 917533, 928517, 939339, 950232, 960687, 969956, 977705, 983616, 986794, 986364, 982538, 976426]
59152I76426p661r269j0917j2043j2637j3148j3525j3236j2314j1583j1576j1704
59140H36813j0911q933o537m642l506k802k176j564r41j09J045K234L028L414
59126H04413L912N030O821Q901J0675J1606J1631J1417J1872J3249J4934J6238
59114I30699J6993J7348J7326J6902J6138J4989J3231J0882Q415O190L933J191
59102A074237j846m473o311p663q933j0069j0783j1104j1433j2055j2668j2557
59090I64342j1339r421p649o515n991n998o606p620q435q672q735r316j0488j1613
59076H45944j2103j1942j1494j1066j0704j0219r373q144o837n747m861l997l237
59063G36220k941l253l770l860l293k411j676j155o09j6K01l62j514k501k635
$$ y = [976426, 968765, 959496, 948579, 936536, 923899, 910751, 897226, 883990, 871676, 860093, 848517, 836813, 825902, 816969, 810432, 805790, 802284, 799482, 797306, 795742, 794801, 794692, 795737, 797971, 800999, 804413, 808325, 813355, 820176, 829077, 839752, 851358, 862989, 874406, 886278, 899527, 914461, 930699, 947692, 965040, 982366, 999268, 1015406, 1030395, 1043626, 1054508, 1062923, 1069113, 1073046, 1074237, 1072391, 1067918, 1061607, 1053944, 1045011, 1034942, 1024159, 1013055, 1001622, 989567, 976899, 964342, 953003, 943582, 935933, 929418, 923427, 917429, 910823, 903203, 894768, 886096, 877361, 868045, 857557, 845944, 833841, 821899, 810405, 799339, 788635, 778416, 769043, 760899, 754062, 748315, 743454, 739457, 736220, 733279, 730026, 726256, 722396, 719103, 716692, 715016, 713861, 713252, 713236, 713437, 713075, 711561, 709060, 706425]
59048G06425j808n65K63J66n49j010p58k78l04p64r12l74L76O59L24j86j53R66
59030G01518K935M630N133M974N555P280Q968R539R493J0027J1217J1907J1218
59017H04394R463P566O060M814L440J771N8j308k233k834k973k291q83N04J299
59002H26847J804K726M229N815O980P668Q167Q789R532R906R344P917O356N144
58988I21224L987K399M12j669l832o124q158r342r552r131q381p360o103m584
58974H53786k559J78L336O275Q569J0257J1532J2495J3248J3985J4953J6181J7328
58961I79564J7877J7679J7097J6271J4548J1146O327J191l569p984j1933j5000
58949A043214j7408j9951k2501k3701k2827k0939j9334j7967j6333j4912j4270
$$ y = [706425, 704617, 704052, 704315, 704481, 703932, 702922, 702164, 701886, 701582, 700818, 699906, 699532, 699908, 700567, 700891, 700705, 700552, 701518, 704453, 709083, 714216, 719190, 724745, 732025, 740993, 750532, 760025, 770052, 781269, 793176, 804394, 813857, 821423, 827483, 832297, 835737, 837508, 837566, 836258, 834025, 831191, 828218, 825927, 825044, 825548, 826847, 828651, 831377, 835606, 841421, 848401, 856069, 864236, 873025, 882557, 892463, 901807, 909724, 916080, 921224, 925211, 927610, 928022, 926353, 922521, 916397, 908239, 898897, 889345, 880214, 871833, 864473, 858370, 853786, 851227, 851405, 854741, 861016, 869585, 879842, 891374, 903869, 917117, 931102, 946055, 962236, 979564, 997441, 1015120, 1032217, 1048488, 1063036, 1074182, 1080509, 1081700, 1078131, 1070147, 1058214, 1043214, 1025806, 1005855, 983354, 959653, 936826, 915887, 896553, 878586, 862253, 847341, 833071]
58938H33071j3572j1550q589o340n470n193m884m645m319l431k367k209l027l625
58924G53850l338k808k574k207j503j181j564j701q36K50M64J97P54K407M179
58909G44389N339O114O969Q021R153J0169J0817J1177J1872J3458J5750J8120
58897H71348K0236K1991K3015K2921K2021K1285K1515K2878K5103K7648K9815
58886A129776L1114L1694L1984L1928L0829K8005K3341J7294J0634M163j666p035
58874A362061j2419j7933k3103k7399l0668l2988l4230l4040l2306k9540k6652
58863A060783k4302k2499k0920j9483j8453j8031j8018j7928j7340j6173j4698
58852H52938j3311j2128j0924r598q506q052q038p828p234o813p047p624p812
$$ y = [833071, 819499, 807949, 799360, 793020, 787550, 782357, 777473, 772828, 768509, 765078, 762711, 760502, 757475, 753850, 750512, 747704, 745130, 742923, 741420, 740239, 738675, 736974, 736138, 736388, 736852, 737049, 737803, 740210, 744389, 749728, 755842, 762811, 770832, 779985, 790154, 800971, 812148, 824020, 837478, 853228, 871348, 891584, 913575, 936590, 959511, 981532, 1002817, 1024332, 1047210, 1072313, 1099961, 1129776, 1160890, 1192584, 1224568, 1256496, 1287325, 1315330, 1338671, 1355965, 1366599, 1370762, 1369096, 1362061, 1349642, 1331709, 1308606, 1281207, 1250539, 1217551, 1183321, 1149281, 1116975, 1087435, 1060783, 1036481, 1013982, 993062, 973579, 955126, 937095, 919077, 901149, 883809, 867636, 852938, 839627, 827499, 816575, 806977, 798471, 790419, 782381, 774553, 767319, 760506, 753459, 745835, 738023]
58839G38023p424o981o976p222p164o619n998n713n661n472n115m781m351l442
58825F55104k115q86R0J240K624L467L242K620K562K983L170L149L541M200M171
58810F89162L183K079J439P29o31k130k766k346j621j406j905k683l043k653j914
58795F73494j442j254r30n26n85j129j365p43L80J465K572L962N460O654P379
58780F93392P595P225O466N855N650N501M970M024K751J080q81k720m244n655
58766G31009o881p342o835o015n523n133m392l544l096k806j935l60J207K087
58752F80441K239K091K206K944M123N128N624N883O208O497O809P801R849J2015
58738G59858J2763J1671R884Q820Q904R560R981R805R315R024Q877Q134O274L848
$$ y = [738023, 730599, 723618, 716642, 709420, 702256, 695637, 689639, 683926, 678265, 672793, 667678, 662897, 658546, 655104, 652989, 652103, 652193, 653433, 656057, 659524, 662766, 665386, 667948, 670931, 674101, 677250, 680791, 684991, 689162, 692345, 694424, 695863, 696592, 695961, 693831, 691065, 688719, 687098, 685692, 683787, 681104, 678061, 675408, 673494, 672052, 670798, 669868, 669342, 668757, 667628, 666263, 665520, 665900, 667365, 669937, 673899, 679359, 686013, 693392, 700987, 708212, 714678, 720533, 726183, 731684, 736654, 740678, 743429, 744509, 743628, 740908, 736664, 731009, 724128, 716786, 709951, 703936, 698413, 693280, 688888, 685344, 682248, 679442, 677507, 677147, 678354, 680441, 682680, 684771, 686977, 689921, 694044, 699172, 704796, 710679, 716887, 723384, 730193, 737994, 747843, 759858, 772621, 784292, 794176, 802996, 811900, 821460, 831441, 841246, 850561, 859585, 868462, 876596, 882870, 886718]
58724H86718J981J225J237J459J653J821K017K288K597K814K887K821K459J639
58710I15616O22j12p31k047m222o207p159p810r519j2288j4756j6056j6697j7479
58696H01155j8396j8943j8831j8012j6523j4652j2881j1427j0110q846p863p288
58684F37383o918o585o438o525o460n858m962m397m289l957k734q53Q41K048L372
58669E83668N282P173Q129Q367R116J0946J3044J4336J4563J3799J1834Q779N657
58656G14693L367J425j330m922q018r535r599q888p856o893o461o577o579n854
58642F36973m494l015j711o47J1Q7k58n27l23L19J013J330J029J52j015k025k504
58625F24395k407j995j438n81P27K208L456M497N724P247Q809J0278J1671J2674
$$ y = [886718, 888699, 889924, 891161, 892620, 894273, 896094, 898111, 900399, 902996, 905810, 908697, 911518, 913977, 915616, 916238, 916126, 915395, 913348, 909126, 902919, 895760, 887950, 878431, 866143, 851387, 835331, 818634, 801155, 782759, 763816, 744985, 726973, 710450, 695798, 682917, 671490, 661380, 652534, 644671, 637383, 630465, 623880, 617442, 610917, 604457, 598599, 593637, 589240, 584951, 580994, 578260, 577407, 578248, 580296, 583668, 588950, 596123, 604252, 612619, 621735, 632681, 645725, 660061, 674624, 688423, 700257, 709036, 714693, 718060, 719485, 718155, 713233, 705215, 695680, 686081, 677193, 669337, 662444, 655983, 649406, 642827, 636973, 632479, 629464, 627753, 627106, 627117, 627204, 626946, 626419, 626096, 626415, 627428, 628758, 629787, 629939, 628924, 626899, 624395, 621988, 619993, 618555, 617974, 618701, 620909, 624365, 628862, 634586, 641833, 650642, 660920, 672591, 685265]
58611F85265J2775J2076J1249J0443Q985O559L889J707l01k709n083o451o700
58598G31704o636o720o572n743m334k707j095M55K020L699N304O396P001P911
58584G30683R771J2099J3809J4473J4465J4037J2973J1189R051O937M952L199
58572H57638J949J382J427J893K635L676N294P763J0753J3340J4944J5948J6931
58559I55573J7652J7315J5676J3289J0707P981M980J786j326m075o288p963r099
58546A016208r536r253q759q680q926q956r000j0061j2317j4453j5304j5293j5466
58533H70204j5859j5784j5070j3918j2145r632p111n355m023k402q79l61n05j
58519G67159J460K831L528M165N148N785N371M231L066K098J351J098J459J984
$$ y = [685265, 698040, 710116, 721365, 731808, 740793, 747352, 751241, 752948, 752647, 749938, 744855, 738404, 731704, 725068, 718348, 711776, 706033, 701699, 698992, 697897, 698352, 700372, 704071, 709375, 715771, 722772, 730683, 740454, 752553, 766362, 780835, 795300, 809337, 822310, 833499, 842550, 849487, 854439, 857638, 859587, 860969, 862396, 864289, 866924, 870600, 875894, 883657, 894410, 907750, 922694, 938642, 955573, 973225, 990540, 1006216, 1019505, 1030212, 1038193, 1043173, 1044959, 1043633, 1039558, 1033270, 1025307, 1016208, 1006672, 997419, 988660, 979980, 971054, 962098, 953098, 943037, 930720, 916267, 900963, 885670, 870204, 854345, 838561, 823491, 809573, 797428, 787796, 780685, 775330, 771307, 768905, 768026, 767665, 767160, 767159, 768619, 771450, 774978, 779143, 784291, 790076, 795447, 799678, 802744, 804842, 806193, 807291, 808750, 810734]
58505H10734K090J645R02K83J57M31L74o47k268l518l990m016l895l671l593l881
58489G87137m046l308j759l36N13J261K291L357M255N284O619P925Q862R449R700
58474H37204R427Q577P225N165K144j371m314o140p306q435r477r829q973o983
58460H06914m668l078k395j654L2K349M496O407Q345R777R825Q659P234N773L696
58445H61712J062j170k506l420m254m644m345l678k933k113j398j000m90Q10K641
58430H34274L978M434M601M941N364N872O622P325P607P872Q584Q865P263M059
58416I21661J167m36j560k693k862j482K28P89K25o29j546k583l312l419l373
58401I00175l679m029l933l598l462l402l011k312j721j605k062k686k744k101
$$ y = [810734, 812824, 814469, 815371, 815654, 815811, 816242, 816616, 815969, 813701, 810183, 806193, 802177, 798282, 794611, 791018, 787137, 783091, 779783, 778024, 777688, 778201, 779462, 781753, 785110, 789365, 794649, 801268, 809193, 818055, 827504, 837204, 846631, 855208, 862433, 867598, 869742, 868371, 864057, 857917, 850611, 842176, 832699, 822870, 813897, 806914, 802246, 799168, 796773, 795119, 795151, 797500, 801996, 808403, 816748, 826525, 836350, 845009, 852243, 858016, 861712, 862774, 861604, 859098, 855678, 851424, 846780, 842435, 838757, 835824, 833711, 832313, 831313, 830823, 831633, 834274, 838252, 842686, 847287, 852228, 857592, 863464, 870086, 877411, 885018, 892890, 901474, 910339, 917602, 921661, 922828, 922392, 920832, 918139, 915277, 913795, 914023, 914812, 915037, 914408, 912862, 910279, 906967, 903548, 900175, 896496, 892467, 888534, 884936, 881474, 878072, 875061, 872749, 871028, 869423, 867361, 864675, 861931, 859830]
58387H59830j754k623m086m803m644m421m067k793j019j46k6J285M540P859R250
58372H52382Q991Q526Q474Q815R655J0721J1217J1132J1557J2869J3856J3558
58360I81753J2746J2522J2654J2355J1627J0798R642Q018O396N086L806K776K905
58347A093084M180N150M916M426M807N774O666P744R236J0369J0577J0699J1718
58334A189346J3287J4486J5168J5554J5536J5271J5399J5752J4988J2483R394
58323A346664O944M977L107J923J897K403K907L879N404O375O251O220P393R108
58309A415452J0360J1401J2678J3598J3813J4322J5794J7085J6981J6167J5985
58298A573636J6433J6786J7054J7437J7547J7366J7729J8681J8874J7778J6786
$$ y = [859830, 858076, 855453, 851367, 846564, 841920, 837499, 833432, 830639, 829620, 829474, 829448, 830733, 835273, 843132, 852382, 861373, 869899, 878373, 887188, 896843, 907564, 918781, 929913, 941470, 954339, 968195, 981753, 994499, 1007021, 1019675, 1032030, 1043657, 1054455, 1064097, 1072115, 1078511, 1083597, 1087403, 1090179, 1093084, 1097264, 1102414, 1107330, 1111756, 1116563, 1122337, 1129003, 1136747, 1145983, 1156352, 1166929, 1177628, 1189346, 1202633, 1217119, 1232287, 1247841, 1263377, 1278648, 1294047, 1309799, 1324787, 1337270, 1346664, 1353608, 1358585, 1361692, 1363615, 1365512, 1367915, 1370822, 1374701, 1380105, 1386480, 1392731, 1398951, 1406344, 1415452, 1425812, 1437213, 1449891, 1463489, 1477302, 1491624, 1507418, 1524503, 1541484, 1557651, 1573636, 1590069, 1606855, 1623909, 1641346, 1658893, 1676259, 1693988, 1712669, 1731543, 1749321, 1766107]
58287A766107J6839J6879J6124J5817J6906J8053J8050J8324K0598K3801K5823
58276A973321K6933K9017L2454L6202L9883M3604M6614M8259M9480N1596N4538
58265B431901N7817O1867O6730P0839P2936P3839P4700P5021P4091P2659P1483
58254C203883P0078O8548O8632P1074P4125P6592P9984Q5584R1888R7294J02788
58243D090470J09546J16573J23161J30915J40667J50218J58071J66325J76839
58234E362785J87714J97015K06778K19651K34612K49827K66628K86687L08381
58225G520078L29967L53297L80304M09234M38593M71311N10500N54713O02033
58216A1570030O54957P16447P85326Q60779R47219J049427J167604J302808J462455
$$ y = [1766107, 1782946, 1799825, 1815949, 1831766, 1848672, 1866725, 1884775, 1903099, 1923697, 1947498, 1973321, 2000254, 2029271, 2061725, 2097927, 2137810, 2181414, 2228028, 2276287, 2325767, 2377363, 2431901, 2489718, 2551585, 2618315, 2689154, 2762090, 2835929, 2910629, 2985650, 3059741, 3132400, 3203883, 3273961, 3342509, 3411141, 3482215, 3556340, 3632932, 3712916, 3798500, 3890388, 3987682, 4090470, 4200016, 4316589, 4439750, 4570665, 4711332, 4861550, 5019621, 5185946, 5362785, 5550499, 5747514, 5954292, 6173943, 6408555, 6658382, 6925010, 7211697, 7520078, 7850045, 8203342, 8583646, 8992880, 9431473, 9902784, 10413284, 10967997, 11570030, 12224987, 12941434, 13726760, 14587539, 15534758, 16584185, 17751789, 19054597, 20517052]
58207B0517052J654865J884241K157670K491453K904222L410110M023897M761761
58199D3805271N626388O600786P670617Q849545J0178382J1714021J3528896J5694540
58191A23668446J8222958K1005346K3807632K6319347K8208206K9147433K8785710
58184B99165078K6650694K2119594J4701132M623670o766660j7357466k5265671
58177C17870371k9682320l0929246k9898544k7503445k4463576k1284319j8253356
58170A35855565j5472310j2950466j0676158q618985o730921m985539l395344
58163G3025842j977591p31950L33355J172342J691950J736892J109961k83712
58155G6077089k238159m235907n723869o436841o464178o059953n447252m768928
$$ y = [20517052, 22171917, 24056158, 26213828, 28705281, 31609503, 35019613, 39043510, 43805271, 49431659, 56032445, 63703062, 72552607, 82730989, 94445010, 107973906, 123668446, 141891404, 162896750, 186704382, 213023729, 241231935, 270379368, 299165078, 325815772, 347935366, 362636498, 367260168, 360493508, 343136042, 317870371, 288188051, 257258805, 227360261, 199856816, 175393240, 154108921, 135855565, 120383255, 107432789, 96756631, 88137646, 81406725, 76421186, 73025842, 71048251, 70316301, 70649656, 71821998, 73513948, 75250840, 76360801, 76077089, 73838930, 69603023, 63879154, 57442313, 50978135, 44918182, 39470930, 34702002]
58147C4702002m116120l537180l037423k603899k229933j911561j638305j401059
58139A4226522j199170j031494q89965p68597o69575n94332n36607m89338m51024
58130G596420m20915l94829l69703l46217l23864k99287k72015k46025k23370
58121D700195k01853j80755j63026j49883j38982j29817j25345j26054j27651
58112C356829j26825j24529j21685j16524j08360r9652r2173q4809p6787o9352
58102B336133o2860n5907m8680m3531m1069l9201l7071l6231l6844l6543l4476
58091A863720l2951l3599l5127l6075l6733l7175l6432l4764l3879l3991l3433
58080A479561l1926l1169l1507l1180k9662k8566k8373k7428k5287k3798k3686
$$ y = [34702002, 30585882, 27048702, 24011279, 21407380, 19177447, 17265886, 15627581, 14226522, 13027352, 11995858, 11105893, 10337296, 9667721, 9073389, 8536782, 8047444, 7596420, 7175505, 6780676, 6410973, 6064756, 5740892, 5441605, 5169590, 4923565, 4700195, 4498342, 4317587, 4154561, 4004678, 3865696, 3735879, 3610534, 3484480, 3356829, 3230004, 3105475, 2983790, 2867266, 2758906, 2659254, 2567081, 2482272, 2405485, 2336133, 2273273, 2217366, 2168686, 2125155, 2084086, 2044885, 2007814, 1971583, 1934739, 1898196, 1863720, 1830769, 1797170, 1762043, 1725968, 1689235, 1652060, 1615628, 1580864, 1546985, 1512994, 1479561, 1447635, 1416466, 1384959, 1353779, 1324117, 1295551, 1267178, 1239750, 1214463, 1190665, 1166979]
58069A166979k3106k0986j8875j8103j7729j6709j5548j4579j3062j1232j0744
58058I86306j1875j2694j2212j1884j2698j3287j2460j1288j1079j1313j1044
58047H54472j0516r962q647o596n528o619q750j0217j0761j0850j0424r553r006
58034G37043r148r291q943q487q157p645p226p750r058r931r984j0019j0108r224
58020F12072p263n554m684l712k221j222j255j449j269j427k111k274j588j247
58006E74796j767j836n24J061J640J620J838J955J497J178J779K797L420L811
57992E93265M376M739M476L890L228K169Q28J34M04O94L16k08m16p87j587k190
57976F13331k403l087m508n485n266m878n453o448o802o733p031p490p288o332
$$ y = [1166979, 1143873, 1122887, 1104012, 1085909, 1068180, 1051471, 1035923, 1021344, 1008282, 997050, 986306, 974431, 961737, 949525, 937641, 924943, 911656, 899196, 887908, 876829, 865516, 854472, 843956, 833994, 825347, 818751, 813223, 806604, 797854, 787637, 776876, 766026, 755602, 746049, 737043, 727895, 718604, 709661, 701174, 693017, 685372, 678146, 670396, 661338, 651407, 641423, 631404, 621296, 612072, 604809, 599255, 594571, 590859, 588638, 587416, 586161, 584712, 583443, 582016, 579905, 577631, 576043, 574796, 573029, 571193, 570669, 571730, 573370, 574990, 576828, 578783, 580280, 581458, 583237, 586034, 589454, 593265, 597641, 602380, 606856, 610746, 613974, 616143, 616971, 617105, 617509, 618203, 618519, 618311, 617895, 617108, 615521, 613331, 610928, 607841, 603333, 597848, 592582, 587704, 582251, 575803, 569001, 562268, 555237, 547747, 540459, 534127]
57962E34127n144m094l474l537l767l094j535n19q92j757k171k608l626m369l770
57947D89770k248r33m9P70J382J547J748K477L383M031M739N711O331O330O633
57932E31622P865Q960Q658P474O712O318N272L650K535K114J412J1j366k132k569
57917E86536l132l895m944o506q432j0104j0999j1094j0737j0440j0557j0826
57905D84870j0613r866r314r360r357q588p376o608o564o900p331p658p487o612
57891C71236n458m529l641k249l66J362K377K686K715K911L327L581L453L339
57877C80744L629L874L432K723K776L489L609K700J847J817J846J103J45l7M10
57862D14107O55M72K02m7k68j58L87Q77R94J184J884K809L540M206M887N104M605
$$ y = [534127, 528983, 524889, 521415, 517878, 514111, 511017, 509482, 508963, 508071, 506314, 504143, 501535, 497909, 493540, 489770, 487522, 486589, 486540, 487310, 488692, 490239, 491987, 494464, 497847, 501878, 506617, 512328, 518659, 524989, 531622, 539487, 548447, 557105, 564579, 571291, 577609, 582881, 586531, 589066, 591180, 592592, 592603, 591237, 589105, 586536, 583404, 579509, 574565, 568059, 559627, 549523, 538524, 527430, 516693, 506253, 495696, 484870, 474257, 464391, 455077, 445717, 436360, 427772, 420396, 413788, 407224, 400324, 392993, 385335, 377848, 371236, 365778, 361249, 357608, 355359, 354993, 356355, 358732, 361418, 364133, 367044, 370371, 373952, 377405, 380744, 384373, 388247, 391679, 394402, 397178, 400667, 404276, 406976, 408823, 410640, 412486, 413589, 413734, 413697, 414107, 414762, 415234, 415436, 415389, 415121, 414963, 415350, 416227, 417221, 418405, 420289, 423098, 426638, 430844, 435731, 440835, 445440]
57845D45440L991L819L803L494L082K743K038Q26n6L3L69r6j232k228k981l876
57829D59169m671m795m421m208m228m067l733l533l308k690j911j485j290p57
57815D14072J50R96J681K424L038L054K501J928J591J190M26n76j417j805j805
57800D27448j850k275k919l561m563o341q263r131q915q818r342r524q666p483
57786C35797o784o213n294m524m292l840k516j146p97j001n26O71J681K253K841
57771C06310L427L586L441L493L816M275N053N956N943M491K752K018J785P08
57757C57054j110k460l159m053n132n442m922m670n135n497n126m357l534k570
57743B99887j756j815k711l437l327k729k134j587j125r26p64k25M22L92m11j166
$$ y = [445440, 449431, 453250, 457053, 460547, 463629, 466372, 468410, 469236, 469180, 469213, 469582, 469486, 468254, 466026, 463045, 459169, 454498, 449703, 445282, 441074, 436846, 432779, 429046, 425513, 422205, 419515, 417604, 416119, 414829, 414072, 414222, 415218, 416899, 419323, 422361, 425415, 427916, 429844, 431435, 432625, 433051, 432475, 431058, 429253, 427448, 425598, 423323, 420404, 416843, 412280, 405939, 397676, 388545, 379630, 370812, 361470, 351946, 343280, 335797, 329013, 322800, 317506, 312982, 308690, 304850, 302334, 301188, 300391, 299390, 298864, 299535, 301216, 303469, 306310, 309737, 313323, 316764, 320257, 324073, 328348, 333401, 339357, 345300, 349791, 352543, 354561, 356346, 357054, 355944, 353484, 350325, 346272, 341140, 335698, 330776, 326106, 320971, 315474, 310348, 305991, 302457, 299887, 298131, 296316, 293605, 290168, 286841, 284112, 281978, 280391, 279266, 278340, 277576, 277351, 277773, 278165, 277754, 276588]
57727B76588j237p31O9R14J313R21K98L80J155J718J627J264Q96L48k61m56k48
57710B84558j29j48J14N42N05qk09L08J096J746K266K463J925R73O92J626L096
57693C01416M124M316L728K638J694J527J973K259K089J874J945K285L054M545
57679C39467O589Q811J1442J5039J9402K3836K8414L3947M0588M7666N5029O3380
57667F93610P2872Q2383R0445R5738R6165Q8511P0128M0948M136l4394o7498q9693
57655A143351r9755j00256r4635q5389p4643o4416n5488m7182l9076l1990k6686
57644D23835k2699j9245j6319j4099j2165j0182q594p753p072n879m506l693l404
57631B88225l012k280j466p57k71k26o04r84j124j302j663j756j240o17o98j623
$$ y = [276588, 275351, 274620, 274689, 275603, 276916, 277837, 278135, 278515, 279670, 281388, 283015, 284279, 285175, 285523, 285262, 284806, 284558, 284429, 284281, 284395, 284937, 285442, 285434, 285225, 285533, 286629, 288375, 290641, 293104, 295029, 296002, 296694, 298320, 301416, 305540, 309856, 313584, 316222, 317916, 319443, 321416, 323675, 325764, 327638, 329583, 331868, 334922, 339467, 346056, 354867, 366309, 381348, 400750, 424586, 453000, 486947, 527535, 575201, 630230, 693610, 766482, 848865, 939310, 1035048, 1131213, 1219724, 1289852, 1330800, 1334936, 1300542, 1233044, 1143351, 1043596, 943340, 848705, 763316, 688673, 624257, 568769, 521587, 482511, 450521, 423835, 401136, 381891, 365572, 351473, 339308, 329126, 320532, 312779, 305707, 299828, 295322, 291629, 288225, 285213, 282933, 281467, 280710, 280439, 280213, 279609, 278625, 277501, 276199, 274536, 272780, 271540, 270923, 270225, 268602]
57615B68602k814l567l387k188n84L57M6j104k173k448j718m22M33J68o31p87
57599B47783j20M11K37j38k53m31r44j407j521j566j648j330n76k24p85j554j666
57582B34268j326j264j572j843j982k129k243k295k487k796k806k425k173k301
57568B04626k314j844j309j123j001o74n14p87r73o11j49j84m82n30m20m01j69
57551A91141N40J207J307J223J550K012K062K012K472L075K865J757N63k41p80
57536B12765r98o90k27k30n51m29K30O76M50r4n65j012j405j421r88m90j84R9
57518B04936L90L05l44j057j102l05Q20J618J818J615J337J130R46P33M40o0p51
57501B12469j222j054m62q3j79n30j074j914k607k339j135j13p8n97q93r25r67
$$ y = [268602, 265788, 262221, 258834, 256646, 256062, 256419, 256465, 255361, 253188, 250740, 249022, 248600, 249033, 249201, 248570, 247783, 247663, 248074, 248311, 248173, 247920, 247489, 246545, 245138, 243617, 242051, 240403, 239073, 238497, 238273, 237488, 235934, 234268, 232942, 231678, 230106, 228263, 226281, 224152, 221909, 219614, 217127, 214331, 211525, 209100, 206927, 204626, 202312, 200468, 199159, 198036, 197035, 196361, 195847, 195060, 194087, 193476, 193327, 193143, 192661, 192131, 191711, 191310, 191141, 191681, 192888, 194195, 195418, 196968, 198980, 201042, 203054, 205526, 208601, 211466, 213223, 213786, 213545, 212765, 211767, 211077, 210850, 210620, 210069, 209640, 209870, 210546, 210996, 210902, 210337, 209325, 207920, 206499, 205511, 205021, 204837, 204936, 205326, 205631, 205287, 204230, 203128, 202823, 203643, 205261, 207079, 208694, 210031, 211161, 212107, 212840, 213280, 213220, 212469, 211247, 210193, 209731, 209648, 209469, 208939, 207865, 205951, 203344, 201005, 199870, 199757, 199679, 199082, 198189, 197264, 196297]
57484A96297r42q12r74j581k053j898j455j201r42m10O3J71K76O03N48l29j270
57467A84091j324p60l67k7P89J557J249J82j60P35J696J582P06J59N15J516K382
57450A94521K348J369L11m5J5k12n40j59R72J950K137J697R33lo91n78J95Q47
57432B05067R83R22R61R82R11Q56O90J76m67p21n47m31o03q63j160j606j973j827
57414B01350j300j010j144j211q51k69J52J68l27j039j157k30J053J668J680J933
57398A99466K466K352J224o7n74j95P74K072L161L345K692K115K179K415K219
57383B25644J771J632J961K491K888K843K218J280M77q8n88j013j300j731k491
57368B35994k976k455j286n61n67o26n03p77j464j553n09P58J141P34L31L01O02
$$ y = [196297, 195355, 194543, 193569, 191988, 189935, 188037, 186582, 185381, 184439, 184029, 184092, 184263, 184539, 185142, 185690, 185361, 184091, 182767, 182007, 181640, 181613, 182402, 183959, 185208, 185390, 185230, 185965, 187661, 189243, 189949, 190108, 190623, 192139, 194521, 196869, 198238, 198549, 198504, 198519, 198307, 197767, 197608, 198580, 200530, 202667, 204364, 205297, 205294, 204603, 204025, 204220, 205067, 206050, 206972, 207933, 208915, 209826, 210682, 211372, 211548, 211081, 210360, 209813, 209382, 208779, 207916, 206756, 205150, 203177, 201350, 200050, 199040, 197896, 196685, 195834, 195565, 195717, 195885, 195558, 194519, 193362, 193132, 194185, 195853, 197533, 199466, 201932, 204284, 205508, 205441, 204867, 204672, 205446, 207518, 210679, 214024, 216716, 218831, 221010, 223425, 225644, 227415, 229047, 231008, 233499, 236387, 239230, 241448, 242728, 243205, 243117, 242529, 241516, 240216, 238485, 235994, 233018, 230563, 229277, 228716, 228149, 227523, 227020, 226243, 224779, 223226, 222717, 223475, 224616, 225350, 225681, 225982, 226584]
57351B26584J222J947K286K150K018J966J333J4q12j87J118J546P98j18n29o76
57335B40660p75m98K92J083J339J177J065J179J277J109P80O25P51Q36N76J63
57319B51639L6K29L71L18L30N36P58R03J111J357J442J400J385J156L76m72l22
57302B62553J004K351K728K433K210K063J689J382J673K373K843K928K973L119
57288B94322L313L769M741N842O311N963N375N089N051M956M713M456M301M148
57274C62350L717K886K036J772K148K524K424K182K414L205M150M975N557N665
57260D08005N160M429M132M459M925M943M407L705L380L696M396M899M929M866
57246D70331N338O498P816Q564Q464P933P709Q192R170J0185J0992J1581J1953
$$ y = [226584, 227806, 229753, 232039, 234189, 236207, 238173, 239506, 239520, 238708, 238521, 239639, 241185, 241983, 241865, 241336, 240660, 239885, 239387, 239679, 240762, 242101, 243278, 244343, 245522, 246799, 247908, 248688, 249313, 250064, 250900, 251476, 251639, 251675, 251904, 252275, 252593, 252923, 253459, 254217, 255120, 256231, 257588, 259030, 260430, 261815, 262971, 263347, 262875, 262553, 263557, 265908, 268636, 271069, 273279, 275342, 277031, 278413, 280086, 282459, 285302, 288230, 291203, 294322, 297635, 301404, 306145, 311987, 318298, 324261, 329636, 334725, 339776, 344732, 349445, 353901, 358202, 362350, 366067, 368953, 370989, 372761, 374909, 377433, 379857, 382039, 384453, 387658, 391808, 396783, 402340, 408005, 413165, 417594, 421726, 426185, 431110, 436053, 440460, 444165, 447545, 451241, 455637, 460536, 465465, 470331, 475669, 482167, 489983, 498547, 507011, 514944, 522653, 530845, 540015, 550200, 561192, 572773, 584726]
57233E84726J2178J2486J2974J3464J3932J4761J6114J7410J8075J8450J9239
57222G53809K0389K1376K2398K4083K6113K7339K7573K8054K9644L1695L3265
57211A045738L4443L5685L6700L6884L6249L5264L4265L3584L3605L4091L4167
57200A430675L3577L3214L3742L4527L4740L4674L4962L5183L4542L3339L2576
57189A805751L2363L1979L1320L1053L1299L1335L0683K9522K7870K5423K2528
57178B131126K0407J9898K0572K1539K2604K4270K6905L0206L3396L5825L7481
57167B424229L8772L9800M0207M0086M0461M2253M5167M8270N1326N4624N7777
57156B922972N9797O0526O1000O1917O2595O1930N9934N7706N6184N5345N4611
$$ y = [584726, 596904, 609390, 622364, 635828, 649760, 664521, 680635, 698045, 716120, 734570, 753809, 774198, 795574, 817972, 842055, 868168, 895507, 923080, 951134, 980778, 1012473, 1045738, 1080181, 1115866, 1152566, 1189450, 1225699, 1260963, 1295228, 1328812, 1362417, 1396508, 1430675, 1464252, 1497466, 1531208, 1565735, 1600475, 1635149, 1670111, 1705294, 1739836, 1773175, 1805751, 1838114, 1870093, 1901413, 1932466, 1963765, 1995100, 2025783, 2055305, 2083175, 2108598, 2131126, 2151533, 2171431, 2192003, 2213542, 2236146, 2260416, 2287321, 2317527, 2350923, 2386748, 2424229, 2463001, 2502801, 2543008, 2583094, 2623555, 2665808, 2710975, 2759245, 2810571, 2865195, 2922972, 2982769, 3043295, 3104295, 3166212, 3228807, 3290737, 3350671, 3408377, 3464561, 3519906, 3574517]
57145C574517N3664N2734N2116N1599N0614M8907M6677M3959M0442L6275L2440
57134D083944K9807K8168K6767K5286K3703K1632J8704J5340J2278R541O887N114
57122D307171N953J0493J8543K9494M2677N6450O7834P3928P3637O8217O0863
57111D815260N5867N7170O6637Q3522J05476J30012J55620J82765K14296K54449
57101F121074L07018L74499M58352N59066O76002Q07992R54173J113444J283333
57092A2654953J460696J643701J831710K021711K203075K351869K427802K383350
57084B8978867K191868J879019J522486J204728R53609P27749M62147J27918k50111
57075C7798280o23910r59898j249231j495316j701856j870919k003740k099020
$$ y = [3574517, 3628181, 3680915, 3733031, 3784630, 3835244, 3884151, 3930828, 3974787, 4015229, 4051504, 4083944, 4113751, 4141919, 4168686, 4193972, 4217675, 4239307, 4258011, 4273351, 4285629, 4295170, 4302057, 4307171, 4313124, 4323617, 4342160, 4371654, 4414331, 4470781, 4538615, 4612543, 4686180, 4754397, 4815260, 4871127, 4928297, 4994934, 5078456, 5183932, 5313944, 5469564, 5652329, 5866625, 6121074, 6428092, 6802591, 7260943, 7820009, 8496011, 9304003, 10258176, 11371620, 12654953, 14115649, 15759350, 17591060, 19612771, 21815846, 24167715, 26595517, 28978867, 31170735, 33049754, 34572240, 35776968, 36730577, 37458326, 37920473, 38048391, 37798280, 37174370, 36214472, 34965241, 33469925, 31768069, 29897150, 27893410, 25794390]
57067B5794390k152191k158425k116190k028209j901090j745209j573544j398521
57059A0721011j229368j071982r30113q05620o98330o06764n29212m63893m08718
57050C977011l61735l21667k87581k58353k32921k10773j91626j74879j59819
57041A777657j46065j33333j21145j09340r8431q8805p9971p1263o2941n5752
57031H10611m9715m4262l9376l5603l2886l0357k7409k4159k0757j7033j3054
57020D76000r199n394q99M813J1551J8849K6485L4396M2799N2421O3929P6888
57008G92639R0061J03028J16964J33388J51974J68518J73801J55842J07341L3916
56998B027472m5790j10595j48955j62186j58408j45458j28412j10340r3135p7855
$$ y = [25794390, 23642199, 21483774, 19367584, 17339375, 15438285, 13693076, 12119532, 10721011, 9491643, 8419661, 7489548, 6683928, 5985598, 5378834, 4849622, 4385729, 3977011, 3615276, 3293609, 3006028, 2747675, 2514754, 2303981, 2112355, 1937476, 1777657, 1631592, 1498259, 1377114, 1267774, 1169343, 1080538, 1000567, 929304, 866363, 810611, 760896, 716634, 677258, 641655, 608769, 578412, 551003, 526844, 506087, 489054, 476000, 466801, 461407, 460508, 465321, 476872, 495721, 522206, 556602, 599401, 651822, 715751, 792639, 882700, 985728, 1102692, 1236080, 1388054, 1556572, 1730373, 1886215, 1993556, 2027472, 1981682, 1871087, 1722132, 1559946, 1401538, 1256080, 1127668, 1017328, 924193, 846338]
56988H46338o5017n4649m6117l8521l1452k5139j9952j6260j4565j5074j7068
56977E02524j9355k1462k3644k5688k6541k5605k3605k1570j9565j7077j4176
56966B64236j1436q950o293l410p28J702M384P362R767J0839J0906J0729J0223
56953B99331Q468M797n04o458j1814j5429j6911j6884j6165j4754j2172q706n496
56940A87303l193j298R05L463O167R075J2074J4524J6021J7100J8409J9502J9071
56927C19123J6184J0734L130n664j3941j9996k3211k4015k3075k1076j8992j7531
56915A81670j6351j4622j2461j0837r984q926o953m741l377k969k797k381j765
56902H3506j107n55k72j35M43J892L787N215N800O052O694P900R321J0619J1894
$$ y = [846338, 781321, 726672, 680555, 642034, 610582, 585443, 565491, 549231, 534666, 519592, 502524, 483169, 461707, 438063, 412375, 385834, 360229, 336624, 315054, 295489, 278412, 264236, 252800, 243850, 237557, 234147, 233419, 235121, 239505, 246867, 256634, 267473, 278379, 289108, 299331, 307799, 312596, 312092, 305634, 293820, 278391, 261480, 244596, 228431, 213677, 201505, 192799, 187303, 184110, 182812, 183717, 187180, 193347, 202422, 214496, 229020, 245041, 262141, 280550, 300052, 319123, 335307, 346041, 349171, 343507, 329566, 309570, 286359, 262344, 239269, 218193, 199201, 181670, 165319, 150697, 138236, 127399, 117415, 108489, 101536, 96795, 93418, 90449, 87652, 85271, 83506, 82399, 81844, 81572, 81437, 81880, 83772, 87559, 92774, 98574, 104626, 111320, 119220, 128541, 139160, 151054]
56887A51054J3499J5509J7482J8726J8657J6807J2864P111O98m915q839j0953
56875B47700j1471j0686q989o674l764l29L148O207R024J2125J5610J9253K3203
56862B94357K7739L2358L5903L7824L8503L7967L5045K8331J7674M436r136k0534
56850E60467k7724l0202k9185k6372k2529j7584j1643n349P22O640J2929J9958
56838D30128K7562L5223M2622M9804N6623O2178O5103O4147N8138M5844K7014
56827I64386L751j9805l9710n3882o1823o3714o0354n3419m5003l6820k9675k3325
56815D80607j6759r212j045O848J4400K2248L0176L6753M0996M3337M4086M1807
56803G34242L4331K1088L734j5067l2506m5852n3248n4764n2068m6961m0632l4054
$$ y = [151054, 164553, 180062, 197544, 216270, 234927, 251734, 264598, 271709, 272407, 267492, 258653, 247700, 236229, 225543, 216554, 209880, 206116, 205787, 208935, 215142, 224166, 236291, 251901, 271154, 294357, 322096, 354454, 390357, 428181, 466684, 504651, 539696, 568027, 585701, 590137, 581001, 560467, 532743, 502541, 473356, 446984, 424455, 406871, 395228, 389879, 390601, 397241, 410170, 430128, 457690, 492913, 535535, 585339, 641962, 704140, 769243, 833390, 891528, 937372, 964386, 968137, 948332, 908622, 854740, 792917, 729203, 668849, 615430, 570427, 533607, 503932, 480607, 463848, 454636, 453591, 460439, 474839, 497087, 527263, 564016, 605012, 648349, 692435, 734242, 768573, 789661, 793395, 778328, 745822, 699970, 646722, 591958, 539890, 492929, 452297, 418243]
56791D18243k8115k2995j8040j2661p048j803K861P272J1832J6487K0571K3124
56779D09728K3438K1321J6800R806M48j0358k0800k8866l3363l4399l3038l0442
56767B90275k7349k4245k1576j9446j7393j5013j2703j1227j0549r793q459p019
56755A05503o035n354m571l733l077k519j839j166q61j106j793k563k827k224
56741F5835j164m49k23R3O43P74K62J2P82J922K217J533P72M80M11K56P6r1l48
56722G3793o37p45n66p0P83J743K168J694P88J55l4K7M08J198J952K027J395N85
56704H6664k8l60k95J63N35L51j28k44J19M67N16M67M75M92N82Q83J117P75n0
56685I2501o19m69qR4k28m57k05K87L63k86j131j274n27K87L62n6p5O27J395J354
$$ y = [418243, 390128, 367133, 349093, 336432, 329384, 327581, 330442, 337714, 349546, 366033, 386604, 409728, 433166, 454487, 471287, 481093, 481541, 471183, 450383, 421517, 388154, 353755, 320717, 290275, 262926, 238681, 217105, 197659, 180266, 165253, 152550, 141323, 130774, 120981, 112522, 105503, 99468, 94114, 89543, 85810, 82733, 80214, 78375, 77209, 76348, 75242, 73449, 70886, 68059, 65835, 64671, 64222, 63999, 64092, 64735, 65509, 65771, 65783, 66565, 68487, 70704, 72237, 73009, 73489, 73900, 74156, 74232, 74141, 73793, 73156, 72411, 71845, 71775, 72558, 74301, 76469, 78163, 78951, 79106, 79072, 79099, 79507, 80705, 82657, 84684, 86079, 86664, 86636, 86276, 85981, 86144, 86679, 87030, 86902, 86658, 86777, 87244, 87760, 88227, 88702, 89194, 89776, 90659, 91776, 92551, 92501, 91882, 91413, 91405, 91499, 91271, 90814, 90609, 90896, 91259, 90973, 89842, 88568, 88041, 88328, 88690, 88634, 88559, 89186, 90581, 91935]
56665I1935K62j246k107j649l17O84O53J07OO16J463K025K103J738J212Q76P09
56648I9070L21l48p60n70j73J6K66R15J533J466R32P84J316J950K071J589Q10
56631A11188K13K44Q27J339J350J074P81L02k82j97R36K102K051J067N27Q76J244
56614A25642J025P29R39J442J681J420P27j48o89m85K06P29Q08N95J61l98n44
56597A33840J50J156J464R20K81kj36j90J05N38L78n73j619k121k037j428k62
56580A30464R74J345O16k71l33L45J011J233J163J232J792K772L597L798L619
56565A53357L556L523L194K946L587N117O686P858Q947J0005J0414R794Q419O485
56551B43888L927J293k81m40j00p8j71j08l70j271j980j588n24n1o41j670k486
$$ y = [91935, 92197, 90951, 88844, 87195, 86878, 87562, 88215, 88322, 88328, 88944, 90407, 92432, 94535, 96273, 97485, 98361, 99070, 99391, 99043, 98283, 97713, 97540, 97556, 97822, 98737, 100270, 101736, 102668, 103452, 104768, 106718, 108789, 110378, 111188, 111401, 111645, 112472, 113811, 115161, 116235, 117016, 117318, 117036, 116839, 117775, 119877, 121928, 122995, 123522, 124398, 125642, 126667, 127396, 128335, 129777, 131458, 132878, 133605, 133457, 132768, 132283, 132489, 133218, 134026, 134621, 134782, 134384, 133840, 133990, 135146, 136610, 137530, 137811, 137809, 137673, 137483, 137588, 138126, 138504, 137931, 136312, 134191, 132154, 130726, 130464, 131438, 132783, 133399, 133128, 132795, 133140, 134151, 135384, 136547, 137779, 139571, 142343, 145940, 149738, 153357, 156913, 160436, 163630, 166576, 170163, 175280, 181966, 189824, 198771, 208776, 219190, 228984, 237403, 243888, 247815, 249108, 248827, 248387, 248287, 248209, 248038, 247930, 247560, 246289, 244309, 242721, 242197, 242146, 241505, 239835, 237349]
56534B37349l010l389l655l773l707l465l257l322l496l300k661k124k126k468
56520A93596k778l014l194l077k519j824j465j656k296l033l280k709j749j139
56506A59863r78p82n06o52j192j270m37N72Q06K63l99p58q65r35j214j676j787
56489A48053j071l1L09m6kQ73J539J104J65k21m3P8O7K32M69N97Q96J496J717
56470A56181J031J71K70J143J559J076N17O16J094J332J174Q56O28O96J083J470
56454A70897J488J242J189J511J935K091J829J281Q30Q55J261J472J160O88N47
56439A90276O72P16O37N94M94J65k37m58o13r36j236j080n38k18m69r07q77k40
56421A85745N01P93O54N49O22M30k79q81n72M18J100J154J282J901K308J671K29
$$ y = [237349, 234339, 230950, 227295, 223522, 219815, 216350, 213093, 209771, 206275, 202975, 200314, 198190, 196064, 193596, 190818, 187804, 184610, 181533, 179014, 177190, 175725, 174069, 171773, 168740, 165460, 162751, 161002, 159863, 158885, 158103, 157597, 156945, 155753, 154483, 154046, 154618, 155424, 155687, 155288, 154530, 153665, 152730, 151516, 149840, 148053, 146982, 146951, 147260, 147214, 147212, 148085, 149624, 150728, 150893, 150672, 150629, 150707, 150774, 151006, 151475, 152072, 152968, 154464, 156181, 157212, 157383, 157653, 158796, 160355, 161431, 161948, 162564, 163658, 164990, 166164, 167020, 167648, 168344, 169427, 170897, 172385, 173627, 174816, 176327, 178262, 180353, 182182, 183463, 184293, 185148, 186409, 187881, 189041, 189729, 190276, 190948, 191664, 192301, 192895, 193389, 193554, 193317, 192859, 192246, 191310, 190074, 188994, 188456, 188238, 187769, 186862, 185985, 185745, 186246, 187039, 187693, 188242, 188864, 189294, 189015, 188134, 187562, 187980, 189080, 190234, 191516, 193417, 195725, 197396, 197625]
56404A97625j015j337p59J48N44Rq36q19L13J503J757J237O90M12L47N40Q69Q25
56386B02053J61o00p59k60M81J090J302J018O34Q15J596K300K571K796L148L051
56370B21397K182J179P64Q41J013J220J232M07j194k275j805m15O42J181J763
56355B28132K300K191J450O22j33q79j178n77L92P26L45O2L05P35J058J309J407
56338B38267J151P30N71P72J154J709K388K791K668K392K372K369K066J801J974
56323B65175K274K336K643L642M515M034K424J079N10r9j126j648q56O31J545
56308B87079J513J249J491K150K461J955J205J315K562M014M751M833M678M245
56294C25501L463K786K515K192J488J006J331J906J938J786K277L213L801M127
$$ y = [197625, 196610, 195273, 194514, 194662, 195206, 195215, 194379, 193560, 193873, 195376, 197133, 198370, 199060, 199472, 199819, 200359, 201228, 202053, 202214, 201614, 200855, 200595, 201076, 202166, 203468, 204486, 205120, 205935, 207531, 209831, 212402, 215198, 218346, 221397, 223579, 224758, 225522, 226363, 227376, 228596, 229828, 230235, 229041, 226766, 224961, 224546, 225188, 226369, 228132, 230432, 232623, 234073, 234695, 234562, 233683, 232505, 231928, 232320, 233046, 233391, 233453, 233758, 234493, 235551, 236860, 238267, 239418, 240148, 240719, 241491, 242645, 244354, 246742, 249533, 252201, 254593, 256965, 259334, 261400, 263201, 265175, 267449, 269785, 272428, 276070, 280585, 284619, 287043, 288122, 288632, 288533, 287407, 285759, 284903, 285534, 287079, 288592, 289841, 291332, 293482, 295943, 297898, 299103, 300418, 302980, 306994, 311745, 316578, 321256, 325501, 328964, 331750, 334265, 336457, 337945, 338951, 340282, 342188, 344126, 345912, 348189, 351402, 355203, 359330]
56280C59330M804N513N403M764M779N616O252O359O810Q002R064R287R104R048
56266D54135Q851Q303Q078Q960J0803J2837J4588J6054J7453J9109K1227K3634
56254F24032K6089K8811L2220L6195M0186M4018M7965N2111N6333O0870O6078
56243A114908P1555P6249P9567Q1674Q2642Q2021P9481P5238O9572O2371N3410
56232A928688M2718L0696J7980N110p863k1054l3797m4690n3000n9331o4352o7713
56220A673392o9111o9471o9837o9704o7907o4714o1516n8676n5218n0732m6177
56209I90329m2426l9249l6060l2827k9866k7406k5458k3663k1475j8975j7040
56198F75884j6023j4998j3261j1686j1295j1274j0068p888o315n703m985l964
$$ y = [359330, 364134, 369647, 375050, 379814, 384593, 390209, 396461, 402820, 409630, 417632, 426696, 435983, 445087, 454135, 462986, 471289, 479367, 488327, 499130, 511967, 526555, 542609, 560062, 579171, 600398, 624032, 650121, 678932, 711152, 747347, 787533, 831551, 879516, 931627, 987960, 1048830, 1114908, 1186463, 1262712, 1342279, 1423953, 1506595, 1588616, 1668097, 1743335, 1812907, 1875278, 1928688, 1971406, 2002102, 2020082, 2025192, 2017329, 1996275, 1962478, 1917788, 1864788, 1805457, 1741105, 1673392, 1604281, 1534810, 1464973, 1395269, 1327362, 1262648, 1201132, 1142456, 1087238, 1036506, 990329, 947903, 908654, 872594, 839767, 809901, 782495, 757037, 733374, 711899, 692924, 675884, 659861, 644863, 631602, 619916, 608621, 597347, 587279, 579391, 573076, 567373, 562388, 558424]
56186E58424l727m434m635l466j973j482j879k196j883r83R7O62L66j64j14K70
56170E32883K59R2N40J328J519J289J694K706L202L016L234M237N160N577O062
56155E72798O751P057P117P865R245J0038R881R814J0393J1035J1635J2978J4969
56142G01576J6367J6957J8142K0575K3106K5039K7593L1991L7742M3899N0619
56131A013606N8310O6639P5406Q5066R5431J05103J13016J19079J22552J21458
56121A975666J14787J03980R1203P7665O4539N3770M6388M1063L5579K8766K0175
56110B653581R371l081j5047k4559l1397l6398m0480m5237n2942o4488p8136r1213
56098B179974j02022j09441j12167j09631j02817r3241q1996p0352n9838n0859
$$ y = [558424, 554697, 550263, 545628, 542162, 540189, 538707, 536828, 534632, 532749, 531766, 531863, 532525, 532891, 532727, 532613, 532883, 533142, 533234, 533774, 535102, 536621, 537910, 539604, 542310, 545512, 548528, 551762, 555999, 561159, 566736, 572798, 579549, 586606, 593723, 601588, 610833, 620871, 630752, 640566, 650959, 661994, 673629, 686607, 701576, 717943, 734900, 753042, 773617, 796723, 821762, 849355, 881346, 919088, 962987, 1013606, 1071916, 1138555, 1213961, 1299027, 1394458, 1499561, 1612577, 1731656, 1854208, 1975666, 2090453, 2194433, 2285636, 2363301, 2427840, 2481610, 2527998, 2569061, 2604640, 2633406, 2653581, 2662952, 2659871, 2644824, 2620265, 2588868, 2552470, 2511990, 2466753, 2413811, 2349323, 2271187, 2179974, 2077952, 1968511, 1856344, 1746713, 1643896, 1550655, 1468659, 1398307, 1338469, 1287610]
56088A287610m2454l4214k7087k1643j7056j2663q950o102l260j58K173L413M911
56075A124520P418R581J0100R772R990J0640J1001J1407J2477J3847J4894J5739
56063A261386J6471J6583J6063J5716J5549J4407J2095J0160R559R312Q574Q138
56051A414013Q686R422R724J0381J1877J3219J3772J4417J5618J6260J5788J5542
56039A568719J6635J8368K0121K2614K5991K8799L0428L2406L5725L9177M1749
56028A880732M4311M7381M9825N1444N4130N8572O2539O4426O5689O7639O8829
56017B515517O8103O7433O8922P1514P3383P5091P7849Q1023Q3925Q7617R2582
56006C362959R7238J01003J05929J12960J19828J25063J30633J37977J45290J51622
$$ y = [1287610, 1245156, 1210942, 1183855, 1162212, 1145156, 1132493, 1123543, 1117441, 1114181, 1114023, 1116196, 1119609, 1124520, 1131938, 1141519, 1151619, 1161391, 1171381, 1182021, 1193022, 1204429, 1216906, 1230753, 1245647, 1261386, 1277857, 1294440, 1310503, 1326219, 1341768, 1356175, 1368270, 1378430, 1387989, 1397301, 1405875, 1414013, 1422699, 1432121, 1441845, 1452226, 1464103, 1477322, 1491094, 1505511, 1521129, 1537389, 1553177, 1568719, 1585354, 1603722, 1623843, 1646457, 1672448, 1701247, 1731675, 1764081, 1799806, 1838983, 1880732, 1925043, 1972424, 2022249, 2073693, 2127823, 2186395, 2248934, 2313360, 2379049, 2446688, 2515517, 2583620, 2651053, 2719975, 2791489, 2864872, 2939963, 3017812, 3098835, 3182760, 3270377, 3362959, 3460197, 3561200, 3667129, 3780089, 3899917, 4024980, 4155613, 4293590, 4438880, 4590502]
55996D590502J59564J70529J81564J90559K00364K13739K28566K42449K57648
55987F435484K76607K96969L16236L37162L63076L91965M20865M51986M88740
55978I779090N29852N73467O22774O81341P47256Q18467Q99429R95742J107261
55969A6754679J233842J382819J563211J778462K033607K344158K729245L202228
55961C3022251L776503M470691N294048O233873P273322Q419603R705921J1177596
55953H9373808J2892804J4920454J7297016J9962733K2737751K5352196K7491800
55946B30028562K8825886K8990107K7504725K3725560J7059972P516694l807899
55939C59843607j4896512k3703735k9106530l1175972l0729052k8721947k5933524
$$ y = [4590502, 4750066, 4920595, 5102159, 5292718, 5493082, 5706821, 5935387, 6177836, 6435484, 6712091, 7009060, 7325296, 7662458, 8025534, 8417499, 8838364, 9290350, 9779090, 10308942, 10882409, 11505183, 12186524, 12933780, 13752247, 14651676, 15647418, 16754679, 17988521, 19371340, 20934551, 22713013, 24746620, 27090778, 29820023, 33022251, 36798754, 41269445, 46563493, 52797366, 60070688, 68490291, 78196212, 89373808, 102266612, 117187066, 134484082, 154446815, 177184566, 202536762, 230028562, 258854448, 287844555, 315349280, 339074840, 356134812, 363651506, 359843607, 344947095, 321243360, 292136830, 260960858, 230231806, 201509859, 175576335]
55932A75576335k2915538k0005272j7348357j4972240j2871767j1037767r446665
55925F6978729q068170o884349n883199n040801m327266l724096l220657k799799
55917B7030392k441379k135374j878902j664160j480014j321478j187401j072172
55909A3849512r68743q76351p96917p27095o61701o01462n49656n04238m60640
55900G702709m19405l83922l53235l23917k96674k74436k55920k37286k18447
55891D939467k01954j87380j72255j56985j43595j31059j16812j01409q7164p3703
55881C567151n9236m4522l1126j7413q70J6930L2015M3318N2018N6826N4295M3185
55869C712571K4765j65l0628o2420q9517j08625j19939j24435j23287j19053j14494
$$ y = [175576335, 152660797, 132655525, 115307168, 100334928, 87463161, 76425394, 66978729, 58910559, 52026210, 46143011, 41102210, 36774944, 33050848, 29830191, 27030392, 24589013, 22453639, 20574737, 18910577, 17430563, 16109085, 14921684, 13849512, 12880769, 12004418, 11207501, 10480406, 9818705, 9217243, 8667587, 8163349, 7702709, 7283304, 6899382, 6546147, 6222230, 5925556, 5651120, 5395200, 5157914, 4939467, 4737513, 4550133, 4377878, 4220893, 4077298, 3946239, 3829427, 3728018, 3640854, 3567151, 3507915, 3463393, 3432267, 3414854, 3413984, 3430914, 3462929, 3506247, 3558265, 3615091, 3669386, 3712571, 3737336, 3737171, 3706543, 3644123, 3554606, 3445981, 3326042, 3201607, 3078320, 2959267, 2844773]
55858B844773j10695j08158j08044j09954j10427j06609r9909r3333q7186q0444
55848A830014p4280p0546o8183o4737o0318n6658n3496m9431m5261m2851m1468
55837A202785l8790l4932l2020l0284k8017k5108k3273k2761k1917k0082j8193
55826I07408j6520j4463j2548j2030j2563j2677j2391j2924j4041j4229j3417
55815G59605j3005j3223j2729j0961q764o713m815l625l632l786k668q33J14L31
55801F75296J274K803L190K018P08l7j115l074n264p177q966j0401j0961j0956
55787F27338j1095j1135j0366r055p893o510m264j915p22m91m28j180l756o971
55773E51557q343p367n600l816j534Q27J819J352Q03M94p36l166n566p373r325
$$ y = [2844773, 2734078, 2625920, 2517876, 2407922, 2297495, 2190886, 2090977, 1997644, 1910458, 1830014, 1755734, 1685188, 1617005, 1552268, 1491950, 1435292, 1381796, 1332365, 1287104, 1244253, 1202785, 1163995, 1129063, 1097043, 1066759, 1038742, 1013634, 990361, 967600, 945683, 925601, 907408, 890888, 876425, 863877, 851847, 839284, 826607, 814216, 801292, 787251, 773022, 759605, 746600, 733377, 720648, 709687, 700923, 694210, 689395, 685770, 682138, 678352, 675684, 674851, 674965, 675296, 676570, 679373, 682563, 684581, 685289, 685252, 684137, 681063, 675799, 668622, 659656, 649255, 638294, 627338, 616243, 605108, 594742, 585687, 577794, 571284, 567020, 565105, 564383, 563892, 563464, 562284, 558528, 551557, 543214, 535847, 530247, 526431, 524897, 525724, 527543, 528895, 529698, 530192, 529456, 526290, 520724, 513351, 504026]
55758E04026j1428j2357j1589j0288r455q764p859p195p060p139p430q269r188
55745C86005r252q647q504q942q886p966o953o105m793l061j957j839j834j328
55731C05938o55m0O90J106L59j333k776l534m220m944n022m415l927l773l398
55716B70056k896l007l542l411k418j473q56P9J258J702J352J307J875K021J237
55701B63284K75m29j454k993m359n275o123o583n767m105l259l616l705k755j884
55686B11252j902j826p51N15Q31L80q3m13n79k25M50O20K65L55R75Q74l38j275
55668B09125j067q85j893l184l197k016q28j55J75J92J37P45K148L313L498L303
55652B09411L445L549L165K748K613J997L31j594k879l845m975n644n258m617
$$ y = [504026, 492598, 480241, 468652, 458364, 448909, 440145, 432286, 425091, 418031, 410892, 403462, 395193, 386005, 376753, 368106, 359602, 350660, 341774, 333808, 326855, 320750, 315957, 312896, 310939, 309100, 307266, 305938, 305283, 305243, 305933, 307039, 307398, 306065, 303289, 299755, 295535, 290591, 285569, 281154, 277227, 273454, 270056, 267160, 264153, 260611, 257200, 254782, 253309, 252453, 252532, 253790, 255492, 256844, 258151, 260026, 262047, 263284, 263559, 263130, 261676, 258683, 254324, 249049, 242926, 236343, 230576, 226471, 223212, 219596, 215891, 213136, 211252, 209350, 207524, 206773, 207288, 208119, 208499, 208416, 208003, 207424, 207199, 207649, 208269, 208534, 208889, 209864, 210738, 210400, 209125, 208058, 207173, 205280, 202096, 198899, 196883, 196055, 195900, 196075, 196267, 196404, 197149, 199297, 202610, 206108, 209411, 212856, 216405, 219570, 222318, 224931, 226928, 227259, 225665, 222786, 218941, 213966, 208322, 203064, 198447]
55638A98447m708m991m319k850j674j116p85o98j041j285q76l37n10j173j551
55623A70533j688k055k318j839j042r32j490j775j476j134r60o17j61r8l89l85
55607A52174Q6L98Rr66k029k593k196j115m49q70j568j312k40L69M4k58K53J026
55589A40763J021K22l45J05J149J584P96m77r89m81K34N99J042J988K954L161
55573A53326K621K063K123K952M218N147N086M333L892M152M472M287L768K948
55559B05388J289j207l409m436m777n174n324m746m088m265m857m768m063l770
55545A51793m099m191l658l114l006k976k599j938j201n28k13m29p57o73l77m24
55529A21610o60m22J95K85m90j306j372r25p04q91j042p23M7P56P50r4j051j228
$$ y = [198447, 193739, 188748, 184429, 181579, 179905, 178789, 178004, 177306, 176265, 174980, 174104, 173767, 173257, 172084, 170533, 168845, 166790, 164472, 162633, 161591, 160659, 159169, 157394, 155918, 154784, 153824, 153207, 153046, 152948, 152559, 152174, 152260, 152658, 152667, 151701, 149672, 147079, 144883, 143768, 143319, 142449, 140881, 139569, 139329, 139698, 139742, 139484, 139737, 140763, 141784, 142006, 141661, 141766, 142915, 144499, 145295, 144818, 143829, 143348, 143582, 144181, 145223, 147211, 150165, 153326, 155947, 158010, 160133, 163085, 167303, 172450, 177536, 181869, 185761, 189913, 194385, 198672, 202440, 205388, 206677, 205470, 202061, 197625, 192848, 187674, 182350, 177604, 173516, 169251, 164394, 159626, 155563, 151793, 147694, 143503, 139845, 136731, 133725, 130749, 128150, 126212, 125011, 124483, 124270, 123841, 123084, 122411, 122034, 121610, 120950, 120528, 120723, 121008, 120518, 119212, 117840, 116915, 116211, 115320, 114278, 113555, 113602, 114358, 115108, 115014, 113963, 112735]
55511A12735n77J19K68N4l2R6J01k66p73q97m70Rj4k83n7O48R14K75n01n26k5
55490A10798J88o6m14p02r04o35L05J208J124J52o92q32n87l49p7K93O16P71P42
55471A10939M34j37n90n91l36k01j34N3P1n08j439k029k023j661j042r1Q01R75
55453A02491L86k28k31L15R05J067O91K42M49J376K117J883J042M02kn91j065
55436A11249p09J83M26l12r73o95K9L14J96L25Q57J368J533J395J073O21J50j59
55418A16871j40J90N57O38N21P81J682K601K722K153J704J654J427O37k53o87
55402A33058q67j393k323l054l070k549k107k029j890j119Q5Q01N15k50o88p01
55386A12419o40n31j93J30J1m21o69o84q57j216j348j154j007j057r94o36k10
$$ y = [112735, 112158, 112277, 112545, 112599, 112567, 112663, 112764, 112498, 111725, 110828, 110358, 110367, 110353, 110070, 110013, 110661, 111575, 111850, 111349, 110823, 110798, 110986, 110920, 110506, 109804, 108900, 108265, 108570, 109778, 110902, 111054, 110362, 109530, 108943, 108594, 108517, 108810, 109426, 110197, 110939, 111373, 111236, 110646, 110055, 109719, 109518, 109384, 109437, 109508, 109000, 107561, 105532, 103509, 101848, 100806, 100715, 101516, 102491, 102877, 102649, 102418, 102733, 103638, 104705, 105396, 105638, 106087, 107463, 109580, 111463, 112505, 112907, 112905, 112314, 111249, 110540, 110723, 111149, 110837, 109864, 109169, 109198, 109512, 109708, 110033, 110890, 112258, 113791, 115186, 116259, 116880, 117030, 116871, 116731, 116921, 117478, 118116, 118637, 119418, 121100, 123701, 126423, 128576, 130280, 131934, 133361, 133998, 133745, 133058, 132191, 130798, 128475, 125421, 122351, 119802, 117695, 115666, 113776, 112657, 112742, 113543, 114058, 113808, 113120, 112419, 111779, 111248, 111055, 111185, 111196, 110775, 110106, 109422, 108565, 107349, 106001, 104847, 103840, 102783, 101789, 101153, 100943]
55369A00943N2J76J73L5rJ96K45l38j105j018R1J142J307J023J010J069O34k5
55351A05601j03M17O20J7p26p30j15K74R2j08K05P28P96L44q2j36m1r1k76m92
55331A06194o63n74m1N90O79K22o7J20J79l25q47p41k86m4J35O27J015O66j3j1
55311A06815P59J333J058K07p19j449j673j225n73l50l59N3P35P68j09j074j440
55294A02757j406j283q65J6R97J673J933J657P20m30r66p43n00p14q93m21N93
55277A02125J606K235K200J342M4r06j184j128q93j60R77J636J202J87m97o34
55261A08152n52m11j61J77O25J241J781J706R34P2l57m50m31k18J78L99L21K98
55243A13304M19J81n72j035m27Q69J811J916J398M63p83j929k418k086j211k03
$$ y = [100943, 100995, 101171, 101344, 101379, 101370, 101566, 101811, 101473, 100368, 99350, 99441, 100583, 101890, 102913, 103923, 104992, 105626, 105601, 105498, 105915, 106535, 106552, 105826, 105096, 104981, 105255, 105347, 105239, 105444, 106172, 106968, 107312, 107230, 107094, 107053, 106962, 106686, 106194, 105531, 104957, 104916, 105506, 106185, 106407, 106340, 106460, 106639, 106314, 105467, 104726, 104440, 104396, 104531, 105158, 106173, 106839, 106826, 106815, 107574, 108907, 109965, 110172, 109453, 108004, 106331, 105106, 104533, 104183, 103824, 103877, 104612, 105380, 105271, 104197, 102757, 101351, 100068, 99203, 99219, 100216, 101889, 103822, 105479, 106199, 105769, 104803, 104060, 103560, 102846, 101953, 101532, 102125, 103731, 105966, 108166, 109508, 109552, 108646, 107462, 106334, 105441, 105281, 106258, 107894, 109096, 109283, 108786, 108152, 107600, 107189, 107028, 107205, 107830, 109071, 110852, 112558, 113492, 113564, 113207, 112757, 112326, 112108, 112286, 112685, 113006, 113304, 113723, 113904, 113332, 112297, 111870, 112739, 114550, 116466, 117864, 118327, 117544, 115615, 113197, 111111, 109900, 109697]
55227A09697M44L40l12p42n46j39N0L13R18J259O11n90j142o69J8K05J23K80O14
55208A10732O83L82O9R8M80R70J321J384J021J43r66j599j297n13j06j93q3N82
55190A13108J264J349R14K75n31j367j685j239o46n86q19o33j2L86K79J08K96
55173A10461O68O91O5r53j578j124K20J382J507Q05P4k30j26K77P81J063J070
55156A15053J235J835K443K482K024J544J176P49K84q7m94r72j066m09M57O25
55140A26879O9l63k20P2L5k16m27o30q41q05l90O8J26k82q15j057q13l19n2k01
55120A19818m13k73J58O22J108J564J487N04p70j231o71K7K24K62N71Q18M94j27
55102A24172k60L05R74J190J105J235J710K015J588N08n50j041r69n44J72R75
$$ y = [109697, 110141, 110481, 110169, 109427, 108881, 108742, 108792, 109105, 110023, 111282, 111893, 111303, 110161, 109492, 109510, 109715, 109838, 110118, 110732, 111415, 111797, 111866, 111964, 112444, 113414, 114735, 116119, 117140, 117283, 116317, 114718, 113421, 112908, 112802, 112609, 112526, 113108, 114372, 115721, 116635, 116910, 116379, 115012, 113327, 112088, 111442, 110856, 110037, 109404, 109392, 109778, 110057, 110165, 110461, 111129, 111820, 111885, 110932, 109354, 108230, 108450, 109832, 111339, 112144, 112218, 111988, 111862, 112139, 112920, 113983, 115053, 116288, 118123, 120566, 123048, 125072, 126616, 127792, 128541, 128825, 128738, 128244, 127272, 126206, 125797, 126254, 126879, 126948, 126585, 126365, 126437, 126472, 126256, 125829, 125199, 124358, 123553, 123163, 123231, 123357, 123075, 122260, 121203, 120390, 120071, 120019, 119818, 119405, 119132, 119290, 119912, 121020, 122584, 124071, 124575, 123805, 122574, 121903, 121930, 122154, 122416, 122987, 123805, 124299, 124172, 123912, 124217, 125191, 126381, 127486, 128721, 130431, 132446, 134034, 134542, 133992, 132951, 131982, 131438, 131610, 132585]
55086A32585J293P64j19n62m90m91p61q73o02l30k88j20M46R92R82N31J42m0k09
55067A32850m04m98n30o11o08l28M6J28r7k63k43l63q81j572j949j729r76j4O78
55048A22636P26J89m59p64o21j55M11P37N55R2k9L87P25M55N7L33J032J067J86
55029A27560m98j46N38M21l36o40j80K45R5k09j27K04L43J29l22p50o67K31J370
55010A27261J639P77j77k52J99J55n99j298j279o73m9K12J75K06N42R21Q60M13
54992A29033K40O95J270J326J014R79J363J649J429Q42K57j45l71n18o75p96p18
54975A36874l56J58N96P46L95m37j191j103j29Q86J238J160J220J372J149O13
54959A43191L54N87Q18N78P5j34P6K74R6k52l08p6j7k09%J001K021J952R38K26
$$ y = [132585, 133878, 134642, 134523, 133961, 133471, 132980, 132219, 131346, 130744, 130414, 130126, 130006, 130452, 131444, 132426, 132957, 133099, 133059, 132850, 132446, 131948, 131418, 130807, 130199, 129871, 129917, 130045, 129948, 129685, 129442, 129079, 128198, 126626, 124677, 122948, 121972, 121958, 122636, 123362, 123551, 123092, 122328, 121707, 121552, 121963, 122700, 123255, 123347, 123318, 123705, 124430, 124885, 124942, 125275, 126307, 127374, 127560, 127062, 126916, 127454, 127875, 127539, 126899, 126719, 126964, 127059, 126850, 126723, 126927, 127270, 127399, 127077, 126327, 125660, 125891, 127261, 128900, 129677, 129500, 129248, 129447, 129602, 129003, 127705, 126426, 125753, 125704, 125916, 126091, 126297, 126839, 127760, 128620, 129033, 129273, 129968, 131238, 132564, 133578, 134557, 135920, 137569, 138998, 139840, 140097, 139952, 139581, 139063, 138388, 137592, 136874, 136518, 136676, 137272, 138018, 138413, 137976, 136785, 135682, 135553, 136439, 137677, 138837, 140057, 141429, 142578, 143191, 143545, 144132, 144950, 145528, 145603, 145469, 145545, 145819, 145915, 145663, 145355, 145279, 145262, 145053, 145053, 146054, 148075, 150027, 150965, 151191]
54939A51191L85P07N91N21J034J685J821J761K255L249M072M533N024N702O308
54924A90839O780P374Q234R248J0229J0868J0641R230O889M133J288j427l777
54911B70549n794p723r385j0136r890r470r374q970p627n930m838m301l660k866
54897A70585k183j287O2R18J39j625k427j467K55J774L208M668N629N940O337
54882A90526P257Q044Q023P542P365P711Q358Q996Q973P425M227M55k660m790
54868B67452o329p622q718r441r447q651p650p144o921o152m845m011m127m346
54854A72048l788k760j996j456o83J17K07o30j746k376k339k109k325l075l651
54839A43438l298k202j238q20n95k30J60N01R14J244J087N29Q9j52n66r33m73
$$ y = [151191, 151576, 152283, 152874, 153395, 154429, 156114, 157935, 159696, 161951, 165200, 169272, 173805, 178829, 184531, 190839, 197619, 204993, 213227, 222475, 232704, 243572, 254213, 263443, 270332, 274465, 275753, 274326, 270549, 264755, 257032, 247647, 237511, 227621, 218151, 208777, 199807, 192180, 186250, 181412, 177111, 173451, 170585, 168402, 167115, 167177, 168095, 168234, 166609, 164182, 162715, 162970, 164744, 167952, 172620, 178249, 184189, 190526, 197783, 205827, 213850, 221392, 228757, 236468, 244826, 253822, 262795, 270220, 274447, 274902, 272242, 267452, 261123, 253501, 244783, 235342, 225895, 217244, 209594, 202450, 195529, 189377, 184532, 180521, 176394, 172048, 168260, 165500, 163504, 162048, 161365, 161482, 161689, 161059, 159313, 156937, 154598, 152489, 150164, 147089, 143438, 140140, 137938, 136700, 135880, 135285, 135055, 135215, 135716, 136630, 137874, 138961, 139490, 139579, 139427, 138861, 137928, 137455]
54822A37455P05J301O28k87j93N86Q24K34l99n12l46l43o00q28n12N84J842K211
54804A42350J499O78N15O69N37K92L46N04L47m0m26q99j362j180j77O89N39n1
54786A44830J84J423K719L300L099K357J562J508K436L456L655L448L866M867
54772A82710N529N667O031O897P617P845Q072Q640R085Q828P826O236M106J647
54758B76736p40k886m838o426p478q344r416j0133r434p386n469m777m759m299
54744A90351l259k350j995j971j927j657j034p9R70J911K753L534M098M298M169
54729A97812L875L623L747M565N985P425Q326Q581Q403P894O904N211K833J45
54715B75329k427m779p017q905r829r607q895q420q093p418o392n478m874m462
$$ y = [137455, 138160, 139461, 140089, 139802, 139609, 140195, 141019, 141253, 140854, 140342, 139996, 139653, 139053, 138225, 137713, 138297, 140139, 142350, 143849, 144527, 145042, 145711, 146248, 146540, 146886, 147390, 147737, 147697, 147271, 146372, 145010, 143830, 143653, 144342, 144881, 144830, 145014, 146437, 149156, 152456, 155555, 157912, 159474, 160982, 163418, 166874, 170529, 173977, 177843, 182710, 188239, 193906, 199937, 206834, 214451, 222296, 230368, 239008, 248093, 256921, 264747, 270983, 275089, 276736, 275996, 273110, 268272, 261846, 254368, 246024, 236608, 226475, 217041, 209655, 204186, 199409, 194650, 190351, 187092, 184742, 182747, 180776, 178849, 177192, 176158, 176079, 177049, 178960, 181713, 185247, 189345, 193643, 197812, 201687, 205310, 209057, 213622, 219607, 227032, 235358, 243939, 252342, 260236, 267140, 272351, 275184, 275329, 272902, 268123, 261106, 252201, 242372, 232765, 223870, 215450, 207357, 199939, 193547, 188069, 183195, 178733]
54701A78733m204m048l573k507j431j161j505j490r08o36j141j615j209l64j26
54686A52815o34j015o70R8O24N61n6r26j516j340n04J54j55j201j849j338j74
54669A42874N98O96N90L93l06j351j741j011l5K91L60R13J464R71l08r57m21L37
54651A43357L71j16m30k69K92R36J052L41m24k11O85R18J33n17l23j18p10j399
54633A43568j076N1R37J210J172Q55J24n91o68k47L0pk8J1j22k95j47K16L53K64
54613A45610L30N56N06Q3k76k22J31N23Q10Q42N86K61P9j49o22r52n82K74O69
54594A48457Q0j005j769j854j279j50J162J914J528K25j097j684j512j171j156
54579A40689j322j067j23R68J386Q79k2n88m86O7N51N64J93j27j72j30j74j36
$$ y = [178733, 174529, 170481, 166908, 164401, 162970, 161809, 160304, 158814, 157906, 157270, 156129, 154514, 153305, 152941, 152815, 152181, 151166, 150496, 150594, 151218, 151779, 151723, 150797, 149281, 147941, 147437, 147591, 147436, 146235, 144386, 143048, 142874, 143472, 144168, 144758, 145151, 144845, 143494, 141753, 140742, 140707, 140998, 141358, 142271, 143735, 144706, 144398, 143441, 143020, 143357, 143728, 143612, 143182, 142913, 143205, 144141, 145193, 145534, 145110, 144899, 145584, 146502, 146635, 146118, 145795, 145677, 144967, 143568, 142492, 142543, 143480, 144690, 145862, 146717, 146841, 146250, 145582, 145335, 145365, 145358, 145330, 145341, 145219, 144924, 144777, 144993, 145346, 145610, 145940, 146496, 147002, 147085, 146809, 146587, 146718, 147241, 148051, 148893, 149479, 149740, 149819, 149670, 149048, 148096, 147514, 147788, 148457, 148537, 147532, 145763, 143909, 142630, 142480, 143642, 145556, 147084, 147309, 146212, 144528, 143016, 141845, 140689, 139367, 138300, 138177, 139145, 140531, 141410, 141388, 140800, 140314, 140381, 140932, 141496, 141689, 141562, 141390, 141260, 141086, 140950]
54561A40950R1K18M9L3P07J734K085J299Kr27j242j204j050q68p25n60k56O6j4
54542A40388o11j168j018k26M99P40Q84J484K399K883K513J722J218J145J063
54527A53915O72J63j66k72k08N5M58P26O81M68K60m3n50j048j233j081p33k20
54509A51844L72O77M25p1k99k74m16p48q06l95O6J70k0k75n25o14k32N54J103
54490A50536R60N46N48Q74P60o9r28j050n21NK23M51R54J428J372Q40M20M11L87
54471A58147j23p55o56L01J187J153M35j69m25p06j104j164o49pJ80j25n48q11
54453A54161p89l82L06P63N18k36p55n80L3N17O32N33M77N36N26J32p45j717k146
54434A51784j757r01j43K69M98P53J004R94N47m2j44M93J222J178M25r9J10M82
$$ y = [140950, 141041, 141259, 141308, 141341, 142048, 143782, 145867, 147166, 147168, 146241, 144999, 143795, 142745, 141877, 141152, 140592, 140336, 140402, 140388, 139777, 138609, 137591, 137365, 137864, 138604, 139488, 140972, 143371, 146254, 148767, 150489, 151707, 152852, 153915, 154587, 154750, 154584, 154312, 154104, 154159, 154617, 155343, 156024, 156492, 156752, 156709, 156159, 155111, 153878, 152797, 152064, 151844, 152216, 152893, 153318, 153247, 152948, 152674, 152258, 151510, 150704, 150309, 150375, 150545, 150525, 150250, 149725, 149111, 148879, 149433, 150536, 151496, 152042, 152590, 153464, 154224, 154155, 153227, 152177, 151656, 151661, 151884, 152335, 153289, 154717, 156089, 156929, 157349, 157760, 158147, 158024, 157269, 156613, 156914, 158101, 159254, 159689, 159520, 159095, 158389, 157285, 156121, 155472, 155465, 155645, 155520, 154972, 154161, 153372, 152990, 153296, 154059, 154577, 154341, 153586, 153006, 153039, 153556, 154188, 154721, 155198, 155734, 156260, 156392, 155647, 153930, 151784, 150027, 149126, 148983, 149252, 149750, 150503, 151507, 152501, 153048, 153006, 152862, 153355, 154577, 155755, 156180, 156081, 156191, 156673]
54416A56673L84J44M44J183J691J778J776J633Q96k88r73n81K93P08M85J22j3
54399A66355L1J01J77L02N32Q60J141J234J183J040O06j94q25o22J54M27k17r05
54381A71380o89K15R69J231J074L95p17j382p84N35J107L77p29j251j280j342
54365A69109j412j134n36L7M18O49P14N55K43j13n07q42q88n68j44J31L69P59
54347A66840J090Q85M4r09j321j009l66O0K6l04o41q47r21q20n35k41j87l39l62
54328A60143r1J73O5k64k41L45R20P56n2n28j1R05J025Q6q65q57j88J63n3j89
54308A61242J64O11O29K77l1o0K05P21J277J479J159O26K92K57M73J019J893K681
54290A74914K880K495K035J861J835J674J305Q68M60R9k56o49j092j492j704j632
$$ y = [156673, 157057, 157201, 157645, 158828, 160519, 162297, 164073, 165706, 166602, 166314, 165341, 164760, 165053, 165761, 166246, 166368, 166355, 166386, 166487, 166664, 166966, 167498, 168358, 169499, 170733, 171916, 172956, 173562, 173368, 172543, 171921, 172075, 172502, 172285, 171380, 170691, 170906, 171875, 173106, 174180, 174575, 173858, 172476, 171692, 172227, 173334, 173711, 172982, 171731, 170451, 169109, 167697, 166563, 166027, 166064, 166482, 167131, 167845, 168400, 168643, 168530, 168023, 167181, 166293, 165725, 165581, 165712, 166081, 166840, 167930, 168815, 168859, 167950, 166629, 165620, 165254, 165314, 165340, 165036, 164395, 163548, 162627, 161807, 161272, 161031, 160844, 160505, 160143, 160052, 160225, 160290, 160026, 159785, 160130, 161050, 161806, 161754, 161226, 161215, 162120, 163145, 163231, 162366, 161509, 161321, 161484, 161431, 161242, 161406, 162017, 162646, 162923, 162892, 162832, 163037, 163758, 165035, 166514, 167673, 168299, 168591, 168848, 169321, 170340, 172233, 174914, 177794, 180289, 182324, 184185, 186020, 187694, 188999, 189867, 190327, 190426, 190170, 189521, 188429, 186937, 185233, 183601]
54274A83601j275p53l79m89j032j436j211n48l0J72L61N81M42j46o09m89j74k98
54256A76288p32q05l76l7j49l33j55K32M01K65K7j82k98k39q2j16m42p89r53j075
54236A70450j192r09m3P26N42m35j186j189r37j024j262j095m43J92K47m36j440
54219A60566j985j603o56J19N06P78Q39K01r59j547r02K03O06L00K08O96J226
54202A58596J301J027N97k8p05r41n00K02N81N24L90N36J037J630J875J564J015
54185A68701P30P19M53m04j526k318k519k226j626r19l87j67JN39J474K258K235
54168A65018J330J54n15m20O4L54J88l00p77r19n77Q2O78R57R63Q12M44j48o69
54149A66719p49m09lK01J66j31o99j261j360r25m34k43l2P28J811K222J447L26
$$ y = [183601, 182326, 181573, 181194, 180705, 179673, 178237, 177026, 176478, 176448, 176620, 176981, 177562, 178004, 177858, 177249, 176760, 176586, 176288, 175556, 174751, 174375, 174338, 174189, 173856, 173701, 173933, 174334, 174599, 174626, 174444, 174146, 173907, 173825, 173709, 173267, 172478, 171525, 170450, 169258, 168349, 168306, 169032, 169574, 169139, 167953, 166764, 165827, 164803, 163541, 162446, 162003, 162195, 162442, 162006, 160566, 158581, 156978, 156322, 156441, 156947, 157725, 158564, 158765, 157806, 156259, 155357, 155560, 156166, 156466, 156674, 157370, 158596, 159897, 160924, 161521, 161493, 160788, 159847, 159347, 159549, 160130, 160654, 161044, 161580, 162617, 164247, 166122, 167686, 168701, 169431, 170150, 170603, 170199, 168673, 166355, 163836, 161610, 159984, 159065, 158678, 158511, 158512, 159051, 160525, 162783, 165018, 166348, 166502, 165987, 165567, 165631, 165985, 166173, 165873, 165096, 164177, 163600, 163682, 164360, 165317, 166280, 167092, 167536, 167388, 166719, 165970, 165561, 165558, 165759, 165925, 165794, 165095, 163834, 162474, 161549, 161115, 160872, 160840, 161568, 163379, 165601, 167048, 167374]
54131A67374K10J254K144J728N09j47J36M59J79j97n4K72J58j89j27K38K50j02
54113A74095j30L15M89m7o81o92k90j30k94m12m49p04j123j210o95J81J076J853
54095A71152K357K319J669P35n7n46p79p61m57J1L84M47K05j04j31K90Q63R36
54077A78533J91q43j209o03K70O10M78N12R10J229J172R70Q26M95k01q54r38n42
54059A81006j70qJ87M96O81O02M43L35J15l73r02r84l58O79J490J712J621J682
54041A88254J804J464O74K16N89J211J290J057J383K431L469L950L972L575K594
54026B17933J454J266K545M389N465N413M738L822K695J570R22R37J339J735J915
54011B58138J820J506J201J126J227J189P32j34j110j787j952j799j792k306l313
$$ y = [167374, 167584, 168838, 170982, 172710, 173219, 173072, 173208, 173667, 173846, 173649, 173595, 173867, 174025, 173836, 173709, 173947, 174197, 174095, 173965, 174280, 174769, 174722, 174041, 173349, 173059, 172929, 172635, 172223, 171774, 171070, 169947, 168737, 168042, 168223, 169299, 171152, 173509, 175828, 177497, 178232, 178175, 177629, 176850, 176089, 175632, 175643, 176027, 176474, 176679, 176575, 176444, 176734, 177597, 178533, 178724, 177881, 176672, 176069, 176339, 176949, 177427, 177939, 178849, 180078, 181250, 182220, 183046, 183541, 183340, 182486, 181548, 181006, 180836, 180828, 181015, 181511, 182192, 182794, 183237, 183572, 183687, 183314, 182412, 181428, 181070, 181749, 183239, 184951, 186572, 188254, 190058, 191522, 192196, 192412, 193001, 194212, 195502, 196559, 197942, 200373, 203842, 207792, 211764, 215339, 217933, 219387, 220653, 223198, 227587, 233052, 238465, 243203, 247025, 249720, 251290, 252212, 253149, 254488, 256223, 258138, 259958, 261464, 262665, 263791, 265018, 266207, 266939, 266805, 265695, 263908, 261956, 260157, 258365, 256059, 252746]
53996B52746m380m875m364l063j799j248j286j345j258j290j432j303q41n74q72
53981B22816j438j744j662j415j220j217j382j324o05N40J220R35J97j96r8J39
53965B13546L24M97O78R17J355J885K133K113K468L583M936N838O420P224Q260
53950B62177R161J0007J1098J2042J2030J1048R906Q878P119L816o03m832p755
53937C44092q962q700p736o930o497n925m744l176j800r42o34q42j389j899k084
53922B81832k018j873j549q12L33J575K540K937K668J978J419J426J938K559L006
53907B97959L318L727M397N245N892N939N361M539L845L347K930K522J966R90
53893C51977m49j827k453k191j607j273j222j236j395k021l077m005m377m438
$$ y = [252746, 248366, 243491, 239127, 236064, 234265, 233017, 231731, 230386, 229128, 227838, 226406, 225103, 224262, 223688, 222816, 221378, 219634, 217972, 216557, 215337, 214120, 212738, 211414, 210809, 211349, 212569, 213504, 213701, 213505, 213407, 213546, 213870, 214367, 215045, 215962, 217317, 219202, 221335, 223448, 225916, 229499, 234435, 240273, 246693, 253917, 262177, 271338, 281345, 292443, 304485, 316515, 327563, 337469, 346347, 353466, 357282, 356679, 351847, 344092, 335130, 326430, 318694, 311764, 305267, 299342, 294598, 291422, 289622, 288680, 288046, 287204, 285815, 283916, 281832, 279814, 277941, 276392, 275580, 275913, 277488, 280028, 282965, 285633, 287611, 289030, 290456, 292394, 294953, 297959, 301277, 305004, 309401, 314646, 320538, 326477, 331838, 336377, 340222, 343569, 346499, 349021, 350987, 351977, 351528, 349701, 347248, 345057, 343450, 342177, 340955, 339719, 338324, 336303, 333226, 329221, 324844, 320406]
53879C20406m744n343n670n311m579m117m108m163l862l258k726k501k381k008
53865B65635j368r52j238k087k859l111k964k688k256j572q59o04j023j770k168
53850B38116j776q37j68l41j006j323j031o27m28q4O57J294J219N98%m25p77p88
53832B32273k01M37K47o71j260j000n83p72j323j494j082m70J0K83L18R5k83o45
53814B23879p87m60L02R14P27l0l66J73Q96R72N29K60L54M59M21M72P82J315K032
53795B32844K865L576L969M175M369M436M266M125M276M406M029L280K753K551
53781B85920K227J725J652K272K891K737K111K094L264N127O734P514P534P189
53767C40991O787O285N449M162K460K47k687o138r271j1250j2001j2060j1758
$$ y = [320406, 315662, 310319, 304649, 299338, 294759, 290642, 286534, 282371, 278509, 275251, 272525, 270024, 267643, 265635, 264267, 263315, 262077, 259990, 257131, 254020, 251056, 248368, 246112, 244540, 243681, 243077, 242054, 240284, 238116, 236340, 235503, 235335, 234994, 233988, 232665, 231634, 231007, 230579, 230495, 231152, 232446, 233665, 234263, 234263, 233838, 233061, 232273, 232072, 232509, 232756, 232085, 230825, 229825, 229242, 228470, 227147, 225653, 224571, 224101, 224111, 224394, 224712, 224807, 224524, 223879, 223092, 222632, 222934, 223848, 224575, 224545, 224179, 224352, 225248, 226220, 226749, 227009, 227363, 227822, 228243, 228715, 229497, 230812, 232844, 235709, 239285, 243254, 247429, 251798, 256234, 260500, 264625, 268901, 273307, 277336, 280616, 283369, 285920, 288147, 289872, 291524, 293796, 296687, 299424, 301535, 303629, 306893, 312020, 318754, 326268, 333802, 340991, 347778, 354063, 359512, 363674, 366134, 366381, 363694, 357556, 348285, 337035, 325034, 312974, 301216]
53754C01216j0958r653q403p789p617p004n397l267j659j123j324j659j891k067
53740B31405k040j604r40n01k89K18J143J651R30n07j232o66K66N22K66L43Q78
53723B29843J231J157J166J593J981J704Q08j82r11j221r29n1Q60J139Q17N82
53707B39587Q65J384J631J500J302J414K090L292M585N427N750N981O333O377
53693B87518N620M254K898J804P23n10j679k556l132l361l042k201j351j058j394
53678B82533j949k324k382k195j902j637j406j089o50l38m92j198k164k884k838
53663B57085j796j92R66R73K09k54J14P52P85m3j296k352k689k022o26O74J164
53646B51452Q96M23Jn35j168j491j202n22J26N63Q61J087J209J177J018Q96J062
$$ y = [301216, 290258, 280605, 272202, 264413, 256796, 249792, 244395, 241128, 239469, 238346, 237022, 235363, 233472, 231405, 229365, 227761, 226821, 226320, 226031, 226249, 227392, 229043, 229973, 229466, 228234, 227568, 227834, 228356, 228622, 228965, 229843, 231074, 232231, 233397, 234990, 236971, 238675, 239483, 239301, 238390, 237169, 236240, 236189, 237049, 238188, 239005, 239587, 240452, 241836, 243467, 244967, 246269, 247683, 249773, 253065, 257650, 263077, 268827, 274808, 281141, 287518, 293138, 297392, 300290, 302094, 302817, 302307, 300628, 298072, 294940, 291579, 288537, 286336, 284985, 283927, 282533, 280584, 278260, 275878, 273683, 271781, 270144, 268738, 267649, 266999, 266661, 266169, 264971, 262807, 259923, 257085, 255289, 255097, 256063, 257036, 257245, 256991, 257105, 257857, 258642, 258599, 257303, 254951, 252262, 250240, 249614, 250288, 251452, 252348, 252771, 252772, 252237, 251069, 249578, 248376, 247854, 247980, 248543, 249404, 250491, 251700, 252877, 253895, 254791, 255853]
53629B55853J579K120K297K169K108K176K031J548J169J317J831K289K601K882
53615B83970K940K464J649J133J221J553J773K093K840L712L968L440K876K998
53601C18630L435L112J655L8m85K73J410K021J870J176K64m94q05o83l54Q1N48
53584C31692P08K48n20q89p19o22r64j375j540j768k317k742k521j878j358j005
53568C12430o49n76j134j888j994j326m95M9K68k0r66j953j940q15L48O92N04
53551C00535M01L50L5m12n71l23J61P85J524K241K837L256L283K691J841J600
53535C20234K310L272L672L655L945M750N562N929N914N845O060O802P971Q986
53521C94907R267Q944Q748R205J0105J0884J1229J1264J1340J1727J2475J3442
$$ y = [255853, 257432, 259552, 261849, 264018, 266126, 268302, 270333, 271881, 273050, 274367, 276198, 278487, 281088, 283970, 286910, 289374, 291023, 292156, 293377, 294930, 296703, 298796, 301636, 305348, 309316, 312756, 315632, 318630, 322065, 325177, 326832, 326870, 326385, 326658, 328068, 330089, 331959, 333135, 333399, 332905, 332100, 331417, 331063, 331144, 331692, 332400, 332648, 332128, 331239, 330520, 329898, 328934, 327559, 326019, 324251, 321934, 319192, 316671, 314793, 313435, 312430, 311781, 311205, 310071, 308183, 306189, 304863, 304368, 304417, 304685, 304665, 303699, 301746, 299806, 298991, 299339, 300031, 300535, 300936, 301286, 301321, 300909, 300338, 300015, 300176, 300961, 302485, 304726, 307563, 310819, 314102, 316793, 318634, 320234, 322544, 325816, 329488, 333143, 337088, 341838, 347400, 353329, 359243, 365088, 371148, 377950, 385921, 394907, 404174, 413118, 421866, 431071, 441176, 452060, 463289, 474553, 485893, 497620, 510095, 523537]
53509E23537J4468J5490J6504J7484J8432J9349K0146K0572K0354J9477J8305
53498G24118J7408J7141J7320J7480J7434J7384J7418J7258J6735J6098J5532
53487I11326J4801J3845J3284J3573J4027J3538J2157J0993J0583J0387J0068
53476A048582J0091J0599J0719R764Q243O980N852M267K278M34j152k751m353
53463A109553n757p013q158q874r162r877j1736j4032j5370j5474j5387j5837
53451I72876j6405j6545j6420j6421j6480j6329j5956j5478j4937j4418j4089
53440G99398j3895j3572j3009j2324j1556j0595r469q323p137n826m535l436k329
53427F83392r15N49J489J928K585L959N810P656R242J0423J1104J1540J2193J3191
$$ y = [523537, 538005, 553495, 569999, 587483, 605915, 625264, 645410, 665982, 686336, 705813, 724118, 741526, 758667, 775987, 793467, 810901, 828285, 845703, 862961, 879696, 895794, 911326, 926127, 939972, 953256, 966829, 980856, 994394, 1006551, 1017544, 1028127, 1038514, 1048582, 1058673, 1069272, 1079991, 1089755, 1097998, 1104978, 1110830, 1115097, 1117375, 1117809, 1116657, 1113906, 1109553, 1103796, 1096783, 1088625, 1079751, 1070589, 1060712, 1048976, 1034944, 1019574, 1004100, 988713, 972876, 956471, 939926, 923506, 907085, 890605, 874276, 858320, 842842, 827905, 813487, 799398, 785503, 771931, 758922, 746598, 735042, 724447, 714978, 706655, 699518, 693692, 689157, 685721, 683392, 682477, 683026, 684515, 686443, 689028, 692987, 698797, 706453, 715695, 726118, 737222, 748762, 760955, 774146]
53413G74146J4281J5386J6670J8020J9135K0189K1721K3612K4990K5499K5958
53402I99607K7170K8841L0252L1381L2631L3906L4875L5792L7190L8906M0213
53391A370764M0927M1581M2380M2740M2206M1206M0558M0472M0422L9819L8490
53380A821565L6666L4703L2798L0864K8695K6201K3397K0262J6800J3220R852
53369B095023O777L687K60l485p278j0985j4743j8726k2859k6827l0378l3475
53357A936991l6222l8699m0921m2808m4119m4621m4464m4189m4049m3568m2210
53346A471121m0371l9056l8565l8096l6975l5588l4618l3945l3027l2005l1476
53335A077399l1274l0435k8661k6931k6168k5879k4906k3000k0921j9134j7365
$$ y = [774146, 788427, 803813, 820483, 838503, 857638, 877827, 899548, 923160, 948150, 973649, 999607, 1026777, 1055618, 1085870, 1117251, 1149882, 1183788, 1218663, 1254455, 1291645, 1330551, 1370764, 1411691, 1453272, 1495652, 1538392, 1580598, 1621804, 1662362, 1702834, 1743256, 1783075, 1821565, 1858231, 1892934, 1925732, 1956596, 1985291, 2011492, 2034889, 2055151, 2071951, 2085171, 2095023, 2101800, 2105487, 2105747, 2102262, 2094984, 2083999, 2069256, 2050530, 2027671, 2000844, 1970466, 1936991, 1900769, 1862070, 1821149, 1778341, 1734222, 1689601, 1645137, 1600948, 1556899, 1513331, 1471121, 1430750, 1391694, 1353129, 1315033, 1278058, 1242470, 1207852, 1173907, 1140880, 1108875, 1077399, 1046125, 1015690, 987029, 960098, 933930, 908051, 883145, 860145, 839224, 820090, 802725]
53324H02725j5492j4009j3134j2230j0713r050q075p678o972n673m372l392k256
53311F89679o84P97J751K663M151N865O993P529Q159R138J0135J1067J2247J3612
53297G83102J4646J5242J5917J6959J8049J8979K0035K1287K2156K2255K2110
53286I90737K2536K3492K4034K3267K1087J8249J5877J4578J3851J2643J0577
53275A190928Q205N983L698J212r72k420l516m887o497p930r177j0538j2035j3487
53261A138567j4911j6313j7419j8158j9042k0385k1580k1897k1726k2105k3213
53250I21818k4275k4856k5224k5373k4796k3538k2538k2343k2271k1478k0210
53239F64916j9370j9241j9268j8883j7963j6699j5455j4705j4690j5152j5507
$$ y = [802725, 787233, 773224, 760090, 747860, 737147, 728097, 720022, 712344, 705372, 699699, 695327, 691935, 689679, 688995, 689792, 691543, 694206, 698357, 704222, 711215, 718744, 726903, 736041, 746176, 757243, 769490, 783102, 797748, 812990, 828907, 845866, 863915, 882894, 902929, 924216, 946372, 968627, 990737, 1013273, 1036765, 1060799, 1084066, 1105153, 1123402, 1139279, 1153857, 1167708, 1180351, 1190928, 1199133, 1205116, 1208814, 1210026, 1209054, 1206634, 1203118, 1198231, 1191734, 1183804, 1174627, 1164089, 1152054, 1138567, 1123656, 1107343, 1089924, 1071766, 1052724, 1032339, 1010759, 988862, 967136, 945031, 921818, 897543, 872687, 847463, 822090, 797294, 773756, 751218, 728875, 706604, 685126, 664916, 645546, 626305, 607037, 588154, 570191, 553492, 538037, 523332, 508642, 493490, 477983]
53228D77983j5259j4201j2510j0778r676r312r179q801q206p598o997o399n929
53215C53138n534m922m165l895m459n177n120m406m024m397m780m334l224k278
53201B92423j965k126k494k985l413l344k528j318m56l87r36j567j810j402l78
53186B65314P53J159M24r63k023k293k076j873j841j860j740j270m01N00R11P50
53170B53471M14J66j08l48r4Q00J642J628Q35N4k67l86o80j067j181p90nQ07J266
53151B56157J324J225J065O01k97j212j561j229n68N8L93J89n55j295j345o04
53135B52346M12J196J570J476Q54j71j296k212k571k066r62k34n22j158r47J31
53119B45846Q69O03N7P1M43N37L25J57L5j57k26p5r9n08p46l41J42j24q74j173
$$ y = [477983, 462724, 448523, 436013, 425235, 415559, 406247, 397068, 388267, 380061, 372463, 365466, 359067, 353138, 347604, 342682, 338517, 334622, 330163, 324986, 319866, 315460, 311436, 307039, 302259, 297925, 294701, 292423, 290458, 288332, 285838, 282853, 279440, 276096, 273568, 272250, 271794, 271407, 270471, 268904, 267094, 265692, 265314, 266067, 267226, 267650, 266687, 264664, 262371, 260295, 258422, 256581, 254721, 252981, 251711, 251310, 251810, 252721, 253471, 253885, 254051, 253943, 253595, 253501, 254301, 255943, 257571, 258406, 258460, 258193, 257807, 257127, 256060, 254879, 254089, 254084, 254891, 256157, 257481, 258706, 259771, 260372, 260075, 258863, 257302, 256073, 255505, 255563, 255956, 256145, 255590, 254295, 252950, 252346, 252758, 253954, 255524, 257000, 257854, 257683, 256387, 254175, 251604, 249538, 248576, 248342, 247820, 246662, 245715, 245846, 246715, 247318, 247375, 247446, 247889, 248426, 248751, 248908, 248943, 248786, 248560, 248485, 248386, 247878, 247132, 246791, 246933, 246809, 245935, 244762]
53099B44762r07p96j004r65p27j173k455l278k570r68J91O32R92J344J008k14
53083B33872j516j986j515o36J31N60O74N37N3r43k250l155l105k348j628j276
53067B15469j040o76k99o4J28M46Q68J195J161N62m52j199r82P9R90Q56j88j162
53049B15692j221l92N43P93K55m12n06PN51P00O04O07P20P00N24M30N21N05J01
53030B20722m73o62l18K9j33n34m67J35M95Q8o13q70p40q10j092j016m81j92n19
53011B12549p53p5J149J723J180L34J37N27P17K40o53j476j905j765j006J4O03
52994B11540L71k79o05m43k98n28q07o01P4O70P41L38j32k57R5O88J120J210J130
52975B14027J086J115J179J219J019M25j26K13J578K843K726J258m23j403j583
$$ y = [244762, 243855, 243059, 242055, 241090, 240363, 239190, 236735, 233457, 230887, 229919, 230110, 230742, 231734, 233078, 234086, 233872, 232356, 230370, 228855, 228219, 228350, 228910, 229584, 230121, 230174, 229231, 226981, 223826, 220721, 218373, 216745, 215469, 214429, 213753, 213454, 213390, 213518, 213964, 214832, 216027, 217188, 217750, 217298, 216099, 215117, 215196, 216186, 217042, 216854, 215692, 214471, 214079, 214622, 215415, 215670, 215258, 214752, 214759, 215310, 216010, 216614, 217221, 217941, 218641, 219165, 219595, 220116, 220621, 220722, 220249, 219587, 219269, 219298, 219165, 218631, 218164, 218299, 218794, 218882, 218269, 217399, 216659, 215849, 214757, 213741, 213260, 213068, 212549, 211796, 211721, 212870, 214593, 215773, 216107, 216244, 216771, 217488, 217728, 217075, 215599, 213694, 211929, 210923, 210937, 211540, 211911, 211632, 211027, 210584, 210286, 209758, 208951, 208350, 208424, 209094, 209835, 210173, 210041, 209784, 209879, 210567, 211687, 212897, 214027, 215113, 216228, 217407, 218626, 219645, 220070, 219944, 220157, 221735, 224578, 227304, 228562, 228139, 226736, 225153]
52960B25153j188m91M1K0l19m79n78j083j734j655q26m12j091j985j962j272r87
52943B09152j328j551j189n42K1L92M09j01q37j201j067q54p92o56l04N5L05O10
52925B00522R79J059N72l78j489k450k819k213q34N03J159J222J103R68P98O68
52909A99370O14M44N4k01J06Q37J338J273R85R23Q93K81j010k097j941n82P50
52892B02037R30J16o15o13j85J69M72R51J328R72k69j696k366j881o26O09J138
52875B00471P48j59p88n65L63J309J739J716J600J566J605J749K000K091J741
52860B17186J129P62P74Q27P71R69J635K288K292J661R38M57K17J97L16J93n03
52843B32109j460k013k059k175k713l290l363k938k388j874j319o89r5L09L54
$$ y = [225153, 223965, 223474, 223515, 223535, 223216, 222737, 222159, 221076, 219342, 217687, 216861, 216449, 215358, 213373, 211411, 210139, 209152, 207824, 206273, 205084, 204542, 204563, 204955, 205364, 205263, 204426, 203225, 202158, 201304, 200512, 199856, 199552, 199607, 199912, 200522, 201501, 202560, 203132, 202754, 201265, 198815, 195996, 193783, 192949, 193452, 194611, 195833, 196936, 197904, 198702, 199370, 199984, 200428, 200482, 200281, 200387, 201224, 202562, 203835, 204820, 205743, 206636, 206917, 205907, 203810, 201869, 201287, 202037, 202967, 203083, 202468, 201855, 201670, 201839, 202311, 203262, 204590, 205562, 205293, 203597, 201231, 199350, 198724, 199333, 200471, 201219, 201060, 200272, 199707, 200070, 201379, 203118, 204834, 206434, 208000, 209605, 211354, 213354, 215445, 217186, 218315, 219077, 219851, 220678, 221449, 222418, 224053, 226341, 228633, 230294, 231232, 231689, 231906, 232103, 232419, 232612, 232109, 230649, 228636, 226577, 224402, 221689, 218399, 215036, 212098, 209710, 207836, 206517, 205828, 205733, 206042, 206396]
52828B06396k4n55o95j35Q40J606J779J471J073Q32O32J39p38j585j811j192m5
52811B07988J079J703J666J300J236J735K281K177J387M23m51j363k205k564k404
52796B13988k235k318k265j773j187r29q34n63l60p03j433j803j443p77m28n29
52780A94408p39o92l54nJ40K27N09P96O07ol16K9L58k4o53m89M83J186R94N05
52760A96964M97Q77J088R59O62K06l98p52m01N04J249J328R27N99O46Q55P55K48
52742B06813p8M62J690K541K269J309O53N98N93J59n41j036j023m76L29Q25O23
52725B15710O1j34J79L47q2o48o96l61l00p20j239j630j991k226j939j101k88
52708B02942kj37l94p98j448k079k336k217j848j057L07J766K462K115J248M34
$$ y = [206396, 206372, 205817, 205122, 204987, 205827, 207433, 209212, 210683, 211756, 212588, 213220, 213359, 212621, 211036, 209225, 208033, 207988, 209067, 210770, 212436, 213736, 214972, 216707, 218988, 221165, 222552, 222975, 222524, 221161, 218956, 216392, 213988, 211753, 209435, 207170, 205397, 204210, 203281, 202447, 201884, 201524, 200821, 199388, 197585, 196142, 195365, 194937, 194408, 193669, 192977, 192623, 192618, 192758, 192985, 193494, 194290, 194897, 194891, 194575, 194604, 194962, 194938, 194285, 193796, 194279, 195465, 196459, 196964, 197461, 198338, 199426, 200385, 201047, 201253, 200855, 200103, 199702, 200206, 201455, 202783, 203710, 204309, 204955, 205810, 206565, 206813, 206735, 207197, 208887, 211428, 213697, 215006, 215659, 216257, 216850, 217009, 216468, 215432, 214409, 213933, 214262, 215087, 215710, 215771, 215637, 215816, 216163, 216081, 215433, 214737, 214376, 214076, 213356, 212117, 210487, 208496, 206270, 204331, 203230, 202942, 202940, 202803, 202409, 201611, 200163, 198084, 195748, 193531, 191683, 190626, 190933, 192699, 195161, 197276, 198524, 198958]
52692A98958k20o84o51L4R10J325J232J123J211J083M24k92k19P02J443J006l04
52675B07081j138o85M35R80N20k89o47l50L02R34J244J097O32J86l1j03k26n10
52657B09432q94j147r81l56M11J005J431J771J782J226N31N60J532K621K850K045
52641B23819P33n29j456j954k137k258k382k244j620o61L25J198J946K485K737
52626B18002K729K467J987J542J414J359P02o67j864k029j425j012j167j482j593
52611B18963j556j418r95k72M65R91J291J301R28L64oj27l17o67q67p75o99r01
52593B15703j196j288j180r33m11M23J238J685J806J796J604J184Q78J079J607
52578B23995J879J729J595J759J807J179J4q79r06k72K81K46k69q27j152j273
$$ y = [198958, 198738, 198054, 197403, 197437, 198347, 199672, 200904, 202027, 203238, 204321, 204745, 204453, 204234, 204936, 206379, 207385, 207081, 205943, 205258, 205693, 206673, 207193, 206904, 206257, 205907, 206209, 207143, 208387, 209484, 210116, 210302, 210271, 210168, 209942, 209432, 208538, 207391, 206410, 206054, 206465, 207470, 208901, 210672, 212454, 213680, 214211, 214771, 216303, 218924, 221774, 223819, 224552, 224023, 222567, 220613, 218476, 216218, 213836, 211592, 209972, 209311, 209636, 210834, 212780, 215265, 218002, 220731, 223198, 225185, 226727, 228141, 229500, 230202, 229535, 227671, 225642, 224217, 223205, 222038, 220556, 218963, 217407, 215989, 214994, 214722, 215187, 216178, 217469, 218770, 219698, 220062, 220056, 219929, 219612, 218945, 218078, 217303, 216604, 215703, 214507, 213219, 212039, 211106, 210695, 211118, 212356, 214041, 215847, 217643, 219247, 220431, 221309, 222388, 223995, 225874, 227603, 229198, 230957, 232764, 233943, 233957, 233078, 232172, 231900, 232181, 232427, 232158, 231331, 230179, 228906]
52562B28906j256j102r08r16j110r91j00J192J806J136j78r10o08L0J42k62m29
52545B24442R1Q25R12J54o80p34r3L60J40j82Q2N82L39o65j150j91J399K026J318
52526B28975L98K50N85N59l6p08r44n41M24J549K188K039J529J321J580J955K214
52509B43337K469K774K908K653K112J504Q87J61o43j306j725k079k533k765k169
52494B45585p55M56M46m82j017m97L31N11J40n6Q6J59J21L58Q59J019N52K5J52
52475B47993Q78J510J519J036O17P05J215J661J736J668J845K210K385K205J837
52460B71020J380Q03K47n5k86r21j978k847l110l055l033k807k086j307j177j572
52444B49216j634j028m73p11j468j908j718j269q43l10L26N88J06p57j182p67
$$ y = [228906, 227650, 226548, 225640, 224724, 223614, 222623, 222523, 223715, 225521, 226657, 226479, 225569, 224961, 224991, 225133, 224871, 224442, 224533, 225358, 226270, 226424, 225744, 225010, 224917, 225277, 225417, 225235, 225317, 225899, 226238, 225573, 224423, 224232, 225631, 227657, 228975, 229373, 229623, 230208, 230767, 230731, 230023, 229079, 228538, 228962, 230511, 232699, 234738, 236267, 237588, 239168, 241123, 243337, 245806, 248580, 251488, 254141, 256253, 257757, 258644, 258805, 258162, 256856, 255131, 253052, 250519, 247754, 245585, 244830, 245286, 245732, 245250, 244233, 243736, 244067, 244578, 244718, 244662, 244748, 244907, 245028, 245386, 246245, 247264, 247816, 247841, 247993, 248871, 250381, 251900, 252936, 253553, 254258, 255473, 257134, 258870, 260538, 262383, 264593, 266978, 269183, 271020, 272400, 273203, 273450, 273395, 273109, 272188, 270210, 267363, 264253, 261198, 258165, 255358, 253272, 251965, 250788, 249216, 247582, 246554, 246081, 245370, 243902, 241994, 240276, 239007, 238164, 237854, 238180, 238768, 238874, 238117, 236935, 236168]
52428B36168J57R14J000K97p47j327r80k31%l85n41P9R15J182R71R12J165J424
52410B40973J659K108K577K543J970J465J457J878K610L668M765N440N835O644
52396B85592P883Q364P004M173J219r83k482l554m257m623m685m333l476k374
52382B83468j539j222j238j247j018n18Q3N01O72Q73J397K188K869L007K325J026
52366B91627p6j80M85P75M1j058j599j669j904k232j961r94o8L19L91M24L10P9
52348B82710J34O01R45P01J72j2K85O79Q32P20N54O76J334K273K821K589J957
52331B99971J622J934K788L841M543M402L601L118L643M682N219N067M937N192
52317C54560N302M743L795L056K661K417K368K720L326L742L807L810M011M321
$$ y = [236168, 236325, 237239, 238239, 238536, 237789, 236462, 235482, 235251, 235251, 234866, 234325, 234404, 235319, 236501, 237472, 238384, 239549, 240973, 242632, 244740, 247317, 249860, 251830, 253295, 254752, 256630, 259240, 262908, 267673, 273113, 278948, 285592, 293475, 301839, 308843, 313016, 314235, 313252, 310770, 307216, 302959, 298336, 293651, 289318, 285842, 283468, 281929, 280707, 279469, 278222, 277204, 276686, 276769, 277270, 277942, 278815, 280212, 282400, 285269, 288276, 290601, 291627, 291551, 291371, 291856, 292631, 292672, 291614, 290015, 288346, 286442, 284210, 282249, 281255, 281187, 281506, 281897, 282321, 282631, 282710, 282844, 283445, 284390, 285091, 285263, 285251, 285536, 286215, 287047, 287767, 288321, 288997, 290331, 292604, 295425, 298014, 299971, 301593, 303527, 306315, 310156, 314699, 319101, 322702, 325820, 329463, 334145, 339364, 344431, 349368, 354560, 359862, 364605, 368400, 371456, 374117, 376534, 378902, 381622, 384948, 388690, 392497, 396307, 400318, 404639]
52303D04639M495M510M539M711M973N137N090M888M624M154L227J971R87O32L54
52288D58931p02k445l718l604k414j106k43J43Q7k54l56J75R20J077O01K86O08
52271D47986J164J527J978K886L868M252M069M019M520N339O098O670P041P197
52257E08614P173P012O595N882N165M777M580M122L335K608K153J711J093N17
52243E65337K15K9l09o87p09r7J059K325L109L149K915L168L933M373L978L418
52227E95206L667M598N160M866M440M750N661O353O437O310O451O777O836O459
52213F73971N949N678N648N666N738O032O437O618O570O695P085P210O736O209
52199G62242O309O747O643N932N525N893O371O290O102O669P900Q730Q346O863
$$ y = [404639, 409134, 413644, 418183, 422894, 427867, 433004, 438094, 442982, 447606, 451760, 454987, 456958, 457945, 458577, 458931, 458229, 455784, 452066, 448462, 446048, 444942, 444699, 444842, 444929, 444675, 444319, 444494, 445414, 446491, 447092, 447378, 447986, 449150, 450677, 452655, 455541, 459409, 463661, 467730, 471749, 476269, 481608, 487706, 494376, 501417, 508614, 515787, 522799, 529394, 535276, 540441, 545218, 549798, 553920, 557255, 559863, 562016, 563727, 564820, 565337, 565552, 565581, 565272, 564585, 563876, 563779, 564838, 567163, 570272, 573421, 576336, 579504, 583437, 587810, 591788, 595206, 598873, 603471, 608631, 613497, 617937, 622687, 628348, 634701, 641138, 647448, 653899, 660676, 667512, 673971, 679920, 685598, 691246, 696912, 702650, 708682, 715119, 721737, 728307, 735002, 742087, 749297, 756033, 762242, 768551, 775298, 781941, 787873, 793398, 799291, 805662, 811952, 818054, 824723, 832623, 841353, 849699, 856562]
52185H56562M969L359K423J982J325j09k020l528m066l756l052k403k123k165
52171H47398k063j540j058j223j730j614o48K85M66K50J98M2o99j596j740j168
52155H33560r19j519k223k082j163k68J95N87J398K651L869M484M321L770L428
52140H50089L449L359K654J437K50n80j162j581j595r27K42J364K067K403K625
52125H64094K944L621M955O862Q600R324Q955Q211P678P235O457N246L769K093
52111I50044K62j442k704l574m333m975n166m735l869k809j613k95J065K422L742
52096I22020M834N382N272M648L581J944k84k740m904o503p486p717o934n151
52082I05962k966j287n25k03M64J541K303K205J569J021O75L28J68O60J689K467
$$ y = [856562, 861531, 864890, 867313, 869295, 870620, 870511, 868491, 864963, 860897, 857141, 854089, 851686, 849563, 847398, 845335, 843795, 842737, 841514, 839784, 838170, 837522, 837807, 838273, 838523, 838721, 838763, 838064, 836468, 834728, 833560, 832641, 831122, 828899, 826817, 825654, 825386, 825581, 826168, 827566, 830217, 834086, 838570, 842891, 846661, 850089, 853538, 856897, 859551, 860988, 861238, 860658, 859496, 857915, 856320, 855393, 855635, 856999, 859066, 861469, 864094, 867038, 870659, 875614, 882476, 891076, 900400, 909355, 917566, 925244, 932479, 938936, 944182, 947951, 950044, 950306, 948864, 946160, 942586, 938253, 933278, 928112, 923377, 919508, 916699, 915086, 914791, 915856, 918278, 922020, 926854, 932236, 937508, 942156, 945737, 947681, 947397, 944657, 939753, 933250, 925764, 918047, 911113, 905962, 902996, 901709, 901184, 900981, 901445, 902986, 905289, 907494, 909063, 910084, 910759, 911087, 911255, 911915, 913604, 916071]
52066I16071K399J678Q86M62O19J317K135K535K489K507K858L153K925K267J598
52051I45899J122P91N43K97j02o53j169j666k507l830n169n891n836n256m453
52036I12120l768l576l891m209m086l679l284k786k024j414j448j831j776j144
52022H73204n38j72N43K029L824N257O320P321Q113Q283P929P752Q209R000R461
52007I56535R246Q449P166N152K072j963o211r893j2761j4932j6292j6505j5626
51994H94437j4313j3206j2393j1751j1489j1967j3031j3994j4337j4238j4234
51983G49484j4580j5067j5371j5347j4978j4209j3061j1856j1065j0865j0861
51972F02224j0418r193p317n123k847n95J602L735N766P574Q972R796R920R296
$$ y = [916071, 918470, 920148, 921034, 921496, 922115, 923432, 925567, 928102, 930591, 933098, 935956, 939109, 942034, 944301, 945899, 947021, 947812, 948355, 948652, 948550, 947897, 946728, 945062, 942555, 938725, 933556, 927665, 921829, 916573, 912120, 908352, 904776, 900885, 896676, 892590, 888911, 885627, 882841, 880817, 879403, 877955, 876124, 874348, 873204, 872666, 872494, 873037, 875066, 878890, 884147, 890467, 897788, 905901, 914184, 922113, 929865, 938074, 947074, 956535, 965781, 974230, 981396, 986548, 988620, 986657, 980446, 970553, 957792, 942860, 926568, 910063, 894437, 880124, 866918, 854525, 842774, 831285, 819318, 806287, 792293, 777956, 763718, 749484, 734904, 719837, 704466, 689119, 674141, 659932, 646871, 635015, 623950, 613085, 602224, 591806, 582613, 575296, 570173, 567326, 566731, 568333, 572068, 577834, 585408, 594380, 604176, 614096, 623392]
51958F23392Q027O353M398K000j020m316o929p945p323n986m960m425l659j971
51944E95636M96L013N158P195R488J1895J3831J4808J4704J3702J2199J0606R010
51931G21741P072M466J309j929m878p433r575j1324j2827j4241j5453j6144j6168
51918F24616j5764j5252j4663j3749j2345j0600q856p275n715m000k203n14J060
51905E14740K594L921M774N258N810O504O829O288M870K680l78m055p397r530
51891E42908j0618j1432j2109j2009j0774q841o771m672k544o64P29J883L335
51878D68421N431Q119J0974J3309J4614J5026J5116J5030J4133J1747P963L442
51866F03325j285n898r743j1812j1592r781p853o840o625o369n441l902k310j285
$$ y = [623392, 631419, 637772, 642170, 644170, 643150, 638834, 631905, 623960, 616637, 610651, 605691, 601266, 597607, 595636, 596132, 599145, 604303, 611498, 620986, 632881, 646712, 661520, 676224, 689926, 702125, 712731, 721741, 728813, 733279, 734588, 732659, 727781, 720348, 710773, 699449, 686622, 672381, 656928, 640784, 624616, 608852, 593600, 578937, 565188, 552843, 542243, 533387, 526112, 520397, 516397, 514194, 513680, 514740, 517334, 521255, 526029, 531287, 537097, 543601, 550430, 556718, 561588, 564268, 563890, 559835, 552438, 542908, 532290, 520858, 508749, 496740, 485966, 477125, 470354, 465682, 463138, 462474, 463203, 465086, 468421, 473852, 481971, 492945, 506254, 520868, 535894, 551010, 566040, 580173, 591920, 599883, 603325, 602040, 596142, 586399, 574587, 562995, 553214, 545361, 538521, 531896, 525527, 520086, 516184, 513874, 512589]
51852E12589j144j546j611q24J75K35p53j555j234l71n4k15J61J489L222M963
51836E13527O909R013J0542J0967J0603R925Q677O237K571j571n308q090r765
51823E64237j0489j0627j0540j0362r927q887p078m933l286k498j977r66M03J280
51809D84350J097r4k021m232n885o311n892n628n785n743n200m606m143l295j931
51794D24681q30n24m57K0O15Q50J065J722K258J849Q63M99J010J371P99l45j314
51777D34132j852k086k071j805j222j05J626L524M937N807O674P827Q837R058
51763D73281Q239O537M245J612j213m027o360p655p994q178q687q836p657n374
51749D27933l313k347k101j767r88J62J445K454K794K579K414K721L403M193M903
$$ y = [512589, 511445, 509899, 508288, 507464, 507639, 507874, 507121, 505566, 504332, 503961, 503907, 503692, 503853, 505342, 508564, 513527, 520436, 529449, 539991, 550958, 561561, 571486, 580163, 586400, 588971, 587400, 582092, 574002, 564237, 553748, 543121, 532581, 522219, 512292, 503405, 496327, 491394, 488108, 485610, 483633, 482667, 483070, 484350, 485447, 485353, 483332, 479100, 473215, 466904, 461012, 455384, 449599, 443856, 438656, 434050, 429907, 426612, 424681, 423851, 423327, 422870, 422890, 423505, 424355, 425420, 427142, 429400, 431249, 432112, 432611, 433621, 434992, 435791, 435446, 434132, 432280, 430194, 428123, 426318, 425096, 424991, 426617, 430141, 435078, 440885, 447559, 455386, 464223, 473281, 481520, 488057, 492302, 493914, 492701, 488674, 482314, 474659, 466665, 458487, 449800, 440964, 433307, 427933, 424620, 422273, 420172, 418405, 417417, 417579, 419024, 421478, 424272, 426851, 429265, 431986, 435389, 439582, 444485]
51734D44485N269N060M508M223M472M895N046M814M170L022J589M51J4K04Q48
51719D93070J900L104L861L819L219K342J013r34l014m331m408l444k013p43j07
51704D93334j41m30n82n26k36M73J461J980J345j57j511k036j821j130J9J546
51688D91588K934L511K939J380p82l135n284o802p268o548n082l693k895k481
51674D58382k056j755k015k686k961k387j508j070r81n18O44K190L883N873Q101
51659D61136R919J0693J0503R885R055P769N752L066J26k366l718l843l464l373
51645E11140l691m092m507n051n418n102m277l873m544o056p779r266j0180j0268
51631D27036r651q677p377n653m050l450l708l567k540j751k102k573j609N15
$$ y = [444485, 449754, 454814, 459322, 463545, 468017, 472912, 477958, 482772, 486942, 489964, 491553, 492004, 492018, 492222, 493070, 494970, 498074, 501935, 505754, 508973, 511315, 512328, 511394, 508380, 504049, 499641, 496197, 494184, 493441, 493334, 493193, 492763, 492181, 491655, 491419, 491892, 493353, 495333, 496678, 496521, 495010, 492974, 491153, 490023, 490042, 491588, 494522, 498033, 500972, 502352, 501570, 498435, 493151, 486349, 479081, 472533, 467451, 463758, 460863, 458382, 456326, 454571, 452556, 449870, 446909, 444522, 443014, 441944, 440963, 440445, 441089, 443279, 447162, 453035, 461136, 471055, 481748, 492251, 502136, 511191, 518960, 524712, 527778, 527904, 525538, 521820, 517977, 514513, 511140, 507449, 503357, 498850, 493799, 488381, 483279, 479002, 475129, 470585, 464529, 456750, 447484, 437304, 427036, 417385, 408708, 401331, 395678, 391628, 388178, 384470, 380903, 378363, 376612, 374510, 371937, 370328, 370843]
51617C70843K051K183J619R62j6j224j810j420q85j029j566j807j685j577j608
51602C63031j667j687j473p41L94J375K000K714L783M770N231N463O020O945P928
51587D04086Q819R538R813R475Q721P703O261M441K960K626L538N295P620J0352
51573E01248J3139J5666J8032K0432K2677K4457K5914K7440K9094L0655L2073
51562G60827L3421L4577L5437L6447L8428M1740M5911M9985N2974N4091N2841
51551A236679M8900M1844L1431J8423M710q021j9518l0390m0587m9144n5330n9273
51539A119724o1327o1527n9974n7168n3614m9412m4524l9129l3503k7877k2706
51528F08963j8698j6198j4696j3299j1582r746q094o709n602m851m475m373m476
$$ y = [370843, 372894, 375077, 376696, 377658, 377642, 376418, 374608, 373188, 372303, 371274, 369708, 367901, 366216, 364639, 363031, 361364, 359677, 358204, 357463, 357857, 359232, 361232, 363946, 367729, 372499, 377730, 383193, 389213, 396158, 404086, 412905, 422443, 432256, 441731, 450452, 458155, 464416, 468857, 471817, 474443, 477981, 483276, 490896, 501248, 514387, 530053, 548085, 568517, 591194, 615651, 641565, 669005, 698099, 728754, 760827, 794248, 828825, 864262, 900709, 939137, 980877, 1026788, 1076773, 1129747, 1183838, 1236679, 1285579, 1327423, 1358854, 1377277, 1381987, 1373966, 1354448, 1324058, 1283471, 1234327, 1178997, 1119724, 1058397, 996870, 936896, 879728, 826114, 776702, 732178, 693049, 659546, 631669, 608963, 590265, 574067, 559371, 546072, 534490, 524744, 516650, 509941, 504339, 499488, 495013, 490640, 486164]
51515D86164m797n218n427n223m823m572m450m061l240k389k051k336k971l675
51501D30931m243m420m125l693l520l474l045k131j229p85p08o93o19l71L07J436
51485C99618K409K327Q05j526l362l741k971k316k493k820k384j585j546k291
51471C78124k697k415k439l191l465k221m12K33m28j056p76J14J135K094K720
51456C65320K817K793L079L263K744K037K257L367M243M577N377P206R132J0134
51442D28346J0440J0810J1301J1598J1842J2232J2219J0835P728L484o89l392
51430E26754l785k443j046p95j492k535l939n763p174p143n789m180k991k150
51416D75529j723k155l419m630m865m016k616j219j74K80J47k30l55k3N25Q72
$$ y = [486164, 481367, 476149, 470722, 465499, 460676, 456104, 451654, 447593, 444353, 441964, 439913, 437577, 434606, 430931, 426688, 422268, 418143, 414450, 410930, 407456, 404411, 402280, 401051, 400266, 399558, 398865, 398246, 397875, 398182, 399618, 402027, 404354, 405159, 403633, 400271, 396530, 393559, 391243, 388750, 385930, 383546, 381961, 380415, 378124, 375427, 373012, 370573, 367382, 363917, 361696, 361284, 361517, 361089, 360033, 359257, 359371, 360506, 362600, 365320, 368137, 370930, 374009, 377272, 380016, 382053, 384310, 387677, 391920, 396497, 401874, 409080, 418212, 428346, 438786, 449596, 460897, 472495, 484337, 496569, 508788, 519623, 527351, 530835, 530146, 526754, 522969, 520526, 519480, 518685, 517193, 514658, 510719, 504956, 497782, 490639, 484850, 480670, 477679, 475529, 473806, 471651, 468232, 463602, 458737, 454721, 452105, 450886, 450712, 450992, 451139, 450909, 450554, 450531, 451056, 451928]
51400D51928R31J042J506K185K837L683N153P098Q787R865J0792J2050J3541J5067
51386E46465J6934J9482K2481K5542K8847L2845L7515M2507M7792N3507N9248
51375I33165O4270O8255P1227P2662P1519O7285O0436N1467M0082K5899R531p421
51363A528377k3456l7870n0500o1100o9112p4062p6060p5717p3539o9629o4221
51352H53111n8150n2298m6695m0752l4434k8665k4317k1275j8837j6637j4830
51341D96221j3579j2709j1868j0818r661q785q426q229p512o099m609l681l229
51328C87016k765k188j809j709j582j290j133j339j598j394p21q9J44J43K30L90
51312C70306M71O50J286K278K933K795K236J950K022J962J559J207J267J536J556
$$ y = [451928, 452859, 453901, 455407, 457592, 460429, 464112, 469265, 476363, 485150, 495015, 505807, 517857, 531398, 546465, 563399, 582881, 605362, 630904, 659751, 692596, 730111, 772618, 820410, 873917, 933165, 997435, 1065690, 1136917, 1209579, 1281098, 1348383, 1408819, 1460286, 1500368, 1526267, 1535798, 1528377, 1504921, 1467051, 1416551, 1355451, 1286339, 1212277, 1136217, 1060500, 986961, 917332, 853111, 794961, 742663, 695968, 655216, 620782, 592117, 567800, 546525, 527688, 511051, 496221, 482642, 469933, 458065, 447247, 437586, 428801, 420375, 412146, 404634, 398535, 393926, 390245, 387016, 384251, 382063, 380254, 378545, 376963, 375673, 374540, 373201, 371603, 370209, 369488, 369399, 369543, 369686, 369916, 370306, 370777, 371427, 372713, 374991, 377924, 380719, 382955, 384905, 386927, 388889, 390448, 391655, 392922, 394458, 396014]
51297C96014J175N32k75j203k046k501k468k170j963k042k303k447k301k009j812
51282C72181j687j383q57l97k65m13o64q43o61J84J474K393K338J654J156J090
51266C75300J003N77R3LM05J105J923K728L348L623L474K967K395K174K433K765
51250D06316K698K283J849J290K03j246k237k420k523l399m867n929n941n071
51236C81006l883k910k457k383k215j832j703k022k045j040M32J109Q05N75J001
51221C62438J390J115O70P60J139J235J227J605K132K180J814J568J476J255J309
51206C83313K326L837M370L444K375K487L402L834L412K803K464K215J914J789
51192D23985K004K406K802L022K762J868P58J48K30M88M40R3l57r04j547k061
$$ y = [396014, 397189, 397721, 397446, 396243, 394197, 391696, 389228, 387058, 385095, 383053, 380750, 378303, 376002, 373993, 372181, 370494, 369111, 368254, 367857, 367592, 367179, 366515, 365672, 365011, 365195, 366669, 369062, 371400, 373054, 374210, 375300, 376303, 376880, 376973, 376976, 377381, 378486, 380409, 383137, 386485, 390108, 393582, 396549, 398944, 401118, 403551, 406316, 409014, 411297, 413146, 414436, 414639, 413393, 411156, 408736, 406213, 402814, 397947, 392018, 386077, 381006, 377123, 374213, 371756, 369373, 367158, 365326, 363623, 361601, 359556, 358516, 358948, 360057, 360862, 361437, 362438, 363828, 364943, 365613, 366373, 367512, 368747, 369974, 371579, 373711, 375891, 377705, 379273, 380749, 382004, 383313, 385639, 389476, 393846, 397290, 399665, 402152, 405554, 409388, 412800, 415603, 418067, 420282, 422196, 423985, 425989, 428395, 431197, 434219, 436981, 438849, 439607, 439755, 439985, 440473, 440913, 441006, 440649, 439745, 438198, 436137]
51176D36137k273k390k775l496m249m634m391l558k574k057k252k757l005k859
51162C92867k508j959j038R2R26J324J762K536L142K933K164J747J941J941J038
51147D08908m29j611k242k650k997l072k782k383k150k180k408k567k208j227
51133C78002k38O7j50r6M80R90J043J021J312J576J405J222J844L321M835N662
51117D02296N732N334M748M289M213M369M198L240J618oq76o94J41Q98J252J434
51101D42186J601J442Q09K72M95J211J537J184P17M52q9j317k759l640l832l753
51085D36516l611l333l065l119l366l194k268j005j04K21K86M32O98J021J414
51070D17523J848K097J987J714J738K269L033L636L996M353M941N821O887P828
$$ y = [436137, 433864, 431474, 428699, 425203, 420954, 416320, 411929, 408371, 405797, 403740, 401488, 398731, 395726, 392867, 390359, 388400, 387362, 387454, 388380, 389704, 391466, 394002, 397144, 400077, 402241, 403988, 405929, 407870, 408908, 408479, 406868, 404626, 401976, 398979, 395907, 393125, 390742, 388592, 386412, 384004, 381437, 379229, 378002, 377764, 377831, 377681, 377585, 378065, 379055, 380098, 381119, 382431, 384007, 385412, 386634, 388478, 391799, 396634, 402296, 408028, 413362, 418110, 422399, 426612, 430981, 435179, 438419, 440037, 440031, 439155, 438461, 438602, 439500, 440752, 442186, 443787, 445229, 446038, 446310, 446805, 448016, 449553, 450737, 451454, 451906, 451817, 450500, 447741, 444101, 440269, 436516, 432905, 429572, 426507, 423388, 420022, 416828, 414560, 413555, 413451, 413672, 413958, 414390, 415088, 416109, 417523, 419371, 421468, 423455, 425169, 426907, 429176, 432209, 435845, 439841, 444194, 449135, 454956, 461843, 469671]
51056D69671Q281Q234Q126Q327Q576Q236P068N471L946K711J878J721K535M325
51042E49106O634Q585R258Q475P160O513O753P056O878O693P120P814P875P038
51028F52958N871M721L073J68l929q100j0955j1879j1470j0820j0431r957r064
51015E80186q039p194o162m413k277p67k64p0N44J433K085K473K868L156K935
51000E66494K233J577J295J139Q04M06K55K67k0q33j789k252k046j571j162n55
50984E64242P15K535M292N767P461R699J1892J3204J3695J4226J5194J5984J5808
50971F94714J4556J2574J0064P105L972J029j532l604n060n997o831p795q555
50958G04640q751q575q300p474n389k346M50K482M611P688J1180J3902J5673J7425
$$ y = [469671, 477952, 486186, 494312, 502639, 511215, 519451, 526519, 531990, 535936, 538647, 540525, 542246, 544781, 549106, 555740, 564325, 573583, 582058, 589218, 595731, 602484, 609540, 616418, 623111, 630231, 638045, 645920, 652958, 658829, 663550, 666623, 666791, 662862, 654762, 643807, 631928, 620458, 609638, 599207, 589250, 580186, 572147, 564953, 558791, 554378, 552101, 551334, 551070, 551000, 551544, 552977, 555062, 557535, 560403, 563559, 566494, 568727, 570304, 571599, 572738, 573542, 573948, 574203, 574470, 574450, 573617, 571828, 569576, 567530, 565959, 564797, 564242, 564957, 567492, 571784, 577551, 585012, 594711, 606603, 619807, 633502, 647728, 662922, 678906, 694714, 709270, 721844, 731908, 739013, 742985, 744014, 742482, 738878, 733818, 727821, 720990, 713195, 704640, 695889, 687314, 679014, 671540, 666151, 663805, 664255, 666737, 671348, 679036, 690216, 704118, 719791, 737216]
50944G37216J9950K3254K7053L1054L4656L7133L8397L9099L9627L9444L7690
50933A104573L4063K8786K2259J5154Q511L108j225n225r130j2463j4860j6735
50921A156816j8865k1574k4499k7048k8858k9853l0030k9363k7971k6305k4895
50910H67555k3845k2724k1170j9445j8166j7518j7021j6062j4513j2718j1058
50899F73315r683q542p535o592n710m966m448m184m064l888l602l347l225l049
50885F00480k592k050j867j998j765p32O00J394J572J718K026J994J331N14J64
50870F00789K85M95P03J096J638K035K085J853J558J554K194L334M216M245L859
50855F31939M074N196O422O869O492N848N371N271N678O508P350P966Q698J0022
$$ y = [737216, 757166, 780420, 807473, 838527, 873183, 910316, 948713, 987812, 1027439, 1066883, 1104573, 1138636, 1167422, 1189681, 1204835, 1213346, 1216454, 1215229, 1210004, 1200874, 1188411, 1173551, 1156816, 1137951, 1116377, 1091878, 1064830, 1035972, 1006119, 976089, 946726, 918755, 892450, 867555, 843710, 820986, 799816, 780371, 762205, 744687, 727666, 711604, 697091, 684373, 673315, 663632, 655090, 647555, 640963, 635253, 630287, 625839, 621655, 617591, 613703, 610101, 606754, 603529, 600480, 597888, 595838, 593971, 591973, 590208, 589476, 590076, 591470, 593042, 594760, 596786, 598780, 600111, 600625, 600789, 601074, 601569, 602272, 603368, 605006, 607041, 609126, 610979, 612537, 614091, 616285, 619619, 623835, 628080, 631939, 636013, 641209, 647631, 654500, 660992, 666840, 672211, 677482, 683160, 689668, 697018, 704984, 713682, 723704]
50841G23704J1784J3355J4523J5805J7730K0197K2701K4943K6963K8915L0974
50830I51594L3349L6102L9019M1828M4620M7779N1438N5090N7921N9532O0212
50819A478484O0440O0231N9191N7123N4287N0804M6096L9310L0272J9754Q790
50808A964782j918j1927k0880k8768l5952m2549m7920n1192n2154n1370m9556
50797A570596m7244m4849m2594m0177l7063l3264k9454k6188k3287k0259j6945
50786A209272j3511j0164p210n100l889k905j387M91J732J653N82p01j804k890
50772A164169m233n855p464q797j0047j1795j4301j6965j8910k0018k0867k1720
50760A003197k2159k1914k1365k0849k0041j8571j6776j5231j3845j2163j0317
$$ y = [723704, 735488, 748843, 763366, 779171, 796901, 817098, 839799, 864742, 891705, 920620, 951594, 984943, 1021045, 1060064, 1101892, 1146512, 1194291, 1245729, 1300819, 1358740, 1418272, 1478484, 1538924, 1599155, 1658346, 1715469, 1769756, 1820560, 1866656, 1905966, 1936238, 1955992, 1964782, 1962864, 1950937, 1930057, 1901289, 1865337, 1822788, 1774868, 1723676, 1671522, 1620152, 1570596, 1523352, 1478503, 1435909, 1395732, 1358669, 1325405, 1295951, 1269763, 1246476, 1226217, 1209272, 1195761, 1185597, 1178387, 1173287, 1169398, 1166493, 1165106, 1165597, 1167329, 1168982, 1169564, 1168863, 1167059, 1164169, 1159936, 1154081, 1146617, 1137820, 1127773, 1115978, 1101677, 1084712, 1065802, 1045784, 1024917, 1003197, 981038, 959124, 937759, 916910, 896869, 878298, 861522, 846291, 832446, 820283, 809966]
50749H09966q936q082p071n457l564j841j86J708L826N915P757R202J0203J1015
50735H24455J1987J3055J3891J4528J5332J6130J6147J5117J3773J2727J1646
50724I78788J0204R089R039R407Q935P749P318Q292R649J0325J0636J1434J2753
50711A103618J4111J5496J7231J9183K0917K2390K3919K5546K6958K7979K8695
50700A346043K9213K9646L0174L0711L0640K9290K6673K3395J9888J6102J1917
50689A623692P565L560M33j599k805l720m560n094n260n575o628q414j0476j2430
50675A568689j3868j4147j2853j0355p380m147n00L410P185J0787J4301J7179
50663A558301J8617J8737J8535J8472J8006J6826J5576J4837J4276J3447J2669
$$ y = [809966, 801030, 792948, 785877, 780420, 776856, 775015, 774829, 776537, 780363, 786278, 794035, 803237, 813440, 824455, 836442, 849497, 863388, 877916, 893248, 909378, 925525, 940642, 954415, 967142, 978788, 988992, 998081, 1007120, 1016527, 1025462, 1033211, 1040529, 1048821, 1058470, 1068795, 1079431, 1090865, 1103618, 1117729, 1133225, 1150456, 1169639, 1190556, 1212946, 1236865, 1262411, 1289369, 1317348, 1346043, 1375256, 1404902, 1435076, 1465787, 1496427, 1525717, 1552390, 1575785, 1595673, 1611775, 1623692, 1631257, 1634817, 1635250, 1633651, 1630846, 1627126, 1622566, 1617472, 1612212, 1606637, 1600009, 1591595, 1581119, 1568689, 1554821, 1540674, 1527821, 1517466, 1510086, 1505939, 1505439, 1508849, 1516034, 1526821, 1541122, 1558301, 1576918, 1595655, 1614190, 1632662, 1650668, 1667494, 1683070, 1697907, 1712183, 1725630, 1738299]
50652A738299J2326J1983J1086J0066R831J0428J1124J1652J2560J4324J6869
50641A870548J9925K3205K6303K9039L1753L4623L6927L7787L7473L6951L6214
50630B220748L4269L0957K7503K4739K2052J8799J5727J3855J2849J1610R803
50619B442911P501L699l174j3102k3876l2878l8594m0362l8011l2376k5336j8562
50607B187840j2681p997n298n227p483j1322j6538k3164l0572l7727m4226n0356
50595A935249n6050o0394o2451o2161o0268n7709n5161n2774n0177m6866m2743
50584A328495l8085l3167k8206k3601j9683j6109j2046p267k627R75L769O750
50572A159198J0300J3714J6177J7748J9087K0524K1676K1943K1057J9176J6654
$$ y = [1738299, 1750625, 1762608, 1773694, 1783760, 1793591, 1804019, 1815143, 1826795, 1839355, 1853679, 1870548, 1890473, 1913678, 1939981, 1969020, 2000773, 2035396, 2072323, 2110110, 2147583, 2184534, 2220748, 2255017, 2285974, 2313477, 2338216, 2360268, 2379067, 2394794, 2408649, 2421498, 2433108, 2442911, 2450412, 2454111, 2450937, 2437835, 2413959, 2381081, 2342487, 2302125, 2264114, 2231738, 2206402, 2187840, 2175159, 2167162, 2161864, 2156637, 2149154, 2137832, 2121294, 2098130, 2067558, 2029831, 1985605, 1935249, 1879199, 1818805, 1756354, 1694193, 1633925, 1576216, 1521055, 1468281, 1418104, 1371238, 1328495, 1290410, 1257243, 1229037, 1205436, 1185753, 1169644, 1157598, 1150331, 1147704, 1148679, 1152448, 1159198, 1169498, 1183212, 1199389, 1217137, 1236224, 1256748, 1278424, 1300367, 1321424, 1340600, 1357254]
50561A357254J3878J1173Q678O419M599L726M240O097Q929J2497J6616K0739K4215
50548A499060K7047K9839L2653L4597L5041L4653L4402L4007L2473L0083K8774
50537A852629L0074L3522L7563M1341M5108M9366N4262N9568O4886O9963P4993
50526B413275Q0349Q5934R1327R6581J02036J07090J10136J10367J08743J06238
50516C412076J01924R4018Q2361O8415N2974L5432J5631m931k4450m2369n8872
50505C732209p3610q5752r4727j00219j01772r9195r3065q4266p3146n9670m4242
50494B822545k7955j2009K672J5361K5436L2348L5392L3709K6879J5508Q77j5925
50482B954838l4216n3102p1081q6484r8268j06221j10638j11916j10504j07066
$$ y = [1357254, 1371132, 1382305, 1390983, 1397402, 1402001, 1405727, 1409967, 1416064, 1424993, 1437490, 1454106, 1474845, 1499060, 1526107, 1555946, 1588599, 1623196, 1658237, 1692890, 1727292, 1761299, 1793772, 1823855, 1852629, 1882703, 1916225, 1953788, 1995129, 2040237, 2089603, 2143865, 2203433, 2268319, 2338282, 2413275, 2493624, 2579558, 2670885, 2767466, 2869502, 2976592, 3086728, 3197095, 3305838, 3412076, 3514000, 3608018, 3690379, 3758794, 3811768, 3847200, 3862831, 3857900, 3833450, 3791081, 3732209, 3658599, 3572847, 3478120, 3377901, 3276129, 3176934, 3083869, 2999603, 2926457, 2866787, 2822545, 2794590, 2782581, 2785253, 2800614, 2826050, 2858398, 2893790, 2927499, 2954378, 2969886, 2970763, 2954838, 2920622, 2867520, 2796439, 2709955, 2611687, 2505466, 2394828, 2282912, 2172408, 2065342]
50472B065342j02358r6753r0101q2366p4276o6890o0516n4609m8805m3496l9032
50461A306140l5028l0999k7280k4558k2769k1140j9276j7424j5624j3274r998
50450A068770o414l589j907q45K25J404K479L500M871O739Q600R709R933R873
50436A113348J0084J0550J1029J1483J1796J1542J0590R607R356R643R693R558
50424A238279J0275J2379J4981J6818J7671J8322J9550K1675K4755K8538L2378
50413A455621L5724L8743M2086M6037N0320N4597N8664O2078O4159O4596O3750
50402B036375O2149N9948N7080N3591M9463M4267L7376K8599J8343P175m616j6948
50390B432802k9547m1617n1972n9597o4273o6541o6879o5131o0957n4708m7385
$$ y = [2065342, 1962984, 1866231, 1776130, 1693764, 1619488, 1552598, 1492082, 1437473, 1388668, 1345172, 1306140, 1271112, 1240113, 1212833, 1188275, 1165506, 1144366, 1125090, 1107666, 1092042, 1078768, 1068770, 1062356, 1058767, 1056860, 1056015, 1056240, 1057644, 1060123, 1063623, 1068494, 1075233, 1083833, 1093542, 1103475, 1113348, 1123432, 1133982, 1145011, 1156494, 1168290, 1179832, 1190422, 1200029, 1209385, 1219028, 1228721, 1238279, 1248554, 1260933, 1275914, 1292732, 1310403, 1328725, 1348275, 1369950, 1394705, 1423243, 1455621, 1491345, 1530088, 1572174, 1618211, 1668531, 1723128, 1781792, 1843870, 1908029, 1972625, 2036375, 2098524, 2158472, 2215552, 2269143, 2318606, 2362873, 2400249, 2428848, 2447191, 2454366, 2449750, 2432802, 2403255, 2361638, 2309666, 2250069, 2185796, 2119255, 2052376, 1987245, 1926288, 1871580, 1824195]
50379A824195l9719l1779k3642j5938r380m115L3K888M048L481J408k350q213
50366A700917j5859k4010l1543l8281m4330m9120n1831n2586n2406n1964n0907
50355A238080m8608m5109m1017l6882l3034k9756k7151k4918k2581k0022j7499
50344H91503j5131j2709j0162p896o410n668n191m686m291m126l984l694l512
50331H04043l749m141m030l244k433k319k823l089k358o85J129K303K808L352
50317G84764M479N834O564O403N947N801N897N882N736N651N572N389N334N745
50303H64998O453O944P182P755Q989J0280J0654R895Q869Q674R580J0758J1102
50290I82133J0336R252Q800R182R980J0942J2139J3457J4455J4808J4308J2101
$$ y = [1824195, 1784476, 1752697, 1729055, 1713117, 1703737, 1699622, 1699655, 1702543, 1706591, 1710072, 1711480, 1709130, 1700917, 1685058, 1661048, 1629505, 1591224, 1546894, 1497774, 1445943, 1393357, 1340951, 1288987, 1238080, 1189472, 1144363, 1103346, 1066464, 1033430, 1003674, 976523, 951605, 929024, 909002, 891503, 876372, 863663, 853501, 845605, 839195, 833527, 828336, 823650, 819359, 815233, 811249, 807555, 804043, 800294, 796153, 792123, 788879, 786446, 784127, 781304, 778215, 775857, 775172, 776301, 778604, 781412, 784764, 789243, 795077, 801641, 808044, 813991, 819792, 825689, 831571, 837307, 842958, 848530, 853919, 859253, 864998, 871451, 878395, 885577, 893332, 902321, 912601, 923255, 933150, 942019, 950693, 960273, 971031, 982133, 992469, 1001721, 1010521, 1019703, 1029683, 1040625, 1052764, 1066221, 1080676, 1095484, 1109792, 1121893]
50278A121893O594k972j4802k5002l0244k9958k6080k1107j6554j2721r218n625
50266I34204j977J222L614N578P842J0398J2224J2348J0974R177P606N982L834
50253A023026J300r70k476l248l680m113m460m360l814l477l914m690m779l919
50239I76426k967k666k718k490k108k167k724l280l605l948m427m795m952n166
50225I28413n653o253o673o764o514o033n558n204m772m085l391l035k775k037
50211H59666r16l63j019k294l062k951k615k812l560m240m347m011l763l802l765
50196H16146l353k918l013l494l707l531l566m052m303l606k236r94j04Q22K021
50181G80112L396M998P034R289J1187J2561J3921J5620J7212J8061J8241J8353
$$ y = [1121893, 1128487, 1125515, 1110713, 1085711, 1055467, 1025509, 999429, 978322, 961768, 949047, 939829, 934204, 932227, 933449, 937063, 942641, 950483, 960881, 973105, 985453, 996427, 1005604, 1013210, 1019192, 1023026, 1024326, 1023356, 1020880, 1017632, 1013952, 1009839, 1005379, 1001019, 997205, 993728, 989814, 985124, 980345, 976426, 973459, 970793, 968075, 965585, 963477, 961310, 958586, 955306, 951701, 947753, 943326, 938531, 933579, 928413, 922760, 916507, 909834, 903070, 896556, 890523, 884965, 879761, 874989, 870904, 867513, 864478, 861703, 859666, 858750, 858387, 857368, 855074, 852012, 849061, 846446, 843634, 840074, 835834, 831487, 827476, 823713, 819911, 816146, 812793, 809875, 806862, 803368, 799661, 796130, 792564, 788512, 784209, 780603, 778367, 777373, 777269, 778091, 780112, 783508, 788506, 795540, 804829, 816016, 828577, 842498, 858118, 875330, 893391, 911632, 929985]
50169I29985J8555J8317J7272J5806J4472J3255J1806J0315R473R417R241P900
50157A085814N270K005j397m821q001j0407j1800j2457j2676j2433j1755j1015
50145I96327j0510j0022r189q139p372p033o745o188n599n517o240p694r627j1628
50131H84824j3030j3238j2310j1021r983q912p136m795l008k622l259l890l949
50118G87671l559k984k461k297k543k672k175j381j070j319j419r76l97PN53J472
50102G64450K290K480K250K142K220K210K128K153K077J554Q22O45J412K661L618
50087G95112L979M073M450N282O113O311N841N286M965M461L344K047J371J384
50073H54019J435J261J466K701M830P146R123J0670J1947J3207J4750J6792J9293
$$ y = [929985, 948540, 966857, 984129, 999935, 1014407, 1027662, 1039468, 1049783, 1059256, 1068673, 1077914, 1085814, 1091084, 1093089, 1091692, 1086871, 1078870, 1068463, 1056663, 1044206, 1031530, 1019097, 1007342, 996327, 985817, 975795, 966606, 958467, 951095, 944062, 937317, 931129, 925530, 920013, 913773, 906079, 896452, 884824, 871794, 858556, 846246, 835225, 825242, 816330, 809194, 804399, 801391, 798769, 795510, 791620, 787671, 784112, 781128, 778667, 776370, 773827, 771155, 768980, 767599, 766529, 765210, 763791, 762815, 762418, 762425, 762978, 764450, 766740, 769220, 771470, 773612, 775832, 778042, 780170, 782323, 784400, 785954, 786776, 787421, 788833, 791494, 795112, 799091, 803164, 807614, 812896, 819009, 825320, 831161, 836447, 841412, 845873, 849217, 851264, 852635, 854019, 855454, 856715, 858181, 860882, 865712, 872858, 881981, 892651, 904598, 917805, 932555, 949347, 968640]
50060I68640K1916K4194K5803K6788K7509K8295K9086K9481K9031K7599K5651
50049A263993K4178K3955K4656K5016K4144K2414K0702J8992J6283J1806N922
50038A482061k83n912j0628j4523j7824k0651k2889k4334k4890k4611k3678k2441
50026A269397k1243k0013j8214j5603j2853j0970j0118r492q415p069n987n251
50014A124169m703m607n560p618r921j1436j1946j2023j2087j1859j0866r260
50002A012283p715o585n584m339k925j647n92L36J128J593J429L20j707l907n285
49987I76803n759o526q785j2327j5804j8152j9246j9438j9052j8336j7386j6016
49975G99976j4041j1719r586p887o497n269m099k717r45Q56K072K580K893L529
$$ y = [968640, 990556, 1014750, 1040553, 1067341, 1094850, 1123145, 1152231, 1181712, 1210743, 1238342, 1263993, 1288171, 1312126, 1336782, 1361798, 1385942, 1408356, 1429058, 1448050, 1464333, 1476139, 1482061, 1481778, 1475866, 1465238, 1450715, 1432891, 1412240, 1389351, 1365017, 1340127, 1315516, 1291838, 1269397, 1248154, 1228141, 1209927, 1194324, 1181471, 1170501, 1160383, 1150891, 1142476, 1135407, 1129420, 1124169, 1119466, 1114859, 1109299, 1101681, 1091760, 1080324, 1068378, 1056355, 1044268, 1032409, 1021543, 1012283, 1004568, 997983, 992399, 988060, 985135, 983488, 982896, 983232, 984360, 985953, 987382, 987702, 985995, 982088, 976803, 971044, 964518, 955733, 943406, 927602, 909450, 890204, 870766, 851714, 833378, 815992, 799976, 785935, 774216, 764630, 756743, 750246, 744977, 740878, 738161, 737216, 738072, 740144, 742724, 745617, 749146]
49961G49146M630O193Q142J0221J2155J4004J5950J7763J9043J9893K0782K1703
49949I19625K2104K1759K1008J9934J8020J5055J1767R051P016N239L604K273
49937A076455J143j81j919l944n945p557q543r027r357r534r115p871o147m374
49923I94084k620j032k81j035l168n868q373j0312j1649j2668j3733j4670j4689
49910H93986j3362j1329r473p719n359k338N68K919N155P712J0155J1652J1925
49897H94492J1406J0612R689Q470O765M590K123n54l559o938j0466j3916j7301
49884H95413k0521k2906k3660k2799k1236j9736j8253j6494j4708j3461j2808
49873F88831j2170j1079r664q264o878n234l332j512J8J464L004M373N259N942
$$ y = [749146, 753776, 759969, 768111, 778332, 790487, 804491, 820441, 838204, 857247, 877140, 897922, 919625, 941729, 963488, 984496, 1004430, 1022450, 1037505, 1049272, 1058323, 1065339, 1070578, 1074182, 1076455, 1077598, 1077417, 1075498, 1071554, 1065609, 1058052, 1049509, 1040482, 1031125, 1021591, 1012476, 1004605, 998458, 994084, 991464, 990432, 990151, 989116, 985948, 980080, 971707, 961395, 949746, 937078, 923345, 908675, 893986, 880624, 869295, 859822, 852103, 846744, 844406, 844974, 847893, 853048, 860760, 870915, 882567, 894492, 905898, 916510, 926199, 934669, 941434, 946024, 948147, 947593, 944034, 937096, 926630, 912714, 895413, 874892, 851986, 828326, 805527, 784291, 764555, 746302, 729808, 715100, 701639, 688831, 676661, 665582, 655918, 647654, 640776, 635542, 632210, 630698, 630716, 632180, 635184, 639557, 644816, 650758]
49859F50758P097Q932J0966J2732J4233J5532J6420J6794J6925J6912J6239J4373
49847H17913J1540Q500N730L326J333l16k069m327o895r328j1675j4099j5958
49834G83675j6135j4515j2355j0792r740q594p401o609o059m987k966m14J940
49821F85048L787N415P288R427J1259J2284J2808J3592J4634J4911J3609J1242
49809H15304Q959P197N500L532J586L4j283k872n025p480r610j0935j1536j1801
49795G81570j1826j1344j0396r627r570j0003j0385j0524j0340r358p277m795
49783F66125l022k031q70Q31K220K623K712L528M950O012O466P153Q730J0767
49769G16194J2306J2875J2752J2472J2264J1718J0057P003L438Q26j94m30j236
$$ y = [650758, 657855, 666787, 677753, 690485, 704718, 720250, 736670, 753464, 770389, 787301, 803540, 817913, 829453, 837953, 843683, 847009, 848342, 848026, 845957, 841630, 834735, 825407, 813732, 799633, 783675, 767540, 753025, 740670, 729878, 720138, 711544, 704143, 697534, 691475, 686488, 683522, 683108, 685048, 688835, 694250, 701538, 710965, 722224, 734508, 747316, 760908, 775542, 790453, 804062, 815304, 824263, 831460, 836960, 840492, 842078, 842112, 840829, 837957, 832932, 825452, 815842, 804907, 793371, 781570, 769744, 758400, 748004, 738377, 728807, 718804, 708419, 697895, 687555, 678197, 670920, 666125, 663103, 661072, 660202, 661033, 663253, 665876, 668588, 672116, 677066, 683078, 689544, 696697, 705427, 716194, 728500, 741375, 754127, 766599, 778863, 790581, 800638, 807641, 811079, 811905, 811711, 811281, 810045]
$$ [...]
##END NTUPLES=NMR SPECTRUM
##END=
