##TITLE=AC1669_DOMRH14360_8570773_FWEQ2OPx1Q
##JCAMPDX= 6.0         $$ Bruker NMR JCAMP-DX V2.0
##DATA TYPE= NMR SPECTRUM
##DATA CLASS= NTUPLES
##ORIGIN= BRUKER
##OWNER= Administrator
$$ 1.72 TOPSPIN		Version 2.1
$$ 2015-08-08 04:57:41.344 -0700  Administrator@X
$$ Compression mode = diff/dup
##.OBSERVE FREQUENCY= 400.02188249412
##.OBSERVE NUCLEUS= ^1H
##.ACQUISITION MODE= SIMULTANEOUS (DQD)
##.ACQUISITION SCHEME= undefined
##.AVERAGES= 8
##.DIGITISER RES= 22
##SPECTROMETER/DATA SYSTEM= spect
##.PULSE SEQUENCE= zg30
##.SOLVENT NAME= COFFEE_meoh
##.SHIFT REFERENCE= INTERNAL, COFFEE_meoh, 1, 14.98509
##AUDIT TRAIL= $$ (NUMBER, WHEN, WHO, WHERE, PROCESS, VERSION, WHAT)
$$ ##TITLE= Audit trail, TOPSPIN		Version 2.1
$$ ##JCAMPDX= 5.01
$$ ##ORIGIN= Bruker BioSpin GmbH
$$ ##OWNER= Administrator
$$ $$ E:\/data/COFFEE/nmr/AC1669_DOMRH14360_8570773_FWEQ2OPx1Q/20/pdata/1/auditp.txt
$$ ##AUDIT TRAIL=  $$ (NUMBER, WHEN, WHO, WHERE, PROCESS, VERSION, WHAT)
(   1,<2015-08-08 04:57:34.031 -0700>,<Administrator>,<X>,<go>,<TOPSPIN 2.1>,
      <created by zg
	started at 2015-08-08 04:56:25.141 -0700,
	POWCHK enabled, PULCHK disabled,
       configuration hash MD5:
       21 0F 79 D6 B3 7B B4 F6 88 20 88 DB 03 48 BD 9F
       data hash MD5: 64K
       12 3F F6 7B B1 EC AF 2F 5F 6F D8 3C 83 66 7F 5F>)
(   2,<2015-08-08 04:57:37.203 -0700>,<Administrator>,<X>,<proc1d>,<TOPSPIN 2.1>,
      <Start of raw data processing
       efp LB = 0 FT_mod = 6 PKNL = 1 PHC0 = 0 PHC1 = 0 SI = 32K 
       data hash MD5: 32K
       80 BE 0D E3 05 C8 2C E3 53 CD 07 D1 A4 34 2B 62>)
(   3,<2015-08-08 04:57:37.516 -0700>,<Administrator>,<X>,<proc1d>,<TOPSPIN 2.1>,
      <pk PHC0 = 93.14758 PHC1 = 0 
       data hash MD5: 32K
       02 E8 96 8D 29 4E 08 E7 FD DC 16 E0 3E 24 6B F8>)
(   4,<2015-08-08 04:57:37.625 -0700>,<Administrator>,<X>,<proc1d>,<TOPSPIN 2.1>,
      <abs ABSG = 1 
       data hash MD5: 32K
       47 0B D6 1A 30 A0 D0 B2 E8 AD 59 29 CC E2 C2 22>)
(   5,<2015-08-08 04:57:37.703 -0700>,<Administrator>,<X>,<proc1d>,<TOPSPIN 2.1>,
      <abs ABSG = 2 
       data hash MD5: 32K
       9A 7C D1 84 B2 50 F2 4E 55 42 21 D1 D5 AC 75 35>)
(   6,<2015-08-08 04:57:37.750 -0700>,<Administrator>,<X>,<proc1d>,<TOPSPIN 2.1>,
      <abs ABSG = 3 
       data hash MD5: 32K
       39 C1 AB 32 1E 65 B9 20 EA 24 D7 A7 ED 1C 58 68>)
(   7,<2015-08-08 04:57:37.828 -0700>,<Administrator>,<X>,<proc1d>,<TOPSPIN 2.1>,
      <abs ABSG = 4 
       data hash MD5: 32K
       0F 38 1E 00 F7 E9 42 04 1E C9 7D C3 EC 68 C9 AD>)
(   8,<2015-08-08 04:57:37.875 -0700>,<Administrator>,<X>,<proc1d>,<TOPSPIN 2.1>,
      <abs ABSG = 5 
       data hash MD5: 32K
       76 EC 8E 56 8D E6 54 44 2C A2 1D 6D A0 AB 91 D4>)
$$ ##END=
$$ 
$$ $$ hash MD5
$$ $$ 4B 15 DA 2F CE 8E 0A 3E 68 15 EA 4B 80 39 B2 FE
##$RELAX= 
##$RELAX= 
##$RELAX= 
##$RELAX= 
##$RELAX= 
##$RELAX= 
##$RELAX= 
$$ Bruker specific parameters
$$ --------------------------
##$DU= <E:\>
##$EXPNO= 20
##$NAME= <AC1669_DOMRH14360_8570773_FWEQ2OPx1Q>
$$ [...]
150 150 150 150 150 150 150 150
##$TP07= 0
##$TPNAME0= <>
##$TPNAME1= <>
##$TPNAME2= <>
##$TPNAME3= <>
##$TPNAME4= <>
##$TPNAME5= <>
##$TPNAME6= <>
##$TPNAME7= <>
##$TPOAL= (0..7)
0.5 0.5 0.5 0.5 0.5 0.5 0.5 0.5
##$TPOFFS= (0..7)
0 0 0 0 0 0 0 0
##$TUNHIN= 0
##$TUNHOUT= 0
##$TUNXOUT= 0
##$USERA1= <user>
##$USERA2= <user>
##$USERA3= <user>
##$USERA4= <user>
##$USERA5= <user>
##$V9= 5
##$VALIST= <valist>
##$VCLIST= <CCCCCCCCCCCCCCC>
##$VD= 0
##$VDLIST= <DDDDDDDDDDDDDDD>
##$VPLIST= <PPPPPPPPPPPPPPP>
##$VTLIST= <TTTTTTTTTTTTTTT>
##$WBST= 2048
##$WBSW= 25
##$XGAIN= (0..3)
0 0 0 0
##$XL= 0
##$YL= 0
##$YMAX_a= 559765
##$YMIN_a= -475221
##$ZGOPTNS= <>
##$ZL1= 120
##$ZL2= 120
##$ZL3= 120
##$ZL4= 120
##$ABSF1= 14.98509
##$ABSF2= -5.573092
##$ABSG= 5
##$ABSL= 3
##$ALPHA= 0
##$AQORDER= 0
##$ASSFAC= 0
##$ASSFACI= 0
##$ASSFACX= 0
##$ASSWID= 0
##$AUNMP= <proc_prof1d_extract_pilot.lims>
##$AXLEFT= 0
##$AXNAME= <>
##$AXNUC= <1H>
##$AXRIGHT= 0
##$AXTYPE= 0
##$AXUNIT= <>
##$AZFE= 0.1
##$AZFW= 0.1
##$BCFW= 0
##$BC_mod= 0
##$BYTORDP= 0
##$COROFFS= 0
##$CY= 15
##$DATMOD= 1
##$DC= 0
##$DFILT= <>
##$DTYPP= 0
##$F1P= 0
##$F2P= 0
##$FCOR= 0.5
##$FTSIZE= 32768
##$FT_mod= 6
##$GAMMA= 0
##$GB= 0
##$INTBC= 1
##$INTSCL= 1
##$ISEN= 128
##$LB= 0
##$LEV0= 0
##$LPBIN= 0
##$MAXI= 10000
##$MC2= 0
##$MEAN= 0
##$ME_mod= 0
##$MI= 0
##$NCOEF= 0
##$NC_proc= -8
##$NLEV= 6
##$NOISF1= 0
##$NOISF2= 0
##$NSP= 0
##$NTH_PI= 0
##$NZP= 0
##$OFFSET= 14.98509
##$PC= 1
##$PHC0= 93.14758
##$PHC1= 0
##$PH_mod= 1
##$PKNL= yes
##$PPARMOD= 0
##$PPDIAG= 0
##$PPIPTYP= 0
##$PPMPNUM= 2147483647
##$PPRESOL= 1
##$PSCAL= 4
##$PSIGN= 0
##$PYNMP= <proc.py>
##$REVERSE= no
##$SF= 400.02
##$SI= 32768
##$SIGF1= 0
##$SIGF2= 0
##$SINO= 400
##$SIOLD= 32768
##$SPECTYP= <>
##$SREGLST= <1H.CDCl3>
##$SSB= 0
##$STSI= 32768
##$STSR= 0
##$SW_p= 8223.68421052631
##$SYMM= 0
##$S_DEV= 0
##$TDeff= 65536
##$TDoff= 0
##$TI= <>
##$TILT= no
##$TM1= 0
##$TM2= 0
##$TOPLEV= 0
##$USERP1= <user>
##$USERP2= <user>
##$USERP3= <user>
##$USERP4= <user>
##$USERP5= <user>
##$WDW= 1
##$XDIM= 32768
##$YMAX_p= 440626514
##$YMIN_p= -678758
##$CURPLOT= <Network HP LaserJet P1505>
##$CURPRIN= <$Network HP LaserJet P1505>
##$DFORMAT= <normdp>
##$LAYOUT= <+/1D_H.xwp>
##$LFORMAT= <normlp>
##$PFORMAT= <normpl>
##$SURQMSG= 1
$$ End of Bruker specific parameters
$$ ---------------------------------
##NTUPLES= NMR SPECTRUM
##VAR_NAME=  FREQUENCY,     SPECTRUM/REAL,   SPECTRUM/IMAG
##SYMBOL=    X,             R,               I
##VAR_TYPE=  INDEPENDENT,   DEPENDENT,       DEPENDENT
##VAR_FORM=  AFFN,          ASDF,            ASDF
##VAR_DIM=   32768,         32768,           32768
##UNITS=     HZ,            ARBITRARY UNITS, ARBITRARY UNITS
##FACTOR=    0.250966925370066, 1,           1
##FIRST=     8223.43324360094, -54131,       12320
##LAST=      0,             -78229,          -138327
##MIN=       0,             -678758,         0
##MAX=       8223.43324360094, 440626514,    0
$$ Real data points
##PAGE= N=1
##DATA TABLE= (X++(R..R)), XYDATA
$$ [...]
$$ plain form
19553 -388732 10366 61042 -55173 -15149 261396 -44644 72973 -109415 -141971 -92502 70572
19541 -349382 -18096 -286908 -123164 -46069 -1854 124478 -155683 -22755 16998 158023 11889
19529 -192427 -139085 -185953 -102799 -11543 84186 94410 81696 -221720 -48620 -280382 -63162
19517 -32005 -3060 -58745 118026 -275127 -64202 97600 -147755 -29455 -7568 -83654 -58034
19506 -58034 148012 -157495 -345133 -46164 148169 -348374 -430728 -95880 7672 -414164 -154926
19494 37726 -146340 -124296 -85677 307850 81663 -124798 -99219 -151438 55721 77848 1033
19482 264379 -45543 74153 133156 -85278 -311079 19478 -161315 283691 -131420 -68013 -341727
19471 -341727 -336272 31314 -270416 -360949 137883 96257 173651 231064 -347122 -48524 -231813
$$ packed form
19553c88732A0366N0676e5173a5149B61396d4644G2973a09415l2556M9469G0572
19541c49382a8096k68812a23164d6069a854A24478a55683b2755A6998J41025A1889
19529a92427N3342m6868Q3154a1543H4186J0224j2714b21720d8620k31762f3162
19517c2005c060n5685A18026b75127f4202I7600a47755b9455g568p6086K5620
19506e8034A48012a57495j87638d6164A48169c48374q2354i5880G672d14164a54926
19494C7726a46340K2044L8619C07850H1663a24798K5579n2219E5721K2127A033
19482B64379d5543G4153N9003h5278k25801A9478a61315B83691a31420O3407k73714
19471c41727N455C1314b70416r0533A37883m1626P7394N7413c47122d8524j83289
$$ plain form
19460 -231813 -121512 107201 47873 4848 -130473 -74447 -165144 -274808 -267446 -95090 -162394
19449 -162394 -182570 -106664 -141788 142969 -28137 -184273 -289408 -195964 -333230 -122653
19438 -11316 191908 610 135182 390515 191044 80015 68527 -115427 -31529 -37406 92654
19426 20291 115916 247196 -138171 -82706 -59414 -108779 198427 160826 4590 -64984 -14828
19414 44741 -141894 81667 53293 210389 47285 -53921 -59026 -242498 89417 183733 150981
19403 150981 -38188 30725 195868 319018 19893 -165303 -5038 171332 -338488 67200 -219145
19391 -145103 -145243 -340982 26242 -33306 -155406 28048 99234 -235635 121977 68789 233105
19380 233105 50085 -229238 -42689 -309800 -321448 71781 -261660 6271 -87768 -88030 -77243
$$ packed form
19460b31813J10301A07201D7873D848a30473N6026r0697j09664P362i5090o7304
19449a62394k0176P5906l5124A42969b8137j56136j05135R3444j37266a22653
19438a1316A91908F10J34572K55333A91044H0015j1488a15427c1529n877I2654
19426B0291R5625J31280a38171N5465K3292m9365A98427l7601D590f4984a4828
19414D4741a41894H1667k8374J57096D7285e3921n105j83472H9417R4316l2752
19403A50981c8188C0725J65143J23150A9893a65303e038A71332c38488F7200b19145
19391a45103j40j95739B6242c3306j22100B8048P1186b35635A21977n3188J64316
19380B33105E0085b29238d2689k67111j1648G1781b61660F271h7768k62J0787
$$ plain form
19369 -77243 -247696 288770 89149 -38869 -195648 -155899 -84359 97486 -26548 -228538 -66627
19357 -227002 -102512 41349 55494 -251790 103054 -150598 -66886 -42901 -97510 179826
19346 68812 262897 -193814 21766 -107064 127292 128359 -121629 50211 201178 92014 89532
19335 89532 -47801 83168 162631 62820 -75722 -157554 55964 203903 -36536 -381778 -235821
19324 -235821 -24280 -226895 -171282 -34704 -333348 -167335 -306734 96570 -216209 37811
19313 -228699 116032 30576 433479 43010 -13093 -230771 79188 -44447 26770 -141459 -669846
19302 -669846 -222966 -54941 208081 4493 -87233 6683 37102 -75914 -178526 -28270 -34053
19291 -34053 1105 -35575 234907 208926 -119208 46165 -396166 -476256 -143 146815 163038
$$ packed form
19369g7243j70453B88770H9149c8869j56779L9749P1540I7486b6548k01990f6627
19357b27002a02512D1349J4145b51790A03054a50598f6886K3985n4609A79826
19346F8812J94085a93814B1766a07064A27292J067a21629E0211J50967I2014k482
19335H9532d7801H3168P9463F2820g5722q1832E5964J47939c6536l45242J45957
19324b35821b4280k02615N5613c4704k98644J66013j39399I6570b16209C7811
19313b28699A16032C0576M02903D3010a3093k17678G9188d4447B6770a41459n28387
19302f69846b22966e4941B08081D493h7233F683L0419g5914j02612b8270n783
19291c4053A105c5575B34907k5981a19208D6165c96166q0090a43A46815J6223
$$ plain form
19280 163038 -96675 -304354 -228969 376688 -85652 -93968 -181013 177592 -334590 -5402 -65857
19269 -65857 40746 -53920 -154190 31379 -41142 -241086 49623 -73837 155099 -499104 -110924
19257 -16048 101615 -69149 51617 -103841 112366 -26262 -104485 -271794 200325 -83633 95678
19245 -224077 179807 -7963 -16538 -188696 -192729 40658 -129244 -230642 140479 -238495 22170
19233 124947 41766 -262361 -65106 -294078 -67887 -55787 148599 274084 -171374 -25068
19222 269220 157552 45610 122465 -163172 -6928 -182170 -151336 49050 146873 -251239 -51934
19210 -194418 -97642 132012 -41410 107125 -252869 -257619 -124826 -42688 -235855 -46874 99875
19198 -54737 -379966 551 434556 11101 -290953 -254175 70534 22738 -297601 -397103 -157772
$$ packed form
19280A63038i6675k07679P5385C76688h5652q316q7045A77592c34590e402o0455
19269f5857D0746e3920j00270C1379d1142j99944D9623g3837A55099d99104a10924
19257a6048A01615f9149E1617a03841A12366b6262p8223j67309B00325h3633I5678
19245b24077A79807g963q575j72158m033D0658a29244j01398A40479b38495B2170
19233A24947D1766b62361f5106k28972f7887J2100A48599J25485a71374b5068
19222B69220j11668D5610P6855a63172f928j75242L0834D9050R7823b51239e1934
19210a94418R6776A32012d1410A07125b52869m750a24826d2688j93167d6874I9875
19198e4737l25229E51M34005A1101b90953L6778G0534B2738b97601r9502a57772
$$ plain form
19186 -74507 -115811 9299 53745 -38352 176178 310055 -151292 180308 -142868 -203607 -217481
19175 -217481 173642 61012 -130059 -281275 -331457 57826 -207495 -192111 94623 94519 -84151
19163 136784 -84321 60305 104486 2769 -338167 -461509 138751 -49867 -224954 -53925 -250318
19152 -250318 -41730 -42985 -43422 139289 36319 -21972 -330261 -218793 3965 85014 -205264
19140 27694 -135200 301989 -329704 121942 -163288 -77265 138225 -129970 -119218 -95094
19130 -95094 -141565 -202507 280501 -125661 -222771 -216288 -47245 187543 -178028 -115438 -93871
19119 -93871 -342351 17744 208844 -240094 -293833 398871 8371 -30690 -66112 -272474 158401
19107 -178120 -4869 -236352 134103 -161683 -380777 -20200 118965 -190450 -174227 165629
$$ packed form
19186g4507m1304I299M4446c8352A76178J33877a51292A80308a42868o0739j3874
19175b17481A73642F1012a30059j51216n0182E7826b07495J5384I4623j04h4151
19163A36784h4321F0305M4181B769c38167j23342A38751d9867j75087e3925j96393
19152b50318d1730j255m37A39289C6319b1972l08289J11468C965Q1049b05264
19140B7694a35200C01989c29704A21942a63288g7265A38225a29970J0752K4124
19130i5094m6471o0942B80501a25661r7110O483d7245A87543a78028O2590K1567
19119i3871k48480A7744J91100b40094n3739C98871H371c0690l5422k06362A58401
19107a78120d869k31483A34103a61683k19094b0200A18965a90450J6223A65629
$$ plain form
19096 59101 17291 -40358 61621 -110923 -32225 -163297 -280414 337377 -134865 -3898 -50523
19085 -50523 -530179 163789 197674 -171075 50965 -583556 -20561 9827 302965 -300505 54546
19073 109247 -38906 65299 -133557 87309 -307561 -106230 -290595 5378 241751 -110294
19062 227821 -333033 300781 -282423 -339180 142457 -249866 98891 25026 -44146 109487
19051 -91880 247314 143141 -249076 -107424 212558 339968 135772 -9672 115586 -56657
19040 89415 -175848 16542 90113 -149644 -116869 -184981 -18099 -185121 10526 -270732 116194
19028 -111000 55534 -51780 -1035 -104334 391659 -117814 125259 -43819 -16678 -97241 150242
19016 -296263 -173544 -70646 245236 -81510 173640 -311122 -39680 -69919 2140 5761 -8543
$$ packed form
19096E9101A7291d0358F1621a10923c2225j31072j17117C37377a34865c898m6625
19085e0523m79656A63789L3885a71075E0965e83556b0561I827K93138c00505E4546
19073A09247c8906F5299a33557H7309c07561a06230j84365E378K36373a10294
19062B27821c33033C00781b82423n6757A42457b49866I8891B5026d4146A09487
19051i1880B47314j04173b49076a07424B12558J27410A35772i672A15586e6657
19040H9415a75848A6542P3571a49644L2775o8112a8099j67022A0526b70732A16194
19028a11000E5534e1780a035j03299C91659a17814A25259d3819a6678q0563A50242
19016b96263J22719g0646B45236h1510A73640c11122c9680l0239B140L621h543
$$ plain form
19004 -272876 153075 82971 164164 -119910 -300908 -224943 34894 59491 -196047 38675 -164817
18992 -137003 -71100 73940 -108426 -59576 132289 -142362 -174746 -255641 -229573 53923 -79414
18980 -68349 -176784 96862 -436485 -412729 -8526 -106784 99111 41548 -370052 -257156 -156042
18969 -156042 -3889 -246995 109259 92337 140157 -224940 -99001 84127 -82571 -279972 -49254
18957 157246 154306 -223009 -140998 -299370 88507 171249 320718 25890 -70642 67612 -248764
18945 -165021 140705 -60285 -70843 -166334 -114274 -222330 -368622 -198113 -412037 -56375
18934 173134 21473 -167960 30863 -117641 76940 172015 206 36865 63046 -241167 113632
18922 43214 86006 -112966 -180454 -72764 116284 -140772 -63202 -108138 148335 -13731 216932
$$ packed form
19004b72876A53075p0104Q1193a19910j80998P5965C4894K4597a96047C8675a64817
18992a37003O5903G3940a08426M8850A32289a42362l2384q0895K6068E3923g9414
18980f8349j08435I6862d36485K3756h526r8258I9111D1548c70052J12896J01114
18969a56042c889k43106A09259j6922M7820b24940i9001H4127h2571j97401d9254
18957A57246k940b23009Q2011j58372H8507Q2742J49469B5890g0642F7612b48764
18945a65021A40705f0285j0558r5491N2060j08056j46292J70509k13924e6375
18934A73134B1473a67960C0863a17641G6940R5075B06L6659K6181b41167A13632
18922D3214M2792a12966o7488g2764A16284a40772f3202m4936A48335a3731B16932
$$ plain form
18910 76640 363592 -114668 -376119 -44300 -303603 -81629 131329 -30930 -456251 -130022
18899 152943 325472 110786 -497254 131478 -144701 47329 189330 106473 174687 -115901
18888 29673 -195631 133608 -101498 -211891 83 -132399 -51396 22733 -361845 -121854 -72326
18877 -72326 55539 -99946 -21236 50014 -104254 -23836 226453 -12182 -210908 -46216 39837
18865 13793 -111411 -244174 248685 -96948 125654 41230 -249383 -106282 115316 -126826
18854 94314 86429 118994 -409618 57390 89066 210771 -287849 -1721 135164 61006 -361716
18842 187162 -87921 -192055 -309689 110869 -111986 -60526 78415 -174859 -70389 -8476 -36342
18831 -36342 -46825 -156878 170618 -40932 -41107 -10227 227279 42498 -139655 -204152 131449
$$ packed form
18910G6640K86952a14668k61451d4300k59303h1629A31329c0930m25321a30022
18899A52943J72529A10786d97254A31478a44701D7329J42001q2857O8214a15901
18888B9673a95631A33608a01498j10393H3a32399e1396B2733c61845a21854M9528
18877g2326E5539i9946b1236E0014a04254b3836B26453a2182j98726d6216C9837
18865A3793a11411j32763B48685i6948A25654D1230b49383a06282A15316a26826
18854I4314p885L2565d09618E7390L1676J21705b87849a721A35164F1006c61716
18842A87162h7921j04134j17634A10869a11986N1460G8415a74859g0389h476k7866
18831c6342j0483j10053A70618d0932j75a0227B27279D2498a39655o4497A31449
$$ plain form
18819 54251 33239 -269912 65647 -143097 -74451 -59852 200490 -204867 -5683 30575 -248750
18807 -91341 251864 70044 359 -356408 -129428 -119642 -119047 -12790 -222844 -52409 60314 10985
18794 96564 -182398 -169830 -214058 95331 2596 -4181 -36016 3971 -238043 -175711 142714 137519
18782 137519 -27489 146224 -205092 -114366 -463517 232652 42554 30406 389662 -56251
18771 -181503 -126760 -75586 174 -290718 134481 -86709 -112313 58408 -240022 -80324 -276251
18760 -276251 -4704 -163478 29701 -88874 207485 -184967 -90134 -86745 -91949 -141963 65576
18748 -41598 -4296 250310 214834 54559 -263526 -170463 -66004 -353090 -115522 -25705 -279298
18737 -279298 -214739 41737 -66274 -187950 38913 106475 -342784 -10965 -263665 144516 -11387
$$ packed form
18819E4251k1012b69912F5647a43097O8646J4599B00490b04867e683C0575b48750
18807i1341B51864G0044C59c56408a29428R786N95a2790k10054e2409F0314A0985
18794I6564a82398J2568m4228I5331B596d181l1835C971b38043O2332A42714n195
18782A37519b7489A46224b05092R0726l49151B32652D2554j2148L59256e6251
18771a81503N4743N1174A74b90718A34481h6709k5604E8408b40022h0324j95927
18760b76251d704j58774B9701h8874B07485a84967i0134L389n204n0014F5576
18748d1598d296B50310l5476E4559b63526R3063f6004k87086a15522b5705k53593
18737b79298O4559D1737f6274j21676C8913O7562c42784a0965k52700A44516a1387
$$ plain form
18725 -111053 -203133 -64689 -21232 -62516 27220 134365 246919 337195 -521 11779 -275144
18713 -133733 -262362 -275143 405329 11901 107314 -11115 -55159 -190019 -255873 13775 207067
18702 207067 28910 10926 72658 -47330 -85501 117769 102404 -213851 -249511 -208658 -211875
18691 -211875 125234 -230985 -26869 73296 81543 49088 -71337 196638 146821 83646 38723
18679 -257466 -20522 -61075 -473946 140703 -122491 -166710 -81938 192466 -75148 -36255 -331736
18668 -331736 10608 -111373 -1318 -142200 285078 -200888 316832 -148600 136507 160405
18658 160405 230157 -110876 -341908 -41156 5995 -208806 -175545 67224 62704 228446 -300653
18646 61918 -58254 -5027 -165007 -198641 157727 -62476 -180117 -184393 -291330 115682 -36561
$$ packed form
18725a11053r2080f4689b1232m1284B7220J07145J12554R0276e21A1779b75144
18713a33733j28629j2781D05329A1901R5413a1115m4044j34860o5854A3775J93292
18702B07067B8910A0926O1732d7330l8171A17769j5365b13851l5660M0853l217
18691b11875A25234b30985b6869G3296Q247l2455g1337A96638m9817o3175C8723
18679b57466b0522m0553m12871A40703a22491m4219h1938A92466g5148c6255k95481
18668c31736A0608a11373a318j40882B85078b00888C16832a48600A36507K3898
18658A60405O9752a10876k31032d1156E995b08806L3261F7224m520J65742c00653
18646F1918e8254e027j59980l3634A57727f2476j17641m276j06937A15682c6561
$$ plain form
18634 -37019 -261944 121665 -251728 -480878 -227805 214083 -34697 -332202 178387 137274
18624 137274 58944 52495 -25243 -78095 -214438 -224807 79342 -105431 41151 -47016 -67705
18613 -67705 -71404 175419 62544 -69762 -184539 40079 273194 -52609 -89579 -217221 -91304
18601 40909 196436 -242934 -57257 -206787 -56189 -47949 -383888 -154037 -107975 -15114 -323986
18590 -323986 -136062 -251750 23417 170760 98994 123875 145047 43522 -203221 -115300 -233396
18579 -233396 215211 251853 208003 -226227 -125550 -150582 165541 180401 -219236 39965
18568 -351371 -186578 -64637 -215101 -141959 -206149 -93190 60946 -272238 154965 -81933 -248675
18557 -248675 -71952 13947 35087 -111721 -283678 -81096 -65145 -77879 176467 -33352 -107876
$$ packed form
18634c7019k24925A21665b51728k29150b27805B14083c4697k97505A78387m1113
18624A37274E8944o449b5243n2852j36343j0369G9342a05431D1151d7016k0689
18613f7705l699A75419F2544f9762j14777D0079K33115e2609l6970j27642i1304
18601D0909J55527b42934e7257j49530e6189Q240l35939a54037M6062a5114l08872
18590c23986a36062j15688B3417J47343p1766K4881K1172D3522b03221Q7921j18096
18579b33396B15211L6642m3850b26227J00677k5032A65541J4860b19236C9965
18568c51371J64793f4637j50464P3142o4190i3190F0946b72238A54965h1933j66742
18557b48675g1952A3947K1140a11721j71957h1096J5951j2734A76467c3352p4524
$$ plain form
18546 -107876 -32894 -98109 -111006 104225 131520 120782 173008 -141895 43593 30836 -261276
18534 -229627 157626 -136414 108692 -120144 -151277 -200138 72214 -8474 327722 -296955
18523 -34733 40512 -108437 13700 -194976 -536892 -447381 -110145 -43321 232460 -23008 220988
18511 -44379 57733 -53375 -103087 -438340 -213113 -50000 159193 -174599 327065 -103444
18500 -108523 2438 -158728 -21285 20430 -193657 -264812 239615 143671 40642 -135237 105107
18488 -114074 98610 -126775 5345 -21617 -299938 -271547 -111458 191041 -158062 194842
18477 -121682 -142854 -64565 -38612 -192504 188318 -216562 176625 70822 -13814 -82403 -52804
18466 -52804 -250617 40112 -97582 227174 163031 2134 -82727 122403 -207625 -250633 -212929
$$ packed form
18546a07876c2894o5215j2897A04225K7295j0738N2226a41895D3593j2757b61276
18534b29627A57626a36414A08692a20144l1133m8861G2214h474C27722b96955
18523c4733D0512a08437A3700a94976l41916Q9511a10145d3321B32460b3008B20988
18511d4379E7733e3375m9712l35253b13113e0000A59193a74599C27065a03444
18500a08523B438a58728b1285B0430a93657p1155B39615r5944D0642a35237A05107
18488a14074I8610a26775E345b1617k78321K8391a11458A91041a58062A94842
18477a21682k1172f4565K5953j53892A88318b16562A76625G0822a3814o8589K9599
18466e2804j97813D0112i7582B27174o4143B134h2727A22403b07625m3008L7704
$$ plain form
18455 -212929 147796 99008 -95371 55744 77889 364204 87013 -224532 151481 -10532 -142883
18444 -142883 18546 147555 -76643 195591 -72271 59388 -90572 -460117 179869 -136314
18433 133929 -124023 -60057 81314 219290 1368 -174624 -187768 -73257 195149 -11149 -113488
18422 -113488 -279772 -169113 -151087 235816 133627 7901 -155732 -166500 107768 292421
18412 292421 12639 -270864 -161118 -19943 -13821 367283 -187775 -253707 116698 21927 92753
18401 92753 102540 -334151 4755 -411968 232068 173798 100245 142076 27398 -26045 -148607
18390 -148607 -265996 -201310 108038 -38589 -116792 13767 -457973 201315 73027 4311 -255435
18378 -480188 -53142 -86172 -121115 -111318 -17578 -86661 171461 113978 -276533 -91090 -139505
$$ packed form
18455b12929A47796m8788i5371E5744K2145K86315H7013b24532A51481a0532j32351
18444a42883A8546J29009g6643A95591g2271E9388i0572l69545A79869a36314
18433A33929a24023f0057H1314J37976A368a74624j3144g3257A95149a1149j02339
18422a13488j66284J10659J8026B35816j02189G901a55732j0768A07768J84653
18412B92421A2639b70864J09746a9943O122C67283a87775o5932A16698B1927P0826
18401I2753R787c34151D755d11968B32068n8270p3553M1831B7398b6045j22562
18390a48607j17389O4686A08038c8589p8203A3767d57973B01315G3027D311b55435
18378d80188e3142l3030l4943R797a7578o9083A71461n7483b76533i1090m8415
$$ plain form
18367 -139505 119997 -171273 -54665 -83954 -98797 -211407 -19092 75529 324055 -21493 -102405
18356 -102405 182977 -490668 -9383 -129957 58355 -88777 -29136 108646 -190280 -10100 -70776
18345 -70776 240718 -271282 -131104 275399 233738 327770 135114 -188895 -190321 -157676 -205944
18334 -205944 21087 75562 148225 37073 27021 116222 -165178 -166003 46199 110496 -346030
18322 -94894 -274858 24349 -59245 106475 -205912 65223 244382 41305 198260 79216 -334044
18310 83600 118489 -74248 58105 -226870 -71062 -197482 65444 258523 -231597 -2336 -269342
18299 -269342 -29840 -75397 -274009 299241 327677 -39342 90424 11761 -145963 -117443 -68339
18288 -68339 -232545 795 77989 -284944 -234946 188805 -257675 -78211 -144218 -138364 287306
$$ packed form
18367a39505A19997a71273e4665k9289j4843j12610a9092G5529K48526b1493q0912
18356a02405A82977d90668i383j20574E8355h8777b9136A08646a90280a0100o0676
18345g0776B40718b71282a31104B75399m1661R4032A35114a88895j426L2645m8268
18334b05944B1087N4475P2663C7073j0052Q9201a65178q25D6199O4297c46030
18322i4894j79964B4349e9245A06475b05912F5223J79159D1305J56955G9216c34044
18310H3600L4889g4248E8105b26870g1062j26420F5444J93079b31597b336k67006
18299b69342b9840m5557j98612B99241K8436c9342I0424A1761a45963K8520M9104
18288f8339j64206G95P7194b84944M9998A88805b57675g8211o6007N854B87306
$$ plain form
18276 28056 -196852 -201427 -30333 90300 365797 -354374 -303650 73011 -146833 93471 218300
18265 218300 117585 36429 87085 -115433 54005 37175 35068 -334111 134796 -202449 148128
18253 -59459 117428 -125776 -118180 -292394 -55565 49464 90409 120566 -141240 25211 -78505
18241 -61137 145613 -182350 -24904 -127177 -49848 72808 -205363 50709 34871 -429299 -29156
18229 -158382 6482 -247414 233988 148740 99767 58440 61296 31171 140147 -207058 -73374
18217 124139 131166 -160472 -197992 -170144 -128648 114853 -98393 -182703 99614 67780 -102037
18205 152058 -275980 102375 -80477 83459 -92714 -38625 180528 -125927 -129067 -308622 -179213
18194 -179213 -6715 310979 -26180 -287531 -68745 2439 15894 -56801 149622 64830 264213
$$ packed form
18276B8056a96852m575c0333I0300K75497c54374N0724G3011a46833I3471J24829
18265B18300j00715C6429N0656a15433E4005j6830k107c34111A34796b02449A48128
18253e9459A17428a25776P596j74214e5565D9464M0945L0157a41240B5211g8505
18241f1137A45613a82350b4904j02273d9848G2808b05363E0709j5838d29299b9156
18229a58382F482b47414B33988q5248m8973m1327K856l0125J08976b07058g3374
18217A24139P027a60472l7520K7848M1496A14853i8393q4310I9614l1834a02037
18205A52058b75980A02375h0477H3459i2714c8625A80528a25927l140j79555J29409
18194a79213f715C10979b6180k61351f8745B439J3455e6801A49622F4830J99383
$$ plain form
18183 264213 234721 10557 9573 -95462 227108 -31719 -46457 -211446 11230 -262661 75126
18171 -165442 -108928 31016 130494 -134120 69339 57289 139660 -207625 -237324 -17614 53398
18159 -30010 44010 139925 145497 85485 38835 -159062 -12341 -180557 25712 -240763 131626
18147 -16911 93060 -215667 -201114 131252 69925 -114117 -257503 -64695 11837 -236623 -79146
18135 822 -344065 -16941 5659 9543 400790 14593 -136587 119318 -141265 -64063 145506
18123 -202326 -1575 -5360 -239613 -203238 54670 -11363 127118 288065 250111 -135626 124302
18111 -60238 7163 -165920 97347 -131060 -13471 -126146 -143762 -183947 -190769 54020 -92987
18099 196771 -186502 -26936 -85088 -62314 -346286 -271244 -181610 168697 -147684 -25805 -85737
$$ packed form
18183B64213k9492A0557r84i5462B27108c1719j4738j64989A1230b62661G5126
18171a65442N6514C1016R9478a34120F9339j2050Q2371b07625k9699a7614E3398
18159c0010D4010R5915N572o0012C8835a59062a2341j68216B5712b40763A31626
18147a6911I3060b15667J4553A31252o1327a14117j43386f4695A1837b36623g9146
18135H22c44065a6941E659L884L91247A4593a36587A19318a41265f4063A45506
18123b02326a575l785k34253L6375E4670a1363A27118J60947l7954a35626A24302
18111f0238G163a65920I7347a31060a3471j12675j7616m0185o822E4020i2987
18099A96771a86502b6936n8152K2774k83972P5042Q9634A68697a47684b5805n9932
$$ plain form
18088 -85737 -65468 306969 -172740 -177979 -466091 381582 43069 -317961 -291903 -237442 219492
18076 258650 -140357 9106 -288665 -56074 29964 -58562 -312450 -179336 85153 -96746 316877
18064 -257602 -271304 -84087 -148565 273741 104562 -265019 228409 -126710 -79651 -10003
18053 -275546 -107784 27599 -462706 72408 373319 -28071 73603 41833 -173021 -304601
18043 -304601 84153 30442 -111419 -215281 27179 10922 -273574 -85995 -82178 61407 144486
18032 144486 -56787 29418 166920 -179697 -282151 28026 77463 -25524 -32906 -155877 -352633
18021 -352633 -71439 -313442 -134631 165198 -80615 -135291 -148164 36769 17611 198375 -65076
18009 166858 -172649 -124286 342889 84706 19636 136233 -189595 -5884 -67093 92648 -19068
$$ packed form
18088h5737K0269C06969a72740n239k88112C81582D3069c17961K6058N4461B19492
18076B58650a40357I106b88665e6074B9964e8562k53888J33114H5153i6746C16877
18064b57602j3702h4087o4478B73741A04562b65019B28409a26710M7059a0003
18053b75546a07784B7599d62706G2408L00911b8071G3603l1770a73021j31580
18043c04601H4153C0442a11419j03862B7179A0922b73574h5995L817F1407Q3079
18032A44486e6787B9418J37502a79697j02454B8026M9437b5524p382j22971j96756
18021c52633g1439k42003a34631A65198h0615n4676j2873C6769A7611J80764f5076
18009A66858a72649M8363C42889H4706A9636J16597a89595e884o1209I2648a9068
$$ plain form
17997 -320561 209113 -122506 -238171 96166 135999 117218 407550 -110010 338745 37158
17986 170193 -84034 -49567 -281764 -216886 -243357 118825 156435 121173 189124 -120057 -24052
17974 61040 17193 -25176 264876 256790 -221819 166607 -117073 -191590 104228 122451 -90631
17962 181881 -104386 196479 262238 -187684 -215639 164184 60312 -260006 103338 137132
17952 137132 -79376 -250658 -173303 90921 401110 82586 -54544 -244200 -215735 -90537 -128716
17941 -128716 45095 158370 -15342 -130854 -307108 -142492 291917 -132562 166252 -30844
17930 -125570 322197 -228420 73206 -76337 86529 -109641 26257 115030 240885 130956
17920 130956 -98654 -155488 143541 -261649 -125305 202485 -16095 -233443 -116310 -141248
$$ packed form
17997c20561B09113a22506j15665I6166L9833j8781K90332a10010C38745C7158
17986A70193h4034L4467k32197O4878k6471A18825L7610l5262O7951a20057b4052
17974F1040A7193b5176B64876q086b21819A66607a17073p4517A04228J8223i0631
17962A81881a04386A96479O5759a87684k7955A64184F0312b60006A03338L3794
17952A37132g9376j71282P7355I0921L10189H2586e4544j89656K8465i0537l8179
17941a28716D5095J13275a5342j15512j76254a42492B91917a32562A66252c0844
17930a25570C22197b28420G3206g6337H6529a09641B6257Q8773J25855j09929
17920A30956i8654n6834A43541b61649a25305B02485a6095k17348a16310k4938
$$ plain form
17910 -141248 -58551 -33638 70080 -90085 -176524 -152325 130906 152599 -172459 -169308 23477
17898 137178 108468 84474 -50693 4758 53974 -284594 131085 258620 47233 -75895 -344510
17887 -344510 83788 246507 1991 -117225 -54269 108373 32599 150631 -155477 131071
17876 76881 116177 -69999 193994 59998 -204314 87633 128224 -335163 39909 -98435 -181569
17865 -181569 -108174 261538 -76410 -24577 -146873 -25188 -152710 -196612 64230 104856 -183518
17853 -511476 -137541 -142922 58034 182943 88343 -43573 233644 -348459 -240989 71573 -208284
17841 -298608 78237 -189981 74349 -171075 68735 -67937 -273458 -67494 -19317 -94206 -79986
17830 -79986 -145749 -105627 -132323 -8050 41668 -248907 86564 -148232 2855 160939 51957
$$ packed form
17910a41248e8551K4913G0080i0085q6439K4199A30906K1693a72459L151B3477
17898A37178k8710k3994e0693D758M9216b84594A31085J27535D7233g5895k68615
17887c44510H3788J62719A991a17225e4269A08373C2599J18032a55477A31071
17876G6881L9296f9999A93994E9998b04314H7633M0591c35163C9909i8435q3134
17865a81569P3395B61538g6410b4577j22296b5188j27522m3902F4230M0626a83518
17853e11476a37541n381E8034J24909H8343d3573B33644c48459J07470G1573b08284
17841b98608G8237a89981G4349a71075F8735f7937k05521f7494a9317p4889J4220
17830g9986o5763M0122k6696h050D1668b48907H6564a48232B855J58084E1957
$$ plain form
17818 85662 234228 132389 -163198 -246211 205501 226020 -410541 57387 -160751 -66923
17807 113641 -88689 -38943 40630 270676 -162358 422050 168028 -47741 214290 178658
17797 178658 -69871 71324 137696 32 -44423 -239904 230261 -48660 139438 38017 -7595 32937
17784 153632 412181 -112637 -173244 456155 37097 32960 -114488 -1001 -113340 -30720 -155618
17773 -155618 88053 -181676 -65428 -7113 347029 57329 268606 5103 -56960 9885 276837
17762 276837 130043 134737 -70780 2541 61230 -81167 33268 -169129 -344915 -386420 261209
17750 163438 -97606 -315783 -31246 168564 247843 38939 158620 -209376 22407 185441
17740 185441 -285011 276786 -83459 -50404 52917 80200 -93073 123969 -239120 39541 -70936
$$ packed form
17818H5662J48566j01839a63198q3013B05501K0519d10541E7387a60751f6923
17807A13641h8689c8943D0630K30046a62358D22050A68028d7741B14290l5632
17797A78658f9871G1324O6372C2d4423j95481B30261d8660A39438C8017g595C2937
17784A53632K58549a12637o0607D56155C7097m137a14488a001j12339c0720j24898
17773a55618H8053a81676f5428g113C47029E7329K11277E103e6960I885K66952
17762B76837A30043M694g0780B541N8689h1167C3268a69129j75786m1505B61209
17750A63438i7606k18177c1246A68564P9279C8939J19681b09376B2407J63034
17740A85441b85011B76786h3459L3055E2917K7283i3073A23969b39120C9541g0936
$$ plain form
17728 -92068 -119375 -43535 8700 82596 -111679 -49465 -160117 44017 -52188 -162168 101343
17716 162411 -56581 43907 286518 33622 26685 -151650 9527 -99071 153774 311214 -120352
17704 106617 283931 -80905 126948 286387 -74796 283722 22930 -174408 161577 -534 54040
17692 46323 -170089 -60172 -84503 117076 117044 -11696 -7072 135402 -332521 137470 1481 93464
17680 93464 156639 -148518 -56329 408574 224756 -56668 -267416 -5465 83130 -119514 60300
17668 -200297 64738 -119069 313243 39066 -235678 84098 -160021 -126275 97489 -161040
17657 -28358 164999 361759 -101972 147596 27089 49468 134257 65151 -21327 64113 -47016
17645 -36304 -139395 365402 115811 -168156 -118503 -285844 215842 86144 -133070 -209996
$$ packed form
17728i2068k7307d3535H700P3896a11679d9465j10652D4017e2188j09980A01343
17716A62411e6581D3907K42611C3622o937a51650I527i9071A53774J57440a20352
17704A06617J77314h0905A26948J59439g4796B83722B2930a74408A61577e34E4040
17692D6323a70089f0172k4331A17076l2a1696M624A35402c32521A37470A481R1983
17680I3464O3175a48518e6329D08574j83818e6668k10748e465H3130a19514F0300
17668b00297F4738a19069C13243C9066b35678H4098a60021L3746I7489a61040
17657b8358A64999J96760a01972A47596B7089K2379Q4789F5151b1327F4113d7016
17645c6304j03091C65402A15811a68156M9653j67341B15842H6144a33070p6926
$$ plain form
17635 -209996 -119629 82579 43907 -81762 205187 -165482 -21064 -143219 358905 468210
17625 468210 227711 -444662 213874 -278929 -28340 -22067 -79876 82814 -118024 111305
17614 -42005 372123 270978 38858 283658 -131620 -362012 -73118 87876 -182874 80836
17603 -119944 -136466 -175865 -69904 67893 99424 152323 -63114 220800 -23928 25910 26511 -72977
17590 -182314 -210148 -60529 -179016 118298 253420 -58198 88151 246969 67309 169247
17580 169247 -84436 -77206 41770 -53747 -203953 -45833 137719 -263608 235339 226989 201667
17569 201667 -68423 -11927 46982 50814 272479 70801 -207708 -194131 -168083 204313 99011
17557 68513 -188820 19955 -1439 157257 81852 -208029 55536 -65497 -214351 58901 252857
$$ packed form
17635b09996R0367H2579l8672h1762B05187a65482b1064j22155C58905J09305
17625D68210B27711d44662B13874b78929b8340O273n7809H2814a18024A11305
17614d2005C72123j01145C8858K44800a31620k30392g3118H7876a82874H0836
17603a19944j6522l9399f9904F7893L1531N2899f3114B20800b3928B5910O01g2977
17590a82314k7834f0529j18487A18298J35122e8198H8151J58818F7309J01938
17580A69247h4436P230D1770e3747j50206d5833A37719b63608B35339q350k5322
17569B01667f8423a1927D6982L832K21665G0801b07708J3577K6048B04313I9011
17557F8513a88820A9955a439A57257p5405b08029E5536f5497j48854E8901J93956
$$ plain form
17546 252857 -283328 29027 -95322 442494 -104467 197257 270507 -117770 -184190 141637
17535 -66624 -181677 -46175 -278974 205480 -82492 -147372 249261 79905 -52221 116961 -47748
17523 -81778 -204014 55268 -86860 104819 255554 63204 64063 278628 212848 -30597 -226005
17512 -226005 94664 -273581 90792 151790 181669 55472 236540 -21503 273747 -155160 -9661
17500 -65378 168551 64706 207550 66362 -55245 214664 7808 -257356 36286 100388 22888
17488 459192 75219 80269 6356 281691 265392 124028 199523 239813 256604 -80262 119356
17476 59498 2846 15214 414134 -13659 15184 -197174 202784 6019 279165 204890 136472
17465 136472 -68101 146517 -93854 351320 -183254 -23338 198624 43392 -176976 259758
$$ packed form
17546B52857b83328B9027i5322D42494a04467A97257P3250a17770o6420A41637
17535f6624j15053d6175k32799B05480h2492o4880B49261G9905e2221A16961d7748
17523h1778j22236E5268h6860A04819J50735F3204Q59K14565o5780c0597j95408
17512b26005I4664b73581I0792O0998K9879E5472J81068b1503B73747a55160i661
17500f5378A68551F4706J42844F6362e5245B14664G808b57356C6286O4102B2888
17488D59192G5219N050F356K75335j6299A24028P5495M0290J6791h0262A19356
17476E9498B846J2368L98920a3659A5184a97174B02784F019K73146p4275o8418
17465A36472f8101A46517i3854C51320a83254b3338A98624D3392a76976B59758
$$ plain form
17454 166452 -89119 148434 302019 208509 94449 237077 224461 83971 184741 163088 168448
17443 168448 -111551 368221 464253 -25615 379333 173015 148381 -21085 185543 -103967
17432 227358 376229 19837 399782 49349 83791 -294227 311814 86431 57215 111019 422340
17421 422340 121218 -182774 183676 206750 -2939 259520 166253 238564 332210 170963 -90026
17409 250869 47577 113882 -31914 9379 -25055 -276333 185821 -106530 101884 -173677 208916
17397 158726 -133967 292848 291850 296921 85466 -206471 -61623 -44030 151205 204820 244421
17386 244421 123197 209406 281867 36184 -176577 93536 202692 253273 282382 93188 -47694
17374 196375 -140710 181734 35660 -76911 224942 -112261 426083 103213 209786 311988
$$ packed form
17454A66452h9119A48434J53585r3510I4449J42628j2616H3971J00770k1653N360
17443A68448a11551C68221R6032b5615C79333A73015k4634b1085A85543a03967
17432B27358J48871A9837L79945D9349L4442b94227C11814H6431k9216N3804L11321
17421D22340A21218a82774A83676K3074b939B59520r3267P2311R3646j61247i0026
17409B50869D7577O6305c1914I379b5055k51278A85821a06530A01884a73677B08916
17397A58726a33967B92848r98N071H5466b06471f1623J7593A51205N3615L9601
17386B44421j21224Q6209P2461C6184a76577I3536J09156N0581K9109I3188d7694
17374A96375a40710A81734C5660g6911B24942a12261D26083A03213J06573J02202
$$ plain form
17364 311988 188909 69506 216800 299894 409657 209200 381218 148001 -151765 -239878
17354 -239878 136319 212054 -12383 -68787 122113 130638 156391 395834 -12457 30949 67823
17343 67823 311151 68278 267851 128735 203396 -315512 153153 50288 282278 -22457
17332 52484 90157 -6877 304763 28322 270637 188737 242383 -39817 393003 152053 266960
17321 266960 256706 219726 334736 396965 126521 759335 214522 126493 164746 338950
17311 338950 134752 79874 349562 -73580 240437 124717 -372370 194982 46035 27320
17301 27320 149743 221324 187645 314380 206362 276393 159796 257069 369027 348086 290242
17290 290242 -10883 -48377 115761 225610 183413 105254 78354 -43624 216419 -40907 288762
$$ packed form
17364C11988j23079F9506J47294Q3094J09763k00457J72018A48001a51765q8113
17354b39878A36319P5735a2383n6404A22113Q525K5753K39443a2457C0949L6874
17343F7823K43328F8278J99573A28735P4661c15512A53153E0288K31990b2457
17332E2484L7673f877C04763B8322K42315q1900N3646c9817C93003A52053J14907
17321B66960j0254l6980J15010O2229A26521O32814B14522q8029L8253J74204
17311C38950A34752n4878K69688g3580B40437j15720c72370A94982D6035j8715
17301B7320J22423P1581l3679J26735j08018P0031j16597R7273J11958k0941n7844
17290B90242a0883l7494A15761J09849m2197p8159k6900d3624B16419d0907B88762
$$ plain form
17278 115147 84880 163282 107686 20218 416189 25995 -29068 232543 203402 -45636 255828
17266 200107 280001 281958 169092 257666 -238181 79040 -24998 132896 137027 208119 113049
17255 113049 107815 545935 -110019 105611 228706 192528 69511 324799 344838 385937 67917
17243 34624 353807 230492 70443 103084 43759 -120814 53737 235072 383264 105649
17232 74289 507134 213092 409356 359591 107805 103782 2506 98920 207528 360812 193329
17221 193329 228294 347888 399032 27412 294944 57660 250412 177390 232988 132543 62585
17209 357323 43420 -99238 661925 122979 159218 8849 406555 589990 797887 -228664
17198 160296 357428 163322 6625 103269 177028 494085 309826 -25852 -159937 179342
$$ packed form
17278A15147l0267P8402n5596B0218L95971B5995b9068B32543k9141d5636B55828
17266B00107P9894J957j12866Q8574b38181G9040b4998A32896M131P1092r5070
17255A13049n234M38120a10019A05611J23095l6178F9511K55288K0039M1099F7917
17243C4624L19183j23315G0443L2641D3759a20814E3737J81335J48192A05649
17232G4289M32845B13092J96264m9765A07805m023B506R6414J08608J53284j67483
17221A93329L4965J19594N1144B7412K67532E7660J92752p3022N5598j00445F2585
17209C57323D3420i9238F61925A22979L6239H849L97706J83435K07897b28664
17198A60296J97132A63322F625R6644P3759L17057j84259b5852j34085A79342
$$ plain form
17187 75577 280419 286020 64769 200805 186954 6271 408825 422947 257770 -65372 259357
17175 149742 256038 131558 87743 481400 124254 27076 473277 151227 444817 212795
17164 287052 299641 216632 79298 81341 73102 365192 416610 107351 242536 184060 158952
17153 158952 537248 357576 538330 138959 334064 370507 145722 572641 172651 398989
17143 398989 174111 127170 328525 512454 306536 572786 268855 482247 372377 344004
17133 344004 -25396 178426 426951 357551 432352 258981 338656 487489 311451 200101
17123 200101 329872 488274 445907 47690 332311 569770 557316 651661 485161 170327
17112 581459 320374 481472 404007 131614 462452 200738 302791 246465 91730 698583
$$ packed form
17187G5577K04842N601F4769J36036j3851F271M02554J4122j65177f5372B59357
17175A49742J06296j24480m3815L93657A24254B7076M46201A51227K93590B12795
17164B87052J2589q3009G9298K043q239K92090N1418A07351J35185n8476k5108
17153A58952L78296j79672J80754A38959J95105L6443A45722M26919A72651K26338
17143C98989A74111m6941K01355J83929k05918K66250B68855K13392j09870k8373
17133C44004b5396A78426K48525o9400P4801j73371P9675J48833j76038j11350
17123B00101J29771J58402m2367D7690K84621K37459j2454R4345j66500A70327
17112E81459k61085J61098p7465A31614L30838B00738J02053n6326I1730O06853
$$ plain form
17102 698583 554845 417854 620174 496585 450152 374290 51906 306805 741687 463101
17092 463101 429364 393558 343409 283016 506123 250057 417744 238994 592078 410764
17082 410764 322245 511510 727404 246122 417957 458667 465500 553143 703818 384204
17072 384204 540796 446166 504560 164282 610245 287615 478225 523190 386940 428528
17062 428528 763155 483633 547652 640065 555442 391143 673350 399805 570436 427279
17052 427279 249533 478278 591172 580364 514654 929677 624704 744147 627597 615515
17042 615515 292901 889581 701211 551309 833957 786622 764033 716868 408259 707605
17032 707605 625172 918163 812091 719835 754666 654635 378777 272530 778671 592562
$$ packed form
17102F98583j43738j36991K02320j23589m6433p5862E1906K54899M34882k78586
17092D63101l3737l5806n0149o0393K23107B50057J67687j78750L53084j81314
17082D10764q8519J89265K15894B46122J71835M0710O833Q7643J50675l19614
17072C84204J56592r4630N8394A64282M45963B87615J90610M4965j36250M1588
17062D28528L34627k79522O4019R2413q4623j64299K82207k73545J70631j43157
17052D27279j77746K28745J12894j0808o5710M15023l04973J19443j16550j2082
17042F15515B92901N96680j88370j49902K82648m7335k2589m7165l08609K99346
17032G07605q2433K92991j06072r2256L4831j00031k75858j06247N06141j86109
$$ plain form
17022 592562 736828 645221 381043 838384 530499 611590 691894 505441 965645 836068
17012 836068 662960 593987 978543 280057 667221 406905 882684 611183 1093151 1028622
17002 1028622 780421 677479 773417 696982 933583 777998 1044022 614719 678888 551768
16992 551768 905020 1032934 670752 872203 472122 880021 1032135 692940 897210 871078
16982 871078 1180910 616034 910734 678213 842334 795716 613581 935118 966606 899448
16972 899448 962829 916877 912693 928953 853533 1025585 971880 1110160 1006431 618847 987553
16961 987553 1310904 880630 734626 1000700 1008616 1226927 822505 933597 1088097 1049556
16951 1049556 1279013 1286776 1089968 1024870 1017720 1102343 1363720 901079 1317193 1207958
$$ packed form
17022E92562J44266r1607k64178M57341l07885Q1091Q0304j86453M60204j29577
17012H36068j73108o8973L84556B80057L87164k60316M75779k71501M81968o4529
17002A028622k48201j02942R5938p6435K36601j55585K66024m29303O4169j27120
16992E51768L53252J27914l62182K01451m00081M07899J52114l39195K04270k6132
16982H71078L09832n64876K94700k32521J64121m6618j82135L21537L1488o7158
16972H99448O3381m5952m184J6260p5420J72052n3705J38280j03729l87584L68706
16961I87553L23351m30274j46004K66074P916K18311m04422J11092J54500l8541
16951A049556K29457P763j96808o5098p150Q4623K61377m62641M16114j09235
$$ plain form
16941 1207958 1119050 1122709 1307623 1585001 1579061 1642364 1093198 1453671 1179799 1210465 1411105
16930 1411105 1598588 1381397 1407378 1330226 1510467 1504623 1354023 1079882 1673053 1558649
16920 1558649 1442504 1387684 1791394 1664622 1944410 2000657 1732752 1784170 1695809 1876458
16910 1876458 1910672 1819672 2034818 1719149 1824046 1559030 1675031 1896125 2014410 1588518
16900 1588518 1777858 1955077 1961202 1820846 2472759 2154084 2137490 2275173 2193476 2218472
16890 2218472 1952612 2079435 1964806 2123523 2120550 2245862 2377911 2178719 2436313 2481810
16880 2481810 2469572 2837362 2541564 2614850 2327213 2741307 2551268 2815620 2740643 2694567
16870 2694567 2803214 3022490 2993759 2831148 3102763 3279512 2995150 2951261 2986393 3278061
$$ packed form
16941A207958q8908L659J84914K77378n940O3303n49166L60473k73872L0666K00640
16930A411105J87483k17191K5981p7152J80241n844j50600k74141N93171j14404
16920A558649j16145n4820M03710j26772K79788N6247k67905N1418q8361J80649
16910A876458L4214r1000K15146l15669J04897k65016J16001K21094J18285m25892
16900A588518J89340J77219O125j40356O51913l18675j6594J37683q1697K4996
16890B218472k65860J26823j14629J58717k973J25312J32049j99192K57594M5497
16880B481810j2238L67790k95798P3286k87637M14094j90039K64352p4977m6076
16870B694567J08647K19276k8731j62611K71615J76749k84362m3889L5132K91668
$$ plain form
16860 3278061 3181448 3265699 3596572 3347175 3388528 3379374 3473061 3752830 3498737 3637136
16850 3637136 3523831 4008208 3457825 3822246 4309080 4061968 4248134 4018569 4363575
16841 4363575 4086590 4248484 4582969 4266331 4529465 4629369 4600928 4821354 4821393 4948216
16831 4948216 4889426 5237149 4927503 5277177 5083198 5705979 5727074 5539990 5597346 5658074
16821 5658074 6073629 6043312 6351790 6587113 6529256 6446147 6574339 6951830 6957565 7107710
16811 7107710 7174300 7369223 7625148 7452068 7751397 7895133 8269098 8259697 8522209 8804510
16801 8804510 9218999 9315184 9549120 9754948 9979114 10067411 10800163 10552064 11003687 10846792
16791 10846792 11461621 11861502 12200426 12084547 12613851 13257914 13431672 13730143 13777194
$$ packed form
16860C278061r6613Q4251L30873k49397M1353r154R3687K79769k54093J38399
16850C637136j13305M84377n50383L64421M86834k47112J86166k29565L45006
16841D363575k76985J61894L34485l16638K63134R9904k8441K20426L9J26823
16831D948216n8790L47723l09646L49674j93979O22781K1095j87084N7356O0728
16821E658074M15555l0317L08478K35323n7857q3109J28192L77491N735J50145
16811G107710O6590J94923K55925j73080K99329J43736L73965r401K62512K82301
16801H804510M14489R6185K33936K05828K24166Q8297P32752k48099M51623j56895
16791A0846792O14829L99881L38924j15879N29304O44063J73758K98471M7051
$$ plain form
16782 13777194 14268326 14637292 15007334 15827705 15848159 16335481 17042681 17471170 17857116
16773 17857116 18783371 19201794 19728255 20650128 21139883 21898802 22446330 23281016 24009078
16764 24009078 24844324 25736628 26684561 27530627 28506842 29617902 30495904 31692983 33385839
16755 33385839 34367395 35450110 37011143 38549384 40321158 41758247 43616042 45283248
16747 45283248 47048211 49093195 51211498 53612851 55690483 58061464 60604582 63266643
16739 63266643 65955750 68707042 71892431 74843999 77691149 81116645 84597419 87600090
16731 87600090 91270670 94708900 98187226 101314934 104790100 107642875 110910058 114136508
16723 114136508 116523380 119049366 120947312 122346800 123839767 124512539 124992915 124983670 124481417
$$ packed form
16782A3777194M91132L68966L70042Q20371K0454M87322P07200M28489L85946
16773A7857116R26255M18423N26461R21873M89755P58919N47528Q34686P28062
16764B4009078Q35246Q92304R47933Q46066R76215J111060Q78002J197079J692856
16755C3385839R81556J082715J561033J538241J771774J437089J857795J667206
16747D5283248J764963K044984K118303K401353K077632K370981K543118K662061
16739F3266643K689107K751292L185389K951568K847150L425496L480774L002671
16731H7600090L670580L438230L478326L127708L475166K852775L267183L226450
16723A14136508K386872K525986J897946J399488J492967O72772M80376r245n02253
$$ plain form
16714 124481417 123891327 122229792 120733409 118952466 116234176 113836491 110812025 107265901
16706 107265901 104605272 101189511 97925434 94308116 90858905 87392640 83993286 80560701
16698 80560701 77415715 74502181 71477074 68357940 65529891 62738306 60186457 57584210
16690 57584210 55264855 53016045 50547105 48734566 46899187 45014336 43394623 41443536
16682 41443536 39638380 38302068 36581454 35492689 33837264 32628868 31742571 30295237
16674 30295237 29239508 28226512 27150680 26659197 25526066 24482340 23924487 23244591
16666 23244591 22440126 21781107 20799665 20215297 19577788 19209570 18337376 17787128 17399206
16657 17399206 16866087 16184005 16294272 15323527 14805586 14438302 14486627 13771720 13603752
$$ packed form
16714A24481417n90090j661535j496383j780943k718290k397685l024466l546124
16706A07265901k660629l415761l264077l617318l449211l466265l399354l432585
16698H0560701l144986k913534l025107l119134k828049k791585k551849k602247
16690E7584210k319355k248810k468940j812539j835379j884851j619713j951087
16682D1443536j805156j336312j720614j088765j655425j208396q86297j447334
16674C0295237j055729j012996j075832m91483j133131j043726n57853o79896
16666B3244591q04465o59019r81442n84368o37509l68218q72194n50248l87922
16657A7399206n33119o82082J10267r70745n17941l67284M8325p14907j67968
$$ plain form
16648 13603752 12997557 12869709 12384763 12225353 11640073 11726742 11143521 11143011 10852509 10733100
16638 10733100 10538229 10056635 9506623 9315861 9617259 9113424 8974485 8751828 8687840
16629 8687840 8213963 8129708 7963781 8094257 7576009 7265230 7206901 6999333 7041907 6619683
16619 6619683 6838615 6775006 6436811 6531504 6197125 6027434 6051859 5821392 6254468 5674480
16609 5674480 5734208 5546510 5446298 5685234 5411631 5200268 5147505 5149227 4685199 4747839
16599 4747839 4641047 4727033 4599931 4810439 4372114 4316984 4289835 4265540 4365788 4481359
16589 4481359 4031518 4033487 4064317 3841936 3583256 3730504 3643264 3785390 3673925 3671356
16579 3671356 3395795 3365422 3441253 3524523 3274851 3583256 3486226 3255798 3153441 3165263
$$ packed form
16648A3603752o06195j27848m84946j59410n85280Q6669n83221n10k90502j19409
16638A0733100j94871m81594n50012j90762L01398n03835j38939k22657o3988
16629H687840m73877q4255j65927J30476n18248l10779n8329k07568M2574m22224
16619F619683K18932o3609l38195R4693l34379j69691K4425k30467M33076n79988
16609E674480N9728j87698j00212K38936k73603k11363n2763J722m64028O2640
16599D747839j06792Q5986j27102K10508m38325n5130k7149k4295J00248J15571
16589D481359m49841J969L0830k22381k58680J47248q7240J42126j11465k569
16579C671356k75561l0373P5831Q3270k49672L08405r7030k30428j02357J1822
$$ plain form
16569 3165263 2870841 3311998 3047505 2678049 2970733 2836704 2532244 2313257 2517302
16560 2517302 2546766 2302004 2957478 2743181 2856251 2570605 2436755 2630826 2223373 2470979
16550 2470979 2827872 2577230 2593645 2215045 2493764 2043504 2117918 2349497 2083593 2461055
16540 2461055 2078933 2321929 1994367 2366969 2063295 1978185 2213939 2092024 1987794 1880489
16530 1880489 1729980 1687991 1843897 1714505 1618816 1748728 1860402 1910073 1729313 1606017
16520 1606017 1801490 1564480 1581265 1791019 1623797 1659431 1877340 1590116 1495901 1497353
16510 1497353 1622544 1347990 1221946 1586756 1265144 1091289 1319605 1452857 1501478 1114859
16500 1114859 1295215 1588086 1602715 1149208 1669384 1531687 1454939 1394875 1235284 1450567
$$ packed form
16569C165263k94422M41157k64493l69456K92684j34029l04460k18987K04045
16560B517302K9464k44762O55474k14297J13070k85646j33850J94071m07453K47606
16550B470979L56893k50642J6415l78600K78719m50260P4414K31579k65904L77462
16540B461055l82122K42996l27562L72602l03674q5110K35754j21915j04230j07305
16530A880489j50509m1989J55906j29392r5689J29912J11674M9671j80760j23296
16520A606017J95473k37010J6785K09754j67222L5634K17909k87224r4215J452
16510A497353J25191k74554j26044L64810l21612j73855K28316J33252M8621l86619
16500A114859J80356K92871J4629m53507N20176j37697p6748o0064j59591K15283
$$ plain form
16490 1450567 1614944 1198799 802965 1035829 1498391 1551230 1316996 1280884 1261020 1352206
16480 1352206 996253 1195393 1366751 926575 983195 1095002 1231791 1291591 956374 1055477
16470 1055477 994586 900064 1020158 938775 971764 900815 860758 1436938 1122286 1226049
16460 1226049 955768 973850 955568 1181708 1073443 1139580 877626 975421 1114569 1191099
16450 1191099 832456 1023883 996712 765511 873598 999773 624523 919472 654139 808548
16440 808548 1150259 1115872 561308 1017256 999041 840677 348265 951927 1192672 595118
16429 821908 815128 920845 584502 938121 851095 730663 486939 463714 700879 576083
16419 576083 493517 558799 838714 1008830 669650 1082762 730655 780580 666631 569119
$$ packed form
16490A450567J64377m16145l95834K32864M62562N2839k34234l6112j9864R1186
16480A352206l55953J99140J71358m40176N6620J11807J36789N9800l35217R9103
16470A055477o0891r4522J20094q1383L2989p0949m0057N76180l14652J03763
16460A226049k70281J8082j8282K26140j08265O6137k61954R7795J39148P6530
16450A191099l58643J91427k7171k31201J08087J26175l75250K94949k65333J54409
16440H08548L41711l4387n54564M55948j8215j58364C48265O03662K40745E95118
16429H21908o780J05717l36343L53619q7026j20432k43724k3225K37165j24796
16419E76083q2566O5282K79915J70116l39180M13112l52107M9925j13949r7512
$$ plain form
16409 569119 510372 813102 666868 452803 724074 877400 638789 239193 850784 817967
16399 817967 660585 865602 597675 422891 583669 768239 631501 364000 444043 336777
16389 336777 428003 628309 675065 575762 681828 314484 875401 582762 512322 682352
16379 682352 695342 909536 626427 374105 480649 685481 309328 681842 683166 605947
16369 605947 428607 656583 309918 932157 670749 730372 499988 614624 532197 446525
16359 446525 519472 432257 534080 289181 755677 386857 474271 514647 169781 470114
16349 470114 498838 477171 194451 452959 275423 313066 272081 431816 402322 685260
16339 685260 573312 302369 397020 339640 631019 531796 415408 325017 307280 248271 287550
$$ packed form
16409E69119n8747L02730j46234k14065K71271J53326k38611B39193O11591l2817
16399H17967j57382K05017k67927j74784J60778J84570j36738k67501Q0043j07266
16389C36777R1226K00306M6756r9303J06066C14484N60917k92639p0440J70030
16379F82352J2990K14194k83109k52322J06544K04832C09328L72514J324p7219
16369F05947j77340K27976C09918O22239k61408N9623k30384J14636q2427q5672
16359D46525P2947q7215J01823k44899M66496l68820Q7414M0376A69781L00333
16349D70114K8724k1667A94451K58508j77536L7643m0985J59735k9494K82938
16339F85260j11948k70943R4651n7380K91379r9223j16388r0391j7737n9009L9279
$$ plain form
16328 287550 456903 647089 670661 224188 56579 303031 349372 529988 692236 402461
16318 402461 42049 163683 283906 216046 617283 134436 243914 163640 372000 241638
16308 241638 405731 459468 192505 335319 465491 294887 392548 177936 83549 748290
16298 748290 52215 392882 236225 298558 405468 348198 285383 190378 -123616 259448
16287 121638 241458 551402 217644 366117 94398 504925 136519 552055 755740 114836
16276 428592 344345 350044 64917 365168 363324 149178 147121 236593 486679 389345 290399
16265 290399 207952 404946 186779 138326 463655 393911 230942 294806 198158 312902
16255 312902 275746 377418 219358 221366 176893 357570 -137832 239519 339416 67755 492960
$$ packed form
16328B87550J69353J90186K3572B24188E6579K46452M6341J80616J62248k89775
16318D02461D2049J21634J20223o7860M01237A34436J09478q0274K08360j30362
16308B41638J64093N3737A92505J42814J30172j70604R7661A77936H3549O64741
16298G48290E2215L40667j56657O2333J06910n7270o2815r5005a23616B59448
16287A21638J19820L09944B17644J48473I4398M10527A36519M15536K03685A14836
16276D28592q4247N699F4917L00251j844A49178k057Q9472K50086r7334r8946
16265B90399q2447J96994A86779m8453L25329o9744j62969O3864r6648J14744
16255C12902l7156J01672j58060K008m4473J80677a37832B39519R9897F7755M25205
$$ plain form
16244 492960 225385 -27507 661935 193367 -167865 365551 174921 186843 -91847 188518
16233 356979 28488 399557 121441 412235 76946 142773 230545 163406 -7 80822 111238 41672
16220 519650 494473 68971 145052 123585 141369 170824 296570 47141 225972 4497 462267
16209 462267 279893 170254 -67811 342662 79224 433824 540440 181338 58836 276235
16199 276235 562231 311657 -149055 338817 90562 63688 98212 74767 394954 159328
16188 360056 329907 133876 188817 41044 433379 160672 245689 177344 169524 244268 247863
16177 247863 357285 392144 95366 101920 32835 -84341 183933 269697 404432 -125068 170453
16165 -215439 -106751 46597 131432 115710 -108403 238756 44418 229882 31880 133630
$$ packed form
16244D92960B25385b7507F61935A93367a67865C65551A74921J1922i1847A88518
16233C56979B8488L71069A21441K90794G6946O5827Q7772o7139gH0822L0416D1672
16220E19650k5177F8971P6081k1467J7784K9455J25746D7141J78831D497M57770
16209D62267j82374j09639f7811C42662G9224L54600J06616A81338E8836K17399
16199B76235K85996k50574a49055C38817I0562k6874L4524k3445L20187A59328
16188C60056l0149A33876N4941D1044L92335A60672Q5017o8345p820P4744L595
16177B47863J09422L4859I5366O554C2835h4341A83933Q5764J34735a25068A70453
16165b15439a06751D6597Q4835j5722a08403B38756D4418J85464C1880J01750
$$ plain form
16155 133630 491793 343832 10019 233131 186243 212581 -206532 322185 14387 104213
16145 104213 473584 52047 13905 385180 -101108 382296 -96056 233161 260785 146878
16135 146878 -132385 38931 357006 81578 249546 156134 228227 73788 108805 63608 96573
16124 96573 338355 8343 -84403 65420 69427 13064 -37349 316621 113102 253607 174427
16113 174427 45785 -57154 182013 71146 162950 -7563 72618 181354 48419 362358 260116
16102 260116 244409 453424 259814 186709 66836 46399 138111 44246 -45630 -58185 285916
16090 66639 260923 80897 157202 29786 -270590 81249 -26135 -100851 -172696 125458 45355
16078 273220 87088 -76933 -81252 108474 -295064 82766 -19949 -29052 75325 50217 -31236
$$ packed form
16155A33630L58163j47961A0019K23112m6888K6338b06532C22185A4387Q9826
16145A04213L69371E2047A3905L71275a01108C82296i6056B33161K7624j13907
16135A46878a32385C8931L18075H1578J67968r3412P2093G3788L5017m5197L2965
16124I6573K41782H343h4403F5420M007A3064c7349C16621A13102J40505p9180
16113A74427D5785e7154A82013G1146R1804g563G2618J08736D8419L13939j02242
16102B60116j5707K09015j93610p3105F6836k0437R1712D4246d5630j2555B85916
16090F6639J94284H0897P6305B9786b70590H1249b6135p4716p1845A25458D5355
16078B73220H7088g6933m319A08474b95064H2766a9949r103G5325k5108c1236
$$ plain form
16066 -103190 -87406 177709 -38815 93969 390579 25806 -22008 -51286 315852 -148744 57793
16054 289545 221160 -140603 -599 -58144 -178143 133685 -58202 -88409 126931 464960 117529
16042 185893 51043 346716 229788 119027 -11003 79773 -321592 104519 -14213 -86680
16032 -86680 195135 145468 -83610 14789 -66553 -91932 8017 58097 287001 65506 95392
16021 95392 77480 86617 100933 3836 296116 91339 162933 48928 -97764 172750 55091 -8650
16008 158204 195114 -70193 28373 63405 -112446 121208 37498 -77774 -112374 -92547 -36096
15996 125834 -252780 273134 9406 -495237 22094 133902 177037 471231 122489 -51399
15985 149389 9264 287079 -91969 79990 -51930 190026 150163 48055 397057 55075 121828
$$ packed form
16066a03190J5784A77709c8815I3969K96610B5806b2008k9278C15852a48744E7793
16054B89545o8385a40603e99n7545j19999A33685e8202l0207A26931L38029A17529
16042A85893E1043K95673j16928j10761a1003G9773c21592A04519a4213p2467
16032h6680A95135m9667h3610A4789f6553k5379H017N0080K28904F5506K9886
16021I5392j7912R137J4316C836K92280I1339P1594D8928i7764A72750E5091h650
16008A58204L6910g0193B8373L5032a12446A21208C7498g7774l4600J9827c6096
15996A25834b52780B73134I406d95237B2094J11808M3135K94194A22489e1399
15985A49389I264K77815i1969G9990e1930A90026l9863D8055L49002E5075O6753
$$ plain form
15974 121828 -147828 114464 41479 345110 2420 -154089 -116061 99342 -27448 -12723 110847
15962 -122996 94626 322040 78526 -138498 -95893 112325 155510 -92019 -249918 -102174
15951 -50641 -46035 -209640 -22192 -346165 26079 -177208 143596 -102914 74676 -71460 74821
15939 -75421 309840 -264594 25049 -140389 95344 11839 261932 120568 -106462 141807
15928 2487 60668 99205 -46752 147564 28716 147090 224507 160648 231469 -41621 15166
15916 160743 72814 -101614 -273449 -216698 -79599 4698 85020 79155 114915 -155661 -164123
15905 -164123 -85508 505408 236132 -123380 -120201 36808 -189068 -72908 -292202 -31040 83739
15893 -33089 51730 -14122 92484 12539 -85428 105135 297023 558013 253754 314452 41743
$$ packed form
15974A21828a47828A14464D1479L03631B420a54089L8028I9342b7448a2723A10847
15962a22996I4626K27414G8526a38498M2605A12325M3185i2019j57899a02174
15951e0641M606j63605b2192l23973B6079a77208A43596a02914G4676g1460G4821
15939g5421C09840b64594B5049a40389I5344A1839K50093A20568a06462A41807
15928B487N8181L8537d6752A47564B8716J18374P7417o3859P0821d1621A5166
15916A60743G2814a01614j71835N6751g9599D698Q0322n865L5760a55661q462
15905a64123P8615E05408B36132a23380L179C6808a89068g2908k19294c1040H3739
15893c3089E1730a4122I2484A2539h5428A05135J91888K60990B53754O0698D1743
$$ plain form
15881 -13898 170120 -246357 94515 -427316 388461 103674 180500 -203258 45562 -136454
15870 31412 100547 82839 154272 -149804 86684 217120 -199203 -12902 -312125 -228056 114969
15858 224303 -308026 200828 342828 -28420 54625 126964 -68246 2284 -154293 -208699 94980
15846 66509 -282981 16157 -213838 148958 -230777 -148893 -7224 -151291 -164516 -166942 -231212
15835 -231212 -148115 79584 -130541 -69379 17977 -176745 -110131 -86179 -521821 280256 -121558
15823 128526 -160999 99281 280745 -61497 -199556 -137920 132339 161497 -194142 240678
15812 -86830 7926 82012 -285877 -12316 67553 157630 -142992 34446 -18457 264533 -19158
15800 -167736 54945 -268672 -175728 104775 74872 -130902 -178438 32078 -142283 -21249 -302361
$$ packed form
15881a3898A70120b46357I4515d27316C88461A03674P6826b03258D5562a36454
15870C1412O9135j7708P1433a49804H6684J30436a99203a2902k99223Q4069A14969
15858B24303c08026B00828J42000b8420E4625P2339f8246B284a54293n4406I4980
15846F6509b82981A6157b13838A48958b30777Q1884g224j44067j3225k426o4270
15835b31212Q3097G9584a30541O1162A7977a76745O6614K3952m35642B80256a21558
15823A28526a60999I9281J81464f1497j38059O1636A32339K9158a94142B40678
15812h6830G926P4086b85877a2316F7553R0077a42992C4446a8457B64533a9158
15800a67736E4945b68672R2944A04775k9903a30902m7536C2078a42283b1249k81112
$$ plain form
15789 -302361 177790 210063 -17162 372560 19665 -186029 272643 -1805 462979 181535
15778 -69039 -248488 159746 196725 95359 40274 133838 101373 -213469 -346433 10762 -167951
15766 -235763 339003 87277 123290 -304344 38898 -160826 -227889 -17799 -172048 16116 -9396
15754 -6656 -330011 -137572 -313394 -118998 -81594 -181678 94246 27708 -125299 -64185 -79483
15743 -79483 -186007 68208 123592 249090 52094 -131875 -29728 282780 24364 -87789 -2151
15731 -74737 2152 153057 309919 159516 -15749 -388841 -180308 -145378 101499 -169944
15720 -139449 -137185 250161 203665 120263 -219481 212534 -14828 -406473 182181 -148315
15709 -121660 -152038 58175 -157965 -252215 140710 75798 -285092 -178727 -25721 67574 -277820
$$ packed form
15789c02361A77790L2273a7162C72560A9665a86029B72643a805D62979A81535
15778f9039j79449A59746L6979I5359D0274R3564l2465b13469j32964A0762a67951
15766b35763C39003H7277L6013c04344C8898a60826o7063a7799j54249A6116i396
15754f656l23355a37572j75822a18998L7404j00084I4246B7708a25299O1114j5298
15743g9483j06524F8208N5384J25498E2094a31875b9728B82780B4364h7789b151
15731g4737B152J50905J56862j50403a5749l73092a80308L4930A01499a69944
15720a39449K264B50161m6496q3402b19481B12534a4828l91645A82181a48315
15709a21660l0378E8175a57965r4250A40710o4912b85092J06365b5721F7574b77820
$$ plain form
15697 42546 200085 -106215 -123366 -138674 251726 -84970 -177332 117052 71548 -297892 -271560
15686 -271560 -114438 -263412 86159 136494 -212851 -63067 -117887 -61647 50271 199085 294322
15675 294322 -301147 37849 176646 226774 -109209 -139064 -148081 -76435 6385 34441 -227937
15663 -54972 -196737 269438 22094 21446 -255935 -85877 -99913 -121727 -65975 42500 -4168 10055
15650 -270437 242840 118061 -97552 -42095 -260081 -171828 -58122 -357474 83783 12792 -230783
15638 -126085 -24562 -87748 146276 146973 -228234 -127944 -211273 304869 80315 182871 29950
15626 -83871 48979 -115911 -62462 -57171 135111 -78613 -184189 32446 -177516 -186091 -163504
15615 -163504 -38631 -24882 -64730 -267108 82155 -262441 -240866 36721 -161006 -56331 -186473
$$ packed form
15697D2546J57539a06215j7151j5308B51726h4970r2362A17052m5504b97892K6332
15686b71560a14438j48974H6159N0335b12851f3067n4820N6240E0271J48814R5237
15675B94322c01147C7849J38797N0128a09209k9855r017P1646F385K8056b27937
15663e4972j41765B69438B2094o48b55935h5877j4036k1814N5752D2500d168A0055
15650b70437B42840A18061i7552d2095k17986Q8253e8122k99352H3783A2792b30783
15638a26085b4562o3186A46276O97b28234J00290q3329C04869H0315J02556B9950
15626h3871D8979a15911N3449N291A35111g8613j05576C2446a77516q575K2587
15615a63504c8631J3749l9848k02378H2155b62441K1575C6721a61006e6331j30142
$$ plain form
15604 -186473 -273380 -140441 260398 147948 -139453 185263 172521 274598 115153 -122007
15593 52151 -110797 -305542 -68497 277932 185182 -227834 14207 128943 -170758 236095
15582 -84068 -225269 68163 -115659 -16701 32170 -10607 -67504 -16866 9523 -83784 -205905
15571 -205905 -29158 -223002 87400 148591 428159 -63842 216308 -256259 119319 69457
15561 69457 119421 -28894 147415 -91977 222576 -23194 -45106 222643 91119 72512 333526
15550 333526 -274067 38527 42919 347403 -13347 99474 -80157 -118680 341848 6588 -150227
15538 -497549 -87627 272485 11267 -67791 112398 8845 -262031 -65065 137183 -60543 126012
15526 129818 -45325 -24410 -272081 108402 183579 -54105 -112382 18272 -122657 29248 -131650
$$ packed form
15604a86473q6907J32939B60398j12450a39453A85263j2742J02077A15153a22007
15593E2151a10797j94745f8497B77932r2750b27834A4207J14736a70758B36095
15582h4068j41201F8163a15659a6701C2170a0607n6897a6866I523h3784j22121
15571b05905b9158j93844H7400O1191K79568f3842B16308b56259A19319m9862
15561F9457M9964b8894A47415i1977B22576b3194k1912B22643I1119j8607K61014
15550C33526b74067C8527M392L04484a3347I9474h0157l8523C41848F588a50227
15538d97549h7627B72485A1267f7791A12398H845b62031f5065A37183f0543A26012
15526A29818d5325K0915k47671A08402P5177e4105n8277A8272a22657B9248a31650
$$ plain form
15514 28500 211911 -411782 -334831 33801 -120035 88553 275901 -21370 -181826 153410
15503 -147185 162729 -102168 667868 82601 -127970 -127709 -169763 -178529 59243 -77410 74548
15491 -293458 -246449 -48217 -120159 123266 -34609 -134596 226626 -220958 70683 48009 169685
15480 169685 -187447 112709 62891 100235 98292 134612 -22786 -334598 -351035 68723 -25043
15468 298856 -68015 -387726 -123641 21426 26909 54598 35727 63304 140809 -344880 124256
15456 103109 121575 192934 62788 -185450 -6087 -30103 -73199 66567 -300130 7845 -66072
15444 138492 -206053 343431 -21587 287110 -40576 173886 -151998 -228936 -373716 177102
15433 162249 123042 37964 -331660 61632 69705 170339 -199795 28332 -11613 -27214 264963
$$ packed form
15514B8500J83411d11782P6951C3801a20035H8553J87348b1370j60456A53410
15503a47185A62729a02168F67868H2601a27970K61m2054q766E9243g7410G4548
15491b93458M7009d8217p1942A23266c4609r9987B26626b20958G0683k2674J21676
15480A69685a87447A12709m9818L7344j943L6320b2786l11812j6437F8723b5043
15468B98856f8015l19711a23641B1426N483K7689j8871K7577P7505c44880A24256
15456A03109J8466P1359F2788a85450f087k4016m3096F6567c00130G845f6072
15444A38492b06053C43431b1587B87110d0576A73886a51998p6938j44780A77102
15433A62249l9207C7964c31660F1632Q073J00634a99795B8332a1613j5601B64963
$$ plain form
15421 107822 135451 -85608 132993 -359285 91848 41905 109280 17347 94112 227740 -146249
15409 13301 -210489 18106 -307473 208413 -82879 -161706 95147 292558 -136330 -262640
15399 -262640 275128 128369 -199169 225357 -18523 -203882 -68495 -124873 -68470 -177482
15389 -177482 57455 -156775 -137931 -97374 -281055 258835 -67919 -123000 323914 32035 259007
15378 259007 100611 94386 72510 -96924 -32529 36565 338343 173327 -269038 -290767 -81615
15366 -89665 -57912 61857 -80547 18515 83426 23379 -193751 194085 21717 -56760 168959
15354 -431693 207293 -195639 -113108 -118268 -265110 -209213 -209145 412606 -140103 216338 -218137
15342 -60114 -228995 -76674 171337 164340 257451 159604 -287986 -18747 38038 -104180 -69500
$$ packed form
15421A07822K7629h5608A32993c59285I1848D1905O7375A7347P6765J33628a46249
15409A3301b10489A8106c07473B08413h2879p8827I5147J97411a36330j26310
15399b62640B75128A28369a99169B25357a8523j85359f8495n6378N6403j09012
15389a77482E7455a56775J8844M0557j83681B58835f7919n5081C23914C2035K26972
15378B59007A00611o225k1876i6924c2529C6565L01778j65016b69038k1729h1615
15366h9665L1753F1857h0547A8515O4911B3379a93751A94085B1717e6760A68959
15354d31693B07293a95639Q2531n160j46842N5897O8D12606a40103B16338b18137
15342f0114j68881g6674A71337o997R3111r7847b87986a8747C8038a04180L4680
$$ plain form
15331 -69500 -86084 48418 -122878 -121258 -17115 102834 14987 128193 -126961 -44027 88244
15319 -195929 246396 255563 85864 185683 138561 -102494 56800 -37558 56123 125423 -154785
15307 -123996 80685 -90362 87216 112956 29867 283392 -186060 138012 -67279 139821 -222814
15295 -58756 75930 36612 126622 -24929 -8192 -63919 187670 22658 -155346 84101 -149846
15283 -146846 -142568 -17171 111807 32589 83610 125228 -32424 -85597 -176392 177219 49320
15271 -189042 65732 79252 -307244 -303903 -313872 303125 -36237 31427 -72472 97475 323149
15260 323149 -83984 -135966 37293 63857 -55151 467388 -263278 183808 254014 284443 86906
15248 358227 706415 942456 2722682 1868312 1712831 2072494 1177871 350929 177645
$$ packed form
15331f9500j6584D8418a22878J620a7115A02834A4987J13206a26961d4027H8244
15319a95929B46396R167H5864R9819m7122a02494E6800c7558E6123O9300a54785
15307a23996H0685i0362H7216K5740B9867K53525a86060A38012f7279A39821b22814
15295e8756G5930C6612R0010b4929h192n5727A87670B2658a55346H4101a49846
15283a46846M278a7171A11807C2589N1021M1618c2424n3173r0795A77219D9320
15271a89042F5732J3520c07244L341r969C03125c6237C1427g2472I7475K25674
15260C23149h3984n1982C7293K6564e5151D67388b63278A83808P0206L0429H6906
15248C58227L48188K36041J780226q54370j55481L59663q94623C50929j73284
$$ plain form
15239 177645 309313 -125370 -127250 396563 211708 380643 23878 9845 306174 290202 -24536
15227 -385225 -136705 38978 50830 64293 105690 177019 69758 232174 -62129 -164806 207710
15215 142509 250367 151634 241157 85560 287662 -141312 -185383 25536 9410 118896 -97150
15203 -42622 309665 23383 128421 458398 58376 42302 188256 -5545 138266 -75122 171190
15191 287349 112464 35353 32586 -367672 -150074 143158 -2279 119538 67341 -189017 347083
15179 128947 -56604 89790 -166246 269361 -168510 -6090 114931 -70337 367946 -113412
15168 -77937 -298013 175185 98579 6565 124075 -62017 -319776 -95318 41857 311556 262954
15157 262954 34501 110957 -185281 69222 17275 63044 -137014 -212600 133945 -51975 248699
$$ packed form
15239A77645J31668a25370j880C96563j84855J68935B3878I845K96329j5972b4536
15227c85225a36705C8978J1852J3463M1397P1329F9758J62416f2129j02677B07710
15215A42509J07858r8733Q9523H5560K02102a41312m4071B5536I410J09486i7150
15203d2622C09665B3383J05038L29977E8376j6074J45954e545A38266g5122A71190
15191B87349A12464C5353k767c67672a50074A43158b279A19538n2197a89017C47083
15179A28947e6604H9790a66246B69361a68510f090A14931g0337C67946a13412
15168g7937k20076A75185p6606F565J17510f2017k57759i5318D1857K69699m8602
15157B62954C4501P6456a85281F9222A7275M5769a37014p5586A33945e1975B48699
$$ plain form
15145 95612 -113599 51112 99637 -135728 110668 177207 22498 31424 159103 71363 -235652
15133 76187 372566 127019 127157 -128267 288294 162111 128088 229056 325252 182565 169974
15122 169974 146132 176372 174982 461276 377882 -66458 -110041 49726 -50447 157665 104709
15111 104709 -25001 345361 -163925 229066 119716 -31714 123163 79001 186623 23947
15100 75974 -6617 304214 146404 202067 281895 79930 386562 -79935 -365735 107836 375300
15089 375300 -182437 -112309 157489 187916 198804 47369 -5115 26210 -79244 105747 13145
15077 104106 150055 -94366 -29290 -155178 24391 90616 147376 57542 175874 -97598 132263
15065 239240 170099 116966 -303131 -52512 15805 317587 -64065 -109674 -3031 260158 378882
$$ packed form
15145I5612a13599E1112M8525a35728A10668O6539B2498Q926J27679G1363b35652
15133G6187K96379A27019J38a28267B88294j26183l4023J00968R6196j42687j2591
15122A69974k3842L0240j390K86294q3394f6458m3583D9726e0447A57665n2956
15111A04709b5001C45361a63925B29066j09350c1714A23163m4162J07622B3947
15100G5974f617C04214A46404N5663P9828G9930L06632g9935k85800A07836K67464
15089C75300a82437P0128A57489L0427J0888D7369e115B6210g9244A05747A3145
15077A04106M5949i4366b9290j25888B4391O6225N6760E7542J18332i7598A32263
15065B39240o9141n3133c03131e2512A5805L01782f4065m5609c031B60158J18724
$$ plain form
15054 378882 139788 186039 -120512 47038 204305 68517 -51680 349420 -69490 -148973 -141477
15043 -141477 530017 -215812 399877 199944 49242 123682 416121 -15479 512121 144051
15032 -119999 205450 278694 290758 260083 259506 124589 43869 -10723 -367 106789 151976 126340
15020 126340 291243 165204 99506 179806 424792 527297 138722 -36546 39343 194457
15010 194457 -105762 169319 477010 370252 357814 322835 156682 -22415 148144 62622
14999 211683 226355 467954 14500 -207829 -73577 73207 448613 -212067 -99435 414665
14988 46234 284846 173710 217566 312093 -37973 47123 226910 160782 -167234 -79512 355839
14976 -101477 -252001 432582 158073 78746 404943 77684 28288 424636 169411 82975
$$ packed form
15054C78882A39788M6251a20512D7038J57267F8517e1680C49420f9490p9483P496
15043a41477E30017b15812C99877j99933D9242P4440K92439a5479E12121A44051
15032a19999B05450P3244J2064l0675n77A24589D3869a0723c67A06789M5187k5636
15020A26340J64903j26039o5698Q0300K44986J02505A38722c6546C9343J55114
15010A94457a05762A69319L07691j06758j2438l4979A56682b2415A48144F2622
14999B11683J4672K41599A4500b07829g3577G3207L75406b12067i9435D14665
14988D6234K38612j11136M3856R4527c7973D7123J79787o6128a67234g9512C55839
14976a01477j50524D32582A58073G8746L26197G7684B8288L96348A69411H2975
$$ plain form
14965 384254 97501 425829 433300 205285 28039 28514 139323 223508 180833 217915 415110
14954 415110 305734 90642 502085 -27898 268050 305056 -34876 302098 335019 254597 359753
14943 359753 221441 238577 259813 116858 366749 212280 447815 317512 26995 325856
14933 325856 293224 12422 -79549 217393 47452 233241 323544 7492 318632 314459 217338
14922 217338 211211 70735 152824 255328 389645 124787 63237 -24074 -211275 32692 55116
14911 55116 115236 38233 135125 -72846 172573 320178 361183 492437 125589 92184 -75998
14899 -154206 499217 271849 175014 16548 218952 198058 -24737 87968 285018 583936
14889 583936 -42358 388744 429590 371418 400114 284931 184691 207799 433251 175381
$$ packed form
14965C84254I7501L28328P471B05285B8039M75J10809Q4185m2675L7082J97195
14954D15110j09376I0642M11443b7898B68050L7006c4876C02098L2921q0422J05156
14943C59753j38312J7136K1236A16858K49891j54469K35535j30303B6995K98861
14933C25856l2632A2422g9549B17393D7452J85789R0303G492L11140m173r7121
14922B17338o127G0735Q2089J02504J34317A24787o1550b4074j87201C2692K2424
14911E5116O0120C8233R6892g2846A72573J47605M1005J31254A25589l3405g5998
14899a54206D99217k27368r6835A6548K02404k0894b4737H7968J97050K98918
14889E83936d2358C88744M0846n8172K8696j15183j00240K3108K25452A75381
$$ plain form
14878 290504 267865 -116275 261324 170313 70195 243518 59292 594553 270405 402134
14868 402134 94012 415934 570158 -37544 453472 208847 254523 464983 491054 522825
14858 522825 498039 142173 504142 158531 476109 423632 613215 344296 329300 270293
14848 270293 5208 -171360 8921 143548 243921 185223 331468 287199 8670 134435 398280
14837 398280 103472 326928 335091 115598 495203 329569 448231 143424 504531 385480
14827 385480 490399 276869 285876 93326 231466 390053 529656 347280 838580 145202
14816 486172 94700 541988 310222 441253 735049 451144 41023 392573 446964 171923
14805 140188 336244 383114 554574 534647 475786 403822 579763 444737 320021 397709
$$ packed form
14878B90504k2639a16275B61324r1011G0195J73323E9292N35261B70405J31729
14868D02134I4012L21922J54224c7544D53472B08847M5676K10460K6071L1771
14858E22825k4786A42173L61969A58531L17578n2477J89583k68919j4996n9007
14848B70293E208a71360H921J34627J00373n8698J46245m4269H670J25765K63845
14837C98280A03472K23456Q163A15598L79605j65634J18662A43424L61107j19051
14827C85480J04919k13530R007I3326J38140J58587J39603j82376M91300A45202
14816D86172I4700M47288k31766J31031K93796k83905D1023L51550N4391A71923
14805A40188J96056M6870J71460j9927n8861p1964J75941j35026j24716P7688
$$ plain form
14795 397709 425984 629219 434227 494388 149163 546804 169529 515735 489356 296914
14785 296914 369523 479128 604977 552231 258156 444713 675687 346112 693315 434839
14775 434839 335707 338211 181535 468988 491916 516092 594838 83647 91211 488869 175283
14763 693423 271750 569368 359091 443748 588420 226065 532278 714982 252538 432493
14753 432493 199851 117037 888337 484111 662979 701061 700585 470687 520467 440123 489010
14742 489010 906304 771415 474299 985940 539759 520432 735255 368289 318680 639017
14732 639017 693342 538916 334421 573437 478809 566376 664294 777280 595659 760937
14722 760937 665561 538969 665262 753047 719453 447711 647826 524595 376154 780101
$$ packed form
14795C97709K8275K03235j94992O0161A49163L97641A69529L46206k6379j92442
14785B96914P2609J09605J25849n2746B58156J86557K30974l29575L47203k58476
14775D34839r9132K504j56676K87453K2928K4176P8746H3647P564L97658A75283
14763F93423B71750K97618k10277Q4657J44672B26065L06213J82704B52538J79955
14753D32493A99851q2814P71300m04226J78868L8082m76k29898M9780q0344M8887
14742D89010M17294j34889k97116N11641m46181j9327K14823l66966m9609L20337
14732F39017N4325j54426k04495K39016r4628Q7567R7918J12986j81621J65278
14722G60937r5376j26592J26293Q7785l3594k71742K00115j23231j48441M03947
$$ plain form
14712 780101 549657 547910 582723 650023 832349 537662 635484 698041 399175 736257 799991
14701 799991 1018481 373904 433936 913418 892172 992187 873872 956642 775406 412798
14691 412798 668252 704511 695124 450189 653615 941501 869498 938355 775270 766942 890413
14680 890413 542203 674468 941809 840790 948841 724273 894938 406112 778119 551962
14670 551962 693681 692673 752919 928176 934524 556920 798918 566199 901440 645524
14660 645524 888388 857353 745322 836150 1131172 1045352 793449 711215 1066388 927072
14650 927072 1110207 890340 783230 1046602 819285 650848 778469 1099268 609271 819989
14640 819989 960767 699812 904576 967916 1017079 986072 603414 1051621 916869 959454
$$ packed form
14712G80101k30444j747L4813O7300J82326k94687R7822O2557k98866L37082O3734
14701G99991K18490C73904O0032M79482k1246J00015j18315Q2770j81236l62608
14691D12798K55454L6259r387k44935K03426K87886p2003O8857j63085q328J23471
14680H90413l48210J32265K67341j01019J08051k24568J70665D06112L72007k26157
14670E51962J41719j008O0246J75257O348l77604K41998k32719L35241k55916
14660F45524K42864l1035j12031R0828K95022q5820k51903q2234L55173j39316
14650I27072J83135k19867j07110K63372k27317j68437J27621L20799m89997K10718
14640H19989J40778k60955K04764O3340M9163l1007l82658M48207j34752M2585
$$ plain form
14630 959454 1003460 969248 792009 1104296 1167182 1259500 982162 1191912 1119606 864397
14620 864397 1126773 1113526 921816 1193727 1104812 1287277 944527 1046510 1112676 1320389
14610 1320389 1333590 1151528 1145981 1205251 1129250 1501470 1369412 1421336 1425946 1381327 1270701
14599 1270701 1030578 940049 1342266 1173796 1222796 1299937 1381771 1345413 1279938 1203880 1349582
14588 1349582 1311136 1306136 1149049 1497852 1637128 1734691 1749276 1345287 1694025 1676685
14578 1676685 1187610 1839870 1707318 1654511 1700951 1782941 1733787 1441173 1509186 1527516
14568 1527516 1588954 1415015 1815322 1712747 1810277 1955771 1823891 2059275 2268883 2345844
14558 2345844 2056486 2252169 2464352 2651378 2565296 2974997 3418515 3801474 4335743 5720668
$$ packed form
14630I59454M4006l4212j77239L12287O2886R2318k77338K09750p2306k55209
14620H64397K62376j3247j91710K71911q8915J82465l42750J01983O6166K07713
14610A320389J3201j82062n547N9270p6001L72220j32058N1924M610m4619j10626
14599A270701k40123r0529M02217j68470M9000P7141Q1834l6358o5475p6058J45702
14588A349582l8446n000j57087L48803J39276R7563J4585m03989L48738j7340
14578A676685m89075O52260j32552n2807M6440Q1990m9154k92614O8013J8330
14568A527516O1438j73939M00307j02575R7530J45494j31880K35384K09608P6961
14558B345844k89358J95683K12183J87026q6082M09701M43518L82959N34269J384925
$$ plain form
14548 5720668 9268317 18445926 36592239 40998144 16424508 6892219 6493498 6145814
14540 6145814 2751451 1849927 1602946 1659094 1489652 1775139 1391296 1389940 1567899 1045869
14530 1045869 1581653 1237122 1715904 1867227 1860995 1742320 1681394 1643160 1693660 1770731
14520 1770731 2017989 1415954 1988145 2058442 2210861 2173557 1725303 1867286 2076397 2292894
14510 2292894 2040334 2358670 2220303 2273362 2182372 2381809 2420306 2401226 2487245 2469360
14500 2469360 2339321 2377212 2394978 2564328 2471263 2584290 2586929 2708000 2521814 2375644
14490 2375644 2395866 2716086 2749385 2844472 3019233 2624329 2947439 2969752 3244611 2816410
14480 2816410 3134841 2889242 3216496 3002079 3088272 3401827 3141135 3360128 3464397 3338598
$$ packed form
14548E720668L547649R177609J8146313M405905A6424508F892219l98721l47684
14540F145814B751451r01524k46981N6148j69442K85487l83843j356J77959n22030
14530A045869N35784l44531M78782J51323o232j18675o0926l8234N0500P7071
14520A770731K47258o02035N72191P0297J52419l7304m48254J41983K09111K16497
14510B292894k52560L18336j38367N3059r0990J99437L8497j9080Q6019j7885
14500B469360j30039L7891J7766J69350r3065J13027K639J21071j86186j46170
14490B375644K0222L20220L3299R5087J74761l94904L23110K2313K74859m28201
14480B816410L18431k45599L27254k14417Q6193L13555k60692K18993J04269j25799
$$ plain form
14470 3338598 3406476 3308070 3599871 3372143 3498298 3660892 3696612 3405258 3494703 3708699
14460 3708699 3671345 3786358 3653832 3887370 3818477 3781905 3905910 4156835 3888559 3912810
14450 3912810 4287354 4204670 4322283 4436453 4484919 4373319 4291584 4590504 4378320 4680052
14440 4680052 4954572 4682854 4917273 4486672 5232161 5032378 5016338 5126421 5085056 5188174
14430 5188174 5246594 5387465 5299094 5901767 5988341 5583351 5784348 5674665 6140579 5951786
14420 5951786 6296678 6311717 6282740 6714198 6650943 6489799 6771243 7051331 6876054 6763435
14410 6763435 7129261 7332083 7490948 7490146 7587602 7824037 7816695 8064959 8126871 7913592 8314611
14399 8314611 8110520 8513961 8475500 8713575 8978895 8946241 9044329 9519592 9399815 9818325
$$ packed form
14470C338598O7878r8406K91801k27728J26155J62594L5720k91354Q9445K13996
14460C708699l7354J15013j32526K33538o8893l6572J24005K50925k68276K4251
14450C912810L74544q2684J17613J14170M8466j11600q1735K98920k12184L01732
14440D680052K74520k71718K34419m30601P45489j99783j6040J10083m1365J03118
14430E188174N8420J40871q8371O02673Q6574m04990K00997j09683M65914j88793
14420E951786L44892J5039k8977M31458o3255j61144K81444K80088j75277j12619
14410F763435L65826K02822J58865q02R7456K36435p342K48264O1912k13279M01019
14399H314611k04091M03441l8461K38075K65320l2654R8088M75263j19777M18510
$$ plain form
14389 9818325 9975336 9983645 10189894 10350161 10356250 10683252 10968944 11427602 11495663 11555006
14379 11555006 11401478 12198819 12143339 12329480 12437985 13103906 13208757 13660685 13445557
14370 13445557 14239389 14182023 14583728 14743335 15059584 15597262 15775887 16146928 16643889
14361 16643889 16627467 17538664 17752719 17702738 18311633 18842861 19217465 19832643 20021643 20490590
14351 20490590 21118491 21666438 22210883 22932205 23009092 24171737 24633353 25085081 26317102
14342 26317102 26480842 27179522 28272640 28868485 29611617 30883017 31274985 32227160 33392797
14333 33392797 34007905 34889655 36148912 37365022 38535238 39482140 40631025 42279058
14325 42279058 43696356 45053079 46779780 48027809 49820309 51817051 53522965 55642945
$$ packed form
14389I818325J57011Q309K06249J60267O089L27002K85692M58658O8061N9343
14379A1555006j53528P97341n5480J86141J08505O65921J04851M51928k15128
14370A3445557P93832n7366M01705J59607L16249N37678J78625L71041M96961
14361A6643889j6422R11197K14055m9981O08895N31228L74604O15178J89000M68947
14351B0490590O27901N47947N44445P21322P6887J162645M61616M51728J232021
14342B6317102J63740O98680J093118N95845P43132J271400L91968R52175J165637
14333C3392797O15108Q81750J259257J216110J170216R46902J148885J648033
14325D2279058J417298J356723J726701J248029J792500J996742J705914K119980
$$ plain form
14317 55642945 57846258 59740495 62291164 64866681 67160024 69965036 73095442 75914473
14309 75914473 79683075 82912083 86736653 90598701 94821340 99193412 103923835 108869401
14301 108869401 114283457 119932307 126388111 132853270 139747305 146996988 154646910 163113163
14293 163113163 172052672 181781401 191988449 202551056 214102342 226153684 238421077
14286 238421077 251585815 265517634 279913034 294718191 310057400 325502784 341146673
14279 341146673 356692554 372157416 386906647 400580537 413708454 425341059 434685719
14272 434685719 439091975 440139997 440626514 440158137 438424327 436237479 429618781 420719743
14264 420719743 409452356 395889019 381193879 365350178 348643734 332381717 315947588
$$ packed form
14317E5642945K203313J894237K550669K575517K293343K805012L130406K819031
14309G5914473L768602L229008L824570L862048M222639M372072M730423M945566
14301A08869401N414056N648850O455804O465159O894035P249683P649922Q466253
14293A63113163Q939509R728729J0207048J0562607J1551286J2051342J2267393
14286B38421077J3164738J3931819J4395400J4805157J5339209J5445384J5643889
14279C41146673J5545881J5464862J4749231J3673890J3127917J1632605R344660
14272D34685719M406256J048022M86517m68377j733810k186848o618698q899038
14264D20719743j1267387j3563337j4695140j5843701j6706444j6262017j6434129
$$ plain form
14257 315947588 299659675 284104698 268721072 253810989 239958486 228439421 216887261
14250 216887261 204801533 193540856 183078758 173306483 163632096 155565458 148020161
14243 148020161 140232200 133339004 126522023 119931146 114273719 109579416 104388008 99891285
14235 99891285 95138807 90870092 86781955 83280131 80302434 76727431 73300230 70556393
14227 70556393 67587907 65257746 62303079 59940591 57926870 55973338 53860771 52162032
14219 52162032 50220442 48291271 46559238 45134048 43329884 42524086 41219041 39902436
14211 39902436 38314566 37267319 35718679 35290233 34622419 33544231 32230330 31325311
14203 31325311 30376928 29706913 29087372 28256029 27539910 26567937 25781650 25164129 24285386
$$ packed form
14257C15947588j6287913j5554977j5383626j4910083j3852503j1519065j1552160
14250B16887261j2085728j1260677j0462098r772275r674387q066638p545297
14243A48020161p787961o893196o816981o590877n657427m694303n191408m496723
14235I9891285m752478m268715m088137l501824k977697l575003l427201k743837
14227G0556393k968486k330161k954667k362488k013721j953532k112567j698739
14219E2162032j941590j929171j732033j425190j804164q05798j305045j316605
14211C9902436j587870j047247j548640m28446o67814j078188j313901r05019
14203C1325311r48383o70015o19541q31343p16119r71973p86287o17521q78743
$$ plain form
14194 24285386 24088861 23220964 23055813 22061268 21465806 21007516 20943891 20301615 19522479
14185 19522479 19346712 18680886 18491455 17747220 17794661 16942999 16961591 16469637 16084330 15728761
14175 15728761 15667309 15073605 14915486 14359136 14232590 14184103 13563091 13304320 13268056 12810275
14165 12810275 12740569 12439091 12419599 11984950 11671943 11898898 11653269 11378931 11079756 10731433
14155 10731433 10597008 10552809 10337343 10101306 9713201 9847091 9555498 9729434 9338541
14146 9338541 9250672 9180051 8886190 8865483 8517864 8728943 8354627 8160734 8256034 7921199
14136 7921199 7731092 7848512 7355880 7609061 7179928 6879869 7255416 7005592 6725728
14127 6725728 6849251 6934914 6678472 6528970 6729388 6277387 6529381 6151383 6258463 6081953
$$ packed form
14194B4285386j96525q67897j65151r94545n95462m58290o3625o42276p79136
14185A9522479j75767o65826j89431p44235M7441q51662J8592m91954l85307l55569
14175A5728761o1452n93704j58119n56350j26546m8487o21012k58771l6264m57781
14165A2810275o9706l01478j9492m34649l13007K26955k45629k74338k99175l48323
14155A0731433j34425m4199k15466k36037l88105J33890k91593J73936l90893
14146I338541q7869p0621k93861k0707l47619K11079l74316j93893R5300l34835
14136G921199j90107J17420m92632K53181m29133l00059L75547k49824k79864
14127F725728J23523Q5663k56442j49502K00418m52001K51994l77998J07080j76510
$$ plain form
14117 6081953 6302791 5835772 6067677 5586648 5763835 5382648 5602850 5394903 5676959
14108 5676959 5320699 5494529 4922143 5139899 5181945 5066087 5037313 4943207 4876546 4745127
14098 4745127 4532592 4865116 4550931 4590786 4755321 4512748 4167372 4642771 4394604 4286263
14088 4286263 4144059 4418914 4119853 4180965 3850508 3888909 3974728 3882118 4022022 3888166
14078 3888166 3984784 3622034 3907727 3705107 3605663 3634941 3638956 3520158 3277012 3702655
14068 3702655 3548800 3652003 3189929 3465464 3323085 3190009 3381018 3396317 3301757 3012965
14058 3012965 3379135 3115303 3016339 3178871 3311692 2706126 3201621 2763468 2968363 3000348
14048 3000348 2845270 2531945 2969606 2597764 2558276 2818728 2606363 2831248 2446587 3034174
$$ packed form
14117F081953K20838m67019K31905m81029J77187l81187K20202k07947K82056
14108E676959l56260J73830n72386K17756M2046j15858k8774r4106o6661j31419
14098D745127k12535L32524l14185L9855J64535k42573l45376M75399k48167j08341
14088D286263j42204K74855k99061O1112l30457L8401Q5819r2610J39904j33856
14078C888166R6618l62750K85693k02620r9444K9278M015j18798k43146M25643
14068C702655j53855J03203m62074K75535j42379j33076J91009J5299r4560k88792
14058C012965L66170k63832r8964J62532J32821o05566M95495m38153K04895L1985
14048C000348j55078l13325M37661l71842l9488K60452k12365K24885l84661N87587
$$ plain form
14038 3034174 2582273 2723147 2652526 2767944 2541943 2478302 2319458 2554769 2441625 2197775
14028 2197775 2466900 2375254 2511540 2261331 2423891 2441988 2437052 2010121 2069272 2242571
14018 2242571 2025078 2215440 2366320 2176303 2069009 2308423 1977843 2194556 2016977
14009 2016977 2039652 1882358 1898495 2036038 1783838 1959597 2052315 1836969 1785278 2045626
13999 2045626 1609100 1949573 1326269 2114310 1821735 1762801 1783621 1451612 2041493 2429305
13989 2429305 2643785 4683965 11130465 28514854 45627808 23622983 10955074 6413001
13981 6413001 4741389 3753360 3687341 2972578 2799749 2431262 2394605 2652179 2106131 2080266
13971 2080266 1842998 2084181 2170590 2100249 2106189 2077146 1946307 1891100 1950908 1695430 1628431
$$ packed form
14038C034174m51901J40874p0621J15418k26001o3641j58844K35311j13144k43850
14028B197775K69125r1646J36286k50209J62560J8097m936m26931N9151J73299
14018B242571k17493J90362J50880j90017j07294K39414l30580K16713j77579
14009B016977K2675j57294J6137J37543k52200J75759R2718k15346n1691K60348
13999B045626m36526L40473o23304P88041k92575n8934K0820l32009N89881L87812
13989B429305K14480K040180O446500J7384389J7112954k2004825A0955074m542073
13981F413001j671612r88029o6019p14763j72829l68487l6657K57574n46048k5865
13971B080266k37268K41183Q6409p0341N940k9043j30839n5207N9808k55478o6999
$$ plain form
13960 1628431 1715454 1808282 1680089 1533691 1582525 1554969 1697388 1430072 1946382 1623824
13950 1623824 1435388 1572254 1305718 1751383 1425072 1289097 1378895 1138657 1530032 1529462
13940 1529462 1172403 1716932 1450890 1368389 1590748 1279996 1132974 1486098 1257027 1291358
13930 1291358 1276325 1044503 1256101 1333900 1454834 1543492 1276004 1224507 1426366 1201080
13920 1201080 1322451 1499223 1311383 1245869 1214985 1295714 1270769 1390481 1318324 1025226
13910 1025226 1069720 1201847 1238019 1063197 1063282 1027205 931910 1396006 1361349 807475 1202270
13899 1202270 1187784 1089096 953288 1046472 1440394 980290 952096 1284821 1174671 977447
13889 977447 1061163 816851 1300735 1107721 1121077 1123886 861337 1138037 953589 884099
$$ packed form
13960A628431Q7023R2828j28193j46398M8834k7556J42419k67316N16310l22558
13950A623824j88436J36866k66536M45665l26311j35975Q9798k40238L91375n70
13940A529462l57059N44529k66042q2501K22359l10752j47022L53124k29071L4331
13930A291358j5033k31822K11598P7799J20934Q8658k67488n1497K01859k25286
13920A201080J21371J76772j87840o5514l0884Q0729k4945J19712p2157k93098
13910A025226M4494J32127L6172j74822Q5l6077r5295M64096l4657n53874L94795
13899A202270j4486r8688j35808R3184L93922m60104k8194L32725j10150j97224
13889I77447Q3716k44312M83884j93014J3356K809k62549K76700j84448o9490
$$ plain form
13879 884099 910490 1004685 687819 1019371 1436501 951345 710642 1056734 1055528 899295
13869 899295 1034545 709530 845105 890786 796794 1238986 515649 770983 843316 620287
13859 620287 688531 766765 900560 767419 952325 1090186 727270 879118 870060 766073
13849 766073 1197845 1033055 833272 805460 820329 737948 635728 730594 942135 494271
13839 494271 668759 1092039 671361 559942 848008 1070581 827760 785166 708878 512529
13829 512529 739150 733680 1068672 639280 771860 929595 881740 704780 802824 815824
13819 815824 738426 788955 488037 579653 701389 520711 424446 852360 830728 452585
13809 452585 441691 1039492 810567 681547 638943 843615 592396 641769 364288 607318
$$ packed form
13879H84099K6391R4195l16866L31552M17130m85156k40703L46092j206j56233
13869H99295J35250l25015J35575M5681r3992M42192E15649K55334P2333k23029
13859F20287O8244P8234J33795j33141J84906J37861l62916J51848r058j03987
13849G66073M31772j64790j99783k7812J4869q2381j02220R4866K11541m47864
13839D94271J74488M23280m20678j11419K88066K22573k42821m2594p6288j96349
13829E12529K26621n470L34992m29392J32580J57735m7855j76960R8044J3000
13819H15824p7398N0529l00918R1616J21736j80678r6265M27914k1632l78143
13809D52585j0894N97801k28925j29020m2604K04672k51219M9373k77481K43030
$$ plain form
13799 607318 1029925 751616 693621 646490 633279 658705 905130 763787 780349 483070
13789 483070 662453 415460 591965 923606 394216 703866 504899 737457 348893 695910
13779 695910 620505 1115174 798169 868644 364848 717311 406751 584458 521062 624426
13769 624426 666613 682121 732612 651596 255898 601176 660503 342642 420312 601509 566092
13758 566092 413578 27875 293376 432998 148878 533324 591496 791169 565630 447202
13748 447202 542723 574051 256051 188366 546777 328312 422472 513319 262897 594197
13738 594197 429197 584071 273289 420563 326360 437739 585100 372827 593861 478768
13728 478768 625342 724053 330755 690042 375732 403653 513529 324450 499516 747197
$$ packed form
13799F07318M22607k78309n7995m7131j3211K5426K46425j41343J6562k97279
13789D83070J79383k46993J76505L31641C94216L09650j98967K32558C48893L47017
13779F95910p5405M94669l17005P0475C64848L52463l10560J77707o3396J03364
13769F24426M2187J5508N0491q1016B55898L45278N9327l17861P7670J81197l5417
13758E66092j52514B7875K65501J39622A48878L84446N8172J99673k25539j18428
13748D47202R5521L1328B56051o7685L58411k18465R4160R0847k50422L31300
13738E94197j65000J54874B73289J47274r4203J11379J47361k12273K21034j15093
13728D78768J46574R8711C30755L59287l14310K7921J09876j89079J75066K47681
$$ plain form
13718 747197 372784 870612 210765 579567 675034 428163 320772 55438 560394 511490
13708 511490 246714 522443 452750 444071 229899 427740 504762 692492 583033 621197
13698 621197 550435 287796 667418 363776 687422 275866 354031 541300 531138 498029
13688 498029 329798 432956 525272 430257 635363 806852 331223 326509 494044 323339
13678 323339 156238 420435 571546 232735 176629 533798 586543 169146 470155 197381
13667 272882 607835 421986 346466 274058 209231 73604 362514 659663 183505 148536
13657 148536 590703 504632 368297 483938 346585 413570 533670 267358 203844 414787
13647 414787 623637 151781 331218 878056 494517 548405 409151 184109 238931 742675
$$ packed form
13718G47197C72784M97828B10765L68802R5467k46871j07391E5438N04956m8904
13708E11490B46714K75729o9693q679k14172J97841P7022J87730j09459L8164
13698F21197p0762k62639L79622l03642L23646B75866P8165J87269j0162l3109
13688D98029j68231J03158R2316r5015K05106J71489C31223m714J67535j70705
13678C23339A56238K64197J51111B32735n6106L57169N2745A69146L01009A97381
13667B72882L34953j85849p5520p2408o4827G3604K88910K97149A83505l4969
13657A48536M42167q6071j36335J15641j37353O6985J20100k66312o3514K10943
13647D14787K08850A51781J79437N46838l83539N3888j39254A84109N4822N03744
$$ plain form
13637 742675 255267 274702 38736 555369 516181 304668 333047 352664 226458 435933
13627 435933 275468 198008 458583 67813 405357 54331 371455 480986 355291 336026
13617 336026 290205 389697 273483 274157 468844 121552 551264 428291 418680 500650 29819
13605 43015 318700 164871 253800 239866 541568 389456 94770 326536 119309 372366
13595 372366 384407 348833 106161 346560 361696 119415 330559 259603 153811 170207
13585 170207 298084 342113 399310 460970 -140079 701128 181196 -53353 354424 120876
13574 251719 447688 304090 318508 314462 352856 207782 342837 411797 56556 325190 666251
13563 666251 453753 -8000 352810 291606 484831 154248 45379 456099 306766 425192
$$ packed form
13637G42675B55267J9435C8736N16633l9188k11513K8379J9617j26206K09475
13627D35933j60465p7460K60575F7813L37544E4331L17124J09531j25695j9265
13617C36026m5821R9492j16214O74J94687A21552M29712j22973r611Q1970B9819
13605D3015K75685j53829Q8929j3934L01702j52112I4770K31766A19309K53057
13595C72366J2041l5574A06161K40399J5136A19415K11144p0956j05792J6396
13585A70207J27877M4029N7197O1660a40079G01128A81196e3353C54424A20876
13574B51719J95969j43598J4418m046L8394j45074J35055O8960E6556K68634L41061
13563F66251k12498h000C52810o1204J93225A54248D5379M10720j49333J18426
$$ plain form
13553 425192 308549 8939 50607 249895 309890 390455 -268513 271220 304171 -132444 72392
13541 115703 271623 339264 214108 92524 309826 343615 539402 89100 252310 628739
13531 628739 -72225 258105 122120 35652 440500 332646 359725 -76019 -178749 238208
13520 278916 -220002 189340 48646 129150 130192 -46297 228310 208632 96530 601534 264210
13508 137952 378279 406276 -232502 236149 311699 384481 184390 189494 214892 201907 581502
13497 581502 239539 392522 53182 -125525 45881 430770 228163 491717 116185 290311
13487 290311 380912 283077 39215 345361 25497 310887 244208 323430 238160 296922 235462
13476 235462 -9690 205118 244955 80242 445895 255236 189868 132947 363017 124916 25029
$$ packed form
13553D25192j16643H939M1668J99288N9995Q0565b68513B71220L2951a32444G2392
13541A15703J55920O7641j25156I2524K17302L3789J95787H9100J63210L76429
13531F28739g2225B58105A22120C5652M04848j07854K7079g6019j02730B38208
13520B78916b20002A89340D8646Q0504J042d6297B28310j9678I6530N05004B64210
13508A37952K40327K7997b32502B36149P5550P2782A84390N104K5398j2985L79595
13497E81502B39539J52983E3182a25525D5881L84889k02607K63554A16185J74126
13487B90311R0601r7835C9215L06146B5497K85390o6679P9222q5270N8762o1460
13476B35462i690B05118L9837H0242L65653j90659o5368n6921K30070A24916B5029
$$ plain form
13464 150981 -24684 -94565 33061 317622 455345 214644 351436 -95380 -69407 -8803 -114718
13453 -114718 33163 309759 -117071 101934 426157 290711 266852 94188 300538 58217
13442 235711 -67473 -27593 62183 259167 168621 82470 76397 338157 157833 53477 250393
13431 250393 115659 317996 26829 169949 19857 306890 348206 317758 390255 234192
13421 234192 476017 265963 -20624 -25669 223183 -38692 169285 224897 148050 135921 263664
13410 263664 205254 -204710 -230381 -37685 126260 83217 253184 8569 127408 -54743 104062
13398 133973 -44274 -55631 729357 329704 -97837 238344 55299 20083 -298479 146589
13387 123469 336619 241753 49158 467528 154960 58574 360816 98181 -149052 125337
$$ packed form
13464A50981b4684o9881C3061K84561J37723B14644J36792i5380K5973h803j05915
13453a14718C3163K76596a17071A01934L24223j35446k3859I4188K06350E8217
13442B35711f7473b7593F2183J96984r0546H2470o073K61760A57833E3477J96916
13431B50393A15659K02337B6829J43120A9857K87033M1316l0448P2497j56063
13421B34192K41825k10054b0624n045B23183c8692A69285N5612p6847j2129J27743
13410B63664n8410b04710k5671c7685A26260m3043J69967H569J18839e4743A04062
13398A33973d4274j1357G29357C29704i7837B38344E5299B0083b98479A46589
13387A23469K13150r4866D9158M18370A54960E8574L02242I8181a49052A25337
$$ plain form
13376 -177295 34747 241762 -49283 189601 154188 383799 -216218 92565 430680 -137663
13365 268038 298170 242104 167408 15363 116646 212672 189082 317460 161305 55330 331536
13354 331536 -161549 118031 -2611 87825 136968 277689 292690 75109 290257 57057 530277
13343 530277 233004 583125 7168 85128 379514 332803 251398 266297 410386 139321 17472
13331 23287 152694 237366 268063 357125 173733 166047 47426 -30945 187393 93615 453722
13320 453722 -92944 271464 -2509 -47071 547183 249488 189840 680784 279008 -14344 204995
13308 129499 246127 186313 -21640 127918 -21516 23315 -14103 238007 -48016 186213 186627
13297 186627 132160 85002 61262 144119 -16101 311809 -122887 353392 -496 125307 25687
$$ packed form
13376a77295C4747K07015d9283A89601l5413K29611b16218I2565L38115a37663
13365B68038L0132n6066p4696A5363J01283R6026k3590J28378j56155E5330K76206
13354C31536a61549A18031b611H7825M9143J40721J5001G5109K15148E7057M73220
13343E30277B33004L50121G168P7960K94386m6711q1405J4899J44089A39321A7472
13331B3287J29407Q4672L0697Q9062A73733p686D7426c0945A87393I3615L60107
13320D53722i2944B71464b509m4562E47183B49488n9648M90944B79008a4344B04995
13308A29499J16628n9814b1640A27918b1516B3315a4103B38007d8016A86213M14
13297A86627n4467m7158k3740Q2857a6101C11809a22887C53392d96A25307B5687
$$ plain form
13285 331995 343146 576470 303428 31820 -18662 -41140 191798 112606 211885 129087 107841
13274 107841 -77201 158315 286184 -56295 151013 57558 31701 148014 299904 213103
13264 213103 143004 324920 70045 -39342 305074 323570 -12708 345191 -103328 -79228 332091
13252 113078 69938 81703 103757 294928 153107 -33000 39019 -212790 89463 63887 187159
13241 187159 -6029 -2940 -61526 524973 202369 29193 -27912 401820 183358 -106054 300497
13229 262609 97227 219243 205741 -132387 250588 113755 183116 113700 47479 -15080 210210
13217 -76514 181034 8245 495268 4540 -71205 25648 104301 200118 -93284 -207886 316890
13205 -195315 82635 29996 -153648 243081 355807 180852 181047 14778 32012 61707 448839
$$ packed form
13285C31995J1151K33324k73042C1820a8662k2478A91798p9192R9279q2798k1246
13274A07841g7201A58315J27869e6295A51013E7558k5857J16313J51890q6801
13264B13103p0099J81916G0045c9342C05074J8496a2708C45191a03328K4100C32091
13252A13078m3140J1765K2054J91171j41821c3000C9019b12790H9463k5576J23272
13241A87159f029b940n8586E24973B02369B9193b7912D01820A83358a06054C00497
13229B62609I7227J22016j3502a32387B50588A13755O9361o9416D7479a5080B10210
13217g6514A81034H245M87023D540g1205B5648P8653R5817i3284j14602C16890
13205a95315H2635B9996a53648B43081J12726j74955J95A4778J7234K9695L87132
$$ plain form
13194 448839 -172864 292244 -34654 33286 109004 68194 18569 174309 171002 130238 -69013
13182 168294 80721 -35712 -305644 173718 61123 370011 6010 -124164 107239 87266 -381949
13170 179756 -38423 238281 490967 168857 334532 163940 246840 -446354 352007 -139713
13159 -64816 114467 60375 140114 -78231 18004 -99267 195820 173985 46372 41340 142034
13148 142034 217069 -136185 -213583 -100594 -112158 47898 191131 79685 -112703 87669 150106
13137 150106 91032 -97614 134514 121710 -18778 172704 221430 -346088 161613 291187
13127 291187 14694 -73617 -36163 -113320 88845 -126155 153386 43861 -8571 264017 81420
13115 207490 -111690 199696 147194 29789 -75103 -34765 164498 8467 -231782 -520728 104587
$$ packed form
13194D48839a72864B92244c4654C3286P5718m0810A8569J55740l307m0764f9013
13182A68294H0721c5712k69932A73718F1123L08888F010a24164A07239j9973c81949
13170A79756c8423B38281K52686A68857J65675A63940Q2900d46354C52007a39713
13159f4816A14467n4092P9739g8231A8004i9267A95820k1835D6372n032J00694
13148A42034P5035a36185p7398a00594j1564D7898J43233G9685a12703H7669O2437
13137A50106n9074i7614A34514j2804a8778A72704M8726c46088A61613J29574
13127B91187A4694g3617c6163p7157H8845a26155A53386D3861h571B64017H1420
13115B07490a11690A99696n2502B9789g5103c4765A64498H467b31782k88946A04587
$$ plain form
13103 375945 -11251 -92509 -67680 121944 -34746 -96166 41542 -14100 318031 16836 107180
13092 107180 199935 115681 316045 -113547 91850 100436 110169 277851 -339393 -207811 -67614
13080 -251821 124132 -133996 283473 139552 91312 -90179 37925 -54075 101860 99777 238616
13069 238616 -251595 -158466 -234451 21893 122496 141324 28312 340420 -67182 83848 128825
13058 128825 -73830 -20232 -188822 -143048 109210 -308700 -25258 -10317 2239 143365 -185584
13046 54061 6844 -196907 402452 227124 154191 425660 -329751 229161 -103896 75426
13035 -188163 -9774 89768 -14683 124126 -41530 -30141 -310646 55886 -103966 296073 17584
13023 129560 94599 -87137 -174233 222032 54974 169076 1008 235303 18928 137915 228170
$$ packed form
13103C75945a1251q1258K4829A21944c4746o1420D1542a4100C18031A6836R0344
13092A07180R2755q4254K00364a13547I1850Q586R733J67682c39393J31582f7614
13080b51821A24132a33996B83473A39552m8240i0179C7925e4075A01860k083J38839
13069B38616b51595R3129p5985B1893J00603J8828B8312L12108f7182H3848M4977
13058A28825g3830b0232j68590M5774A09210c08700b5258a0317B239J41126a85584
13046E4061F844a96907D02452j75328p2933K71469c29751B29161a03896G5426
13035a88163i774H9768a4683A24126d1530J1389k80505E5886a03966B96073A7584
13023A29560l4961h7137q7096B22032E4974J14102A008K34295A8928J18987R0255
$$ plain form
13012 228170 18060 -118644 40601 67342 89 159420 -342133 9491 74788 158889 32293 6921
12999 59177 81036 -73722 -295416 -162308 13410 27183 17147 -120449 -48585 -92014 130256
12987 -4608 -217118 57255 233163 -457167 128824 88920 186918 53712 269185 30414 237069
12976 237069 -30938 351619 339346 -204679 48798 95602 -201 475988 18485 272667 297461
12965 297461 -97015 -134574 -106136 126966 202447 -244052 -190297 255018 1800 283002 239632
12954 239632 -236010 -39446 215251 424898 204143 206495 69620 -73655 -13987 -292437 91375
12942 -295812 -161683 -249850 195957 195696 214072 -44308 76840 328060 131567 210372 -43604
12930 -211459 196643 -133437 238874 74662 113719 -47699 -263216 -236015 -195063 319332
$$ packed form
13012B28170A8060a18644D0601K6741H9J59331c42133I491O5297Q4101C2293F921
12999E9177K1859g3722k21694J33108A3410J3773j0036a20449d8585m3429A30256
12987d608k12510E7255J75908d57167A28824l9904R7998E3712K15473C0414K06655
12976B37069c0938C51619j2273b04679D8798M6804b01D75988A8485K54182K4794
12965B97461i7015l7559K8438A26966P5481b44052N3755B55018A800K81202m3370
12954B39632b36010c9446B15251K09647B04143K352F9620g3655a3987k78450I1375
12942b95812J34129q8167A95957k61J8376d4308G6840K51220A31567P8805d3604
12930b11459A96643a33437B38874G4662L9057d7699k15517K7201M0952C19332
$$ plain form
12919 -132871 -340420 -59428 71194 -349812 254142 -463821 172523 -251530 -100691 -71782
12909 -71782 -45221 65128 8951 199550 147315 -981 -1022 -87489 -134846 58458 132946 272860
12897 272860 -219230 -2438 -209231 16235 -171372 184082 364362 -123845 138731 150009
12887 150009 -117903 6429 246714 -73815 232756 295377 212785 -58058 103399 -32479 139045
12875 284180 229672 193850 108077 19815 -51691 30555 108756 1616 -284629 -186045 51296
12863 18169 226012 -107940 -81235 -64906 -90848 12124 -95859 89796 -54519 -45988 117228
12851 -75669 -184408 175428 122934 -2427 17574 157553 184382 2734 215129 39491 -262628
12839 18900 -76665 -78598 75204 -73730 -38455 69520 98279 -279348 114039 185758 -32251
$$ packed form
12919a32871k07549e9428G1194c49812B54142d63821A72523b51530a00691K8909
12909g1782K6561F5128H951J90599n2235i81m1q6467m7357E8458P4488J39914
12897B72860b19230b438k06793A6235a71372A84082J80280a23845A38731J1278
12887A50009a17903F429K40285g3815B32756O2621q2592e8058A03399c2479A39045
12875B84180n4508l5822q5773A9815e1691C0555P8201A616b84629R8584E1296
12863A8169K07843a07940K6705J6329k5942A2124i5859H9796e4519Q531A17228
12851g5669j08739A75428n2494b427A7574J39979K6829B734K12395C9491b62628
12839A8900g6665j933G5204g3730L5275F9520K8759b79348A14039P1719c2251
$$ plain form
12827 273966 -179402 266057 -54405 -234329 348023 244033 -245873 -122781 -21165 14977
12816 -86427 -57061 -245604 202829 62641 349017 86567 204602 -306697 -309856 -59101 76638
12804 58079 114934 -88547 -146460 -32880 -165160 32408 293582 28303 215693 31365 87593
12793 87593 113672 217661 145639 144434 26854 -32891 -97170 122218 189036 -51584 79936
12781 -12248 -115200 -58531 -102345 174803 173435 151039 55479 303550 145716 -245002 -212767
12770 -212767 57237 -13857 -121676 12333 -53381 -351289 105456 -15032 202702 143502 101522
12759 101522 31586 -78611 13830 -21824 132841 39690 -14291 -139779 -130809 -468195 2143
12747 110792 -156694 -101284 32196 51792 129519 -130503 24086 48352 -490829 -80312 73283
$$ packed form
12827B73966a79402B66057e4405j79924C48023j03990b45873a22781b1165A4977
12816h6427K9366j88543B02829F2641K86376H6567J18035c06697l159e9101G6638
12804E8079N6855h8547n7913c2880j32280C2408K61174B8303J87390C1365N6228
12793H7593K6079J03989p2022j205B6854c2891o4279A22218O6818e1584G9936
12781a2248j02952N6669m3814A74803j368k2396E5479K48071A45716b45002L2235
12770b12767E7237a3857j07819A2333e3381k97908A05456a5032B02702n9200m1980
12759A01522C1586g8611A3830b1824A32841C9690a4291j25488Q970l37386B143
12747A10792a56694N5410C2196J9596P7727a30503B4086K4266d90829h0312G3283
$$ plain form
12735 23100 287465 -195203 -97783 -45921 -161955 -278494 -403575 109657 107370 -48728 63116
12723 103936 -159903 -99937 -68150 283154 -82273 -171631 -135241 -52362 161585 513594 -110777
12711 -14894 98806 75332 111119 376841 67887 -132031 -246455 -338079 -14917 54403 314400
12700 314400 127539 95460 88490 -153185 -79542 198938 -45285 -65320 -70176 23310 198326
12689 198326 239794 146565 -3524 -112690 144471 96697 113105 102064 -404951 -37931 -223001
12678 -223001 138289 -360849 -130559 -241753 277788 346280 340767 7464 -58944 227331 59833
12666 94489 -21151 32820 207348 53084 -142106 -31574 176201 68191 -21392 -42639 106114
12654 28215 248917 -103764 41865 -132807 -159554 324122 131973 99935 140892 200987 27695
$$ packed form
12735B3100K64365a95203R7420d5921j16034j16539j25081A09657k287d8728F3116
12723A03936a59903N9966L1787B83154h2273q9358L6390e2362A61585L52009a10777
12711a4894I8806k3474L5787K65722F7887a32031j14424r1624a4917E4403K59997
12700C14400A27539l2079o970a53185P3643A98938d5285k0035m856B3310J75016
12689A98326M1468r3229c524j09166A44471m7774J6408j1041d04951c7931j85070
12678b23001A38289c60849a30559j11194B77788O8492n513G464e8944B27331E9833
12666I4489b1151C2820J74528E3084a42106c1574A76201F8191b1392k1247A06114
12654B8215K20702a03764D1865a32807k6747C24122A31973l2038M0957O0095B7695
$$ plain form
12642 -111782 -52277 50603 161328 111490 18970 -10413 329301 115973 -94620 372246 -143082
12630 104817 2758 167609 -135856 580283 88435 378083 254626 7564 -192047 183484
12619 -114293 -18294 -81748 134054 -89786 -5796 260813 -143886 -83250 161205 161761 -150163
12607 39758 163209 -139333 110389 106324 -37224 -105071 263463 -91968 -327206 79273 -23341
12595 -205199 5438 -247164 44826 248253 79277 17700 212126 -105848 -94742 98804 264244
12584 264244 186061 21983 -152394 -282891 -17968 -133966 144575 -322097 -31986 23470
12573 416622 -4699 -73893 -39159 -68248 -154566 -94071 -105910 -28372 326823 -71280 189755
12561 75721 85623 176029 -2365 -80801 26458 -7395 69182 188756 143859 233238 33146 -38615
$$ packed form
12642a11782e2277E0603J10725m9838A8970a0413C29301A15973i4620C72246a43082
12630A04817B758J64851a35856E80283H8435K89648j23457G564a92047A83484
12619a14293a8294o3454A34054h9786e796B60813a43886O0636A61205N56a50163
12607C9758J23451a39333A10389m065c7224o7847B63463i1968k35238G9273b3341
12595b05199E438b47164D4826K03427G9277A7700J94426a05848J1106I8804J65440
12584B64244p8183B1983a52394j30497a7968j15998A44575c22097c1986B3470
12573D16622d699o9194L4734k9089q6318O0495j1839b8372C26823g1280A89755
12561G5721R902R0406b365p8436B6458g395F9182J19574m4897Q9379C3146c8615
$$ plain form
12548 159511 -33286 186963 120277 16913 74887 94762 -1339 309266 146919 32109 -21869
12536 71269 -56590 71765 -72642 125411 -118237 321428 9164 -342421 -282095 -121182 -89795
12525 -89795 -29252 38880 262636 126487 184063 204902 -247409 119875 126215 -43645 -205485
12514 -205485 55877 165855 50014 98926 42969 -95819 -194433 121658 -63074 1871 -152724
12502 -43012 50870 -102507 -179365 -86975 127388 -157797 -111683 61347 -51701 20040 -202084
12490 221829 346034 -225619 130472 -142531 -100067 -47116 -52976 375025 -135910 -224074
12480 -224074 -114804 102641 211762 -77113 106442 -14630 63171 -4897 240510 160019 323190
12469 323190 97621 21657 -172352 -223499 -12682 -124709 260869 -380879 165527 47460
$$ packed form
12548A59511c3286A86963o6686A6913N7974J9875a339C09266A46919C2109b1869
12536G1269e6590G1765g2642A25411a18237C21428I164c42421O0326a21182L1387
12525h9795b9252C8880K23756A26487N7576K0839b47409A19875O340d3645j61840
12514b05485E5877J09978E0014M8912D2969i5819r8614A21658f3074A871a52724
12502d3012E0870a02507p6858h6975A27388a57797M6114F1347e1701B0040b02084
12490B21829J24205b25619A30472a42531M2464d7116n860C75025a35910q8164
12480b24074J09270A02641J09121g7113A06442a4630F3171d897B40510q0491J63171
12469C23190I7621B1657a72352n1147a2682j12027B60869c80879A65527D7460
$$ plain form
12458 298068 119580 341848 127907 -147410 -217036 108982 -325836 313955 -11043 105712
12447 169742 75948 187067 71832 -18272 78296 -294777 -229124 -296008 -109132 -195341 -20033
12435 45367 -289072 276412 -41569 86161 -18286 231307 90875 225945 -36432 655 111005
12424 111005 -13818 -334127 340683 342622 -212702 202497 -69525 255720 3905 -166221 -34403
12412 -206674 -205830 467449 -186024 213328 11 -12399 123715 3586 -258083 24221 -17766 57962
12399 -155914 300356 217890 -7078 130439 97968 270962 -260040 13746 -340074 -55367 -35909
12388 -35909 -101457 274015 -162731 6849 -142403 -98265 142178 62177 -80265 232389 -208492
12376 161489 -11484 231425 -135866 219979 -40383 -191413 -187528 160864 -150618 85849
$$ packed form
12458B98068A19580K22268A27907a47410o9626A08982c25836C13955a1043A05712
12447A69742G5948J11119G1832a8272G8296b94777O5653o6884a09132q6209b0033
12435D5367b89072B76412d1569H6161a8286B31307I0875J35070c6432F55J10350
12424A11005a3818l20309C40683J939b12702B02497f9525B55720C905a66221c4403
12412b06674Q44D67449a86024B13328A1a2399A23715C586b58083B4221a7766E7962
12399a55914C00356q2466g078A30439l2471J72994b60040A3746c40074e5367J9458
12388c5909o5548B74015a62731F849a42403M4138A42178F2177h0265B32389b08492
12376A61489a1484B31425a35866B19979d0383j51030L885A60864a50618H5849
$$ plain form
12365 134614 -24421 19961 128010 80323 134920 -182797 -99829 -74987 30070 -49422 58180
12353 152716 45784 7802 51447 -101869 121944 120695 -252584 -253724 -49336 -429267 123314
12341 504 191001 115334 19149 -129996 274611 -42378 -462139 -43118 -88253 -149418 359101
12329 -308291 38692 42343 14667 -290581 4246 -77434 92232 163997 64293 292014 245749
12318 245749 263562 199677 255997 83764 -247073 -150745 50096 105852 -36558 -167478 -30381
12306 87032 -152476 -252011 -110106 50395 -13240 -117293 -55944 100799 -191615 -37427 129691
12294 -35040 221243 324085 217204 70725 254618 -137785 118927 363784 148656 -183040
12283 173940 -265353 -19240 -179845 235118 102243 322795 160078 -40096 110607 23957
$$ packed form
12365A34614b4421A9961J08049m7687N4597a82797Q2968K4842C0070d9422E8180
12353A52716D5784G802M3645a01869A21944j249b52584j140d9336l79931A23314
12341E04J90497p5667A9149a29996B74611d2378m19761d3118m5135o1165C59101
12329c08291C8692L651A4667b90581D246g7434I2232P1765F4293K27721m6265
12318B45749J7813o3885N6320H3764b47073R6328E0096N5756c6558j30920c0381
12306H7032a52476r9535a10106E0395a3240j04053e5944A00799a91615c7427A29691
12294c5040B21243J02842j06881G0725J83893a37785A18927K44857A48656a83040
12283A73940b65353a9240j60605B35118A02243K20552A60078d0096A10607B3957
$$ plain form
12272 56954 278083 79780 125875 -319407 -47377 -205965 -120708 -129124 -28287 -82858 216854
12260 314357 73166 -14363 -7066 154923 521553 -136635 373741 157455 -249133 -57614
12249 11569 -271045 -168610 -316930 -1946 3627 55762 -16288 -214577 -119980 129167 -186311
12237 -156424 101707 290081 239864 99653 44798 387861 158776 -92822 165643 -161422
12226 224920 -66221 310946 104690 67101 44686 297953 346253 -26706 -152211 -366135
12216 -366135 149236 277161 -25584 211594 168635 -39549 72094 108695 -155350 -41140 118209
12204 -35769 54736 107929 320015 193252 175490 231643 25326 -196973 104203 75552 83634
12193 83634 -217840 -175088 -31864 175559 176009 149977 483784 -146621 -33040 -71028 -88776
$$ packed form
12272E6954K21129G9780M6095c19407d7377j58588Q5257q416b8287n4571B16854
12260C14357G3166a4363g066A54923L66630a36635C73741A57455b49133e7614
12249A1569b71045J02435j48320a946C627N2135a6288j98289R4597A29167a86311
12237a56424A01707J88374n0217I9653D4798L43063A58776i2822A65643a61422
12226B24920f6221C10946A04690l7589k2415K53267M8300b6706j25505k13924
12216c66135A49236J27925b5584B11594m2959c9549G2094L6601a55350d1140A18209
12204c5769E4736N3193K12086j26763j7762N6153B5326a96973A04203k8651Q082
12193H3634b17840M2752c1864A75559M50k6032L33807a46621c3040l7988j7748
$$ plain form
12182 -88776 206647 -21386 60913 18290 265956 125136 209180 -178521 -358509 421538
12171 202669 261991 -98321 114743 284886 186194 825 313107 357543 27666 97618 328930
12160 328930 -16002 -76821 37651 -17150 -210498 224282 298365 232006 134936 96475 -275402
12148 21972 55534 -27349 -33575 59969 104300 -76996 -63961 129432 -24300 199114 -35402
12136 246059 21953 33116 82182 214242 47461 -92741 -100441 -302239 -56514 248520 -250552
12124 189553 -7685 110085 211449 201071 186310 -97705 -310487 -19733 -152052 195757 -63483
12112 -364960 47846 281503 177742 73976 314909 309989 54399 -117870 220151 104277
12101 169076 -46874 284369 -98594 -204371 242532 175909 26786 -205753 135859 -220531
$$ packed form
12182h8776B06647b1386F0913A8290K47666A25136Q4044a78521j79988D21538
12171B02669N9322i8321A14743J70143r8692H25L12282M4436B7666O9952K31312
12160C28930a6002o0819C7651a7150j93348B24282P4083o6359r7070l8461b75402
12148B1972L3562b7349o226E9969M4331g6996J3035A29432b4300A99114c5402
12136B46059B1953J1163M9066J32060D7461i2741p700k01798e6514B48520b50552
12124A89553g685A10085J01364j0378j4761i7705k12782a9733j32319A95757f3483
12112c64960D7846K33657j03761G3976K40933m920E4399a17870B20151A04277
12101A69076d6874B84369i8594j05777B42532o6623B6786b05753A35859b20531
$$ plain form
12090 29375 47651 99449 -404 22853 -19640 -91138 7689 28847 -98229 78188 82747 -131073
12077 -138521 -164906 13170 -84890 270949 39232 126143 -23632 -134697 16040 -129945 323067
12065 652738 1645041 908502 413822 -81436 387072 11730 283840 -2946 406398 -244276
12054 -11134 -255823 -50697 406318 191284 121731 76148 -74358 -248330 59973 43458 -357
12042 -240092 175558 -432175 222398 219318 200340 12761 -79956 112843 -21299 21845 318040
12031 318040 -221862 -47078 -213908 44268 119064 360511 52183 10511 -237919 158254
12020 244122 41639 -191991 -157948 -80472 -135028 199394 -76304 179178 -74615 249989 -60265
12008 107957 -79733 1055 283912 10112 -33058 31083 -57466 230016 -5925 -21486 -94936
$$ packed form
12090B9375J8276N1798d04B2853a9640p1498G689K1158i8229G8188M559a31073
12077a38521k6385A3170h4890B70949C9232Q6911b3632j11065A6040a29945C23067
12065F52738R92303p36539D13822h1436C87072A1730K72110b946D06398b44276
12054a1134k44689e0697D06318A91284o9553m5583g4358j73972E9973j6515c57
12042b40092A75558d32175B22398l080j8978A2761g9956A12843b1299B1845K96195
12031C18040b21862d7078j66830D4268P4796K41447E2183A0511b37919A58254
12020B44122D1639a91991L4043P7476n4556A99394g6304A79178g4615B49989f0265
12008A07957g9733A055K82857A0112c3058C1083e7466B30016e925j5561p3450
$$ plain form
11997 -94936 -46425 120310 -7818 -176439 -82439 -50474 -123892 161029 25423 -255086 273
11985 -115272 -54465 54172 113212 -65169 17396 -129891 23147 277010 21007 60475 -116274
11973 -58939 98870 247561 -174138 -49985 -80883 172271 -17599 49926 -81232 -95879 107657
11961 -26655 34153 35677 -132099 -134721 178839 -161403 -173941 38417 -56364 243933 201263
11950 201263 8064 152925 -341178 -43006 -166130 -184988 64654 75518 -5071 14262 77860
11939 77860 -135232 -2655 -156108 72017 -223587 -150377 -146176 387855 -59609 -106833 135083
11927 -222412 1753 -49702 131934 74230 102761 92972 -226934 -260064 -149378 -418495 61076
11915 71652 122170 -27417 -225794 -102948 -105310 217886 -56349 20384 -2831 -21165 450458
$$ packed form
11997i4936d6425A20310g818j68621h2439L1965p3418A61029B5423b55086B73
11985a15272e4465E4172N9040f5169A7396a29891B3147K53863B1007L9468a16274
11973e8939I8870J48691a74138d9985l0898A72271a7599D9926h1232j4647A07657
11961b6655C4153J524a32099k622A78839a61403j2538C8417e6364B43933m2670
11950B01263H064J44861c41178d3006j23124j8858F4654J0864e071A4262O3598
11939G7860a35232b655j53453G2017b23587P3210M201C87855e9609m7224A35083
11927b22412A753d9702A31934n7704K8531r789b26934l3130J10686k69117F1076
11915G1652N0518b7417j98377a02948k362B17886e6349B0384b831j8334D50458
$$ plain form
11903 208601 123866 -289309 -462629 -197458 -159778 66700 -29926 -177795 240450 -176877
11892 21554 -247713 -4267 126485 -85094 85948 153559 -262697 -112743 1366 -129827 129058
11880 -12094 223694 66248 -302803 -61983 179461 97072 114380 107387 45814 64736 -59960
11868 -92539 -235356 -44858 -82745 123824 87214 -41425 435262 -327783 -36508 4506 191970
11857 191970 -95990 -72293 93997 -322 -35178 163322 -80128 77426 17650 54954 9083 -270429
11844 73603 82804 -219822 -40806 224558 -52725 10804 -153566 117136 12067 -407474 36678
11832 -362538 192847 -102225 22759 169296 63653 -138369 118368 13685 146458 326020
11822 326020 7533 -502530 120600 -257799 -255932 39306 170481 -32797 -88358 -61796 133164
$$ packed form
11903B08601q4735b89309j73320a97458L7680F6700b9926j47869B40450a76877
11892B1554b47713d267A26485h5094H5948O7611b62697a12743A366a29827A29058
11880a2094B23694F6248c02803f1983A79461q2389J7308o993D5814J8922e9960
11868i2539j42817d4858l7887A23824l6610d1425D35262c27783c6508D506J87464
11857A91970i5990K3697I3997c22l4856A63322h0128G7426A7650L7304I083b70429
11844G3603R201b19822d0806B24558e2725A0804a53566A17136A2067d07474C6678
11832c62538A92847a02225B2759J46537F3653a38369A18368A3685J32773J79562
11822C26020G533e02530A20600b57799J867C9306J31175c2797n5561K6562A33164
$$ plain form
11810 -30209 308358 -168551 58849 -55115 146081 231817 -136513 -166512 -291773 -26326 -274460
11799 -274460 130190 -123553 -86595 223397 252392 -103399 -164269 251160 -124026 40203
11788 120711 230143 -185926 219335 -371955 47033 91210 -228236 -402722 299442 -417020
11777 333673 -56776 -204752 -62632 -1065 -132375 -30319 -57422 -305730 51259 -219392 -158323
11766 -158323 -263137 -146769 117060 -112345 11672 -336854 171545 188211 23524 -168261
11755 -193993 -254830 195686 46921 -194158 55418 238997 -211074 -100766 -192839 162206
11744 -85822 329981 -45568 96137 -12290 -50781 -420324 199779 140404 223424 -81090 -216066
11733 -216066 116779 -267848 -295277 -15833 70839 -163748 126416 -39511 270565 49476
$$ packed form
11810c0209C08358a68551E8849e5115A46081Q5736a36513k9999j25261b6326k48134
11799b74460A30190a23553L6958B23397K8995a03399o0870B51160a24026D0203
11788A20711J09432a85926B19335c71955D7033M4177b28236j74486B99442d17020
11777C33673e6776j47976f2632a065j31310c0319k7103k48308E1259b19392O1069
11766a58323j04814J16368A17060a12345A1672c36854A71545J6666B3524a68261
11755a93993o0837A95686D6921a94158E5418J83579b11074a00766r2073A62206
11744h5822C29981d5568I6137a2290l8491l69543A99779n9375Q3020h1090j34976
11733b16066A16779b67848k7429a5833G0839a63748A26416c9511B70565D9476
$$ plain form
11722 137032 -11717 -239133 72041 -422477 -171711 178266 -127444 -160403 -85450 16173
11711 264398 264580 127047 236439 -169125 96762 -162938 -225241 -365994 236925 -170148
11700 -52761 211595 -485958 243069 -195654 -88210 257807 174417 231451 -21057 -609926
11690 -609926 -4848 -82366 5420 -70307 81840 -57754 12519 -16158 137121 -116262 -29430
11678 -96114 167583 -18438 -36244 -25118 -23780 -12613 521946 -425164 -159982 325522 -238392
11666 -162503 46658 -66950 -147219 17218 -141572 -2041 88460 -125116 -364974 -190212 -334222
11655 -334222 -93951 199765 -130102 -27202 -19263 -254462 43757 77797 -3585 472337 229164
11643 -35576 -165100 251596 -312539 -19243 -187177 49566 102170 -156942 4915 181235 131229
$$ packed form
11722A37032a1717k27416G2041d22477a71711A78266a27444l2959P4953A6173
11711B64398J82A27047J09392a69125I6762a62938o2303j40753B36925a70148
11700e2761B11595d85958B43069a95654h8210B57807q3390N7034b1057n88869
11690f09926d848p7518E420g0307H1840e7754A2519a6158A37121a16262b9430
11678i6114A67583a8438j7806J1126J338J1167E21946d25164a59982C25522b38392
11666a62503D6658f6950q0269A7218a41572b041H8460a25116k39858J74762j44010
11655c34222i3951A99765a30102b7202P939k35199D3757L4040c585D72337B29164
11643c5576j29524B51596c12539a9243j67934D9566N2604a56942D915J76320n0006
$$ plain form
11632 131229 -44365 182835 90121 173042 -175411 87605 160117 -150135 115136 -30065 63815
11620 218175 156060 37719 383157 235491 -175999 -359357 -157975 -203289 56095 122875
11610 122875 -160100 -74454 -210885 -11923 66614 18561 -249461 81404 67757 188725 278545
11599 278545 114486 -109227 -31215 385516 -119082 -93202 -157039 -171382 -178355 -23886 -5270
11587 140655 -181052 -107065 212206 125218 137062 255267 -28708 -16599 -44536 71157 56338
11576 56338 94736 302408 33120 -91659 -176753 447347 112970 -54519 -35559 153430 26760
11564 38925 14931 -152384 -351139 -123640 -116406 27580 -24326 389178 -925 -57343 -48354 -68031
11552 -68031 150605 -105777 -7916 -95413 -389552 -56469 88830 320446 226078 -37157 -165195
$$ packed form
11632A31229d4365A82835I0121Q2921a75411H7605P2512a50135A15136c0065F3815
11620B18175o2115C7719L45438j47666a75999j83358a57975m5314E6095O6780
11610A22875a60100g4454j36431a1923F6614A8561b49461H1404j3647J20968Q9820
11599B78545A14486a09227c1215C85516a19082K5880o3837j4343o973b3886e270
11587A40655a81052P3987B12206q6988J1844J18205b8708J2109k7937G1157j4819
11576E6338L8398K07672C3120i1659q5094D47347A12970e4519J8960A53430B6760
11564C8925A4931a52384j98755a23640P234B7580b4326C89178i25n6418Q989j9677
11552f8031A50605a05777g916q7497k94139e6469H8830K31616r4368c7157j28038
$$ plain form
11541 -165195 98316 -194870 -143143 -271797 60385 129045 284178 30495 158348 -107659
11530 -136414 65868 -198790 -150208 -79431 161999 -52204 2790 -108925 -207784 -24562 4381
11518 -7673 -53614 -18797 284684 -159771 -1736 -59616 155291 -12822 156233 -191306 -28352
11506 6564 43456 232012 32499 192457 42686 -319086 -72978 249909 -579694 93383 55161
11495 55161 -51345 -288007 -71791 -131662 190814 -151579 320359 502323 128520 147666
11485 147666 355917 126147 -286255 86404 72452 -24023 327645 163379 232708 72713
11474 -63771 -278096 167684 16879 -66072 163184 -220128 -3801 168969 180415 38101 -41398
11462 209895 185445 10132 270 502996 151299 194016 -63235 -223606 183025 45502 -40565
$$ packed form
11541a65195I8316a94870N1727j28654F0385O8660J55133C0495J27853a07659
11530a36414F5868a98790M8582P0777A61999e2204B790a08925r8859b4562D381
11518g673m5941a8797B84684a59771a736n7880A55291a2822A56233a91306b8352
11506F564L6892J88556C2499J59958D2686c19086g2978B49909e79694I3383l8222
11495E5161e1345k36662g1791n9871A90814a51579C20359J81964A28520J9146
11485A47666K08251A26147b86255H6404j3952b4023C27645A63379O9329G2713
11474f3771k14325A67684A6879f6072A63184b20128c801A68969J1446C8101d1398
11462B09895k4450A0132B70N02726A51299M2717f3235j60371A83025D5502d0565
$$ plain form
11450 129982 -137558 179731 -53461 254870 522742 -80208 181027 -62548 51754 -49540
11439 82025 347414 -176890 -12774 -179832 -207231 -115974 19146 172110 -310398 91195 -2909
11427 65111 10938 202077 -7119 127061 78609 -17643 85269 194082 257860 80207 -135020
11415 -110031 133822 -368884 -61762 -175472 -354666 -119406 99063 -264607 64134 349945
11405 349945 -313861 211785 4067 47124 193424 21315 6643 -80757 65645 -285595 -96297
11393 -256564 -59728 -26814 -233479 59546 -82406 -501046 -110044 356977 9077 168159 -30897
11381 -64168 56879 119871 -106152 80708 80835 467584 -32074 -80760 -57048 -100828 187118
11369 -234130 27819 441040 114541 49364 -1722 -162879 -49123 -288109 -54782 -195574 93975
$$ packed form
11450A29982a37558A79731e3461B54870K67872h0208A81027f2548E1754d9540
11439H2025K65389a76890a2774j67058k7399R1257A9146J52964c10398I1195b909
11427F5111A0938J91139g119A27061m8452a7643H5269J08813O3778H0207a35020
11415a10031A33822c68884f1762j13710j79194a19406I9063b64607F4134K85811
11405C49945c13861B11785D067M3057J46300B1315F643h0757F5645b85595i6297
11393b56564e9728b6814k06665E9546h2406m18640a10044C56977I077J59082c0897
11381f4168E6879O2992a06152H0708J27L86749c2074m8686K3712m3780A87118
11369b34130B7819M13221A14541D9364a722j61157d9123k38986e4782j40792I3975
$$ plain form
11357 -24737 -257804 -10862 -128188 -257531 -55807 -100554 78379 -199849 47477 196342 -39481
11345 -385904 -285943 -130306 135279 -167887 -22426 22839 195286 32611 112562 -103068
11334 -348138 91949 -86264 145316 -193005 20041 -38274 205615 -31333 -191664 86395 -41565
11322 -304065 -315138 152785 -35373 126215 -13611 290364 -116906 -149210 199202 38455
11311 226668 -2173 233174 65140 -115357 215812 125846 -168519 123121 195675 -206143
11300 100104 105472 -188083 70331 62464 -22032 167583 -186641 17990 -238182 -34465 -9870
11288 -69065 -157583 11937 -355583 -30256 59517 141705 70210 -122535 11654 -55464 -104359
11277 -104359 163137 235337 -159835 -253544 -239960 354722 71087 45263 -467 14003 -102775
$$ packed form
11357b4737k33067a0862j17326j29343e5807m4747G8379a99849D7477J48865c9481
11345c85904R9961a30306A35279a67887b2426B2839J72447C2611P9951a03068
11334c48138I1949h6264A45316a93005B0041c8274B05615c1333j60331H6395d1565
11322c04065j1073A52785c5373A26215a3611B90364a16906l2304A99202C8455
11311B26668b173B33174F5140a15357B15812q9966a68519A23121P2554b06143
11300A00104N368a88083G0331p867b2032A67583a86641A7990b38182c4465i870
11288f9065q8518A1937c55583c0256E9517Q2188G0210a22535A1654e5464m8895
11277a04359A63137P2200a59835r3709J3584C54722G1087k5824d67A4003a02775
$$ plain form
11265 199935 -84630 -177466 -158704 37892 -228771 -307142 1140 -112154 -35834 -293570 -62994
11253 -320914 -10902 18836 -327455 1943 181022 -3230 -9734 -96238 758 405579 -46068 -56696
11241 -56696 -81407 -64236 -190130 177831 -81185 15907 243334 -32575 139386 -339038 -126446
11229 135274 -10634 -131648 -76373 -115521 116764 939 -2707 103561 93028 -131481 24915
11217 -167327 -377084 -172188 48832 -194999 -62813 -145495 -390994 -180223 -138017 -324224
11207 -324224 -259997 -170005 -364206 5652 -113334 90501 -179876 -53165 240298 -64305 -59210
11196 -59210 -165700 307673 228541 207018 355132 -32057 -400739 239487 196497 -151722
11185 21767 115638 8067 -173481 4357 262858 -252488 -175753 -338068 -141803 -135206 84757
$$ packed form
11265A99935h4630r2836J8762C7892b28771p8371A140a12154c5834k57736f2994
11253c20914a0902A8836c27455A943J79079c230o504q6504G58M04821d6068j0628
11241e6696k4711J7171j25894A77831h1185A5907K27427c2575A39386c39038a26446
11229A35274a0634j21014N5275l9148A16764I39b707A03561j0533a31481B4915
11217a67327k09757a72188D8832a94999f2813q2682k45499a80223M2206j86207
11207c24224O4227Q9992j94201E652a13334I0501a79876e3165B40298f4305N095
11196e9210j06490C07673p9132k1523J48114c2057l68682B39487m2990a51722
11185B1767R3871H067a73481D357K58501b52488P6735j62315a41803O597H4757
$$ plain form
11173 97707 166882 -6911 286045 149805 -108903 310684 143614 -60597 -123237 -43092 -177314
11162 -177314 -30744 -277843 172522 -76640 -249588 222111 -175918 15288 -9053 -91593 -235873
11151 -235873 95224 -153288 -92548 -210838 235103 125132 -44089 453264 -346960 -166921
11140 -219803 -119474 265937 -112447 71532 137207 -3519 105702 268099 140530 254557
11130 254557 -50597 -250043 -142993 137360 163948 -262098 -25842 -121113 204213 -44625
11119 150921 322766 38981 -46498 178029 380451 144363 -271664 68551 153773 -478114
11108 204467 -123999 -24763 -27812 -123762 178057 61525 -35690 208175 8787 -273014 128881
11096 -101297 131001 -321503 104264 167924 146999 4895 212925 321020 -312433 -36741
$$ packed form
11173I7707O9175f911B86045j36240a08903C10684A43614f0597o2640d3092j34222
11162a77314c0744k47099A72522g6640j72948B22111a75918A5288i053q2540j44280
11151b35873I5224a53288O0740j18290B35103j09971d4089D53264c46960a66921
11140b19803J00329B65937a12447G1532O5675c519A05702J62397j27569J14027
11130B54557e0597j99446J07050A37360K6588b62098b5842r5271B04213d4625
11119A50921J71845C8981d6498A78029K02422A44363b71664F8551Q5222d78114
11108B04467a23999b4763l049r5950A78057F1525c5690B08175H787b73014A28881
11096a01297A31001c21503A04264O3660k0925D895K08030J08095c12433c6741
$$ plain form
11085 253910 183650 -121695 164439 -48971 75698 -66265 126968 103561 272844 57033 -15372
11073 114143 216414 290048 124695 -217487 -19493 -136742 421975 292774 530698 305236
11063 305236 33442 308070 378923 50430 441511 348086 214168 137827 39738 193895 478093
11052 478093 348637 183754 449268 420038 332652 -44870 167868 413759 533740 298490
11042 298490 436183 514031 295004 178621 369234 383765 356183 455358 386776 507048
11032 507048 236358 324077 69372 285649 358979 521095 293356 85754 723587 343231
11021 460051 268639 446073 236777 195519 100379 494595 361527 126400 334472 -45337
11010 419471 160318 141233 499383 128043 303474 217762 409081 560647 258689 301810
$$ packed form
11085B53910p0260a21695A64439d8971G5698f6265A26968k3407J69283E7033a5372
11073A14143J02271P3634A24695b17487a9493j17249D21975j29201K37924k25462
11063C05236C3442K74628P0853E0430L91081r3425j33918p6341C9738J54157K84198
11052D78093j29456j64883K65514k9230q7386d4870A67868K45891J19981k35250
11042B98490J37693P7848k19027j16383J90613J4531k7582R9175o8582J20272
11032E07048B36358Q7719F9372K16277P3330J62116k27739H5754O37833C43231
11021D60051j91412J77434k09296m1258r5140L94216j33068A26400K08072d5337
11010D19471A60318j9085L58150A28043J75431q5712J91319J51566B58689M3121
$$ plain form
11000 301810 520621 21205 391104 204680 403221 229361 530880 341380 328409 465724
10990 465724 311600 214056 661633 608654 402490 503290 622939 510784 556009 398719
10980 398719 575014 470106 422352 699925 729048 671808 1051230 1380472 1176808 1561664
10970 1561664 1446495 1727533 1667965 1557396 1388344 1464717 1236922 924856 877953 758897
10960 758897 684429 736386 676022 493780 818462 550573 548687 655871 449845 34236 239337
10949 239337 393744 127565 105932 138241 103605 159501 23357 49519 305127 -97021 88396
10937 -85776 -189308 -110194 -61077 139420 24785 5831 -189170 117721 445272 182020 -12118
10925 -30994 117963 -168703 174423 -103477 72267 173198 74955 -110295 -158551 164479
$$ packed form
11000C01810K18811B1205L69899j86424J98541j73860L01519j89500j2971J37315
10990D65724j54124r7544M47577n2979k06164J00800J19649j12155M5225j57290
10980C98719J76295j04908m7754K77573K9123n7240L79422L29242k03664L84856
10970A561664j15169K81038n9568j10569j69052P6373k27795l12066m6903j19056
10960G58897p4468N1957o0364j82242L24682k67889j886J07184k06026C4236K05101
10949B39337J54407A27565k1633L2309l4636N5896B3357K6162K55608i7021H8396
10937h5776j03532P9114M9117A39420B4785E831a89170A17721L27551A82020a2118
10925c0994A17963a68703A74423a03477G2267J00931G4955a10295m8256A64479
$$ plain form
10914 -7381 93889 256788 136724 90869 -142807 148996 -240748 -268179 -276276 -116248 -246732
10903 -246732 191109 122150 -257382 197050 121254 -129552 3066 -153091 443999 -115845
10892 93375 -35542 -76910 -11076 -131912 -12804 -31521 -129067 -18463 29119 7649 -183417
10880 -108346 136939 -93567 -103348 24153 -111943 28983 -323695 -428029 12920 97040 -46355
10868 -156185 -255636 -26320 87770 -58248 -52466 -113394 202187 125221 409393 81978 -157651
10856 127259 69311 -82433 -73911 -94234 25451 -211433 -149538 -97819 -351333 36357 -84849
10844 -31409 -186816 40645 -559091 -76945 -70418 -116935 128036 -184993 280886 -264587 -165565
10833 -165565 18565 -1897 248130 -297256 -65071 51467 109306 330321 115881 -238320 42995
$$ packed form
10914g381I3889J62899j20064m5855a42807A48996b40748k7431q097a16248j30484
10903b46732A91109o8959b57382A97050p5796a29552C066a53091D43999a15845
10892I3375c5542m1368a1076j20836a2804j8717r7546a8463B9119G649a83417
10880a08346A36939i3567r781B4153a11943B8983c23695j04334A2920Q4120d6355
10868a56185r9451b6320H7770e8248N782o0928B02187p6966K84172H1978a57651
10856A27259n7948h2433Q522k0323B5451b11433O1895N1719k53514C6357h4849
10844c1409j55407D0645e59091g6945O527m6517A28036a84993B80886b64587R9022
10833a65565A8565a897B48130b97256f5071E1467N7839K21015A15881b38320D2995
$$ plain form
10821 -244540 27735 51963 -23666 -13933 -108112 73283 -140877 79828 -309128 -128618 158475
10809 189405 20968 365747 184838 11431 298678 43720 368976 74358 -103775 -24966
10798 242964 215043 42567 -24796 -157394 -126782 32013 86732 -154053 15046 79258 197007
10787 197007 -93145 79414 -10073 -20893 94839 -202541 -55363 157086 -92161 172754 -44448
10775 294236 -64360 9016 -434165 261199 -146779 -204354 -224522 -355995 177095 -16339 -329719
10764 -329719 -86672 -52980 17361 -33872 -129098 -85239 263019 -117579 18162 -46038 121205
10752 -153780 -211790 211895 -21285 15510 -172020 -103037 9260 48839 60387 37528 -24086
10740 -127945 108927 -376955 -361203 -42570 -30350 45763 -287263 -138073 -231454 -286147 62865
$$ packed form
10821b44540B7735K4228b3666R733r4179G3283a40877G9828c09128a28618A58475
10809A89405B0968L44779j80909A1431K87247D3720L25256G4358a03775b4966
10798B42964k7921D2567b4796j32598L0612C2013N4719a54053A5046O4212J17749
10787A97007i3145G9414a0073j0820I4839b02541e5363A57086i2161A72754d4448
10775B94236f4360I016d34165B61199a46779n7575k0168j31473A77095a6339l13380
10764c29719h6672L3692A7361c3872r5226M3859B63019a17579A8162d6038A21205
10752a53780n8010B11895b1285A5510a72020O8983I260L9579J1548k2859b4086
10740a27945A08927c76955J5752d2570J2220D5763b87263a38073r3381n4693F2865
$$ plain form
10728 -53605 -124017 -243166 -22030 140433 150724 -395544 59142 219775 -201469 -92890 -196945
10717 -196945 2661 -38137 -198193 116627 -312930 -56889 110546 -11234 -137242 44667 -273651
10705 -176455 -85273 152128 81641 -186476 -112786 -168515 113400 133812 -13455 -24006 -291230
10694 -291230 -253301 115401 -409655 -70167 70470 2681 -144188 237303 94413 -5096 24852
10682 -150429 -357404 38026 -13232 -34291 76665 234168 9482 -13444 -183436 -358095 267220
10670 68849 -256631 -45481 63158 88936 -49778 -166705 212734 -65936 87672 80707 52375
10659 52375 124576 -100518 245409 259543 174249 -88946 82582 -79740 138437 -275886 -118585
10647 -66718 -10082 -207916 86727 -294542 -262553 -119862 79074 -227832 -108819 -307939
$$ packed form
10728e3605p0412j19149b2030A40433J0291c95544E9142J60633b01469i2890j04055
10717a96945B661c8137j60056A16627c12930e6889A10546a1234j26008D4667b73651
10705a76455h5273A52128p0487a86476P3690n5729A13400K0412a3455j0551k67224
10694b91230L7929A15401d09655g0167G0470B681a44188B37303I4413e096B4852
10682a50429k06975C8026a3232k1059G6665J57503I482a3444j69992j74659B67220
10670F8849b56631d5481F3158K5778d9778j16927B12734f5936H7672o965k8332
10659E2375P2201a00518B45409J4134q5294h8946H2582g9740A38437b75886a18585
10647f6718a0082j97834H6727b94542L1989a19862G9074b27832a08819j99120
$$ plain form
10637 -307939 -245058 -76799 -6442 -42542 117790 170344 -2097 -394944 -171252 -239895 -194003
10626 -194003 -256062 173379 -75585 -72121 -83604 13760 123958 -92850 74847 -443371 4778
10614 -50949 25707 -64643 103821 -267729 -210148 175371 -56129 294161 227480 -61094 -136014
10603 -136014 50961 -152774 -31501 -254191 81312 329577 -151201 26953 -115440 146863
10592 240217 123093 -164959 -82979 -31608 12592 -275305 58696 -80445 197683 -27655 209652
10580 130947 -38809 -101403 85747 -19955 12328 -192192 23948 -129514 -155342 -261725 -116544
10568 175752 -193 163819 -84933 -160145 -247909 -69440 46460 -463110 -79558 -221978 -327186
10557 -327186 215975 389296 221702 -369212 156676 236107 -290911 -200885 -254557 -237884
$$ packed form
10637c07939O2881g6799f442l6100A17790N2554b097l92847a71252o8643M5892
10626a94003o2059A73379g5585L464j1483A3760J10198i2850G4847d43371D778
10614e0949B5707f4643A03821b67729N7581A75371e6129B94161o6681f1094p4920
10603a36014E0961a52774c1501k22690H1312K48265a51201B6953a15440A46863
10592B40217j17124a64959Q1980c1608A2592b75305E8696h0445A97683b7655B09652
10580A30947c8809o2594H5747a9955A2328a92192B3948a29514k5828j06383a16544
10568A75752a93A63819h4933p5212q7764f9440D6460d63110g9558j42420j05208
10557c27186B15975J73321j67594c69212A56676P9431b90911R0026n3672J6673
$$ plain form
10547 -237884 80726 40596 -106519 210133 -129873 -279690 -120180 245431 -52642 47230
10536 -71170 264474 -457517 69724 -103652 -2635 -59862 -199994 -260933 2947 -107653 -56042
10525 -56042 84105 -78595 124143 2544 -165666 1463 -242143 -203060 -196853 10604 101081 -234164
10512 23741 -24857 47075 -173138 -143137 -218385 50577 30953 -280163 51508 93113 -21498
10500 -91810 47115 -88909 135885 -55315 -97853 -203342 87371 -92092 77694 -150931 -378172
10489 -378172 127214 153279 33628 -22565 -263997 -152556 103040 204038 -234931 -83956
10478 -250102 -430802 -8840 151630 -62274 -57494 -103393 -184517 -96198 37288 211638 -91458
10466 -298290 -259343 -173414 52203 143688 -237168 -21683 108370 80923 151264 -85117 89467
$$ packed form
10547b37884H0726m0130a06519B10133a29873j49817a20180B45431e2642D7230
10536g1170B64474d57517F9724a03652b635n7227j40132o0939B947a07653N1611
10525e6042H4105g8595A24143B544a65666A463b42143L9083O207A0604R0477b34164
10512B3741b4857D7075a73138L0001p5248E0577j9624b80163E1508M1605b1498
10500i1810D7115h8909A35885e5315m2538j05489H7371i2092G7694a50931k27241
10489c78172A27214K6065C3628b2565k41432J11441A03040J00998b34931h3956
10478b50102j80700h840A51630f2274M780m5899q1124Q8319C7288J74350i1458
10466b98290L8947Q5929E2203R1485b37168b1683A08370k7447P0341h5117H9467
$$ plain form
10454 49437 -22226 -18587 -28211 -47258 33439 182928 -39149 4910 257037 144472 141069 58880
10441 -118307 383114 -13420 -69448 -196945 78744 157763 -295397 96150 -88827 -112564 -45496
10429 -143744 172045 -3805 4002 42451 -285457 100269 257158 55019 -223934 -173749 79062
10417 -18984 -53027 25996 36802 -335596 -183990 -99325 122988 230036 -3341 32110 16596
10406 16596 120335 -54074 21356 18319 114615 63043 100236 136541 -143495 23581 164852
10395 164852 -12345 240438 -168657 31559 48698 -179907 101516 -119880 192378 -41836
10384 121727 -54892 71743 284820 13883 32315 110093 222786 413521 287826 -86493 146114
10372 -64453 95762 373192 321966 -59115 -954 196961 -51263 141462 557722 444638 105368
$$ packed form
10454D9437b2226L639r624j9047C3439J49489c9149D910K52127j12565l403E8880
10441a18307C83114a3420n6028j27497G8744P9019b95397I6150h8827k3737d5496
10429a43744A72045c805D002L8449b85457A00269J56889E5019b23934N0185G9062
10417a8984l4043B5996J0806c35596J51606Q4665A22988J07048c341C2110j5514
10406A6596J03739e4074B1356l037R6296n1572L7193L6305a43495B3581J41271
10395A64852a2345B40438a68657C1559J7139a79907A01516a19880A92378d1836
10384A21727e4892G1743K13077A3883J8432P7778J12693J90735j25695h6493A46114
10372f4453I5762K77430n1226e9115i54A96961e1263A41462M16260j13084A05368
$$ plain form
10360 88123 35812 278237 138152 292089 -20720 350333 272308 6333 -8040 106793 6147
10348 330739 499280 169717 -126607 182826 149297 -15876 100342 72976 -69930 -82436
10338 -82436 -152769 292095 -70718 -1251 21121 170341 108666 128862 -155155 93751 179182
10327 179182 2837 141567 30705 222799 -199139 -132498 -59412 59642 -51964 -342041 -53302
10315 -14022 1287 113334 -116136 271142 -21810 132287 27493 145633 60649 24006 92775
10304 92775 -277657 -153610 -121697 -201952 14257 -108839 -21780 -82949 87472 178364 130471
10293 130471 -12193 52093 288188 4553 -211623 -186382 -19263 -39375 -29604 -130366 40954
10281 -134368 -52304 13265 106983 17291 200171 -122047 347044 -388149 -417102 -144669
$$ packed form
10360H8123C5812K42425A38152J53937b0720C50333p8025F333h040A06793F147
10348C30739J68541A69717a26607A82826l3529a5876A00342k7366f9930j2506
10338h2436p0333B92095g0718a251B1121J49220o1675K0196a55155I3751Q5431
10327A79182B837J38730C0705J92094a99139O6641e9412E9642e1964k90077e3302
10315a4022A287J12047a16136B71142b1810A32287B7493J18140F0649B4006O8769
10304I2775b77657J24047L1913q0255A4257a08839b1780o1169H7472R0892m7893
10293A30471a2193E2093K36095D553b11623K5241a9263k0112R771j00762D0954
10281a34368e2304A3265R3718A7291J82880a22047C47044c88149k8953a44669
$$ plain form
10270 57250 89296 -248270 -208131 -67455 -133743 316540 -82523 -264838 128958 -102359 -102252
10259 -102252 -267225 -95821 26954 117746 -89099 96815 107797 -168801 174759 133155 -5413
10247 -117350 297147 74920 -271956 -22791 138421 46186 -108339 260026 13647 114039
10237 114039 -66611 -140788 341581 -230822 -128061 -111633 -29971 168012 -281267 -234190
10227 -234190 -227794 159238 50665 -124345 249284 -51974 -150859 186859 -87775 329207 284877
10216 284877 40839 -95263 138198 190260 -110718 38614 176149 24208 -281177 59954 211528
10205 211528 -177613 -99921 95178 -104918 10168 -91474 140035 -16611 63271 -24944 21656
10193 -192353 77279 2938 129219 201602 37519 142017 1012 -95805 -122245 -190127 36008
$$ packed form
10270E7250L2046b48270M0139f7455o6288C16540h2523j82315A28958a02359J07
10259a02252j64973i5821B6954R0792h9099I6815J0982a68801A74759m1604e413
10247a17350B97147G4920b71956b2791A38421D6186a08339B60026A3647J00392
10237A14039f6611p4177C41581b30822J02761J6428b9971A68012b81267M7077
10227b34190O396A59238E0665a24345B49284e1974r8885A86859h7775C29207m4330
10216B84877D0839i5263A38198N2062a10718C8614J37535B4208b81177E9954J51574
10205B11528a77613P7692I5178a04918A0168i1474A40035a6611F3271b4944B1656
10193a92353G7279B938J26281P2383C7519J04498A012i5805k6440o7882C6008
$$ plain form
10181 -216973 -814 36752 -114948 136420 -175503 -72192 -21997 74650 -52647 -178533 -383562
10170 -383562 -19444 -291499 -1121 -120725 -239 -199967 -184484 -53887 6527 -107966 -16010
10158 -126475 -437675 -205678 -224678 -253478 -98835 -300990 -77869 192068 35511 -181504
10147 21797 -27998 78974 -198524 -153312 115207 -125147 97938 -250454 159369 -169876
10136 -49754 14540 61010 -357291 101851 147701 -277654 -275738 -159541 -119933 -157335 49971
10124 8369 211165 21978 -43032 215285 -88329 31321 85921 -11127 -158058 109598 -251195
10112 -476013 182224 279369 206490 -136302 -159147 -209110 186520 130269 -6788 -142453 -434
10100 -103984 223081 -150844 19071 -151541 117830 -242769 -258197 -415200 -473119 52246
$$ packed form
10181b16973h14C6752a14948A36420a75503g2192b1997G4650e2647j25886k05029
10170c83562a9444k72055a121j19604b39j99728J5483e3887F527a07966a6010
10158a26475l11200b05678j9000k8800i8835k02155g7869A92068C5511a81504
10147B1797b7998G8974a98524M5212A15207a25147I7938b50454A59369a69876
10136d9754A4540M6470c57291A01851M5850b77654J916J16197L9608l7402D9971
10124H369K02796B1978d3032B15285h8329C1321N4600a1127j46931A09598b51195
10112d76013A82224R7145p2879a36302k2845m9963A86520n6251f788j35665d34
10100a03984B23081a50844A9071a51541A17830b42769j5428j57003n7919E2246
$$ plain form
10089 123771 -109104 -28455 -56318 -10545 -71840 75353 -116973 -145795 -144942 -49249 -56106 -82133
10077 -82133 31479 212094 -70850 -140028 -219110 77225 169689 -200686 -154329 -271883 20700
10065 -73241 -16577 -48489 146710 135882 42114 -87531 48658 -181634 -266970 66116 -121827
10053 6473 -36615 -115646 37045 -257428 -32633 63080 -167620 -77387 -257924 -181324 -168874
10042 -168874 -112351 -172635 -225933 -318004 102955 -101781 -104035 92940 3878 -121350 20581
10030 -150425 89946 -364732 -542446 -205765 -205574 56770 -185675 73054 -223383 -168138 -56908
10018 -105230 -221404 286127 -163737 26216 -112327 27520 -145832 157850 -95270 -91251
10008 -91251 244595 -33837 226 16610 102254 382599 21813 -233949 -73215 -49014 -162212
$$ packed form
10089A23771a09104b8455k7863a0545o1295G5353a16973k8822Q53d9249o857k6027
10077h2133C1479J80615g0850o9178p9082G7225R2464b00686M6357j17554B0700
10065g3241a6577l1912A46710j0828D2114h7531D8658a81634q5336F6116a21827
10053F473c6615p9031C7045b57428c2633F3080a67620g7387j80537P6600J2450
10042a68874N6523o0284n3298r2071A02955a01781k254I2940C878a21350B0581
10030a50425H9946c64732j77714b05765J91E6770a85675G3054b23383N5245e6908
10018a05230j16174B86127a63737B6216a12327B7520a45832A57850i5270M019
10008i1251B44595c3837B26J6384Q5644K80345B1813b33949g3215K4201j13198
$$ plain form
9997 -162212 -47827 -65607 -138234 -15204 202939 -23888 107571 -32049 135608 163205 -158396
9985 -275087 -291045 -316094 7001 -426763 450196 -297754 69707 -3474 -278871 -112686 111860
9973 -38524 214399 -236663 -587825 -60719 -31799 171799 173527 -163141 225018 -265790 280971
9961 -54890 -239322 43217 388749 -235230 -254677 -200481 -201890 39486 -190211 -131647 -53388
9949 -166614 -87216 -378345 94421 58526 -93552 217376 180564 95860 -267118 -37948 -94302
9938 -94302 -442785 151009 -366307 87403 -88028 -223927 8506 -95477 -31993 196801 -285230
9926 -114000 -330301 -400911 -224750 -116636 -10931 9733 -33934 -28855 -32210 260874 262963 31977
9913 -12258 -320390 29010 44120 -337778 -80646 261131 -210252 -74901 -204519 -122333 165307
$$ packed form
9997a62212d7827j7780p2627a5204B02939b3888A07571c2049A35608K7597a58396
9985b75087j5958k5049G001d26763D50196b97754F9707c474k75397a12686A11860
9973c8524B14399b36663l51162f0719K8920A71799J728a63141B25018b65790B80971
9961e4890j84432D3217L45532b35230j9447N4196j409C9486a90211N8564e3388
9949a66614P9398k91129I4421l5895i3552B17376l6812q4704b67118c7948n6354
9938i4302l48483A51009c66307H7403h8028j35899H506i5477c1993A96801b85230
9926a14000k16301p0610J76161J08114a0931I733c3934N079l355B60874K089C1977
9913a2258l08132B9010J5110c37778h0646B61131b10252g4901j29618Q2186A65307
$$ plain form
9901 103591 -1763 176770 -499413 -24860 -59269 46915 -232587 -50484 41949 -200059 136059
9889 54875 -47628 -82353 -165183 69488 24572 52738 109847 -279028 -102996 31295 -243130
9877 70639 92989 391896 -304548 -63455 -190882 88425 -147627 -306502 -56233 -36608 -226429
9866 -226429 -72549 -326525 27717 37242 92058 -136458 108938 -222601 -224431 -150195 49888
9854 67313 -130988 -144348 -168257 -81037 -96667 -343591 -101428 -16595 133978 2922 -301870
9842 180471 32833 -26575 27845 -119041 137865 -113236 219824 -116236 -117261 -86196 -17283
9830 -49286 51140 76737 3677 -122681 -304261 -62398 38135 -201676 -120919 -192857 198642
9818 -32605 -254393 -31024 -130716 -67258 22454 -42817 212351 14340 -21201 -11639 26500 -195045
$$ packed form
9901A03591a763A76770d99413b4860l4409D6915b32587e0484D1949b00059A36059
9889E4875d7628l4725q2830F9488B4572K8166N7109b79028a02996C1295b43130
9877G0639K2350K98907c04548f3455j27427H8425a47627j58875e6233J9625j89821
9866b26429g2549k53976B7717R525N4816a36458A08938b22601j830P4236D9888
9854F7313a30988j3360k3909h1037j5630k46924a01428a6595A33978B922c01870
9842A80471C2833b6575B7845a19041A37865a13236B19824a16236j025L1065a7283
9830d9286E1140K5597C677a22681j81580f2398C8135b01676Q0757p1938A98642
9818c2605k21788c1024r9692O3458B2454d2817B12351A4340b1201R562B6500a95045
$$ plain form
9805 -52575 10591 -232141 -14417 -113099 -128443 -154090 -330216 -98366 -34893 -30849 -25865 -130250
9793 -130250 -281295 -64293 -169593 -335808 76336 -212675 128011 -308306 67240 38597
9783 38597 -52235 231582 132367 -296202 30922 -264796 -127426 -137961 -54802 -52206 259643
9771 154727 -130459 -360690 29741 9879 81054 191404 -102136 -38623 -218213 -148917 -22257
9759 -212794 263471 -325529 102237 -567415 69707 114364 -192393 182989 88709 -76833
9748 -24473 297618 -382764 -75376 -109519 -18040 -84910 -60290 -297996 -320258 -92050 -57967
9737 -57967 -240438 -39583 129407 -137752 -217957 24768 -198330 153831 -175283 197211
9726 101922 165649 -147798 79133 -157865 -80461 -30751 -328776 121137 -109951 -195082 -146415
$$ packed form
9805e2575A0591b32141a4417r8682j5344k5647j76126i8366c4893M044M984j04385
9793a30250j51045f4293j05300j66215G6336b12675A28011c08306F7240k8643
9783C8597e2235B31582r9215b96202C0922b64796a27426j0535e4802K596B59643
9771A54727a30459k30231B9741I879P1175J10350a02136c8623j79590O9296b2257
9759b12794B63471c25529A02237e67415F9707M4657a92393A82989H8709g6833
9748b4473B97618c82764g5376l4143a8040o6870K4620k37706k2262i2050L4083
9737e7967j82471c9583A29407a37752q0205B4768a98330A53831a75283A97211
9726A01922O3727a47798G9133a57865P7404c0751k98025A21137a09951q5131M8667
$$ plain form
9715 -146415 -198603 -67207 55516 -124978 -256164 117539 206692 153817 43301 168098 47017
9703 70089 72659 -74723 -126647 124176 -89592 -100815 -475917 -114864 -365310 -27589 -142507
9692 -142507 -253617 -105320 -53212 -269470 -384739 -134565 167094 31947 438092 141902
9681 166648 -181535 45906 -60238 -64202 271354 72967 8030 -217150 77918 119327 -104765
9669 68239 -321119 -133976 112038 79847 -255678 -143932 -258172 -100986 278743 -99172
9658 -70258 -98840 59403 -161523 -129163 -100458 -54102 -313711 -42885 20941 77561 288708
9647 288708 129850 -423578 -129292 139302 95549 29536 4479 -77887 143512 -99950 22564
9635 -181293 -204037 155827 -159544 -161438 -214825 50557 108617 -137821 -189577 -19460 -235207
$$ packed form
9715a46415n2188f7207E5516a24978j31186A17539Q9153n2875D3301J24797D7017
9703G0089K570g4723n1924A24176h9592j1223l75102a14864k50446b7589j14918
9692a42507j11110a05320N2108k16258j15269a34565A67094C1947M06145A41902
9681A66648a81535D5906f0238l964B71354G2967H030b17150G7918M1409a04765
9669F8239c21119a33976A12038l2191b55678J11746j14240a00986B78743i9172
9658g0258k8582E9403a61523L2360K8705M6356k59609d2885B0941N6620K11147
9647B88708A29850d23578a29292A39302m3753B9536D479g7887A43512i9950B2564
9635a81293k2744A55827a59544j894n3387E0557N8060a37821n1756a9460k15747
$$ plain form
9624 -235207 -4488 161642 -14409 -90484 -114236 -452991 -201152 -75403 -75162 -66539 84653 91746
9612 91746 -173165 -414435 423501 43887 -54839 69567 -67393 -93478 -70933 -295850 -122895
9600 -57878 -136462 447240 239676 -472345 -271381 -1039 -143471 -208250 -68629 105611 103093
9589 103093 80132 33743 -4614 -143960 109675 81167 -92923 173960 -92190 161687 -40647
9577 -219402 -129438 -129669 -175195 -356757 195414 -30988 -8734 -177858 -266976 172713 -84616
9565 -362997 -260685 258934 134250 104529 -49183 376074 -173099 235536 89924 20716
9554 -132280 48231 68345 -47411 106433 -129218 174282 -71975 -187533 -135200 101740 15595
9542 -115526 -365412 -256452 -84881 -99866 -227453 -15644 76103 -273157 -108534 27810 -26552
$$ packed form
9624b35207d488A61642a4409p6075k3752l38755b01152g5403K41Q623H4653P093
9612I1746a73165k41270D23501D3887e4839F9567f7393k6085K2545k24917a22895
9600e7878p8584D47240k07564d72345K00964a039j42432o4779f8629A05611k518
9589A03093k2961C3743d614j39346A09675k8508i2923A73960i2190A61687d0647
9577b19402Q9964k31m5526j81562A95414c0988h734j69124q9118A72713h4616
9565c62997J02312B58934j24684k9721d9183C76074a73099B35536H9924B0716
9554a32280D8231K0114d7411A06433a29218A74282g1975j15558N2333A01740A5595
9542a15526k49886J08960h4881j4985j27587a5644G6103b73157a08534B7810b6552
$$ plain form
9530 2171 -419970 105948 -114769 -36338 -138622 -99085 -354654 167439 137284 -133003 87081
9518 -220315 -53562 -205928 -153946 -367959 -13063 164024 -59547 -66261 20767 196029 -4506
9506 -32215 -138603 331131 -88723 196981 -61951 3908 8513 -89444 277240 -48892 28185
9494 -284344 -93959 -229594 4736 -174719 248992 117022 -183562 -118085 -61528 164551 211778
9483 211778 91544 -352047 -56550 -128671 48449 -168108 -300268 -6960 -80264 216103 173143
9472 173143 55679 -98415 45478 90875 -132502 5338 -210349 212697 -105660 -253984 136603
9460 42311 -142371 -118584 11543 -73924 8315 245247 -258438 90669 -262843 10544 247449
9449 247449 216554 -426 -195473 158900 -386512 13418 -293934 -113993 86232 -219847 -175496
$$ packed form
9530B171d19970A05948a14769c6338j02284L9537k55569A67439l0155a33003H7081
9518b20315e3562j52366N1982k14013a3063A64024e9547o714B0767J75262d506
9506c2215j06388C31131h8723A96981f1951C908M605h9444B77240d8892B8185
9494b84344i3959j35635D736a74719B48992A17022a83562O5477N6557A64551M7227
9483B11778I1544c52047e6550p2121D8449a68108j32160f960p3304B16103m2960
9472A73143E5679i8415D5478M5397a32502E338b10349B12697a05660j48324A36603
9460D2311a42371K3787A1543g3924H315K36932b58438I0669b62843A0544K36905
9449B47449l0895d26j95047A58900c86512A3418b93934a13993H6232b19847M4351
$$ plain form
9438 -175496 -61596 -69761 -206933 -7537 -366365 122815 -310031 -44342 -65410 -29279 -208788
9427 -208788 -47789 -34821 -216111 -192061 70588 -178396 393116 117746 133120 -137657 -258179
9416 -258179 200862 50722 80695 -88834 202891 -100122 30812 303219 -378106 -78732 -138684
9405 -138684 72704 179417 -205317 28253 43068 50899 -85716 -126322 391840 -33853 -224200
9394 -224200 -244246 -112235 -146154 55822 -2404 48940 101308 -34412 -161767 -63324 53568
9382 -202083 241257 -9089 -312318 -5180 -6220 -60436 -239763 207594 -20168 -225165 220913
9370 -276822 -203461 87169 -93570 -219161 53631 -404630 217823 50705 147523 -153344 -357725
9359 -357725 -75231 -360369 -202520 8663 -377566 -51953 76381 -85969 57257 142154 134652
$$ packed form
9438a75496f1596q165j37172g537l58828A22815c10031d4342k1068b9279j79509
9427b08788d7789J2968j81290K4050G0588a78396C93116A17746J5374a37657j20522
9416b58179B00862E0722K9973h8834B02891a00122C0812K72407c78106g8732n9952
9405a38684G2704J06713b05317B8253J4815P831h5716m0606C91840c3853j90347
9394b24200k0046a12235l3919E5822b404D8940N2368c4412j27355f3324E3568
9382b02083B41257i089l03229e180j040n4216j79327B07594b0168k04997B20913
9370b76822P3361H7169i3570j25591E3631d04630B17823E0705R6818a53344k04381
9359c57725g5231k85138J57849H663c77566e1953G6381h5969E7257Q4897p502
$$ plain form
9348 134652 -136001 67052 -32707 -128381 36848 -65632 50715 -204655 -133144 11778 211209
9337 211209 175455 170119 -64120 61455 -2139 145790 -77326 -97207 -40098 355655 -139759
9325 177191 116588 -66844 38467 82211 -315294 114127 288876 -88365 -140488 99577 -236184
9313 53333 -160948 18291 230790 44400 271373 114147 -137101 -177411 -155214 -320682 80822
9301 427864 95617 -415055 306436 -63638 101027 27420 -162872 143249 151965 -76952 -360305
9290 -360305 28954 256045 150915 -78725 134964 -52499 -100897 -43016 -66640 30331 -29640
9278 56675 65229 -70431 376989 -162868 -52625 -243158 212630 -83245 -46478 105539 100728
9267 100728 3620 -195180 -209560 35353 -1058 -119898 152562 61080 -363012 -147673 201314
$$ packed form
9348A34652a36001F7052c2707r5674C6848f5632E0715b04655P1511A1778J99431
9337B11209l5754n336f4120F1455b139A45790g7326j9881d0098C55655a39759
9325A77191o0603f6844C8467M3744c15294A14127J74749h8365n2123I9577b36184
9313E3333a60948A8291K12499D4400K26973A14147a37101m0310K2197j65468H0822
9301D27864I5617d15055C06436f3638A01027B7420a62872A43249Q716g6952k83353
9290c60305B8954K27091j05130g8725A34964e2499m8398d3016k3624C0331b9640
9278E6675Q554g0431C76989a62868e2625j90533B12630h3245L6767A05539m811
9267A00728C620a95180j4380C5353a058j18840A52562F1080c63012a47673B01314
$$ plain form
9255 72906 -79410 -8122 -299650 -614362 -259607 -215905 -143729 -179570 79890 -78302 1082 11407
9243 11407 -268079 -127900 204783 -191379 192549 118033 -252699 -441416 38717 -122108
9232 -228129 31896 -229836 501 -21178 -116829 -185533 -18897 -53726 -453250 -181904 -163140
9221 -163140 104654 -108886 -62989 213106 -255428 -400 -134991 -467368 -91314 -131379 -40711
9209 -62563 -142641 20108 217402 131041 -95485 -8910 49578 -69529 -4178 78986 44544 -467425
9196 130243 -40534 -195074 -138320 168284 -142299 -192143 -9952 -213737 -156951 -240198 -125162
9185 -125162 3167 15937 61300 35439 -214626 -47184 101775 -325212 272007 -164497 -203536
9174 -203536 -47150 338042 -274483 159017 -219603 -223603 -100783 10135 28647 57196 -18830
$$ packed form
9255G2906g9410h122k91528l14712b59607M3702P2176l5841G9890g8302A082J0325
9243A1407b68079a27900B04783a91379A92549p4516b52699j88717C8717a22108
9232b28129C1896b29836E01b1178r5651o8704a8897l4829l99524a81904J8764
9221a63140A04654a08886M5897B13106b55428d00j34591l32377i1314m0065d0711
9209f2563q0078B0108J97294q6361i5485h910D9578f9529d178G8986l4442d67425
9196A30243d0534j54540N6754A68284a42299m9844i952k03785N6786q3247J15036
9185a25162C167J2770M5363k5861b14626d7184A01775c25212B72007a64497l9039
9174b03536d7150C38042b74483A59017b19603m000a00783A0135J8512K8549a8830
$$ plain form
9162 -209648 61353 -118389 -117412 -78249 -270339 -159015 107695 -357671 49348 150792 -113228
9150 72888 8842 -124131 121820 -60760 83918 57402 -125894 164624 60538 -320633 -266301
9139 -266301 48488 214806 -157419 -104277 145074 164544 -55947 -385790 -73482 -169127 -188103
9128 -188103 166835 -51935 -217819 73311 -42428 95165 -146506 -167483 -103484 32122 -64529
9116 -80397 59582 -147690 16554 133522 -152842 77326 202686 -318776 -123783 63221 -198471
9104 38014 12907 25830 -151862 -131381 -102055 265958 -50575 49195 -215959 124352 157105
9093 157105 156615 59596 411762 44615 -194898 145393 222992 120692 -32810 97799 405843
9082 405843 -148448 -23469 244157 -32782 287116 -196438 -103523 -145236 -104407 260255 144513
$$ packed form
9162b09648F1353a18389R77L9163j92090J11324A07695c57671D9348J01444a13228
9150G2888H842a24131A21820f0760H3918k6516a25894A64624F0538c20633N4332
9139b66301D8488J66318a57419N3142A45074J9470e5947l29843g3482r5645j8976
9128a88103A66835e1935j65884G3311d2428I5165a46506k0977O3999C2122f4529
9116h0397E9582a47690A6554J16968a52842G7326J25360c18776a23783F3221a98471
9104C8014A2907J2923a51862K0481K9326B65958e0575D9195b15959A24352L2753
9093A57105m90E9596L52166D4615a94898A45393P7599j02300c2810I7799L08044
9082D05843a48448b3469B44157c2782B87116a96438R2915m1713M0829B60255j15742
$$ plain form
9071 144513 -238055 239446 -181521 -133103 -286265 44459 -121906 -96549 -220725 -232454
9061 -232454 8427 183292 -414841 -171805 -357892 217613 -99827 -106298 -148956 -22838 -34149
9050 -34149 -38802 -59734 -223543 19989 -255601 39292 -137571 56177 54576 -392738 -302095
9039 -302095 -106496 -142833 85026 56286 -114754 -12074 20336 277306 -65690 97051 111743
9028 111743 -209287 -152056 -229363 93423 117395 24246 99810 109031 -10192 -114859 287329
9016 124913 98695 15385 -128851 267824 40778 14329 -338896 111670 -248924 7071 -145580
9004 -180266 -171224 -344477 -156084 25362 -169319 -194008 -11950 193837 174733 138358 27707
8992 -59586 -213429 178650 -135415 135061 -262594 -196208 -238882 -313791 64356 -47110 4783
$$ packed form
9071A44513b38055B39446a81521M8418j53162D4459a21906K5357j24176j1729
9061b32454H427J74865d14841a71805j86087B17613i9827o471m2658b2838j1311
9050c4149m653k0932j63809A9989b55601C9292a37571E6177j601c92738R0643
9039c02095a06496l6337H5026k8740a14754a2074B0336K56970f5690I7051J4692
9028A11743b09287N7231p7307I3423K3972B4246P5564R221a0192j04667B87329
9016A24913k6218A5385a28851B67824D0778A4329c38896A11670b48924G071a45580
9004a80266R042j73253a56084B5362a69319k4689a1950A93837j9104l6375B7707
8992e9586j53843A78650a35415A35061b62594O6386m2674p4909F4356d7110D783
$$ plain form
8980 134076 -158286 130542 -115311 -267170 -243181 178459 -14653 14287 241518 175301
8970 175301 162728 48167 -31663 55152 -30625 -200096 -150177 113583 -122111 231790 5091
8958 -139110 56407 190737 -84041 -280605 -205258 -56062 -126019 18334 -100716 -4888 -1931
8946 -342556 -214735 -10218 -259008 -133297 156284 -63133 -112671 23562 -149726 -204275 184917
8934 -35306 953 177990 7286 239311 12199 -36933 -114237 -231772 -284675 108189 186616 -7943
8921 -74100 548901 303092 134738 343397 106526 -267351 -161741 -505983 -222001 -100591
8910 -319019 -180044 69845 133082 -343486 -331237 216462 199065 -31793 -76324 -195138 -103340
8899 -103340 -396669 -82209 -1741 -83055 51566 51850 122815 -4742 108980 344649 -495 -283793
$$ packed form
8980A34076a58286A30542a15311j51859K3989A78459a4653A4287K27231o6217
8970A75301j2573D8167c1663E5152c0625j69471M9919A13583a22111B31790E091
8958a39110E6407J34330h4041j96564P5347e6062o9957A8334a00716d888a931
8946c42556J27821a0218k48790J25711A56284f3133m9538B3562a49726n4549A84917
8934c5306I53J77037G286K32025A2199c6933p7304j17535n2903A08189P8427g943
8921g4100E48901k45809A34738K08659A06526b67351J05610l44242b22001a00591
8910c19019J38975F9845O3237c43486J2249B16462j7397c1793m4531j18814R1798
8899a03340k93329h2209a741q1314E1566K84P0965d742A08980K35669d95k83298
$$ plain form
8887 -283793 186049 -32100 121793 156096 -49455 70908 -318509 -84150 -180264 -191160 -408686
8876 -408686 -33671 63079 -65755 -21202 -184443 -213975 -5663 -430005 -17353 700 -8594 224670
8863 342598 -278448 -127873 -91558 -120989 39206 251685 150442 27484 -17224 -63535 -46908
8852 -46908 23317 -331105 45162 -44343 -93465 185911 2591 -247914 99763 60237 -64887
8840 -310374 194478 -208300 -193368 6050 -223941 -24669 -112122 -93808 -259866 133641 -25358
8828 -196497 -238211 -437102 209316 -135297 454334 -224131 -259347 179895 12321 19521 -139716
$$ packed form
8887b83793A86049c2100A21793L4303d9455G0908c18509h4150r6114j0896k17526
8876d08686c3671F3079f5755b1202j63241k9532e663m24342a7353G00h594B24670
8863C42598b78448a27873L6315k9431C9206K12479j01243B7484a7224m6311J6627
8852d6908B3317c31105D5162d4343m9122A85911B591b47914I9763l9526f4887
8840c10374A94478b08300J4932F050b23941b4669q7453J8314j66058A33641b5358
8828a96497m1714j98891B09316a35297D54334b24131l5216A79895A2321P200a39716
$$ [...]
##END NTUPLES=NMR SPECTRUM
##END=
