##TITLE=AC1669_DOMRH14360_8570773_FWEQ2OPx1Q
##JCAMPDX= 6.0         $$ Bruker NMR JCAMP-DX V2.0
##DATA TYPE= NMR SPECTRUM
##DATA CLASS= NTUPLES
##ORIGIN= BRUKER
##OWNER= Administrator
$$ 1.72 TOPSPIN		Version 2.1
$$ 2015-08-08 05:10:45.328 -0700  Administrator@X
$$ Compression mode = diff/dup
##.OBSERVE FREQUENCY= 400.02188249412
##.OBSERVE NUCLEUS= ^1H
##.ACQUISITION MODE= SIMULTANEOUS (DQD)
##.ACQUISITION SCHEME= undefined
##.AVERAGES= 64
##.DIGITISER RES= 22
##SPECTROMETER/DATA SYSTEM= spect
##.PULSE SEQUENCE= noesygpps1d.comp
##.SOLVENT NAME= COFFEE_meoh
##.SHIFT REFERENCE= INTERNAL, COFFEE_meoh, 1, 14.96172
##AUDIT TRAIL= $$ (NUMBER, WHEN, WHO, WHERE, PROCESS, VERSION, WHAT)
$$ ##TITLE= Audit trail, TOPSPIN		Version 2.1
$$ ##JCAMPDX= 5.01
$$ ##ORIGIN= Bruker BioSpin GmbH
$$ ##OWNER= Administrator
$$ $$ E:\/data/COFFEE/nmr/AC1669_DOMRH14360_8570773_FWEQ2OPx1Q/22/pdata/1/auditp.txt
$$ ##AUDIT TRAIL=  $$ (NUMBER, WHEN, WHO, WHERE, PROCESS, VERSION, WHAT)
(   1,<2015-08-08 05:10:39.797 -0700>,<Administrator>,<X>,<go>,<TOPSPIN 2.1>,
      <created by zg
	started at 2015-08-08 04:59:10.297 -0700,
	POWCHK enabled, PULCHK disabled,
       configuration hash MD5:
       21 0F 79 D6 B3 7B B4 F6 88 20 88 DB 03 48 BD 9F
       data hash MD5: 64K
       2D C3 C4 FA AA 6A 1C 51 A1 71 DA 57 06 F5 EC 5B>)
(   2,<2015-08-08 05:10:43.219 -0700>,<Administrator>,<X>,<proc1d>,<TOPSPIN 2.1>,
      <Start of raw data processing
       efp LB = 0.3 FT_mod = 6 PKNL = 1 PHC0 = 0 PHC1 = 0 SI = 128K 
       data hash MD5: 128K
       DA 69 C0 79 77 6E 22 29 A9 94 7F 72 5D 4F ED 71>)
(   3,<2015-08-08 05:10:44.125 -0700>,<Administrator>,<X>,<proc1d>,<TOPSPIN 2.1>,
      <pk PHC0 = -83.91357 PHC1 = 0 
       data hash MD5: 128K
       D4 EC D3 7C FA EC 8D 91 87 D3 DF 9F 8B 31 D9 07>)
(   4,<2015-08-08 05:10:44.500 -0700>,<Administrator>,<X>,<proc1d>,<TOPSPIN 2.1>,
      <abs ABSG = 1 
       data hash MD5: 128K
       2F 80 AD CD 09 BC DC 79 FD CC 2F A1 36 D5 18 B9>)
(   5,<2015-08-08 05:10:44.594 -0700>,<Administrator>,<X>,<proc1d>,<TOPSPIN 2.1>,
      <abs ABSG = 2 
       data hash MD5: 128K
       F4 DC 01 01 8B B7 06 A9 01 E4 FE 13 56 A8 96 E9>)
(   6,<2015-08-08 05:10:44.688 -0700>,<Administrator>,<X>,<proc1d>,<TOPSPIN 2.1>,
      <abs ABSG = 3 
       data hash MD5: 128K
       49 2B DB C0 14 09 BB D1 8C 40 4F 63 F4 F0 2F 5E>)
(   7,<2015-08-08 05:10:44.766 -0700>,<Administrator>,<X>,<proc1d>,<TOPSPIN 2.1>,
      <abs ABSG = 4 
       data hash MD5: 128K
       FD C6 35 D8 D4 94 81 DB 39 AC C5 55 80 86 A3 82>)
(   8,<2015-08-08 05:10:44.891 -0700>,<Administrator>,<X>,<proc1d>,<TOPSPIN 2.1>,
      <abs ABSG = 5 
       data hash MD5: 128K
       E4 6C 21 16 24 F7 1F 24 06 E4 AF 5D FF D0 B5 10>)
$$ ##END=
$$ 
$$ $$ hash MD5
$$ $$ 25 5E 15 56 EB B7 BD 7E B6 B3 57 4B DE 55 8B 13
##$RELAX= 
##$RELAX= 
##$RELAX= 
##$RELAX= 
##$RELAX= 
##$RELAX= 
##$RELAX= 
##$RELAX= 
$$ Bruker specific parameters
$$ --------------------------
##$DU= <E:\>
##$EXPNO= 22
$$ [...]
##$TP07= 0
##$TPNAME0= <>
##$TPNAME1= <>
##$TPNAME2= <>
##$TPNAME3= <>
##$TPNAME4= <>
##$TPNAME5= <>
##$TPNAME6= <>
##$TPNAME7= <>
##$TPOAL= (0..7)
0.5 0.5 0.5 0.5 0.5 0.5 0.5 0.5
##$TPOFFS= (0..7)
0 0 0 0 0 0 0 0
##$TUNHIN= 0
##$TUNHOUT= 0
##$TUNXOUT= 0
##$USERA1= <user>
##$USERA2= <user>
##$USERA3= <user>
##$USERA4= <user>
##$USERA5= <user>
##$V9= 5
##$VALIST= <valist>
##$VCLIST= <CCCCCCCCCCCCCCC>
##$VD= 0
##$VDLIST= <DDDDDDDDDDDDDDD>
##$VPLIST= <PPPPPPPPPPPPPPP>
##$VTLIST= <TTTTTTTTTTTTTTT>
##$WBST= 2048
##$WBSW= 25
##$XGAIN= (0..3)
0 0 0 0
##$XL= 0
##$YL= 0
##$YMAX_a= 4707237
##$YMIN_a= -9701628
##$ZGOPTNS= <>
##$ZL1= 120
##$ZL2= 120
##$ZL3= 120
##$ZL4= 120
##$ABSF1= 14.96172
##$ABSF2= -5.596461
##$ABSG= 5
##$ABSL= 3
##$ALPHA= 0
##$AQORDER= 0
##$ASSFAC= 0
##$ASSFACI= 0
##$ASSFACX= 0
##$ASSWID= 0
##$AUNMP= <proc_prof1d_extract.lims>
##$AXLEFT= 0
##$AXNAME= <>
##$AXNUC= <1H>
##$AXRIGHT= 0
##$AXTYPE= 0
##$AXUNIT= <>
##$AZFE= 0.1
##$AZFW= 0.1
##$BCFW= 0
##$BC_mod= 0
##$BYTORDP= 0
##$COROFFS= 0
##$CY= 15
##$DATMOD= 1
##$DC= 0
##$DFILT= <>
##$DTYPP= 0
##$F1P= 0
##$F2P= 0
##$FCOR= 0.5
##$FTSIZE= 131072
##$FT_mod= 6
##$GAMMA= 0
##$GB= 0
##$INTBC= 1
##$INTSCL= 1
##$ISEN= 128
##$LB= 0.3
##$LEV0= 0
##$LPBIN= 0
##$MAXI= 10000
##$MC2= 0
##$MEAN= 0
##$ME_mod= 0
##$MI= 0
##$NCOEF= 0
##$NC_proc= -2
##$NLEV= 6
##$NOISF1= 0
##$NOISF2= 0
##$NSP= 0
##$NTH_PI= 0
##$NZP= 0
##$OFFSET= 14.96172
##$PC= 1
##$PHC0= -83.91357
##$PHC1= 0
##$PH_mod= 1
##$PKNL= yes
##$PPARMOD= 0
##$PPDIAG= 0
##$PPIPTYP= 0
##$PPMPNUM= 2147483647
##$PPRESOL= 1
##$PSCAL= 4
##$PSIGN= 0
##$PYNMP= <proc.py>
##$REVERSE= no
##$SF= 400.020009348024
##$SI= 131072
##$SIGF1= 0
##$SIGF2= 0
##$SINO= 400
##$SIOLD= 131072
##$SPECTYP= <>
##$SREGLST= <1H.CDCl3>
##$SSB= 0
##$STSI= 131072
##$STSR= 0
##$SW_p= 8223.68421052631
##$SYMM= 0
##$S_DEV= 0
##$TDeff= 65536
##$TDoff= 0
##$TI= <>
##$TILT= no
##$TM1= 0
##$TM2= 0
##$TOPLEV= 0
##$USERP1= <user>
##$USERP2= <user>
##$USERP3= <user>
##$USERP4= <user>
##$USERP5= <user>
##$WDW= 1
##$XDIM= 131072
##$YMAX_p= 416480304
##$YMIN_p= -10730
##$CURPLOT= <Network HP LaserJet P1505>
##$CURPRIN= <$Network HP LaserJet P1505>
##$DFORMAT= <normdp>
##$LAYOUT= <+/1D_H.xwp>
##$LFORMAT= <normlp>
##$PFORMAT= <normpl>
##$SURQMSG= 1
$$ End of Bruker specific parameters
$$ ---------------------------------
##NTUPLES= NMR SPECTRUM
##VAR_NAME=  FREQUENCY,     SPECTRUM/REAL,   SPECTRUM/IMAG
##SYMBOL=    X,             R,               I
##VAR_TYPE=  INDEPENDENT,   DEPENDENT,       DEPENDENT
##VAR_FORM=  AFFN,          ASDF,            ASDF
##VAR_DIM=   131072,        131072,          131072
##UNITS=     HZ,            ARBITRARY UNITS, ARBITRARY UNITS
##FACTOR=    0.0627417313425164, 1,          1
##FIRST=     8223.62146879497, -1080,        -35965
##LAST=      0,             -684,            -36483
##MIN=       0,             -10730,          0
##MAX=       8223.62146879497, 416480304,    0
$$ Real data points
##PAGE= N=1
##DATA TABLE= (X++(R..R)), XYDATA
$$ [...]
61612D95206m544n108n153n290n892o413o415o479p075p319o129m062k698k550
$$ 495206 490662 485554 480401 475111 469219 462806 456391 449912 442837 435518 429389 425327 422629 420079
61598D20079k843l081l480l945l879l225k646k586k878l352l954m261l692k351
$$ 420079 417236 414155 410675 406730 402851 399626 396980 394394 391516 388164 384210 379949 376257 373906
61584C73906j072n03o10j009j327j338j140j010q86m08K72M05k05p26n57k50m89
$$ 373906 372834 372331 371721 370712 369385 368047 366907 365897 365011 364603 364875 365280 365075 364349 363792 363542 363053
61567C63053r98j322j735k382k398j170K80O05J95M30J279J322J35r38p05L99
$$ 363053 362055 360733 358998 356616 354218 353048 353328 353933 354128 354558 355837 357159 357294 356356 355651 356050
61551C56050J194J184P75O42J127J865K147J903J888K413K622J796O30J96L17
$$ 356050 357244 358428 359203 359845 360972 362837 364984 366887 368775 371188 373810 375606 376236 376432 376749
61536C76749J91J8N72J502J481J49j424k209k166j659j017p06r69j207o31N26
$$ 376749 376940 376958 377530 379032 380513 380662 379238 377029 374863 373204 372187 371481 370512 369305 368674 369200
61520C69200J204Q89p8j264k335k670j866o24j35n74j036q65k37L85N88l5j344
$$ 369200 370404 371293 371215 369951 367616 364946 363080 362456 362321 361747 360711 359846 359609 359994 360582 360547 359203
61503C59203k299k017r72k74r2J97P30J117J442K054K509J990P51rK44R65J658
$$ 359203 356904 354887 353915 353641 353549 353746 354476 355593 357035 359089 361598 363588 364339 364330 364574 365539 367197
61486C67197K313K695K309J330N24J85m2k62j93M0j00o93j263j549j589j230l84
$$ 367197 369510 372205 374514 375844 376368 376553 376511 376249 376056 376096 375996 375303 374040 372491 370902 369672 369288
61469C69288L96M72Q5p4K9k1j16J22M25L26J40M22P42L75k19O4J063J457P76q8
$$ 369288 369684 370156 370241 370167 370196 370175 370059 370181 370606 370932 371072 371494 372236 372611 372392 372456 373519 374976 375752 375664
61449C75664l93k97j2N28J021J064J068J797L012L770M018M527N297N484M966
$$ 375664 375271 374974 374962 375490 376511 377575 378643 380440 383452 387222 391240 395767 401064 406548 411514
61434D11514M627M805M772M067L163K556K309K536L224L580K790J351M37M3p72
$$ 411514 416141 420946 425718 429785 432948 435504 437813 440349 443573 447153 449943 451294 451731 451774 451002
61419D51002j951k410k019j882k383k632k192j805j876j846j506j458j728j452
$$ 451002 449051 446641 444622 442740 440357 437725 435533 433728 431852 430006 428500 427042 425314 423862
61405D23862n58j75p64j281q95k07Rl7Oj12l83j65O76J230Q76J06m09n91l53N30
$$ 423862 423304 423129 422365 421084 420189 419982 419991 419954 419960 419848 419465 419300 419976 421206 422082 422188 421779 421188 420835 421365
61385D21365J566J831J516J897L208M017L352K102J581J920K598L382M036M207
$$ 421365 422931 424762 426278 428175 431383 435400 438752 440854 442435 444355 446953 450335 454371 458578
61371D58578M185M656N347N225M369M103M779N156M588M009L940L519K553K567
$$ 458578 462763 467419 472766 477991 482360 486463 491242 496398 500986 504995 508935 512454 515007 517574
61357E17574M373O371O919O804P627R092R891J0144J0916J1982J1988J0458Q102
$$ 517574 521947 528318 535237 542041 549668 558760 568651 578795 589711 601693 613681 624139 632241
61344F32241N431K542n4j773k922m233n618o417o547o418o102n471m850m618m441
$$ 632241 637672 640214 640160 638387 635465 631232 625614 619197 612650 606232 600130 594659 589809 585191 580750
61329E80750l795k896k343k088j589p37j2J49k73q66r72k90O15J048J355K397
$$ 580750 576955 574059 571716 569628 568039 567302 567290 567439 567166 566300 565328 565038 565653 566701 568056 570453
61313E70453L883M598M543N207P164Q989R591J0012J1614J3715J4488J3329J0979
$$ 570453 574336 578934 583477 588684 595848 604837 614428 624440 636054 649769 664257 677586 688565
61300F88565Q122N127K484L86j553l294l988l492l228m298n726n922n007m253
$$ 688565 696687 701814 704298 704684 703131 699837 695849 692357 689129 684831 679105 673183 668176 663923
61286F63923l924l257k178j450j277j040l43O04J553K376K910L364M407O229P963
$$ 663923 659999 656742 654564 653114 651837 650797 650454 651058 652611 654987 657897 661261 665668 671897 679860
61271F79860Q827R135R492R747R619R635J0427J1679J2666J3276J3608J3257J1917
$$ 679860 688687 697822 707314 717061 726680 736315 746742 758421 771087 784363 797971 811228 823145
61258H23145J0043Q019N335J535k709o389r350j1806j3494j4270j4707j5071j4533
$$ 823145 833188 841207 846542 848077 845368 838979 829629 817823 804329 790059 775352 760281 745748
61245G45748j2528j0076q508p655o569n292m476l911k845j350q9Q72J813K419
$$ 745748 733220 723144 714636 706981 700412 695120 690644 686733 683888 682538 682449 683321 685134 687553
61231F87553K293J914J945K052J599J030J270K221L045L520L876L781K780J482
$$ 687553 689846 691760 693705 695757 697356 698386 699656 701877 704922 708442 712318 716099 718879 720361
61217G20361R67J351J987K765M007N439O425O968P437P733P734Q072R289J0680
$$ 720361 721328 722679 724666 727431 731438 736877 743302 750270 757707 765440 773174 781246 790535 801215
61203H01215J1199J1134J1640J2936J4161J4740J4790J4496J4130J4331J5300
$$ 801215 812414 823548 835188 848124 862285 877025 891815 906311 920441 934772 950072
61192I50072J6098J5661J4017J1587Q080L336j447m777o680q232r832j1165j2308
$$ 950072 966170 981831 995848 1007435 1015515 1018851 1017404 1012627 1005947 997715 987883 976718 964410
61179I64410j3536j4538j5118j5991j7597j8866j8670j7784j7663j8013j7434
$$ 964410 950874 936336 921218 905227 887630 868764 850094 832310 814647 796634 779200
61168G79200j5920j4685j3786j2083r564p666p025o679n826m771l810k659j403
$$ 779200 763280 748595 734809 722726 713162 705496 698471 691792 685966 681195 677385 674726 673323
61155F73323p73j034j595j831j434j03K060M085N155N620N924N221K644n91k194
$$ 673323 672550 671516 669921 668090 666656 666553 668613 672698 677853 683473 689397 694618 697262 696671 694477
61140F94477j677m60O85K352M661O697Q169R922J2294J4337J5200J5082J4533
$$ 694477 692800 692340 693025 695377 700038 706735 714904 724826 737120 751457 766657 781739 796272
61127G96272J3889J3574J3931J4616J5089J5464J5937J5803J4359J2321J0968
$$ 796272 810161 823735 837666 852282 867371 882835 898772 914575 928934 941255 952223
61116I52223J0262R223P660O042M145J577q42k080k823m499o756q021q264q981
$$ 952223 962485 971708 979368 985410 989555 991132 990290 988210 985387 980888 974132 966111 957847 948866
61102I48866j0560j1954j2962j4572j6800j8426j9162j9940k0805k0602j9123
$$ 948866 938306 926352 913390 898818 882018 863592 844430 824490 803685 783083 763960
61091G63960j7485j6100j4319j2328j1159j0553r102o867n512n440n205m286l861
$$ 763960 746475 730375 716056 703728 692569 682016 672914 666047 660535 655095 649890 645604 641743
61078F41743m167l715k057p60n49J5J809L468L850L883M550N149N146N658P462
$$ 641743 637576 633861 631804 631044 630495 630510 632319 635787 639637 643520 648070 653219 658365 664023 671485
61063F71485R328R994J0174J1051J2313J3190J4001J5250J6496J7325J8166J9146
$$ 671485 680813 690807 700981 712032 724345 737535 751536 766786 783282 800607 818773 837919
61051H37919J9528J9223J9275J9972K0198J9511J9032J9272J9082J7782J6408
$$ 837919 857447 876670 895945 915917 936115 955626 974658 993930 1013012 1030794 1047202
61040A047202J5703J4936J3840J3506J4152J4237J3168J2546J3293J4048J4000
$$ 1047202 1062905 1077841 1091681 1105187 1119339 1133576 1146744 1159290 1172583 1186631 1200631
61029A200631J4757J7478K0683K3002K5674L0124L5385M0299M5944N3338O0884
$$ 1200631 1215388 1232866 1253549 1276551 1302225 1332349 1367734 1408033 1453977 1507315 1568199
61018A568199O6596P0759P4154P6167P7307Q0933Q9404J00905J13096J27137J44597
$$ 1568199 1634795 1705554 1779708 1855875 1933182 2014115 2103519 2204424 2317520 2444657 2589254
61007B589254J63176J79590J94447K10556K29408K53897K91290L47996M24295
$$ 2589254 2752430 2932020 3126467 3337023 3566431 3820328 4111618 4459614 4883909
60998D883909N19810O40303P91661R71523J177328J419589J715426K073314K500191
$$ 4883909 5403719 6044022 6835683 7807206 8984534 10404123 12119549 14192863 16693054
60989A6693054L010942L578848M043114M108752L531010K356139R62514j77226
$$ 16693054 19703996 23282844 27325958 31434710 34965720 37321859 38284373 38107147
60981C8107147p89476q73697n56043L2485P05716J143122R97941J55178j134012
$$ 38107147 37317671 36443974 35887931 35920416 36626132 37769254 38767195 38922373 37788361
60972C7788361k409637l304410l711461l724072l486839l114231k689034k271715
$$ 37788361 35378724 32074314 28362853 24638781 21151942 18037711 15348677 13076962
60964A3076962j894927j566408j285741j053195q64786p10673n83016m80107m01126
$$ 13076962 11182035 9615627 8329886 7276691 6411905 5701232 5118216 4638109 4236983
60955D236983l41783k96823k62535k35362k11655j90207j72010j56532j41179
$$ 4236983 3895200 3598377 3335842 3100480 2888825 2698618 2526608 2370076 2228897
60946B228897j25123j10433r8249q6991p5844o7155o3212o2816o2976o2367o1185
$$ 2228897 2103774 1993341 1895092 1808101 1732257 1665102 1601890 1539074 1476098 1413731 1352546
60935A352546n9043n5144m9835m4322l9111l3928k8825k4331k0740j7998j5934
$$ 1352546 1293503 1238359 1188524 1144202 1105091 1071163 1042338 1018007 997267 979269 963335
60924I63335j4104j1968r774q619q927r519r059p880p453q334r599j0198j0071
$$ 963335 949231 937263 927489 918870 909943 900424 891365 883485 876032 867698 858099 847901 837830
60911H37830r818r944j0633j1827j3235j4470j5232j5354j4771j3645j2406j1473
$$ 837830 828012 818068 807435 795608 782373 767903 752671 737317 722546 708901 696495 685022
60899F85022j0915j0490r946r226q486p936p555p007o054m945m024l074j567L21
$$ 685022 674107 663617 653671 644445 635959 628023 620468 613461 607407 602462 598438 595364 593797 594118
60885E94118J674K078K298L130M187M557M289M408N454O791P509P405O848O246
$$ 594118 595792 597870 600168 603298 607485 612042 616331 620739 626193 632984 640493 647898 654746 660992
60871F60992N884N871N976N776N166M492M088M006M236M809N482N740N317M472
$$ 660992 666876 672747 678723 684499 689665 694157 698245 702251 706487 711296 716778 722518 727835 732307
60857G32307L649L195L418M379N451N604M495K776J107n88k472m061m759m713
$$ 732307 735956 739151 742569 746948 752399 758003 762498 765274 766381 765793 763321 759260 754501 749788
60843G49788m609m894n726p267r443j1690j3449j4563j4778j3547j1023q597p429
$$ 749788 745179 740285 734559 727292 717849 706159 692710 678147 663369 649822 638799 630202 622773
60830F22773o951n846m068k635j751n81J096K476L219L992N136O042O381O813
$$ 622773 615822 609976 605908 603273 601522 600941 602037 604513 607732 611724 616860 622902 629283 636096
60816F36096P789Q774R373J0223J1936J4016J5681J7066J8734K0574K2105K3397
$$ 636096 643885 652659 662032 672255 684191 698207 713888 730954 749688 770262 792367 815764
60804H15764K4790K6101K6867K7110K7195K7120K6597K5573K4158K2320K0094
$$ 815764 840554 866655 893522 920632 947827 974947 1001544 1027117 1051275 1073595 1093689
60793A093689J7718J5097J1626P112K476j260m304p644j1513j5089j7695j9487
$$ 1093689 1111407 1126504 1138130 1145242 1147718 1146458 1142154 1134510 1122997 1107908 1090213 1070726
60781A070726k0817k1570k1510k0956k0681k1112k1819k2025k1572k1051k0838
$$ 1070726 1049909 1028339 1006829 985873 965192 944080 922261 900236 878664 857613 836775
60770H36775k0490j9594j8715j8676j9166j9014j7763j6021j4311j2709j1643
$$ 836775 816285 796691 777976 759300 740134 721120 703357 687336 673025 660316 648673
60759F48673j1696j2270j1833j0054q349p710p300o119m649l647k565o68J223
$$ 648673 636977 624707 612874 602820 594471 586761 579461 573342 568693 565046 562481 561813 563036
60746E63036J703Q60j27r44k132l417l694k752j650j164r59m96J68Q22J475K135
$$ 563036 564739 565599 565472 564528 562396 558979 555285 552533 550883 549719 548760 548264 548432 549254 550729 552864
60730E52864K739L343L856L705K448N72r75j869k424k823l087l598m795o405p660
$$ 552864 555603 558946 562802 566507 568955 569527 568552 566683 564259 561436 558349 554751 549956 543551 535891
60715E35891q237q393q320q013p566p041o358n764n937o860p210n921l858k840
$$ 535891 527654 519261 510941 502928 495362 488321 481963 476199 470262 463402 456192 450271 446413 443573
60701D43573l257l896l858l374k699j686o63n12j286j808j157J83J184J537J569
$$ 443573 440316 436420 432562 429188 426489 424803 424140 423628 422342 420534 419377 419560 420744 422281 423850
60686D23850J482J248R75Q82J038J344J696K116K825L944N069N521N278N213N943
$$ 423850 425332 426580 427555 428437 429475 430819 432515 434631 437456 441400 446469 451990 457268 462481 468424
60671D68424O913P130O365N034L454J977J298J711K473K833L185M207N328N388
$$ 468424 475337 482467 488832 493866 497320 499297 500595 502306 504779 507612 510797 515004 520332 525720
60657E25720M595M400N417O703P310P306P013O387N544M864M217K921Q86j112
$$ 525720 530315 534715 540132 546835 554145 561451 568464 574851 580395 585259 589476 592397 593283 592171
60643E92171k569l876n398o788p628q090q434q457p900p009o318o172o519o854
$$ 592171 589602 585726 580328 573540 565912 557822 549388 540931 533031 526022 519704 513532 507013 500159
60629E00159o405m893l039j812j374j300j446j785j807j167p44j683l398l989
$$ 500159 493754 488861 485822 484010 482636 481336 479890 478105 476298 475131 474387 472704 469306 465317
60615D65317k890j709j844k677k892k403j908j460n74O45J531J744J459R37M03
$$ 465317 462427 460718 458874 456197 453305 450902 448994 447534 446960 447605 449136 450880 452339 453276 453679
60600D53679R7Kk26o26o63N3J157K032K555K879K942K679K476K790L434L671K977
$$ 453679 453776 453778 453552 452926 452263 452316 453473 455505 458060 460939 463881 466560 469036 471826 475260 478931 481908
60583D81908J547J29m71N4J226K170K425K258K183K462L111M044N010N674N981
$$ 481908 483455 483584 483113 483167 484393 486563 488988 491246 493429 495891 499002 503046 508056 513730 519711
60568E19711O307P119Q606J0592J2675J4445J5772J6882J7995J8956J9352J8837
$$ 519711 526018 533137 541743 552335 565010 579455 595227 612109 630104 649060 668412 687249
60556F87249J7226J4525J1031P145K911j785o408r723j1018j0804r860q211n661
$$ 687249 704475 719000 730031 737176 740087 738302 731894 722171 711153 700349 690489 682278 676617
60543F76617k637L66L622P549J1730J5614J9701K4815L0523L5552L9601M3289
$$ 676617 673980 674346 677968 685517 697247 712861 732562 757377 787900 823452 863053 906342
60531I06342M6235M6640M3206L6371K7264J6635N383m918j2964j8635k2435k4505
$$ 906342 952577 999217 1042423 1078794 1106058 1122693 1128076 1123158 1110194 1091559 1069124 1044619
60519A044619k4693k3197k0706j8117j6170j4956j3703j1495q291m821j585J474
$$ 1044619 1019926 996729 976023 957906 941736 926780 913077 901582 893291 888470 886885 888359
60507H88359M322O543P852Q505R186J0759J3728J7552K1024K4103K8673L6388
$$ 888359 892681 899224 907076 915581 924767 935526 949254 966806 987830 1011933 1040606 1076994
60495A076994M6320N6036O4623P2984Q1344Q8223R2225R3178R0950Q4863P5109
$$ 1076994 1123314 1179350 1243973 1316957 1398301 1486524 1578749 1671927 1762877 1847740 1922849
60484A922849O3385N1021L7504K1846M396j3665l1832n0024o7320q2055r3072
$$ 1922849 1986234 2037255 2074759 2096605 2101001 2087336 2055504 2005480 1938160 1856105 1763033
60473A763033j00162j03415j02822r8548r1267q2251p3113o5065n8213n1877m5668
$$ 1763033 1662871 1559456 1456634 1358086 1266819 1184568 1111455 1046390 988177 936300 890632
60462H90632l9831l4567k9748k5446k2049j9580j7492j5404j3511j2040j0827
$$ 890632 850801 816234 786486 761040 738991 719411 701919 686515 673004 660964 650137
60451F50137r706q791q142p577p031o662o523o453o329o013n298m344l860m180
$$ 650137 640431 631640 623498 615921 608890 602228 595705 589252 582923 576910 571612 567268 563408 559228
60437E59228m471l726k325j642k156k927k908j824O7K093L117K523J312J013J594
$$ 559228 554757 551031 548706 547064 544908 541981 539073 537249 537316 539409 542526 545049 546361 547374 548968
60422E48968J643O43l12l77r2j79m41m80n35r69j706k518l192l289k542j531j025
$$ 548968 550611 551254 550942 550565 550473 550294 549853 549373 548838 547869 546163 543645 540453 537164 534622 533091 532066
60405E32066p65%R60J113N99O05J281J474P70J90L80Q19J188J850K492K121J033
$$ 532066 531301 531301 532261 533374 533973 534578 535859 537333 538103 538293 538673 539492 540680 542530 545022 547143 548176
60388E48176Q38J809K201J236N68J442K455J916O40L78R41R81N18N84J115J204
$$ 548176 549014 550823 553024 554260 554828 556270 558725 560641 561281 561659 562600 563581 564099 564683 565798 567002
60372E67002R39J111J536J365Q18R90K040K976L174K923K595K312K330K729K931
$$ 567002 567941 569052 570588 571953 572771 573761 575801 578777 581951 584874 587469 589781 592111 594840 597771
60357E97771K415J683J629K229K695K664K455K401K678L494M792O033O784P124
$$ 597771 600186 601869 603498 605727 608422 611086 613541 615942 618620 622114 626906 632939 639723 646847
60343F46847P055O195M537K772J245n56k809m576n068m855m941n328n386m931
$$ 646847 653902 660097 664634 667406 668651 668095 665286 660710 655642 650787 645846 640518 635132 630201
60329F30201m124l021j953j530j569r38P52K290K605K197J936J599Q38L82R12
$$ 630201 626077 623056 621103 619573 618004 617066 617818 620108 622713 624910 626846 628445 629283 629665 630577
60314F30577J684J760J593K028K657K717K738L588M689M952M809N504O888P864
$$ 630577 632261 634021 635614 637642 640299 643016 645754 649342 654031 658983 663792 669296 676184 684048
60300F84048Q656J0646J3881J6491J6866J5014J1743P738L563o40n424j0998j6122
$$ 684048 692704 703350 717231 733722 750588 765602 777345 785083 788646 788006 782582 771584 755462
60287G55462j9143j9875j9346j8123j6222j4215j2848j1747r988p836o387n618
$$ 755462 736319 716444 697098 678975 662753 648538 635690 623943 613955 606119 599732 594114
60275E94114m412k623j466j539j943j763j147m56M21J406J963K007K239L113M166
$$ 594114 589702 587079 585613 584074 582131 580368 579221 578765 579186 580592 582555 584562 586801 589914 594080
60260E94080M670M369L442K353J732J739J586M36j348k585k804k600k621k998
$$ 594080 598750 603119 606561 608914 610646 612385 613971 614407 613059 610474 607670 605070 602449 599451
60246E99451l630m195m044k896j453o18l46n3K22Q6j28L43J459K449K947L106
$$ 599451 595821 591626 587582 584686 583233 582615 582269 582216 582438 582524 582396 582739 584198 586647 589594 592700
60230E92700K871K151J509J686K471K996K951K649K261J873J897K380K423J423
$$ 592700 595571 597722 599231 600917 603388 606384 609335 611984 614245 616118 618015 620395 622818 624241
60216F24241L77O50J890K623K529K509K742K363J115k14j141j868k242j877j404
$$ 624241 624618 625268 627158 629781 632310 634819 637561 639924 641039 640825 639684 637816 635574 633697 632293
60201F32293k075l775m902m620l892l829m336m865n272n343m602l119j702p97
$$ 632293 630218 626443 621541 616921 613029 609200 604864 599999 594727 589384 584782 581663 579961 579164
60187E79164j09M91O51M37N30J143J693J852J965K161K026J565J462J953K310
$$ 579164 579055 579546 580197 580634 581164 582307 584000 585852 587817 589978 592004 593569 595031 596984 599294
60172E99294K011J521J468J750J984K136K258K085J358J92j121k321l063l055
$$ 599294 601305 602826 604294 606044 608028 610164 612422 614507 615865 616057 614936 612615 609552 606497
60158F06497k406j486n36L30R76J459K052K658K705K141J927K762L972M578M758
$$ 606497 604091 602605 602069 602399 603375 604834 606886 609544 612249 614390 616317 619079 623051 627629 632387
60143F32387N245N935O276O524P303Q413R296J0194J1461J2205J1183Q744O351
$$ 632387 637632 643567 649843 656367 663670 672083 681379 691573 703034 715239 726422 735166 741517
60130G41517M438K309j24k193m012o312q692r733r113q067p497p084o462n793
$$ 741517 745955 748264 748140 745947 741935 735623 726931 717198 708085 700018 692521 685437 678975 673182
60116F73182n007l840k803k641k770j847P8J620K373L305M615N150M580M297N362
$$ 673182 668175 664335 661532 658891 656121 654274 654352 655972 658345 661650 666265 671415 675995 680292 685654
60101F85654P119Q546R445R654Q651O780N397M985M490L210J978J639J806J952
$$ 685654 692773 701319 710764 720418 729069 735849 741246 746231 750721 753931 755909 757548 759354 761306
60087G61306K406L246L473K386P62k77p42j360k495m151o208q117r210r729j0562
$$ 761306 763712 766958 770431 772817 773579 773302 772560 771200 768705 764554 758346 750229 741019 731290 720728
60072G20728j1643j1786j0517q832p669o861o084n528n079m179l032k634l005
$$ 720728 709085 697299 686782 677950 670281 663420 657336 651808 646729 642550 639518 636884 633879
60059F33879k885j873j309k102l192l296k821k828l228l285l020k949l157l514
$$ 633879 630994 629121 627812 625710 622518 619222 616401 613573 610345 607060 604040 601091 597934 594420
60045E94420m101m670m519l627l018l282l681l452k918k603k314j945k127l113
$$ 594420 590319 585649 581130 577503 574485 571203 567522 564070 561152 558549 556235 554290 552163 549050
60031E49050l986l961l566l625l937l904l639l486l205k533j953k016k510k865
$$ 549050 545064 541103 537537 533912 529975 526071 522432 518946 515741 513208 511255 509239 506729 503864
60017E03864k824k183p74Q27J404O14m45p09k92K70Q82J440J569J466J967L180
$$ 503864 501040 498857 498083 498910 500314 500928 500483 499774 499482 499752 500634 502074 503643 505109 507076 510256
60001E10256M111M158L925L986M030L850L853L942L306K051J567K397L194K880
$$ 510256 514367 518525 522450 526436 530466 534316 538169 542111 545417 547468 549035 551432 554626 557506
59987E57506K324K680L376L239K413J822J574J300J218J652K130K091J709J218
$$ 557506 559830 562510 565886 569125 571538 573360 574934 576234 577452 579104 581234 583325 585034 586252
59973E86252L11r30j471p04O08J526K035K192J536M07L70K021L644L453J948O43
$$ 586252 586563 585633 584162 583458 584066 585592 587627 589819 591355 591762 592132 594153 597797 601250 603198 603841
59957F03841k65j369k333k520k440k884l319k842j973j877k380k435k006j891
$$ 603841 603576 602207 599874 597354 594914 592030 588711 585869 583896 582019 579639 577204 575198 573307
59943E73307k061j788j114p69p73m33M25J303J837J928J535J150J754L335M314
$$ 573307 571246 569458 568344 567575 566802 566369 566794 568097 569934 571862 573397 574547 576301 579636 583950
59928E83950L583K174J674J924J815J448J776K635K917K421J959J856J741J614
$$ 583950 587533 589707 591381 593305 595120 596568 598344 600979 603896 606317 608276 610132 611873 613487
59914F13487J790K005J776J404J440J517R50J79K91J353K350K570K053J029Jj24
$$ 613487 615277 617282 619058 620462 621902 623419 624369 624548 624839 626192 628542 631112 633165 634194 634195 634071
59898F34071Q70J754J351K89PN97J085J381K329L941N084N090M501M146M299M810
$$ 634071 634941 636695 638046 638335 638342 638939 640024 641405 643734 647675 652759 657849 662350 666496 670795 675605
59882F75605N225N009M257L781L839L504K168P98N71J025R48L99L64R11J137O88
$$ 675605 680830 685839 690096 693877 697716 701220 703388 704186 704757 705782 706730 707129 707493 708404 709541 710229
59866G10229J3o22j219j486j379j741l224n065o048o197o214n891m596k838j831
$$ 710229 710242 709620 708401 706915 705536 703795 700571 695506 689458 683261 677047 671156 666560 663722 661891
59851F61891j735j743j550j413j052K8J472K678M053O331R109J1629J4474J8554
$$ 661891 660156 658413 656863 655450 654398 654426 655898 658576 662629 668960 678069 689698 704172 722726
59837G22726K2609K3747K0766J5341R750N047J636j7J6Q79J730J904L86l564r062
$$ 722726 745335 769082 789848 805189 814939 819986 821622 821605 821621 822500 824230 826134 826520 822956 813894
59822H13894j3983j7007j8387j8728j8106j6649j4892j3214j1686j0422r440q261
$$ 813894 799911 782904 764517 745789 727683 711034 696142 682928 671242 660820 651380 643119
59810F43119o487m631l552l286l258l388l976m792n215n175n091n099n110n290
$$ 643119 636632 632001 628449 625163 621905 618517 614541 609749 604534 599359 594268 589169 584059 578769
59796E78769n683n749n159m552m627n033m988m463l822l000k024j530j732j722
$$ 578769 573086 567337 562178 557626 552999 547966 542978 538515 534693 531693 529669 528139 526407 524685
59782E24685r49m23j048j823j245L22J340J377J040M30m71o89N50K109K326J558
$$ 524685 523736 523313 522265 520442 519197 519519 520859 522236 523276 523706 523235 522546 523096 525205 527531 529089
59766E29089J356J727J379K98k35Q6M34P88J858L155L348K576K266K653K605J985
$$ 529089 530445 532172 533551 533849 533614 533700 534134 534922 536780 539935 543283 545859 548125 550778 553383 555368
59750E55368J958K719L068K580K129J908J084k03o44m1K26l82p45k43J91j31o20
$$ 555368 557326 560045 563113 565693 567822 569730 570814 570611 569967 569926 570152 569770 569025 568782 568973 568842 568222
59733E68222q58j281j735j211K60J170P64K1k14l94p75o35J92O17J67o7P26J733
$$ 568222 567364 566083 564348 563137 563397 564567 565331 565352 565138 564744 563969 563334 563526 564143 564310 564243 564969 566702
59715E66702K009J899J977J886J273O77N36L96q5l57JM66N38N62R36J429J811
$$ 566702 568711 570610 572587 574473 575746 576423 576959 577355 577270 576913 576914 577380 577918 578480 579416 580845 582656
59698E82656K242K628K527K012J612J221K47r48j198l93J96r5m38j36L19L72K89
$$ 582656 584898 587526 590053 592065 593677 594898 595145 594197 592999 592606 592802 592707 592269 592133 592452 592824 593113
59681E93113K72r6r09j565j830k207k885l451l865m436m681l657j704l33m4K18
$$ 593113 593385 593289 592380 590815 588985 586778 583893 580442 576577 572141 567460 563803 562099 561766 561722 561940
59665E61940J045J688J691J777K374K765K379J628R00R0m67r4P01M24j086k205
$$ 561940 562985 564673 566364 568141 570515 573280 575659 577287 578187 578277 577810 577716 578417 578841 577755 575550
59649E75550j965j326j315j548j435j283j349j185p17n83p12j12J233J909J292
$$ 575550 573585 572259 570944 569396 567961 566678 565329 564144 563427 562844 562132 562020 563253 565162 566454
59634E66454N65O31O59k41j371j711j474j318j167p78m05q5N18R68J13j970l592
$$ 566454 567019 567650 568309 568068 566697 564986 563512 562194 561027 560249 559844 559759 560277 561245 561358 559388 555796
59617E55796l759l379l358l192k343j487j213r23r3O80Q97J044J324R36l58j363
$$ 555796 552037 548658 545300 542108 539765 538278 537065 536142 536049 536729 537626 538670 539994 540930 540572 539209
59601E39209j247p64p54q51p59j243k566l405k684j229l65q4J85J97l80r43r17
$$ 539209 537962 537198 536444 535593 534834 533591 531025 527620 524936 523707 523342 523258 523443 523640 523260 522317 521400
59584E21400p26q61r40o81o50j153j542j502j679k272k366j558p83o30m26J56
$$ 521400 520674 519813 518873 518192 517542 516389 514847 513345 511666 509394 507028 505470 504687 504057 503631 503787
59568E03787L26jM38J878K555J587P52J571K652K046N62K76J168J695J707K312
$$ 503787 504113 504112 504550 506428 508983 510570 511322 512893 515545 517591 518153 518429 519597 521292 522999 525311
59552E25311L492M167M254M633N334N642N747O536P922R120J0511J3561J8348
$$ 525311 528803 532970 537224 541857 547191 552833 558580 565116 573038 582158 592669 606230 624578
59539F24578K2280K1842J5554N510l791q795r464q169o339l640l43J725J619P23
$$ 624578 646858 668700 684254 689764 685973 677178 667714 659545 653206 649566 649223 650948 652567 653290
59525F53290N14M75m29j767k652l439m801o314p376q423r872j0897j0649r542
$$ 653290 653804 654279 653850 652083 649431 645992 641191 634877 627501 619078 609206 598309 587660 578118
59511E78118q237o551m604l453l313k635o03J112Q29m31o50J26N07K82R5l17j409
$$ 578118 569881 563330 558726 555273 551960 549325 548722 549834 550663 550232 549582 549708 550215 550497 550592 550275 548866
59494E48866k226j594k20L82K93N88J114R77O38J388L084M366M829N265N910O135
$$ 548866 546640 545046 544826 545208 545501 546089 547203 548180 548818 550206 553290 557656 562485 567750 573660 579795
59478E79795N809N507N432N218M567L275J259o79j074K35J572J835K095L487N106
$$ 579795 585604 591111 596543 601761 606328 609603 610862 610183 609109 609344 610916 612751 614846 618333 623439
59463F23439N719O110P663R846J1127J1472J1917J2444J2272J1519J0785R845
$$ 623439 629158 635268 642931 652777 663904 675376 687293 699737 712009 723528 734313 744158
59451G44158Q370P043O199M423M19m742r077j2280j4824j5877j4477j1841r972
$$ 744158 752528 759571 765770 770193 770612 765870 756793 744513 729689 713812 699335 687494 677522
59438F77522q728o692m153k627k010q86P34J561J723K662M433N624O064P188R466
$$ 677522 668794 662102 657949 655322 653312 652426 653160 654721 656444 659106 663539 669163 675227 682415 691881
59423F91881J1758J3478J5206J6895J7637J7771J9086K1980K3851K1208J2699
$$ 691881 703639 717117 732323 749218 766855 784626 803712 825692 849543 870751 883450
59412H83450J38j2381k0590k2737k0519j6741j2454p059k66P147J3405J5429J0068
$$ 883450 883588 871207 850617 827880 807361 790620 778166 771107 770841 777988 791393 806822 816890
59399H16890k186j5754k4461k6930k5914k3638k0326j6328j2705r698o870m664
$$ 816890 814704 798950 774489 747559 721645 698007 677681 661353 648648 638950 632080 627416
59387F27416l813l519k379o86K39N17J277K281K432K176K901M225M536M052M646
$$ 627416 623603 620084 617705 617019 617258 617775 619052 621333 623765 625941 628842 633067 637603 641655 646301
59372F46301O566P932P828P372P368P239O774O716P154P349P411Q202R389R662
$$ 646301 652867 660799 668627 675999 683367 690606 697380 704096 711250 718599 726010 734212 743601 753263
59358G53263R058Q977R750J0347J0655J1745J3567J4627J4376J3864J3537J2481
$$ 753263 762321 771298 781048 791395 802050 813795 827362 841989 856365 870229 883766 896247
59346H96247J0334P904N488K439j154m278o811r629j2609j4472j5011j5455j6247
$$ 896247 906581 914485 919973 922412 921258 916980 910169 900540 887931 873459 858448 842993 826746
59333H26746j6416j5563j4559j3720j2226r960q111p342o868n857m406k823j351
$$ 826746 810330 794767 780208 766488 754262 744302 736191 728849 721981 716124 711718 708895 707544
59320G07544n74p16p36M09J920K285J687J398J341O09j69M39J780J731J40j003
$$ 707544 706970 706254 705518 705927 707847 710132 711819 713217 714558 715167 714998 715437 717217 718948 719088 718085
59304G18085r54j006j600j527n04K00L27J229L091M216M033M389O815J0556J4391
$$ 718085 717131 716125 714525 712998 712494 712694 713021 714250 717341 721557 725590 729979 736794 747350 761741
59289G61741J8477K3409K8805L3200L3989K8019J4677j626j4479k1180k3334k2534
$$ 761741 780218 803627 832432 865632 899621 927640 942317 940691 926212 905032 881698 859164
59277H59164j8810j3371r007o639m526j907l04k93j37J027J649Q04j87n88j781
$$ 859164 840354 826983 817976 811337 806811 804904 804600 804307 804170 805197 806846 807650 807463 806875 805094
59262H05094m368o494o860o771p425p800p057o560p449q456q146p235o737n915
$$ 805094 800726 794232 787372 780601 773176 765376 758319 751759 744310 735854 727708 720473 713736 707821
59248G07821m024k145j304n83J027K663L383M108N752P132O757N251M083L232
$$ 707821 703797 701652 700348 699765 700792 703455 706838 710946 716698 723830 730587 735838 739921 743153
59234G43153J867J67j288k710m241n124n080n200o179p067o991o589o455n784
$$ 743153 745020 745187 743899 741189 736948 731824 726744 721544 715365 708298 701307 694718 688263 682479
59220F82479m088k606k439k707k023n39Q66K041K922K905K183K179L378M195L398
$$ 682479 678391 675785 673346 670639 668616 668077 668943 670984 673906 676811 678994 681173 684551 688746 692144
59205F92144K051J667J992K141K428L379M255M122L372K767K146J214N09L70K37
$$ 692144 694195 695862 697854 699995 702423 705802 710057 714179 717551 720318 722464 723678 724187 724557 724794
59190G24794q2K00J275K038J945J930K505K757K259K155L082L913L850L879M801
$$ 724794 724712 724912 726187 728225 730170 732100 734605 737362 739621 741776 744858 748771 752621 756500 761301
59175G61301N676N790O262Q035R990J0707J0468R956Q717O579M925M692M561K900
$$ 761301 766977 772767 779029 787064 797054 807761 818229 828185 836902 843481 848406 853098 857659 860559
59161H60559J75k185l903n381o444p150q402j0349j1537j1070j0139j0073j0422
$$ 860559 860734 858549 854646 849265 842821 835671 827269 816920 805383 794313 784174 774101 763679
59148G63679j0369j0344j0770j0826j0007r273r242q891p518o216n900n632m487
$$ 763679 753310 742966 732196 721370 711363 702090 692848 683957 676439 670223 664323 658691 654204
59135F54204l214k483j371O52K247K436K462L514M585M559M486N694P413Q431
$$ 654204 650990 648507 647136 647788 650035 652471 654933 658447 663032 667591 672077 677771 685184 693615
59121F93615R340J1082J2935J4141J5670J8225K0231K0255J9642K0335K1599K1509
$$ 693615 702955 714037 726972 741113 756783 775008 795239 815494 835136 855471 877070 898579
59109H98579K0123J8581J6396J2392P283K797q88m569p909j0163j1962j4146j5822
$$ 898579 918702 937283 953679 966071 973354 976151 975263 970694 962785 952622 940660 926514 910692
59096I10692j5688j4301j2987j1631r609p711o950o553n364m135m318n635o883
$$ 910692 895004 880703 867716 856085 846476 838765 831815 825262 819898 815763 811445 805810 798927
59083G98927p963r077r248p834o302o222o715o099m760m099l926l297k739l129
$$ 798927 790964 781887 772639 764805 758503 752281 745566 739467 734707 730608 726682 723385 720646 717517
59069G17517l577k876j912k144k763k024l88L44J73N10J377J636J403J795K704
$$ 717517 713940 711064 709152 707008 704245 702221 701833 702177 702350 702860 704237 705873 707276 709071 711775
59054G11775L076K944L114L420L228K933L076K908J681L23q6j94p95q42O23K176
$$ 711775 714851 717795 720909 724329 727557 730490 733566 736474 738155 738478 738392 738198 737403 736561 737184 739360
59038G39360K155J761L155N717P069O864O684P039P288P792R331J0933J0899R423
$$ 739360 741515 743276 746431 752148 759217 766081 772765 779804 787092 794884 804215 815148 826047 835470
59024H35470P831N979K920o44l132m580n939o750o014m539l832l421j844N54K327
$$ 835470 843301 849280 852200 851556 848424 843844 837905 831155 825141 820602 816770 813349 811505 812059 814386
59009H14386L521N050O433O771O924Q001Q793P552N307M408M695M192K669J493
$$ 814386 817907 822957 829390 836161 843085 851086 859879 867431 872738 877146 881841 886033 888702 890195
58995H90195O92p24k245k777l252n251p790q621p956p550p028m697j345N17Q80
$$ 890195 890887 890163 887918 885141 881889 876638 868848 860227 852271 844721 837693 832996 831651 832168 833048
58980H33048K013M274N820O377P587R457J0048R075Q433Q824R101R211J0532J2857
$$ 833048 835061 839335 845155 851532 859119 868576 878624 887699 896132 904956 914057 923268 933800 946657
58966I46657J4273J4438J4897J5803J5413J3346J1215R530O967L299R1k180m973
$$ 946657 960930 975368 990265 1006068 1021481 1034827 1046042 1055572 1062539 1065838 1065929 1063749 1058776
58953A058776q912j2690j5293j7016j7878j7415j6171j5137j3717j0663o836m438
$$ 1058776 1049864 1037174 1021881 1004865 986987 969572 953401 938264 924547 913884 907048 902610
58941I02610l703l056k243k359k957k359q57m85j508k173k105k758m331n292n330
$$ 902610 898907 895851 893608 891249 888292 885933 885076 884591 883083 880910 878805 876047 871716 866424 861094
58926H61094n725o494o165m740l855l704k671l98J683L140N043P476R344J0650
$$ 861094 855369 848875 842710 837970 834115 830411 827740 827342 829025 832165 837208 844684 854028 864678
58912H64678J2218J3337J2735J1592J2241J4087J4379J2802J1624J1256R789P130
$$ 864678 876896 890233 902968 914560 926801 940888 955267 968069 979693 990949 1000738 1007868
58900A007868N536N440M818L427L700O354R053J0562J2505J5738J8532J9639J9784
$$ 1007868 1013404 1018844 1023662 1027089 1030789 1037143 1046196 1056758 1069263 1085001 1103533 1123172 1142956
58887A142956J9004J5971J1069O763L667l11n853j0765j3786j6309j8939j9928
$$ 1142956 1161960 1177931 1189000 1195763 1199430 1199119 1193266 1182501 1168715 1152406 1133467 1113539
58875A113539j8542j6656j5502j4068j2150j1588j2903j3954j3544j3251j4111
$$ 1113539 1094997 1078341 1062839 1048771 1036621 1025033 1012130 998176 984632 971381 957270
58864I57270j4739j4336j4386j5634j6404j5700j4995j5298j5306j4118j2971
$$ 957270 942531 928195 913809 898175 881771 866071 851076 835778 820472 806354 793383
58853G93383j2657j2058j0761j0281j1135j1475j0158q455p349n973m094l114
$$ 793383 780726 768668 757907 747626 736491 725016 714858 706403 699054 693081 688987 685873
58841F85873l164k282Q9J747J449Q26J058P54j014k649k851k745l328l573k768
$$ 685873 682709 680427 680516 682263 683712 684538 685596 686350 685336 682687 679836 677091 673763 670190 667422
58826F67422k059k029j467r2L45p57j427m83N41L83N9K59k90k090l311k803k022
$$ 667422 665363 663334 661867 661775 662120 661363 659936 659453 659994 660377 660436 660695 660405 658315 655004 652201 650179
58809F50179k359l116l484l870m050k883r99p14k170k863k052j941l254l648k127
$$ 650179 647820 644704 641220 637350 633300 630417 629418 628704 626534 623671 621619 619678 616424 612776 610649
58794F10649j065j737j828L29K763L492L625M491N113M905N441P160P737O112
$$ 610649 609584 607847 606019 606348 609111 612603 616228 620719 625832 630737 636178 643338 651075 657187
58780F57187M719N325O121N439M734N193M902K247j122l409n463p831q532o676
$$ 657187 661906 667231 673352 678791 683525 688718 693620 695867 694745 691336 685873 678042 669510 662834
58766F62834m888n168n715m750m016n212o392n409l784l720m177l350k180k035
$$ 662834 657946 652778 647063 642313 638297 633085 626693 621284 617500 613780 609603 606253 604073 602038
58752F02038j658K54K190K776L712O587R579J0700J1382J3470J5524J5706J5531
$$ 602038 600380 600634 602824 605600 609312 615899 625478 636178 647560 661030 676554 692260 707791
58739G07791J7065J8963J8980J7991J7826J7502J5287J2243J0167Q124M558O74
$$ 707791 724856 743819 762799 780790 798616 816118 831405 843648 853815 861939 866497 867171
58727H67171j633l136n244o876o600n742o057o536n675m591m740m913l808l121
$$ 867171 865538 862402 857158 850282 843682 837940 831883 825347 819672 815081 810341 805428 801620 798499
58713G98499m710p042p867q015r268j0844j1474j2426j5004j7476j7927j7678
$$ 798499 793789 786747 778880 770865 761597 750753 739279 726853 711849 694373 676446 658768
58701F58768j8376j8465j6189j3404j2461j1917r411o285n136n122l937k281k131
$$ 658768 640392 621927 605738 592334 579873 567956 558545 552260 547124 542002 538065 535784 533653
58688E33653k587j655k81m95j358p30P15J116J201K608M307M572M562O191Q405
$$ 533653 531066 529411 529130 528635 527277 526547 527262 528378 529579 532187 536494 541066 545628 551819 560224
58673E60224R337R962J1822J3373J2713J1579J2409J3578J1984Q275N120K255
$$ 560224 569561 579523 591345 604718 617431 629010 641419 654997 666981 675256 680376 682631
58661F82631k141p021r963j1508j3602j5267j4255j1477r607q640o888m830l962
$$ 682631 680490 673469 663506 651998 638396 623129 608874 597397 587790 579150 572262 567432 563470
58648E63470l505k095r53j512k066p71M81n71j841l33K195J991l52j462j142j541
$$ 563470 559965 557870 556917 555405 553339 552568 553049 552478 550637 550304 552499 554490 554138 552676 551534 549993
58632E49993k162r44J141J668J569L402O270P377P149P974R342R247Q781J0216
$$ 549993 547831 546887 548028 549696 551265 554667 560937 568314 575463 583437 592779 602026 610807 621023
58618F21023J2098J1348Q778P324O422L477o27k973m112o570r286r252p440p309
$$ 621023 633121 644469 653247 660571 666993 670470 669843 666870 662758 656188 646902 637650 630210 622901
58604F22901q535p972n832n016n223l620o80N85N94K569O358Q724R375J0976J3511
$$ 622901 614366 606394 600562 595546 590323 586703 586023 586608 587202 589771 596129 604853 614228 625204 638715
58589F38715J4400J3979J5134J7475J7451J4317J0695P438L284p43k096j621k390
$$ 638715 653115 667094 682228 699703 717154 731471 742166 749604 752888 752145 750049 748428 746038
58576G46038l905k912N18L258N061Q430J2886J5269J5652J7185K0009K0979J9484
$$ 746038 742133 739221 739739 742997 748058 756488 769374 784643 800295 817480 837489 858468 877952
58563H77952J8003J6884J4172J0516Q622P906N333J331q14j188k986o249p939
$$ 877952 895955 912839 927011 937527 946149 954055 959388 960719 959905 958717 955731 949482 941543
58550I41543q099r729j2624j3564j2723j3527j5949j6257j3829j1844j0924q548
$$ 941543 933444 923715 911091 897527 884804 871277 855328 839071 825242 813398 802474 793926
58538G93926n198m488o392o834m840l763m567m259k067q63j290n33J965L475L573
$$ 793926 788728 784240 777848 771014 766174 762411 757844 753585 751518 750655 749365 748832 750797 754272 757845
58523G57845M893P511Q519P793Q206R609Q773N814M297M490L089N3j145o97k676
$$ 757845 762738 770249 778768 786561 794767 804376 813149 818963 823260 827750 830839 830892 829747 829050 826374
58508H26374p252r902r475r821j2070j2671j0706r777j0779r966o302l730m007
$$ 826374 819122 809220 799745 789924 777854 765183 754477 744700 733921 723955 717653 713923 709916
58495G09916m027k354j650k525j686J660M080M518O105R572J1589J1421J2328
$$ 709916 705889 703535 701885 699360 697674 699334 703414 707932 714037 723609 735198 746619 758947
58482G58947J4542J3934R689O230N373L675k41k912k951l598o001o920n435m882
$$ 758947 773489 787423 797112 803342 808715 812390 812149 809237 806286 802688 796687 789767 784332 779450
58468G79450n922n017j950j274l832m605j678M75m57p06J756L245J719N01J235
$$ 779450 773528 768511 766561 765287 761455 756850 755172 755647 755190 754484 756240 759485 761204 761705 762940
58453G62940N77k560m044k314j620l802m452j180J790J302K78J058R91j272k256
$$ 762940 763517 760957 756913 754599 752979 749177 744725 743545 745335 746637 746915 747973 748964 747692 745436
58438G45436m46M56j150j348J579L437K053J502M282O677O161N956P964Q566N897
$$ 745436 744990 745446 744296 742948 744527 747964 750017 751519 755801 762478 768639 774595 782559 791125 797022
58423G97022L988N296O322M891M396O620P855O455O488R521J0524O561J713j005
$$ 797022 801010 806306 812628 817519 821915 828535 836390 842845 849333 858854 869378 875939 877652 876647
58409H76647m546j0061j2688j0247p905q968r157n372j850k031k381rJ585J0q07
$$ 876647 872101 862040 849352 839105 831200 822232 813075 807703 805853 803822 801441 801432 803017 803027 802220
58394H02220J465K529o4j589J038L468K707L035P189J0317R019P802J0091J1510
$$ 802220 803685 806214 806150 804561 805599 809067 811774 814809 821998 832315 841334 849136 859227 870737
58380H70737Q699O094P173P678M487K396M936P243N393M035P283J0840J0761J1245
$$ 870737 879436 885530 892703 900381 904868 907264 912200 919443 924836 928871 936154 946994 957755 969000
58366I69000J5852J9844J9096J7751J9003J7418Q969l23m345o630j1496j4609
$$ 969000 984852 1004696 1023792 1041543 1060546 1077964 1086933 1086610 1082265 1075635 1064139 1049530
58354A049530j1568p098o409n859j315K928K724K744P227J0986R112O700R158
$$ 1049530 1037962 1030864 1024455 1018596 1017281 1020209 1022933 1025677 1032904 1043890 1053002 1059702 1068860
58341A068860J1883R552O606Q158R518N412P43J535L804K077J64K696M907J808
$$ 1068860 1080743 1090295 1096901 1105059 1114577 1119989 1120732 1122267 1126071 1128148 1128312 1131008 1135915 1137723
58327A137723j426Q14L646J539l97L525P857O245L844P275J1692J0356P663R929
$$ 1137723 1136297 1137111 1140757 1142296 1141899 1145424 1153281 1159526 1163370 1170645 1182337 1192693 1200356 1210285
58313A210285J2662R888O747R679J3514J1583Q950J2180J5787J2766Q624J0742
$$ 1210285 1222947 1232835 1239582 1249261 1262775 1274358 1283308 1295488 1311275 1324041 1332665 1343407
58301A343407J3796J0418O176Q915J3317J1461Q548J2383J7432J5529J2247J6041
$$ 1343407 1357203 1367621 1373797 1382712 1396029 1407490 1416038 1428421 1445853 1461382 1473629 1489670
58289A489670K1412J9780J6718K1002K6882K5056K0970K4020K8959K6596K2483
$$ 1489670 1511082 1530862 1547580 1568582 1595464 1620520 1641490 1665510 1694469 1721065 1743548
58278A743548K5950L1266K9199K6457L3324M2832M3180M0070M5167N3135N2351
$$ 1743548 1769498 1800764 1829963 1856420 1889744 1932576 1975756 2015826 2060993 2114128 2166479
58267B166479M7873N0861N5614N0495M1587M1770M6306M3255L7789M1620M8752
$$ 2166479 2214352 2265213 2320827 2371322 2412909 2454679 2500985 2544240 2582029 2623649 2672401
58256B672401M6926M2497M8215N7234N5969N1520N8760P1287P3762P1729P9855
$$ 2672401 2719327 2761824 2810039 2867273 2923242 2974762 3033522 3104809 3178571 3250300 3330155
58245C330155R2001R3404R1052J00583J14664J16742J14225J24487J40256J43788
$$ 3330155 3422156 3515560 3606612 3707195 3821859 3938601 4052826 4177313 4317569 4461357
58235D461357J42840J56063J75396J81064J81084J96175K18509K27009K30372
$$ 4461357 4604197 4760260 4935656 5116720 5297804 5493979 5712488 5939497 6169869
58226F169869K51339K81419K96874L06227L34166L71873L93741M09592M47328
$$ 6169869 6421208 6702627 6999501 7305728 7639894 8011767 8405508 8815100 9262428
58217I262428M97707N32340N62251O19220O93475P52977Q09880R00613J015219
$$ 9262428 9760135 10292475 10854726 11473946 12167421 12920398 13730278 14630891 15646110
58208A5646110J118854J228194J388860J592620J801443K038340K363797K779687
$$ 15646110 16764964 17993158 19382018 20974638 22776081 24814421 27178218 29957905
58200B9957905L258816L854937M672562N742620P048233Q653047J0663260J3083611
$$ 29957905 33216721 37071658 41744220 47486840 54535073 63188120 73851380 86934991
58192H6934991J5874479J9131331K3024267K7597240L2818421L8585771M3997163
$$ 86934991 102809470 121940801 144965068 172562308 205380729 243966500 287963663
58185B87963663M6433759M2251302K9511911J0319669r969827k6138990l5838512
$$ 287963663 334397422 376648724 406160635 416480304 406510477 380371487 344532975
58178C44532975l9584253l9069746l5883911l1245284k6071241k0936081j6072738
$$ 344532975 304948722 265878976 229995065 198749781 172678540 151742459 135669721
58171A35669721j1553108p544482m488384l008312l438883n330131p558749r086364
$$ 135669721 124116613 116572131 112083747 109075435 105636552 100306421 92747672 83661308
58163H3661308r582274r304144q586640p617504o549794n546103m673784l902859
$$ 83661308 74079034 64774890 56188250 48570746 42020952 36474849 31801065 27898206
58155B7898206l228218k690572k281888j938255j634165j395410j217120j054005
$$ 27898206 24669988 21979416 19697528 17759273 16125108 14729698 13512578 12458573
58147A2458573q96393p78264p03724o35747n63135n12644m88601m61609m23426
$$ 12458573 11562180 10783916 10080192 9444445 8881310 8368666 7880065 7418456 6995030
58138F995030l96252l81835l54978l13151k81997k66200k42853k08159j84188
$$ 6995030 6598778 6216943 5861965 5548814 5266817 5000617 4757764 4549605 4365417
58129D365417j74395j57454j30841j17495j22997j26797j21751j23236j33164
$$ 4365417 4191022 4033568 3902727 3785232 3662235 3535438 3413687 3290451 3157287
58120C157287j33112j19800j11537j13095j08475r4254q6457q8440q4547p1695
$$ 3157287 3024175 2904375 2792838 2679743 2571268 2477014 2390557 2302117 2217570 2145875
58110B145875o5657o9879o8740n7983n2049n5022n3236m3162l8423m2487m1557
$$ 2145875 2080218 2010339 1941599 1883616 1831567 1776545 1723309 1680147 1641724 1599237 1557680
58099A557680l1419k4971k6535k4321j5079j1265j6811j9911j6555j7640k6009
$$ 1557680 1526261 1501290 1474755 1450434 1435355 1424090 1407279 1387368 1370813 1353173 1327164
58088A327164k9606k4367k1561k5656k6758k1671k0833k7338l0134k5208k3056
$$ 1327164 1297558 1273191 1251630 1225974 1199216 1177545 1156712 1129374 1099240 1074032 1050976
58077A050976k8004l0067k4662k0917k3086k2575j5899j2166j5287j6456j1617
$$ 1050976 1022972 992905 968243 947326 924240 901665 885766 873600 858313 841857 830240
58066H30240r083j2618j3794q528m782o756p279k882p93m173n706k451j900o820
$$ 830240 821157 808539 794745 786217 781435 774679 767400 764518 763725 759552 753846 751395 749495 742675
58052G42675r162n635m392r440j3033j0454q196j0525j1764q779p647j1151j2693
$$ 742675 733513 727878 723486 714046 701013 690559 682363 671838 660074 651295 643648 632497 619804
58039F19804r177p074r455r935n619l106n376n715j092J296k575o166n016m333
$$ 619804 610627 603553 594098 584163 578544 575438 570062 564347 563255 564551 561976 555810 550794 546461
58025E46461p361q428m549k001m412n892k791p23l015l743O27L916J885J53L125
$$ 546461 539100 530672 526123 524122 519710 513818 511027 510304 507289 503546 504173 508089 509974 510127 513252
58010E13252N702L581J478L492N101K353m02P24J799m98k116q9J162j338k817
$$ 513252 518954 522535 524013 527505 532606 534959 534557 535281 537080 536582 534466 534377 535539 534201 531384
57995E31384J21K856J673M99K288K557j809n985n969n442p502q210m999k798n026
$$ 531384 531505 534361 536034 536533 538821 541378 539569 533584 527615 522173 514671 506461 501462 498664 493638
57980D93638o953m793l003n471p793n627k766l472m469j918R81N75j04K147M087
$$ 493638 486685 481892 478889 473418 465625 459998 457232 453760 449291 447373 448354 448929 448825 450972 455059
57965D55059K876K464O194R922R520Q427J0642J2950J1377Q860R199R605O544
$$ 455059 457935 460399 466593 476515 486035 494462 505104 518054 529431 538291 547490 557095 563639
57952E63639L035K846L145L2m003n053m885o439p546n644l491l869l950j030J651
$$ 563639 566674 569520 572665 572697 568694 563641 558756 552317 544771 539127 535636 531767 527817 526787 528438
57937E28438J036M41L238O046M887K511K829L477Q76k546l219l366o099q480o663
$$ 528438 529474 529915 533153 539199 544086 546597 549426 552903 553779 551233 548014 544648 538549 530069 523406
57922E23406l348l039m202l132j394k333m160l418j728k397l833k765n25j2R3
$$ 523406 520058 517019 512817 509685 508291 505958 501798 498380 496652 494255 490422 487657 487132 487120 487213
57907D87213K043L741K620J016J686K051j034m785n097l761m704o693o294m627
$$ 487213 489256 492997 495617 496633 498319 500370 499336 494551 489454 485693 480989 474296 468002 463375
57893D63375m764n625m677l458m429n609m331k906m472o731o051m234m835o210
$$ 463375 458611 452986 448309 444851 440422 434813 430482 427576 423104 416373 410322 406088 401253 395043
57879C95043m895k679l514o230o970o228o885p873o387m001m093n460m758k994
$$ 395043 390148 387469 383955 377725 370755 364527 357642 349769 343382 339381 335288 329828 325070 322076
57865C22076l260m337k936j82N21P1J758M717N597N066O369Q954R657Q777R094
$$ 322076 318816 314479 311543 311361 311882 311953 313711 318428 324025 329091 335460 344414 354071 362848 371942
57850C71942J0283J0072R385J0495J1645R474N336L320L273J770j198k454j662
$$ 371942 382225 392297 401682 412177 423822 433296 438632 441952 445225 446995 445797 443343 441681
57837D41681j384j846j083M33M42n34k19Q56N09n64j61R04M26o87l19K63j216
$$ 441681 440297 438451 437368 437801 438243 437709 437490 438346 438855 438291 438130 439034 439460 438773 438454 438717 437501
57820D37501k979j989J59k35k255k119j54R2j489j832p57p60j409Q8L122M152
$$ 437501 434522 432533 432692 432457 430202 428083 427929 428021 426532 424700 423943 423183 421774 421862 424984 429136
57804D29136K658J232K21k227n277o044m911m862n863n242l235k690l452k539
$$ 429136 431794 433026 433247 431020 425743 419699 414788 409926 404063 398821 395586 392896 389444 386905
57790C86905J13J494J163J711L430L786K474J934K538K158P75O57J729J624M85
$$ 386905 387018 388512 389675 391386 394816 398602 401076 403010 405548 407706 408481 409138 410867 412491 412976
57775D12976Q06K384K380N93k99m5j250m087n672n432o072q371r783r297r045
$$ 412976 413782 416166 418546 419139 418840 418795 417545 413458 407786 402354 396282 387911 378128 368831 359786
57760C59786r991j0350r464r089r708r429p568n798m966m195l474l695m004k703
$$ 359786 349795 339445 329981 320892 311184 301755 294187 288389 283423 279228 275754 272059 268055 265352
57746B65352p42m84j334o17J428J977P10N5L35n92k652l253k103j720k643k697
$$ 265352 264610 264126 262792 262175 263603 265580 266290 266345 266680 266088 263436 260183 258080 256360 253717 251020
57730B51020j552j361k277j972k73L63k89K94K277K685Q38k53O73J114k89j379
$$ 251020 249468 248107 245830 243858 243585 243948 243659 243953 246230 248915 249753 249500 250173 251287 250998 249619
57714B49619q15m65j541k342j682q93p57j9J545K160J518J649L064L685K908K932
$$ 249619 248804 248339 246798 244456 242774 241881 241124 241105 242650 244810 246328 247977 251041 254726 257634 260566
57698B60566M598N662M727L339K610J317j018k579k366j744j627j181l38l11o39
$$ 260566 265164 270826 275553 278892 281502 282819 281801 279222 276856 275112 273485 272304 271966 271655 271016
57683B71016P75L806N918O698Q649J2534J6087J8742K3252L0892L9266M6894N6079
$$ 271016 271791 275597 281515 288213 296862 309396 325483 344225 367477 398369 437635 484529 540608
57670E40608O8957Q4400J00714J17107J29528J28703J06449O3161P881m6795q9358
$$ 540608 609565 693965 794679 911786 1041314 1170017 1276466 1339627 1347508 1300713 1211355
57659A211355j13365j20223j16540j07442r4257p8502o3860n2506m3132l4549
$$ 1211355 1097990 977767 861227 753785 659528 581026 517166 464660 421528 386979
57649C86979k8032k4268k1338j7795j4819j3384j2218j0352q819q029o445l636
$$ 386979 358947 334679 313341 295546 280727 267343 255125 244773 235954 227925 221480 217844
57637B17844j650j626j971j543j535k461k508q75M21P1l13N17J078K19n62j16
$$ 217844 216194 214568 212597 211054 209519 207058 204550 203675 204096 204167 203854 204371 205449 205668 205106 204990
57621B04990N1j253k456k054j178j091r10P0M50n44j213m22K55m15r05O9R89M04
$$ 204990 205041 203788 201332 199278 198100 197009 196099 196169 196619 196075 194862 194440 194695 194280 193375 193444 194433 194837
57603A94837l34K46R34K58p28o55l75q65j005M6O17p52k570k881k321k289k336
$$ 194837 194503 194749 195683 195941 195213 194558 194183 193318 192313 192359 192976 192224 189654 186773 184452 182163 179827
57586A79827j751j559k500l147k436j873k872m133l999l216k955k516j383j102
$$ 179827 178076 176517 174017 170870 168434 166561 163689 159556 155557 152341 149386 146870 145487 144385
57572A44385k447l212j626L67K59r39q68Qk22j204j266p12r63j653j456o78l49
$$ 144385 141938 138726 137100 137467 137726 136787 135919 135927 135705 134501 133235 132523 131560 129907 128451 127773 127424
57555A27424J02J639L233L221J983R77L08n78j079n63R1J36O60K524M196L906
$$ 127424 127526 129165 132398 135619 137602 138579 138887 138309 137230 136667 136758 136894 137554 140078 144274 148180
57539A48180K422J433Q08l15j340j464j498k136k168p32N14o6j153p84K76J80
$$ 148180 150602 152035 152843 152528 151188 149724 148226 146090 143922 143190 143704 143638 142485 141701 141977 142157
57523A42157n67l12O20P65K35l2m24j455j894o60Q88J115R24J728K404J293m06
$$ 142157 141590 141278 141898 142663 142898 142866 142442 140987 139093 138433 139321 140436 141360 143088 145492 146785 146379
57506A46379n13L41J62n86m1J204R22p85j753j486j355j539r72q4m48j817k287
$$ 146379 145866 146207 146369 145783 145742 146946 147868 147083 145330 143844 142489 140950 139978 139894 139446 137629 135342
57489A35342j413o28o73r57j282j936k330j704p84p35j138r80o97j117j376l07
$$ 135342 133929 133301 132628 131671 130389 128453 126123 124419 123635 122900 121762 120782 120085 118968 117592 117285
57473A17285J113J220N02M82Q16K60n29oJ238J434P88Q47J416J065J09N2O81N93
$$ 117285 118398 119618 120120 120602 121418 121678 121149 121143 122381 123815 124603 125450 126866 127931 128040 128092 128773 129366
57455A29366Q9N19J303O93q41j193l10j48j046j293m11J96J24N51J615J920J051
$$ 129366 129455 129974 131277 131970 131129 129936 129626 129478 128432 127139 126728 126924 127048 127599 129214 131134 132185
57438A32185K13L5k8q2K15K39p05j471n50R62O63j229k141j269l76m56n20p0Q3
$$ 132185 132398 132433 132405 132323 132538 132777 132072 130601 130051 131013 131676 130447 128306 127037 126661 126205 125685 125615 125698
57419A25698j72K7M62K9q68o61N11Q82J11m04l35p98j741j771q61m32n14L22J871
$$ 125698 125526 125553 126015 126044 125176 124515 125026 125908 126019 125615 125280 124482 122741 120970 120109 119677 119163 119485 121356
57400A21356K187J008K95P55Q43qk47P36J287M94j81M05J209J185J014J397J613
$$ 121356 123543 124551 124846 125601 126444 126436 126189 126925 128212 128706 128525 128930 130139 131324 132338 133735 135348
57383A35348J096N89O55P62P03J179K256K901K728K446K253J619R33J276K276
$$ 135348 136444 137033 137688 138450 139153 140332 142588 145489 148217 150663 152916 154535 155468 156744 159020
57368A59020K440J827K021L020K911J229j3L70J028O62k8j27MJ32R34K324L007
$$ 159020 161460 163287 165308 168328 171239 172468 172455 172825 173853 174515 174487 174360 174364 174496 175430 177754 180761
57351A80761K626K314K396J728J39q29n03j17l75l95m2p84k916m497m341l795
$$ 180761 183387 185701 188097 189825 189964 189135 188632 188515 188140 187745 187703 186919 184003 179506 175165 171370
57335A71370m120m416l742l054l298l608l054k392k394k194q92P66J773K390K979
$$ 171370 167250 162834 159092 156038 152740 149132 146078 143686 141292 139098 138206 138972 140745 143135 146114
57320A46114K941K064J395J534J639J173R60J372J406O44K63Q51J233P26M87J236
$$ 146114 149055 151119 152514 154048 155687 156860 157820 159192 160598 161242 161505 162356 163589 164315 164802 166038
57304A66038J705R74K64O64J063K64o47r5J382K281K557K991L432L411L368L642
$$ 166038 167743 168717 168981 169645 170708 170972 170325 170230 171612 173893 176450 179441 182873 186284 189652 193294
57288A93294L450K355J462J710K305K359K548L568M398L860K651K096K090J879
$$ 193294 196744 199099 200561 202271 204576 206935 209483 213051 217449 221309 223960 226056 228146 230025
57274B30025J680J880J889J344J212K132K961K604J938K208K839K666K073K007
$$ 230025 231705 233585 235474 236818 238030 240162 243123 245727 247665 249873 252712 255378 257451 259458
57260B59458K058J453Q89J451K582L065L126L757M742N137M961M761M291L326
$$ 259458 261516 262969 263858 265309 267891 270956 274082 277839 282581 287718 292679 297440 301731 305057
57246C05057K886L913N463N989N690N866O663P175P273P574Q041Q212Q351Q914
$$ 305057 307943 311856 317319 323308 328998 334864 341527 348702 355975 363549 371590 379802 388153 397067
57232C97067R426R255Q954R470J0539J1224J1444J1747J2175J2580J3354J4644
$$ 397067 406493 415748 424702 434172 444711 455935 467379 479126 491301 503881 517235 531879
57220E31879J5613J5689J5677J6439J7419J7774J7930J8542J8999J8573J8136
$$ 531879 547492 563181 578858 595297 612716 630490 648420 666962 685961 704534 722670
57209G22670J9093K1232K3214K4532K5602K6658K7865K9758L2261L4172L4886
$$ 722670 741763 762995 786209 810741 836343 863001 890866 920624 952885 987057 1021943
57198A021943L5547L7183L8913L9498L9380L9496L9380L8342L7241L7100L7114
$$ 1021943 1057490 1094673 1133586 1173084 1212464 1251960 1291340 1329682 1366923 1404023 1441137
57187A441137L6227L5518L6689L9121M0871M1869M3681M6652M9819N3172N7520
$$ 1441137 1477364 1512882 1549571 1588692 1629563 1671432 1715113 1761765 1811584 1864756 1922276
57176A922276O2285O5819O7916O9831P1896P3226P3749P4415P5264P5268P4206
$$ 1922276 1984561 2050380 2118296 2188127 2260023 2333249 2406998 2481413 2556677 2631945 2706151
57165B706151P2936P1714O9933O7492O4902O2173N9184N6723N5390N3977N0853
$$ 2706151 2779087 2850801 2920734 2988226 3053128 3115301 3174485 3231208 3286598 3340575 3391428
57154C391428M6529M2804L9809L6168L1813K8170K5637K3296K1268K0955K2665
$$ 3391428 3437957 3480761 3520570 3556738 3588551 3616721 3642358 3665654 3686922 3707877 3730542
57143C730542K5284K8538L3413L9860M6316N1932N7126O1392O2712N9789N3000
$$ 3730542 3755826 3784364 3817777 3857637 3903953 3955885 4013011 4074403 4137115 4196904 4249904
57132D249904M2804K9446J4861K628m958p994o750p04R184J9501K7151L1521L3022
$$ 4249904 4292708 4322154 4337015 4339643 4334685 4326691 4319941 4319237 4328421 4347922 4375073 4406594 4439616
57119D439616L1341K6673K1170J7646J7614K1191K7566L4755M0364M3570M5399
$$ 4439616 4470957 4497630 4518800 4536446 4554060 4575251 4602817 4637572 4677936 4721506 4766905
57108D766905M6842M8318N1377N8769P1946R0486J14821J47134J88459K37552
$$ 4766905 4813747 4862065 4913442 4972211 5044157 5134643 5249464 5396598 5585057 5822609
57098E822609K94566L63471M48898N52991O77552Q25785R97180J182061J365645
$$ 5822609 6117175 6480646 6929544 7482535 8160087 8985872 9983052 11165113 12530758
57089A2530758J537439J693347J829992J941952K023961K069259K064743J996308
$$ 12530758 14068197 15761544 17591536 19533488 21557449 23626708 25691451 27687759
57081B7687759J864624J688868J485491J245835R45132N75595J62205k57730o62681
$$ 27687759 29552383 31241251 32726742 33972577 34917709 35493304 35655509 35397779 34735098
57072C4735098j048501j409441j728555j986433k170588k274713k297120k245157
$$ 34735098 33686597 32277156 30548601 28562168 26391580 24116867 21819747 19574590
57064A9574590k136796j992509j826517j647637j464856j287656j122377r71904
$$ 19574590 17437794 15445285 13618768 11971131 10506275 9218619 8096242 7124338
57056G124338q38300p22850o24296n39872m67977m07943l58031l15857k80156
$$ 7124338 6286038 5563188 4938892 4399020 3931043 3523100 3165069 2849212 2569056
57047B569056k50029k23247j97599j73272j51678j32646j15072r9545q7581p8598
$$ 2569056 2319027 2095780 1898181 1724909 1573231 1440585 1325513 1225968 1138387 1059789
57037A059789p0360o2225n5358m9863m4369l8671l4056l0706k7265k3367k0049
$$ 1059789 989429 927204 871846 821983 777614 738943 704887 674181 646916 623549 603500
57026F03500j7134j2825o643k87N332J1572J9627K8931L9167N1624O7295Q5561
$$ 603500 586366 573541 566898 566611 571943 583515 603142 632073 671240 722864 790159 875720
57014H75720J05739J27004J44175J45695J19951O5486n357p2969j21304j44883
$$ 875720 981459 1108463 1252638 1398333 1518284 1583770 1578413 1505444 1384140 1239257
57004A239257j48225j39716j25750j09544r3173p8398o5614n4009m3352l4277
$$ 1239257 1091032 951316 825566 716022 622849 544451 478837 424828 381476 347199
56994C47199k6697j9555j2634o923k764Q14M293O830P995Q861J0440J2247J3098
$$ 347199 320502 300947 288313 281390 278626 279440 283733 290563 298558 307419 317859 330106 343204
56981C43204J2232R052L192m348j1316j6179j9042k0293j9755j7771j5646j4142
$$ 343204 355436 364488 367680 363332 352016 335837 316795 296502 276747 258976 243330 229188
56969B29188j2607j0393p954n888m004j933L14K908O245J0027J3525J7004K1379
$$ 229188 216581 206188 198234 192346 188342 186409 186723 189631 195876 205903 219428 236432 257811
56956B57811K5849K7401K3584J4766L271q339j7628k2746k3787k2720k1215j9356
$$ 257811 283660 311061 334645 349411 352682 344343 326715 303969 280182 257462 236247 216891
56944B16891j6797j3834j0728p275l644m95K266N556R519J3189J6240J9646K4125
$$ 216891 200094 186260 175532 168257 164613 164118 166384 171940 181459 194648 210888 230534 254659
56931B54659K9167L3661L5969L3349K3686Q626o910j9116k7590l2981l4951l3567
$$ 254659 283826 317487 353456 386805 410491 419117 412207 393091 365501 332520 297569 264002
56919B64002l0441k6973k3130j9112j6262j4994j3769j1522r263p969o786m992
$$ 264002 233561 206588 183458 164346 148084 133090 119321 107799 98536 90567 83781 78789
56907G8789l682l740l864k634r52m36o88k71P86J455J755K469L596M676N918P605
$$ 78789 75107 71367 67503 64869 63917 63481 62793 62522 63308 64763 66518 68987 72583 77259 83177 90782
56891I0782R288J0819J3132J6700K0414K3205K5411K7000K6016K0665J1933K534
$$ 90782 100070 110889 124021 140721 161135 184340 209751 236751 262767 283432 295365 297899
56879B97899n709j1942j5248j5512j4291j3064j1422q508n017k033Q95M660Q665
$$ 297899 292190 280248 265000 249488 235197 222133 210711 202203 197186 195153 196048 200708 209373
56866B09373J1940J5154J9587K5029L0632L6892M4642N2493N7007N5021M4784
$$ 209373 221313 236467 256054 281083 311715 348607 393249 445742 502749 557770 602554
56855F02554K6416L305j8138l2584l9489m1469m0314l6487l1082k5528j9872j3488
$$ 602554 628970 632275 614137 581553 542064 500595 460281 423794 392712 367184 347312 333824
56843C33824o930j062M889J2244K0539K8495L6653M6748N8988P2042Q4651R4299
$$ 333824 326894 325832 330721 342965 363504 391999 428652 475400 534388 606430 691081 785380
56831G85380R4940P9932M8714Q794k9493n8925p6782q3529q1706p4708o5294n5163
$$ 785380 880320 960252 1008966 1017760 988267 929342 852560 769031 687325 612617 547323 492160
56819D92160m5365l6160k6939j7463q672j183O074J4312K2973L0989L9048M8640
$$ 492160 446795 410635 383696 366233 357561 356378 362452 376764 399737 430726 469774 518414
56807E18414N9249O7906P0714O3559M3528J2621k0747m6992o2258o8572o8666
$$ 518414 577663 645569 716283 779842 823370 835991 815244 768252 705994 637422 568756
56796E68756o3789n5741m7230l9397l1563k3736j7011j1343n440P97O105J0314
$$ 568756 504967 449226 401996 362599 331036 307300 290289 278946 273506 274303 280408 290722
56784B90722J4621J9304K3611K7966L3256L7333L5234K4237O971j1329k6623l6748
$$ 290722 305343 324647 348258 376224 409480 446813 482047 506284 513255 501926 475303 438555
56772D38555m1015m0621l7972l4548l0479k6219k2773j9988j6721j3126j0775
$$ 438555 397540 356919 318947 284399 253920 227701 204928 184940 168219 155093 144318
56761A44318j0007r256p618o051n322m808m031l517l356k742j605r37q93n21R0
$$ 144318 134311 125055 117437 111386 106064 101256 97225 93708 90352 87610 86005 85068 84175 83654 83744
56746H3744m60k249l269k296n99K14K39J88J8k15J62J019J053j77j301j193m81
$$ 83744 83284 81035 77766 75470 74871 75085 75324 75512 75530 75315 75477 76496 77549 77372 76071 74878 74397
56729G4397j52j00K0l4j57M09J581K075J384O56P21P44j38j207j312n54K05O06
$$ 74397 74245 74145 74165 74131 73974 74383 75964 78039 79423 80079 80800 81544 81406 80199 78887 78333 78538 79144
56711G9144P47P43Q40J211J340O44k77k45O25J055O96M23M87J56n81p75l54l55
$$ 79144 79891 80634 81474 82685 84025 84669 84392 84147 84772 85827 86523 86946 87433 87589 87008 86233 85879 85524
56693H5524r54j048k98K59Q4k27n05j306k204j875l89O38O81R60J907K219J213
$$ 85524 84570 83522 83224 83483 83567 83340 82835 81529 79325 77450 77061 77699 78380 79340 81247 83466 84679
56676H4679q4r22j739k363j663O7Q27mo15J45J053J097J299K428L231K572J309
$$ 84679 84595 83673 81934 79571 77908 77975 78802 78798 78183 78328 79381 80478 81777 84205 87436 90008 91317
56659I1317N48qn62j88J219K051J546J154J872K412J693Q74J087J309N84K21J489
$$ 91317 91865 91857 91295 91107 92326 94377 95923 97077 98949 101361 103054 103928 105015 106324 106908 107129 108618
56642A08618L047L035K098J986K541K448J710J166O37l99j199q26P6K91q0k33
$$ 108618 111665 114700 116798 118784 121325 123773 125483 126649 127286 126887 125688 124862 124938 125229 125149 124916
56626A24916j67j26K68R28P00o96j560o71O57P05j3l7M54M09l6j47k59r86j764
$$ 124916 124749 124623 124891 125819 126519 125823 124263 123592 124249 124954 124941 124904 125358 125767 125731 125584 125325 124339 122575
56607A22575j813j586j715j666r44m37r59j704j573q71k11P44K006K292J032k02
$$ 122575 120762 119176 117461 115795 114851 114414 113455 111751 110178 109307 109096 109840 111846 114138 115170 114968
56591A14968j4O72N39K94J076K086J989J345J476K151K391K325K336J723K71l97
$$ 114968 114954 115626 116165 116459 117535 119621 121610 122955 124431 126582 128973 131298 133634 135357 135628 135231
56575A35231Q71K485K437J404J269J946K195K342L540N296O268O712P771R167
$$ 135231 136102 138587 141024 142428 143697 145643 147838 150180 153720 159016 165284 171996 179767 188934
56561A88934R919J0387J1420J2336J2075J1384J1577J2067J1447J0114R414R084
$$ 188934 198853 209240 220660 232996 245071 256455 268032 280099 291546 301660 311074 320158
56549C20158P962O445N791N634M596K755J275J85j349l101m254n109o383p661
$$ 320158 328120 334565 340356 345990 350586 353341 354616 354801 353452 350351 346097 340988 334605 326944
56535C26944q377r292j1001j2227j1755j0728j0690j0761r394p556p213p738o973
$$ 326944 318567 309275 298274 286047 274292 263564 252874 242113 232719 225163 217950 210212 203239
56522B03239n040l992m236m325l903l942m340m075l456l652m262l883k791k491
$$ 203239 198199 194207 189971 185646 181743 177801 173461 169386 165930 162278 158016 154133 151342 148851
56508A48851l003l004k310j872j653r22j80m57j234j328j120j618k130j399j24
$$ 148851 145848 142844 140534 138662 137009 136087 135907 135450 134216 132888 131768 130150 128020 126621 126497
56493A26497K47K76J276K359J743J47k56M69N64J05O20J700J400k23j252j277
$$ 126497 126744 127020 128296 130655 132398 132545 132289 132758 133322 133427 134047 135747 137147 136924 135672 134395
56477A34395j489j711o71R80J273M58O16J820K024Q53J46N46P66M62P12J435J327
$$ 134395 132906 131195 130524 131504 132777 133235 133851 135671 137695 138548 138694 139240 140006 140468 141180 142615 143942
56460A43942N65O21J336J165K29M9M38j14j107n63J175J669N22k16J63L49K37
$$ 143942 144507 145128 146464 147629 147858 147907 148345 148231 147124 146561 147736 149405 149927 149711 149874 150223 150460
56443A50460J074K225J585l96r07M59J059n9p27J47Q23L09M7Q17J308R69J039
$$ 150460 151534 153759 155344 154948 154041 154500 155559 155500 154773 154920 155743 156052 156099 156916 158224 159193 160232
56426A60232J694J461L69L39J542J785N03j80O32J131M25P7P93R92M4m70K9o3
$$ 160232 161926 163387 163756 164095 165637 167422 167925 167745 168377 169508 169933 170010 170803 171795 171839 171369 171398 171335
56408A71335j164j365n6P50M6m93N4J78q46j347m70K18j71k89N03Q12K60N46K043
$$ 171335 170171 168806 168750 169500 169546 169053 169107 169285 168439 167092 166622 166840 166669 166380 166883 167695 167955 168501 170544
56389A70544K678J666R39J362J097o09j596o22M73L36M05J630K353J582J069J977
$$ 170544 173222 174888 175827 177189 178286 177677 176081 175459 175932 176268 176673 178303 180656 182238 183307 185284
56373A85284K671J932J152J230N89j444k575j316K52j7r97r15m14n58m84N36J217
$$ 185284 187955 189887 191039 192269 192858 191414 188839 187523 187775 187758 186761 185846 185432 184874 184390 184926 186143
56356A86143P06L89J156J571P62L82J474K181R09q49j084k66L00O73J043P19J8
$$ 186143 186849 187238 188394 189965 190727 191109 192583 194764 195673 194824 193740 193474 193774 194447 195490 196209 196227
56339A96227N23K022K132L48p30J82R68J90m80R5J97j086j557J27J771J554J131
$$ 196227 196750 198772 200904 201252 200522 200704 201672 201862 201382 201477 201674 200588 199031 199158 200929 202483 203614
56322B03614K198L294K880K288K773K879J515M73J115J737R77N27J693K581J661
$$ 203614 205812 209106 211986 214274 217047 219926 221441 221914 223029 224766 225743 226270 227963 230544 232205
56307B32205Q38K019L791M432M868N814N367K670M30P01J497P91K35J584L036
$$ 232205 233043 235062 238853 243285 248153 253967 259334 262004 262434 263135 264632 265423 265658 267242 270278
56292B70278K731K376L678M617L156J306J554K509K052J606L153N004M687L263
$$ 270278 273009 275385 279063 283680 286836 288142 289696 292205 294257 295863 299016 304020 308707 311970
56278C11970K817K585J482J375L789O260O142N110N864P346P509P677R763J2012
$$ 311970 314787 317372 318854 320229 324018 330278 336420 341530 347394 354740 362249 369926 379689 391701
56264C91701J2150J1940J4069J7200J8755J9943K3272K7527K9987L1442L4359
$$ 391701 403851 415791 429860 447060 465815 485758 509030 536557 566544 597986 632345
56253F32345L8220M1080M3714M7801N2145N4837N6970O0185O2933O3205O2261
$$ 632345 670565 711645 755359 803160 855305 910142 967112 1027297 1090230 1153435 1215696
56242A215696O1587N9070N2578M4280L6913K8842J7584N183m992j3796k3532l2657
$$ 1215696 1277283 1336353 1388931 1433211 1470124 1498966 1516550 1521733 1516741 1502945 1479413 1446756
56230A446756l8556m2726m7760n1965n2516n1302n1813n2863n1181m7840m6110
$$ 1446756 1408200 1365474 1317714 1265749 1213233 1161931 1110118 1057255 1006074 958234 912124
56219I12124m5168m1977l7347l4280l2223k8857k5481k4733k4899k2421j8272
$$ 912124 866956 824979 787632 753352 721129 692272 666791 642058 617159 594738 576466
56208E76466j5918j4990j2823j0274r813r879p435m272m326o470o449m394l884
$$ 576466 560548 545558 532735 522461 512648 502769 495334 491062 486736 480266 473817 469423 465539
56195D65539m977m755l496l814m801l535j121r66k276j715j23r58l278l145r03
$$ 465539 460562 455807 452311 448497 443696 440161 439040 438074 435798 434083 433960 433002 429724 426579 425676
56180D25676k99j283n61J560J685P5J56J811J835M70R08K843L025J689J945L422
$$ 425676 425377 424094 423533 425093 426778 426853 427009 428820 430655 431125 432033 434876 437901 439590 441535 444957
56164D44957L009J307J784M109M853M178N308P990Q956Q262Q743J0038R556Q364
$$ 444957 447966 449273 451057 455166 460019 464197 469505 477495 486451 494713 503456 513494 523050 531414
56150E31414R555J1952J2099J1130J2801J6125J7202J6896J9186K3305K5229K5750
$$ 531414 540969 552921 565020 576150 588951 605076 622278 639174 658360 681665 706894 732644
56138G32644K9181L5263M0294M5175N4144O6470P7501Q6809R6872J04826J04460
$$ 732644 761825 797088 837382 882557 936701 1003171 1080672 1167481 1264353 1369179 1473639
56127A473639R5863Q4652P2658N8166M4252L7157L6498L5979L3320L0566K5721
$$ 1473639 1569502 1654154 1726812 1784978 1829230 1866387 1902885 1938864 1972184 2002750 2028471
56116B028471J4300r84j1960j6596j9642k2464k2557k2784l0193m4881n9940p2736
$$ 2028471 2042771 2041787 2029827 2013231 1993589 1971125 1948568 1925784 1895591 1850710 1790770 1718034
56104A718034q5962r7589j00927r5681q8377q1085p0185n6739m6906m1053l3547
$$ 1718034 1632072 1534483 1433556 1337875 1249498 1168413 1098228 1041489 994583 953530 919983
56093I19983k4220j8863j7528j3955p611m499m831k149L785N816K973K666P035
$$ 919983 895763 876900 859372 845417 837806 833307 828476 826327 830112 835928 838901 841567 848602
56080H48602R671Q420Q963J2785J4046J1437J0844J3256J2332O953L819M667L496
$$ 848602 858273 866693 875656 888441 902487 913924 924768 938024 950356 957309 961128 965795 969291
56067I69291p24j491K226L532J121J860O900Q874O203O227J0695J2358R509R388
$$ 969291 968567 967076 969302 972834 973955 975815 982715 991589 997792 1004019 1014714 1027072 1036581 1045969
56053A045969J3487J4267J0395J0030J4891J6618J3192J3049J8258K0062J6049
$$ 1045969 1059456 1073723 1084118 1094148 1109039 1125657 1138849 1151898 1170156 1190218 1206267
56042A206267J5008J9376K0008J4192J1451J5245J6640J2756J3477K2536L0018
$$ 1206267 1221275 1240651 1260659 1274851 1286302 1301547 1318187 1330943 1344420 1366956 1396974
56031A396974L1193L4521M3233M7618M3907M2078M6385M7275M1306L9397M5969
$$ 1396974 1428167 1462688 1505921 1553539 1597446 1639524 1685909 1733184 1774490 1813887 1859856
56020A859856M9828M5595M3943N0370N4411N0667M9661N6730O1249N8164N8618
$$ 1859856 1909684 1955279 1999222 2049592 2104003 2154670 2204331 2261061 2322310 2380474 2439092
56009B439092O7573P3080O9809P0344Q0649Q7928Q5948Q7946J00580J10186J09548
$$ 2439092 2506665 2579745 2649554 2719898 2800547 2888475 2974423 3062369 3162949 3273135 3382683
55998C382683J12481J26533J37599J37810J41493J56712J68829J69727J74487
$$ 3382683 3495164 3621697 3759296 3897106 4038599 4195311 4364140 4533867 4708354
55989D708354J91084K03715K04971K12882K36221K56091K62993K77140L09531
$$ 4708354 4899438 5103153 5308124 5521006 5757227 6013318 6276311 6553451 6862982
55980F862982L39599L55658L79052M22317M63947M92499N32881N98880O64787
$$ 6862982 7202581 7558239 7937291 8359608 8823555 9316054 9848935 10447815 11112602
55971A1112602P16483P82754Q81105R84142J077954J198730J369695J561391J760979
$$ 11112602 11829085 12611839 13492944 14477086 15555040 16753770 18123465 19684856 21445835
55962B1445835K016790K363879K778034L263281L908071M788460N899756P255408
$$ 21445835 23462625 25826504 28604538 31867819 35775890 40564350 46464106 53719514
55954E3719514Q953213J1057854J3534521J6402848J9824091K3924328K8701900
$$ 53719514 62672727 73730581 87265102 103667950 123492041 147416369 176118269
55947A76118269L4165921M0038048M4708735M4802977L6961231K0896444N41260
$$ 176118269 210284190 250322238 295030973 339833950 376795181 397691625 398232885
55940C98232885j8297810l1549251l8404707m0178106l8577610l5004907l0574478
$$ 398232885 379935075 348385824 309981117 269803011 231225401 196220494 165646016
55933A65646016k6069226k1864422j8098535j4878345j2250544j0123700q368406
$$ 165646016 139576790 117712368 99613833 84735488 72484944 62361244 53992838
55926E3992838o937069n809046m904069m138775l503634l008266k608134k251429
$$ 53992838 47055769 41246723 36342654 32203879 28700245 25691979 23083845 20832416
55918B0832416j944075j705706j509121j319812j150775j024688r21977q15403
$$ 20832416 18888341 17182635 15673514 14353702 13202927 12178239 11256262 10440859
55910A0440859p18156o51037n96980n32194m69822m30879m02112l62390l22545
$$ 10440859 9722703 9071666 8474686 7942492 7472670 7041791 6639679 6277289 5954744
55901E954744l01019k86345k59977k31714k18156k09198j88720j66380j57411
$$ 5954744 5653725 5367380 5107403 4875689 4657533 4448335 4259615 4093235 3935824
55892C935824j51949j34574j14238j05643j00253q3897o4599n5478m7760k7613
$$ 3935824 3783875 3649301 3535063 3429420 3329167 3245270 3180671 3125193 3077433 3049820
55882C049820k962J2338K4766M6043O7030P1452O1633M7550K4912j2447n2003
$$ 3049820 3046858 3059196 3083962 3130005 3197035 3268487 3330120 3377670 3402582 3390135 3338132
55871C338132p7593r3130j10421j26300j32741j36446j46545j54685j48606j34441
$$ 3338132 3260539 3167409 3056988 2930688 2797947 2661501 2514956 2360271 2211665 2077224
55861B077224j25183j18013j03415q6081p6269p0024n7954m4668m0162m0511l5986
$$ 2077224 1952041 1834028 1730613 1644532 1568263 1498239 1440285 1395617 1355455 1314944 1278958
55850A278958k9971l1386l6154l4464k9076k8859l1186k7917k1969k1329k3101
$$ 1278958 1248987 1217601 1181447 1146983 1117907 1089048 1057862 1029945 1007976 986647 963546
55839I63546j9772j4723j5664j9134j7125j2684j3599j6948j5230j1494j3121
$$ 963546 943774 929051 913387 894253 877128 864444 850845 833897 818667 807173 794052
55828G94052j6671j4152q584q205j0794q667m020m363p668o673l273m250p187
$$ 794052 777381 763229 754645 746440 735646 726979 722959 718596 710928 704255 700982 696732 689545
55815F89545n000j67l91l972l443J6n40m122m433k825n433j0439j1111q638r417
$$ 689545 684545 684378 683987 680015 676572 676588 676048 671926 667493 664668 659235 648796 637685 629047 619630
55800F19630j2407j1512p825p351r292q289n536o056p831n218j91J297R48M377
$$ 619630 607223 595711 587886 580535 571243 562954 557418 551362 543531 538313 538122 539419 540367 544744
55786E44744Q882P112M33l341l321m942q162q038n398n557p777p005m528o007
$$ 544744 553626 560738 561171 557830 554509 549567 541405 533367 527969 522412 514635 507630 503102 497095
55772D97095j0377j1558r764j0409j3134j2578q969p529q345o993m102m205o203
$$ 497095 486718 475160 465396 454987 441853 429275 420306 412777 404432 397439 393337 389132 382929
55759C82929m995j551j377m071m281k051k327n128o016n433p704j1573j1449p506
$$ 382929 377934 376383 375006 370935 366654 364603 362276 357148 351132 345699 337995 326422 314973 307467
55745C07467n095m841k880K0o73l870m047j395j235l723l801j186p43k801k618
$$ 307467 302372 297531 294651 294671 293998 290128 286081 284686 283451 279728 275927 274741 273998 271197 268579
55730B68579K55J198n21r83J5j320m540n204l480l798n911n232k085j508l613
$$ 268579 268834 270032 269511 268528 268543 267223 262683 257479 253999 250201 244290 239058 236973 235465 231852
55715B31852l375m35J72k216k669k27M11j879k590l35R22o7J77K168J938j132
$$ 231852 228477 228042 228214 225998 223329 223102 223513 221634 219044 218709 219631 219564 219741 221909 223847 222715
55699B22715k784j794j738l495l656j803j742m042m879l612l917o129o175l556
$$ 222715 219931 218137 216399 212904 209248 207445 205703 201661 196782 193170 189253 183124 176949 173393
55685A73393k568m114m009j092O98J36Q98M059N872N016M775O074N650L078K214
$$ 173393 170825 166711 162702 161610 162308 162444 163342 167401 173273 178289 183064 189138 194788 197866 200080
55670B00080L712L495P60m2K467L756J537n16j5K35j519k583j714j942m432n743
$$ 200080 203792 207287 208047 208005 210472 214228 215765 215249 215234 215469 213950 211367 209653 207711 203279 197536
55654A97536m140k655l174l342j975j625l148l544j740p74j891k279r05o55k300
$$ 197536 193396 190741 187567 184225 182250 180625 177477 173933 172193 171419 169528 167249 166344 165689 163389
55639A63389k435N4J468j51j781j335r95k057k242p77m54k043k312j70R34o52
$$ 163389 160954 161008 162476 162325 160544 159209 158214 156157 153915 153138 152684 150641 148329 148159 149093 148441
55623A48441j827p62n0j134j358M89J446Q8n81J014J882K11j259o36k09j335j426
$$ 148441 146614 145852 145802 144668 143310 143799 145245 145333 144752 145766 147648 147859 146600 145964 145755 144420 142994
55606A42994O57J707p5j618o61L42p09j732j047p42k042k289o1J632O68m12O15
$$ 142994 143651 145358 145283 143665 143004 143346 142637 140905 139858 139116 137074 134785 134724 136356 137024 136612 137227
55589A37227J687Q95J03P62Q45o61r93J198K696J340j8J122K398J412M04J937
$$ 137227 138914 139809 139912 140674 141519 140858 139865 141063 143759 145099 145081 146203 148601 150013 150417 152354
55573A52354M147M528M441N833P212O769N876N840M934K031m88r42j497l825n626
$$ 152354 156501 161029 165470 171303 178515 185284 191160 197000 201934 203965 203477 202535 201038 197213 191587
55558A91587n010m207n319o405n497m507n288n833m240k610l090l828k684j259
$$ 191587 186577 182370 177051 170646 165149 160642 155354 149521 145281 142671 139581 135753 133069 131810
55544A31810j345j278L44J164n87k157r24Q16J01j340o11R40N63o96m07N08m7
$$ 131810 130465 129187 129531 130695 130108 127951 127027 127843 127944 126604 125993 126933 127496 126800 126393 126901 126854
55527A26854j019m91K35q50k300j726j73j2p80q17o37j050o07J447K451L97k131
$$ 126854 125835 125344 125579 124729 122429 120703 120530 120518 119738 118921 118284 117234 116627 118074 120525 120922 118791
55510A18791j952l82k98r95l49O84J18q43q1J159O07o48l45M94l51j754j219L68
$$ 118791 116839 116457 116159 115164 114815 115499 115617 114774 114693 115852 116459 115811 115466 115960 115609 113855 112636 113004
55492A13004L52q94r55J52M76j31l92m76j073j081M76J858J154l21l40M04J31
$$ 113004 113356 112462 111507 111659 112135 112004 111612 111136 110063 108982 109458 111316 112470 112149 111809 112213 112344
55475A12344m78L6O47j66j180o68J85m44j364o06P85Q46M58J326K355J818J020
$$ 112344 111866 111902 112549 112383 111203 110535 110720 110276 108912 108306 109091 109937 110395 111721 114076 115894 116914
55458A16914J852K820J622m14o59M3p13k051j429M99J126O29R89J624M61j624
$$ 116914 118766 121586 123208 122794 122135 122178 121465 119414 117985 118484 119610 120239 121228 122852 123313 121689
55442A21689j938o55j79o61k83P38N89l84k63O72O31L7P96K452K843K012J863
$$ 121689 119751 119096 118917 118256 117973 118711 119300 118916 118653 119325 119956 119993 120789 123241 126084 128096 129959
55425A29959K535K657K503L455N020N825O622Q864J1299J1580J0289R668R348
$$ 129959 132494 135151 137654 141109 146129 151954 158576 167440 178739 190319 200608 210276 219624
55412B19624P228L764J362P6k124n309p599q734r938j0749r669p592o820p131
$$ 219624 226852 230616 231978 232054 229930 224621 217022 208288 198350 187601 177932 170340 163520 156389
55398A56389o414m752m164m679m394l169k680k965k460j246q43j062m01P53P29
$$ 156389 149975 145223 141059 136380 131986 128817 126137 123172 120712 119466 118623 117561 117160 117913 118642
55383A18642r3N2Q11L81q81j103n38r34j842j362j2P8o02K58K131K152L07l54
$$ 118642 118549 118601 119412 119793 118912 117809 117271 116337 114495 113133 113121 113199 112597 112855 114986 117138 117445 117091
55365A17091R51J612M80l31L58P80k84j446j472j127j157j095r04j265j694q88
$$ 117091 118042 119654 120134 119803 120161 120941 120657 119211 117739 116612 115455 114360 113456 112191 110497 109609
55349A09609P08J307Q01P02J116P74q3N7Q56N23o58n70P69J026l68j362j002o41
$$ 109609 110317 111624 112425 113127 114243 115017 114934 114991 115847 116370 115712 115142 115911 116937 116569 115207 114205 113564
55331A13564q09l37P86Q76k43o55K23P34J78n0N92O95l52j276j403j589j987j588
$$ 113564 112755 112418 113204 114080 113837 113182 113405 114139 114317 114267 114859 115554 115202 113926 112523 110934 108947 107359
55313A07359n94n56j557j876r31J7N06J330K107J369m22r88P7P56K12p7N03N87
$$ 107359 106765 106209 104652 102776 101845 101862 102368 103698 105805 107174 106752 105764 105841 106597 106809 106732 107235 107822
55295A07822k49m94L90R54N80N58J334J534O16j44k01n86j399j224R0P62J54k21
$$ 107822 107573 107079 107469 108423 109003 109561 110895 112429 113045 112901 112700 112114 110715 109491 109581 110343 110497 110276
55277A10276M12Q56M93L44P16M27o84j174o69n23j017p94J54j1j492j975m38J162
$$ 110276 110688 111544 112037 112381 113097 113524 112840 111666 110997 110474 109457 108663 108817 108806 107314 105339 104901 106063
55259A06063J337J242J915K244J380N82Q53J092K59q07j207j508j995j581P4J386
$$ 106063 107400 108642 110557 112801 114181 114763 115616 116708 116967 116160 114953 113445 111450 109869 109943 111329
55243A11329J189L17k80j015k011k160j067k4J30K56R93J553J384J122J015L83
$$ 111329 112518 112835 112555 111540 109529 107369 106302 106278 106408 106664 107657 109210 110594 111716 112731 113114
55227A13114n54m84O28J174O22K77O29M85l75m11Q23J626J113N89P91M99p55j316
$$ 113114 112560 112076 112704 113878 114500 114777 115406 115891 115516 115105 115928 117554 118667 119256 120047 120546 119791 118475
55209A18475l79K92o90j993j965j142o36j69N47N49n41j244n01N42N59M1j22k44
$$ 118475 118096 118388 117698 115705 113740 112598 111962 111793 112340 112889 112348 111104 110603 111145 111704 111745 111623 111379
55191A11379o06l67Q48J920K052J884J814J095l23j052n57j41o07r77o27m91r42
$$ 111379 110773 110406 111254 113174 115226 117110 118924 120019 119696 118644 118087 117946 117339 116362 115735 115244 114302
55174A14302p65M24J109N33J06P36J135L41m28j06K95j25l43M54J114P16L76R52
$$ 114302 113537 113961 115070 115603 115709 116445 117580 117921 117493 117387 117682 117557 117214 117668 118782 119498 119874 120826
55156A20826J166L1j011m93M92L51k13J73Q91N17n89j142j134j231j169n46o3
$$ 120826 121992 122023 121012 120519 121011 121362 121149 121322 122213 122730 122141 120999 119865 118634 117465 116919 116856
55139A16856k86l60M70J402J511J282J227N53j173k533k148p60P7J22j34p44j557
$$ 116856 116570 116210 116680 118082 119593 120875 122102 122655 121482 118949 116801 116041 116118 116240 116106 115362 113805
55122A13805j678r51n67j005j026Q4J113J070Q47J265J398M45n62n80l52p45j105
$$ 113805 112127 111176 110609 109604 108578 108662 109775 110845 111692 112957 114355 114800 114238 113658 113306 112561 111456
55105A11456p54l48k91K83J420J472p3j111j67J222J333J073J711K124R51n33
$$ 111456 110702 110354 110063 110346 111766 113238 113165 112054 111887 113109 114442 115515 117226 119350 120301 119768
55089A19768m77L86L47j76J32O42k4j207j294n20j76j54L70Q69M95KL85P91P4
$$ 119768 119291 119677 120024 119848 119980 120622 120598 119391 118097 117577 117401 117247 117617 118486 118981 118983 119368 120159 120233
55070A20233q38n38K07o7o78j18R00N68p11j012k00J43l26m36O8K51l2p3P4j70
$$ 120233 119395 118857 119064 118997 118319 118201 119101 119669 118958 117946 117746 117889 117563 117127 117195 117446 117414 117341 117415 117245
55050A17245m00J41Q93P73J21M2M21M21K34M87O63jq38p87l56o05j075o67K33
$$ 117245 116845 116986 117879 118652 118773 118815 119236 119657 119891 120378 121041 121040 120202 119415 119059 118454 117379 116712 116945
55031A16945N09L83O92R89M20k62K20J307J441O29R0J2l32p63n35O0K32J94M56
$$ 116945 117454 117837 118529 119518 119938 119676 119896 121203 122644 123273 123363 123375 123043 122280 121745 121805 122037 122231 122687
55012A22687M23m85j321j055m01l32r0J176K228J655O28J033K077J719L85Q5O10
$$ 122687 123110 122625 121304 120249 119848 119516 119426 120602 122830 124485 125113 126146 128223 129942 130327 130412 131022
54995A31022rj698k360j574j003j016j65J606K321J256N0k04m35j272j688j008
$$ 131022 131013 129315 126955 125381 124378 123362 123197 124803 127124 128380 128430 128226 127791 126519 124831 123823
54979A23823k07j89m40k42K12O02J074J641K025K236K298J732M45l49K89J289
$$ 123823 123616 123427 122987 122745 122957 123559 124633 126274 128299 130535 132833 134565 135010 134661 134950 136239
54963A36239J100K23K29R48R42K88L92J258J445Q05O92J295J272L50k1P67J527
$$ 136239 137339 137562 137791 138739 139681 139969 140361 141619 143064 143869 144561 145856 147128 147478 147457 148224 149751
54946A49751J504J518K209K984L420M045N140O199P062Q134R217R622R624J0205
$$ 149751 151255 152773 154982 157966 161386 165431 170571 176770 183832 191966 201183 210805 220429 230634
54932B30634J1130J0851Q613N148J144l352p749j0737j1761j1425j0345q748p193
$$ 230634 241764 252615 261228 266376 267520 264168 256419 245682 233921 222496 212151 203403 196210
54919A96210o339o025n683n382n234m468k636j038j086j873j454L5P55L34J85
$$ 196210 189871 183846 178163 172781 167547 163079 160443 159405 158319 156446 154992 155027 155782 156116 156301
54904A56301P72J088R35J387K556L159K814K703L526M659N721P154Q919J0278
$$ 156301 157073 158161 159096 160483 163039 166198 169012 171715 175241 179900 185621 192775 201694 211972
54890B11972J1096J1641J1196Q781N168K129k91l540p546j0418j1334j1402j1264
$$ 211972 223068 234709 245905 254686 259854 261983 261692 258152 250606 240188 228854 217452 206188
54877B06188j0240q359o856o044m914l452l069l937m318l317k168j850j641j003
$$ 206188 195948 187589 180733 174689 169775 166323 163254 159317 154999 151682 149514 147664 146023 145020
54863A45020p27j139j160l05L13M8j32K90J64j170k318j911o82k9J07M69Q20M87
$$ 145020 144293 143154 141994 141689 142002 142050 141918 142208 142372 141202 138884 136973 136291 136262 136369 136838 137658 138145
54845A38145k92q00r35r38q12o28o69p80m66Q0Q2m25n34m6K54J47L15Q39Q71K83
$$ 138145 137853 137053 136118 135180 134368 133740 133071 132291 131825 131905 131987 131562 131028 130982 131236 131383 131698 132537 133408 133691
54825A33691N8N24P87M20J87N01P09M78L82N67L40l31n08mK25r9%Q35J315Q84
$$ 133691 133749 134273 135060 135480 135667 136168 136877 137355 137737 138304 138644 138313 137805 137801 138026 137927 137927 138762 140077 140961
54805A40961M87P62R25M35R5M96Q51M58k4J19M04K08n8K07Q29J523K489L677M497
$$ 140961 141448 142210 143135 143570 143665 144161 145012 145470 145446 145565 145969 146177 146119 146326 147155 148678 151167 154844 159341
54786A59341M833N327O222P131Q158R865J1782J2521J1851J0975J0339Q902O198
$$ 159341 164174 169501 175723 182854 191012 200877 212659 225180 237031 248006 258345 267247 273445
54773B73445L350J278l64j742k176j752j782k716l325k905k460k603k231p39K48
$$ 273445 276795 278073 277709 275967 273791 272039 270257 267541 264216 261311 258851 256248 254017 253278 253526
54758B53526j067m080o807q335q941q866q301p675o889n180k638p00k32k43N20
$$ 253526 252459 248379 241572 233237 224296 215430 207129 199454 192565 187385 184747 184047 183815 183572 184092
54743A84092J848K904L671M570N623O807Q311R780J0310R724Q686P170M282J88
$$ 184092 185940 188844 192515 197085 202708 209515 217826 227606 237916 247640 256326 263496 267778 267966
54729B67966l548o123q396j0817j2285j2040j0937r853q437o586n350n157m825
$$ 267966 264418 258295 249899 239082 226797 214757 203820 193967 185530 178944 173594 168437 163612
54716A63612l558k345k109k132j641j320j742j949j178m26o68r86k28Q35Q92L77
$$ 163612 160054 157709 155600 153468 151827 150507 148765 146816 145638 145212 144544 143558 143330 144165 145057 145434
54700A45434N35J142J073L15l11o94j114j070J2J396J826J179K63m45p68l67N17
$$ 145434 145969 147111 148184 148499 148188 147494 146380 145310 145322 146718 148544 149723 149986 149541 148773 148406 148923
54683A48923O65n73k099k492j884j381j374j488j486j267o33K10O23O00Q07J115
$$ 148923 149588 149015 146916 144424 142540 141159 139785 138297 136811 135544 134911 135121 135744 136344 137151 138266
54667A38266M65j207k361k036j065k79P27K002K245R21m29m77p0l56n83L16J474
$$ 138266 138731 137524 135163 133127 132062 131783 132510 134512 136757 137678 137249 136772 136702 136346 135763 136079 137553
54650A37553J478P77P18J117Q18j25o68m98k7O30J297J224K68m44k54j46q45j279
$$ 137553 139031 139808 140526 141643 142461 142336 141668 141170 141143 141773 143070 144294 144562 144118 143864 143718 142873 141594
54632A41594n73M9p14j742j293K4L86k04l66J5K8p1O45J585J315Q6n12k03j48
$$ 141594 141021 141070 140356 138614 137321 137345 137731 137527 137161 137176 137204 137133 137778 139363 140678 140764 140252 140049 139901
54613A39901o08o10L6L84J19p5M0K1k1M73J291J649J490J250P25l92j285r77p7
$$ 139901 139293 138683 138719 139103 139222 139147 139187 139208 139187 139660 140951 142600 144090 145340 146065 145673 144388 143411 143334
54594A43334J7o49q08j61L37K08n6j63k30m3N53Q52K17n78m16L02L51j95k82J03
$$ 143334 143351 142702 141894 141733 142070 142278 142222 142059 141829 141786 142339 143191 143408 142830 142414 142716 143067 142872 142590 142693
54574A42693j4p24j067p22k94l7K72M13J0m68l44K4p0k42J81N98M9q29o52L46
$$ 142693 142679 141955 140888 140166 139872 139835 140107 140520 140530 140062 139718 139742 139672 139430 139611 140209 140258 139429 138777 139123
54554A39123P16K69J79P01P94J28m16l59j40J06O72J170Q41J3k67L2R1nN60J576
$$ 139123 139839 140108 140287 140988 141782 141910 141494 141135 140995 141101 141773 142943 143784 143797 143530 143562 143653 143648 144208 145784
54534A45784J981J776J901K191J399m99j894j881j273r22o50k82j87k60J80J026
$$ 145784 147765 149541 151442 153633 155032 154533 152639 150758 149485 148563 147913 147631 147444 147184 147364 148390
54518A48390J238N16k48n03p24j150j211o25LJ81O8k01p23j170r46j47N25Q01
$$ 148390 149628 150144 149896 149393 148669 147519 146308 145683 145686 145867 145935 145734 145011 143841 142895 142748 143273 144074
54500A44074Q84P31L19K83J015J535P22p22j131m32o9m77n85L7M14j8n33n47m19
$$ 144074 144958 145689 146008 146291 147306 148841 149563 148841 147710 147278 147209 146732 146147 146184 146598 146580 146047 145500 145081
54481A45081l22K28J263J971J873J313O08j70n77j92L56J25n04m21J39j04j090
$$ 145081 144759 144987 146250 148221 150094 151407 152015 151845 151268 151076 151432 151557 151053 150632 150771 150667 149577
54464A49577j226O0J386J565J020N18L8m46n31k92m13q98r38l95p7j98o7L65J87
$$ 149577 148351 148411 149797 151362 152382 152900 152938 152492 151961 151669 151256 150358 149420 149025 148948 148750 148683 149048 149235
54445A49235o90j032k12P58Q69M63K50J97J25K91O67O82J93j88j57r6j67l8J57
$$ 149235 148545 147513 147301 148059 148928 149391 149641 149838 149963 150254 150921 151603 151796 151608 151451 151355 151188 151150 151307
54426A51307j59q08q85k60K30L15O24J206J173L40k77q6L01L76N42R89J132P54
$$ 151307 151148 150340 149455 149195 149425 149740 150364 151570 152743 153083 152806 152720 153021 153397 153939 154928 156060 156814
54408A56814M58M37M4q61j361r15j50K73M72N51K51k24j98K08R3o21r51n86l85
$$ 156814 157272 157709 157753 156892 155531 154616 154466 154739 155211 155762 156013 155789 155591 155799 155892 155271 154320 153734 153349
54389A53349o82o23K01R35R51P35O44K66l30k19O91J122M45k46lM92L65R2M09
$$ 153349 152667 152044 152245 153180 154131 154866 155510 155776 155446 155227 155918 157040 157485 157239 157236 157728 158093 158185 158594
54370A58594Q83P53K11j95n31r16r68o02m01m36J35J415K045J081m67j147r99
$$ 158594 159477 160230 160441 160246 159715 158799 157831 157229 156828 156392 156527 157942 159987 161068 160601 159454 158455
54353A58455q98r17o36k45j24LM71Q06M43k46n38l86n4N77J525K136J947J607
$$ 158455 157557 156640 156004 155759 155635 155638 156109 156915 157358 157112 156574 156188 156134 156711 158236 160372 162319 163926
54335A63926K078L292M322M516L928K912J845R33L0r86j735j834j747k216k937
$$ 163926 166004 169296 173618 178134 182062 184974 186819 187752 187782 186796 185061 183227 181480 179264 176327
54320A76327k907k158j865k424k823k344j595j246j054p21n99q55r79p49o29p32
$$ 176327 173420 171262 169397 166973 164150 161806 160211 158965 157911 157190 156591 155736 154757 154008 153379 152647
54304A52647m15N15J276J319R92O12M3m34j59N80O37q9l48L16P32P7q54j192j213
$$ 152647 152232 152747 154023 155342 156334 156946 156989 156555 156396 156976 157613 157524 157176 157492 158224 158301 157447 156255 155042
54285A55042j165m85Q42J653J434J192J559J593O84n2L07P42P0r11p36L44J023
$$ 155042 153877 153392 154234 155887 157321 158513 160072 161665 162349 162297 162604 163346 163416 162505 161769 162113 163136
54268A63136J032R92R32M99k2j94l58r39j530j609j377j025j69J005J292K67p05
$$ 163136 164168 165160 166092 166591 166569 166375 166017 165078 163548 161939 160562 159537 159368 160373 161665 161932 161227
54251A61227m88J03q3n24k68J50j99p27l70L27J28o59p49j14J93k1p2K8k65o24
$$ 161227 160739 160842 160759 160235 159967 160117 159918 159191 158821 159148 159276 158617 157868 157754 157947 157926 157854 157882 157617 156993
54231A56993k59M93N40j39n55m11k76k03L96J460K172K203J964J616R09j00r87
$$ 156993 156734 157227 157767 157628 157073 156662 156386 156183 156579 158039 160211 162414 164378 165994 166903 166803 165816
54214A65816j551j689j143j37L01l79j182r22j8K70j59l55l5J59q2m07o65r54
$$ 165816 164265 162576 161433 161296 161597 161218 160036 159114 159096 159366 159207 158852 158817 158976 158894 158487 157822 156868
54196A56868j030o08o8R4J31N26R88R74P26P36O56j34j275j873j800j525j028
$$ 156868 155838 155230 155162 155256 155387 155913 156901 157875 158601 159337 159993 159859 158584 156711 154911 153386 152358
54179A52358rJ100J543J406J356J426J125M71l8k86n35p87r40j145j393j209m81
$$ 152358 152349 153449 154992 156398 157754 159180 160305 160776 160738 160452 159917 159130 158190 157045 155652 154443 153962
54162A53962J21K76O29J425J540J69j503j817j014n65q12q92n99n10n69r5Q30
$$ 153962 154083 154359 154988 156413 157953 158122 156619 154802 153788 153223 152411 151519 150920 150410 149841 149746 150576
54145A50576J384J375J302J234Q32L07J63J81j92o84o10j28J53M13J210K083K032
$$ 150576 151960 153335 154637 155871 156703 157010 157173 157354 157162 156478 155868 155740 155893 156306 157516 159599 161631
54128A61631J178N98O70Q33R20J303J817J799J256Q23O27K44l02n81o29q01r56
$$ 161631 162809 163407 164077 164910 165830 167133 168950 170749 172005 172828 173455 173699 173397 172816 172187 171386 170430
54111A70430q10p37j159j562j306q87j080j368p17N26J125J018J154J488R55m66
$$ 170430 169620 168883 167724 166162 164856 163969 162889 161521 160804 161330 162455 163473 164627 166115 167070 166604
54095A66604j401j125m07l4J07J56j48o44o49l5O13J014J323J308N78l37m15L26
$$ 166604 165203 164078 163671 163637 163744 163900 163752 163108 162459 162424 163037 164051 165374 166682 167260 166923 166508 166834
54077A66834R05R89J121J347J040L19J61P01Q20q2j101j216o43j73J7K38O18J000
$$ 166834 167739 168728 169849 171196 172236 172555 172716 173417 174237 174155 173054 171838 171195 171022 171039 171277 171895 172895
54059A72895J181J096R95J264J767J790J165P46J125J633J619J812L090M806N861
$$ 172895 174076 175172 176167 177431 179198 180988 182153 182899 184024 185657 187276 189088 192178 196984 202845
54044B02845O736Q588J0921J2195J2591J3932J6573J8296J6843J2094N425j544
$$ 202845 209581 218169 229090 241285 253876 267808 284381 302677 319520 331614 337039 335495
54032C35495p184j0327j1172j0771r528p327m925l572l145k340r10oK6L35J405
$$ 335495 328311 317984 306812 296041 286513 279186 274261 270689 267544 265204 264294 264288 264314 264649 266054
54017B66054J983J094l55r14n00MQ4l18j184k203k778k775k731l044l540l965
$$ 266054 268037 269131 268776 267862 267362 267366 267450 267132 265948 263745 260967 258192 255461 252417 248877 244912
54001B44912m213m044l403k872k978l196k694j811j611k103k292j885j636j836
$$ 244912 240699 236655 233252 230380 227402 224206 221512 219701 218090 215987 213695 211810 210174 208338
53987B08338j921j619j273r01k14M46M48R4J47L69l4p21o43o2k61j194j402m70
$$ 208338 206417 204798 203525 202624 202410 202856 203304 203398 203545 203914 203880 203159 202516 202454 202193 200999 199597 199127
53969A99127L16J20m21o84p82n74K99J088O31l98o7J670K660J894P21J59m67j256
$$ 199127 199443 199563 199142 198458 197676 197102 197401 198489 199120 198722 198655 200325 202985 204879 205600 205759 205292 204036
53951B04036p62J283K770K358J608K184L122K854K066K262L028L003K413K448
$$ 204036 203274 204557 207327 209685 211293 213477 216599 219453 221519 223781 226809 229812 232225 234673
53937B34673L008L178L164L924N383O692P704Q677R144Q615P881Q113R010R154
$$ 234673 237681 240859 244023 247947 253330 260022 267726 276403 285547 294162 302043 310156 319166 328320
53923C28320P817N334K268o88k508k763k232j632m87J698L886M491L386J752L86
$$ 328320 336137 341471 343739 343051 340543 337780 335548 333916 333429 335127 339013 343504 346890 348642 349028
53908C49028o55j217j065n01n2K49N29N66K23j25l03p60j579j973j491r21j102
$$ 349028 348373 347156 346091 345590 345538 345787 346316 346882 347105 346980 346677 345917 344338 342365 340874 339953 338851
53891C38851j729k210k734l501l809l045j808r61l48M87J255J681K496M414O953
$$ 338851 337122 334912 332178 328677 324868 321823 320015 319054 318706 319193 320448 322129 324625 329039 335992
53876C35992R379J1749J3649J2965P866m24q439j3765j6308j6904j6320j5347
$$ 335992 345371 357120 370769 383734 391600 391176 382737 368972 352664 335760 319440 304093
53864C04093j4308j2526r525o386m646m206l783l128l158l969m380l734k806k496
$$ 304093 289785 277259 267734 261348 256702 252496 248713 245585 242427 238458 234078 230344 227538 225042
53850B25042k764l131l285k925j929q60m83o61n63j1L17J38P3N64J111J073O04
$$ 225042 222278 219147 215862 212937 211008 210148 209665 209004 208441 208430 208747 208885 208958 209522 210633 211706 212310
53833B12310L81P19J261J414R31J50l91n84p84j224j753k169k343j980r90j27
$$ 212310 212691 213410 214671 216085 217016 217166 216775 216191 215407 214183 212430 210261 207918 205938 204948 204821
53817B04821l41j242j314j32Q38M33m59m33K54M38J73N87J906L136L600L623L621
$$ 204821 204480 203238 201924 201792 202630 203063 202604 202171 202425 202863 203036 203623 205529 208665 212265 215888 219509
53800B19509L535L238K783K237J834K016K721L085K534J786J810K288K128J242
$$ 219509 223044 226282 229065 231302 233136 235152 237873 240958 243492 245278 247088 249376 251504 252746
53786B52746P06J209K226K814K486J331j05j015j011n88n23r72j533j874j940
$$ 252746 253452 254661 256887 259701 262187 263518 263413 262398 261387 260799 260276 259304 257771 255897 253957
53771B53957j816j821k281k943l111k732k554k783k537j277O3L35k44p56j077
$$ 253957 252141 250320 248039 245096 241985 239253 236699 233916 231379 230102 230165 230500 230256 229500 228423
53756B28423j646k300k583k745l331m038m015l148k138j500j215j162j181j002
$$ 228423 226777 224477 221894 219149 215818 211780 207765 204617 202479 200979 199764 198602 197421 196419
53742A96419p00o58o67J39J673K311J019q22j171j86K86l62q38k02Q16J078M40
$$ 196419 195719 195061 194394 194533 196206 198517 199536 198714 197543 197357 197643 197281 196443 196241 197057 198135 198575
53725A98575m29p77j46J143J873J113m95j382q80L17J338J839J679P84m57j345
$$ 198575 198146 197369 197223 198366 200239 201352 200857 199475 198595 198912 200250 202089 203768 204552 204095 202750
53709B02750j488q94K70J493J959J410O77N70Q03O53K83L84R95J532J749J756
$$ 202750 201262 200368 200638 202131 204090 205500 206177 206747 207550 208203 208486 208870 209865 211397 213146 214902
53693B14902J442P63K29K92N86N61M01M77M54J9j55O48J689J583L49o08m68J98
$$ 214902 216344 217107 217336 217628 218214 218775 219176 219653 220107 220126 219971 220619 222308 223891 224240 223632 223164 223362
53675B23362N67M39J6l48k13L82O64J44n84p69o47o69m21M96J245Q20k12n57l35
$$ 223362 223929 224368 224384 224036 223823 224205 224869 225013 224429 223660 223013 222344 221923 222419 223664 224484 224272 223715 223380
53656B23380p14j686j981j200l62j56j32J28L79N69J038J600J563Q54J17m09j082
$$ 223380 222666 220980 218999 217799 217437 217281 217149 217277 217656 218225 219263 220863 222426 223280 223397 222988 221906
53639B21906j847k132j835j348p10K22Q87N78j94k27M49O26l4m51J00J003J503
$$ 221906 220059 217927 216092 214744 214034 214256 215143 215721 215527 215300 215749 216375 216341 215890 215990 216993 218496
53622B18496J636J587J244P98P75J121J168P72N56Q65J351J727K017K038J651
$$ 218496 220132 221719 222963 223761 224536 225657 226825 227597 228153 229018 230369 232096 234113 236151 237802
53607B37802J427J956K676K579J967K093L007L322K402J230P72Q94J242J854K349
$$ 237802 239229 241185 243861 246440 248407 250500 253507 256829 259231 260461 261233 262127 263369 265223 267572
53592B67572J937P46n8j3N2l42m63K21J036J220J048J000Q40K32n37j115j596
$$ 267572 269509 270255 270197 270184 270236 269894 269431 269652 270688 271908 272956 273956 274796 275028 274491 273376 271780
53575B71780k019k084j778j521j376r98n67o92j159r55J31J105J367J475J780
$$ 271780 269761 267677 265899 264378 263002 262004 261437 260745 259586 258631 258762 259867 261234 262709 264489
53560B64489J693J024Q00J736L013L453L040K394J626O50j05k85l35p95j374j508
$$ 264489 266182 267206 268006 269742 272755 276208 279248 281642 283268 283918 283813 283528 283193 282398 281024 279516
53544B79516j334j388j705j875j653j096l69J98K79Pq8K16P53J538K764M079M706
$$ 279516 278182 276794 275089 273214 271561 270465 270096 270294 270573 270580 270492 270708 271461 272999 275763 279842 284548
53527B84548M524M284M520M965N266N435N454N191M991N440O380O967O948O939
$$ 284548 289072 293356 297876 302841 308107 313542 318996 324187 329178 334618 340998 347965 354913 361852
53513C61852P253P426P249P267P827Q522R027R676J0746J1935J2915J3698J4227
$$ 361852 369105 376531 383780 391047 398874 407396 416423 426099 436845 448780 461695 475393 489620
53500D89620J4294J4032J3775J3365J2466J1548J1542J2431J3243J3464J3421
$$ 489620 503914 517946 531721 545086 557552 569100 580642 593073 606316 619780 633201
53489F33201J3234J2636J1912J1769J2115J2295J2445J3192J3980J3507J2036
$$ 633201 646435 659071 670983 682752 694867 707162 719607 732799 746779 760286 772322
53478G72322J1361J1935J2057J0692R164Q942R479R493Q926Q321P558O454N526
$$ 772322 783683 795618 807675 818367 827531 836473 845952 855445 864371 872692 880250 886704 892230
53465H92230M987M086K428Q30j80j450l701o122p647q522r367r861r659r565j0375
$$ 892230 897217 901303 903731 904561 904381 902931 899230 893108 885461 876939 867572 857711 848052 838487 828112
53450H28112j1484j1959j2109j2681j3334j3380j3184j3521j4163j4369j4150
$$ 828112 816628 804669 792560 779879 766545 753165 739981 726460 712297 697928 683778
53439F83778j3813j3044j1697j0713j0881j1326j0646q972p530o685n858m920
$$ 683778 669965 656921 645224 634511 623630 612304 601658 592686 585156 578471 572613 567693
53427E67693m242l668k769j860j462j102J22J934L120L292L249L668M496N582
$$ 567693 563451 559783 557014 555154 553692 552590 552712 554646 557766 561058 564307 567975 572471 578053
53413E78053O877Q038Q709R203J0115J1376J2401J3039J3696J4679J5987J7518
$$ 578053 584930 592968 601677 610880 620995 632371 644772 657811 671507 686186 702173 719691
53401G19691J8929J9705J9893K0305K1439K2709K3452K4072K5428K7528K9677
$$ 719691 738620 758325 778218 798523 819962 842671 866123 890195 915623 943151 972828
53390I72828L1392L2470L2718L2346L2171L2681L3366L3594L3556L3641L3593
$$ 972828 1004220 1036690 1069408 1101754 1133925 1166606 1199972 1233566 1267122 1300763 1334356
53379A334356L3034L2158L1177K9819K8039K6391K5014K3187K0761J8829J7930
$$ 1334356 1367390 1399548 1430725 1460544 1488583 1514974 1539988 1563175 1583936 1602765 1620695
53368A620695J6759J4021J0512P784N716L095j32l030n687r144j3504j7803k1690
$$ 1620695 1637454 1651475 1661987 1669771 1675487 1678582 1678450 1675420 1669733 1660589 1647085 1629282 1607592
53355A607592k5681k9643l2502l3775l4195l4632l5315l6166l6913l6947l5909
$$ 1607592 1581911 1552268 1519766 1485991 1451796 1417164 1381849 1345683 1308770 1271823 1235914
53344A235914l4392l3223l2341l1279l0324l0023k9961k9209k7861k6917k6759
$$ 1235914 1201522 1168299 1135958 1104679 1074355 1044332 1014371 985162 957301 930384 903625
53333I03625k6806k6550k5902k4718k3049k1637k1058k0619j9186j6876j4725
$$ 903625 876819 850269 824367 799649 776600 754963 733905 713286 694100 677224 662499
53322F62499j2997j1150r302q302q277q387q069p431o450m953l492k941l144l035
$$ 662499 649502 638352 629050 620748 612471 604084 596015 588584 582134 577181 573689 570748 567604 564569
53308E64569k238j383p81M1J287K457L270M040N003O061P319Q956J0509J1252
$$ 564569 562331 560948 560167 560208 561495 563952 567222 571262 576265 582326 589645 598601 609110 620362
53294F20362J1351J1697J2563J3384J3891J4474J5262J5864J6205J6736J7624
$$ 620362 631713 643410 655973 669357 683248 697722 712984 728848 745053 761789 779413
53283G79413J8506J9113J9393J9103J8027J6517J5049J3481J1578R964R419R490
$$ 779413 797919 817032 836425 855528 873555 890072 905121 918602 930180 940144 949563 959053
53271I59053Q948P474N768M115K191J85j228k134l319m820n921o651p960j0055
$$ 959053 968001 975475 981243 985358 987549 987734 986506 984372 981053 976233 970312 963661 955701 945646
53257I45646j1969j3205j4466j6246j7875j8643j8839j9049j9285j9409j9653
$$ 945646 933677 920472 906006 889760 871885 853242 834403 815354 796069 776660 757007
53246G57007k0161k0670k0954k0974k0373j8669j6246j4315j3579j3639j3956
$$ 757007 736846 716176 695222 674248 653875 635206 618960 604645 591066 577427 563471
53235E63471j4598j5654j6710j7294j7330j6925j6177j5266j4198j2595j0381
$$ 563471 548873 533219 516509 499215 481885 464960 448783 433517 419319 406724 396343
53224C96343q445p714p788p424o323n354n065n119n189n229m834l576k137j830
$$ 396343 387898 380184 372396 364972 358649 353295 348230 343111 337922 332693 327859 324283 322146 320316
53210C20316k718l448l269k963l342m023m300m138l777l275k934l182l696l566
$$ 320316 317598 314150 310881 307918 304576 300553 296253 292115 288338 285063 282129 278947 275251 271685
53196B71685k762k288k466k321j223l3K74J8m9j43r03k024k460j753n16K66j3
$$ 271685 268923 266635 264169 261848 260625 260592 260866 260884 260835 260692 259789 257765 255305 253552 253036 253302 253289
53179B53289j129k056j827o50K01j52j290k163k208j623j015q71j018p73mL91
$$ 253289 252160 250104 248277 247627 247828 247676 246386 244223 242015 240392 239377 238506 237488 236715 236711 237102
53163B37102l06j424j869j754j857k014j555r44j222j933j552j77L21o96j607
$$ 237102 236796 235372 233503 231749 229892 227878 226323 225379 224157 222224 220672 220495 220816 220120 218513
53148B18513j251o50q79j186o62j71p78j631j243K4N75J25j74K05N21K52j41j21
$$ 218513 217262 216612 215733 214547 213885 213714 212936 211305 210062 210086 210661 210786 210612 210817 211338 211590 211449 211328
53130B11328K28N66P10O03L59K95N12P07O86O87Q33P29R4o18p08q7O65Q11o5j618
$$ 211328 211556 212122 212832 213435 213794 214089 214601 215308 215994 216681 217514 218243 218337 217719 217011 216924 217589 218400 218335 216717
53110B16717k730k558j630j146j254j024k19K13k08p07o67o01r09r44k63L39R7
$$ 216717 213987 211429 209799 208653 207399 206375 206156 206369 206161 205454 204787 204186 203277 202333 202070 202409 202506
53093B02506l76j40N19P60O16N91M46l04j153j069j9J029J441J425J345J351J505
$$ 202506 202130 201990 202509 203269 203885 204476 204922 204618 203465 202396 202377 203406 204847 206272 207617 208968 210473
53076B10473J629J284M23k85l46k34o20j351j836j958j916j569p42J62O05O30
$$ 210473 212102 213386 213809 213524 213178 212944 212324 210973 209137 207179 205263 203694 202952 203114 203719 204349
53060B04349N21J57o23j387j589j358j217j265j180q31l81n3r5n68r71o52J68
$$ 204349 204870 205027 204404 203017 201428 200070 198853 197588 196408 195577 195196 195143 195048 194480 193509 192857 193025
53043A93025N24J81k1K59Q7j127k302k035n04R75J584J269J41j290j949j378n51
$$ 193025 193549 193730 193709 193968 194055 192928 190626 188591 188087 189062 190646 191915 192056 190766 188817 187439 186888
53026A86888n15q52o12p6k27r23j054l36L85N95O65R04J077R84O87J88l96n86
$$ 186888 186373 185521 184909 184833 184606 183683 182629 182293 182678 183273 183938 184842 185919 186903 187590 187778 187382 186796
53008A86796j78J58j88o53k91O41J025N43j06m91p98r44n83n2j09n98n20L82J149
$$ 186796 186618 186776 186588 185935 185644 186285 187310 187853 187747 187256 186458 185514 184931 184879 184770 184172 183652 184034 185183
52989A85183J079O06K79r8q04j405j279m16P80J976K818K820J847M92l85l95J58
$$ 185183 186262 186868 187147 187049 186245 184840 183561 183145 183925 185901 188719 191539 193386 193878 193493 193098 193256
52972A93256O68P64N73M70N37N26M25N98J061J194N94l08r58j414j787j590n93
$$ 193256 193924 194688 195261 195731 196268 196794 197219 197817 198878 200072 200666 200358 199400 197986 196199 194609 194016
52955A94016K74j4r43j081k28K93l79j452j669q50J71N04j52j314j972j488l79
$$ 194016 194290 194276 193333 192252 192024 192317 191938 190486 188817 187967 188138 188642 188490 187176 185204 183716 183337
52938A83337K90J99l9J8J31pk36k68k3M91J168J656J586J029K93n77j569k178
$$ 183337 183627 183826 183787 183805 183936 183929 183693 183425 183402 183893 185061 186717 188303 189332 189625 189048 187479 185301
52920A85301j832p99M1L68O33J084J345J149Q22O85O03L88J35r2m60r28j109q18
$$ 185301 183469 182670 182711 183079 183712 184796 186141 187290 188112 188797 189400 189788 189923 189831 189371 188443 187334 186516
52902A86516m32l37l68n4P49J669K206K127J640J166Q46M00l64j137j436j240
$$ 186516 186084 185747 185379 185325 186074 187743 189949 192076 193716 194882 195728 196128 195764 194627 193191 191951
52886A91951r20o82m54j95L9K35L53K02k43n80m19M9L04J89j3o9Q3M84J042J314
$$ 191951 191031 190349 189895 189700 189739 189974 190327 190529 190286 189706 189287 189336 189640 189829 189816 189747 189830 190314 191356 192670
52866A92670R47K44j27%J52l3k50O2R91J944K170J564Q62Q40J376J741J670J537
$$ 192670 193617 193861 193734 193734 193886 193853 193603 193665 194656 196600 198770 200334 201196 202036 203412 205153 206823 208360
52848B08360J371N47j163k985m083m440m339l667k406j130k99L83J185J574J098
$$ 208360 209731 210278 209115 206130 202047 197607 193268 189601 187195 186065 185766 186149 187334 188908 190006
52833A90006L75K92O88Q45Q00J087J587J762J810K417L524M468N159N954O391
$$ 190006 190381 190673 191361 192206 193006 194093 195680 197442 199252 201669 205193 209661 214820 220774 227165
52818B27165N331K574o70l209m841n775o041n759n191m334l068j844j324j353
$$ 227165 232496 235070 234400 231191 226350 220575 214534 208775 203584 199250 196182 194338 193014 191661
52804A91661j141o04o04j519k512k623j844p37L19J092J317R99M84mm66p42n73
$$ 191661 190520 189916 189312 187793 185281 182658 180814 180077 180396 181488 182805 183804 184288 184284 183818 183076 182503
52787A82503j47K1j11p2K35K92j85p30p37r9Q92J743J777O59q73j444n34R17J653
$$ 182503 182356 182377 182266 182194 182429 182721 182536 181806 181069 180970 181862 183605 185382 186041 185168 183724 183190 184107 185760
52768A85760J372O84K94M66R20J050N27k76p83r44j019q79k60M13L14n05r87m34
$$ 185760 187132 187816 188110 188576 189496 190546 191073 190797 190014 189070 188051 187172 186912 187325 187639 187134 186147 185713
52750A85713O38J319J333R24K85m57j053j227q67j24M91L90l43o99J18J558K387
$$ 185713 186351 187670 189003 189927 190212 189755 188702 187475 186608 186484 186975 187365 187022 186323 186441 187999 190386
52733A90386K285J908J577R02j92j040j174r14p50p81r48j218j311r35l58r2p
$$ 190386 192671 194579 196156 197058 196866 195826 194652 193738 192988 192207 191259 190041 188730 187795 187437 187345 187338
52716A87338M52J118J166N01N4L27O20K41m54p99q73j093j346j263q83m87q0M85
$$ 187338 187790 188908 190074 190575 190629 190956 191576 191817 191363 190564 189691 188598 187252 185989 185106 184619 184539 185024
52698A85024J127J671J996J838R15m67j353j109r6Q17J093P21M7k92J87J143J588
$$ 185024 186151 187822 189818 191656 192571 192104 190751 189642 189546 190363 191456 192177 192224 191932 192119 193262 194850
52681A94850J042M8o65j035j330j468j163m93R7K82J22o5M9M68Q85J123J390J815
$$ 194850 195892 195940 195275 194240 192910 191442 190279 189786 189883 190165 190287 190222 190271 190739 191624 192747 194137 195952
52663A95952J998J559R01P65J180J527J544J503J414R20R2m58m63l29m53q32j430
$$ 195952 197950 199509 200410 201175 202355 203882 205426 206929 208343 209263 209355 208897 208434 208105 207652 206820 205390
52646B05390k174k543j965p74J2N2J8L76P65Q92J111J680K202K328K296K247J736
$$ 205390 203216 200673 198708 197934 197946 197998 198016 198392 199157 200049 201160 202840 205042 207370 209666 211913 213649
52629B13649M19j264k564l133k920j945n76M41O68L42j07n15p92q16o89o55o60
$$ 213649 214068 212804 210240 207107 204187 202242 201666 202107 202775 203117 203010 202495 201703 200887 200198 199543 198883
52612A98883n03l45m87o70m19j1j90q63j061l80N13J015J204J108M94k95l70L64
$$ 198883 198380 198035 197548 196878 196459 196448 196258 195395 194334 193954 194467 195482 196686 197794 198288 197993 197623 197987
52594A97987R12O85K73K68L96L52L92N26K32l75k46R62K061K042J469J263J174
$$ 197987 198899 199584 199857 200125 200521 200873 201265 201791 202023 201648 201402 202364 204425 206467 207936 209199 210373
52577B10373O25P7K71Q34R49P20O53M26n57j806k252j811j233p10J58J097J152
$$ 210373 210998 211075 211346 212180 213129 213849 214502 214928 214371 212565 210313 208502 207269 206559 206717 207814 208966
52560B08966Q2j130j528j117m96o3J97N45J135J602J283R4j176j732j550r32L9
$$ 208966 209048 207918 206390 205273 204777 204714 204911 205456 206591 208193 209476 209570 208394 206662 205112 204180 204219
52543B04219J096J533R91K5p20j269j706j521m53O90R74O65O31R23R83Q22R12
$$ 204219 205315 206848 207839 207864 207144 205875 204169 202648 202195 202885 203859 204524 205155 206078 207061 207883 208795
52526B08795J107Q07N7m60n16n17n79l35K72P73Q45O41L68J52K12O43J110J241
$$ 208795 209902 210709 210766 210306 209790 209273 208694 208359 208631 209404 210249 210890 211258 211410 211622 212265 213375 214616
52508B14616J138R81M66o20j599j551o62o4k20m01P1P68P82p6j092j475j154p39
$$ 214616 215754 216735 217201 216581 214982 213431 212769 212705 212485 212084 212155 212923 213705 213629 212537 211062 209908 209169
52490B09169p44q82m04Q17J991K388K130J691J214P00M01M60N67M92N36R32J319
$$ 209169 208425 207543 207139 207956 209947 212335 214465 216156 217370 218070 218471 218931 219498 219990 220526 221458 222777
52473B22777J310J166J296J504J433J257J258J099K83r80k013k489k370j568l71
$$ 222777 224087 225253 226549 228053 229486 230743 232001 233100 233383 232403 230390 227901 225531 223963 223592
52458B23592K57l02j321j581r75l80j96m7K46L43J14q8n2L9l6l76j026j736j855
$$ 223592 223849 223547 222226 220645 219670 219290 219094 219047 219293 219636 219750 219662 219610 219649 219613 219237 218211 216475 214620
52439B14620j063O8P69R88J057R42N70M26Q68J212O03n31r65n22k57p25j211r61
$$ 214620 213557 213625 214394 215382 216439 217381 217951 218377 219245 220457 221060 220529 219564 219042 218785 218060 216849 215888
52421B15888j63N69R32Q73M78K13N75J308J608J301J207K018L415M574N101N262
$$ 215888 215725 216294 217226 218099 218577 218790 219365 220673 222281 223582 224789 226807 230222 234796 239897 245159
52405B45159N636O677Q164Q983P858M555J23l970o800q113q066o964n158l149
$$ 245159 250795 257472 265636 274619 282477 287032 287155 283185 276385 268272 260206 253242 248084 244935
52391B44935j690j344j824k266k321k371k419j718r6J259J334Q11R80J752K013
$$ 244935 243245 241901 240077 237811 235490 233119 230700 228982 228886 230145 231479 232290 233270 235022 237035
52376B37035J556J211J204Q23j35q34p31l33k32k37K1L29K81o0l29l95m37o38
$$ 237035 238591 239802 241006 241829 241694 240860 240129 239796 239564 239327 239348 239677 239958 239898 239569 239174 238737 238099
52358B38099q50n99L66J474J768J239R70J512J935J306K96J05N29M19k89m92K42
$$ 238099 237249 236650 237016 238490 240258 241497 242467 243979 245914 247220 247516 247621 248150 248569 248280 247788 248030
52341B48030J135J595J888K180K111J683J550K066K794L210L169K629J743J235
$$ 248030 249165 250760 252648 254828 256939 258622 260172 262238 265032 268242 271411 274040 275783 277018
52327B77018J760K844L319K829K038J423R67R03J542K257J989R93P82J938L255
$$ 277018 278778 281622 284941 287770 289808 291231 292198 293101 294643 296900 298889 299882 300664 302602 305857
52312C05857L533L009K453K013J649J762K569L627M529N337N914N711M735L806
$$ 305857 309390 312399 314852 316865 318514 320276 322845 326472 331001 336338 342252 347963 352698 356504
52298C56504L347K807J888J279J468J719J170J76l34k20J4J85M43P19Q64R73R91
$$ 356504 359851 362658 364546 365825 367293 369012 370182 370358 370024 369804 369818 370003 370446 371165 372029 373002 373993
52281C73993N13l88o95M04K299L689M123M112M033L810L526L497L700L746L509
$$ 373993 374506 374118 373423 373827 376126 379815 383938 388050 392083 395893 399419 402916 406616 410362 413871
52266D13871L243L056K736K216J829J919K404K859K922K574K066J629J339J222
$$ 413871 417114 420170 422906 425122 426951 428870 431274 434133 437055 439629 441695 443324 444663 445885
52252D45885J301J398J194P41O59J343K296K681K390J946J557J010M28L23P63
$$ 445885 447186 448584 449778 450519 451178 452521 454817 457498 459888 461834 463391 464401 464829 465152 465915
52237D65915J183J246J279J637K155K507K629K629K672L031L858M831N449N638
$$ 465915 467098 468344 469623 471260 473415 475922 478551 481180 483852 486883 490741 495572 501021 506659
52223E06659N664N569N298N177N586O204O352O034N891O165O491O707O969P045
$$ 506659 512323 517892 523190 528367 533953 540157 546509 552543 558434 564599 571090 577797 584766 591811
52209E91811O429N339M629M530M321L577K834K722L171L749M098L865K934J910
$$ 591811 598240 603579 608208 612738 617059 620636 623470 626192 629363 633112 637210 641075 644009 645919
52195F45919J563J662J288L88n8L11O48L61Q3N30J370J868J924J815J606J378
$$ 645919 647482 649144 650432 650820 650762 651073 651721 652082 652165 652695 654065 655933 657857 659672 661278 662656
52179F62656J388J603J654J516J465J169p3j879k707j846m20K45K17J66J08j45
$$ 662656 664044 665647 667301 668817 670282 671451 671378 669499 666792 664946 664526 664771 664988 665154 665262 665117
52163F65117j73L10O25R7p14p23J72J169J772K094K249K240K189K167J972J547
$$ 665117 664944 665254 665879 665976 665262 664539 664711 665880 667652 669746 671995 674235 676424 678591 680563 682110
52147F82110J177R69N82j21p10q55p71o44k89K12K76k85q09p14j58N58J420K119
$$ 682110 683287 684256 684838 684717 684007 683152 682381 681737 681448 681660 681936 681651 680842 680128 679970 680528 681948 684067
52129F84067K033J365J316K401L581L801L385L029K524J553P74Q72J292J057K90
$$ 684067 686100 687465 688781 691182 694763 698564 701949 704978 707502 709055 709829 710701 711993 713050 713340
52114G13340l03p68j546k327k531k573l369m839o033o513o573o347n709m889m235
$$ 713340 713037 712269 710723 708396 705865 703292 699923 695084 689051 682538 675965 669618 663909 659020 654785
52099F54785l506k275p51N69J766L112M214M510M311M355M626M613M430M553M645
$$ 654785 651279 649004 648253 648822 650588 653700 657914 662424 666735 671090 675716 680329 684759 689312 693957
52084F93957L816K087M96k63l91j45M83J104R39j19j146j197j86J369K912M034
$$ 693957 697773 699860 700356 700093 699702 699557 700040 701144 702083 701964 700818 699621 699435 700804 703716 707750
52068G07750M497M350L779K963K150J641J425J181Q94J010J596J953J538P44J92
$$ 707750 712247 716597 720376 723339 725489 727130 728555 729736 730630 731640 733236 735189 736727 737471 737663
52053G37663j12l57l03K17P37Q84J032J490J682J015j06j041k063l572m824m735
$$ 737663 737551 737194 736891 737108 737845 738729 739761 741251 742933 743948 743842 742801 740738 737166 732342 727607
52037G27607l650k964l202l691l943m137m240l851l029k276j553k60J710L625
$$ 727607 723957 720993 717791 714100 710157 706020 701780 697929 694900 692624 691071 690811 692521 696146
52023F96146M807N174M996M627M355M009L083J770J207J837K340J329n80j760
$$ 696146 700953 706127 711123 715750 720105 724114 727197 728967 730174 732011 734351 735680 735100 733340
52009G33340k031k529l478l912l608l551m168m754m945n358o224o808o829p153
$$ 733340 731309 728780 725302 721390 717782 714231 710063 705309 700364 695006 688782 681974 675145 667992
51995F67992q430j0128j1594j3011j4583j5732j6005j5888j6000j5983j5067j3232
$$ 667992 659562 649434 637840 624829 610246 594514 578509 562621 546621 530638 515571 502339
51983E02339j1161r342p770o240m572k710r70J71N79N34K20m51j433k513l650
$$ 502339 491178 481836 474066 467826 463254 460544 459574 459745 460324 460858 461078 460627 459194 456681 453031
51968D53031m881n834n832m731l182j999j560j766k226k449k222j636o56R04K683
$$ 453031 448150 442316 436484 431753 428571 426572 425012 423246 421020 418571 416349 414713 414057 414961 417644
51953D17644L713L687L529L977M365L903L351L964N299N758N021M301M165L880
$$ 417644 421357 425044 428573 432550 436915 440818 444169 448133 453432 459190 464211 468512 472677 476557
51939D76557L143K719K889K745J734N19l76j495l241m914n770o079o322o300n828
$$ 476557 479700 482419 485308 488053 489787 490306 489930 488435 485194 480280 474510 468431 462109 455809 449981
51924D49981n403n342m978l586j540K25J382K136K486K279J582M92j099l079m803
$$ 449981 444578 439236 434258 430672 429132 429357 430739 432875 435361 437640 439222 439714 438615 435536 430733
51909D30733n727o000o144o397o640o594n893m467k882j909j596j308o71J53J080
$$ 430733 425006 419006 412862 406465 399825 393231 387338 382871 379989 378080 376484 375176 374505 374658 375738
51894C75738K267L639N061O936R745J3029J5733J7672J9504K1253K2162K2352
$$ 375738 378005 381644 386705 393641 403386 416415 432148 449820 469324 490577 512739 535091
51882E35091K3192K5497K8577L1722L5196L8802M0521L7740K9297J5807r28j7866
$$ 535091 558283 583780 612357 644079 679275 718077 758598 796338 825635 841442 840514 822648
51870H22648l1192l8448m0206l8927l6510l3525l0092k6471k2969j9887j7446
$$ 822648 791456 753008 712802 673875 637365 603840 573748 547277 524308 504421 486975
51859D86975j5477j3686j2401j2309j3119j3415j2426j0979j0089r521q634p635
$$ 486975 471498 457812 445411 433102 419983 406568 394142 383163 373074 363553 354919 347284
51847C47284o916n938m048j808l62K42R34K127L325M020M078L436K290J344J143
$$ 347284 340368 334430 330382 328574 328212 328454 329388 331515 334840 338860 342938 346374 348664 350008 351151
51832C51151J299J193J091J633K571K986K628K016J287O9j443k329k235j966k348
$$ 351151 352450 353643 354734 356367 358938 361924 364552 366568 367855 367924 366481 364152 361917 359951 357603
51817C57603l156l631l548l218k806k153j220l20K05L78M81N98M54n9m49j01Q27
$$ 357603 354447 350816 347268 344050 341244 339091 337871 337551 337756 338134 338615 339213 339667 339608 339159 339058 339885
51800C39885J511J516J236J098R24L70m34j103j494j684j711j662j667j566r17
$$ 339885 341396 342912 344148 345246 346170 346540 346106 345003 343509 341825 340114 338452 336785 335219 334302
51785C34302L57J685K453K655K706K923L328L578L012J273j076k980m069m778
$$ 334302 334659 336344 338797 341452 344158 347081 350409 353987 356999 358272 357196 354216 350147 345369
51771C45369n261n042m005k902k384k273k183k184k263j921q98K19P52P65O32
$$ 345369 340108 335066 331061 328159 325775 323502 321319 319135 316872 314951 314053 314272 315024 315789 316421
51756C16421L99O4j5L07N70L86L3j53l80q67j219j043n65j26M14J196J846K125
$$ 316421 316820 316884 316869 317176 317746 318132 318165 318012 317632 316765 315546 314503 313938 313812 314226 315422 317268 319393
51738C19393K433L046L445L154K608K373K118J262P6o56o61l2J384L443N062N151
$$ 319393 321826 324872 328317 331471 334079 336452 338570 339832 339908 339252 338591 338559 339943 343386 348448 353599
51722C53599M008K880K451K531K889L444L933M285N062O643Q246Q616P464N302
$$ 353599 357607 360487 362938 365469 368358 371802 375735 380020 385082 391725 399971 408587 416051 421353
51708D21353K294j583n425p644p588o068m116j988M45K922M589M417K036j433
$$ 421353 423647 422064 416639 408995 401407 395339 391223 389235 389680 392602 397191 401608 403644 402211
51694D02211l976m653m482m805n522n906o239p295q653r092q448p684p163o245
$$ 402211 398235 393582 389100 384295 378773 372867 366628 359333 350680 341588 333140 325456 318293 312048
51680C12048m771l508k814k070q70K89R37J289J599J780K009K843M339N804O801
$$ 312048 307277 303769 300955 298885 298015 298304 299241 300530 302129 303909 305918 308761 313100 318904 325705
51665C25705P542P996P503N722L248Q64j156k692l496l644l618l500k808j438
$$ 325705 333247 341243 348746 354468 357716 358580 357424 354732 351236 347592 343974 340474 337666 336228
51651C36228r0P02J328K321L412L783K893P42k131m637n729n444m834m583m252
$$ 336228 336138 336840 338168 340489 343901 347684 350577 351319 349188 344551 338822 333378 328544 323961 319709
51636C19709l229j731m15M26P77N34j49o80o84m93m99m41lM05J61n00p30l27j6
$$ 319709 316480 314749 314334 314760 315537 316071 315922 315242 314558 314065 313566 313125 313122 313527 313688 313188 312458 312131 312115
51617C12115l80j094j393r57j01O94J191J534K093L050M145M866M975M685M349
$$ 312115 311735 310641 309248 308291 308190 308884 310075 311609 313702 316752 320897 325763 330738 335423 339772
51602C39772M032L618L223L360M489O475Q646J0242J0630R285O136K160r08j980
$$ 339772 343804 347422 350645 354005 358494 364969 373615 383857 394487 403772 409908 412068 411160 409180
51588D09180j497n71N34K586O068J0173J3311J4467J4018J3285J3254J3704J3539
$$ 409180 407683 407112 407646 410232 416300 426473 439784 454251 468269 481554 494808 508512 522051
51575E22051J1886Q600M048r22m753n799l698L70N208J0769J7369K4318L0067
$$ 522051 533937 542537 546585 545663 540910 535111 531413 531783 536991 547760 565129 589447 619514
51562F19514L3458L4275L3040L0815K8725K6884K4118J9407J3321P186J267n335
$$ 619514 652972 687247 720287 751102 779827 806711 830829 850236 863557 870743 872010 866675
51550H66675j3062k1108k8207l3542l6899l8596l9203l8836l6933l3321k9075
$$ 866675 853613 832505 804298 770756 733857 695261 656058 617222 580289 546968 517893
51539E17893k5483k2461j9019j5042j1586r403q196p409o776o003m873l820l526
$$ 517893 492410 469949 450930 435888 424302 414899 406703 399294 392518 386515 381642 377822 374296
51526C74296l808l774l174k679k663k660k330k004j940j869j593j302j042o18
$$ 374296 370488 366714 363540 360861 358198 355538 353208 351204 349264 347395 345802 344500 343458 342840
51512C42840j68j01k44J2O05P83M17K69O10P23J86l89n80j000k089l064k933j932
$$ 342840 342672 342571 342327 342339 342944 343727 344144 344413 345023 345746 345932 345543 344963 343963 341874 338810 335877 333945
51494C33945j060p79r00j221j541j532j253j265j646j573n39O30R02N65O61J356
$$ 333945 332885 332106 331206 329985 328444 326912 325659 324394 322748 321175 320636 321266 322168 322733 323394 324750
51478C24750J915K056K259K705K791J978N26q45j687k127k631l400l911l376j878
$$ 324750 326665 328721 330980 333685 336476 338454 338980 338135 336448 334321 331690 328290 324379 321003 319125
51463C19125n48k50n67m99K30J168K022K811L430L767M244N549P786J0252J2047
$$ 319125 318577 318327 317760 317261 317491 318659 320681 323492 326922 330689 334933 340482 348268 358520 370567
51448C70567J2503J1202Q176M219O87j225j016R12L244M304L106N0l613o703q494
$$ 370567 383070 394272 402448 406667 407354 406129 405113 406025 409269 413573 416679 416729 413116 406413 397919
51433C97919q660p561o248n556n192m213k438p71K8L39J066K332L168K598O89
$$ 397919 389259 381698 375450 369894 364702 360489 358051 357280 357308 357647 358713 361045 364213 366811 367500
51418C67500j517l028l619l674l601l637l863m095l886l054k018j306q31j42P45
$$ 367500 365983 362955 359336 355662 352061 348424 344561 340466 336580 333526 331508 330202 329371 329229 329974
51403C29974J372J655J993K536K975L259L842M926O054O830P484Q368R455J0721
$$ 329974 331346 333001 334994 337530 340505 343764 347606 352532 358586 365416 372900 381268 390723 401444
51389D01444J2548J5238J8526K1945K5322K8645L1854L5147L9002M3444M7676
$$ 401444 413992 429230 447756 469701 495023 523668 555522 590669 629671 673115 720791
51378G20791N0771N2246N1617M8113M1533L2899K3459J3364K117r885k1161l0520
$$ 720791 771562 823808 875425 923538 965071 997970 1021429 1034793 1036910 1027025 1005864 975344
51366I75344l7966m3970m8483n1014n1362m9964m7526m4423m0609l6135l1564
$$ 975344 937378 893408 844925 793911 742549 692585 645059 600636 560027 523892 492328
51355D92328k7522k3968k0426j6961j4269j2574j1062q909o354m197k771j946
$$ 492328 464806 440838 420412 403451 389182 376608 365546 356637 350283 346086 343315 341369
51343C41369j748k198k767k683j754m40P94J701K049J678Q28n3p50j232j351j030
$$ 341369 339621 337423 334656 331973 330219 329779 330573 332274 334323 336001 336829 336776 336026 334794 333443 332413
51327C32413n71l15j06M24J129J395R62K30l31o65r00j033j035j057j284j633
$$ 332413 331842 331527 331421 331845 332974 334369 335331 335561 335230 334565 333665 332632 331597 330540 329256 327623
51311C27623j777j567j305j499k150k598k331j748j619j927j942j425r50q06m52
$$ 327623 325846 324279 322974 321475 319325 316727 314396 312648 311029 309102 307160 305735 304785 303979 303527
51296C03527L66Q37K03q85j072RJ548K815L722M234M215M079M748O529Q437R013
$$ 303527 303893 304730 304933 304048 302976 302985 304533 307348 311070 315304 319519 323598 328346 334875 343312 352325
51280C52325P628M846J823m82j775k412k929l543m025l928k937j282R9K23q57
$$ 352325 359953 364799 366622 366140 364365 361953 359024 355481 351456 347528 344591 343309 343408 343631 342774
51265C42774j894j744n72N74J006P80J10q62j727j908j338o42m21o44q98r63q96
$$ 342774 340880 339136 338564 339138 340144 340924 341034 340172 338445 336537 335199 334557 334136 333492 332594 331631 330735
51248C30735o93k43L75P81P27N03O23J065J234Q85N98Q49J081M31q28j509j206
$$ 330735 330042 329799 330174 330955 331682 332185 332808 333873 335107 335992 336590 337439 338520 338951 338123 336614 335408
51231C35408q01r98j341j122m60K14J007K121L042L061K394J967K286K975L391
$$ 335408 334607 333609 332268 331146 330686 330900 331907 334028 337070 340131 342525 344492 346778 349753 353144
51216C53144L180K356J278M48mm49j096j581j476r47m20m4K38L99N15P52Q46J15
$$ 353144 356324 358680 359958 360406 360402 359953 358857 357276 355800 354853 354433 354389 354627 355026 355541 356293 357139 357254
51198C57254j422k531k103m96J099K179K935L278K932K338K438L418M517N101
$$ 357254 355832 353301 351198 350702 351801 353980 356915 360193 363125 365463 367901 371319 375836 380937
51184C80937N220N027M403L329J992M37j396l170m290m685m904n332n731n711
$$ 380937 386157 391184 395587 398916 400908 401345 399949 396779 392489 387804 382900 377568 371837 366126
51170C66126n219m426l515k627j764q29j7Q6p80j943k415j993j233n17K25R66
$$ 366126 360907 356481 352966 350339 348575 347746 347729 347815 347035 345092 342677 340684 339451 338934 339159 340125
51154C40125J387J350J071Q13P36R88J461J616J110M11K80O58P56K06n08q41q73
$$ 340125 341512 342862 343933 344746 345482 346470 347931 349547 350657 351068 351348 352006 352762 352968 352460 351619 350746
51137C50746r74j295j684j783j175K37K012L561M642N188N030M272L609L549L633
$$ 350746 349772 348477 346793 345010 343835 344072 346084 349645 354287 359475 364505 368777 372386 375935 379568
51122C79568K992J601J85r21k025l208l995m057l615l045k583k411k472k300j627
$$ 379568 382560 384161 384346 383425 381400 378192 374197 370140 366525 363480 360897 358486 356014 353714 352087
51107C52087j023j189j788j808j060m24m94q75j031r66p73k87M23R03R51R21J142
$$ 352087 351064 349875 348087 346279 345219 344795 344301 343426 342395 341429 340656 340369 340792 341695 342646 343567 344709
51090C44709J570K182L082L953M087L193J757L74p51j503j711j427r09k35N46
$$ 344709 346279 348461 351543 355496 359583 362776 364533 364907 364156 362653 360942 359515 358606 358371 358917
51075C58917R61O39J82N91J715K289J769J042R54J176J146J070J239J253Q43P04
$$ 358917 359878 360517 360699 361290 363005 365294 367063 368105 369059 370235 371381 372451 373690 374943 375786 376490
51059C76490J614L115L991L698K662J454N10L71J479L633O098Q145R304R502R329
$$ 376490 378104 381219 385210 388908 391570 393024 393534 393905 395384 399017 405115 413260 422564 432066 441395
51044D41395R752J0996J2019J1610R741P415N437L897K638J577N90n73k148m253
$$ 441395 451147 462143 474162 485772 495513 502928 508365 512262 514900 516477 517067 516494 514346 510093
51030E10093o742q963j0056r777q821q041p563o891n583l597j307O13J577J667
$$ 510093 503351 494388 484332 474555 465734 457693 450130 443239 437656 434059 432752 433365 434942 436609
51016D36609J549J713K115K651L425M339M974N269N716O540P202P168O654O140
$$ 436609 438158 439871 441986 444637 448062 452401 457375 462644 468360 474900 482102 489270 495924 502064
51002E02064N635M990M474M451M820N294N933O866P853Q572R059R358R192Q514
$$ 502064 507699 512689 517163 521614 526434 531728 537661 544527 552380 560952 570011 579369 588561 597075
50988E97075P933P953Q235Q223Q094Q203P966O242K777j554n873r810j2926j4613
$$ 597075 605008 612961 621196 629419 637513 645716 653682 659924 662701 661147 655274 645464 632538 617925
50974F17925j4853j4411j3955j3442j2516j1019q950o435l949k045p17N72K105
$$ 617925 603072 588661 574706 561264 548748 537729 528779 522344 518395 516350 515633 516205 518310
50961E18310L648N076O715Q732J0637J1769J2052J2080J2652J4337J7142K0356
$$ 518310 521958 527034 533749 542481 553118 564887 576939 589019 601671 616008 633150 653506
50949F53506K3013K4825K6436K8672L1705L4986L7446L7571L3953K6555J7370
$$ 653506 676519 701344 727780 756452 788157 823143 860589 898160 932113 958668 976038
50938I76038R122L134j202m938q199j0605j2382j4275j6490j8399j9513k0215
$$ 976038 985160 988294 987092 982154 973955 963350 950968 936693 920203 901804 882291 862076
50926H62076k1192k2494k3618k4214k4307k3911k2949k1595k0212j8858j7225
$$ 862076 840884 818390 794772 770558 746251 722340 699391 677796 657584 638726 621501
50915F21501j5242j3332j1836j0504q858o928n273m362m102m022l754l328k956
$$ 621501 606259 592927 581091 570587 561729 554801 549528 545166 541064 537042 533288 529960 527004
50902E27004k650k192j559j099j081j255j218r62p55n78k07K18K99Q2P3M33P60
$$ 527004 524354 522162 520603 519504 518423 517168 515950 514988 514233 513655 513448 513666 513965 514047 514120 514553 515313
50885E15313P94P83Q75P49K56j49l0L83N71M75M11N70R80J664K471K988K975K659
$$ 515313 516107 516890 517765 518514 518770 518621 518591 518974 519545 520020 520431 521001 521981 523645 526116 529104 532079 534738
50867E34738K365K127J971K120K613L055L244L641M661N881O544O642O827P399
$$ 534738 537103 539230 541201 543321 545934 548989 552233 555874 560535 566416 572960 579602 586429 593828
50853E93828Q011Q414Q902R802J1030J2306J3524J4753J6031J7281J8294J8883
$$ 593828 601839 610253 619155 628957 639987 652293 665817 680570 696601 713882 732176 751059
50841G51059J9114J9304J9750K0605K2074K4372K7288L0217L2905L5744L8961
$$ 751059 770173 789477 809227 829832 851906 876278 903566 933783 966688 1002432 1041393
50830A041393M2040M4476M6640M9135N1513N2532N1578M9149M5822M1476L5744
$$ 1041393 1083433 1127909 1174549 1223684 1275197 1327729 1379307 1428456 1474278 1515754 1551498
50819A551498K8551K0035J0504P35q210j5912k2815k9257l4699l8419m0546m1775
$$ 1551498 1580049 1600084 1610588 1611323 1603113 1587201 1564386 1535129 1500430 1462011 1421465 1379690
50807A379690m2283m1657l9825l7418l4961l2251k8952k5391k2139j9116j5739
$$ 1379690 1337407 1295750 1255925 1218507 1183546 1151295 1122343 1096952 1074813 1055697 1039958
50796A039958j1958q436n460k448R96M102N852O457P003P736P711O276M038J928
$$ 1039958 1028000 1019564 1014104 1011656 1012652 1016754 1022606 1029063 1036066 1043802 1051513 1057789 1061827 1063755
50782A063755J51j479k824l755m666o015p662r237j0838j2787j4979j7027j8860
$$ 1063755 1063906 1062427 1059603 1055848 1051182 1045167 1037505 1028268 1017430 1004643 989664 972637 953777
50769I53777k0577k1955k2682k2872k2835k2441k1382j9839j8343j6957j5334
$$ 953777 933200 911245 888563 865691 842856 820415 799033 779194 760851 743894 728560
50758G28560j3450j1696j0147q441o489m637k977j150Q61K375K928L040L583M720
$$ 728560 715110 703414 693267 684826 678337 673700 670723 669573 670434 672809 675737 678777 682360 687080
50744F87080N946O893P647Q325Q885R341R826J0375J0892J1421J2131J2962J3474
$$ 687080 693026 699919 707566 715891 724776 734117 743943 754318 765210 776631 788762 801724 815198
50731H15198J3338J2854J2766J3461J4496J4957J4242J2482J0356Q633P729P458
$$ 815198 828536 841390 854156 867617 882113 897070 911312 923794 934150 942783 950512 957970
50719I57970P195O493N622N378O375Q644J1777J5206J8376K0969K3133K5217K7249
$$ 957970 965165 971658 977280 982658 989033 997677 1009454 1024660 1043036 1064005 1087138 1112355 1139604
50706A139604K8819K9507K9114K7525K4720K1050J7119J3219R259N384K212J63
$$ 1139604 1168423 1197930 1227044 1254569 1279289 1300339 1317458 1330677 1339936 1345320 1347532 1347695
50694A347695j080k098l039l705m146m763n889p515r331j0953j2135j2797j2676
$$ 1347695 1346615 1344517 1341478 1337773 1333627 1328864 1322975 1315460 1306129 1295176 1283041 1270244 1257568
50681A257568j1127p689k888K192P182J2649J8782K4554K8715L0978L1706L0935
$$ 1257568 1246441 1238752 1235864 1238056 1245238 1257887 1276669 1301223 1329938 1360916 1392622 1423557
50669A423557K8520K4944K1220J8113J5857J4406J3416J2226J0414Q206N942L418
$$ 1423557 1452077 1477021 1498241 1516354 1532211 1546617 1560033 1572259 1582673 1590879 1596821 1600239
50657A600239L75k731n233p282r576j2071j3747j3758j2202r614o367k738J067
$$ 1600239 1600614 1597883 1592650 1585368 1575792 1563721 1549974 1536216 1524014 1514400 1508033 1505295 1506362
50644A506362N181R860J4731J8671K0824K1388K1201K0791K0116J8978J7429J5813
$$ 1506362 1511543 1521403 1536134 1554805 1575629 1597017 1618218 1639009 1659125 1678103 1695532 1711345
50632A711345J4565J3856J3396J2779J2140J2276J3675J5044J3017M241j1319
$$ 1711345 1725910 1739766 1753162 1765941 1778081 1790357 1804032 1819076 1832093 1836334 1825015
50621A825015k9078m2724m8809m8345m4127l7721k9576k0736j2856o659j635K580
$$ 1825015 1795937 1753213 1704404 1656059 1611932 1574211 1544635 1523899 1511043 1504384 1502749 1505329
50609A505329N455O360N307K537j928p963j4979k2230k9223l5599m0850m4413
$$ 1505329 1510784 1517144 1522451 1524988 1523060 1515097 1500118 1477888 1448665 1413066 1372216 1327803
50597A327803m5929m5481m3663m1296l8793l5949l2501k8624k4578k0210j5379
$$ 1327803 1281874 1236393 1192730 1151434 1112641 1076692 1044191 1015567 990989 970779 955400
50586I55400j0572o509l182J38L906P813J1324J4207J6440J7908J8278J7062J4022
$$ 955400 944828 938319 935137 935275 939181 946994 958318 972525 988965 1006873 1025151 1042213 1056235
50573A056235R797N715K594P6k330m086m294l095j379O88L689P520J1139J4116
$$ 1056235 1066032 1071747 1074341 1074417 1072087 1068001 1063707 1060612 1059233 1059921 1063610 1071130 1082269 1096385
50559A096385J7332K1519K6038K9693L2082L3438L3674L2414K9721K6210K2525
$$ 1096385 1113717 1135236 1161274 1190967 1223049 1256487 1290161 1322575 1352296 1378506 1401031
50548A401031J9137J6526J5078J4777J5265J6225J7586J9414K1617K3791K5428
$$ 1401031 1420168 1436694 1451772 1466549 1481814 1498039 1515625 1535039 1556656 1580447 1605875
50537A605875K6554K7917L0272L3551L7186M1096M5820N1588N7816O3655O8612
$$ 1605875 1632429 1660346 1690618 1724169 1761355 1802451 1848271 1899859 1957675 2021330 2089942
50526B089942P2468P5024P6115P5529P2757O7266N9166M9148L7617K4302R087
$$ 2089942 2162410 2237434 2313549 2389078 2461835 2529101 2588267 2637415 2675032 2699334 2708421
50515B708421p202k3216l8071n1554o3530p3519q0894q5364q7106q6394q3169
$$ 2708421 2701219 2678003 2639932 2588378 2524848 2451329 2370435 2285071 2197965 2111571 2028402
50504B028402p7124o8358n7662m5967l3724k1104q523L449J4499K4420L2717L8793
$$ 2028402 1951278 1882920 1825258 1779291 1745567 1724463 1715940 1719389 1733888 1758308 1791025 1829818
50492A829818M2319M2924L9736L1941J9818M668j2128k9290m5019n7296o5277
$$ 1829818 1872137 1915061 1954797 1986738 2006556 2011224 1999096 1969806 1924787 1867491 1802214
50481A802214o9792p2075p2502p0916o7656o3652n9735n6229n3047m9894m6415
$$ 1802214 1732422 1660347 1587845 1516929 1449273 1385621 1325886 1269657 1216610 1166716 1120301
50470A120301m2482l8325l4396l1058k8339k5885k3261k0384j7455j4500j1329
$$ 1120301 1077819 1039494 1005098 974040 945701 919816 896555 876171 858716 844216 832887
50459H32887q140n585l947k702j388l11J58M57J198K103K454K284K324K967M094
$$ 832887 824747 819162 815215 812513 811125 810814 810972 811429 812627 814730 817184 819468 821792 824759 828853
50444H28853N614P335Q537Q671Q173P736P139N948M962N504P432R307J0569J1979
$$ 828853 834467 841802 850339 859010 867183 874919 882058 888006 892968 898472 905904 915211 925780 937759
50430I37759J3712J4725J4500J3923J3787J3761J3604J4046J5661J8061K0987
$$ 937759 951471 966196 980696 994619 1008406 1022167 1035771 1049817 1065478 1083539 1104526
50419A104526K4971L0013L4756L8064M0369M2471M4052M4565M4549M4719M4404
$$ 1104526 1129497 1159510 1194266 1232330 1272699 1315170 1359222 1403787 1448336 1493055 1537459
50408A537459M2381L8771L4776L0830K6272K0650J4216P055j189j0543k0378k9967
$$ 1537459 1579840 1618611 1653387 1684217 1710489 1731139 1745355 1752410 1751221 1740678 1720300 1690333
50396A690333l8875m6798n3428n8421o1219o1290n8804n4677m9635m3772l7355
$$ 1690333 1651458 1604660 1551232 1492811 1431592 1370302 1311498 1256821 1207186 1163414 1126059
50385A126059l1167k5462j9376j2248m817J791P574J3134J8162K1599K3027K2763
$$ 1126059 1094892 1069430 1050054 1037806 1032989 1034780 1042354 1055488 1073650 1095249 1118276 1141039
50373A141039K0762J6482R952K139n828j3183j9426k4379k8254l1125l2549l2314
$$ 1141039 1161801 1178283 1188235 1190374 1184546 1171363 1151937 1127558 1099304 1068179 1035630 1003316
50361A003316l1176l0066k8864k6913k4522k2922k2624k2769k2331k1240k0089
$$ 1003316 972140 942074 913210 886297 861775 838853 816229 793460 771129 749889 729800
50350G29800j9295j8812j8238j7025j4985j2595j0510q851p285n710m349l344
$$ 729800 710505 691693 673455 656430 641445 628850 618340 609489 602204 596494 592145 588801
50338E88801k592j975j423q51l35r9k9M28J589L017M137M903N512N870N949O168
$$ 588801 586209 584234 582811 581960 581625 581526 581497 581925 583514 586531 590668 595571 601083 606953 612902 619070
50322F19070O828P556P947Q359R362J0740J1834J2631J3744J5451J7394J9172
$$ 619070 625898 633454 641401 649760 659122 669862 681696 694327 708071 723522 740916 760088
50310G60088K0578K1371K1125J9242J4902P703j216r327j4768j7673j9034j9043
$$ 760088 780666 802037 823162 842404 857306 865009 863793 854466 839698 822025 802991 783948
50298G83948j7512j5079j2748j0695q714p292o928o824n749m054l258l694m065
$$ 783948 766436 751357 738609 727914 719200 711908 704980 698156 692407 688353 685095 681401 677336
50285F77336l554k873k766k815k347j399j57J553L589N183N913O320O913P352
$$ 677336 673782 670909 668143 665328 662981 661582 661425 662978 666567 671750 677663 683983 690896 698248
50271F98248P103O349N698N462N706O554P995R679J1155J2065J2027J0792Q682
$$ 698248 705351 711700 717398 722860 728566 735120 743115 752794 763949 776014 788041 798833 807515
50258H07515O388M287K354O47o92j904l362m776n430n278n140n626o501p238p543
$$ 807515 813903 818190 820544 821191 820499 818595 815233 810457 805027 799749 794609 788983 782482 775244 767701
50243G67701p224o289n257m694m277l206j597n17l55k47M24R83P05K18P87K648
$$ 767701 760477 754188 748931 744237 739960 736754 735157 734640 734285 734038 734462 735445 736150 736368 737155 739803
50227G39803M872O609P808Q874J0216J2015J4096J5985J7413J8564J9659K0499
$$ 739803 744675 751284 759092 767966 778182 790197 804293 820278 837691 856255 875914 896413
50215H96413K0577J9556J7605J5383J3651J2632J1925J1241J0834J0691R722O670
$$ 896413 916990 936546 954151 969534 983185 995817 1007742 1018983 1029817 1040508 1050230 1056900
50203A056900J669l922r173j4117j8625k1889k3466k3883k3688k2570j9917j5756
$$ 1056900 1058569 1054647 1045474 1031357 1012732 990843 967377 943494 919806 897236 877319 861563
50191H61563j0704n442n44L450N916N936K507m136j1630j6935j8955j8885j8030
$$ 861563 850859 845417 844873 848323 854239 860175 862682 858546 846916 829981 811026 792141 774111
50178G74111j6415j3872j1159r221q158p588p280o880n836m257l098k842k701
$$ 774111 757696 743824 732665 723444 715286 707698 700418 693538 687702 683445 680347 677505 674804
50165F74804j839o34M8K62P78J876L088L890M053L608K898K344J810P23q43j813
$$ 674804 672965 672331 672379 672641 673419 675295 678383 682273 686326 689934 692832 695176 696986 697709 696866 695053
50149F95053j472n74m62j523l052m216m536l930k920k429k749l043k377r17L42
$$ 695053 693581 693007 692545 691022 687970 683754 679218 675288 672368 669939 667190 664147 661770 660853 661195
50134F61195O66j5j294k466k893k672k439k304j680m78M69P41J132K318L641M264
$$ 661195 661861 661846 660552 658086 655193 652521 650082 647778 646098 645620 646089 646830 647962 650280 653921 658185
50118F58185M620N551O703P177P311Q296J0172J1651J2118J2481J3768J5931J8468
$$ 658185 662805 668356 675059 682236 689547 697843 708015 719666 731784 744265 758033 773964 792432
50105G92432K1298K4526K7927L1198L4214L6764L8378L8677L7674L5755L3571
$$ 792432 813730 838256 866183 897381 931595 968359 1006737 1045414 1083088 1118843 1152414
50094A152414L1846L0932L0506L0037K9244K7829K5012J9925J2473L402o309j5825
$$ 1152414 1184260 1215192 1245698 1275735 1304979 1332808 1357820 1377745 1390218 1393620 1387311 1371486
50082A371486k4468l1777l7444m1085m2515m2464m2248m2181m1004l7677l3003
$$ 1371486 1347018 1315241 1277797 1236712 1194197 1151733 1109485 1067304 1026300 988623 955620
50071I55620k8550k4609k0463j6165j2655j0312q696p779q011q973r357q669p788
$$ 955620 927070 902461 881998 865833 853178 842866 834170 826391 818380 809407 800050 791381 783593
50058G83593p289o409m418k043n35L8O50J927L629N234O299O385N323L641K264
$$ 783593 776304 769895 765477 763434 762899 762937 763587 765514 769143 774377 780676 787061 792384 796025 798289
50043G98289J726J758J671J047R2o30q88j053j473j888j920j909k546l685m269
$$ 798289 800015 801773 803444 804491 804583 803953 803065 802012 800539 798651 796731 794822 792276 788591 784322
50028G84322l693k568j836j723j886k061k075j661p24M51J689L268N384P550Q964
$$ 784322 780629 778061 776225 774502 772616 770555 768480 766819 766095 766546 768235 771503 776887 784437 793401
50013G93401R285Q693P398N565L585J979R52L02k26o91j087j475k033k988m436
$$ 793401 802686 811379 818777 824342 827927 829906 830858 831160 830934 830243 829156 827681 825648 822660 818224
49998H18224o163p777r116j0253j0994j0696r024o669m781l705k724j080J218
$$ 818224 812061 804284 795168 784915 773921 763225 754201 747532 742751 739046 736322 735242 736460
49985G36460L820O706R902J2880J4922J6097J7240J8751J9932J9901J8794J7653
$$ 736460 740280 746986 756888 769768 784690 800787 818027 836778 856710 876611 895405 913058
49973I13058J7396J8336K0366K2967K5100K5751K4680K2190J8237J2418M875l454
$$ 913058 930454 948790 969156 992123 1017223 1042974 1067654 1089844 1108081 1120499 1125374 1121920
49961A121920j1597j8897k4585k7875k8980k9124k9122k8661k7539k6664k6883
$$ 1121920 1110323 1091426 1066841 1038966 1009986 980862 951740 923079 895540 868876 841993
49950H41993k7531k7278k5961k4448k2943k0737j7713j4888j3083j1937j0764
$$ 841993 814462 787184 761223 736775 713832 693095 675382 660494 647411 635474 624710
49939F24710r593q882q659q470p958p158o304n577m844l771k307r15K8Q38K050
$$ 624710 615117 606235 597576 589106 581148 573990 567686 562109 557265 553494 551187 550272 550300 551138 553188
49924E53188L508M617N380O472Q134R736J0761J1519J2455J3282J3327J2428J0993
$$ 553188 556696 561313 566693 573165 581299 591035 601796 613315 625770 639052 652379 664807 675800
49911F75800R339P501N620M071L044K236J068q13l333o197r165j2008j4348j5804
$$ 675800 685139 692640 698260 702331 705375 707611 708679 707866 704533 698336 689171 677163 662815 647011
49897F47011j6286j5916j4685j2617j0291q659p982p439o195m449l015k300k201
$$ 647011 630725 614809 600124 587507 577216 568557 560575 553136 546941 542492 539477 537177 534976
49884E34976k536k945k743j627k86M27O70J170J931K315K378L003M593O513Q160
$$ 534976 532440 529495 526752 525125 524839 525266 525936 527106 529037 531352 533730 536733 541326 547839 555999
49869E55999R684J1225J2209J1909J0336Q058N583L239J341J06n88j211k382m458
$$ 555999 565683 576908 589117 601026 611362 619420 625003 628242 629583 629689 629101 627890 625508 621050
49855F21050p031r036r748r453q838q112p305o810o737o193m363k075r76j204
$$ 621050 614019 604983 595235 585782 576944 568832 561527 554717 547980 541787 537424 535349 534373 533169
49841E33169j213o3J495K638L696N069O184O454O315O454O785O960P064P074O419
$$ 533169 531956 531893 533388 536026 539722 544791 550975 557429 563744 570198 576983 583943 591007 598081 604500
49826F04500M934L499K847K475J598M54l12r21k024l568n089o637q337r463r198
$$ 604500 609434 612933 615780 618255 619853 620307 619995 619074 617050 613482 608393 601756 593419 583956 574758
49811E74758p962o926o369n608m400l278k539j947j487j429j626j655j635j953
$$ 574758 566796 559870 553501 547893 543493 540215 537676 535729 534242 532813 531187 529532 527897 525944
49797E25944k232j606j33J141J712K165K962L775M451N590P484R338J0244J0302
$$ 525944 523712 522106 521973 523114 524826 526991 529953 533728 538179 543769 551253 560591 570835 581137
49783E81137J0173R987R382Q196O632N000L684K978K610J816J88j944m224o748
$$ 581137 591310 601297 610679 618875 625507 630507 634191 637169 639779 641595 641783 639839 635615 628867
49769F28867r401j1369j1953j1491j0840j0305r664q949q491q263p807o878n723
$$ 628867 619466 608097 596144 584653 573813 563508 553844 544895 536404 528141 520334 513456 507733
49756E07733m726m144m060m244m097l207j888q33k72J08N27Q67J119J587K407
$$ 507733 503007 498863 494803 490559 486462 483255 481367 480534 480262 480370 480897 481764 482883 484470 486877
49741D86877L255L686L670L640M156N484P239Q455Q366P168N757M666L592K140
$$ 486877 490132 493818 497488 501128 505284 510768 518007 526462 534828 541996 547753 552419 556011 558151
49727E58151N81m09n76l83n20j452l179n220o866p722p974p959p632o779n656
$$ 558151 558732 558323 557747 557364 556844 555392 552213 546993 540127 532405 524431 516472 508840 502061 496405
49712D96405m860m532m061k957j618q57p64n38N03K087L350L766L558L348L614
$$ 496405 491545 487013 482952 479995 478377 477520 476756 476218 476721 478808 482158 485924 489482 492830 496444
49697D96444M506N810O954P257O549N663N940P851J0254J1439J0944R975R766
$$ 496444 500950 506760 513714 520971 527520 533183 539123 546974 557228 568667 579611 589586 599352
49684E99352J0032R490P670N559M391M229M027K779M05k345m676o444q109r981
$$ 599352 609384 618874 626544 632103 636494 640723 644750 647529 647934 645589 640913 634469 626360 616379
$$ [...]
##END NTUPLES=NMR SPECTRUM
##END=
