##TITLE=AC1669_DOMRH14360_8570773_FWEQ2OPx1Q
##JCAMPDX= 6.0         $$ Bruker NMR JCAMP-DX V2.0
##DATA TYPE= NMR SPECTRUM
##DATA CLASS= NTUPLES
##ORIGIN= BRUKER
##OWNER= Administrator
$$ 1.72 TOPSPIN		Version 2.1
$$ 2015-08-11 19:17:14.242 -0700  Administrator@X
$$ Compression mode = diff/dup
##.OBSERVE FREQUENCY= 400.02188249412
##.OBSERVE NUCLEUS= ^1H
##.ACQUISITION MODE= SIMULTANEOUS (DQD)
##.ACQUISITION SCHEME= undefined
##.AVERAGES= 8
##.DIGITISER RES= 22
##SPECTROMETER/DATA SYSTEM= spect
##.PULSE SEQUENCE= zg30
##.SOLVENT NAME= COFFEE_meoh
##.SHIFT REFERENCE= INTERNAL, COFFEE_meoh, 1, 14.98509
##AUDIT TRAIL= $$ (NUMBER, WHEN, WHO, WHERE, PROCESS, VERSION, WHAT)
$$ ##TITLE= Audit trail, TOPSPIN		Version 2.1
$$ ##JCAMPDX= 5.01
$$ ##ORIGIN= Bruker BioSpin GmbH
$$ ##OWNER= Administrator
$$ $$ E:\/data/COFFEE/nmr/AC1669_DOMRH14360_8570773_FWEQ2OPx1Q/30/pdata/1/auditp.txt
$$ ##AUDIT TRAIL=  $$ (NUMBER, WHEN, WHO, WHERE, PROCESS, VERSION, WHAT)
(   1,<2015-08-11 19:17:06.820 -0700>,<Administrator>,<X>,<go>,<TOPSPIN 2.1>,
      <created by zg
	started at 2015-08-11 19:16:00.914 -0700,
	POWCHK enabled, PULCHK disabled,
       configuration hash MD5:
       21 0F 79 D6 B3 7B B4 F6 88 20 88 DB 03 48 BD 9F
       data hash MD5: 64K
       7E 97 3A ED AA F9 C9 3A B9 BA 56 26 1D 68 A9 1B>)
(   2,<2015-08-11 19:17:10.117 -0700>,<Administrator>,<X>,<proc1d>,<TOPSPIN 2.1>,
      <Start of raw data processing
       efp LB = 0 FT_mod = 6 PKNL = 1 PHC0 = 0 PHC1 = 0 SI = 32K 
       data hash MD5: 32K
       C5 53 34 E7 69 1D 37 C1 DA 19 1D B1 D7 A6 FE 20>)
(   3,<2015-08-11 19:17:10.398 -0700>,<Administrator>,<X>,<proc1d>,<TOPSPIN 2.1>,
      <pk PHC0 = 86.18225 PHC1 = 0 
       data hash MD5: 32K
       CD 25 65 90 36 5F 72 AE 0C F2 C5 B3 C7 07 AA 55>)
(   4,<2015-08-11 19:17:10.507 -0700>,<Administrator>,<X>,<proc1d>,<TOPSPIN 2.1>,
      <abs ABSG = 1 
       data hash MD5: 32K
       39 A4 9B B7 E2 26 50 CB C7 32 3A 96 CC D2 F7 E8>)
(   5,<2015-08-11 19:17:10.570 -0700>,<Administrator>,<X>,<proc1d>,<TOPSPIN 2.1>,
      <abs ABSG = 2 
       data hash MD5: 32K
       49 0C BB FE 79 47 43 C0 B3 13 6E 3A 62 F7 6D A3>)
(   6,<2015-08-11 19:17:10.632 -0700>,<Administrator>,<X>,<proc1d>,<TOPSPIN 2.1>,
      <abs ABSG = 3 
       data hash MD5: 32K
       ED 62 96 03 27 39 05 85 9E BB F0 5A E2 10 1B 90>)
(   7,<2015-08-11 19:17:10.695 -0700>,<Administrator>,<X>,<proc1d>,<TOPSPIN 2.1>,
      <abs ABSG = 4 
       data hash MD5: 32K
       77 FE 4E B5 EA F6 87 A2 D3 0D 1B B0 45 49 90 A0>)
(   8,<2015-08-11 19:17:10.757 -0700>,<Administrator>,<X>,<proc1d>,<TOPSPIN 2.1>,
      <abs ABSG = 5 
       data hash MD5: 32K
       D5 41 CC 84 03 47 A7 C1 5F 23 0F B3 26 4F BE A8>)
$$ ##END=
$$ 
$$ $$ hash MD5
$$ $$ 5C 9E 82 BA D7 9E FA 9A 2A 31 0F 1D 56 FA 99 04
##$RELAX= 
##$RELAX= 
##$RELAX= 
##$RELAX= 
##$RELAX= 
##$RELAX= 
##$RELAX= 
$$ Bruker specific parameters
$$ --------------------------
##$DU= <E:\>
##$EXPNO= 30
##$NAME= <AC1669_DOMRH14360_8570773_FWEQ2OPx1Q>
$$ [...]
150 150 150 150 150 150 150 150
##$TP07= 0
##$TPNAME0= <>
##$TPNAME1= <>
##$TPNAME2= <>
##$TPNAME3= <>
##$TPNAME4= <>
##$TPNAME5= <>
##$TPNAME6= <>
##$TPNAME7= <>
##$TPOAL= (0..7)
0.5 0.5 0.5 0.5 0.5 0.5 0.5 0.5
##$TPOFFS= (0..7)
0 0 0 0 0 0 0 0
##$TUNHIN= 0
##$TUNHOUT= 0
##$TUNXOUT= 0
##$USERA1= <user>
##$USERA2= <user>
##$USERA3= <user>
##$USERA4= <user>
##$USERA5= <user>
##$V9= 5
##$VALIST= <valist>
##$VCLIST= <CCCCCCCCCCCCCCC>
##$VD= 0
##$VDLIST= <DDDDDDDDDDDDDDD>
##$VPLIST= <PPPPPPPPPPPPPPP>
##$VTLIST= <TTTTTTTTTTTTTTT>
##$WBST= 2048
##$WBSW= 25
##$XGAIN= (0..3)
0 0 0 0
##$XL= 0
##$YL= 0
##$YMAX_a= 586130
##$YMIN_a= -514884
##$ZGOPTNS= <>
##$ZL1= 120
##$ZL2= 120
##$ZL3= 120
##$ZL4= 120
##$ABSF1= 14.98509
##$ABSF2= -5.573092
##$ABSG= 5
##$ABSL= 3
##$ALPHA= 0
##$AQORDER= 0
##$ASSFAC= 0
##$ASSFACI= 0
##$ASSFACX= 0
##$ASSWID= 0
##$AUNMP= <proc_prof1d_extract_pilot.lims>
##$AXLEFT= 0
##$AXNAME= <>
##$AXNUC= <1H>
##$AXRIGHT= 0
##$AXTYPE= 0
##$AXUNIT= <>
##$AZFE= 0.1
##$AZFW= 0.1
##$BCFW= 0
##$BC_mod= 0
##$BYTORDP= 0
##$COROFFS= 0
##$CY= 15
##$DATMOD= 1
##$DC= 0
##$DFILT= <>
##$DTYPP= 0
##$F1P= 0
##$F2P= 0
##$FCOR= 0.5
##$FTSIZE= 32768
##$FT_mod= 6
##$GAMMA= 0
##$GB= 0
##$INTBC= 1
##$INTSCL= 1
##$ISEN= 128
##$LB= 0
##$LEV0= 0
##$LPBIN= 0
##$MAXI= 10000
##$MC2= 0
##$MEAN= 0
##$ME_mod= 0
##$MI= 0
##$NCOEF= 0
##$NC_proc= -8
##$NLEV= 6
##$NOISF1= 0
##$NOISF2= 0
##$NSP= 0
##$NTH_PI= 0
##$NZP= 0
##$OFFSET= 14.98509
##$PC= 1
##$PHC0= 86.18225
##$PHC1= 0
##$PH_mod= 1
##$PKNL= yes
##$PPARMOD= 0
##$PPDIAG= 0
##$PPIPTYP= 0
##$PPMPNUM= 2147483647
##$PPRESOL= 1
##$PSCAL= 4
##$PSIGN= 0
##$PYNMP= <proc.py>
##$REVERSE= no
##$SF= 400.02
##$SI= 32768
##$SIGF1= 0
##$SIGF2= 0
##$SINO= 400
##$SIOLD= 32768
##$SPECTYP= <>
##$SREGLST= <1H.CDCl3>
##$SSB= 0
##$STSI= 32768
##$STSR= 0
##$SW_p= 8223.68421052631
##$SYMM= 0
##$S_DEV= 0
##$TDeff= 65536
##$TDoff= 0
##$TI= <>
##$TILT= no
##$TM1= 0
##$TM2= 0
##$TOPLEV= 0
##$USERP1= <user>
##$USERP2= <user>
##$USERP3= <user>
##$USERP4= <user>
##$USERP5= <user>
##$WDW= 1
##$XDIM= 32768
##$YMAX_p= 442778270
##$YMIN_p= -754322
##$CURPLOT= <Network HP LaserJet P1505>
##$CURPRIN= <$Network HP LaserJet P1505>
##$DFORMAT= <normdp>
##$LAYOUT= <+/1D_H.xwp>
##$LFORMAT= <normlp>
##$PFORMAT= <normpl>
##$SURQMSG= 1
$$ End of Bruker specific parameters
$$ ---------------------------------
##NTUPLES= NMR SPECTRUM
##VAR_NAME=  FREQUENCY,     SPECTRUM/REAL,   SPECTRUM/IMAG
##SYMBOL=    X,             R,               I
##VAR_TYPE=  INDEPENDENT,   DEPENDENT,       DEPENDENT
##VAR_FORM=  AFFN,          ASDF,            ASDF
##VAR_DIM=   32768,         32768,           32768
##UNITS=     HZ,            ARBITRARY UNITS, ARBITRARY UNITS
##FACTOR=    0.250966925370066, 1,           1
##FIRST=     8223.43324360094, -113114,      -186296
##LAST=      0,             101274,          -24221
##MIN=       0,             -754322,         0
##MAX=       8223.43324360094, 442778270,    0
$$ Real data points
##PAGE= N=1
##DATA TABLE= (X++(R..R)), XYDATA
$$ [...]
19527c41425E3832b33110A84276a16159d0990A60266a3464n7824E1609O3450J373
$$ -341425 53832 -233110 184276 -116159 -40990 160266 -13464 -71288 51609 115059 116432
19516A16432J06990G7422k8383K8549b30943P9553q4780i9794B5960K35287E730
$$ 116432 223422 77422 49039 77588 -230943 -151390 -236170 -99794 25960 261247 5730
19504A26654A2226b62755n0791G226c87593Q2760J01510P8579D3784b32210b9458
$$ 126654 12226 -262755 -313546 7226 -387593 -304833 -203323 -124744 43784 -232210 -29458
19492E5333J93635j008G4941c05789A10621b10386A11047a44325r5270R8283H5402
$$ 55333 248968 247960 74941 -305789 110621 -210386 111047 -144325 -239595 -141312 85402
19480e0923I960m885J64956b1173k03147J1830l4112b063k9785j34550B50615
$$ -50923 9960 5075 170031 -21173 -224320 -212490 -246602 -2063 -31848 -166398 250615
19468A8634J34400b25457R7524N1198B4077R4316A620a26518D4012b03569Q5793
$$ 18634 153034 -225457 -127933 -76735 24077 118393 1620 -126518 44012 -203569 -117776
19457a17776B85891E9414a39512B37999D5982a7099F0241L7082a99238e327m43930
$$ -117776 285891 59414 -139512 237999 45982 -17099 60241 97323 -199238 -5327 -449257
19446d49257A36914b28071j22319f602G4436e5907j96342A7574b30977d8793D9928
$$ -449257 136914 -228071 -350390 -6602 74436 -55907 -252249 17574 -230977 -48793 49928
19434f6013B21344F0182a84611D1199b02074i6884j8918C61790I6852b72322D17000
$$ -66013 221344 60182 -184611 41199 -202074 -96884 -115802 361790 96852 -272322 417000
19422i6301l28160f7269A03861J81880j04755c45391J27539c8311q8800r0386
$$ -96301 -424461 -67269 103861 285741 180986 -345391 -217852 -38311 -127111 -217497
19412b17497a4264B06292c10269a46029B63178i4344a8325E2783L8884a15440
$$ -217497 -14264 206292 -310269 -146029 263178 -94344 -18325 52783 91667 -115440
19401b34699A57450b21592d4613r036A86153D0561b38682A95560d05667b3462
$$ -234699 157450 -221592 -44613 -53649 186153 40561 -238682 195560 -405667 -23462
19390c07563a17654K7846k37317k41039b48243A10233o039a82647h2636j2251
$$ -307563 -117654 -89808 -327125 -568164 -248243 110233 104194 -182647 -82636 -94887
19380i4887B22713a1837j00144m3559B07267a06013O127a4037k06457f3299k8960
$$ -94887 222713 -11837 -111981 -155540 207267 -106013 -99886 -14037 -220494 -63299 -92259
19369i2259f706k00088M1675I5374Q4446b39921g1789J8992q5148B38476A07320
$$ -92259 -6706 -206794 -165119 95374 179820 -239921 -71789 -52797 -137945 238476 107320
19357A13982a10909j59169A94905c5633A27078e5208a4262j29144H2983c01340
$$ 113982 -110909 -270078 194905 -35633 127078 -55208 -14262 -143406 82983 -301340
19346A32647M463d00143B6283J26722i9575k9864l70173a14445k32744J27529
$$ 132647 137110 -400143 26283 153005 -99575 -129439 -499612 -114445 -347189 -219660
19336b19660A51624m6518e1451l2594q2248j27335A74669a73152N2402o4571j95401
$$ -219660 151624 105106 -51451 -84045 -166293 -293628 174669 -173152 -120750 -185321 -380722
19325c80722B2539C188b9720k31911A14511a83285p1738A4878a56737q356k0168
$$ -380722 22539 3188 -29720 -261631 114511 -183285 -255023 14878 -156737 -165093 -185261
19314a85261A7770a82719d7370k19485b475A78062m9394A1005i2227A3032b5491
$$ -185261 17770 -182719 -47370 -266855 -2475 178062 128668 11005 -92227 13032 -25491
19302A58376a28591j8431N9084J1163j1582B4723b11059I9369a99410e3279I7970
$$ 158376 -128591 -147022 -87938 -76775 -88357 24723 -211059 99369 -199410 -53279 97970
19290a55482I4720J9981e7401j97301A0694O8420h0596A94464h6914l67311a56471
$$ -155482 94720 114701 -57401 -254702 10694 79114 -80596 194464 -86914 -454225 -156471
19278B54562N5406a3575B8362c07855A05501C8661A9232b11012m1039A94664D4923
$$ 254562 309968 -13575 28362 -307855 105501 38661 19232 -211012 -252051 194664 44923
19266a10359q1778H2928J74373e7678B55420A4429M21309i2022j27805g6179r4244
$$ -110359 -192137 82928 257301 -57678 255420 14429 435738 -92022 -219827 -76179 -170423
19255a70423j18914A42512D8200J40209k3127b0679A31511g1169c0387j36961
$$ -170423 -289337 142512 48200 188409 165282 -20679 131511 -71169 -30387 -167348
19245a67348d2001m2143p1583A6225f777k05253a8694d601l4156B76674A0206
$$ -167348 -42001 -84144 -155727 16225 -6777 -212030 -18694 -4601 -38757 276674 10206
19233A1381k333a63121A62160G6375b16578A44222b45358k2790i9415A85107c0078
$$ 11381 9048 -163121 162160 76375 -216578 144222 -245358 -268148 -99415 185107 -30078
19221A39549b43634M0750k9129c0641A45446J0331a77072F7980a88574I8746f3754
$$ 139549 -243634 -202884 -232013 -30641 145446 155777 -177072 67980 -188574 98746 -63754
19209c51874J25765j05311H2728j8447k3978g4441A49218C8373b25419q5745A63913
$$ -351874 -226109 -331420 82728 64281 40303 -74441 149218 38373 -225419 -311164 163913
19197C5817j2273Q1454m8971b51451J10683L4111c3270E7052J57328H2938b36925
$$ 35817 23544 104998 56027 -251451 -140768 -106657 -33270 57052 214380 82938 -236925
19185B00562d3810A6478J12222b41927E3314a15571C75990E9445d2314I258a59653
$$ 200562 -43810 16478 128700 -241927 53314 -115571 375990 59445 -42314 9258 -159653
19173E3635a38648A58817a11304I8334f9361j27745n259P3894e4990r1643L3371
$$ 53635 -138648 158817 -111304 98334 -69361 -197106 -202365 -128471 -54990 -146633 -113262
19162a13262h587j20441e0542j83886g3546m9365e9606l98712d3738k9433j39789
$$ -113262 -8587 -129028 -50542 -234428 -73546 -122911 -59606 -458318 -43738 -73171 -212960
19151b12960A41065g5224G0950i1973q7422r6411K6040A57212k4835a37343j63344
$$ -212960 141065 -75224 70950 -91973 -179395 -275806 -249766 157212 132377 -137343 -300687
19140c00687I6132J0908a05039A9458g2618F5511a4241n6958r3053c1708k4835
$$ -300687 96132 107040 -105039 19458 -72618 65511 -14241 -71199 -164252 -31708 -56543
19129e6543k1240K1645D4387N13a4494D7045R4808h4441j2789A56399c3657k5718
$$ -56543 -77783 -56138 44387 44900 -14494 47045 141853 -84441 -97230 156399 -33657 -59375
19117e9375k0810j03904J9757A0464b6126k83907L7057K1812d5655k6423l30617
$$ -59375 -80185 -184089 -164332 10464 -26126 -310033 -272976 -251164 -45655 -72078 -402695
19106d02695A39518i7199E3667a04493K8555k6770M1900A12356a54297F3544J6870
$$ -402695 139518 -97199 53667 -104493 -75938 -102708 -60808 112356 -154297 63544 80414
19095H0414R3440a33448e9054B07545a60795D0169a34028k38586O2758a51918
$$ 80414 173854 -133448 -59054 207545 -160795 40169 -134028 -372614 -309856 -151918
19084b4223p8500l8718B76951F1050a31604K9695J221J3065A8613P2647p397b90137
$$ -24223 -102723 -141441 276951 61050 -131604 -101909 -100688 -87623 18613 91260 83863 -290137
19071a67325P0554A60565a8348j70050D4835a56872d1049j8022k615d221j6326
$$ -167325 -96771 160565 -18348 -188398 44835 -156872 -41049 -59071 -61686 -4221 -20547
19060b0547B87360b89737a21073c7651A89516M1483a6984E5051a55527a1026n5034
$$ -20547 287360 -289737 -121073 -37651 189516 230999 -16984 55051 -155527 -11026 -66060
19049f6060L0254o1450J9686K8228A55749B8634J31462b95370a0901C64979i1831
$$ -66060 -35806 -97256 -77570 -49342 155749 28634 160096 -295370 -10901 364979 -91831
19037A84096e0846B01446b13525n3325L0801a6017o453l5997J4278r5637O0938
$$ 184096 -50846 201446 -213525 -266850 -236049 -16017 -22470 -58467 -44189 -139826 -78888
19026g8888A23380a09907J7560E7771e255I3948B2115b20721L8890E7943b38927
$$ -78888 123380 -109907 -92347 57771 -5255 93948 22115 -220721 -181831 57943 -238927
19014A59882a3366I8638b19318q7860e4672k95674B29806E3780h133p5655C2104
$$ 159882 -13366 98638 -219318 -307178 -54672 -350346 229806 53780 -8133 -83788 32104
19002H2173j6062J28078A2150f7892k42448A49354b98170h2845k6466b5763E039
$$ 82173 66111 194189 12150 -67892 -310340 149354 -298170 -82845 -109311 -25763 5039
18990H0678P5913m1002l8618A8090i9123o6280C19705f005j5668k64395a17325
$$ 80678 156591 115589 76971 18090 -99123 -165403 319705 -6005 -21673 -286068 -117325
18978A87131E2406K38639b12787J01426j66897G1365c11975B3787h4634j32589
$$ 187131 52406 291045 -212787 -111361 -278258 71365 -311975 23787 -84634 -217223
18968b17223k4972j74999A47759D7323a5914A3418K5639b68616A31767b07124
$$ -217223 -242195 -417194 147759 47323 -15914 13418 39057 -268616 131767 -207124
18957C2294c88512a77311F1467a13806l6722n3448j37041h8768k0920m3173B4957
$$ 32294 -388512 -177311 61467 -113806 -150528 -203976 -341017 -88768 -109688 -152861 24957
18945B62058a06380B36500c1787B15795J50776g0808k49623A74246h3722A96442
$$ 262058 -106380 236500 -31787 215795 366571 -70808 -320431 174246 -83722 196442
18934D1122a13379E3295B5895a30736A93105b63179j3557a29779e5259o1710o29
$$ 41122 -113379 53295 25895 -130736 193105 -263179 -276736 -129779 -55259 -116969 -117598
18923a17598D24662k08269b65778c7717R617l5821G2780d7415D43198b5042j20040
$$ -117598 424662 216393 -265778 -37717 -28100 -63921 72780 -47415 443198 -25042 -145082
18912a45082b0254A08603M1357e59239D1562K85798a37028K7191C2110A5192c2088
$$ -145082 -20254 108603 149960 -559239 41562 327360 -137028 -109837 32110 15192 -32088
18900a62148c9415j96919M6397L9924L6495A25112a17823N2014B08140l9192c14651
$$ -162148 -39415 -236334 -189937 -150013 -113518 125112 -117823 -65809 208140 168948 -314651
18888C2062g5066c4624A76102f0503j39155k2902d7289e737C15308a69204C42595
$$ 32062 -75066 -34624 176102 -60503 -199658 -222560 -47289 -5737 315308 -169204 342595
18876g1463L2978A03360m2898K57547d68882B59213e3417L446n2496K2153B09882
$$ -71463 -38485 103360 60462 318009 -468882 259213 -53417 -49971 -102467 -80314 209882
18864a22648b9750n9102D2494K61719d63498J02364A99302i1593I1714b2081A98792
$$ -122648 -29750 -88852 42494 304213 -463498 -361134 199302 -91593 91714 -22081 198792
18852D7445O8978B6716a9674B03692i2098j03206E9238J5475a79940j05951Q617
$$ 47445 116423 26716 -19674 203692 -92098 -195304 59238 74713 -179940 -285891 -277274
18841b77274f8642r8138e7872B82345d5168L208l94849a40745C7110a35356J1127
$$ -277274 -68642 -166780 -57872 282345 -45168 -41960 -436809 -140745 37110 -135356 -124229
18830a24229n4730B66604h6540J0906l1543K6799c9736j2257m504E9593c4523
$$ -124229 -178959 266604 -86540 -75634 -107177 -80378 -39736 -51993 -56497 59593 -34523
18818B60632b01667h61n207j679p7555A35760l9610m7200J76835E850K16172A05954
$$ 260632 -201667 -861 -6068 -7747 -85302 135760 96150 48950 225785 5850 222022 105954
18805H981c65910B35577d97661B00696d0119G7170l4538K77399a25496B55730
$$ 8981 -365910 235577 -497661 200696 -40119 77170 42632 320031 -125496 255730
18794A31695a13372d6653B32543d6631l17448B81869B8175a12041o1881G8624
$$ 131695 -113372 -46653 232543 -46631 -364079 281869 28175 -112041 -173922 78624
18783D3631a66479D8655g9938A52769M312h5453l57244A7538a26880B35521j12705
$$ 43631 -166479 48655 -79938 152769 157081 -85453 -442697 17538 -126880 235521 122816
18772A22816e049A4348K06730G4431B2573d2841l0803k5305j74079e6612k6541
$$ 122816 -5049 14348 221078 74431 22573 -42841 -73644 -98949 -273028 -56612 -83153
18761h3153A4144a02944c5305n8525o9263J4650L9787m3568B00279p9008a10136
$$ -83153 14144 -102944 -35305 -93830 -163093 -148443 -108656 -152224 200279 121271 -110136
18749I9426a86163A50852o4152b80534q5285f0752j37543j46180a195k57669K1850
$$ 99426 -186163 150852 86700 -280534 -365819 -60752 -198295 -344475 -1195 -258864 -237014
18738b37014i4296j29889J04047D6192K54670e3719E6922b24833H9476c30378
$$ -237014 -94296 -224185 -120138 46192 300862 -53719 56922 -224833 89476 -330378
18727G104J9114j2353J082K60113a61245P0553k4237n4446e1707A49437g2353
$$ 7104 26218 13865 14947 275060 -161245 -90692 -114929 -169375 -51707 149437 -72353
18715a25082l40348J55669F5788h3098o9444A11442b09599H2874i2739A51085
$$ -125082 -465430 -309761 65788 -83098 -152542 111442 -209599 82874 -92739 151085
18704C1129a62066A71328a7332k49408f008j08067n296M0433j9324J6655A45500
$$ 31129 -162066 171328 -17332 -266740 -6008 -114075 -119371 -78938 -98262 -81607 145500
18692b04469o9130A04478m2898e06770A31770a05823b1862G6838g635l0841a1030
$$ -204469 -273599 104478 61580 -506770 131770 -105823 -21862 76838 -7635 -38476 -11030
18680G9421R752b0012k95889A4361K10184c29155M6595b2960j07212k64767C5889
$$ 79421 89173 -20012 -315901 14361 224545 -329155 -282560 -22960 -130172 -394939 35889
18668a84045I5475H535M55022b5498j59161j6516j01262G3665K8255a1577H4112
$$ -184045 95475 8535 463557 -25498 -184659 -201175 -302437 73665 101920 -11577 84112
18656a57577A24795D6837h458A55684k212J09316a85634P7C8724K0629a92650
$$ -157577 124795 46837 -8458 155684 153472 262788 -185634 -185557 38724 59353 -192650
18644a35203A34624a06611L9299A08779c01003I769b9629A76119D2768a98370
$$ -135203 134624 -106611 -67312 108779 -301003 9769 -29629 176119 42768 -198370
18633e8618k534A31989a17540k27681F4365B5217Q6742a10889G1426b95636B03064
$$ -58618 -61152 131989 -117540 -345221 64365 25217 111959 -110889 71426 -295636 203064
18621i5111a5665o3488K2601B2755i0278a7537p1714I8012h7674m7101A05439
$$ -95111 -15665 -79153 -56552 22755 -90278 -17537 -89251 98012 -87674 -134775 105439
18609a6530j14458j11918B59268c8810j51034p3337g3079D1677J13891a13100
$$ -16530 -130988 -242906 259268 -38810 -189844 -263181 -73079 41677 155568 -113100
18598a52314H7412c11116c2381B16915a92586g7217m0192p8947R2668B15580a98105
$$ -152314 87412 -311116 -32381 216915 -192586 -77217 -117409 -196356 -103688 215580 -198105
18586i0821B60014h0642A19102C3390i0202r595j31278c6574B06054H1611C7869
$$ -90821 260014 -80642 119102 33390 -90202 -99797 -231075 -36574 206054 81611 37869
18574b58219j29050A73899b61253c7671q0541j12698Q6560l2727D3100k926d54391
$$ -258219 -387269 173899 -261253 -37671 -118212 -230910 -144350 -177077 43100 40174 -454391
18562c660m8213j0743l09005a77846f4874b8946j23109f4636F7855a01894A76467
$$ -3660 -51873 -62616 -371621 -177846 -64874 -28946 -152055 -64636 67855 -101894 176467
18550c2864A30210b36395j70400A65402B2752a70505q7332H1822K9819K0644a49080
$$ -32864 130210 -236395 -406795 165402 22752 -170505 -257837 81822 111641 132285 -149080
18538d2317e799j08574B8146p417J92999J73948a76045M6187K2754l58176a14953
$$ -42317 -5799 -114373 28146 20729 213728 387676 -176045 -129858 -107104 -465280 -114953
18526b41422g1292j07798f8659H075a6645C6861A2807N8191i1757a1729F2882
$$ -241422 -71292 -179090 -68659 8075 -16645 36861 12807 70998 -91757 -11729 62882
18514b97544E8235c84210B47621d6920F4274b6564j70082K123f1110q6526A13063
$$ -297544 58235 -384210 247621 -46920 64274 -26564 -196646 -194523 -61110 -147636 113063
18502a18625B53159a52165A02967c49086e5859q2487O4533A83402R369a46116
$$ -118625 253159 -152165 102967 -349086 -55859 -138346 -73813 183402 192771 -146116
18491a54773q4569E801P7565d2300C39061a72339e1214n5411A493J86234A8115
$$ -154773 -239342 5801 83366 -42300 339061 -172339 -51214 -106625 1493 187727 18115
18479C09598c90505N799b6914m8611k45118a0687k24522P7234P7492n3307b4482
$$ 309598 -390505 -384706 -26914 -75525 -320643 -10687 -235209 -157975 -80483 -133790 -24482
18467C3771a40839H4202J235N7532O2764J23589a60134b0043o9710m346j17100
$$ 33771 -140839 84202 85437 142969 205733 329322 -160134 -20043 -89753 -94099 -211199
18456b11199A31892K5220b2324A52594b40934a18059A2118J1474J87272b10456
$$ -211199 131892 157112 -22324 152594 -240934 -118059 12118 23592 210864 -210456
18445c32835a65751i259j69596h706n2486J3672j80825e828k21694A4287c27458
$$ -332835 -165751 -9259 -178855 -8706 -61192 -47520 -228345 -5828 -227522 14287 -327458
18433H5285g4406k66542a33962D9483h2993C6330J3037a15569B33270g5226C16151
$$ 85285 -74406 -340948 -133962 49483 -82993 36330 49367 -115569 233270 -75226 316151
18421D7826N9686a18518j47770f3656E4617b54263J03179L2020r6348j8337j51015
$$ 47826 107512 -118518 -266288 -63656 54617 -254263 -151084 -119064 -215412 -233749 -384764
18410c84764b433k87903H5194L1329L54176a05791o3157g8537k38016f4133J7823
$$ -384764 -2433 -290336 85194 116523 470699 -105791 -168948 -78537 -316553 -64133 -46310
18399d6310a1426B1807e44896c6134H0467b09036M7902J5054B2376e2189A88488
$$ -46310 -11426 21807 -544896 -36134 80467 -209036 -161134 -146080 22376 -52189 188488
18387A38066J55779h1933A6623d1245m3757a1132A584a66694p6448A04460a07683
$$ 138066 293845 -81933 16623 -41245 -85002 -11132 1584 -166694 -243142 104460 -107683
18375B49270j23403h6141B19347b0497B45028d6324E848J9866a20896n6931A54288
$$ 249270 125867 -86141 219347 -20497 245028 -46324 5848 25714 -120896 -177827 154288
18363I2814b4895j21593q5766f0085J7446l70838b8893k8353k47204h4786H0403
$$ 92814 -24895 -146488 -232254 -60085 -42639 -413477 -28893 -57246 -304450 -84786 80403
18351E3662d8646H0728a63115b5596C3980O6539a0052k16965A1833f094G2067
$$ 53662 -48646 80728 -163115 -25596 33980 100519 -10052 -227017 11833 -6094 72067
18339A82766a16705J2814M909k05620D4671e6705C0125J72838a06743A57986a54037
$$ 182766 -116705 -103891 -98982 -304602 44671 -56705 30125 202963 -106743 157986 -154037
18327i3192J7814C8618b37611e5181I415L5757J56858A6368b51825C9291f2506
$$ -93192 -75378 38618 -237611 -55181 9415 45172 202030 16368 -251825 39291 -62506
18315a17650A81769a20726j57110h4100j35452M358A17581c4280m6756A03683
$$ -117650 181769 -120726 -277836 -84100 -219552 -215194 117581 -34280 -81036 103683
18304e7971J8037m5778A82531a027A550K9891c32308C0247i862B6559h088B53684
$$ -57971 -39934 -85712 182531 -1027 1550 31441 -332308 30247 -9862 26559 -8088 253684
18291A15912J23351i9104j6614I831O0186h3162A04851c5535m89720B3821Q0066
$$ 115912 239263 -99104 -115718 9831 70017 -83162 104851 -35535 -525255 23821 103887
18280A03887b79432r7811a44410H3316e9234q6893L5472j14308j35527C6151A368
$$ 103887 -279432 -377243 -144410 83316 -59234 -146127 -110655 -224963 -360490 36151 1368
18268A35493a15391j27517D7652L897D971M5717f766m5689j51419Q3569E8785
$$ 135493 -115391 -242908 47652 51549 4971 50688 -6766 -52455 -203874 -120305 58785
18256a61393B89889f3797a0270j87216b4907j11703j89793D8304M4972Q9899o4061
$$ -161393 289889 -63797 -10270 -197486 -24907 -136610 -326403 48304 93276 183175 119114
18245A19114b22939H218L11429b6672k28935m0127a28822B95837A12448b82734
$$ 119114 -222939 8218 319647 -26672 -255607 -295734 -128822 295837 112448 -282734
18234a58355A19555i7014m0243c2187F7260a4306k03221Q5174p8654m6948H0171
$$ -158355 119555 -97014 -137257 -32187 67260 -14306 -217527 -132353 -211007 -257955 80171
18222B43409b36577R5667a3508A75876A3074a90319J3894B1126i2659J1932L8067
$$ 243409 -236577 -140910 -13508 175876 13074 -190319 -176425 21126 -92659 -80727 -42660
18211d2660j30580b0356j9576B45646b70269B53847G0305b969k91035a17965A21297
$$ -42660 -173240 -20356 -39932 245646 -270269 253847 70305 -2969 -294004 -117965 121297
18199d2168C6573J74366n3937A1231O9835c2210O01j29389B78764a68320A38155
$$ -42168 36573 210939 157002 11231 81066 -32210 -31609 -160998 278764 -168320 138155
18187a89361R2806J4729a4095A66698c97057P0828a38974A09622c59105F5821
$$ -189361 -96555 -81826 -14095 166698 -397057 -326229 -138974 109622 -359105 65821
18176D6608b30837A03192M8027a94378R5043B98801a17809A8641N1812k7003e4004
$$ 46608 -230837 103192 151219 -194378 -99335 298801 -117809 18641 70453 43450 -54004
18164d4786A67864d7327l77206a10956B31031b32205F2223j7459J04276b73448
$$ -44786 167864 -47327 -424533 -110956 231031 -232205 62223 44764 149040 -273448
18153E6584a21393B95314b14515A5657a5731n2513I7144M6514r121b7384E0405
$$ 56584 -121393 295314 -214515 15657 -15731 -68244 97144 143658 134537 -27384 50405
18141A14584a06294K4345j4763j17100A44864c13834A72802F0013a65871c0591
$$ 114584 -106294 -81949 -96712 -213812 144864 -313834 172802 60013 -165871 -30591
18130A40159a94804L4049B38925m3732a7146j0697a2022B30066j13566C3965A2751
$$ 140159 -194804 -160755 238925 195193 -17146 -27843 -12022 230066 116500 33965 12751
18118a79827H1185b65177h1964B00897c0152A42118J17744c797I5748I09a14443
$$ -179827 81185 -265177 -81964 200897 -30152 142118 259862 -3797 95748 909 -114443
18106D30065j07780j43120g4048A53643K8540k9277p4851h9084k9489q6730m366
$$ 430065 322285 179165 -74048 153643 182183 152906 78055 -89084 -118573 -205303 -209669
18095b09669b2270k07938J4404L9251o7993J00244B06333c86949E5075a26445
$$ -209669 -22270 -230208 -215804 -176553 -244546 -144302 206333 -386949 55075 -126445
18084a19454A86114j2668j1741j1650a90073q3498A07886a60137A90285a78414
$$ -119454 186114 173446 161705 150055 -190073 -273571 107886 -160137 190285 -178414
18073H6242L7336b02169Q6771c1085j95782B5073c26122B70872A18680h2833K6742
$$ 86242 123578 -202169 -115398 -31085 -226867 25073 -326122 270872 118680 -82833 -56091
18062e6091D4788b46019a2503A88223c6385j35951H053f7822k53628d4244j12989
$$ -56091 44788 -246019 -12503 188223 -36385 -172336 8053 -67822 -321450 -44244 -157233
18051a57233B710f3515j79317A70366g5632A51354i8762k60026D17479A28737
$$ -157233 2710 -63515 -242832 170366 -75632 151354 -98762 -358788 417479 128737
18040B0651e10675A25277B7698l123b86034B30505H2846l8424a9589j14549D3918
$$ 20651 -510675 125277 27698 24575 -286034 230505 82846 44422 -19589 -134138 43918
18028b97896A6217e3113j1631o7393A43434L6894a42372E3649Q6353d510D60430
$$ -297896 16217 -53113 -64744 -132137 143434 180328 -142372 53649 140002 -4510 460430
18016d15209J82098B37023a40422E9191J05092h6106d0170j207I3354J86162G1542
$$ -415209 -233111 237023 -140422 59191 164283 -86106 -40170 -41377 93354 279516 71542
18004b09217A20828A5685f0366B82665a66754k672B39009b53067e32l60895a9324
$$ -209217 120828 15685 -60366 282665 -166754 -169426 239009 -253067 -532 -361427 -19324
17992A44547l6171b04621B51243B9145d6045A17142b93013J33250a2007A48905
$$ 144547 108376 -204621 251243 29145 -46045 117142 -293013 -159763 -12007 148905
17981F9196J80299a21981A15363J12923i805A68910J93214A35693b14291D7180
$$ 69196 249495 -121981 115363 228286 -9805 168910 362124 135693 -214291 47180
17970a61367m6587O6558L9358M1668C4160a64189f1736B10271e5326q6761c0058
$$ -161367 -207954 -141396 -102038 -60370 34160 -164189 -61736 210271 -55326 -142087 -30058
17958h8352A96841b74468K4526f7349D80549a14697A45865p2572b08326E0666
$$ -88352 196841 -274468 -249942 -67349 480549 -114697 145865 73293 -208326 50666
17947a45618M1164k2020N2657F2521c04921i4563k1242E1217a39258b6738A44911
$$ -145618 -104454 -126474 -73817 62521 -304921 -94563 -115805 51217 -139258 -26738 144911
17935c34306P9104P7348A90271J70537a97844B49017b18804B829g4668m6755B22027
$$ -334306 -255202 -177854 190271 360808 -197844 249017 -218804 2829 -74668 -121423 222027
17923g5767n7133A99818q7865J8584a8227l51751P8107B8879J26162f5375q9084
$$ -75767 -132900 199818 111953 130537 -18227 -369978 -291871 28879 155041 -65375 -154459
17912a54459a1139I4331K6096H516K9462K24600h1344B5228b08636d1395A8320
$$ -154459 -11139 94331 120427 8516 37978 262578 -81344 25228 -208636 -41395 18320
17900A8311M310J5372O9208c30669b4546D9040J86946c7633a5259B7297a41810
$$ 18311 22621 37993 107201 -330669 -24546 49040 235986 -37633 -15259 27297 -141810
17888E323J85200a12483F6488f4032A85885j6423E066a27299F1089a87428D6542
$$ 5323 190523 -112483 66488 -64032 185885 169462 5066 -127299 61089 -187428 46542
17876h2062A01276J106J99743r8776a18856D8866R0806E1073B5381J05103i8075
$$ -82062 101276 102382 302125 203349 -118856 48866 139672 51073 25381 130484 -98075
17864d2634G5031J47599A05232B9415a93373b3545A61859g8597k0631G8307a47683
$$ -42634 75031 222630 105232 29415 -193373 -23545 161859 -78597 -99228 78307 -147683
17852b518G8924a19022I7467N9724a44457C28488b29626H1170K055b93655d5695
$$ -2518 78924 -119022 97467 157191 -144457 328488 -229626 81170 83225 -293655 -45695
17840a03612L7371A7176F062L5032J80453a41043j5400F7816c98853i0933i681
$$ -103612 -66241 17176 6062 41094 221547 -141043 -156443 67816 -398853 -90933 -9681
17828a30483I2271l8988d9064j38816j08324F8421C162K44882a26405H7790a53753
$$ -130483 92271 53283 -49064 -187880 -296204 68421 3162 248044 -126405 87790 -153753
17816g5825B66225c2169j4151B46778F1265J31829h628l0866A03861P1792O2066
$$ -75825 266225 -32169 -46320 246778 61265 193094 -8628 -39494 103861 175653 237719
17805B37719A17002c3043m97716a20680d0867q8093j10639A60612k2334J73938
$$ 237719 117002 -33043 -530759 -120680 -40867 -128960 -239599 160612 138278 312216
17795C12216I5586R5149B3668a82592R0660c4935c371C3977J25884j158a43372
$$ 312216 95586 190735 23668 -182592 -91932 -34935 -3371 33977 159861 158703 -143372
17783F9583e7725k5124J8413A54140n5215f6530j54282B37415b4064A5555J46190
$$ 69583 -57725 -82849 -64436 154140 98925 -66530 -220812 237415 -24064 15555 161745
17772A61745f3823A57013a54379j48547g0870I6889O5843f5669E7865b64991A49205
$$ 161745 -63823 157013 -154379 -302926 -70870 96889 162732 -65669 57865 -264991 149205
17760A57682a43475j14220R652A50161b53912i0006H6207a19779B46108c58212
$$ 157682 -143475 -257695 -248043 150161 -253912 -90006 86207 -119779 246108 -358212
17749d2696C7756b74515A35106c2133A24778e4631C5764R1233D3324K56349I7668
$$ -42696 37756 -274515 135106 -32133 124778 -54631 35764 126997 43324 299673 97668
17737H6509b9161D7625i3536B16812J09797r1004O8447f3111I7770f9463J0934
$$ 86509 -29161 47625 -93536 216812 326609 235605 304052 -63111 97770 -69463 -58529
17726e8529A71842J2111k0444b27291N0962a3977o7208f656C8372a1585j39813
$$ -58529 171842 183953 163509 -227291 -176329 -13977 -81185 -6656 38372 -11585 -151398
17715a51398I3780m5339Q4426b7595B4320b58205e1968j17688A07928L50996B20605
$$ -151398 93780 48441 132867 -27595 24320 -258205 -51968 -169656 107928 458924 220605
17703g8791l0970D475K29505a36542D1239K62980f6226I5023F820L5863K18852
$$ -78791 -109761 4475 233980 -136542 41239 304219 -66226 95023 6820 42683 261535
17692B61535J53778G6828b56283J12153j02184d9779B92326A20763D8324K20409
$$ 261535 415313 76828 -256283 -144130 -246314 -49779 292326 120763 48324 268733
17682B68733E3280a96943i303G8828I256b9063B59840h5061N945a1266C677K20159
$$ 268733 53280 -196943 -9303 78828 9256 -29063 259840 -85061 -79116 -11266 3677 223836
17670B23836A0260e4104J3589B83234h0717F4163K25602q1985a10106N2673A48565
$$ 223836 10260 -54104 -40515 283234 -80717 64163 289765 207780 -110106 -57433 148565
17658e8889F6847c7676k16725c50j76276E3916J58408n167J08942A3643c47922
$$ -58889 66847 -37676 -254401 -350 -176626 53916 212324 207157 316099 13643 -347922
17646F9343i164A1894a10109B87537E3850K34017A36935M8991a11054B53471H2626
$$ 69343 -9164 11894 -110109 287537 53850 287867 136935 185926 -111054 253471 82626
17634f9708l222b4596d704F3802M9561D9305Q5153c0427J4530A21791I616a92537
$$ -69708 -72930 -24596 -4704 63802 113363 49305 134458 -30427 -15897 121791 9616 -192537
17621B79437I9946a60998L0152C0967O3980a11136A21901g2430a6598j9526H9319
$$ 279437 99946 -160998 -130846 30967 94947 -111136 121901 -72430 -16598 -36124 89319
17609B31315O1055k5329k8707a79153a8406B23556j03921M8305P112n0338E5832
$$ 231315 292370 267041 238334 -179153 -18406 223556 119635 167940 175052 124714 55832
17597D1782J08999o4029d3245I0736a02419B42474J62092j22362e5825B5774R2538
$$ 41782 150781 86752 -43245 90736 -102419 242474 404566 282204 -55825 25774 118312
17586A18312m9034a1180A86638a3124j27075j4420B42954b1183r3670M3066k45466
$$ 118312 69278 -11180 186638 -13124 -140199 -154619 242954 -21183 -114853 -71787 -317253
17575c17253g779j08410M0102A35052E0403J48934h1518B38028a56576D01151
$$ -317253 -7779 -116189 -76087 135052 50403 199337 -81518 238028 -156576 401151
17564G0792a56573A16035d294j03894b7154J2059j49602A33817J81365c4312l3550
$$ 70792 -156573 116035 -4294 -108188 -27154 -15095 -164697 133817 315182 -34312 -67862
17553f7862j03939b4820B51182c45024J42156Q8906J3785b8793o06m0679o1578
$$ -67862 -171801 -24820 251182 -345024 -202868 -113962 -100177 -28793 -29399 -70078 -131656
17542a31656B58099B5596D487b32687N5642A007b58p1228H5121B6251Q4763M12317
$$ -131656 258099 25596 4487 -232687 -177045 1007 -258 -71486 85121 26251 111014 523331
17530E23331a19014A15356C165K20079p1649d6629B7576K37394H3691J74869c9715
$$ 523331 -119014 115356 3165 223244 151595 -46629 27576 264970 83691 258560 -39715
17518B72071a35684A43060l7748L02900a43436B4054J94619p0482d6112C02067
$$ 272071 -135684 143060 105312 408212 -143436 24054 218673 148191 -46112 302067
17507H8046O2387B1605J904J42341a15167k64450P0339C12L33046o3972E6535
$$ 88046 150433 21605 23509 165850 -115167 -379617 -309278 312 333358 269386 56535
17495C822e4850I5016b73413A92554p5650L389d8201k43853A17492k4446g4441
$$ 3822 -54850 95016 -273413 192554 116904 120293 -48201 -292054 117492 93046 -74441
17483D58433j13380A65468n3985L0592g463A70035a77895C07227N334A01366q599
$$ 458433 345053 165468 111483 142075 -7463 170035 -177895 307227 312561 101366 92767
17472I2767f6069B91422a20595B73231a46753D03542j06945O7505A80621J50694
$$ 92767 -66069 291422 -120595 273231 -146753 403542 296597 364102 180621 331315
17462C31315j24780c86749I1942a27745B03299r9997K78647A67555i9665A01122
$$ 331315 206535 -386749 91942 -127745 203299 103302 381949 167555 -99665 101122
17451G7444J57121K05561b11289E37204A02546K03370L7124N9622A41422R4906
$$ 77444 234565 440126 -211289 537204 102546 305916 343040 402662 141422 236328
17441B36328q0254a951D87412a1498F6749D349c96719A11642n0843J53073K12857
$$ 236328 156074 -1951 487412 -11498 66749 4349 -396719 111642 60799 213872 426729
17430D26729A77697n4848J12307L8936A31019R6087g7686E50234A41939J65413
$$ 426729 177697 122849 235156 274092 131019 227106 -77686 550234 141939 307352
17420C07352C0623J77809E3230J29842J68080n717F5564j608a0945m11817B43573
$$ 307352 30623 208432 53230 183072 351152 345435 65564 63956 -10945 -422762 243573
17408C89941A32464J99880p7684c5202C57237A75831j2363M8154a31362B26326
$$ 389941 132464 332344 254660 -35202 357237 175831 163468 211622 -131362 226326
17397C21789G4531a10893B38529a2863j08815A69052R3422b40585A33874K99685
$$ 321789 74531 -110893 238529 -12863 -121678 169052 262474 -240585 133874 433559
17387D33559J19625c10659C52643F9183K51809E6270L00931A74276m571J14300
$$ 433559 553184 -310659 352643 69183 320992 56270 357201 174276 169705 284005
17377B84005J33512j87998P841p7893j8523k3748M9135E8467O6953c1620C4991
$$ 284005 417517 229519 237360 159467 140944 117196 166331 58467 125420 -31620 34991
17365C06333A27294d1655A05290O9253h9385o3153F5643K08294A34727L0246G8755
$$ 306333 127294 -41655 105290 174543 -89385 -152538 65643 273937 134727 164973 78755
17353G1229a83017B11457K7813J66098A1162J70172b3839A96429l3351a23291
$$ 71229 -183017 211457 239270 405368 11162 181334 -23839 196429 163078 -123291
17342C95111E8222J83827H661B000P8060b09711G4869J05776q3605m293N328j1867
$$ 395111 58222 242049 8661 2000 80060 -209711 74869 180645 97040 92747 98075 86208
17330H6208L40010H7113J17013J74846o7948j26880J52392a25816A08077J94947
$$ 86208 426218 87113 204126 378972 311024 184144 336536 -125816 108077 303024
17320C03024d6900k03916A93021n113l4785L0894q2065J62289o2210J78405j16241
$$ 303024 -46900 -250816 193021 187908 153123 184017 101952 264241 202031 380436 264195
17309B64195b08308B33932l7327p7688J56461P1997O11d427B53082J01087O0355
$$ 264195 -208308 233932 196605 118917 275378 347375 347986 -4427 253082 354169 414524
17298D14524C6250a78549C7276J13186a35958E50807g9226C51807j23551J56484
$$ 414524 36250 -178549 37276 150462 -135958 550807 -79226 351807 228256 384740
17288C84740j05703P4278h2496A7752L25203N3650A89900L6239P3026G3474K95083
$$ 384740 279037 353315 -82496 17752 342955 396605 189900 226139 299165 73474 368557
17277C68557a8234C16752n1482l2644p4036K47621p1908j1277j35976p7619R1134
$$ 368557 -18234 316752 265270 232626 158590 406211 334303 323026 187050 109431 200565
17266B00565L43K1239k8797L9054K61949a66838C64540j27834d3600G16M75445
$$ 200565 200908 222147 193350 232404 494353 -166838 364540 236706 -43600 716 476161
17255D76161A7241J25366K45860a13359A62685Q9055J78618B01488K94775j40484
$$ 476161 17241 142607 388467 -113359 162685 251740 430358 201488 496263 355779
17245C55779A40385o5681J75414l7497L04229k00584A33392J66022J66629J89152
$$ 355779 140385 74704 250118 212621 516850 316266 133392 299414 466043 655195
17235F55195B01634Q3380C3583N71452I9721M7483N9054m4174n5902J38722K57187
$$ 655195 201634 285014 33583 605035 99721 147204 206258 162084 106182 244904 502091
17224E02091A12340P0901R2672J06117C9659M30624j83440J47747A55769b7616
$$ 502091 112340 183241 275913 382030 39659 470283 286843 434590 155769 -27616
17213C01915a55627B97198M6872j18058R3803M1043D2152J18852K24139J57551
$$ 301915 -155627 297198 344070 226012 319815 360858 42152 161004 385143 542694
17203E42694k26974n3417A5277J07448A0589M01876J9896j3242j24376J3594P1009
$$ 542694 315720 262303 15277 122725 10589 412465 432361 419119 294743 308337 379346
17192C79346E6324J16412L79797B39634q4270P0076L14646B50766n8976N70693
$$ 379346 56324 172736 552533 239634 155364 225440 540086 250766 191790 762483
17182G62483A91894J71846l3003J10276E1895J81135K07342j6059p8260A40404
$$ 762483 191894 363740 330737 441013 51895 233030 440372 424313 346053 140404
17171D12561J08306A28588L07790Q8892O5692B42595A06444J60704O7883J88954
$$ 412561 520867 128588 436378 525270 590962 242595 106444 267148 335031 523985
17161E23985A97923P6456J61096j56311j23156L52053Q323j98148L21280o0242
$$ 523985 197923 274379 435475 279164 156008 508061 516384 318236 639516 579274
17151E79274k79773P4543A08818J63296n1829r4176L54829B27934K32301j72358
$$ 579274 299501 374044 108818 272114 220285 126109 480938 227934 460235 287877
17141B87877L19914j97775j80563J26143D865O61533A27696L94031A61472K04793
$$ 287877 607791 410016 229453 355596 4865 666398 127696 521727 161472 366265
17131C66265J65516k05178L60287k07900j41798R7291J57936j23443N3943j27106
$$ 366265 531781 326603 686890 478990 337192 434483 592419 468976 522919 395813
17121C95813J47451j73765K63580l07180k6667M29482B10415L40968o8517B01512
$$ 395813 543264 369499 633079 325899 299232 728714 210415 551383 482866 201512
17110D55261K2478J9258j5094r4154J36976k3640j59913K1127M54335D06464J17404
$$ 455261 477739 496997 481903 387749 524725 501085 341172 362299 816634 406464 523868
17099E23868J6630n3673M2080k57160J41745K32326j54227E1919L26795P4837
$$ 523868 540498 486825 528905 271745 413490 645816 491589 51919 378714 453551
17089D53551M91082D38383K7562B18011K83657K3865K14107j3043j04612k30401
$$ 453551 944633 438383 465945 218011 501668 525533 739640 726597 621985 391584
17079C91584j02480Q7737K43592l3720J34549J93754C05775K56822p007j5147
$$ 391584 289104 376841 620433 586713 721262 915016 305775 562597 555590 540443
17069E40443k10835J76135N8492l4678K7794m1657p2101R0783L0785K49155j09133
$$ 540443 329608 505743 564235 529557 557351 515694 443593 534376 565161 814316 705183
17058G05183L565j67113r922J54763j28739n0492K44220m1542j47962K36550J890
$$ 705183 708748 541635 531713 686476 557737 507245 751465 709923 561961 798511 800401
17047H00401k90035M0781K19914r5289n2959J01457C58035K83765J54378J37133
$$ 800401 510366 551147 771061 675772 622813 724270 358035 641800 796178 933311
17037I33311j96273k07017J60890K2519k5662k58517K05386L78811K1466k89781
$$ 933311 737038 530021 690911 713430 687768 429251 634637 1013448 1034914 745133
17027G45133j2200J43448P6502l7059j91322J63988J98036k75455J06591r0959
$$ 745133 732933 876381 952883 915824 724502 888490 1086526 811071 917662 826703
17017H26703k70744L99287j92688p2300P4536L53319k96843O6230J8965j13605
$$ 826703 555959 955246 762558 690258 764794 1118113 821270 887500 906465 792860
17007G92860K07875J06588l45512P1942p3694J06333L20806n25442K65196J66053
$$ 792860 1000735 1107323 761811 833753 760059 866392 1187198 661756 926952 1093005
16997A093005j50513j06388j20810R9460k58537M16343j14283j71926M89782j07650
$$ 1093005 942492 836104 715294 814754 556217 972560 858277 686351 1176133 1068483
16987A068483R038L25844m44615J28672j68328J91131l4410M22012l68446J14174
$$ 1068483 1077521 1403365 958750 1087422 919094 1110225 1075815 1497827 1129381 1243555
16977A243555j47060j38388J2637m9696K63249n5848j8859J56350j87118J47843
$$ 1243555 1096495 958107 970744 921048 1184297 1128449 1109590 1265940 1078822 1226665
16967A226665k95037K51797K9541j09580k49063M55937n1028m1757j05712L5173
$$ 1226665 931628 1183425 1212966 1103386 854323 1310260 1259232 1217475 1111763 1146936
16957A146936j43092M04832J16094l7497p0938j07976M3382L60663n08594K73309
$$ 1146936 1003844 1408676 1524770 1487273 1416335 1308359 1351741 1712404 1203810 1477119
16947A477119J78073j41907J43638M4116l45492J25135j84178K94078K20771n31500
$$ 1477119 1655192 1513285 1656923 1701039 1355547 1480682 1296504 1590582 1811353 1279853
16937A279853J81703J09271R1498q7164j4654Q9915m3035Q4927j63394r0203L27442
$$ 1279853 1461556 1570827 1662325 1575161 1560507 1650422 1607387 1692314 1528920 1438717 1766159
16926A766159k1409J82941k46795n2142P4333L13813P6019l19902M05603j88181
$$ 1766159 1744750 1927691 1680896 1628754 1703087 2016900 2092919 1773017 2178620 1990439
16916A990439q3794J72230K04168k33900R9089J0754Q3423j62235K80832l49196
$$ 1990439 1906645 2078875 2283043 2049143 2148232 2158986 2242409 2080174 2361006 2011810
16906B011810P3965K94129j47236K38084k57064J95905k44944J75519Q6019j66657
$$ 2011810 2085775 2379904 2232668 2470752 2213688 2409593 2164649 2340168 2426187 2259530
16896B259530L6644q0626Q50100o12458K55395k42053K12141J08090J15126k3194
$$ 2259530 2296174 2215548 3065648 2453190 2708585 2466532 2678673 2786763 2901889 2878695
16886B878695K38458l8660l60565J38899M16436l31064J64640P0535q2785o1099
$$ 2878695 3117153 3078493 2717928 2856827 3273263 2942199 3106839 3177374 3094589 3033490
16876C033490j96778N73300j41208j38115L44770K33008m58482K54202J98962
$$ 3033490 2836712 3410012 3268804 3130689 3475459 3708467 3249985 3504187 3703149
16867C703149K414l80274M43391K54656j11995l7675M0800j84304K99744K065
$$ 3703149 3705563 3325289 3768680 4023336 3911341 3873666 3914466 3730162 4029906 4031971
16857D031971j5145J89001q8857L45451j65155M48965o8910n2573L40874k07833
$$ 4031971 4016826 4205827 4116970 4462421 4297266 4746231 4677321 4624748 4965622 4757789
16847D757789J73080j20954J13238K03387K11587J5326M0205J51090L09857J99559
$$ 4757789 4930869 4809915 4923153 5126540 5338127 5353453 5393658 5544748 5854605 6054164
16837F054164j83056k3083J81795K56029j62222n3002K15133P891N98294j26152
$$ 6054164 5871108 5848025 6029820 6285849 6123627 6070625 6285758 6293649 6891943 6765791
16827F765791J38230J80932R6987P3390K11016K77056J24857r905K16214R623
$$ 6765791 6904021 7084953 7181940 7255330 7466346 7743402 7868259 7858354 8074568 8084191
16817H084191M82362J9898M6397M51555k26115N78506L49788P4569j4678N8794
$$ 8084191 8566553 8586451 8632848 9084403 8858288 9436794 9786582 9861151 9846473 9905267
16807I905267O75641K8380L96889J52473L5371M62585L50854O50600q1951L25392
$$ 9905267 10580908 10609288 11006177 11158650 11194021 11656606 12007460 12658060 12576109 12901501
16797A2901501L56341M46040L44206M51406M2588M57570L47909O01475K60701
$$ 12901501 13257842 13703882 14048088 14499494 14542082 14999652 15347561 15949036 16209737
16788A6209737M19000N64448O35922K27840Q39366M69407R31775K13508P78584
$$ 16209737 16628737 17193185 17829107 18056947 18896313 19365720 20297495 20511003 21289587
16779B1289587N47876M33802J476345M08696M53965P54133R64807P19174J179945
$$ 21289587 21837463 22271265 23747610 24156306 24610271 25364404 26329211 27048385 28228330
16770B8228330O27892J286095J176112J313562J048512R10240J606689R41095
$$ 28228330 28856222 30142317 31318429 32631991 33680503 34590743 36197432 37138527
16762C7138527J465388J765960J582410J616884J540062J790663K208206J551975
$$ 37138527 38603915 40369875 41952285 43569169 45109231 46899894 49108100 50660075
16754E0660075K124112K562109J678617K483378K535866K375630K842998K770771
$$ 50660075 52784187 55346296 57024913 59508291 62044157 64419787 67262785 70033556
16746G0033556L116163L006611L043486L132917L152472L479005L078493L113589
$$ 70033556 73149719 76156330 79199816 82332733 85485205 88964210 92042703 95156292
16738I5156292L668702L508577L505237K942555L284099L025369K687776K812608
$$ 95156292 98824994 102333571 105838808 108781363 112065462 115090831 117778607 120591215
16730A20591215K263702K194233J617774J388828R44206Q91923K95180n34164
$$ 120591215 122854917 125049150 126666924 128055752 128999958 129891881 130187061 129652897
16722A29652897n85026j160091j554382j499494k012879k505507k605846l155697
$$ 129652897 129067871 127907780 126353398 124853904 122841025 120335518 117729672 114573975
16714A14573975l007313l194680l429940l419444l587003k987569l489407l638416
$$ 114573975 111566662 108371982 104942042 101522598 97935595 94948026 91458619 87820203
16706H7820203l497183k978743l227963k836664l216174k907694k975214k868401
$$ 87820203 84323020 81344277 78116314 75279650 72063476 69155782 66180568 63312167
16698F3312167k172269k506696k526012k197633k079235k017611j901775j776561
$$ 63312167 61139898 58633202 56107190 53909557 51830322 49812711 47910936 46134375
16690D6134375k001516j457722j563352j731645j050092j396602j680132r86356
$$ 46134375 44132859 42675137 41111785 39380140 38330048 36933446 35253314 34266958
16682C4266958j449587j104198r55250j402828p11757q20955p56000j062019r52811
$$ 34266958 32817371 31713173 30757923 29355095 28643338 27822383 27066383 26004364 25051553
16673B5051553p99660o84966p62142n34427p31264m96535q23212m58103o55706
$$ 25051553 24251893 23566927 22804785 22270358 21539094 21042559 20219347 19761244 19105538
16664A9105538m28120q78839k30485o84567o33451J12449o72115k16988n28078
$$ 19105538 18677418 17798579 17568094 16883527 16250076 16362525 15690410 15473422 14945344
16655A4945344m73777m12922l29647k25266l20266l99107n26356M65022q14291
$$ 14945344 14471567 14058645 13728998 13503732 13183466 12784359 12258003 12723025 11908734
16646A1908734m07312L6250m43857p4408n06952l44583q0944l33278M7385l77768
$$ 11908734 11501422 11537672 11093815 11019407 10512455 10167872 10086928 9753650 9801035 9423267
16636I423267r230l95500j59667k915l30421N179l13985k85036j620l01493k23101
$$ 9423267 9414037 9018537 8858870 8855955 8525534 8530713 8216728 7931692 7930072 7628579 7405478
16625G405478k1725L3801k59537l06468L40892m13021l04784J45370m66584m6190
$$ 7405478 7383753 7417554 7158017 6851549 7192441 6779420 6474636 6620006 6153422 6107232
16615F107232m3769j29474J29910k43590m5273J12637o76796L17088k02276J41982
$$ 6107232 6063463 5933989 6063899 5820309 5775036 5887673 5210877 5527965 5325689 5467671
16605E467671l06504P3278l08145J41387k16688q5137l29262L11662r7120j58303
$$ 5467671 5161167 5234445 4926300 5067687 4850999 4765862 4436600 4748262 4651142 4492839
16595D492839O7225K5661k72316J66820j45003j95745k08031J55978k15788M48150
$$ 4492839 4560064 4585725 4313409 4480229 4335226 4139481 3931450 4087428 3871640 4319790
16585D319790n64766J14777L7674k68180K22775n30338J91537L2829m12377K51373
$$ 4319790 3755024 3869801 3907475 3639295 3862070 3331732 3523269 3556098 3143721 3395094
16575C395094k0892O9644L6823k87404K065N9845j7109j69395P2083j29555R358
$$ 3395094 3374202 3443846 3480669 3193265 3195330 3255175 3238066 3068671 3140754 3011199 3020557
16564C020557L44241k72258l40702J75175J11235J40429j79537n49137K1406K90682
$$ 3020557 3364798 3092540 2751838 2927013 3038248 3178677 2999140 2450003 2471409 2762091
16554B762091r2927k16750L13050k26531j03666k07063L29616L0182j87707R3731
$$ 2762091 2669164 2452414 2765464 2538933 2435267 2228204 2557820 2588002 2400295 2494026
16544B494026q1372l32542L12702n55035J71623N4222L23040j26862q3990J04670
$$ 2494026 2412654 2080112 2392814 1837779 2009402 2063624 2386664 2259802 2175812 2280482
16534B280482j21718k40442K69625j72727Q9057l0783J2142R1128l16923K6093
$$ 2280482 2158764 1918322 2187947 2015220 2104277 2073494 2085636 2176764 1859841 1885934
16524A885934j74913R6487k6354J03814j46512K38041k11295J34196l16324L76326
$$ 1885934 1711021 1807508 1781154 1884968 1738456 1976497 1765202 1899398 1583074 1959400
16514A959400m8104J58661j06469n75559M02137k56389K21784j64629P302j51350
$$ 1959400 1911296 2069957 1963488 1387929 1790066 1533677 1755461 1590832 1598134 1446784
16504A446784K29784j52967p37j07887J07268J65992l03017M86817n61440M35065
$$ 1446784 1676568 1523601 1522864 1414977 1522245 1688237 1385220 1872037 1310597 1745662
16494A745662n42746j903k3832M80697k72474n2581J08547N5986J43125l64065
$$ 1745662 1202916 1201013 1177181 1657878 1385404 1332823 1441370 1497356 1640481 1276416
16484A276416o4522K35679P189k15873n8683M37704m67192o2211l8276K39372
$$ 1276416 1211894 1447573 1454762 1238889 1180206 1617910 1150718 1088507 1050231 1289603
16474A289603L5881K1265j09589k22149m878M31149l63180K66685k76692j18592
$$ 1289603 1325484 1346749 1237160 1015011 1010133 1441282 1078102 1344787 1068095 949503
16464I49503J01486K801L11170l07686J10264Q0027k81199K87498m40486L2263
$$ 949503 1050989 1053790 1364960 1057274 1167538 1247565 966366 1253864 813378 845641
16454H45641k13941K85781N508P6490k06548L79107k60676p922J65419R378j90443
$$ 845641 631700 917481 922989 999479 792931 1172038 911362 903440 1068859 1078237 887794
16443H87794K14936J6135j68088r714k62675L34519l03304L26780J06681j92420
$$ 887794 1102730 1118865 950777 941063 678388 1012907 709603 1036383 1143064 950644
16433I50644j60227L21373m46383K10632n9433r7656J16944l5761M20969m54775
$$ 950644 790417 1111790 665407 876039 816606 718950 835894 800133 1221102 766327
16423G66327n3458B7389J019978L10049l89500k08529P4690n8603j0991k823j06975
$$ 766327 712869 27389 1047367 1357416 967916 759387 834077 775474 764483 761660 654685
16412F54685M4834L7250q3503K29270k10724Q2594q6813k8749k0696K93534k42752
$$ 654685 699519 736769 653266 882536 671812 754406 667593 638844 618148 911682 668930
16401F68930O1640J34073k36814J03245J96339l0347C42359M38519j17825P3475
$$ 668930 730570 864643 627829 731074 927413 897066 342359 780878 663053 736528
16391G36528m282n3964K73055p7137j63422j74324j51754L41331k9931J34760
$$ 736528 732246 678282 951337 874200 710778 536454 384700 726031 696100 830860
16381H30860p8429n9801K36945l41588A17235K63273J43001l7585m6612n118J51827
$$ 830860 752431 692630 929575 587987 117235 380508 523509 485924 439312 434194 586021
16370E86021K6121K75126k12137L8500B83340M51821l15624J38077J29371k90374
$$ 586021 612142 887268 675131 713631 283340 735161 419537 557614 686985 396611
16360C96611K65402J9044J2076n8234J8633k00125n396p7174J16197j92014J65526
$$ 396611 662013 681057 693133 634899 653532 453407 448011 370837 487034 295020 460546
16349D60546J58832k66027M12913k42373J13364J43461M1306B99837K24541K72003
$$ 460546 619378 353351 766264 523891 637255 780716 822022 299837 524378 796381
16339G96381k86100n6757K30788k77054j02283M07783C54975K376K02540j77440
$$ 796381 510281 453524 684312 407258 304975 712758 354975 357351 559891 382451
16329C82451A68011K01359j05632J67157j48694J078R4334J72310j10597j64985
$$ 382451 168011 369370 263738 430895 282201 283279 377613 549923 439326 274341
16319B74341J44988O8872r6192O4829L0595j25515j06777K73160k44167q2839
$$ 274341 419329 488201 392009 456838 487433 361918 255141 528301 284134 201295
16309B01295K21112J28060k0749k14472J01204L32118A51585J19905M09788k81696
$$ 201295 422407 550467 529718 315246 416450 748568 151585 271490 681278 399582
16299C99582j02550j23968K00711J85089F2410J67621p8646J176J46366F5660
$$ 399582 297032 173064 373775 558864 62410 230031 151385 152561 298927 65660
16288B25442N564P3419Q7449p1346L82799C40168J40051N1537j20639B01117O2590
$$ 225442 231006 304425 391874 320528 703327 340168 480219 531756 411117 201117 263707
16277B63707K3268G7675j0667K65541J38071N2212B45267d0390B21497J67085
$$ 263707 286975 77675 67008 332549 470620 522832 245267 -40390 221497 388582
16267C88582M1689K59446l23692A21828M9228K57075n9964P0854j39883o858c0065
$$ 388582 430271 689717 366025 121828 171056 428131 368167 439021 299138 292280 -30065
16255C90476j55094H0178K34689q500c9900B38714R6507l3202J14671j17916R9780
$$ 390476 235382 80178 314867 306367 -39900 238714 335221 302019 416690 298774 398554
16244C98554A46213J82256q5912q0113C5000K94409D6779Q7649O5941Q0942n8739
$$ 398554 146213 328469 242557 162444 35000 329409 46779 134428 200369 281311 222572
16233B22572p0000m1262J98890j46913P880K28444Q2037A70709g1206B06931J57321
$$ 222572 152572 111310 310200 163287 171167 399611 481648 170709 -71206 206931 364252
16222C64252H3416O28237l28542k7665A04707K87696G522K29976J68015l6004
$$ 364252 83416 711653 383111 355446 104707 392403 7522 237498 405513 369509
16212C69509h2889B48000p9410j3667K2488K04239J00042B03403K1347a16194
$$ 369509 -82889 248000 168590 154923 177411 381650 481692 203403 224750 -116194
16201I2805P8033c3367A89020L06998e5312A84248Q6815K23635j38533A33885
$$ 92805 170838 -33367 189020 496018 -55312 184248 271063 494698 356165 133885
16190C59881r7499C1007J45324C3224Q0912J3969J91451j30520b5581D5944a44826
$$ 359881 262382 31007 176331 33224 114136 128105 319556 189036 -25581 45944 -144826
16178A35892J65234l7979j00838L31559A90981O800q2703b40301b5712C12305
$$ 135892 301126 263147 162309 493868 190981 197781 115078 -240301 -25712 312305
16167e8658C61325j9793G261c38121H8803J0631i6185A49570R1983N3092E9757
$$ -58658 361325 341532 7261 -338121 88803 99434 -96185 149570 241553 294645 59757
16155a11021R257A33471h8019D83810H6445q579R9520B0319K13910A8535K52049
$$ -111021 -101764 133471 -88019 483810 86445 77866 177386 20319 234229 18535 270584
16144B70584H8327P6712Q3385A20691Q0219K42176A4347a86498b3752B21533G2783
$$ 270584 88327 165039 248424 120691 200910 443086 14347 -186498 -23752 221533 72783
16132a19352B30275p0408J74991A05836N0281L51575D2112L8127Q7240N828J96940
$$ -119352 230275 159867 334858 105836 156117 507692 42112 80239 167479 173307 370247
16121C70247b7721A64654o4910K30963r8490b974A24267m07c9828o5468j4169
$$ 370247 -27721 164654 99744 330707 232217 -2974 124267 123860 -39828 -105296 -119465
16110a19465e8015B34363K72793j85858A16929g2906B06063l4189k8564K68246
$$ -119465 -58015 234363 507156 321298 116929 -72906 206063 171874 143310 411556
16100D11556J7542A33177J08368K7879j29443O6870b17295B11508a39921I5907
$$ 411556 429098 133177 241545 269424 139981 206851 -217295 211508 -139921 95907
16089a07930B6189c2965A73271b40B38068Q9254G9513a67035b1151A7972J24804
$$ -107930 26189 -32965 173271 -240 238068 327322 79513 -167035 -21151 17972 142776
16078A42776J46100A36041g0745a1237j26520D63120B23175G6249M3831a57138
$$ 142776 288876 136041 -70745 -11237 -137757 463120 223175 76249 120080 -157138
16067A44649J8094l0372a49861O588A46283c9163r763A18575M7096C3834g7382
$$ 144649 162743 132371 -149861 -143273 146283 -39163 -48926 118575 165671 33834 -77382
16055c9864j8227I7134k6352R0546m7794K01702b3335p5807F173K94109p14A8632
$$ -39864 -58091 97134 70782 161328 113534 315236 -23335 -99142 6173 300282 299568 18632
16042d3921j53772A22829m5245a46005b0653B33951q8024P3941g1284B49110M5948
$$ -43921 -197693 122829 77584 -146005 -20653 233951 145927 219868 -71284 249110 295058
16031B95058J2862C1719J25543i7438C8113e1517m61794A20350j7924a7275j02035
$$ 295058 307920 31719 157262 -97438 38113 -51517 -513311 120350 102426 -17275 -119310
16020a19310B41696j10404a66419P3968j82209A11074m2623c9838A53686b18641
$$ -119310 241696 131292 -166419 -92451 -274660 111074 68451 -39838 153686 -218641
16009i8889r3959C9604b37880R6211b1159C12591d2350D00807j54659a54253A21212
$$ -98889 -192848 39604 -237880 -141669 -21159 312591 -42350 400807 246148 -154253 121212
15997E0436M32634A2017Q7087C7662L69167A754d1534C3510a49264N5221k01245
$$ 50436 483070 12017 99104 37662 406829 1754 -41534 33510 -149264 -94043 -295288
15986b95288E8826e0836A45230q767C1475M60262k17064J6328r0748b58302I3388
$$ -295288 58826 -50836 145230 136463 31475 491737 274673 291001 200253 -258302 93388
15974a39689L1224j2600B7335a25106B86357E1896f0741j27919E281M43510F0163
$$ -139689 -108465 -121065 27335 -125106 286357 51896 -60741 -188660 5281 448791 60163
15962A18403b54420g7577I1588c2688A22734D7039d5205k26415I1649D3334p940
$$ 118403 -254420 -77577 91588 -32688 122734 47039 -45205 -271620 91649 43334 35394
15951C5394f6034C25639H9293J61689a22090C27828g5761l8301A91068e1861A02831
$$ 35394 -66034 325639 89293 250982 -122090 327828 -75761 -114062 191068 -51861 102831
15939C99481D2702a06542r1032Q9717l51098c9146B28105o6652k5794b158p9371
$$ 399481 42702 -106542 -197574 -107857 -458955 -39146 228105 161453 135659 -2158 -81529
15928h1529E2166J95099f2777E7776a59504P2461q4343e9795m4929j53240I2142
$$ -81529 52166 247265 -62777 57776 -159504 -87043 -171386 -59795 -104724 -257964 92142
15916A36513a45968B34308a15324D2214K71463I2841l3907c5845H2391J55112
$$ 136513 -145968 234308 -115324 42214 313677 92841 58934 -35845 82391 237503
15906B37503K6054A16507Q8906E7331h2180A21289R0540j9447a47151B86355a0732
$$ 237503 263557 116507 205413 57331 -82180 121289 211829 192382 -147151 286355 -10732
15894F839J1161J03240R1573A04624b75511B73923m5795b49400H3385C7389b3918
$$ 6839 18000 121240 212813 104624 -275511 273923 228128 -249400 83385 37389 -23918
15882d1625h664F9275d3270K0457l9399k78178b7332A35517b57279I0953A0762
$$ -41625 -8664 69275 -43270 -22813 -62212 -340390 -27332 135517 -257279 90953 10762
15870A00641e9498l40494a02492B93573h4620q9527A72897c7305B3141J46869
$$ 100641 -59498 -399992 -102492 293573 -84620 -174147 172897 -37305 23141 170010
15860A70010C332K0663a31372A47274f5888B8764h8865o2611E0409L4141b258
$$ 170010 3332 23995 -131372 147274 -65888 28764 -88865 -151476 50409 84550 -2258
15848A11575c20233e3660D6406A4441i4280a9803j99022C78560a17074m6411D66
$$ 111575 -320233 -53660 46406 14441 -94280 -19803 -218825 378560 -117074 -163485 466
15836F7552a88388e8041j7623j21358A69545a48086G1994a98362h9395A10480
$$ 67552 -188388 -58041 -75664 -197022 169545 -148086 71994 -198362 -89395 110480
15825A60728C7166P4151K17250I7593K88886j77183p3715d9735j22346B87388
$$ 160728 37166 111317 328567 97593 386479 209296 135581 -49735 -172081 287388
15814B67046A13433b75114R6379H5472A1048d3632j17872o7168G6221J79473K0312
$$ 267046 113433 -275114 -178735 85472 11048 -43632 -161504 -228672 76221 255694 276006
15803B76006A10443C0958b71005J14274A9004a02532A0384e8240A51233l6537
$$ 276006 110443 30958 -271005 -156731 19004 -102532 10384 -58240 151233 114696
15793A14696b16406h3849F2160q796f5711M071j83018A49670f4415C5669L4714
$$ 114696 -216406 -83849 62160 53364 -65711 -61640 -244658 149670 -64415 35669 70383
15782G0383J77927o7103a77403J9740A13934b10300f2781A44641Q1218H9347d09084
$$ 70383 248310 181207 -177403 -157663 113934 -210300 -62781 144641 225859 89347 -409084
15770e4G7575b11736e0773F9272a19195A58670c30209M666F5731K1442c06801
$$ -54 77575 -211736 -50773 69272 -119195 158670 -330209 -325543 65731 87173 -306801
15758h187B79244H7940c4958r644B01912d20056A44040D6111K15200J6736b76531
$$ -8187 279244 87940 -34958 -44602 201912 -420056 144040 46111 261311 278047 -276531
15746e1718E9469h2714H5706j9724l2497J03485B7148b24385a11634I9046b55204
$$ -51718 59469 -82714 85706 65982 33485 136970 27148 -224385 -111634 99046 -255204
15734E9475Q8326O0465i2107A42089b14058A9495J66905a37534A29426F2489l0646
$$ 59475 147801 208266 -92107 142089 -214058 19495 186400 -137534 129426 62489 31843
15723C1843c63899a17882e996j03261f023k19880B42711b43547D9992N2347b59829
$$ 31843 -363899 -117882 -5996 -109257 -6023 -225903 242711 -243547 49992 102339 -259829
15711D31203h8397B82618a01886E2787m778A9903R9863b99155a08986l1312k10009
$$ 431203 -88397 282618 -101886 52787 48009 19903 119766 -299155 -108986 -140298 -350307
15700c50307d7428C1971c07723e4345k3477L4756l21814D0081d92685B74266q430
$$ -350307 -47428 31971 -307723 -54345 -77822 -43066 -364880 40081 -492685 274266 265836
15689B65836F9838J11617C8932a79101A25046K4275j6763b7649h329q0008j28850
$$ 265836 69838 181455 38932 -179101 125046 149321 132558 -27649 -8329 -88337 -217187
15678b17187A63840a69296C9783M5230a20322j68639E1825P7331K0040d6943N901
$$ -217187 163840 -169296 39783 85013 -120322 -288961 51825 129156 149196 -46943 -41042
15667d1042A32052h3399A22419a44309l19213D559L0623h9307G2716a36065j6778
$$ -41042 132052 -83399 122419 -144309 -463522 4559 35182 -89307 72716 -136065 -152843
15656a52843E9407k3106A0565L4611L7067C9153f5j14201L9376B26709i5534C44840
$$ -152843 59407 36301 10565 45176 82243 39153 -65 -114266 -74890 226709 -95534 344840
15643a35786G8210N7710h0286o2353e5930b2020A98502c2529D37305a46458B5332
$$ -135786 78210 135920 -80286 -142639 -55930 -22020 198502 -32529 437305 -146458 25332
15631a78364j08760g5682E38c25282i0389G8416f0248H1948c9992j36984f1309
$$ -178364 -287124 -75682 538 -325282 -90389 78416 -60248 81948 -39992 -176976 -61309
15619B7360a69788B17376C3639Q201i7715A83533l0925a41434E6591J8977C1315
$$ 27360 -169788 217376 33639 41840 -97715 183533 152608 -141434 56591 75568 31315
15607e2476F9695b01691j3409K7522B17058d1794D8651a42445D60375a06306b5283
$$ -52476 69695 -201691 -215100 -187578 217058 -41794 48651 -142445 460375 -106306 -25283
15595c491p4570L0789H2720C0611a00788K7413j20827Q7722j13657i4707J6903
$$ -3491 -78061 -47272 82720 30611 -100788 -73375 -194202 -106480 -220137 -94707 -77804
15584g7804H3787J12316E6731j9933K39990d2192i820F10401D6532K7153J8638
$$ -77804 83787 196103 56731 36798 276788 -42192 -9820 610401 46532 73685 92323
15573I2323a20859j47342J32713B2836J16368b9398A946e750m922k10109J09513
$$ 92323 -120859 -268201 -135488 22836 139204 -29398 1946 -5750 -10672 -220781 -111268
15562a11268B47924b97153B01881q9525H742J15290b10862A96728f6419C69871
$$ -111268 247924 -297153 201881 112356 8742 124032 -210862 196728 -66419 369871
15551A01965i0936M5348A10168J50678a74220B40903a20764C8823b22316a08525
$$ 101965 -90936 -45588 110168 260846 -174220 240903 -120764 38823 -222316 -108525
15540b54986R2180L344B54494r4378m6152b554q8597d5031A81363e4378F2822
$$ -254986 -162806 -159462 254494 160116 113964 -2554 -91151 -45031 181363 -54378 62822
15528b91470B0716J63848I1182Q5818a20843d3572H4997b5947G9260a18731A51265
$$ -291470 20716 184564 91182 177000 -120843 -43572 84997 -25947 79260 -118731 151265
15516F6245A1874c05296A37634C6565a19305j64455r4702A59172b68228d310k21947
$$ 66245 11874 -305296 137634 36565 -119305 -283760 -378462 159172 -268228 -4310 -226257
15505b26257R6636G5845j4245J62460c15590a8751E198O108J70499O7424g7857
$$ -226257 -129621 75845 61600 224060 -315590 -18751 5198 11306 181805 249229 -77857
15493c65166a28236A01175a56154B26425I1667A7852J75400J88732f1115e449
$$ -365166 -128236 101175 -156154 226425 91667 17852 193252 381984 -61115 -5449
15482A02646J85692a16212A8685J43709e8328A1489K92522a5287M90k03602A54426
$$ 102646 288338 -116212 18685 162394 -58328 11489 304011 -15287 -14797 -218399 154426
15470c86758A35730M2978k4943b29542R0861G31a83823h3309A39285h0546A86487
$$ -386758 135730 178708 153765 -229542 -138681 731 -183823 -83309 139285 -80546 186487
15458a4312B85946a14522k27533a07698j50771J9387A26352O4157a26101A93338
$$ -14312 285946 -114522 -342055 -107698 -258469 -239082 126352 190509 -126101 193338
15447A33881i7929c1061A48572N2849E1368D88i6803b5683B79791b5069q9060
$$ 133881 -97929 -31061 148572 201421 51368 488 -96803 -25683 279791 -25069 -114129
15436a14129M3216j31580A77358a90397H4436a11985n5155A87732J55066a65184
$$ -114129 -70913 -202493 177358 -190397 84436 -111985 -167140 187732 342798 -165184
15425a41634I5071j7273d7227k4623k55770D0953d0616p8531k6578O0137F9266
$$ -141634 95071 77798 -47227 -71850 -327620 40953 -40616 -119147 -145725 -85588 69266
15413b6897l2873K2098r1308L6698k4173L7422l72906A04108a8577A7787O6405
$$ -26897 -59770 -37672 -128980 -92282 -116455 -79033 -451939 104108 -18577 17787 84192
15402H4192k5975J83482f292j24244J0778D4488a12059l3737E23R9546J73785
$$ 84192 58217 241699 -6292 -130536 -119758 44488 -112059 -145796 523 100069 273854
15391B73854J85860b4440A16587a75299B1055J16561e2130l65068c1179k01485
$$ 273854 459714 -24440 116587 -175299 21055 137616 -52130 -417198 -31179 -232664
15381b32664F6833K2789B6175a83815A16522e0668C3635L32096c1690l01339b1297
$$ -232664 66833 89622 26175 -183815 116522 -50668 33635 365731 -31690 -333029 -21297
15369A71108o4461b567j58044c8777a37j29704j56568b9689A10824b6070D1002
$$ 171108 106647 -2567 -160611 -38777 -137 -129841 -286409 -29689 110824 -26070 41002
15357F9031d3880b455n9653M090C96383h0287k1223m05033B9227M3885K5177e0202
$$ 69031 -43880 -2455 -62108 -58018 396383 -80287 -101510 -506543 29227 73112 98289 -50202
15344g5546B9046b2946A62999B1348M34311A38946J6268c4056C54904a52153I2764
$$ -75546 29046 -22946 162999 21348 455659 138946 155214 -34056 354904 -152153 92764
15332a63724e9235H3036J2575a7757j62256A2533M1336J63566B253P8494J17919
$$ -163724 -59235 83036 95611 -17757 -180013 12533 53869 217435 2253 80747 198666
15321A98666a07205a4684k1664j51344A68649R0962j18518B3232J30829J3214
$$ 198666 -107205 -14684 -36348 -187692 168649 259611 141093 23232 154061 167275
15311A67275J97926d648l84588f8557B21247f4323j0211A44737h2102I3763e1490
$$ 167275 365201 -4648 -389236 -68557 221247 -64323 -74534 144737 -82102 93763 -51490
15299A54439c6673C27143R1061a32228H2564N6423b9204A17019J6529b0098k43162
$$ 154439 -36673 327143 418204 -132228 82564 138987 -29204 117019 133548 -20098 -263260
15288b63260B35667K6818r8687b19817M8863D76381j31062N7512a09377A08675
$$ -263260 235667 262485 163798 -219817 -170954 476381 345319 402831 -109377 108675
15277g3766A95248b09410E0176J16357a71527B01209B5708O7467O1637c17681
$$ -73766 195248 -209410 50176 166533 -171527 201209 25708 93175 154812 -317681
15266G4604J63533i3517L8441A31232e0867A99536R8944a33183f3835B59103b776
$$ 74604 238137 -93517 -55076 131232 -50867 199536 298480 -133183 -63835 259103 -2776
15254I4440R6568K9869g6157i254A61330K53157N57064M18340J233829p74950
$$ 94440 191008 220877 -76157 -9254 161330 414487 971551 1389891 2623720 1848770
15244A848770M54286l55132D17867j42080r6186B6884G502O0582B3687J16401
$$ 1848770 2303056 1947924 417867 275787 179601 26884 7502 68084 23687 140088
15234A40088E7959L5806K4808a25857C7685K80537j47269b5442j1998o3269I8808
$$ 140088 57959 93765 118573 -125857 37685 318222 170953 -25442 -37440 -100709 98808
15222c7857C46761E8305b0582j80526F1160a67099B33221E4862b65348C8484Q191
$$ -37857 346761 58305 -20582 -201108 61160 -167099 233221 54862 -265348 38484 46675
15211D6675J0606c15912C71466c477F5882K88222B5794e4989G6672e6846j05648
$$ 46675 57281 -315912 371466 -3477 65882 354104 25794 -54989 76672 -56846 -162494
15200a62494B60203A23367K01450l6761B1915N0170O2090L4967C107K74180o1770
$$ -162494 260203 123367 324817 288056 21915 72085 134175 169142 3107 277287 215517
15189B15517a27236A74948C2921J76149H1042R9775a642k1116C28032D9938J00026
$$ 215517 -127236 174948 32921 209070 81042 180817 -1642 -22758 328032 49938 149964
15178A49964D4713g6210j27432G086K51293a25136d0600k7880j07867C19304j50643
$$ 149964 44713 -76210 -203642 7086 258379 -125136 -40600 -68480 -176347 319304 168661
15167A68661O959a17020A63002m0076a99502C86922A9601J6699J05050l3902J65615
$$ 168661 175620 -117020 163002 122926 -199502 386922 19601 36300 141350 107448 273063
15156B73063r9343J17512A09169E3166P3144R345J88135P0462i4815E4055K25287
$$ 273063 173720 291232 109169 53166 126310 135655 323790 394252 -94815 54055 279342
15145B79342K8710A46365J27181h9184E8742i1937B34g9450p338A25825L3745
$$ 279342 308052 146365 273546 -89184 58742 -91937 234 -79450 -86788 125825 159570
15134A59570j0429k564K334J11803J87535A90086c3069B17140A02447J03771E2439
$$ 159570 149141 146577 148911 260714 448249 190086 -33069 217140 102447 206218 52439
15122B94213r0724K1368J5104N5972A40581K21673D4540J24350J45320j5680a04217
$$ 294213 203489 224857 239961 295933 140581 362254 44540 168890 314210 298530 -104217
15110B72965C4571K34465A01788N8623D6476a67813C66381j70436J00167o4751
$$ 272965 34571 269036 101788 160411 46476 -167813 366381 195945 296112 231361
15100B31361l278M0112A483a06520G6256j4386a60021C3789f333A04741J25492
$$ 231361 228083 268195 1483 -106520 76256 61870 -160021 33789 -6333 104741 230233
15089B30233Q7992p0493M2893j35117o3361n477Q5101M8454a87425B83187n6760
$$ 230233 318225 247732 290625 155508 92147 86670 171771 220225 -187425 283187 226427
15078B26427r2919d1795I1311L00584A60520J68111A13599B2728a90644C14590
$$ 226427 133508 -41795 91311 391895 160520 328631 113599 22728 -190644 314590
15067A92253E2829g8449D39264A96425a01293D35963A26424M34222f2309A53769
$$ 192253 52829 -78449 439264 196425 -101293 435963 126424 560646 -62309 153769
15056A87533a11009E7960N434P1925D0329J57621J24707C4850J35584A1403R3998
$$ 187533 -111009 57960 63394 135319 40329 197950 322657 34850 170434 11403 105401
15045A05401j3510J04575a58515A64489e7769k8976l4003B52962g3587E0571Q9280
$$ 105401 91891 196466 -158515 164489 -57769 -86745 -120748 252962 -73587 50571 139851
15034A39851J5728N8630F1688J11268j7082K09298o1307f995D20618D9141a41646
$$ 139851 155579 214209 61688 172956 155874 365172 303865 -6995 420618 49141 -141646
15022A78229a38893d2970j3208B40106A10021B325L10696B5682a16499n5483D17750
$$ 178229 -138893 -42970 -56178 240106 110021 2325 313021 25682 -116499 -171982 417750
15010B61983K05477K409j85096A12117C7456K8335M4499a62308B05512c5546C03827
$$ 261983 467460 469869 284773 112117 37456 65791 110290 -162308 205512 -35546 303827
14998A03882J96342D1010L91158j23708J19366k10070b24373C31864j30593K11968
$$ 103882 300224 41010 432168 308460 427826 217756 -224373 331864 201271 413239
14988D13239A68660l999j4661L69114A42811c7846B18721B9311a63356C2001K43380
$$ 413239 168660 164661 150000 519114 142811 -37846 218721 29311 -163356 32001 275381
14977B75381J84925J76525d1462o2630A07743a6759A87226b6568C06652H120L30109
$$ 275381 460306 636831 -41462 -104092 107743 -16759 187226 -26568 306652 8120 338229
14966C38229j08160J9633P9973m7507C7668b06118B45605J37069n1191J59755
$$ 338229 230069 249702 329675 282168 37668 -206118 245605 382674 331483 491238
14956D91238A68430K71197j63881p5369e8122A7877L66085E5292k5096L15073
$$ 491238 168430 439627 275746 200377 -58122 17877 383962 55292 30196 345269
14946C45269p0912J90047j03463j07713m6773K11067A16705K24182j36402b8042
$$ 345269 274357 464404 360941 253228 206455 417522 116705 340887 204485 -28042
14935E00598A82314J34739F6966J03420o4326N7964M9066n0823J3109e8745B38727
$$ 500598 182314 317053 66966 170386 106060 164024 213090 162267 175376 -58745 238727
14923A58698J00331L03432B076L96532A75630R1930A21077J99783j25529L16357
$$ 158698 259029 562461 2076 398608 175630 267560 121077 320860 195331 511688
14913E11688k30327j9431K08558j42480K1940j7340G9780L60714H9074L41259
$$ 511688 281361 261930 470488 328008 349948 332608 79780 440494 89074 430333
14903D30333q8704N2795H200L75362m1034p4969K72232A56851a1557C64916R1659
$$ 430333 341629 394424 8200 383562 342528 267559 539791 156851 -11557 364916 456575
14892D56575A85644J80973E9431J35513J88170A81634L01796B20414Q7811K96530
$$ 456575 185644 366617 59431 194944 383114 181634 483430 220414 308225 604755
14882F04755m2711p8861j45531J06585j88235J04881L2716M3411A12400L64774
$$ 604755 562044 483183 337652 444237 256002 360883 393599 437010 112400 477174
14872D77174b9936D43391A55535K67497l4413D1171M57089j73868K65072r5983
$$ 477174 -29936 443391 155535 423032 388619 41171 498260 324392 589464 493481
14862D93481j60795A24093L59923A19659K3601J11968J91150A23049k5431K62885
$$ 493481 332686 124093 484016 119659 143260 255228 446378 123049 97618 360503
14852C60503M2932K26760G5971P18769l53837A64562J63874C1799J73996L42668
$$ 360503 403435 630195 75971 794740 440903 164562 328436 31799 205795 548463
14842E48463j96131o1773K50593j35842P6192o8246J92717B34201J49272P6348
$$ 548463 352332 290559 541152 405310 481502 413256 605973 234201 383473 459821
14832D59821A53674L80349j76759K35938J45431C19723J15386p9476J22083L7415
$$ 459821 153674 534023 357264 593202 738633 319723 435109 355633 477716 515131
14822E15131R4626R5302C08981O0984L23880j59998j75799o0157K94413j21938
$$ 515131 609757 705059 308981 369965 693845 533847 358048 297891 592304 470366
14812D70366j0286j44146A09315L10081Q1070k00048M8463r6860O15343j5699
$$ 470366 460080 315934 109315 419396 500466 300418 348881 252021 867364 851665
14802H51665o2870J18511B49147L54007B84437Q119j4820J99501K37817B60669
$$ 851665 788795 907306 249147 603154 284437 292556 277736 477237 715054 260669
14791F01982L6717r1500q4778k9076K25730m1819k39398K20462j56138l6338J97398
$$ 601982 638699 547199 462421 433345 659075 617256 377858 598320 442182 405844 603242
14780F03242j4294M7408R9981C24982N02447q9926m4446j83268o0980K95441k47293
$$ 603242 588948 636356 736337 324982 827429 737503 693057 509789 448809 744250 496957
14769D96957J96276J31829B77873J20564O0240J31791B74466L79644j86357j44630
$$ 496957 693233 825062 277873 398437 458677 590468 274466 654110 467753 323123
14759C23123L35043l08259J71928j00023K38668j34583L53967C99559j29972L38640
$$ 323123 658166 349907 521835 421812 660480 525897 879864 399559 269587 608227
14749F08227B03987K43833M74351j07661l07732o4917O067L64311k77664m2397
$$ 608227 203987 447820 922171 814510 506778 441861 447928 812239 534575 492178
14739D92178N11700l44360l463L87833m19752L58557D79881L07127P8760j74455
$$ 492178 1003878 659518 656055 1043888 624136 982693 479881 787008 865768 691313
14729F91313N5709k43913J80969P4204O6900K9828J47977l59375L1526K48483
$$ 691313 747022 503109 684078 758282 825182 855010 1002987 643612 675138 923621
14719I23621l23550o4404K3714L82467j03978K72085l12751j28437L54826k66598
$$ 923621 600071 535667 559381 941848 837870 1109955 797204 668767 1023593 756995
14709G56995l66434L56767j63414M50556D77268K51299K78408k63886M20036m16353
$$ 756995 390561 747328 583914 1034470 477268 728567 1006975 743089 1163125 746772
14699G46772Q8129R6096n0822n5433K87413k19879k22304J19856J78364j39777
$$ 746772 834901 930997 880175 824742 1112155 892276 669972 789828 968192 828415
14689H28415R8488r2978j67726L8617k03887J98529K76721L1077j01629l07717
$$ 828415 926903 833925 666199 704816 500929 699458 976179 1007256 905627 597910
14679E97910K33658L12720k55764J67854k03206K24877m72942K2951J72934J41687
$$ 597910 831568 1144288 888524 1056378 853172 1078049 605107 628058 800992 942679
14669I42679j30335n9407J22001N03838m68571J27449J46479l70733J88915m2399
$$ 942679 812344 752937 874938 1378776 910205 1037654 1184133 813400 1002315 959916
14659I59916J73385j04043o8005J70539j33427j41949J97081J63677k16415J19436
$$ 959916 1133301 1029258 961253 1131792 998365 856416 1053497 1217174 1000759 1120195
14649A120195q126n9959J7757j79831L13752k65871J4783K89988J75018k62376
$$ 1120195 1112069 1052110 1069867 890036 1203788 937917 952700 1242688 1417706 1155330
14639A155330N25907F72536M42405Q4616j99382j09265L24143J5051k57176L08864
$$ 1155330 1681237 672536 1114941 1199557 1000175 890910 1215053 1230104 972928 1281792
14629A281792j14685J14882j2331M1758N6428J61245k34798J14272K3348j06075
$$ 1281792 1167107 1281989 1269658 1311416 1367844 1529089 1294291 1408563 1431911 1325836
14619A325836J646j20201m6633J76229O8922k7457q8524k7272J61126Q4287j82882
$$ 1325836 1327482 1207281 1160648 1336877 1405799 1378342 1289818 1262546 1423672 1507959 1325077
14608A325077j0079k10633M80239J67498l67620n9014m20662L41812N96717m88884
$$ 1325077 1314998 1104365 1584604 1752102 1384482 1325468 904806 1246618 1843335 1354451
14598A354451Q2973J78588l3703j82682K43128l97274O93412l92070L81925j50070
$$ 1354451 1437424 1616012 1582309 1399627 1642755 1245481 1938893 1546823 1928748 1778678
14588A778678j30385j23741J80987Q5603j11565K932K23390j32058k45932M16165
$$ 1778678 1648293 1524552 1705539 1791142 1679577 1682509 1905899 1773841 1527909 1944074
14578A944074l67014K26740j30531L14699M8051J1351j78993J68702N4719J67894
$$ 1944074 1577060 1803800 1673269 1987968 2036019 2047370 1868377 2037079 2091798 2259692
14568B259692l5410l0175l5521K34663n2597m6967K90729l07987K35038K4622
$$ 2259692 2224282 2194107 2158586 2393249 2340652 2293685 2584414 2276427 2511465 2536087
14558B536087M00188k84098O3059L42970J87704K48229L13730P40913R52943K373044
$$ 2536087 2936275 2652177 2715236 3058206 3245910 3494139 3807869 4548782 5501725 7874769
14548G874769M367714Q782390J8862018Q80900A6251951q004351m03699k866306
$$ 7874769 12242483 21024873 39886891 40767791 16251951 8247600 7843901 4977595
14540D977595k017638q85077k07515k24184N00102l59934K10700M5240l02508
$$ 4977595 2959957 2074880 1867365 1643181 2143283 1783349 1994049 2039289 1736781
14531A736781J22474N9891o9140K03790o2287J47142k56059J24443J76081p1137
$$ 1736781 1859255 1919146 1850006 2053796 1991509 2138651 1882592 2007035 2183116 2111979
14521B111979K48790k22287J61741K14203q6283j86121J65737J26273j10196k18084
$$ 2111979 2360769 2138482 2300223 2514426 2428143 2242022 2407759 2534032 2423836 2205752
14511B205752N08282j18470O2993k47642L57494J12331k00661K38401n6553r2142
$$ 2205752 2714034 2595564 2658557 2410915 2768409 2880740 2680079 2918480 2861927 2769785
14501B769785J30029j4013j20132K66285k03983M74664k82920n6508J2660p7127
$$ 2769785 2899814 2885801 2765669 3031954 2827971 3302635 3019715 2963207 2975867 2898740
14491B898740K35550j43209R2079J66919J25357l2321p8746m8377J24739Q8140
$$ 2898740 3134290 2991081 3083160 3250079 3375436 3343115 3264369 3215992 3340731 3428871
14481C428871K04222k04934L78071j03340K77517o3821q8644k7834l0728M85239
$$ 3428871 3633093 3428159 3806230 3702890 3980407 3916586 3827942 3800108 3769380 4254619
14471D254619r9226J0958k87854K49624l9754L46721k87283m6898L79753k29819
$$ 4254619 4155393 4166351 3878497 4128121 4088367 4435088 4147805 4100907 4480660 4250841
14461D250841N9117P504J166K12912J50522o3404L2656J08522J97985k93007K09594
$$ 4250841 4309958 4317462 4318628 4531540 4682062 4618658 4651314 4759836 4957821 4664814 4874408
14450D874408L5032L21360j68819K70116l02212M40247n7316k5062o8158J52987
$$ 4874408 4909440 5230800 5061981 5332097 5029885 5470132 5412816 5387754 5319596 5472583
14440E472583M77968k92657K92798j96740J94847J72617k4936L18774j85912O1542
$$ 5472583 5950551 5657894 5950692 5753952 5948799 6121416 6096480 6415254 6229342 6290884
14430F290884L42650J50918l00463n3377N95375O0590j9450Q2763L06132j38045
$$ 6290884 6633534 6784452 6483989 6430612 7025987 7086577 7067127 7149890 7456022 7317977
14420G317977J68645j8970q2519K27019L16574j11634K59902J30466K63854q7505
$$ 7317977 7486622 7467652 7385133 7612152 7928726 7817092 8076994 8207460 8471314 8383809
14410H383809J38603J40242J25039l02609K52409L30458M96646k12724J86154
$$ 8383809 8522412 8662654 8787693 8485084 8737493 9067951 9564597 9351873 9538027
14401I538027J03430L40587k8265L50264R0029M417L34064R9816L90308J07708
$$ 9538027 9641457 9982044 9953779 10304043 10394072 10398489 10732553 10832369 11222677 11330385
14391A1330385j26081M34012J81441N7484P09402k74538L57105K58033L0056L73616
$$ 11330385 11204304 11638316 11819757 11877241 12586643 12312105 12669210 12927243 12957299 13330915
14381A3330915K37794O08908J13132J49260k51134Q87392K08696N7638J98230
$$ 13330915 13568709 14177617 14290749 14440009 14188875 15076267 15284963 15342601 15540831
14372A5540831M09128O11502M1485N53394J49442N05404L42461R25581k27350
$$ 15540831 15949959 16561461 16602946 17156340 17305782 17811186 18153647 19079228 18851878
14363A8851878J075919l1114K40249P13443L36547M55410O01637M23830Q44809
$$ 18851878 19927797 19896683 20136932 20850375 21186922 21642332 22243969 22667799 23512608
14354B3512608L82496L93897P70385M36422Q26972L52089P16105Q40482M72413
$$ 23512608 23895104 24289001 25059386 25495808 26322780 26674869 27390974 28231456 28703869
14345B8703869J181203N24397R02975J068910P13098O13912J325399Q42031R48327
$$ 28703869 29885072 30409469 31312444 32381354 33094452 33708364 35033763 35875794 36824121
14336C6824121J072492J523982Q54466J044204J246745J505108J455620J486288
$$ 36824121 37896613 39420595 40275061 41319265 42566010 44071118 45526738 47013026
14328D7013026J030918J945427J762986J621359J829698K038710K249163J657648
$$ 47013026 48043944 49989371 51752357 53373716 55203414 57242124 59491287 61148935
14320F1148935K553241K321301K681193K355074K702769L210542K549487L527975
$$ 61148935 63702176 66023477 68704670 71059744 73762513 76973055 79522542 83050517
14312H3050517L162799L345781M046654L980535M342120M319125M936273M495002
$$ 83050517 86213316 89559097 93605751 97586286 101928406 106247531 111183804 115678806
14304A15678806N368752N909394N918185O307271O708407P324008P429665Q394384
$$ 115678806 121047558 126956952 132875137 139182408 145890815 153214823 160644488 169038872
14296A69038872P910206R359299R037971R938110J0945879J0856101J1809437
$$ 169038872 176949078 186308377 195346348 205284458 216230337 227086438 238895875
14289B38895875J2074585J2708893J3147911J3567616J4093031J4008242J4251207
$$ 238895875 250970460 263679353 276827264 290394880 304487911 318496153 332747360
14282C32747360J4352574J4520218J4220501J3813630J2890659J2484475J0439101
$$ 332747360 347099934 361620152 375840653 389654283 402544942 415029417 425468518
14275D25468518R322442O391981J595329o09472m44107n34808j618895m912853
$$ 425468518 434790960 441182941 442778270 442168798 441724691 441189883 439570988 434658135
14267D34658135n667217p640803j0656524j2889878j3721277j5204043j5544213
$$ 434658135 428990918 421350115 410693591 397803713 384082436 368878393 353334180
14260C53334180j5468770j5592404j5448260j5004492j4637774j3892601j3726139
$$ 353334180 337865410 322273006 306824746 291820254 277182480 263289879 249563740
14253B49563740j2413291j0885725j1475748j0903422j0729599r801992q994129
$$ 249563740 237150449 226264724 214788976 203885554 193155955 183353963 174359834
14246A74359834q746375q167279p237642p422973o430961o483352o196263n543848
$$ 174359834 165613459 157446180 150208538 142785565 136354604 129871252 123674989 118131141
14238A18131141m935158m724185n047665m139303m432846l572933l947896k854117
$$ 118131141 113195983 108471798 103424133 99284830 94851984 91279051 87331155 84477038
14230H4477038l748645k967788l339918k824796k579860k413174k448947k073632
$$ 84477038 80728393 77760605 74420687 71595891 69016031 66602857 64153910 62080278
14222F2080278k413668k264323j637227j947525j690267j758884j380155j909113
$$ 62080278 59666610 57402287 55765060 53817535 52127268 50368384 48988229 47079116
14214D7079116j038068j167198j854923j071811j293505j141567j107546n94230
$$ 47079116 46041048 44873850 43018927 41947116 40653611 39512044 38404498 37810268
14206C7810268j289947j121916j027341r44510q78505m14954j057631q87338q03885
$$ 37810268 36520321 35398405 34371064 33426554 32548049 32133095 31075464 30188126 29384241
14197B9384241r86071o22780o17493m86149o31111q07744q46398p19218k22425
$$ 29384241 28398170 27775390 27157897 26671748 26040637 25232893 24386495 23667277 23444852
14188B3444852j95628j226786j11108l47105m78114p28943l94759m05367j65833
$$ 23444852 23249224 22022438 21911330 21564225 21086111 20357168 19962409 19557042 19391209
14179A9391209o62917k86590m00145k75137j30054o18073l02155l46337l11388
$$ 19391209 18728292 18441702 18041557 17766420 17636366 17018293 16716138 16369801 16058413
14170A6058413l93755m70940K72040n95805k63732k58466m34647J4587j07643
$$ 16058413 15664658 15193718 15465758 14869953 14606221 14347755 13913108 13927695 13820052
14161A3820052o57106J95004m18063m05313n3530r5538m08911N0380m99636K7140
$$ 13820052 13162946 13357950 12939887 12534574 12481044 12385506 11976595 12026975 11527339 11554479
14151A1554479l89818j58622k67039M5990j37103j12957l14542r2129j73211m4504
$$ 11554479 11164661 11006039 10739000 10784990 10647887 10534930 10220388 10128259 9955048 9910544
14141I910544m26479j48499q0316l68759j576q3764r1629j01020J98256j24399
$$ 9910544 9484065 9335566 9255250 8886491 8884915 8801151 8709522 8608502 8806758 8682359
14131H682359k47705k37m14788J0652k56775p9322j70485n3659j37900j00134
$$ 8682359 8434654 8434417 8019629 8030281 7773506 7694184 7523699 7470040 7332140 7232006
14121G232006j01518L00110l77287k19444P5723n47573q578L50715j42869k15917
$$ 7232006 7130488 7430598 7053311 6833867 6909590 6362017 6353439 6704154 6561285 6345368
14111F345368J64165k94793j19404m9177j40027N24104o37105O0668k22823N883
$$ 6345368 6509533 6214740 6095336 6046159 5906132 6430236 5793131 5853799 5630976 5636859
14101E636859j73943J36155r1896q6280j25078K68746l47975L57725l74199r0029
$$ 5636859 5462916 5599071 5507175 5420895 5295817 5564563 5216588 5574313 5200114 5110085
14091E110085j92812M1679j33532m3813Q0819J20644l15718j50021j9436K56900
$$ 5110085 4917273 4958952 4825420 4781607 4862426 4983070 4667352 4517331 4497895 4754795
14081D754795k14215j1879k89596R9769m1234j43591K4231K21329J6161n07199
$$ 4754795 4540580 4528701 4239105 4338874 4297640 4154049 4178280 4399609 4415770 3908571
14071C908571M77504l57270j5516k72263P9779J46460p7101m84967L12527P9092
$$ 3908571 4386075 4028805 4013289 3741026 3820805 3967265 3890164 3405197 3717724 3796816
14061C796816J06405j40178n3807l61460L80019m02447J30339k5592j69400L00744
$$ 3796816 3903221 3763043 3709236 3347776 3727795 3325348 3455687 3430095 3260695 3561439
14051C561439j45976j00410k65777J86151k11554j49016M99054l35885j37988
$$ 3561439 3415463 3315053 3049276 3235427 3023873 2874857 3373911 3038026 2900038
14042B900038K18916q0282L5020j93424j39595l15527L32977j31657J69347L29544
$$ 2900038 3118954 3038672 3073692 2880268 2740673 2425146 2758123 2626466 2795813 3125357
14032C125357l88296K2003K00014m03719J36876K55753l68915p4886J46885l39460
$$ 3125357 2737061 2759064 2959078 2555359 2692235 2947988 2579073 2504187 2651072 2311612
14022B311612K74197m5860j4326J21995j38954q3799n8493k3849J07355o1137
$$ 2311612 2585809 2539949 2525623 2647618 2508664 2424865 2366372 2342523 2449878 2388741
14012B388741l38154r793k6324O4439L54401k00060j16779K4033J04303j42996
$$ 2388741 2050587 2040794 2014470 2078909 2433310 2233250 2116471 2140504 2244807 2101811
14002B101811j63430o9546L10021k12499L19145k06058k03090P2343K52704k87955
$$ 2101811 1938381 1868835 2178856 1966357 2285502 2079444 1876354 1948697 2201401 1913446
13992A913446p6812L25694M18315J312935L131389O455082J7792947J2989015
$$ 1913446 1836634 2162328 2580643 3893578 7024967 13480049 31272996 44262011
13984D4262011k1101489j1550574m356887j926648j382611n92132j12854m08262
$$ 44262011 23160522 11609948 7253061 5326413 3943802 3351670 3238816 2830554
13976B830554j29054J83292n84223L95315k04071l8641j35316k43565M85386l78543
$$ 2830554 2701500 2884792 2300569 2695884 2491813 2453172 2317856 2074291 2559677 2181134
13966B181134o6946L22831k37009q9414k56496K96247m9058o9008k3318J18582
$$ 2181134 2114188 2437019 2200010 2110596 1854100 2150347 2101289 2032281 2008963 2127545
13956B127545j68493J4458l51390L81241k7140k48024P2697J06221q870l27101
$$ 2127545 1959052 1973510 1622120 2003361 1976221 1728197 1800894 1907115 1898245 1571144
13946A571144J71679K20894m71638K23746k33009q8915L22028J4965r8220R7241
$$ 1571144 1742823 1963717 1492079 1715825 1482816 1393901 1715929 1730894 1632674 1729915
13936A729915J501Q050l72483K80215j15463l1091J58222k58420J89981j67156
$$ 1729915 1731416 1739466 1366983 1647198 1531735 1500644 1658866 1400446 1590427 1423271
13926A423271R7682r0944k33R5607J15095k61004L50887o06329L05695r3596K52394
$$ 1423271 1520953 1430009 1429776 1525383 1640478 1379474 1730361 1124032 1429727 1336131 1588525
13915A588525K5567l24444R2486j29900j4943L6511J54040p1853k01737j404L3890
$$ 1588525 1614092 1289648 1382134 1252234 1237291 1273802 1427842 1355989 1154252 1152848 1186738
13904A186738J07473J64758k40767k1087K71975K6768m11920M3596J42173j24740
$$ 1186738 1294211 1458969 1218202 1197115 1469090 1495858 1083938 1127534 1269707 1144967
13894A144967K9903k90198L63409l7774m6354j33094J28272l23115L52259L4792
$$ 1144967 1174870 884672 1248081 1210307 1163953 1030859 1159131 836016 1188275 1223067
13884A223067j67247J32713k59153L82727N8743j58627M4670K4509j32543k97314
$$ 1223067 1055820 1188533 929380 1312107 1370850 1212223 1256893 1281402 1148859 851545
13874H51545L63826J53564m86267J36569L65029n0174j18999J85786o13325J82345
$$ 851545 1215371 1368935 882668 1019237 1384266 1334092 1215093 1400879 787554 969899
13864I69899k10664K24509K19732j78145J43540j93555K82133k73169L0641J31681
$$ 969899 759235 983744 1203476 1025331 1168871 975316 1257449 984280 1014921 1146602
13854A146602j53526N3232k41696L30091k46666j39729K83683j49888Q6395Q9371
$$ 1146602 993076 1046308 804612 1134703 888037 748308 1031991 882103 968498 1057869
13844A057869q0724j64151N18745j94917k46543K10912k11797j79218J94567R4688
$$ 1057869 977145 812994 1331739 1136822 890279 1101191 889394 710176 904743 999431
13834I99431O6257j24233l08791j80764K8944L95361k13975L54345k02496j89657
$$ 999431 1065688 941455 632664 451900 480844 876205 662230 1016575 814079 624422
13824F24422J86413n806P4423j4649M1486l9069l95787R1473M84796l60517J1385
$$ 624422 810835 805029 879452 864803 906289 867220 471433 562906 1047702 687185 698570
13813F98570Q858J53095j43417J28964l0023l8084q9187J22736J1148k48035J40174
$$ 698570 707428 860523 717106 846070 816047 777963 688776 811512 822660 574625 714799
13802G14799N3681l19870K57740C14745L72499J31324k11973R8175l38392K29929
$$ 714799 768480 448610 706350 314745 687244 818568 606595 704770 366378 596307
13792E96307M1721J06575k43685L98786k39317N3989J0661J62963K8796l46714
$$ 596307 638028 744603 500918 899704 660387 714376 725037 888000 916796 570082
13782E70082K60143j25422j81189K99590k01780j09814K79835K50633m66960J20674
$$ 570082 830225 704803 523614 823204 621424 511610 791445 1042078 575118 695792
13772F95792k9284j61554r8724J81401J77764k06237J62868N989J45475j51771
$$ 695792 666508 504954 406230 587631 765395 559158 722026 728015 873490 721719
13762G21719r6767m4813J25417j39133m0249j12858K61757l15638K66182r6582
$$ 721719 624952 580139 705556 566423 526174 413316 675073 359435 625617 529035
13752E29035n3698J00744k32667K90611q8416O220K3408j02805K47176j23150
$$ 529035 475337 576081 343414 634025 545609 551829 575237 472432 719608 596458
13742E96458j37626M87399B83989K59415j89299K15657N5729j59r0831J45797
$$ 596458 458832 946231 283989 543404 354105 569762 625491 625332 534501 680298
13732F80298k99657J25587j25282j1122J48336Q9984N6463k13662J32949J35958
$$ 680298 380641 506228 380946 369824 518160 608144 664607 450945 583894 719852
13722G19852B70735M61319j97388B65803J27932J19073K15893j97449Q4300k96093
$$ 719852 270735 732054 534666 265803 393735 512808 728701 531252 615552 319459
13712C19459n7536K68740N6033L64013D07773k9813j62059L60967J42222k43193
$$ 319459 261923 530663 586696 950709 407773 377960 215901 576868 719090 475897
13702D75897Q4754j86729J02654J5292p7757j40080J64041J83108J4586k35124
$$ 475897 560651 373922 476576 491868 414111 274031 438072 621180 635766 400642
13692D00642O0042N4080M7746l8738k25076A48584J84302L7628K64261B46618
$$ 400642 460684 514764 562510 523772 298696 148584 332886 370514 634775 246618
13681E02747A43333L05355m1791K04106k90827J3251A24992J77316L55906l18442
$$ 502747 143333 448688 406897 611003 320176 333427 124992 302308 658214 339772
13671C39772C6550M61819j27298k231R4830J36392r3612j59594A14128K33843
$$ 339772 36550 498369 371071 368840 463670 600062 506450 346856 114128 347971
13661C47971K77435B84390M44999A80153J07468J91747p206J03372k77613J43884
$$ 347971 625406 284390 729389 180153 287621 479368 472162 575534 297921 441805
13651D41805A98912N09443B74782K93769k52777q7958L04404K34747l39837A97929
$$ 441805 198912 708355 274782 568551 315774 227816 532220 766967 427130 197929
13640E00353j91910L56789k51600Q2669A12324L92377j33030j34653O38746k67888
$$ 500353 308443 665232 413632 496301 112324 504701 371671 237018 875764 607876
13630F07876j31257M5945A88331L32075B24686O66673l64004j67749j4742Q6068
$$ 607876 476619 522564 188331 520406 224686 891359 527355 359606 344864 430932
13620D30932L78838l19501K21892C45657p0287j24530M23648A42121K44769l2621
$$ 430932 809770 490269 712161 345657 275370 150840 574488 142121 386890 354269
13610C54269J77063j85749A38260M34402k65034A48721J43607J79572A17710L09404
$$ 354269 531332 345583 138260 572662 307628 148721 292328 471900 117710 427114
13600D27114o1448J02316n9124j11325J49714o5359L9557p9861j53109q7457K19418
$$ 427114 365666 467982 408858 297533 447247 381888 421445 341584 188475 101018 320436
13589C20436J46456A82151L9231J1594R4491o0572o289J28260J2808I4579L65538
$$ 320436 466892 182151 221382 232976 327467 266895 260606 388866 401674 94579 460117
13578D60117j99562K62477j53978P8770O4916I9272M1736K84488L9316j74020
$$ 460117 260555 523032 369054 447824 512740 99272 141008 425496 464812 290792
13568B90792l786L0282A46607L04016j53043A35438J90856J56356M792K7513k43324
$$ 290792 287006 317288 146607 450623 297580 135438 326294 482650 487442 514955 271631
13557B71631d5709A93886A6878K47414J02603l4803r1234j6756J7584N70649E3110
$$ 271631 -45709 193886 16878 264292 366895 332092 240858 224102 241686 812335 53110
13545D9381L31664J12086B18630M47701e3209A91162K19942k6027a1813C14738
$$ 49381 381045 493131 218630 666331 -53209 191162 411104 385077 -11813 314738
13534A60998N8958K77315P7571k38495Q9030j57560A17812J41539H2103K90943
$$ 160998 219956 497271 574842 336347 425377 267817 117812 259351 82103 373046
13524C73046K55160k93706J18153A60820N48604A95377a58633B89260J20358j10212
$$ 373046 628206 334500 452653 160820 709424 195377 -158633 289260 409618 299406
13514B99406a00205C42540B3521L85225j15677f5293C47190J45308j61422j05082
$$ 299406 -100205 342540 23521 408746 293069 -65293 347190 492498 331076 225994
13504B25994q98I0607J04109l434F5386K83274d9182C16006F4304J79708K71111
$$ 225994 225096 90607 194716 191282 65386 348660 -49182 316006 64304 244012 515123
13493E15123B18974B5192K19512M9587l184N2948I0633e1183B12862J36457a63467
$$ 515123 218974 25192 244704 294291 291107 344055 90633 -51183 212862 349319 -163467
13481B69213o6448l4964J22266p9287I9408O6724p63J76078F3660M05097j50835
$$ 269213 202765 167801 290067 210780 99408 166132 165369 341447 63660 468757 317922
13470C17922A29822F099P5262N8208b37278h5442B29668J07930j20584J90893
$$ 317922 129822 6099 81361 139569 -237278 -85442 229668 337598 217014 407907
13460D07907A57638o603L49606b8672C28522A25393N1976N6120o8683J13051K12684
$$ 407907 157638 151035 500641 -28672 328522 125393 177369 233489 164806 277857 490541
13449D90541j48677A69888f8114E88753B19068j7557j0576a5847E39092k50741
$$ 490541 341864 169888 -68114 588753 219068 201511 190935 -15847 539092 288351
13439B88351j31677J52141F6840L55465j62516A29625J78141F1944L451K22443
$$ 288351 156674 308815 66840 422305 259789 129625 307766 61944 65395 287838
13429B87838L2593F5100J24105n465J06698A31320l7294J00585G5303J89693r3617
$$ 287838 320431 65100 189205 183740 290438 131320 94026 194611 75303 264996 171379
13418A71379A3875J89829J22294o9974k0991j09686O8400O9686J29796A38466
$$ 171379 13875 203704 325998 256024 235033 125347 193747 263433 393229 138466
13407B84989J19845a6214A53499h1506A62116E3470a2876p7131B14943A02980
$$ 284989 404834 -16214 153499 -81506 162116 53470 -12876 -90007 214943 102980
13396E9000K95543l2172A30260B0831K3527L54791A14294l1932M14241e192C06510
$$ 59000 354543 322371 130260 20831 44358 399149 114294 82362 496603 -5192 306510
13384a72240e4430l4753A87888J08306j20182m4092J47557l7464j17616g8289
$$ -172240 -54430 -89183 187888 296194 176012 131920 279477 242013 124397 -78289
13373B00935L91793A70912l6734m5975J84660J5393J10921J13632A42034J16668
$$ 200935 592728 170912 134178 88203 272863 288256 399177 512809 142034 258702
13363B58702a29186b1223B89723k1978n8387j00869K1950M8461j5176l6809J64618
$$ 258702 -129186 -21223 289723 267745 209358 108489 130439 178900 163724 126915 291533
13352B91533C6595J39046n3319M4939J33493L2238F0207K33046K4884k7203l1450
$$ 291533 36595 175641 122322 167261 300754 332992 60207 293253 318137 290934 259484
13341B59484J37379j63296m7096Q8722J15075j17390b7774C72724A00915c05748
$$ 259484 396863 233567 186471 275193 390268 272878 -27774 372724 100915 -305748
13330H9901Q2437D4732J76005M2099a27065M2100I0553i9228a8553B53422J14242
$$ 89901 172338 44732 220737 262836 -127065 -84965 90553 -99228 -18553 253422 367664
13319C67664j58969O2831F2159J14641K04170j78450N4613J20214r6688G7285
$$ 367664 208695 271526 62159 176800 380970 202520 257133 377347 280659 77285
13308A98308J72386F5188M6280n1930K25412A00040J06463j01846j6100P2190
$$ 198308 370694 65188 111468 59538 284950 100040 206503 104657 88557 160747
13298A60747G6311i5921b1602B35295g6376B83508f9279A63289J18205C7613J74472
$$ 160747 76311 -95921 -21602 235295 -76376 283508 -69279 163289 281494 37613 212085
13287B12085c9844n5687D7497J70106H0586j0535K52705d3579j43298A92860C4486
$$ 212085 -39844 -95531 47497 217603 80586 70051 322756 -43579 -186877 192860 34486
13275B82907l5530K1671D585Q1936P3904J75680l944D8294O6657a49469I0537
$$ 282907 247377 269048 4585 86521 160425 336105 332161 48294 114951 -149469 90537
13263A92840M7663b16598E442O3023b5029F4238b0195A21257n6288a81450E4481
$$ 192840 240503 -216598 5442 68465 -25029 64238 -20195 121257 64969 -181450 54481
13251F8963a70647B85798A7919K9212i4964B05429p6994a19502F0329r986B53
$$ 68963 -170647 285798 17919 47131 -94964 205429 128435 -119502 60329 50343 253
13239B8226L64252A2483D396K93751B6621J97307c24046J2489B1114K1521F46
$$ 28226 392478 12483 4396 298147 26621 223928 -324046 -311557 21114 42635 646
13227A28696h5774A0994a9345d501A79373D7774J79561a60856b5689B0150O4244
$$ 128696 -85774 10994 -19345 -4501 179373 47774 227335 -160856 -25689 20150 84394
13216H4394a97755b4982I4890a15413I7973J46082b30883I3508J30225E3956a12432
$$ 84394 -197755 -24982 94890 -115413 97973 244055 -230883 93508 223733 53956 -112432
13204a29505E8734K76714M0884r8548a02850C17612J17661A31116d0105I7612
$$ -129505 58734 335448 376332 277784 -102850 317612 435273 131116 -40105 97612
13193A93535J67985a567B01032i9064B12771a97648E2724J04001j5808j16j1688
$$ 193535 361520 -1567 201032 -99064 212771 -197648 52724 156725 140917 140801 129113
13182A29113f9397K3070D84005f5607B23609b2289A76351i6875A40629n3043K20607
$$ 129113 -69397 -46327 484005 -65607 223609 -22289 176351 -96875 140629 87586 308193
13171C08193j52414R0282Q9877N3167h2656C64040E1558J64869g1950G3347h8718
$$ 308193 155779 246061 335938 389105 -82656 364040 51558 216427 -71950 73347 -88718
13159F4753P1678l9578a05799c7139H1489a57262d715A70928n5977F943b3366
$$ 64753 136431 96853 -105799 -37139 81489 -157262 -4715 170928 114951 6943 -23366
13147c1756G4554J49412m7740a07765A19972C049f2612G9551R0690k3945m3975
$$ -31756 74554 223966 176226 -107765 119972 3049 -62612 79551 170241 146296 102321
13136A02321M1510C9011J05529Q3460K747B4800J10814n0326b23205Q7626C24694
$$ 102321 143831 39011 144540 228000 230747 24800 135614 85288 -223205 -135579 324694
13124A97331O159p3306b8441A11720J56393A34019A3802L4810A0963a56085b7521
$$ 197331 203490 130184 -28441 111720 268113 134019 13802 48612 10963 -156085 -27521
13112h3712j87250G842N57783A95072K19845A07860J38330a1915k63593A00167
$$ -83712 -270962 7842 565625 195072 414917 107860 246190 -11915 -275508 100167
13101C01196a9516B78182G0040F166b41213A66875o6603P829L84653A6974a32736
$$ 301196 -19516 278182 70040 6166 -241213 166875 100272 108101 492754 16974 -132736
13089a7366l7575a0134F9579K73162E3421O3761a16217B96477B5084J3278K15178
$$ -17366 -54941 -10134 69579 342741 53421 117182 -116217 296477 25084 38362 253540
13078B53540o9069g3894J2670D7164N5107K0009J62601g3335D11222G6507d5660
$$ 253540 184471 -73894 -61224 47164 102271 122280 284881 -73335 411222 76507 -45660
13066A21548a88483E2847a15158A93795j834F0118K87149j07869k5818m0417i2781
$$ 121548 -188483 52847 -115158 193795 191961 60118 347267 239398 213580 173163 -92781
13054f2937G5272c806B31179L2631b94478I9738a27778B02689M4276A23155h5431
$$ -62937 75272 -3806 231179 263810 -294478 99738 -127778 202689 246965 123155 -85431
13042D03376j98934C7464j6448a44352A12280e5630Q055E5761a97176C06469b5169
$$ 403376 204442 37464 21016 -144352 112280 -55630 -47575 55761 -197176 306469 -25169
13030A28462B9009f5091A00722e2030A31931M4499P6070p6680q1182R7350F879
$$ 128462 29009 -65091 100722 -52030 131931 176430 252500 175820 94638 191988 6879
13018A48147F4692J12546n9575k2161a10224L1855B10693a13934D8756a65214
$$ 148147 64692 177238 117663 95502 -110224 -78369 210693 -113934 48756 -165214
13007b23794A36641L0558d8667A96504K1209K20886A3284a53102A14440K59035
$$ -223794 136641 167199 -48667 196504 217713 438599 13284 -153102 114440 373475
12997C73475a37555A38552N5674K47155a18922k2485F8907C1544R1912J11781
$$ 373475 -137555 138552 194226 441381 -118922 -141407 68907 31544 123456 235237
12987B35237M63b32431C53424j12622g4084k30534c355A02630J83124a77743B61062
$$ 235237 235700 -232431 353424 240802 -74084 -304618 -3355 102630 285754 -177743 261062
12975I5469R1979b27183A69746K2417b2254A81384A7238a54837l8075i3759k9379
$$ 95469 187448 -227183 169746 192163 -22254 181384 17238 -154837 -192912 -93759 -123138
12964a23138j33332b3076i812j61993c1256k74561C36881b9856B21904n9701h3843
$$ -123138 -256470 -23076 -9812 -171805 -31256 -305817 336881 -29856 221904 162203 -83843
12952a09482B37066F4658g6625c5777j62587M1895A85610a61655G1254g8232I2419
$$ -109482 237066 64658 -76625 -35777 -198364 -156469 185610 -161655 71254 -78232 92419
12940a6001A2439J45149K22025c40195B7640M6214i7003j55382A74974b21803
$$ -16001 12439 157588 379613 -340195 27640 73854 -97003 -252385 174974 -221803
12929D09226c6523F1674d1656E6703K80006C0530Q5362a15008C86325F1167Q3789
$$ 409226 -36523 61674 -41656 56703 336709 30530 115892 -115008 386325 61167 144956
12918A44956g0584A1435J361J40463F6091L51163i6581A98986a22884I4137j0912
$$ 144956 -70584 11435 12796 153259 66091 417254 -96581 198986 -122884 94137 83225
12907H3225N1957a66880B87996b33128J4079B74773r3563d15627A19478B5975
$$ 83225 135182 -166880 287996 -233128 -219049 274773 181210 -415627 119478 25975
12896A00948a0322A92252E3128K83656D7898J1152P9489A0048K15767E7405a66160
$$ 100948 -10322 192252 53128 336784 47898 59050 138539 10048 225815 57405 -166160
12884C1841b19043g7715K0079A06975E685a41794j8413N7255n1179A67797L2727
$$ 31841 -219043 -77715 -57636 106975 5685 -141794 -160207 -102952 -154131 167797 200524
12873B00524a02319I2712J60207d00851C19088a30924C0837J26663i8029C86343
$$ 200524 -102319 92712 252919 -400851 319088 -130924 30837 157500 -98029 386343
12862A22399d2988B03430H5698b9000Q724H8230K56121j25904e1112f913D07900
$$ 122399 -42988 203430 85698 -29000 -20276 88230 344351 218447 -51112 -6913 407900
12850B48751a56618k9515G247J46001L968a31758c4405A81732f8672A92497B822
$$ 248751 -156618 -186133 7247 153248 157216 -131758 -34405 181732 -68672 192497 2822
12838C11522f6516G9933P853J77212a24055m845a2164B72542E9475b19208F9620
$$ 311522 -66516 79933 87786 264998 -124055 -128900 -12164 272542 59475 -219208 69620
12826a7261C61866A69461q4187B8393b29615Q9348A23668K567K7350a13767F707
$$ -17261 361866 169461 85274 28393 -229615 -140267 123668 126235 153585 -113767 6707
12814B5975c2784R079l3420B26878G5994j4754a88261b0506J827k06168M2502
$$ 25975 -32784 -23705 -57125 226878 75994 61240 -188261 -20506 -18679 -224847 -182345
12803a82345C2438P0207L7986F8857Q87k171K79143a33597B37035E0108J27357
$$ -182345 32438 102645 140631 68857 69744 67573 346716 -133597 237035 50108 177465
12792A77465A7471K8834J96510d93122J23083B61460Q7831b34108B563J58778
$$ 177465 17471 46305 242815 -493122 -370039 261460 349291 -234108 2563 161341
12782A61341a56978b0913B93782r9075a4698A68994f5526A88809E4435a14202
$$ 161341 -156978 -20913 293782 194707 -14698 168994 -65526 188809 54435 -114202
12771d27875a45134a0735D7738b6786j3422j76981J05900A91543L0681d0691k34810
$$ -427875 -145134 -10735 47738 -26786 -40208 -217189 -111289 191543 222224 -40691 -275501
12760b75501H4876J11207F227K0972h9677E3097D237a51366B09537A04198L08147
$$ -275501 84876 196083 6227 27199 -89677 53097 4237 -151366 209537 104198 412345
12749D12345B3220A1324a25631F6535b38117B15354b7754j03274H3305J11115
$$ 412345 23220 11324 -125631 66535 -238117 215354 -27754 -131028 83305 194420
12739A94420a14410a5198A06903h80B6672J47449b59743C12288c5658A42470N7993
$$ 194420 -114410 -15198 106903 -880 26672 174121 -259743 312288 -35658 142470 200463
12728B00463E2188b122A12212Q461b06498F9010J48386e5584j22002D26510b53142
$$ 200463 52188 -2122 112212 120673 -206498 69010 217396 -55584 -177586 426510 -253142
12716b14782k6574N3289b4266o21k6938r7434d7959p235n7634B7871J78745a28269
$$ -214782 -241356 -188067 -24266 -24887 -51825 -149259 -47959 -55194 -112828 27871 206616 -128269
12703i6092C4385a62398K5091h328C51593F4374a57468B95747d03888J99764M2525
$$ -96092 34385 -162398 -137307 -8328 351593 64374 -157468 295747 -403888 -204124 -161599
12692a61599a3260A00218L16152a33297B57061L8547A44271J70931a42488A83359
$$ -161599 -13260 100218 416370 -133297 257061 295608 144271 315202 -142488 183359
12681C4268c8575p7416c7007A16469J9426J64216C9610b08418R9472B23178o1539
$$ 34268 -38575 -115991 -37007 116469 135895 300111 39610 -208418 -108946 223178 161639
12670A61639p4024b84216A38489J7528b6808I5120N7554E7135K66847f4309j96506
$$ 161639 87615 -284216 138489 156017 -26808 95120 152674 57135 323982 -64309 -260815
12659b60815h9301D23318a8826A67845J15658a36873C61851c54396B13902a42967
$$ -260815 -89301 423318 -18826 167845 283503 -136873 361851 -354396 213902 -142967
12648a96156B09082C8101b02170H4444M8494j6698L37648B13533I6401e9245A24081
$$ -196156 209082 38101 -202170 84444 132938 116240 453888 213533 96401 -59245 124081
12636A95082b37168g3586l8j06208C02297c0275H3080J73425f3939j2605C11093
$$ 195082 -237168 -73586 -73624 -179832 302297 -30275 83080 256505 -63939 -76544 311093
12624A7814f8951A6799K65523F1238a53719I0746b20329M8435M0133F9696e8943
$$ 17814 -68951 16799 282322 61238 -153719 90746 -220329 -171894 -131761 69696 -58943
12612b5258B56762m8236j8720c1469B08133e1783C2591a10450E1226i4311A68982
$$ -25258 256762 208526 189806 -31469 208133 -51783 32591 -110450 51226 -94311 168982
12600C3851O4211J82875a3287E8076g0799A6753K60286j12224m182K65671A07218
$$ 33851 98062 280937 -13287 58076 -70799 16753 277039 164815 160633 426304 107218
12588C14715r3105o7565C1813L60015A46337n0635L1093h4900j20674Q3145j66987
$$ 314715 221610 154045 31813 391828 146337 95702 126795 -84900 -205574 -122429 -289416
12577b89416R9832c0816B49996D3182f814k86406B67797C1987M9329K15734b8022
$$ -289416 -189584 -30816 249996 43182 -6814 -293220 267797 31987 81316 297050 -28022
12565i8500A00786J32944b547j97231A22463c9679j34918Q6356o2460d7610k31081
$$ -98500 100786 233730 -2547 -199778 122463 -39679 -174597 -88241 -150701 -47610 -278691
12554b78691f6938o0019F2171f2940A09604b3610A59493a44068e7065I2313a32326
$$ -278691 -66938 -126957 62171 -62940 109604 -23610 159493 -144068 -57065 92313 -132326
12542a2081F7283i9216H768a18728c551j40649A10722a55622G0435Q6496c86419
$$ -12081 67283 -99216 8768 -118728 -3551 -144200 110722 -155622 70435 156931 -386419
12530h591j01305A29375a70899j6954j0089R0140B4047J54846j5175a85786N0708
$$ -8591 -109896 129375 -170899 -187853 -197942 -107802 24047 178893 163718 -185786 -135078
12519a35078H9925i034A26790h5316A04203h3600q9910A32879a54054F3098a50769
$$ -135078 89925 -9034 126790 -85316 104203 -83600 -173510 132879 -154054 63098 -150769
12507f565p4144D39611a76515c8440F5662j010J12976d81613A11814a74701O4431
$$ -6565 -80709 439611 -176515 -38440 65662 64652 177628 -481613 111814 -174701 -110270
12496a10270C974K47498b24042C0506d8395E5501h592m91404B6490d7274j63221
$$ -110270 3974 251472 -224042 30506 -48395 55501 -8592 -499996 26490 -47274 -210495
12485b10495A12639h957A17504b44840A28188D9898Q2103e7947A12928b1536A72211
$$ -210495 112639 -8957 117504 -244840 128188 49898 132001 -57947 112928 -21536 172211
12473A29864h2415A69744F2025h3341B19136Q381F4094d4871l3678b7269k85692
$$ 129864 -82415 169744 62025 -83341 219136 227517 64094 -44871 -78549 -27269 -312961
12462c12961H2284a76848f5697j19727I8501a09301C67925d8224l060a5847A79492
$$ -312961 82284 -176848 -65697 -185424 98501 -109301 367925 -48224 -51284 -15847 179492
12450c4509c859j10876n624A84954M0430a80595C1241J77806G7403d495r7552
$$ -34509 -3859 -114735 -120359 184954 225384 -180595 31241 209047 77403 -4495 -102047
12439a02047c7257F5876a89120A19423a72639b358G0631a44999O4566B54264a50780
$$ -102047 -37257 65876 -189120 119423 -172639 -2358 70631 -144999 -80433 254264 -150780
12427b43712B21844H9530a25004F9089f5485j81819C28035A61317e4613E2631
$$ -243712 221844 89530 -125004 69089 -65485 -247304 328035 161317 -54613 52631
12416b10800A45265b6885B06410a21615F5825J667L12046b16460A47018c81892
$$ -210800 145265 -26885 206410 -121615 65825 67492 379538 -216460 147018 -381892
12405C347b53856H6885D2133b52462i0027c5324j73827G7820a90593g1263n4330
$$ 3347 -253856 86885 42133 -252462 -90027 -35324 -209151 77820 -190593 -71263 -125593
12394a25593D2452g4932j73467c7679H6293a82135B73350D5320J32438D8518e5037
$$ -125593 42452 -74932 -248399 -37679 86293 -182135 273350 45320 177758 48518 -55037
12382h1866n1728C1395h8877A59596m2259B7772J11276C7168J4883R4104M6407
$$ -81866 -133594 31395 -88877 159596 117337 27772 139048 37168 52051 146155 192562
12371A92562l2375a42360A48779i7157j57830J03238j39568B18902B549R8888
$$ 192562 160187 -142360 148779 -97157 -254987 -151749 -291317 218902 2549 101437
12361A01437g3968B6080i5822D3023A4381K2403N0944c81383B7942J46793G1106
$$ 101437 -73968 26080 -95822 43023 14381 36784 87728 -381383 27942 174735 71106
12349A94402H5618k9695h669H4739h623B29441A01661c14426K7393a12276D6863
$$ 194402 85618 55923 -8669 84739 -8623 229441 101661 -314426 -287033 -112276 46863
12337B88114a87890j72104g5249c5703B44422j19634B3336d4964k85650B1182
$$ 288114 -187890 -359994 -75249 -35703 244422 124788 23336 -44964 -330614 21182
12326A53841n7703k7742k2370f0778F2467d8888j43462g6515q573K9054B19872
$$ 153841 96138 68396 46026 -60778 62467 -48888 -192350 -76515 -85088 -56034 219872
12314a14232H1399a05509e1640j92173d6152A58679J03567q8418l6465F2848J63286
$$ -114232 81399 -105509 -51640 -243813 -46152 158679 262246 173828 137363 62848 226134
12303B26134f2489J8640n1692B4817K30630m9246b55054A3771P3311M7662D7209
$$ 226134 -62489 -43849 -95541 24817 255447 206201 -255054 13771 87082 134744 47209
12291A13507a09828B64999c2417B2713a62683J8858j83095F2818K38753b92301
$$ 113507 -109828 264999 -32417 22713 -162683 -143825 -326920 62818 301571 -292301
12280A3605e8374B199J59379G5949J22540r1950c4770A9382N4146J83964a28538
$$ 13605 -58374 2199 161578 75949 198489 106539 -34770 19382 73528 257492 -128538
12268f6041B5279E400K48013b17066A28779a05296K9708j48803J00588E6262b09940
$$ -66041 25279 5400 253413 -217066 128779 -105296 -75588 -224391 -123803 56262 -209940
12256A17914a36964B4149a67700C9805J81234J0036K39416A61515l2048M4392
$$ 117914 -136964 24149 -167700 39805 221039 231075 470491 161515 129467 173859
12246A73859d5335J1243B34247j5490i2784l6175N2353D6599O8552J78100a28835
$$ 173859 -45335 -34092 234247 218757 -92784 -128959 -76606 46599 115151 293251 -128835
12234B21481R1048A20456f3678A11578N9666a3354H900J80273J2371f1336O391
$$ 221481 312529 120456 -63678 111578 171244 -13354 8900 189173 201544 -61336 -54945
12223e4945e335B57451m6075C9436c2092B38215b78617A89207a16272A22873e0370
$$ -54945 -5335 257451 211376 39436 -32092 238215 -278617 189207 -116272 122873 -50370
12211C9822a52809L5382B95254p7319g2485O449A50737Q5246i6169L2453I3723
$$ 39822 -152809 -117427 295254 217935 -72485 -66036 150737 235983 -96169 -63716 93723
12199C10042a17311g367F2056l930M35298a79954B36682J42764A38851N0618a5727
$$ 310042 -117311 -7367 62056 58126 493424 -179954 236682 379446 138851 189469 -15727
12187C50608A7327N674g5541A79748M1366C1474K18017N6835a6144C4165b0077
$$ 350608 17327 23001 -75541 179748 221114 31474 249491 306326 -16144 34165 -20077
12175b22869A41421E8627d629C81630j53323n6324d65753C7623d3908H321K50627
$$ -222869 141421 58627 -4629 381630 228307 171983 -465753 37623 -43908 8321 258948
12164B58948d5891A0669K87110a45285C1330L16647d9321A75777j6310m8420A509
$$ 258948 -45891 10669 297779 -145285 31330 347977 -49321 175777 159467 111047 1509
12152C12741a98771H4252L3889b60072B54285Q0654E0677J90829K04083o1702
$$ 312741 -198771 84252 118141 -260072 254285 334939 50677 241506 445589 383887
12142C83887g7408l54j7039A8015C014O2742b46120I3397a06304I1496H293J00314
$$ 383887 -77408 -77762 -94801 18015 3014 65756 -246120 93397 -106304 91496 8293 108607
12130A08607J06271a18299j38484A3756j531a1555p8993n877A50570a06375B4589
$$ 108607 214878 -118299 -256783 13756 12225 -11555 -90548 -96425 150570 -106375 24589
12118a60589e8484C7853a59104b7104B28481a78470J6564B1520a33220E3629k3222
$$ -160589 -58484 37853 -159104 -27104 228481 -178470 -161906 21520 -133220 53629 30407
12107C0407K81450A03606a68493j51680B60276a87732A47687M5801b5873j50714
$$ 30407 311857 103606 -168493 -320173 260276 -187732 147687 193488 -25873 -176587
12097a76587A29744K11114b65905A50853l7164l6513l7785J38927d2373G8323
$$ -176587 129744 340858 -265905 150853 113689 77176 39391 178318 -42373 78323
12086a67758B75131b48429g1928e11l2660G561J15202d8612C3643h75B5972K7733
$$ -167758 275131 -248429 -71928 -511 -33171 7561 122763 -48612 33643 -875 25972 53705
12074E3705a46485d1541n3056j57322a4100C9900L57938n9424J42085J101207
$$ 53705 -146485 -41541 -94597 -251919 -14100 39900 397838 338414 480499 1581706
12064A581706m16866n78624B40441l2503b00173c457l75008g8521A65541b25611
$$ 1581706 1164840 586216 240441 207938 -200173 -3457 -378465 -78521 165541 -225611
12053a43974J9656B0088L2033h8845I1874b92743B34521G939f4736b2501j58107
$$ -143974 -124318 20088 52121 -88845 91874 -292743 234521 7939 -64736 -22501 -180608
12042a80608A73011d0714A64959A0740f5620C15174f251A90946o4870e1764A77812
$$ -180608 173011 -40714 164959 10740 -65620 315174 -6251 190946 126076 -51764 177812
12030B89688a70684C52501k7572b90992A38435f5306B07343e1025B80679b60746
$$ 289688 -170684 352501 324929 -290992 138435 -65306 207343 -51025 280679 -260746
12019B9535a33309q3044G0854J34484g2827j87814a28661q0469a3286F2916a33190
$$ 29535 -133309 -216353 70854 205338 -72827 -260641 -128661 -209130 -13286 62916 -133190
12007A53129o1192J25105q0137a47433K0910d4871B57185G7120J07907a31230
$$ 153129 91937 217042 136905 -147433 -126523 -44871 257185 77120 185027 -131230
11996D5428f1798g117j27669F6172e4401q4673D263b42401B18920d543l9535H7069
$$ 45428 -61798 -7117 -134786 66172 -54401 -139074 4263 -242401 218920 -4543 -44078 87069
11983a77850A4458a38309b4810r5985C637a78955G5719M3401k2414C8034J18576
$$ -177850 14458 -138309 -24810 -120795 3637 -178955 75719 119120 96706 38034 156610
11972A56610d698I1696J42681j11936b7771D0971g373A07274J01519D7977h3931
$$ 156610 -4698 91696 234377 122441 -27771 40971 -7373 107274 208793 47977 -83931
11960a5364k69188A07024E3205d07199J59302j03036a35759J0894d087A21069
$$ -15364 -284552 107024 53205 -407199 -247897 -350933 -135759 -124865 -4087 121069
11949D1001K19655a8448B23890k7173D7777M4606h1963B36773A00077O6783i6904
$$ 41001 260656 -18448 223890 196717 47777 92383 -81963 236773 100077 166860 -96904
11937a87349o4772j19117o355I3248a14762p8477d1942o5916l44306h16k99724
$$ -187349 -252121 -371238 -377593 93248 -114762 -193239 -41942 -107858 -452164 -816 -300540
11926c00540K2565B22757r3168J10008g707l02584N592h5965C0276L42201E8627
$$ -300540 -277975 222757 129589 239597 -7707 -310291 -304699 -85965 30276 372477 58627
11914a45449A98876E8509L984P5039a92362E9560b50638A64342A8892K34401e4049
$$ -145449 198876 58509 62493 137532 -192362 59560 -250638 164342 18892 253293 -54049
11902g4291K9228o8558j64689A98580p3605a57673c5399B35527g8629C40515g2570
$$ -74291 -45063 -113621 -278310 198580 124975 -157673 -35399 235527 -78629 340515 -72570
11890a07111C35139e615l8354l0081A71242h2329j45433C8792E50N8026K16515
$$ -107111 335139 -5615 -43969 -74050 171242 -82329 -227762 38792 550 58576 275091
11879B75091a25847b1439F5114k2442M4146b09105j31036G8289M7985e20734b05494
$$ 275091 -125847 -21439 65114 42672 86818 -209105 -340141 78289 126274 -520734 -205494
11867A63872Q4572M6683a66402m5112M3985F8680b83838A1674J96280c07705a09206
$$ 163872 248444 295127 -166402 -211514 -167529 68680 -283838 11674 207954 -307705 -109206
11855i7526k8687k20139D4328L2576b84798A60982M069b5753A89955H2503a90773
$$ -97526 -126213 -346352 44328 76904 -284798 160982 165051 -25753 189955 82503 -190773
11843a94431P3897J0563b0207C58230a7257B48691b41013j21733i4666A50770
$$ -194431 -120534 -109971 -20207 358230 -17257 248691 -241013 -362746 -94666 150770
11832a40075N2855A30143b24544L3962l5678P9769k47605A35986o6756k8062d4208
$$ -140075 -87220 130143 -224544 -190582 -226260 -146491 -394096 135986 69230 41168 -44208
11820e67623a5819E2395K2333B3402N1775k8871a7308j42582n671k6993i2822
$$ -567623 -15819 52395 74728 23402 75177 46306 -17308 -159890 -165561 -192554 -92822
11808a18095A52J22918E4324b03854j7293G8717a24383j67791G7422f7227r9038
$$ -118095 152 123070 54324 -203854 -221147 78717 -124383 -292174 77422 -67227 -166265
11797a66265O2954J605j4272F1274i7706l6131O4500j3775k23928A06242J05304
$$ -166265 -103311 -101706 -115978 61274 -97706 -133837 -69337 -83112 -307040 106242 211546
11786B11546b19500o7539b1468A82386b23631A16011G427h4613J8749A44509h8262
$$ 211546 -219500 -287039 -21468 182386 -223631 116011 7427 -84613 -65864 144509 -88262
11774F1073J00223h610k16068h1802B27009C7659c3221j37483F9251c48795J34606
$$ 61073 161296 -8610 -224678 -81802 227009 37659 -33221 -170704 69251 -348795 -214189
11763b14189O5892K7518A90625D1953b1913B81676c6445r5303B59964h1792q8648
$$ -214189 -148297 -120779 190625 41953 -21913 281676 -36445 -131748 259964 -81792 -170440
11752a70440B77327b49673A91313a4543A78584e9774B99323G6718q718a33683
$$ -170440 277327 -249673 191313 -14543 178584 -59774 299323 76718 68000 -133683
11741h5816D73833A54767j3126g8475A17563k0747b47504G031R9831e3767E7671
$$ -85816 473833 154767 141641 -78475 117563 96816 -247504 7031 106862 -53767 57671
11729c13350B61504j07087a5109j12668L3107C08772C4378c37293b0187j69783
$$ -313350 261504 154417 -15109 -127777 -94670 308772 34378 -337293 -20187 -189970
11719a89970E1632f1925j90479A7854m891b13737N1934F7835a93115a4079j479
$$ -189970 51632 -61925 -252404 17854 12963 -213737 -161803 67835 -193115 -14079 -15558
11708a5558j399j0852B5894b94385f9937o0775B22852j2777a09704c6505j48403
$$ -15558 -16957 -27809 25894 -294385 -69937 -130712 222852 210075 -109704 -36505 -184908
11697a84908Q1465j7490C948c52255B8456d61022a53035l9217A8743K23120l6794
$$ -184908 -103443 -120933 3948 -352255 28456 -461022 -153035 -192252 18743 241863 205069
11686B05069a02577C02967e7072j96676B96964e9680j84628Q7234k01847A66510
$$ 205069 -102577 302967 -57072 -253748 296964 -59680 -244308 -157074 -358921 166510
11675C0315J90736G3796L45143A86717k5378J74258c8484o3085k0404N236l72426
$$ 30315 221051 73796 418939 186717 161339 335597 -38484 -101569 -121973 -116737 -489163
11664d89163a71822B63891e8634A53609j3106A5999a9460A83055h769j36843d8086
$$ -489163 -171822 263891 -58634 153609 140503 15999 -19460 183055 -8769 -145612 -48086
11652A33323J35472B4688d4106b141C9551J25988i7492k71831H9462a3143k75138
$$ 133323 268795 24688 -44106 -2141 39551 165539 -97492 -369323 89462 -13143 -288281
11641b88281d9261A70805b3066l11443a00890a2173k81301I0927h9898j07922
$$ -288281 -49261 170805 -23066 -334509 -100890 -12173 -293474 90927 -89898 -197820
11631a97820A37897B5219b46023B0574a54162d6268B0708a00969M0853I4504a26187
$$ -197820 137897 25219 -246023 20574 -154162 -46268 20708 -100969 -60116 94504 -126187
11619d7336a6319k05052A77460a39261a490j35496G390J73482C8324a89401j28779
$$ -47336 -16319 -221371 177460 -139261 -1490 -136986 7390 180872 38324 -189401 -318180
11608c18180a4478j14613p390f1476j85849i401k42383h8091c1476j63643C6595
$$ -318180 -14478 -129091 -136481 -61476 -247325 -9401 -251784 -88091 -31476 -195119 36595
11596A7507a26614D7532J03151C4072b72254H5351d2583q1217k818p8883N9738
$$ 17507 -126614 47532 150683 34072 -272254 85351 -42583 -123800 -126618 -205501 -145763
11585a45763a187j17608k8523A28725c0784k28203J29126q669n4099M0497A29826
$$ -145763 -1187 -118795 -147318 128725 -30784 -258987 -129861 -138530 -192629 -152132 129826
11573d0361J6196j21352I3923b35048L3789f1488E8580O7985c51241B08100l0240
$$ -40361 -24165 -145517 93923 -235048 -201259 -61488 58580 126565 -351241 208100 177860
11562A77860E0008Q8764a34820M9611c1507A56076a73870C22927b72376A97206
$$ 177860 50008 138772 -134820 -85209 -31507 156076 -173870 322927 -272376 197206
11551D3383a03410a5973B3123J06804f7709A03825a46392e2811H1034Q388Q2689
$$ 43383 -103410 -15973 23123 129927 -67709 103825 -146392 -52811 81034 89422 172111
11540A72111a46474a1657k32822J09089B5783Q5573b86928A56819o8547P5414
$$ 172111 -146474 -11657 -244479 -135390 25783 111356 -286928 156819 88272 163686
11530A63686l9414N5803g5712K5499D73873C7530c6809q3174B25577b82013c4681
$$ 163686 124272 180075 -75712 -50213 473873 37530 -36809 -119983 225577 -282013 -34681
11518A48884B5464b10710i4154M5551A2387a1919p3134C0650J31252F1430n24
$$ 148884 25464 -210710 -94154 -48603 12387 -11919 -85053 30650 161902 61430 60906
11507F0906O6824K2709h0520B0049J81653G3369J98135N2011a55790f3025A55291
$$ 60906 127730 150439 -80520 20049 201702 73369 271504 323515 -155790 -63025 155291
11495A44050h8580E6983o742L20606J2752d1342a4686q3383q6149g3453h470n8081
$$ 144050 -88580 56983 50241 370847 383599 -41342 -14686 -98069 -184218 -73453 -8470 -66551
11483f6551A4810N3956A6569a04591A31886e8052j00653A08778J18276O4852a58222
$$ -66551 14810 68766 16569 -104591 131886 -58052 -158705 108778 227054 291906 -158222
11471A52557P16K25984p8331e1389A16173A8749a706A04874D1154h0191A42404
$$ 152557 153273 379257 300926 -51389 116173 18749 -1706 104874 41154 -80191 142404
11459b90174A44485j343a5299I475b18957A2521K28324f3954B56497g0051A26566
$$ -290174 144485 143142 -15299 9475 -218957 12521 240845 -63954 256497 -70051 126566
11447A44758a59628j19222F6227c74724J72265A13449L1660f3268m2203A26261
$$ 144758 -159628 -278850 66227 -374724 -202459 113449 145109 -63268 -105471 126261
11436A6825e7831j96174a01632B14812f2990A06823c56054a70114m1306Q060o389
$$ 16825 -57831 -254005 -101632 214812 -62990 106823 -356054 -170114 -211420 -203360 -209749
11425b09749A5165M5601j694B6026L11901E0137a72623B05a85055e4686D728J44438
$$ -209749 15165 60766 59072 26026 337927 50137 -172623 205 -185055 -54686 4728 149166
11413A49166a65066E6384J52808K1478l9859G4500J77298a94143c3443Q564k8401
$$ 149166 -165066 56384 209192 230670 190811 74500 251798 -194143 -33443 -24879 -53280
11402e3280A96729D5201M7377b1495A04520g066G5308k2080a90071j11221F6387
$$ -53280 196729 45201 92578 -21495 104520 -7066 75308 53228 -190071 -301292 66387
11390b80076J16426A27972J56896A04465A6649a23341I7590N3031M9133A3451
$$ -280076 -163650 127972 284868 104465 16649 -123341 97590 150621 199754 13451
11379A4672c8785j32916A2752a15218A04429M26833a65293B2671J76046R9781
$$ 14672 -38785 -171701 12752 -115218 104429 531262 -165293 22671 198717 298498
11369B98498a47748D0661L7427C7525J2864k5032b831A09608a60083p062D0160
$$ 298498 -147748 40661 78088 37525 50389 25357 -2831 109608 -160083 -167145 40160
11357G4957k6006c1400j21012A37118b53131D6484a37943l9838i256m7624A76173
$$ 74957 48951 -31400 -152412 137118 -253131 46484 -137943 -177781 -9256 -56880 176173
11345A67758a60419d090j38876a4583B39270a25565B52808a58098N3744L298H2564
$$ 167758 -160419 -4090 -142966 -14583 239270 -125565 252808 -158098 -104354 -101056 82564
11333A15124P0319F413a89423J3843A5979D233P4443L14270a48917J5738G5802
$$ 115124 185443 6413 -189423 -175580 15979 4233 78676 392946 -148917 -133179 75802
11321B18337i1563k52894M1292A32804m6794k311a17534j90439C9025a07016k4121
$$ 218337 -91563 -344457 -303165 132804 86010 83699 -117534 -307973 39025 -107016 -131137
11310a31137k05429a33900D4349J28050L3244b30955J11364k35879J04338E0519
$$ -131137 -336566 -133900 44349 172399 205643 -230955 -119591 -355470 -251132 50519
11299a92775B9451b26212A29465B4735J11135f301j3463j30672J8753D0447g6717
$$ -192775 29451 -226212 129465 24735 135870 -6301 -19764 -150436 -131683 40447 -76717
11287D9832c13577b6548a0227H035M06547f4845j4324j85149A47512e6866A46925
$$ 49832 -313577 -26548 -10227 8035 414582 -64845 -79169 -264318 147512 -56866 146925
11275a30336L8527k06254H403Q248N2184a19638A15889h0112j01295C23429D0618
$$ -130336 -91809 -298063 8403 16651 68835 -119638 115889 -80112 -181407 323429 40618
11263c05442J19912B86675b07350e8711D7510b74438J21125N2412o2014a9307
$$ -305442 -185530 286675 -207350 -58711 47510 -274438 -153313 -100901 -162915 -19307
11252b03092K4615f8803k48856C13446B3755J66097q065F6237j3239b74823B6505
$$ -203092 -178477 -68803 -317659 313446 23755 189852 181787 66237 52998 -274823 26505
11240c24761A21425C5664a87747j3961j4995k2273N9319B08857l2929m0749a69151
$$ -324761 121425 35664 -187747 -201708 -216703 -238976 -179657 208857 175928 135179 -169151
11228c301j9841A56851B2491i7816m8666j55932J12437I2188H16b25088e3729
$$ -3301 -23142 156851 22491 -97816 -146482 -302414 -189977 92188 816 -225088 -53729
11216I7421a08044j2240A74675a7282p4901A90151l9731a21584C68073b5048A695
$$ 97421 -108044 -120284 174675 -17282 -92183 190151 150420 -121584 368073 -25048 1695
11204f3872H7817a42903j54750g7159H8343J96114f3317j9642b3766j13228D1226
$$ -63872 87817 -142903 -297653 -77159 88343 284457 -63317 -82959 -23766 -136994 41226
11192c80503A67478a98010O1903B77662D9311a93038A67477a36414q6174j65634
$$ -380503 167478 -198010 -136107 277662 49311 -193038 167477 -136414 -222588 -388222
11182c88222C49189b79636f3192m3528B0404c7667p0077A06788c8855H5556a64026
$$ -388222 349189 -279636 -63192 -106720 20404 -37667 -107744 106788 -38855 85556 -164026
11170b71160j45553f7103A30962d0847j27335h049o8671a4628o9839q1953k8668
$$ -271160 -416713 -67103 130962 -40847 -168182 -8049 -76720 -14628 -84467 -166420 -195088
11159a95088O2427L3178j6027N6931A67201a28587j29085J27978m5144j81380
$$ -195088 -132661 -99483 -115510 -58579 167201 -128587 -257672 -129694 -174838 -356218
11149c56218a9026m274A492a48298c0981k51067O4918B15883F480L23157i3968
$$ -356218 -19026 -23300 1492 -148298 -30981 -282048 -217130 215883 6480 329637 -93968
11137c3837l1267m9595A38693a2643k67317L0434A83590d1839D713c38667a35930
$$ -33837 -65104 -114699 138693 -12643 -279960 -249526 183590 -41839 4713 -338667 -135930
11125B18272b9371D859M9082R2433L4665J3319I6931A0162c1836I5745a00227
$$ 218272 -29371 4859 53941 146374 181039 194358 96931 10162 -31836 95745 -100227
11113a48661k6732A43716B5815b65797L8915O0371A77035F0167B5414a79550K217
$$ -148661 -175393 143716 25815 -265797 -226882 -166511 177035 60167 25414 -179550 -177333
11102a77333M6914A05662A1647M53233F2186b65165A17888J57562r7169H1617
$$ -177333 -130419 105662 11647 464880 62186 -265165 117888 275450 178281 81617
11091g1015A22182P1072J71616A57945N2938K53725f053o3346A41943K1973F6723
$$ -71015 122182 193254 364870 157945 210883 464608 -6053 -69399 141943 163916 66723
11079D50490B01217J12987C4237a51443D7325J13887f4288B14803L7593C1121
$$ 450490 201217 314204 34237 -151443 47325 161212 -64288 214803 252396 31121
11068C4812L80320A52360C0264J04584K99492h4706c838C89798j04089l7227E649
$$ 34812 415132 152360 30264 134848 434340 -84706 -3838 389798 285709 248482 5649
11056A99139L7896m4853O5427J20655j01148L41232k92099J20143l5076d0329
$$ 199139 237035 192182 257609 378264 277116 618348 326249 446392 411316 -40329
11045B55446J13629l8130n6484j1716L61726L0877q7265R240A90528J59832M6349
$$ 255446 369075 330945 274461 262745 624471 655348 568083 577323 190528 350360 396709
11034C96709A89908L86719A30906K81691j79142K54440m2130J56098l3922q0220
$$ 396709 189908 576627 130906 412597 233455 487895 445765 601863 567941 487721
11024D87721F4714N15143j82565j9807K51326p5871B45851l6464K61328j46166
$$ 487721 64714 579857 397292 377485 628811 552940 245851 209387 470715 324549
11014C24549L2571K20427Q4927C16979J33799j61399J15246j87500M99200l28604
$$ 324549 357120 577547 662474 316979 450778 289379 404625 217125 716325 387721
11004C87721j48433K50173j54321j26740J72538A67360n2162J88104L25159k75329
$$ 387721 239288 489461 335140 208400 380938 167360 115198 303302 628461 353132
10994C53132j66365N15431B94252K68877j95687J04526L7266j10830O9447J07632
$$ 353132 186767 702198 294252 563129 367442 471968 509234 398404 467851 575483
10984E75483J23101k47067J57457j61515N12165k16897J02884j58168L09200q4941
$$ 575483 698584 451517 608974 447459 959624 742727 845611 687443 996643 911702
10974I11702J64738L45661M3309J52908L91574m90963N70568K133m76562R3948
$$ 911702 1076440 1422101 1465410 1618318 2009892 1518929 2089497 2091630 1615068 1709016
10964A709016j34133k99104l07280M9724j24083K43829l40002j9360j23455K01879
$$ 1709016 1574883 1275779 968499 1018223 894140 1137969 797967 778607 655152 857031
10954H57031l21787Q9114L4836C04947R8748J02859m3567j80044Q0751a12370
$$ 857031 535244 624358 659194 304947 403695 506554 462987 282943 363694 -112370
10943b39015B0209R3275K79015D9956J09058j1663K4035D5032b36583a4440A20669
$$ -239015 20209 113484 392499 49956 159014 147351 171386 45032 -236583 -14440 120669
10931b23852B7822K38981A27710N6895g8385N982L2752B28399G8796c1109A50459
$$ -223852 27822 266803 127710 184605 -78385 -72403 -39651 228399 78796 -31109 150459
10919A18613K66055C9858b96457g9286D4776O5510C4765a18325j2760j82983M1698
$$ 118613 384668 39858 -296457 -79286 44776 110286 34765 -118325 -131085 -314068 -272370
10908b72370N5552K2628R4227b2336D8074A1091b9191j70205e7616M391j70794
$$ -272370 -216818 -194190 -99963 -22336 48074 11091 -29191 -199396 -57616 -53225 -224019
10897b24019B84499a79137j0948O4916A12851a04301F4647a44515A26402a24794
$$ -224019 284499 -179137 -190085 -125169 112851 -104301 64647 -144515 126402 -124794
10886G0838f922A5008i9894h899j08398q9392G3859b67612K4364a08027r3927
$$ 70838 -6922 15008 -99894 -8899 -117297 -206689 73859 -267612 -243248 -108027 -201954
10875b01954h4710c981p3707k813j3247p8494a0077E073J69521b04925i3147B9484
$$ -201954 -84710 -3981 -77688 -80501 -93748 -172242 -10077 5073 174594 -204925 -93147 29484
10862C3047b18302A86814o0275a9566C5545a09364B1321b5037l41463a34186B55839
$$ 33047 -218302 186814 126539 -19566 35545 -109364 21321 -25037 -366500 -134186 255839
10850a16927c4214F6184a40613b1054j82028F039a18388D1400a26267M8046o4403
$$ -116927 -34214 66184 -140613 -21054 -203082 6039 -118388 41400 -126267 -78221 -142624
10839a42624A47879b8147E41b34308a06553P648A45777a61948I9146J2481c91024
$$ -142624 147879 -28147 541 -234308 -106553 -98905 145777 -161948 99146 111627 -391024
10827F7735a13907L6946A6483g5463k5255k02755g2858j58351B13063c83237A15267
$$ 67735 -113907 -76961 16483 -75463 -100718 -303473 -72858 -231209 213063 -383237 115267
10815d2337j83159C8045r290c1144A69096i0953A58065f5693D4999P3491M4186
$$ -42337 -225496 38045 28755 -31144 169096 -90953 158065 -65693 44999 118490 162676
10804A62676a96874q2494M4947i6805i409l52648a0572m6520P305k56038i4925
$$ 162676 -196874 -279368 -234421 -96805 -9409 -362057 -10572 -57092 -49787 -305825 -94925
10792b53068C01497F8093b39162q2255h1356B82262h517j28784f8339k81128P8702
$$ -253068 301497 68093 -239162 -321417 -81356 282262 -8517 -137301 -68339 -349467 -270765
10781b70765a01291A2392J49805K49612A18296b01265F0660L14k2738b26006B88693
$$ -270765 -101291 12392 162197 411809 118296 -201265 60660 60974 38236 -226006 288693
10769A47739b03092F2380h4020B95935b30689B58384K2157a21365l36019A21641
$$ 147739 -203092 62380 -84020 295935 -230689 258384 280541 -121365 -457384 121641
10758b00350A3955c16473a00303a4958B2862O0372a80943m1052A686J14457i8595
$$ -200350 13955 -316473 -100303 -14958 22862 83234 -180943 -221995 1686 116143 -98595
10746C69373j79837g347n2527K3063F2695b93033b4889G9065h4231k43526J34335
$$ 369373 189536 -7347 -59874 -36811 62695 -293033 -24889 79065 -84231 -327757 -193422
10735a93422P5961B88593j08551a51692l5365Q4393I5180J74864a58917O8246
$$ -193422 -117461 288593 180042 -151692 -187057 -102664 95180 270044 -158917 -90671
10725i0671k8440A0286J15313D3137J49096b75294A87996g3103J8965b4678j83644
$$ -90671 -119111 10286 125599 43137 192233 -275294 187996 -73103 -54138 -24678 -208322
10714b08322P8693n8378e352k19809M8738j65841b4416j33459C02481A37120b22978
$$ -208322 -129629 -188007 -5352 -225161 -176423 -342264 -24416 -157875 302481 137120 -222978
10702a0470C6675d8749J5136F5066a37104l8965b7455l7870c0228p1944j65550
$$ -10470 36675 -48749 -33613 65066 -137104 -176069 -27455 -65325 -30228 -102172 -267722
10691b67722B1450b62266a051l91045A4189d8568l4819j76533f974j01050j92476
$$ -267722 21450 -262266 -1051 -392096 14189 -48568 -83387 -259920 -6974 -108024 -300500
10680c00500a08172q5437j15354J9953H0728Q8014J54676f9127G7199g0022j22095
$$ -300500 -108172 -193609 -308963 -289010 80728 168742 323418 -69127 77199 -70022 -192117
10669a92117B19020r4929l6017i904j7809k30696A63211a19012E277J13317a54387
$$ -192117 219020 124091 88074 -9904 -27713 -258409 163211 -119012 5277 118594 -154387
10657a60407l871g736F290P7989J643C801P574L473d4078B04868h681C8052b8968
$$ -160407 -164278 -7736 6290 84279 85922 3801 11375 14848 -44078 204868 -8681 38052 -28968
10643F7972a15923I6204c2778a1311A35163b36580A89659h901F8444a94955c4489
$$ 67972 -115923 96204 -32778 -11311 135163 -236580 189659 -8901 68444 -194955 -34489
10631A66591q2454i4783C2551i2180H4054L086a97562D556c330p5200B84842a17295
$$ 166591 84137 -94783 32551 -92180 84054 87140 -197562 4556 -3330 -78530 284842 -117295
10618a3972l40679L1989F6762d7015I3359b7650k57128A77240a21126E3014c1870
$$ -13972 -354651 -322662 66762 -47015 93359 -27650 -284778 177240 -121126 53014 -31870
10606A87050a69739d5371J2515A91799o2262b20058A83227l818K2126d1872G262
$$ 187050 -169739 -45371 -32856 191799 129537 -220058 183227 179409 201535 -41872 7262
10594A0719a3988k88812O7711B7794a6266m24k1395m95142c8791m8340A30392
$$ 10719 -13988 -302800 -235089 27794 -16266 -16690 -38085 -533227 -38791 -87131 130392
10582h1500J175j26102c4055k94240J31367b7668A22579c58926G4649h7094A06527
$$ -81500 -80325 -206427 -34055 -328295 -196928 -27668 122579 -358926 74649 -87094 106527
10570a42965c9142r427J0574l66226C7658f501a514l70430j04050a1191q2788
$$ -142965 -39142 -48569 -37995 -404221 37658 -6501 -1514 -371944 -475994 -11191 -93979
10559i3979l7641k89466a31196O1426D23647a51239b6448D5559c63217a75020
$$ -93979 -131620 -421086 -131196 -69770 423647 -151239 -26448 45559 -363217 -175020
10548a9215l18216a21413J4851H3210g479A67988J26971a68344c7786G2705g6245
$$ -19215 -337431 -121413 -106562 83210 -7479 167988 294959 -168344 -37786 72705 -76245
10536b78893P9715d1226B40114g885B6631a69680A12932a35037A9780e1563n7293
$$ -278893 -199178 -41226 240114 -7885 26631 -169680 112932 -135037 19780 -51563 -108856
10525a08856O813j9128l36661I8498b26044o5917i5105I3826M3806c8783r5864
$$ -108856 -102043 -121171 -457832 98498 -226044 -291961 -95105 93826 137632 -38783 -134647
10514a34647A88740H3961a87170J9993B10292b24677B8451M9759d0048l60545
$$ -134647 188740 83961 -187170 -167177 210292 -224677 28451 78210 -40048 -400593
10504d00593H1560a41148A08679a01921A09385O7267b7367k96484a18897o1880
$$ -400593 81560 -141148 108679 -101921 109385 176652 -27367 -323851 -118897 -180777
10494a80777j94920a37675G9111b52337A6040o343c6649j61049i5730j28482b8898
$$ -180777 -375697 -137675 79111 -252337 16040 9697 -36649 -197698 -95730 -224212 -28898
10482A63127h669j1248r3667A470e4214A2496a63775A4449f3453A51731P8273
$$ 163127 -8669 -19917 -113584 1470 -54214 12496 -163775 14449 -63453 151731 230004
10471B30004a04388M033r619B71133A02720a62875b363p2652J465M067p8907j5463
$$ 230004 -104388 -100355 -109974 271133 102720 -162875 -2363 -75015 -73550 -69483 -148390 -163853
10459a63853k76020d5853C2517b66280N6704R8376C45107c8071k01100J12939
$$ -163853 -439873 -45853 32517 -266280 -209576 -111200 345107 -38071 -239171 -126232
10449a26232o5389C0805N1751J49480J17389j09253f0387A19273b5601A2744J19048
$$ -126232 -191621 30805 82556 232036 349425 240172 -60387 119273 -25601 12744 131792
10438A31792E1837R1419J66148H2869C70e9426m0688o2896A12874c06906d7040
$$ 131792 51837 143256 309404 82869 370 -59426 -100114 -163010 112874 -306906 -47040
10426a52295B4446J3297b49433r368j6405K283B77211A36370R1701f9029l68044
$$ -152295 24446 37743 -249433 -258801 -275206 -272923 277211 136370 228071 -69029 -437073
10415d37073b03264J5697m6167A02519m313g9904B62730c3046G1576b07275F4746
$$ -437073 -203264 -187567 -233734 102519 98206 -79904 262730 -33046 71576 -207275 64746
10403B8943J18138K3025K03683a03672I0138b61661A25535P7746B6446a74389
$$ 28943 147081 170106 373789 -103672 90138 -261661 125535 203281 26446 -174389
10392B00786e8358D15148q6414c8991C55777a08581b276B06617l1768f03310A12633
$$ 200786 -58358 415148 328734 -38991 355777 -108581 -2276 206617 174849 -603310 112633
10380a5761G061a46708A70241b4274B64021H8773K21215e0738A94647k3614g1277
$$ -15761 7061 -146708 170241 -24274 264021 88773 309988 -50738 194647 171033 -71277
10368C67030n3197P7274d0820E3442R6598K29247A49849F4562Q1231B3328a18368
$$ 367030 313833 391107 -40820 53442 150040 379287 149849 64562 145793 23328 -118368
10356g0749C65709J17078k16691j10725L25410A68721A2472J87344K23585A14389
$$ -70749 365709 482787 266096 155371 480781 168721 12472 199816 423401 114389
10345A58424Q3987d2722B65611J24672A40576a95138C23207j04192L5156o8251
$$ 158424 242411 -42722 265611 390283 140576 -195138 323207 219015 254171 185920
10335A85920N39130H9308d8777A61291d7699A21458e7326H8949J70591C4067R4630
$$ 185920 725050 89308 -48777 161291 -47699 121458 -57326 88949 259540 34067 128697
10324A28697a0302B30996k2864A3632K34778J50168j45169D4069a2183o7681H8276
$$ 128697 -10302 230996 208132 13632 248410 398578 253409 44069 -12183 -79864 88276
10312g2954H3928j8724R6350b01561N8253p0685A26819e5862H4858h6120M063
$$ -72954 83928 65204 161554 -201561 -143308 -213993 126819 -55862 84858 -86120 -82057
10301h2057a9534B9760N9068r285J4059b09339A99589m1574i9662A22546b80268
$$ -82057 -19534 29760 88828 79543 93602 -209339 199589 158015 -99662 122546 -280268
10289c3550k8939A7188a35832C19300D3293A9916J25754i8265K7694A90502i9048
$$ -33550 -62489 17188 -135832 319300 43293 19916 145670 -98265 -70571 190502 -99048
10277B3572Q0944a47701n9594J03067D9157i8307C734J53099a4555j28545c8389
$$ 23572 104516 -147701 -207295 -104228 49157 -98307 3734 156833 -14555 -143100 -38389
10265A29137e4096A17237J6594c11098E6252a39567A80457J07892K6431L9372
$$ 129137 -54096 117237 133831 -311098 56252 -139567 180457 288349 314780 354152
10255C54152b23448C5053j1995c35966J35034c8914A6884P5538L9013c8292j57199
$$ 354152 -223448 35053 23058 -335966 -200932 -38914 16884 92422 131435 -38292 -195491
10244a95491A4542f6683j99954C92470i2159D8026e1018H9527b28624B4334K51525
$$ -195491 14542 -66683 -266637 392470 -92159 48026 -51018 89527 -228624 24334 275859
10233B75859b33460d2745B46504h7257j8303C1831M0765E226M13698a96903D2976
$$ 275859 -233460 -42745 246504 -87257 -105560 31831 72596 5226 418924 -196903 42976
10221c29111K4706N8204Q2009j10789a4168l25293L6781A22671c4229k34135E0196
$$ -329111 -304405 -246201 -164192 -274981 -14168 -339461 -302680 122671 -34229 -268364 50196
10209B12096A2450a58356q1668j5956G242Q5004a1121A71280a24968e8341E3699
$$ 212096 12450 -158356 -240024 -255980 7242 92246 -11121 171280 -124968 -58341 53699
10197b04318A75914L0412b56370m1447R4499P6486a4175j79425A38876a50408
$$ -204318 175914 206326 -256370 -297817 -203318 -126832 -14175 -193600 138876 -150408
10186c21069A53671b36394l7683E3704K8951h9845H1634a86323A43601e9025a6905
$$ -321069 153671 -236394 -274077 53704 82655 -89845 81634 -186323 143601 -59025 -16905
10174a43061q4596C69751A60065a57253h232G7715a60675f3320Q193j48690j39329
$$ -143061 -227657 369751 160065 -157253 -8232 77715 -160675 -63320 -55127 -203817 -343146
10163c43146K7837D37966e25p6165B29804a71740C1105J04901b70334H9447p238
$$ -343146 -315309 437966 -525 -76690 229804 -171740 31105 136006 -270334 89447 82209
10152H2209b0068A79858a1988l76814J3566a55663H7694e0237N706E1776l156
$$ 82209 -20068 179858 -11988 -388802 -375236 -155663 87694 -50237 -44531 51776 48620
10141D8620a62911g1282C9382b78602b5520j06207j8434M7337D7687J46395e6887
$$ 48620 -162911 -71282 39382 -278602 -25520 -131727 -150161 -102824 47687 194082 -56887
10129B03545i8678p4058r064G8472N7883i1770j24454G7876b02874F7839J74996
$$ 203545 -98678 -172736 -181800 78472 136355 -91770 -216224 77876 -202874 67839 242835
10118B42835h835D4640b69162a08523B39886P4584b00498q4632P5096f6431K7886
$$ 242835 -8835 44640 -269162 -108523 239886 314470 -200498 -285130 -210034 -66431 -38545
10107c8545l0831c0358j41467d5719q7833e4562k81054d07r9025B74536f6495
$$ -38545 -69376 -30358 -171825 -45719 -133552 -54562 -335616 -407 -99432 274536 -66495
10095c1091a960q302j20568B92240a01084A14030j0712L8605A1508b95713A75070
$$ -31091 -1960 -10262 -130830 292240 -101084 114030 103318 141923 11508 -295713 175070
10083i7103M0863D04188d40699B10672g517n55921a01614I5487a10090j47780
$$ -97103 -56240 404188 -440699 210672 -7517 -563438 -101614 95487 -110090 -257870
10073b57870i2815A13654a31697J0066F3717a52276q5078i1963k60199B14795
$$ -257870 -92815 113654 -131697 -121631 63717 -152276 -237354 -91963 -352162 214795
10062h6764k11254C62564A61443a90220G4670P3210h0684p7791q7328g6195D7942
$$ -86764 -298018 362564 161443 -190220 74670 147880 -80684 -158475 -245803 -76195 47942
10050a53840A54331K33834c48366g0708k2645a1273r0417D7573K7404h4147k07433
$$ -153840 154331 388165 -348366 -70708 -93353 -11273 -101690 47573 74977 -84147 -291580
10039b91580J5959R7551e1349G5118i9166G7081Q0415a87750k11459I7880a64015
$$ -291580 -275621 -178070 -51349 75118 -99166 77081 157496 -187750 -399209 97880 -164015
10027e6658j79772r646B17213e4298D5083g5210m46218b3001j23696m0825j23663
$$ -56658 -236430 -246076 217213 -54298 45083 -75210 -521428 -23001 -146697 -187522 -311185
10016c11185R9414Q1538O905A6927a00781G1460J66428c0688R912I4225D2766
$$ -311185 -211771 -130233 -123328 16927 -100781 71460 237888 -30688 -20776 94225 42766
10004A03304c0013B04875a09882c3551C40404A01385L0941c4370A2304a12624
$$ 103304 -30013 204875 -109882 -33551 340404 101385 132326 -34370 12304 -112624
9993c30658A41386F6377C1518c00233a16623j29373E48222a17701A54921c1017
$$ -330658 141386 66377 31518 -300233 -116623 -245996 548222 -117701 154921 -31017
9982a17324M4846k57361i0936j10806h7555B7362b33696B6705b80748a2074D459
$$ -117324 -72478 -329839 -90936 -201742 -87555 27362 -233696 26705 -280748 -12074 4459
9970a20577o7822N8961d6584j0337k57180h2758A10991a52976H762c33565A47856
$$ -120577 -188399 -129438 -46584 -56921 -314101 -82758 110991 -152976 8762 -333565 147856
9958c1593B84556b8491A66925g4272g037k21159c203D3385b23467A48247j1356
$$ -31593 284556 -28491 166925 -74272 -7037 -228196 -3203 43385 -223467 148247 136891
9947A36891H955a5992k8078g967j45963A52403Q1903n437e8605A80586B8879A2362
$$ 136891 8955 -15992 -44070 -7967 -153930 152403 234306 228869 -58605 180586 28879 12362
9934e7459n8010q9650A47550J79111b06135C0306i5764J0418n9064C9068O9507
$$ -57459 -115469 -205119 147550 326661 -206135 30306 -95764 -85346 -144410 39068 108575
9923A08575c5594m7849n1914j5214A07813a74612f7951A89190b79693Q7718A1857
$$ 108575 -35594 -83443 -135357 -150571 107813 -174612 -67951 189190 -279693 -191975 11857
9911a28301j61684i7829B4967a2362j32111c5688k18557c5571j76155g7033B18352
$$ -128301 -289985 -97829 24967 -12362 -144473 -35688 -254245 -35571 -211726 -77033 218352
9899b9900E9736L5488a54366m7050k42546J23639B38727H5384b3819G2079e5677
$$ -29900 59736 95224 -154366 -201416 -443962 -320323 238727 85384 -23819 72079 -55677
9887A69219b69050g4957d909I5572b41176E4989B6516d55669K13165P7178L3443
$$ 169219 -269050 -74957 -4909 95572 -241176 54989 26516 -455669 -242504 -165326 -131883
9876a31883l10287F8509C1541a84305g5173j35673a7565m00231A17963B4350a24277
$$ -131883 -442170 68509 31541 -184305 -75173 -210846 -17565 -417796 117963 24350 -124277
9864A80550l7019b20863J06319B01559a12956C2526b0589k49028b1407j03636
$$ 180550 143531 -220863 -114544 201559 -112956 32526 -20589 -269617 -21407 -125043
9854a25043e9092j70095k11208F2984a97820Q0747c7259A489c7422j39539k20684
$$ -125043 -59092 -229187 -440395 62984 -197820 -117073 -37259 1489 -37422 -176961 -397645
9843c97645B13091A399b58679p9426j8075g5302L304G6919a08581A00745h0586
$$ -397645 213091 1399 -258679 -338105 -356180 -75302 -71998 76919 -108581 100745 -80586
9831e5756l56557A70586b4806j54364Q7604k26968g3622j04686F2066f8689B55847
$$ -55756 -412313 170586 -24806 -179170 -91566 -318534 -73622 -178308 62066 -68689 255847
9819B51660R5173j52274C8331f192j95546j43544a00647d7125G093a10695L6433
$$ 251660 346833 194559 38331 -6192 -201738 -345282 -100647 -47125 7093 -110695 -74262
9808g4262j89125P2490r9489o5571B367K22263b11967A14648B4919K79555b282
$$ -74262 -263387 -190897 -290386 -355957 2367 224630 -211967 114648 24919 304474 -2282
9796A87260b29593A47268b0274k83745a00541F1347a43844j78173N4517j09220
$$ 187260 -229593 147268 -20274 -304019 -100541 61347 -143844 -322017 -267500 -376720
9786c76720d9069G7447I806a96771B10433L7192c27711A6241K6050M4503b91866
$$ -376720 -49069 77447 9806 -196771 210433 247625 -327711 16241 42291 86794 -291866
9774a96294A10007J1007l4656c7365B04099c7916j47033l69838b46252A1305b77817
$$ -196294 110007 121014 86358 -37365 204099 -37916 -184949 -554787 -246252 11305 -277817
9762a63151e5768b0468j1366C8300f3703F0616a63018N5988p5460g1161a808j20304
$$ -163151 -55768 -20468 -31834 38300 -63703 60616 -163018 -107030 -182490 -71161 -1808 -122112
9750a22112k3710K0104p0699H085J40546c31376A09325b75345A12513H671K1506
$$ -122112 -145822 -125718 -196417 8085 148631 -331376 109325 -275345 112513 8671 30177
9739C0177P777a79823A01981J04739p9679l8016h6861n8302K9222F4564a80490
$$ 30177 37954 -179823 101981 206720 127041 89025 -86861 -145163 -115941 64564 -180490
9727F6055a09228A0657J6052K33604j01681C6123j7345L7912a38925A60574b17198
$$ 66055 -109228 10657 26709 260313 158632 36123 18778 56690 -138925 160574 -217198
9715A69951b2881k96930A13590b46814A45528a92746A77284q7717j5988K5845
$$ 169951 -22881 -319811 113590 -246814 145528 -192746 177284 89567 73579 99424
9705I9424f6351j5023d478j65937j71636g2565j08661i685A74408l0164D0082
$$ 99424 -66351 -81374 -4478 -170415 -342051 -72565 -181226 -9685 174408 144244 40082
9693b43278e475q113j28610b1763j26962g1913q2594e4448a8380p2374j85304
$$ -243278 -5475 -13588 -142198 -21763 -148725 -71913 -154507 -54448 -18380 -90754 -276058
9682b76058C07783g8670a7076B96852d8044B48559b46859M3660d8477p5319j55849
$$ -276058 307783 -78670 -17076 296852 -48044 248559 -246859 -203199 -48477 -123796 -279645
9671b79645a10871q890M6B9489J23576a34683M2574A32632g3691A5395a36442
$$ -279645 -110871 -119761 -119715 29489 153065 -134683 -92109 132632 -73691 15395 -136442
9659a91722b9105B47558d1869j97222j59050i9140a6059l2237l1916A94400a85700
$$ -191722 -29105 247558 -41869 -239091 -398141 -99140 -16059 -48296 -80212 194400 -185700
9647A22299a31163j35129j2984a31863k15565A96979C2433b89326q468J44904
$$ 122299 -131163 -266292 -279276 -131863 -347428 196979 32433 -289326 -297794 -152890
9637a52890a4404B85134a52163c5127D3680J15399a39253B16666e1596o3996I5685
$$ -152890 -14404 285134 -152163 -35127 43680 159079 -139253 216666 -51596 -115592 95685
9625b30982F9566J32247a64275A998P1451b64745A94279b37692p9556A19498a48087
$$ -230982 69566 201813 -164275 1998 73449 -264745 194279 -237692 -317248 119498 -148087
9613B56462c16207J0258a39222G9237l265b62169J14517c185l33266a53198p2931
$$ 256462 -316207 -305949 -139222 79237 75972 -262169 -147652 -3185 -336451 -153198 -226129
9602b26129B46785E6585b29523G5309i8808A85501f4930n7434a8995k62482f6267
$$ -226129 246785 56585 -229523 75309 -98808 185501 -64930 -122364 -18995 -281477 -66267
9590B09826a79261d5471o5785J487d8254j23494r601E4945a39663p3626F5596
$$ 209826 -179261 -45471 -111256 -109769 -48254 -171748 -181349 54945 -139663 -213289 65596
9578a90048g97G4053c14623F3651c86893A08737B1599b49580i6975A8650i3945
$$ -190048 -797 74053 -314623 63651 -386893 108737 21599 -249580 -96975 18650 -93945
9566a97403j33764A24805m6700J55816r683J9361j09426a04927j88819A16497
$$ -197403 -331167 124805 78105 233921 224238 243599 134173 -104927 -293746 116497
9555c50002a32156C4837e5405j11447B01299B6807M2165O1749b6366m6064r9698
$$ -350002 -132156 34837 -55405 -166852 201299 26807 68972 130721 -26366 -72430 -172128
9544a72128C04608a95122B25004i5980d6691m9739j00902l7916O4852e4235j55716
$$ -172128 304608 -195122 225004 -95980 -46691 -96430 -197332 -235248 -170396 -54235 -209951
9533b09951g9567q6954E4088i3286a8458k12929c6289q0008d2142p3936m39469
$$ -209951 -79567 -166521 54088 -93286 -18458 -231387 -36289 -116297 -42142 -116078 -555547
9522e55547J82163f9671k64231a32929m169M3700j0299G8981R6020e3463A34785
$$ -555547 -373384 -69671 -333902 -132929 -137098 -93398 -103697 78981 175001 -53463 134785
9510a78182G6645a72311B1497L9299J04441a90956O7995H8323f5767C4065d9429
$$ -178182 76645 -172311 21497 60796 165237 -190956 -122961 88323 -65767 34065 -49429
9498f1129a4875H2712o692K749c31j17676C6508N2655h0420A0240a61358D4236
$$ -61129 -14875 82712 76020 78769 -331 -118007 36508 89163 -80420 10240 -161358 44236
9485i7535H2807i8456n8490A54790a46732j52823A7546J45440a79249A4865F447
$$ -97535 82807 -98456 -156946 154790 -146732 -299555 17546 162986 -179249 14865 6447
9473b60416a12802G8602L89754a65251B05369l6249D7536d8859m5455j45424C7463
$$ -260416 -112802 78602 468356 -165251 205369 169120 47536 -48859 -94314 -239738 37463
9461e851p5796l96187d1100H5286a36531E5407J07117K1698e5020A1470h256l45011
$$ -5851 -81647 -477834 -41100 85286 -136531 55407 162524 184222 -55020 11470 -8256 -353267
9449c53267A98952B2383c12953d6797A92192C7209j1926Q0591A3998A014h7569
$$ -353267 198952 22383 -312953 -46797 192192 37209 25283 105874 13998 1014 -87569
9437A59367a28934r2458L2233f9490j51237h1545l2801c9537k68411A79004a17794
$$ 159367 -128934 -221392 -189159 -69490 -220727 -81545 -114346 -39537 -307948 179004 -117794
9425B28515F8843g3962A9096J1689o372c6964j31907l45404A23136c04855d8652
$$ 228515 68843 -73962 19096 30785 24413 -36964 -168871 -514275 123136 -304855 -48652
9413A98344d30213J93452b0049j71395i3196m2134D7007q899a70895O9783A09622
$$ 198344 -430213 -236761 -20049 -191444 -93196 -135330 47007 38108 -170895 -101112 109622
9401A61563b02930Q9563c4275a3772m30159K01439b6440k86551J46488k05600
$$ 161563 -202930 -113367 -34275 -13772 -443931 -242492 -26440 -312991 -166503 -372103
9391c72103a6173l94950a8718p35604a52180P5611c1610C50794I2643a31268k6363
$$ -372103 -16173 -411123 -18718 -754322 -152180 -76569 -31610 350794 92643 -131268 -157631
9380a57631j63048A26510b14926j17592a51323p6477A66794h8565J660n000k25537
$$ -157631 -320679 126510 -214926 -332518 -151323 -227800 166794 -88565 -86905 -91905 -317442
9369c17442j51802B63418p6848b48230A01473b02216H5827O6807b16689I2340
$$ -317442 -469244 263418 186570 -248230 101473 -202216 85827 152634 -216689 92340
9358b13013A23346c40828a51248a4182q3937c9593p9944C36758d1290D3515a28168
$$ -213013 123346 -340828 -151248 -14182 -98119 -39593 -119537 336758 -41290 43515 -128168
9346h518I2911c527m9673l64722a66540l25964a57546M85k37821a59329a0951
$$ -8518 92911 -3527 -53200 -417922 -166540 -492504 -157546 -157061 -394882 -159329 -10951
9334A41177a1176A40781l7835a96541C2796a52161G6009d4612H5876c5548q1677
$$ 141177 -11176 140781 102946 -196541 32796 -152161 76009 -44612 85876 -35548 -117225
9323a17225M1022k1789E2683J95164D5244J39136B3592a17477j16835M9878L6651
$$ -117225 -76203 -97992 52683 247847 45244 184380 23592 -117477 -234312 -184434 -147783
9312a47783j1873c4719B6074i0491H572J54938b28986F5336c48048g1991j14455
$$ -147783 -159656 -34719 26074 -90491 8572 163510 -228986 65336 -348048 -71991 -186446
9301a86446B37156e1613k36376b0157r0690k15556k4748a64950e0389B3812g2359
$$ -186446 237156 -51613 -287989 -20157 -110847 -326403 -351151 -164950 -50389 23812 -72359
9289b15746r4271C7557b44062C2608J38466d2146B1673c96217J27765A59911a26790
$$ -215746 -310017 37557 -244062 32608 171074 -42146 21673 -396217 -268452 159911 -126790
9277H6934f6699B10768D6022A7473J74217H5483d0245A44533K5334j5813C6390
$$ 86934 -66699 210768 46022 17473 191690 85483 -40245 144533 169867 154054 36390
9265A37615F541b82454L666C34684A13600b036o7321B81423f4157B22206n9038
$$ 137615 6541 -282454 -278788 334684 113600 -2036 -69357 281423 -64157 222206 163168
9254A63168d00204A06339h8435C6481K08805h3900A5741C253b67001A6693Q22
$$ 163168 -400204 106339 -88435 36481 245286 -83900 15741 3253 -267001 16693 17515
9243A7515a86655C50613F6011i4729C02743b0237D7029a49888j08623L0225L680
$$ 17515 -186655 350613 66011 -94729 302743 -20237 47029 -149888 -258511 -228286 -224606
9232b24606D9503L5047h9947l21255J59017A86718D3493J4011a02253j81377C4235
$$ -224606 49503 84550 -89947 -411202 -252185 186718 43493 57504 -102253 -283630 34235
9220a1231D9703a30715j03358A26844e6517b0863A65959e8894A70466a91718F9268
$$ -11231 49703 -130715 -234073 126844 -56517 -20863 165959 -58894 170466 -191718 69268
9208a8942j9926B05497c41717R9241a5810E7425a45085e7346k76583a3991l58077
$$ -18942 -38868 205497 -341717 -242476 -15810 57425 -145085 -57346 -333929 -13991 -372068
9197c72068A23209a94779G5383j7031d7202q3264B14624i2335A66646n5279b87021
$$ -372068 123209 -194779 75383 58352 -47202 -130466 214624 -92335 166646 111367 -287021
9185B66762a36445A26959J6180o3228J96707a18952C05947B9339a9334R126L30
$$ 266762 -136445 126959 143139 79911 276618 -118952 305947 29339 -19334 -10208 -9878
9174i878j72820B23559B6304a19505M9474b6038k96427B0253c15952a54891l9416
$$ -9878 -182698 223559 26304 -119505 -70031 -26038 -322465 20253 -315952 -154891 -194307
9163a94307n4689a02494d3216j18133F3283c261j33078B02736r1980i5714A71039
$$ -194307 -248996 -102494 -43216 -161349 63283 -3261 -136339 202736 110756 -95714 171039
9151b00676E1869A0125a27096I8392a42752j72281e4985F7337e0779B68661J8760
$$ -200676 51869 10125 -127096 98392 -142752 -315033 -54985 67337 -50779 268661 287421
9140B87421J7588D95J34680K2535J4498b25210M8178c6356n7736A3134a52195
$$ 287421 305009 495 135175 157710 172208 -225210 -177032 -36356 -94092 13134 -152195
9128H6701P8937b16908Q7821l56663g2381a576o6146m4922A18657i1226B6893
$$ 86701 165638 -216908 -129087 -485750 -72381 -1576 -67722 -112644 118657 -91226 26893
9116A36450G568e4479B3120K03479a77326J6530k6849B05040C8179b66048a01323
$$ 136450 7568 -54479 23120 226599 -177326 -160796 -187645 205040 38179 -266048 -101323
9104a28513A11573C8492a38476j4483h926k2048B51237e8909I5099B9155I709
$$ -128513 111573 38492 -138476 -152959 -8926 -30974 251237 -58909 95099 29155 9709
9092c4536q9521K6024d8541q5811A50198e0233j85377e9492j3631A16018b55120
$$ -34536 -124057 -98033 -48541 -134352 150198 -50233 -235610 -59492 -73123 116018 -255120
9080A51046f6873m033q568E6112a89790q3654N6954E1870f7600A70560b18223
$$ 151046 -66873 -70906 -79474 56112 -189790 -273444 -216490 51870 -67600 170560 -218223
9068a72462A55300a86515a9866O099n2240j51158A15272e2677j03895C10622b08063
$$ -172462 155300 -186515 -19866 -13767 -66007 -217165 115272 -52677 -156572 310622 -208063
9056E9342b01457g8774k20093B21608m2687c79319a7515j82748A57765o8674b3120
$$ 59342 -201457 -78774 -298867 221608 178921 -379319 -17515 -200263 157765 89091 -23120
9044b55162d4622m3142G7602b93626N491B07585a89890K5326P2066l78559B4150
$$ -255162 -44622 -87764 77602 -293626 -288135 207585 -189890 -164564 -92498 -471057 24150
9032H6292R546a2343q5557l75j14916E576c72977A57878a34172L1702G5551a6601
$$ 86292 95838 -12343 -97900 -98275 -213191 5576 -372977 157878 -134172 -102470 75551 -16601
9019b87835I1552b23599A12876a77315K2812B0382a19900j37407A85837A4739
$$ -287835 91552 -223599 112876 -177315 -154503 20382 -119900 -257307 185837 14739
9008a33815o3492L2132a547k509o984k37099a2013m0806A60255b03907A28210
$$ -133815 -197307 -165175 -1547 -4056 -11040 -248139 -12013 -52819 160255 -203907 128210
8996H396P0133b37735d3619D2104c86971J67075l2994M88B84953m3370F147g4746
$$ 8396 78529 -237735 -43619 42104 -386971 -219896 -252890 -252402 284953 241583 6147 -74746
8983a16039h546q4175j28839C17607c42259C36525A8719e28553J50491J18381
$$ -116039 -8546 -92721 -221560 317607 -342259 336525 18719 -528553 -378062 -259681
8973b59681b1362m4466k85096a44950A6939R1646b46716A63339D1042a86266k57396
$$ -259681 -21362 -65828 -350924 -144950 16939 108585 -246716 163339 41042 -186266 -443662
8962d43662L4495A0189b12346B34107a96676l56C52504a61264M7616j22668j12223
$$ -443662 -409167 10189 -212346 234107 -196676 -197032 352504 -161264 -113648 -236316 -348539
8951c48539R8401A39427J65706H6642J9019i9549G9797a51056c3666A61235g1163
$$ -348539 -250138 139427 305133 86642 105661 -99549 79797 -151056 -33666 161235 -71163
8939a51372D6487Q9166J91902a25112j15740C06848A13182k6084a51659O0542
$$ -151372 46487 135653 327555 -125112 -240852 306848 113182 87098 -151659 -91117
8929i1117j77026a18063I3695B4423K71298G5193J50152M21519J248120J972406
$$ -91117 -268143 -118063 93695 24423 295721 75193 225345 646864 1894984 3867390
8919C867390A104108B49725J99408A55516f8056o0563d6663A64703c1941j78627
$$ 3867390 1104108 249725 449133 155516 -68056 -128619 -46663 164703 -31941 -210568
8909b10568O3392A08690K77689A41416a25614A77014a56195A91875b9496D0106
$$ -210568 -147176 108690 386379 141416 -125614 177014 -156195 191875 -29496 40106
8898a84255B17694A03882a3324A33510a48624a4490j94811k8905J09550l3561
$$ -184255 217694 103882 -13324 133510 -148624 -14490 -209301 -238206 -128656 -162217
8888a62217B2979c67196J81864K9068A35937B215g5305k25055f6194q6517J3706
$$ -162217 22979 -367196 -185332 -156264 135937 2215 -75305 -300360 -66194 -152711 -139005
8877a39005j18404C6249n673a57030B70182b01128l6993c3903j47978k31677a85444
$$ -139005 -257409 36249 30576 -157030 270182 -201128 -238121 -33903 -181881 -413558 -185444
8865I8828b80608e2726B9361b48907b3846B00363j1180b30665K7594K8522H9794
$$ 98828 -280608 -52726 29361 -248907 -23846 200363 189183 -230665 -203071 -174549 89794
8853A18857b2656A37758A6072c86988J88915A7828K15963h4894L2627b4007j5668
$$ 118857 -22656 137758 16072 -386988 -198073 17828 233791 -84894 -52267 -24007 -39675
$$ [...]
##END NTUPLES=NMR SPECTRUM
##END=
