##TITLE=AC1669_DOMRH14360_8570773_FWEQ2OPx1Q
##JCAMPDX= 6.0         $$ Bruker NMR JCAMP-DX V2.0
##DATA TYPE= NMR SPECTRUM
##DATA CLASS= NTUPLES
##ORIGIN= BRUKER
##OWNER= Administrator
$$ 1.72 TOPSPIN		Version 2.1
$$ 2015-08-11 19:30:18.585 -0700  Administrator@X
$$ Compression mode = diff/dup
##.OBSERVE FREQUENCY= 400.02188249412
##.OBSERVE NUCLEUS= ^1H
##.ACQUISITION MODE= SIMULTANEOUS (DQD)
##.ACQUISITION SCHEME= undefined
##.AVERAGES= 64
##.DIGITISER RES= 22
##SPECTROMETER/DATA SYSTEM= spect
##.PULSE SEQUENCE= noesygpps1d.comp
##.SOLVENT NAME= COFFEE_meoh
##.SHIFT REFERENCE= INTERNAL, COFFEE_meoh, 1, 14.96173
##AUDIT TRAIL= $$ (NUMBER, WHEN, WHO, WHERE, PROCESS, VERSION, WHAT)
$$ ##TITLE= Audit trail, TOPSPIN		Version 2.1
$$ ##JCAMPDX= 5.01
$$ ##ORIGIN= Bruker BioSpin GmbH
$$ ##OWNER= Administrator
$$ $$ E:\/data/COFFEE/nmr/AC1669_DOMRH14360_8570773_FWEQ2OPx1Q/32/pdata/1/auditp.txt
$$ ##AUDIT TRAIL=  $$ (NUMBER, WHEN, WHO, WHERE, PROCESS, VERSION, WHAT)
(   1,<2015-08-11 19:30:12.835 -0700>,<Administrator>,<X>,<go>,<TOPSPIN 2.1>,
      <created by zg
	started at 2015-08-11 19:18:43.054 -0700,
	POWCHK enabled, PULCHK disabled,
       configuration hash MD5:
       21 0F 79 D6 B3 7B B4 F6 88 20 88 DB 03 48 BD 9F
       data hash MD5: 64K
       1B A5 62 86 3E 98 2B C0 9C 18 E9 4F 77 B0 85 70>)
(   2,<2015-08-11 19:30:16.492 -0700>,<Administrator>,<X>,<proc1d>,<TOPSPIN 2.1>,
      <Start of raw data processing
       efp LB = 0.3 FT_mod = 6 PKNL = 1 PHC0 = 0 PHC1 = 0 SI = 128K 
       data hash MD5: 128K
       FE 52 00 9C 9C 8B 91 42 6A 10 43 D5 55 B9 BA C1>)
(   3,<2015-08-11 19:30:17.382 -0700>,<Administrator>,<X>,<proc1d>,<TOPSPIN 2.1>,
      <pk PHC0 = 269.7913 PHC1 = 0 
       data hash MD5: 128K
       88 65 F6 F0 10 2B AB D0 CA E4 08 95 3F 89 92 42>)
(   4,<2015-08-11 19:30:17.773 -0700>,<Administrator>,<X>,<proc1d>,<TOPSPIN 2.1>,
      <abs ABSG = 1 
       data hash MD5: 128K
       49 12 89 DD F7 F1 ED A0 4E A3 83 A4 FE 05 58 A6>)
(   5,<2015-08-11 19:30:17.867 -0700>,<Administrator>,<X>,<proc1d>,<TOPSPIN 2.1>,
      <abs ABSG = 2 
       data hash MD5: 128K
       13 FA 18 30 7E 79 A6 D2 DE 41 0F 17 2F A2 59 92>)
(   6,<2015-08-11 19:30:17.945 -0700>,<Administrator>,<X>,<proc1d>,<TOPSPIN 2.1>,
      <abs ABSG = 3 
       data hash MD5: 128K
       E3 6F 2C 0B C5 B9 D6 20 20 6C B8 4C 71 02 35 CE>)
(   7,<2015-08-11 19:30:18.039 -0700>,<Administrator>,<X>,<proc1d>,<TOPSPIN 2.1>,
      <abs ABSG = 4 
       data hash MD5: 128K
       63 25 C9 AE 67 BB F3 E1 47 EC 6B 2D AA E3 F2 BD>)
(   8,<2015-08-11 19:30:18.179 -0700>,<Administrator>,<X>,<proc1d>,<TOPSPIN 2.1>,
      <abs ABSG = 5 
       data hash MD5: 128K
       D2 BB 0B 66 1C 5A 16 94 78 90 D5 7F D3 EE C0 4B>)
$$ ##END=
$$ 
$$ $$ hash MD5
$$ $$ 04 50 D8 2C 3E E9 B8 EE 60 40 06 D6 3C A1 AE EE
##$RELAX= 
##$RELAX= 
##$RELAX= 
##$RELAX= 
##$RELAX= 
##$RELAX= 
##$RELAX= 
##$RELAX= 
$$ Bruker specific parameters
$$ --------------------------
##$DU= <E:\>
##$EXPNO= 32
$$ [...]
##$TP07= 0
##$TPNAME0= <>
##$TPNAME1= <>
##$TPNAME2= <>
##$TPNAME3= <>
##$TPNAME4= <>
##$TPNAME5= <>
##$TPNAME6= <>
##$TPNAME7= <>
##$TPOAL= (0..7)
0.5 0.5 0.5 0.5 0.5 0.5 0.5 0.5
##$TPOFFS= (0..7)
0 0 0 0 0 0 0 0
##$TUNHIN= 0
##$TUNHOUT= 0
##$TUNXOUT= 0
##$USERA1= <user>
##$USERA2= <user>
##$USERA3= <user>
##$USERA4= <user>
##$USERA5= <user>
##$V9= 5
##$VALIST= <valist>
##$VCLIST= <CCCCCCCCCCCCCCC>
##$VD= 0
##$VDLIST= <DDDDDDDDDDDDDDD>
##$VPLIST= <PPPPPPPPPPPPPPP>
##$VTLIST= <TTTTTTTTTTTTTTT>
##$WBST= 2048
##$WBSW= 25
##$XGAIN= (0..3)
0 0 0 0
##$XL= 0
##$YL= 0
##$YMAX_a= 5203377
##$YMIN_a= -10338628
##$ZGOPTNS= <>
##$ZL1= 120
##$ZL2= 120
##$ZL3= 120
##$ZL4= 120
##$ABSF1= 14.96173
##$ABSF2= -5.596452
##$ABSG= 5
##$ABSL= 3
##$ALPHA= 0
##$AQORDER= 0
##$ASSFAC= 0
##$ASSFACI= 0
##$ASSFACX= 0
##$ASSWID= 0
##$AUNMP= <proc_prof1d_extract.lims>
##$AXLEFT= 0
##$AXNAME= <>
##$AXNUC= <1H>
##$AXRIGHT= 0
##$AXTYPE= 0
##$AXUNIT= <>
##$AZFE= 0.1
##$AZFW= 0.1
##$BCFW= 0
##$BC_mod= 0
##$BYTORDP= 0
##$COROFFS= 0
##$CY= 15
##$DATMOD= 1
##$DC= 0
##$DFILT= <>
##$DTYPP= 0
##$F1P= 0
##$F2P= 0
##$FCOR= 0.5
##$FTSIZE= 131072
##$FT_mod= 6
##$GAMMA= 0
##$GB= 0
##$INTBC= 1
##$INTSCL= 1
##$ISEN= 128
##$LB= 0.3
##$LEV0= 0
##$LPBIN= 0
##$MAXI= 10000
##$MC2= 0
##$MEAN= 0
##$ME_mod= 0
##$MI= 0
##$NCOEF= 0
##$NC_proc= -2
##$NLEV= 6
##$NOISF1= 0
##$NOISF2= 0
##$NSP= 0
##$NTH_PI= 0
##$NZP= 0
##$OFFSET= 14.96173
##$PC= 1
##$PHC0= 269.7913
##$PHC1= 0
##$PH_mod= 1
##$PKNL= yes
##$PPARMOD= 0
##$PPDIAG= 0
##$PPIPTYP= 0
##$PPMPNUM= 2147483647
##$PPRESOL= 1
##$PSCAL= 4
##$PSIGN= 0
##$PYNMP= <proc.py>
##$REVERSE= no
##$SF= 400.020009345083
##$SI= 131072
##$SIGF1= 0
##$SIGF2= 0
##$SINO= 400
##$SIOLD= 131072
##$SPECTYP= <>
##$SREGLST= <1H.CDCl3>
##$SSB= 0
##$STSI= 131072
##$STSR= 0
##$SW_p= 8223.68421052631
##$SYMM= 0
##$S_DEV= 0
##$TDeff= 65536
##$TDoff= 0
##$TI= <>
##$TILT= no
##$TM1= 0
##$TM2= 0
##$TOPLEV= 0
##$USERP1= <user>
##$USERP2= <user>
##$USERP3= <user>
##$USERP4= <user>
##$USERP5= <user>
##$WDW= 1
##$XDIM= 131072
##$YMAX_p= 435348302
##$YMIN_p= -11402
##$CURPLOT= <Network HP LaserJet P1505>
##$CURPRIN= <$Network HP LaserJet P1505>
##$DFORMAT= <normdp>
##$LAYOUT= <+/1D_H.xwp>
##$LFORMAT= <normlp>
##$PFORMAT= <normpl>
##$SURQMSG= 1
$$ End of Bruker specific parameters
$$ ---------------------------------
##NTUPLES= NMR SPECTRUM
##VAR_NAME=  FREQUENCY,     SPECTRUM/REAL,   SPECTRUM/IMAG
##SYMBOL=    X,             R,               I
##VAR_TYPE=  INDEPENDENT,   DEPENDENT,       DEPENDENT
##VAR_FORM=  AFFN,          ASDF,            ASDF
##VAR_DIM=   131072,        131072,          131072
##UNITS=     HZ,            ARBITRARY UNITS, ARBITRARY UNITS
##FACTOR=    0.0627417313425164, 1,          1
##FIRST=     8223.62146879497, 5179,         -42267
##LAST=      0,             6768,            -41948
##MIN=       0,             -11402,          0
##MAX=       8223.62146879497, 435348302,    0
$$ Real data points
##PAGE= N=1
##DATA TABLE= (X++(R..R)), XYDATA
$$ [...]
61560C71009p32m23l12m24o01o24m93l63k41o5Kk30n33n03k01PK06Q43J766K155
61540C70243J702J147J268J950K704L392L871L524J984j2j219j235o95l02k04
61525C88118l02o53j370k300k993k975k228j332q95q32o39k78k12m81n21k02k62
61508C69643j168k208k386j729j005n27oO28J046J118J062J008Q74P16P29R04
61492C68699J033J076J206J499J800J874J549R01M00N63J263J698J350N81l5n17
61476C84940j177j879k186j975j409n54M52J077Q16q6q72j093q05j47P08J272
61460C77082J080L63j03N5L86L01k12o55n40K18J186J725J608J315J476K097K609
61443C89991K647K446K463K864L451L905M080M124M291M579M689M400L834L239
$$ plain form
61560 371009 370277 369854 369542 369118 368517 367893 367400 367037 366796 366731 366733 366503 365970 365467 365266 365273 365479 366322 368088 370243
61540 370243 371945 373092 374360 376310 379014 382406 386277 389801 391785 391773 390554 389319 388624 388322 388118
61525 388118 387816 387163 385793 383493 380500 377525 375297 373965 373070 372238 371599 371321 371109 370628 370107 369905 369643
61508 369643 368475 366267 363881 362152 361147 360620 360614 361242 362288 363406 364468 365476 366350 367066 367795 368699
61492 368699 369732 370808 372014 373513 375313 377187 378736 379637 380037 380600 381863 383561 384911 385492 385457 384940
61476 384940 383763 381884 379698 377723 376314 375760 376212 377289 378105 378019 377147 376054 375249 375102 375810 377082
61460 377082 378162 378525 378422 378477 378863 379164 378952 378297 377757 377975 379161 380886 382494 383809 385285 387382 389991
61443 389991 392638 395084 397547 400411 403862 407767 411847 415971 420262 424841 429530 433930 437764 441003
61429D41003K775K580K739K983K788J999J125O70M30k24j509k943l818l800l190
61414D43608k689k710k884k547j633o91%O12R94M87r90k380k600j737o52J10M39
61397D24737K72k98q35j087j308j551j197J10J559K001J429Q09Q04J399K428L542
61381D32814L921L117K026K051L200M116M075L807M032M257L772L021L071M122
61367D81402N277N695N413M990M768M714M809N329O476P791Q325P680O648O425
61353E65742P399Q981J0398J1238J1329J0692R592Q230O440M037J391p98k299
61340F52372l472m641n732o597p224p528p302o508n408m290l254k321j571j147
61326E85377j182j615k069k052j417m39N73J430J896J828J623J958K882L725M224
$$ plain form
61429 441003 443778 446358 449097 452080 454868 456867 457992 458662 459092 458868 457359 454416 450598 446798 443608
61414 443608 440919 438209 435325 432778 431145 430454 430454 431066 432060 432547 431557 429177 426577 424840 424188 424298 424737
61397 424737 425009 424711 423876 422789 421481 419930 418733 418843 420402 422403 423832 424641 425445 426844 429272 432814
61381 432814 436735 439852 441878 443929 447129 451245 455320 459127 463159 467416 471188 474209 477280 481402
61367 481402 486679 492374 497787 502777 507545 512259 517068 522397 528873 536664 544989 552669 559317 565742
61353 565742 573141 582122 592520 603758 615087 625779 635371 643601 650041 654078 655469 654671 652372
61340 652372 648900 644259 638527 631930 624706 617178 609876 603368 597960 593670 590416 588095 586524 585377
61326 585377 584195 582580 580511 578459 577042 576603 577176 578606 580502 582330 583953 585911 588793 592518 596742
61311E96742M952O302P737Q684R454J0540J1582J1936J1732J1483J1019R693P378
61298G19234M474J226k079m561n377m799l920l395l199l285l587l616k959k027
61284F82130j499j295r53o28o73n78M12J873K770L258M478O465P903Q185Q270
61269G20118Q921R614R888J0364J1493J2449J2359J1743J1675J2077J1846J0291
61257H52838P582M117J71l917p806j1216j3779j5116j5309j4834j3885j2304j0376
61244G46166q968q450q125p169n628m030k588j298l64L4Q0O2O5K44R07K038L153
61227G06129L904M377M578M188L137J950J202J035J424K283L171L496L425L860
61213G48159N129O400O845O750O899P487Q229R056J0009J0853J1371J1714J2073
$$ plain form
61311 596742 601694 607996 615733 624417 633871 644411 655993 667929 679661 691144 702163 711856 719234
61298 719234 723708 724934 722855 718294 712917 708118 704198 700803 697604 694319 690732 687116 684157 682130
61284 682130 680631 679336 678383 677755 677082 676504 676916 678789 681559 684817 689295 695760 703663 711848 720118
61269 720118 729039 738653 748541 758905 770398 782847 795206 806949 818624 830701 842547 852838
61257 852838 860420 864537 864708 860791 852985 841769 827990 812874 797565 782731 768846 756542 746166
61244 746166 737198 728748 720623 713454 707826 703796 701208 699910 699546 699580 699660 699722 699787 700031 700938 702976 706129
61227 706129 710033 714410 718988 723176 726313 728263 729465 730500 731924 734207 737378 740874 744299 748159
61213 748159 753288 759688 766533 773283 780182 787669 795898 804954 814963 825816 837187 848901 860974
61200H60974J2338J2511J2956J3784J4498J4722J4827J5256J5703J5474J4257
61189A017300J1948Q268L361j558n053o889q033r307j0676j1783j2567j3162j3738
61176I48111j4532j5710j7097j8302j9168j9820k0208j9892j8470j6121j3567
61165G55224j1454r820q366p141o564o600o380n204l502k183j287q3J590K951
61151F91181L409L315L308L564L872L927L326J884J05j201j852k196k045o27K112
61136G12082N061P255Q921J0748J2778J4549J5785J6409J6355J5867J5567J5834
61124H67211J6415J6820J6733J5969J4590J3200J2409J1871J0670Q733O962N676
61112A017259M080J759l75j409j860k881m735o824q704j0265j1396j2240j3373
$$ plain form
61200 860974 873312 885823 898779 912563 927061 941783 956610 971866 987569 1003043 1017300
61189 1017300 1029248 1037516 1040877 1039319 1034266 1027377 1019344 1010037 999361 987578 975011 961849 948111
61176 948111 933579 917869 900772 882470 863302 843482 823274 803382 784912 768791 755224
61165 755224 743770 733950 725584 718443 711879 705279 698899 693695 690193 688010 686723 686640 688230 691181
61151 691181 694590 697905 701213 704777 708649 712576 715902 717786 717891 716690 714838 712642 710597 709970 712082
61136 712082 717143 724398 733319 744067 756845 771394 787179 803588 819943 835810 851377 867211
61124 867211 883626 900446 917179 933148 947738 960938 973347 985218 995888 1004621 1011583 1017259
61112 1017259 1021339 1023098 1022723 1021314 1019454 1016573 1011838 1005014 996310 986045 974649 962409 949036
61099I49036j5109j6975j8359j9246j9811j9830j9141j8199j7549j7054j6156
61088G51607j4610j2544j0203q038o543n711m996m146l446k938k117q34K78P75
61074F76534J152K069L363M346M671M533M467N085O460P725Q050P993Q876J0803
61060G56127J2558J3578J4592J5955J6944J7356J8209J9942K1430K1757K1593
61049I50041K1774K1914K1574K1454K2076K2538K1922K0827K0223J9902J9330
61038A183575J8890J8881J8609J7887J8091K0030K2096K2463K2030K3066K5852
61027A411470K8834L1450L4750L9524M5704N3163O1354O8593P3438P6416P9021
61016B003717Q1905Q5606R1924J02456J16558J32719J51012J71919J93853K14666
$$ plain form
61099 949036 933927 916952 898593 879347 859536 839706 820565 802366 784817 767763 751607
61088 751607 736997 724453 714250 706212 699669 693958 688962 684816 681370 678432 676315 675481 675759 676534
61074 676534 677686 679755 683118 687464 692135 696668 701135 706220 712680 720405 728455 736448 745324 756127
61060 756127 768685 782263 796855 812810 829754 847110 865319 885261 906691 928448 950041
61049 950041 971815 993729 1015303 1036757 1058833 1081371 1103293 1124120 1144343 1164245 1183575
61038 1183575 1202465 1221346 1239955 1257842 1275933 1295963 1318059 1340522 1362552 1385618 1411470
61027 1411470 1440304 1471754 1506504 1546028 1591732 1644895 1706249 1774842 1848280 1924696 2003717
61016 2003717 2085622 2171228 2263152 2365608 2482166 2614885 2765897 2937816 3131669 3346335
61006C346335K35279K59617K91695L34873L92655M67015N56640O59624P77174
60997G320907R12713J070728J261453J504458J821938K229497K732993L311772
60989B2166459L868134M187900M004815L182683J874449M85915n53939j017883
60981C8198533r22463m21476K78243R07922J143823P39941k89203j629206k843144
60972C5162970l620137l893057l775935l433212k997846k554975k149653j796223
60964A0941932j492428j233859j017511q37825o87524n63048m64540l90229l34511
60955C920457k91716k58359k31588k08587j88206j70777j55758j41359j26628
60946B147479j12033r8063q5118p4702o8699o7083o7788o8813o9120o7696o3635
$$ plain form
61006 3346335 3581614 3841231 4132926 4467799 4860454 5327469 5884109 6543733 7320907
60997 7320907 8233620 9304348 10565801 12070259 13892197 16121694 18854687 22166459
60989 22166459 26034593 30222493 34227308 37409991 39284440 39770355 39216416 38198533
60981 38198533 37276070 36854594 37132837 38040759 39184582 39924523 39635320 38006114 35162970
60972 35162970 31542833 27649776 23873841 20440629 17442783 14887808 12738155 10941932
60964 10941932 9449504 8215645 7198134 6360309 5672785 5109737 4645197 4254968 3920457
60955 3920457 3628741 3370382 3138794 2930207 2742001 2571224 2415466 2274107 2147479
60946 2147479 2035446 1937383 1852265 1777563 1708864 1641781 1573993 1505180 1436060 1368364 1304729
60935A304729n7434n0763m4708l9319l4679l1031k7908k4492k0933j8087j6039
60924I39336j4090j2103j0540r328p996o843o619p078p175o764o676p051p065
60911H30008o602o792q353j0448j1813j2117j1832j1510j1580j2223j3033j3303
60899G00402j2787j1847j0878j0054r425q768p622o036m906m883n345n195m206
60886E98450k812j177N71J773K147K648M153N828O206N584N575O563P322P215
60872F50046O966O948O492N464M927N442O086N962N528N604O064O342O348O158
60858G34377N608M909M854N733O647O511N173L104P44j321k320k075j320q31q77
60843G68916j802m225p989j1732j4291j5804j6763j6744j5122j2507j0334r170
$$ plain form
60935 1304729 1247295 1196532 1151824 1112505 1077826 1046795 1018887 994395 973462 955375 939336
60924 939336 925246 913143 902603 893275 885279 878436 871817 864739 857564 850800 844124 837073 830008
60911 830008 823406 816614 808261 797813 786000 773883 762051 750541 738961 726738 713705 700402
60899 700402 687615 675768 664890 654836 645411 636643 629021 622985 618079 613196 607851 602656 598450
60886 598450 595638 594461 595032 596805 598952 601600 605753 611581 617787 623371 628946 635509 642831 650046
60872 650046 657012 663960 670452 675916 680843 686285 692371 698333 703861 709465 715529 721871 728219 734377
60858 734377 739985 744894 749748 755481 762128 768639 773812 776916 777660 776339 774019 771944 770624 769793 768916
60843 768916 767114 762889 754900 743168 728877 713073 696310 679566 664444 651937 641603 632433
60831F32433q297o981n408m200l574l169k485j343j1J198K372L773N155N854N716
60816F21033N449N777O631P510Q177Q706R263J0184J1869J4218J6519J8278J9701
60803G63315K1097K2260K2967K3589K4600K5818K6726K7314K7870K8057K7068
60792A040681K4872K2583K1084J9683J6823J2071O825K743j72l277p257j1177
60780A145482j3934j5861j8078k0659k2539k3216k3374k3565k3327k2289k1312
60769I17328k1517k2652k3399k3081k2191k1217j9908j8074j6337j5529j5537
60758F97886j5363j4266j2544j1044j0168r508q453o891n280m100l371k723j926
60745E92249j271j403k588m205n237n316m998m807m366k932n79J672K902L061
$$ plain form
60831 632433 624136 617155 611747 607547 603973 600804 598319 596976 596965 598163 600535 604308 609463 615317 621033
60816 621033 626482 632259 638890 646400 654577 663283 672546 682730 694599 708817 725336 743614 763315
60803 763315 784412 806672 829639 853228 877828 903646 930372 957686 985556 1013613 1040681
60792 1040681 1065553 1088136 1109220 1128903 1145726 1157797 1164622 1167365 1167193 1163916 1156659 1145482
60780 1145482 1131548 1115687 1097609 1076950 1054411 1031195 1007821 984256 960929 938640 917328
60769 917328 895811 873159 849760 826679 804488 783271 763363 745289 728952 713423 697886
60758 697886 682523 668257 655713 644669 634501 624993 616540 609649 604369 600269 596898 594175 592249
60745 592249 590978 589575 586987 582782 577545 572229 567231 562424 558058 555126 554547 556219 559121 562182
60731E62182K649K166K022K421L037L094K213R43R5k85q71j981l105l693m045
60716E66842m930o430p742q226q193q294q531q432p996p771p902p820p090o029
60702D61456n117m323l434k624k212k148k173k194k103j512k57J106J815J787
60688D38067J534J375J215R49N66Qo13p69n7J171K231L036M022N213O081O367
60672D70396O429O553O481N851M727L443K225J141K44l47l72N27K391M664O493
60657E20846P326P228O816O962P984Q940Q352O185M403M702O244O610M665J411
60643F08674j768m380o328p386p684p771p809p426o715o459o986p539p308o393
60629E16722n331m332l502l162l377l600l317k751k482k740l290l709l519k578
$$ plain form
60731 562182 564831 566997 569019 571440 574477 577571 579784 580727 580822 580537 579666 577685 574580 570887 566842
60716 566842 561912 555482 547740 539514 531321 523027 514496 506064 498068 490297 482395 474575 467485 461456
60702 461456 456339 452016 448582 445958 443746 441598 439425 437231 435128 433616 433359 434465 436280 438067
60688 438067 439601 440976 442191 443140 443706 443714 443101 442332 442275 443446 445677 448713 452735 457948 464029 470396
60672 470396 476825 483378 489859 495710 500437 503880 506105 507246 507490 507143 506771 507298 509689 514353 520846
60657 520846 528172 535400 542216 549178 557162 566102 574454 580639 585042 589744 595988 602598 607263 608674
60643 608674 606906 602526 596198 588812 581128 573357 565548 558122 551407 544948 537962 530423 523115 516722
60629 516722 511391 507059 503557 500395 497018 493418 490101 487350 484868 482128 478838 475129 471610 469032
60615D69032j535j350k078k722k610k183k030j833j012J44P22L66m01q31n35L54
60599D51498J211J385R58P73J357K220K566K349K152K329K680K786K368J548R09
60584D79089R97J533J711J435J611K773M080M377L678K940K781L170L934M888
60570E18997N653O152P000Q699J0675J1898J2364J3134J4878J7130J9031K0111
60558F65722K0153J8945J6527J3312R745O049K365j202m599p606r614j0068r060
60545G10669p160m662j481K277O121R675J2980J6270J9839K4111K9379L5278M0844
60532H94140M5093M7283M6674M2649L5267K5336J3876J927r070j7418k2222k4018
60520A079517k4089k3306k1885j9899j7623j5399j3407j1538r420o760l766r90
$$ plain form
60615 469032 467497 466147 464069 461347 458737 456554 454524 452691 451679 451823 452545 452911 452510 451679 451144 451498
60599 451498 452709 454094 455052 455825 457182 459402 461968 464317 466469 468798 471478 474264 476632 478180 479089
60584 479089 480086 481619 483330 484765 486376 489149 493229 497606 501284 504224 507005 510175 514109 518997
60570 518997 524650 530802 537802 546501 557176 569074 581438 594572 609450 626580 645611 665722
60558 665722 685875 704820 721347 734659 744404 750453 752818 751616 747017 739411 729797 719729 710669
60545 710669 703509 698847 697366 699643 705764 715439 728419 744689 764528 788639 818018 853296 894140
60532 894140 939233 986516 1033190 1075839 1111106 1136442 1150318 1152245 1143175 1125757 1103535 1079517
60520 1079517 1055428 1032122 1010237 990338 972715 957316 943909 932371 922951 916191 912425 911435
60508I11435J401L906O923J0018J2361J3793J5020J6756J9188K2479K7241L4004
60496A094525M2343N1066N9382O7490P5774Q3692Q9789R2806R2435Q9037Q2968
60485A921307P4324O3115M9392L3317J5295l948k3621m3173o2131p9594r4029
60474A850254j03834j08211j07565j03108r6152q7715p8576o9450o1022n3805
60464I80816m7942m3024l8261l3141k8012k3795k0995j9196j7641j5980j4278
60453F78551j2613j1055r800q952q320p740p408p435p379o739n821n391n479n260
60439E69159m214k845j924j652j843k342k867k881k148j075j41O34J329J584J043
60424E49817N2n84n07o3K46K48J20J28L70N50K69l82q09p55p82j470k515l055
$$ plain form
60508 911435 912836 916742 923665 933683 946044 959837 974857 991613 1010801 1033280 1060521 1094525
60496 1094525 1136868 1187934 1247316 1314806 1390580 1474272 1564061 1656867 1749302 1838339 1921307
60485 1921307 1995631 2058746 2108138 2141455 2156750 2152802 2129181 2086008 2023877 1944283 1850254
60474 1850254 1746420 1638209 1530644 1427536 1331384 1243669 1165093 1095643 1034621 980816
60464 980816 932874 889850 851589 818448 790436 766641 745646 726450 708809 692829 678551
60453 678551 665938 654883 645083 636131 627811 620071 612663 605228 597849 591110 585289 579898 574419 569159
60439 569159 564945 562100 560176 558524 556681 554339 551472 548591 546443 545368 545227 545861 547190 548774 549817
60424 549817 549869 549285 548778 548715 548961 549209 549329 549457 549827 550377 550646 550264 549455 548700 547918 546448 543933 540878
60406E40878k718j846q57N0O56P09K70l28q29j037o13N89J980K582K133J367J047
60389E44033J153J199J015Q36R08J258J713J971J829J496J447J777J980J633J036
60374E65284P89R17R26O86O76J219J916K262K395K734L096K848J958J301J556
60359E90563K331K771K719K704L025L402L554L597L730L940M149M390M683M954
60345F40512N168N308N185M598L708K888K124R50r03l108n127o649p457p327o359
60330F33511n046l753k432j125k94j71k07K88J153J688J714J703J826J661J049
60315F31565O08R54J848K517K632K564K798L420M151M652M789M809N157O008P122
60300F85594Q304R844J2091J4570J5977J5261J2440Q221L163k331p539j1635j4509
$$ plain form
60406 540878 538160 536314 535457 535507 536163 536872 537142 536814 535985 534948 534335 534924 536904 539486 541619 542986 544033
60389 544033 545186 546385 547400 548236 549144 550402 552115 554086 555915 557411 558858 560635 562615 564248 565284
60374 565284 566073 566990 567916 568602 569278 570497 572413 574675 577070 579804 582900 585748 587706 589007 590563
60359 590563 592894 595665 598384 601088 604113 607515 611069 614666 618396 622336 626485 630875 635558 640512
60345 640512 645680 650988 656173 660771 664479 667367 669491 670441 669538 666430 661303 654654 647197 639870 633511
60330 633511 628465 624712 622280 621155 620861 620690 620483 620771 621924 623612 625326 627029 628855 630516 631565
60315 631565 632173 633127 634975 637492 640124 642688 645486 648906 653057 657709 662498 667307 672464 678472 685594
60300 685594 693898 703742 715833 730403 746380 761641 774081 782302 785465 783134 775595 763960 749451
60287G49451j6796j8798j9830j9027j6617j3835j1631r909q117o290n058m764
60275E98779m841m382l195j937j162o12J84J024J378J371J633K130K079J331R71
60260E94751J907L535M498M288L409K353J258K55n66j458k614l658m183m462m943
60245E94370n252m573k903j138K3N36M85j2l93k6Q78J570J925K488L280L592L138
60228E97988K529K228J953J485J253J619K263K692K763K431J639P35L32M68N95
60213F22973O26J087J966K335J658O22J01j7l28r22j461j765j792j515j222j405
60197F20941k093k854l589m507n216m911l786l017k908k309o11J021J389R67P40
60182E89257N41m3j97J029K837L569L053K501K442K373K284K767L510L262J806
$$ plain form
60287 749451 732655 713857 694027 675000 658383 644548 632917 623008 614891 608601 603543 598779
60275 598779 593938 589556 586361 584424 583262 582650 582834 583858 585236 586607 588240 590370 592449 593780 594751
60260 594751 596658 600193 604691 608979 612388 614741 615999 616254 615688 614230 611616 607958 603775 599313 594370
60245 594370 589118 584545 581642 580504 580527 581063 581548 581536 581143 581117 581995 583565 585490 587978 591258 594850 597988
60228 597988 600517 602745 604698 606183 607436 609055 611318 614010 616773 619204 620843 621578 621910 622378 622973
60213 622973 623599 624686 626652 628987 630645 631267 631368 631351 631023 630101 628640 626875 625083 623568 622346 620941
60197 620941 618848 615994 612405 607898 602682 597771 593985 590968 588060 585751 585140 586161 587550 588517 589257
60182 589257 589798 589755 589558 590587 593424 596993 600046 602547 604989 607362 609646 612413 615923 619185 620991
60167F20991N27M77R59P49k11j074j457j734k207k516k095r76N2L71M34J255K859
60150F16404M061M082L630L705M202M496M689N252N912O076N976O334P122P691
60136F89632P942Q314Q740Q611P712O300M410K003l75k099l488n326p419q678
60122G16279q642p947p249o583n892n216m348l096j891j322j129n59M79J466K303
60107F66653L251M078M420M838O198Q084R123Q945Q501Q374Q143P675P468P362
60093G63113O338M291K593K211K419K144J424P63O4q62j628j984k530l854n645
60078G68857p249q522r521j0058j0143j0233j0479j0409r785r015q212o813m755
60065F53663l142k831l193l160k805k876l357l555l308l110l187l241l059k753
$$ plain form
60167 620991 621518 621995 622954 623703 623492 622418 620961 619227 617020 614504 612409 611433 611485 611856 612290 613545 616404
60150 616404 620465 624547 628177 631882 636084 640580 645269 650521 656433 662509 668485 674819 681941 689632
60136 689632 697574 705888 714628 723239 730951 737251 741661 743664 743289 741190 737702 732376 724957 716279
60122 716279 707637 699690 692441 685858 679966 674750 670402 667306 665415 664093 662964 662405 662884 664350 666653
60107 666653 669904 673982 678402 683240 689438 697522 706645 715590 724091 732465 740608 748283 755751 763113
60093 763113 769451 773742 776335 778546 780965 783109 784533 785296 785360 784498 782870 780886 778356 774502 768857
60078 768857 761608 753086 743565 733507 723364 713131 702652 692243 682458 673443 665231 658418 653663
60065 653663 650521 647690 644497 641337 638532 635656 632299 628744 625436 622326 619139 615898 612839 610086
60051F10086k456k238k189k295k421k640l180l812l856l091k185j861k153k809
60037E72900l770m807n303m976m333l957l839l772l824l930l692l083k708k873
60023E18033k987k508j773j331j065o71l57l41k37K55O56M09j67m70n87q32p90
60006E05237J70J727K881L238L250L350L564L793L880L536K800K280K389K648
59992E44743K408J856J630J793J983K158K412K394J809J258J553K381K661K164
59978E73203J770K031K442K390J968J548J174P96O04Q33J520K475L283L438K944
59963F02419K534K739K973K262P40m76r46j417k414l225k998k148j896k665l645
59948E91837l967l653l262k976k482j633q19n01n79n82l79k64l23k08K89Q77J273
$$ plain form
60051 610086 607630 605392 603203 600908 598487 595847 592667 588855 584999 581908 579723 577862 575709 572900
60037 572900 569130 564323 559020 554044 549711 545754 541915 538143 534319 530389 526697 523614 520906 518033
60023 518033 515046 512538 510765 509434 508369 507698 507341 507000 506763 507018 507674 508083 507916 507446 506859 506027 505237
60006 505237 505407 507134 510015 513253 516503 519853 523417 527210 531090 534626 537426 539706 542095 544743
59992 544743 547151 549007 550637 552430 554413 556571 558983 561377 563186 564444 565997 568378 571039 573203
59978 573203 574973 577004 579446 581836 583804 585352 586526 587322 587926 588759 590279 592754 596037 599475 602419
59963 602419 604953 607692 610665 612927 613667 613191 612245 610828 608414 605189 602191 600043 598147 595482 591837
59948 591837 587870 584217 580955 577979 575497 573864 573045 572544 571965 571383 571004 570740 570417 570209 570498 571375 572648
59931E72648J691K477L555M535N094N026M308L367K908L105L359L194K954L105
59917F21326L382L265K922K946L312L322K611J583Q31N41N16M42J35k33k66Q9
59901F46724M10M59N68R61J193P86R7j23K36P35J234J937K693L063L053L211L781
59884F71018M403M699M686M511M163L588K788J882J236J379K352L348L493K818
59870G16364K046J613J407J272J112O06n44k047l246l925m376m724m831m820n048
59855F90859n346m929l434j556l22K0P5M58J156J758K180L030N054Q214J1679
59840G08896J4831J7692K0001K0460J7827J2571O732K174m65j208j72K008L795
59827H25142L500M68m582j0200j5114j8583k0270j9988j7920j4989j2483j0988
$$ plain form
59931 572648 574339 576816 580371 584906 590000 595026 599334 602701 605609 608714 612073 615267 618221 621326
59917 621326 624708 627973 630895 633841 637153 640475 643086 644669 645500 646041 646557 646999 647134 646901 646635 646724
59901 646724 647134 647593 648161 649122 650315 651101 651198 651075 651311 652046 653280 655217 657910 660973 664026 667237 671018
59884 671018 675421 680120 684806 689317 693480 697068 699856 701738 702974 704353 706705 710053 713546 716364
59870 716364 718410 720023 721430 722702 723814 724420 723876 721829 718583 714658 710282 705558 700727 695907 690859
59855 690859 685513 680584 677150 675594 675272 675292 675367 675825 676981 678739 680919 683949 689003 697217 708896
59840 708896 723727 741419 761420 781880 799707 812278 819010 821184 820719 819511 819339 821347 825142
59827 825142 828642 829110 824528 814328 799214 780631 760361 740373 722453 707464 694981 683993
59815F83993j0018q948p907p326p043o418n231l910l026k908l497m252m437m024
59801F05048l928m808n946o024m831l510l165l882m941n506n096m041l327l506
59787E42537l960l782l058k523k213j532n33o7m26q47p11l65k10J27J045J977
59771E25459J970J008J30K44J197K063K098J375O19M91J033J825K456K670K355
59756E46993J709J261J345J709J933K102K546L137L295K757J880J125O52M08L11
59741E73163K65K07R5k83j132k126k445j782q99o08o63l11L83O74L58N6J84M56
59723E65592N00L36J29J2K07Q52J623K011J914J615J236P67L78J88m4m42n30J05
59705E76449R80J381J495J929K411K146J325J040J516J702R14j65o04m43k82m14
$$ plain form
59815 683993 673975 665027 657120 649794 642751 636333 631102 627192 624166 621258 617761 613509 609072 605048
59801 605048 601120 596312 590366 584342 579511 576001 572836 568954 564013 558507 553411 549370 546043 542537
59787 542537 538577 534795 531737 529214 527001 525469 524936 524869 524443 523596 522885 522520 522310 522437 523482 525459
59771 525459 527429 528437 528567 528811 530008 532071 534169 535544 536163 536654 537687 539512 541968 544638 546993
59756 546993 548702 549963 551308 553017 554950 557052 559598 562735 566030 568787 570667 571792 572444 572852 573163
59741 573163 573428 573635 573730 573447 572315 570189 567744 565962 565063 564455 563792 563481 563864 564538 564896 564952 565136 565592
59723 565592 566092 566428 566557 566569 566776 567628 569251 571262 573176 574791 576027 576794 577172 577360 577316 576874 576344 576449
59705 576449 577429 578810 580305 582234 584645 586791 588116 589156 590672 592374 593288 593123 592519 592076 591794 591380
59689E91380p94j142q63M41K097K760J997O82l74j272k177k697k659k619k967
59674E81793l223k850k141j727j732j917k063j825q60M81J293J368J569K428L178
59659E73772K888J832R97P64Q33R03P49N1j102j998k145j959k018k191k147k109
59643E67120k316k262j374p5P14Q73R55J045P30N3m47p46j428k560l234k697j299
59626E53052j6N93N77J71m18r86j416j816k301k664k470j593n48K4J19L07P28
59609E41343P03j87j099q27M05J037K21j151j822j756j655j647j292n86j50l77
59593E31160r41j210r17l86k11n84r96q76m65n20j072j274p03j00k95j027j543
59576E18040j763k136k606k582j844q48r8K90M30M66N32O27O17N26N95Q29Q40
$$ plain form
59689 591380 590586 589444 588581 589022 591119 593879 595876 596558 596184 594912 592735 590038 587379 584760 581793
59674 581793 578570 575720 573579 571852 570120 568203 566140 564315 563455 563936 565229 566597 568166 570594 573772
59659 573772 576660 578492 579489 580253 581086 581989 582738 582789 581687 579689 577544 575585 573567 571376 569229 567120
59643 567120 564804 562542 561168 561093 561807 562680 563635 564680 565410 565463 565016 564270 562842 560282 557048 554351 553052
59626 553052 553036 553629 554206 554377 553959 552973 551557 549741 547440 544776 542306 540713 540165 540189 540308 540615 541343
59609 541343 542046 541859 540760 539933 540338 541375 541596 540445 538623 536867 535212 533565 532273 531687 531537 531160
59593 531160 530219 529009 528092 527706 527495 526911 525915 525039 524574 524054 522982 521708 521005 520905 520610 519583 518040
59576 518040 516277 514141 511535 508953 507109 506261 506163 506453 506883 507349 507881 508508 509125 509651 510246 511075 511915
59559E11915N15M47J163K249K820K748K759L334M110M462M279L960L942M432N440
59544E58575O914Q966J1902J5919K0482K3994K4171J9365J0168k83q118j1393
59532F80662j0952q886o575m316k132k56J015J534J245J84j468l319m895n894
59518F35947o479p140q041q702q647q161p940q080p981p260o125m862l493k121
59504E40915j058l72J56N67O69N10L91K61k14r03j149p29j51J36K43K56o5o23
59486E38840p51p0R26J572J833K083K584L424M421M995M706L986L576L230K129
59471E77484P00N44K016L277K820J648J734L293N053O430P888R484J0548J0852
59457F43771J0842J0718J0210R346Q544P872O981N778M421K688J59k998o081q663
$$ plain form
59559 511915 512430 512877 514040 516289 519109 521857 524616 527950 532060 536522 540801 544761 548703 553135 558575
59544 558575 565489 574455 586357 602276 622758 646752 670923 690288 700456 700173 692055 680662
59532 680662 669710 660824 654249 649933 647801 647545 648560 650094 651339 651523 650055 646736 641841 635947
59518 635947 629468 622328 614287 605585 596938 588777 580837 572757 564776 557516 551391 546529 543036 540915
59504 540915 539857 539485 539641 540208 540877 541387 541778 542039 541825 540922 539773 539044 538893 539029 539272 539528 539463 538840
59486 538840 538089 538019 538945 540517 542350 544433 547017 550441 554862 559857 564563 568549 572125 575355 577484
59471 577484 578184 578728 580744 584021 586841 588489 590223 593516 598569 604999 612887 622371 632919 643771
59457 643771 654613 665331 675541 684887 693431 701303 708284 714062 718483 721171 721330 718332 712251 703588
59443G03588j0702j1866j1604j0002p955o219m814l440k002n58Q69K227L371M164
59429F45057M547M618M784N624P317R433J1454J3307J5081J6577J7539J8302J9709
59416G93349K2112K4243K3266J6660M895q031j7545k2007k2797k1420j7922j2116
59404G62687m734L023R634J2482Q840r57j2525k0969k4697k4977k3193k0091j6669
59391F47854j3753j1043p910m828k678j225L01J602J843J439J683K662L183K789
59377F21919K403K776L622M516N429O175O441O544P131P984Q172P454O595O176
59363G03337O177O683P876R250R961J0086J0443J1143J1525J1616J2229J3401
59351H23727J4111J3883J3441J3164J2261J0086P216M525K120k40k512m792p447
$$ plain form
59443 703588 692886 681020 669416 659414 651459 645240 640426 636986 634984 634426 635295 637522 640893 645057
59429 645057 649604 654222 659006 664630 671947 681380 692834 706141 721222 737799 755338 773640 793349
59416 793349 815461 839704 862970 879630 884525 876494 858949 836942 814145 792725 774803 762687
59404 762687 757953 760976 770610 783092 791932 790975 778450 757481 732784 707807 684614 664523 647854
59391 647854 634101 623058 615148 610320 607642 606417 606718 608320 610163 611602 613285 615947 619130 621919
59377 621919 624322 627098 630720 635236 640665 646840 653281 659825 666956 674940 683112 690566 697161 703337
59363 703337 709514 716197 724073 733323 743284 753370 763813 774956 786481 798097 810326 823727
59351 823727 837838 851721 865162 878326 890587 900673 907889 912414 914534 914294 911782 906990 899543
59338H99543j0238j2220j3081j3725j4820j5678j5355j4077j2743j1597j0337
59327G55672r043q090p335o217m596l010k035j674j412p14L99J298J471J152R23
59312G16789R01Q56Q71J171J399R65J44j07M65J105J304J407J724J982K152K832
59296G35960M293N951P404R245J2130J5816J9854K4479K9578L2991L1032K1497
59284I50230O107j0084k1891k7069k6880k4010k0224j5982j1575p646m603k282
59272G84091m04J088K159K723K545J641O30O8l71j311k501l168l418m166n583
59257G74023o800p425q176r461j0455j0189q790p057n494m335l673l037j550Q47
59243F88428L043M167M645N285N966N972N116L805K431J249M75op20j984l532
$$ plain form
59338 899543 889305 877085 864004 850279 835459 819781 804426 790349 777606 766009 755672
59327 755672 746629 738539 731204 724987 720391 717381 715346 713672 712260 711546 711945 713243 714714 715866 716789
59312 716789 717690 718546 719417 720588 721987 722952 723096 722989 723454 724559 725863 727270 728994 730976 733128 735960
59296 735960 740253 746204 753608 762853 774983 790799 810653 835132 864710 897701 928733 950230
59284 950230 956337 946253 924362 897293 870413 846403 826179 810197 798622 790976 786373 784091
59272 784091 783687 784775 786934 789657 792202 793843 794473 794541 794170 792859 790358 787190 783772 779606 774023
59257 774023 767223 759798 751622 742161 731706 721517 712727 705670 700176 695841 692168 689131 687581 688428
59243 688428 691471 695638 700283 705568 711534 717506 722622 726427 728858 730107 730582 730576 729856 727872 724340
59228G24340m968o103o625o210n229m661m857n076m662l914l281k559j529o21
59214F64045k37L2P43J711K495L121L647L596K724J835J944K924L767L928L616
59199F99891L130K632K396K477K345J561P15Q84K183L490L766L087K324K177K606
59184G35664K993K776K070J490J401J686K302L426M805N627N626N705O809Q540
59170G90920R669R687R128Q494P716O695N700M872L761J736j228m307o431p279
59156H39133p561q188r208r915r928r623r443r364r295r405r713r838r559r214
59142G08879r127q982q191o650m814l298k590k770l213l013j935o70J24N72J167
59127F55489K097L309M736O142P159P853Q841J0454J2281J3834J5229J6773J8329
$$ plain form
59228 724340 719372 713269 706644 700434 695205 690544 685687 680611 675949 672035 668754 666195 664666 664045
59214 664045 663808 663840 664583 666294 668789 671910 675557 679153 681877 683712 685656 688580 692347 696275 699891
59199 699891 703021 705653 708049 710526 712871 714432 715147 716031 718214 721704 725470 728557 730881 733058 735664
59184 735664 738657 741433 743503 744993 746394 748080 750382 753808 758613 764240 769866 775571 782380 790920
59170 790920 800589 810276 819404 827898 835614 842309 848009 852881 856642 858378 857150 852843 846412 839133
59156 839133 831572 823384 814176 804261 794333 784710 775267 765903 756608 747203 737490 727652 718093 708879
59142 708879 699752 690770 682579 675929 671115 667817 665227 662457 659244 656231 654296 653626 653750 654322 655489
59127 655489 657586 660895 665631 671773 678932 686785 695626 706080 718361 732195 747424 764197 782526
59114G82526J9527K0275K0639K0546J9907J8838J7410J5520J3133J0349P051L050
59102I68771j324n315q589j1415j3793j5129j5149j4367j3296j1856j0053q488
59090H39997p603p044o366n843o025o912q062r091r658r500q874q398q124p381
59076G31116n920m508l869l808l868m089m485m551m037l466l224k819j795o82
59062F79995k35l13l71l60l90r0P09J373J408J408K036K747K625J985J904K500
59046F96931K889K641K116J542Q37K49J78L52K35J58R96K767M525N746O846Q158
59030G37166R312R900J0060J0088R961R472Q381O502M008J586k31j730l477n310
59016H05688o467o564n795m382k517o91N89J440K313L275M138N090O402P594P719
$$ plain form
59114 782526 802053 822328 842967 863513 883420 902258 919668 935188 948321 958670 965721 968771
59102 968771 967447 962132 953543 942128 928335 913206 898057 883690 870394 858538 848485 839997
59090 839997 832394 825350 818984 813141 807116 800204 792142 783051 773393 763893 755019 746621 738497 731116
59076 731116 725196 720688 716819 713011 709143 705054 700569 696018 691981 688515 685291 682472 680677 679995
59062 679995 679760 679447 679076 678716 678326 678236 678945 680318 681726 683134 685170 687917 690542 692527 694431 696931
59046 696931 699820 702461 704577 706119 706956 707205 707383 707735 707970 708128 709124 711891 716416 722162 729008 737166
59030 737166 746478 756378 766438 776526 786487 795959 804340 810842 814850 816436 816205 814475 810998 805688
59016 805688 799221 792657 786862 782480 779963 779272 779861 781301 783614 786889 791027 796117 802519 810113 817832
59001H17832O581N021L896L356L103K777J978M71j502l411m924n947o447o628
58987H16156o991p661p911o939m871k477j97J956L841N295O607Q102R394R807
58973H24111R456R158R315R594R767J0086J0723J1456J2111J2806J3586J4121
58961I56290J3949J2754J0504P517M301J135j965m789o953q670j0820j3651j5999
58948I43603j6595j5702j4633j3936j2970j1136q686o253m257k837j898j163n28
58935H33009k08k97n33q52j674l155m633n427n747o128o430o123n205m121l082
58920G79394k119j379p22N54K816N334P116Q032Q473Q529Q371Q800J0267J1815
58906H55281J2126J1289J0469J0197J0116J0126J0445J0692J0146R020Q441R083
$$ plain form
59001 817832 824413 829434 833330 836686 839789 842566 844544 845015 843513 840102 835178 829231 822784 816156
58987 816156 809165 801504 793593 786654 781783 779306 779109 781065 784906 790201 796808 804910 814304 824111
58973 824111 833567 842725 852040 861634 871401 881487 892210 903666 915777 928583 942169 956290
58961 956290 970239 982993 993497 1001014 1005315 1006450 1004485 999696 992743 984073 973253 959602 943603
58948 943603 927008 911306 896673 882737 869767 858631 849945 843692 839435 836598 834700 833537 833009
58935 833009 832801 832504 831971 831119 829445 826290 821657 816230 810483 804355 797925 791802 786597 782476 779394
58920 779394 777275 775896 775174 775728 778544 783878 790994 799026 807499 816028 824399 833199 843466 855281
58906 855281 867407 878696 889165 899362 909478 919604 930049 940741 950887 959907 968348 977431
58894I77431J0691J2881J5463J7991J9909K1017K1097J9435J5724J1084O943L175
58882A152841j418o903j1949j5697j8510k0620k1508k1098k0290j9670j8623j6398
58870I60157j3345j0605r035q763r265r644r379q970r345j0668j2172j3071j3115
58857H22780j2510j1850j1808j2249j2053j0659r226r227j0285j0651r595p968
58845F94699o569n316m185l583l458l063k002o81M12J085J101M03l23k55L80O07
58829F69252J29m88r52j489j968j890j311q60p65q30j152j850k307j860j068j082
58813F49509j877k441k525k789l275l302k883k740k782k203j259j266k484l617
58799F14066l842l722l608k826j224K8J37j11L55J497K833M334N802O494O199
$$ plain form
58894 977431 988122 1001003 1016466 1034457 1054366 1075383 1096480 1115915 1131639 1142723 1149666 1152841
58882 1152841 1151423 1144520 1132571 1116874 1098364 1077744 1056236 1035138 1014848 995178 976555 960157
58870 960157 946812 936207 927172 918409 909144 899500 890121 881151 871806 861138 848966 835895 822780
58857 822780 810270 798420 786612 774363 762310 751651 742425 733198 722913 712262 702667 694699
58845 694699 688130 682814 678629 675046 671588 668525 666523 665842 666254 667339 668440 668843 668520 668265 668645 669252
58829 669252 669381 668893 667941 666452 664484 662594 661283 660423 659658 658828 657676 655826 653519 651659 650591 649509
58813 649509 647632 645191 642666 639877 636602 633300 630417 627677 624895 622692 621433 620167 617683 614066
58799 614066 610224 606502 602894 600068 598844 598872 599009 598898 599253 600750 603583 607917 613719 620213 626412
58784F26412N798O062O688P092P228P173O800O379O480O743N788K936q30m109
58770F96640o411p848q507q613q464p864o467m803l915l820l596l107l145l688
58756F16392l522k195p98j86J17O26J005J260K367M682P061Q516R593J1184J3045
58741F69147J4512J5682J6934J8055J8597J8426J7435J5599J3566J2123J0810
58730H40886Q399N033K247N10j430m048n868n865n231n431o072o120n741n499
58716H05770m986l843l010l513m927o343p787r470j0751j1335j2342j4689j7292
58703F95482j8444j8141j7515j6737j5177j3056j1356j0368r553q630p627o323
58691E42555m670l319k825k701k199j402p54j07Q08J643K041K360K974L596M044
$$ plain form
58784 626412 632210 638272 644960 652052 659280 666453 673253 679632 686112 692855 698643 701579 700749 696640
58770 696640 690229 682381 673874 665261 656797 648933 642466 637663 633748 629928 626332 623225 620080 616392
58756 616392 612870 610675 609877 609691 609808 610434 611439 612699 615066 619748 626809 635325 644918 656102 669147
58741 669147 683659 699341 716275 734330 752927 771353 788788 804387 817953 830076 840886
58730 840886 849285 854318 856565 857075 855645 851597 845729 839864 834633 829202 823130 817010 811269 805770
58716 805770 800784 796941 793931 790418 785491 779148 771361 761891 751140 739805 727463 712774 695482
58703 695482 677038 658897 641382 624645 609468 596412 585056 574688 565135 556505 548878 542555
58691 542555 537885 534566 531741 529040 526841 525439 524685 524578 525386 527029 529070 531430 534404 538000 542044
58676E42044M827O148P221P530P811Q789R950J0607J1265J2545J3634J3092J0655
58663F66118P131L162q88m404o983q934j0561j1492j1441j0795r847q339o415
58650E86312m896l936k689j111n69j555k469j941q80p49j286j598k037l110l789
58635E53697k950j502j062j402j121j01P40J453K807M537N764O709Q201R876J0672
58620E96318J0717J0995J1436J1061R730Q065O032L164n1k612m510o298p596p639
58606F38812o891o470o311n567m531m310m735m351k613n48R29J989L102M491O356
58591F09352Q672J0890J2642J4268J5762J6055J4542J2373J0830R270O407K804
58579G43867J82j119k069k764k293n88J509L871P051J0716J3757J5880J7597J8829
$$ plain form
58676 542044 546871 553019 560240 567770 575581 584370 594320 604927 616192 628737 642371 655463 666118
58663 666118 673249 676411 675523 671119 664136 655202 644641 633149 621708 610913 601066 592727 586312
58650 586312 581416 577480 574791 573680 573111 571556 569087 567146 566266 565517 564231 562633 560596 557486 553697
58635 553697 550747 549245 548183 546781 545660 545559 546299 547752 550559 555096 560860 567569 575770 585646 596318
58620 596318 607035 618030 629466 640527 650257 658322 664354 667518 667467 664855 660345 654047 646451 638812
58606 638812 631921 625451 619140 613573 609042 604732 599997 595646 593033 592485 593414 595403 598505 602996 609352
58591 609352 618024 628914 641556 655824 671586 687641 702183 714556 725386 734656 741063 743867
58579 743867 744049 742930 740861 738097 735804 735216 736725 740596 747647 758363 772120 788000 805597 824426
58565H24426J9046J8520J7922J6934J4833J2097R854Q129O183M173K723J370p77
58552I55433l204m738n701p407r871j2007j3713j5585j6911j6245j4022j2201
58540H23828j1268r878p706o249o235o426n819m999m578m022k921j830j109k57
58526G50531R13J822K352L297N013O819Q119R066R660R351P939N980M110K663
58512H27635J814J207j39k592n063o577p936j0311j2897j3818j2885j1577j0629
58499G36232r572q425p823p473o396m716l452k581j140Q60K516L913N970Q415
58485G06328R900J0183J0347J0763J0695R926Q927P445M833J702o30k214m014
58472G84191n639n765m709m158m295l651j967q38j050j537j424r30MJ750L344
$$ plain form
58565 824426 843472 861992 879914 896848 911681 923778 933632 941761 947944 952117 954840 956210 955433
58552 955433 952229 947491 941790 934383 924512 912505 898792 883207 866296 850051 836029 823828
58540 823828 812560 802682 794976 788727 782492 776066 770247 765248 760670 756648 753727 751897 750788 750531
58526 750531 751444 753266 755618 758915 763928 770747 778866 787932 797592 806943 814882 820862 824972 827635
58512 827635 829449 830656 830517 827925 822862 816285 808349 798038 785141 771323 758438 746861 736232
58499 736232 726660 718235 710412 702939 696543 691827 688375 685794 684654 685514 688030 691943 697913 706328
58485 706328 716228 726411 736758 747521 758216 768142 777069 784514 789347 791049 790419 788205 784191
58472 784191 778552 772787 768078 763920 759625 755974 754007 753169 752119 750582 749158 748228 748232 749982 753326
58457G53326L102J334K06M63N52n33j819k378k590k711k206j118k92K11J035J758
58441G48340J308J83L7R26J389J292J965L329L728L055L149M482N356N129N354
58426G89022O668P478O810N877N666N533N263N908P481Q373Q256Q734R926R149
58412H90144M709j463o581j0091j2421j3056j1674r402p296n187l105j996j898
58399H10683j439k36K02r00k187k434k175j982j223L68J888K981M324N771O258
58384H19899O239P622J0497J2579J2894J3140J4333J5018J4101J2705J1765J0585
58372I61377R160R214J1297J3533J4746J6229J8911K1367K2026K0839J7496J1040
58360A147235K656m125p633r639j1413j1561r437p151o074m546j336J803L368
$$ plain form
58457 753326 756428 757762 757968 758431 758983 758450 756631 754253 751663 748952 746746 745628 745336 745547 746582 748340
58441 748340 749648 749831 749868 750794 752183 753475 755440 758769 762497 765552 768701 773183 778539 783668 789022
58426 789022 795690 803168 809978 815855 821521 827054 832317 838225 845706 854079 862335 871069 880995 890144
58412 890144 894853 893390 886809 876718 864297 851241 839567 830165 822869 817682 814577 812581 810683
58399 810683 809244 809008 809210 808310 806123 803689 801514 799532 798309 798677 800565 803546 807870 813641 819899
58384 819899 826138 833760 844257 856836 869730 882870 897203 912221 926322 939027 950792 961377
58372 961377 970537 979751 991048 1004581 1019327 1035556 1054467 1075834 1097860 1118699 1136195 1147235
58360 1147235 1149891 1145766 1138133 1128494 1117081 1105520 1096083 1088932 1082858 1078312 1076976 1078779 1082147
58347A082147M807P519J0061J0937J1309J2458J3199J2330J1054J0555R738P697
58335A203811N852N347M882L436K385K772L180K639K681M243N478N062M685N758
58321A262211O774O452O439Q142R929J0209J0322J1597J2625J2205J1938J3157
58309A382000J4245J3805J3345J4157J4746J4066J3843J4996J5380J3949J3224
58298A537756J4633J5579J4472J4329J7528K1189K2023K1736K3239K5350K5812
58287A753646K5999K7981L0237L0765L1078L2804L3866L2413L0924L1978L3658
58276B095349L3696L4178L7391M1027M2472M3762M7157N0095M9973M9681N2589
58265B577370N6207N6829N6280N7796N9412N8054N6266N8018O1444O2573O2742
$$ plain form
58347 1082147 1086954 1094473 1104534 1115471 1126780 1139238 1152437 1164767 1175821 1186376 1196114 1203811
58335 1203811 1209663 1215010 1219892 1223328 1225713 1228485 1231665 1234304 1236985 1241228 1246706 1251768 1256453 1262211
58321 1262211 1268985 1275437 1281876 1290018 1299947 1310156 1320478 1332075 1344700 1356905 1368843 1382000
58309 1382000 1396245 1410050 1423395 1437552 1452298 1466364 1480207 1495203 1510583 1524532 1537756
58298 1537756 1552389 1567968 1582440 1596769 1614297 1635486 1657509 1679245 1702484 1727834 1753646
58287 1753646 1779645 1807626 1837863 1868628 1899706 1932510 1966376 1998789 2029713 2061691 2095349
58276 2095349 2129045 2163223 2200614 2241641 2284113 2327875 2375032 2425127 2475100 2524781 2577370
58265 2577370 2633577 2690406 2746686 2804482 2863894 2921948 2978214 3036232 3097676 3160249 3222991
58254C222991O5492O9683P2514P5751Q2058Q8860R2799R6334J02925J09865J13417
58243D192689J16578J23834J32590J38112J42626J50856J60921J68522J75880
58234E502608J87347K00437K10628K20652K35472K52593K67241K82286L02725
58225G661989L25499L45543L66501L94203M25337M54607M86870N29355N78351
58216A1568255O27396O81650P49349Q26315R05288R93268J102291J230695J372490
58207B0056997J537595J742647J990337K280516K633819L080527L634445M302192
58199D1259075N106242O069045P186743Q453554R903990J1604574J3633801J6120577
58191A19337601J9275491K3316619K8358100L4326147M0695182M5922561M7194738
$$ plain form
58254 3222991 3288483 3358166 3430680 3506431 3588489 3677349 3770148 3866482 3969407 4079272 4192689
58243 4192689 4309267 4433101 4565691 4703803 4846429 4997285 5158206 5326728 5502608
58234 5502608 5689955 5890392 6101020 6321672 6557144 6809737 7076978 7359264 7661989
58225 7661989 7987488 8333031 8699532 9093735 9519072 9973679 10460549 10989904 11568255
58216 11568255 12195651 12877301 13626650 14452965 15358253 16351521 17453812 18684507 20056997
58207 20056997 21594592 23337239 25327576 27608092 30241911 33322438 36956883 41259075
58199 41259075 46365317 52434362 59621105 68074659 77978649 89583223 103217024 119337601
58191 119337601 138613092 161929711 190287811 224613958 265309140 311231701 358426439
58184C58426439M1453406K7570173P898284j2531929k8763985l8318030m1514809
58177C14219549m0151834l6126645l0865850k5280857j9830347j4716951j0253170
58170A36993895p051080n717556o296432q055322r880211j0923145j0952023j0216914
58162F7901212r097419p871978o693768n641643m742296l981852l338618k805726
58154B3727912k376866k029193j736884j490043j286738j117632r72619q52988
58146A1864949p62270o92055o29947n75105n33161n01260m70568m39008m09760
58137F851815l81064l48636l15014k86147k61473k36516k12100j91910j74359
58128D444596j56225j41348j36309j39562j43434j44647j44691j42336j34597
$$ plain form
58184 358426439 399879845 427450018 435348302 422816373 394052388 355734358 314219549
58177 314219549 274067715 237941070 207075220 181794363 161964016 147247065 136993895
58170 136993895 129942815 124225259 117928827 109873505 99993294 89070149 78118126 67901212
58162 67901212 58803793 50931815 44238047 38596404 33854108 29872256 26533638 23727912
58154 23727912 21351046 19321853 17584969 16094926 14808188 13690556 12717937 11864949
58146 11864949 11102679 10410624 9780677 9205572 8672411 8171151 7700583 7261575 6851815
58137 6851815 6470751 6122115 5807101 5520954 5259481 5022965 4810865 4618955 4444596
58128 4444596 4288371 4147023 4010714 3871152 3727718 3583071 3438380 3296044 3161447
58119C161447j23671j14720j07886r9748r1002q5307q1915p6938p0745o7032o5610
58108B176873o2975n9037n6652n5348n2087m7520m5055m4397m2112l8062l5254
58097A638374l3822l1075k7178k5002k4658k3553k1658k1380k2535k2535k1303
58086A363675k1057k1646k1091k0297k2074k5780k7883k7720k7804k8634k8097
58075A091592k6005k4492k3688k1603j8446j6696j6612j5944j4162j2930j2343
58064H88671j0793q564p544p366n969l851l616n268o201n954o715q816j0011r686
58050G88317r746j0698j0860j0009r976j0905j0769r339q947j0345j1362j0606
58038F64755r250q219o788m856l623l172k346j464k266m528n853n470n205o036
$$ plain form
58119 3161447 3037776 2923056 2815170 2715422 2624420 2539113 2457198 2380260 2309515 2242483 2176873
58108 2176873 2113898 2054861 1998209 1942861 1890774 1843254 1798199 1753802 1711690 1673628 1638374
58097 1638374 1604552 1573477 1546299 1521297 1496639 1473086 1451428 1430048 1407513 1384978 1363675
58086 1363675 1342618 1320972 1299881 1279584 1257510 1231730 1203847 1176127 1148323 1119689 1091592
58075 1091592 1065587 1041095 1017407 995804 977358 960662 944050 928106 913944 901014 888671
58064 888671 877878 869314 861770 854404 848435 844584 840968 835700 829499 823545 816830 808014 798003 788317
58050 788317 778571 767873 757013 747004 737028 726123 715354 706015 697068 686723 675361 664755
58038 664755 655505 647286 640498 635642 632019 628847 626501 625037 622771 618243 612390 606920 601715 595679
58024E95679o682o379o163o494o374n623n362n545m634k411n63J63Q02J741K089
58009E44244J985K726L954L570J246p32r93p84j224j511r68m33m22j4J343K790
57993E54777L654M252M549L927K791K359K382J231j367l754m992n841o723o983
57979E50262o695o872p418p013n578m567m389l852k603j664j112K54K380L693
57965E04826L951M735O365P200O822P090Q802J0033R204P305N699M120K262J026
57951E89440O52k11k024l122k539j848k565l765m075l996m314m055k141L45J658
57936E57440J982K671L872M693M844M596L808K328O72o94k027l394m216m501n311
57921E66763p004q280p963o620n403m515l834l686l965l609k148o17J7J88M58
$$ plain form
58024 595679 588997 582618 576455 569961 563587 557964 552602 547057 542423 540012 539449 539612 540414 542155 544244
58009 544244 546229 548955 552909 556479 557725 556993 556000 555216 553992 552481 551513 551080 550658 550644 551987 554777
57993 554777 558431 562683 567232 571159 573950 576309 578691 579922 578555 574801 569809 563968 557245 550262
57979 550262 543567 536695 529277 522264 516686 512119 507730 503878 501275 499611 498499 498753 501133 504826
57965 504826 508777 513512 519877 527077 533899 540989 549791 559824 569028 576333 582032 586152 588414 589440
57951 589440 590092 589881 587857 584735 582196 580348 577783 574018 569943 565947 561633 557578 555437 555782 557440
57936 557440 559422 562093 565965 570658 575502 580098 583906 586234 586906 586212 584185 580791 576575 572074 566763
57921 566763 559759 551479 543516 536896 531493 526978 523144 519458 515493 511884 509736 509119 509136 509324 509782
57906E09782L16n86j302j058p69j659l343m517m809m692m399m051m144m860n514
57891D64395n590n573n968o317o029n353m743m134l558l479l799l609k743k390
57877D01110l297m548n136n531o509p487p388o319n153m117k938j771r62m17J3
57862C39550J49J89Q95K397L733M363N063O397P502P499P132P625Q752R322Q911
57847D19479P956O726N339M277L788L327K424J548J186Q25j56j284j719j504j080
57832D51132l00Q97J510N98j084j827j206l78l05p27r40p13k83k8k12o99j113
57815D44322j350j621j903j914j752j723j458k27J527K231J176o61k367m211o254
57800D23815p336o773n745n594n745m777k714p31P03J901K748K901K799L151L712
$$ plain form
57906 509782 510098 509512 508210 507152 506383 504724 501381 496864 492055 487363 482964 478913 474769 469909 464395
57891 464395 458805 453232 447264 440947 434918 429565 424822 420688 417130 413651 409852 406243 403500 401110
57877 401110 397813 393265 388129 382598 376089 368602 361214 354895 349742 345625 342687 340916 339954 339537 339550
57862 339550 339699 339888 340783 343180 346913 351276 356339 362736 370238 377737 384869 392494 401246 410568 419479
57847 419479 427435 434161 439500 443777 447565 450892 453316 454864 456050 456875 456719 455435 453716 452212 451132
57832 451132 450832 451729 453239 453837 452753 450926 449720 449342 449037 448310 447370 446657 446374 446346 446134 445435 444322
57815 444322 442972 441351 439448 437534 435782 434059 432601 432374 433901 436132 437308 436647 434280 430069 423815
57800 423815 416479 409706 403961 398367 392622 387845 385131 384400 385103 387004 389752 392653 395452 398603 402315
57785D02315L793L603L837M253M009L169K671K810K881K286J155j16j128j550
57771D33988j618k217l692n146n694n811o403p204p384p295q082r745j1003j1120
57757C41574j0657j0179r414q053o475n246m494l987l392k459j284l13K28N97
57743B76446R43R35M32p0k42m78j011j242q22n69j254k197k264j644j313j250
57727B64400o76L02Q03P87J044J624J719J206R91J491K109K369K431K200J205
57712B84005k06p11K92J800K542K427K142K150K582L513M735N797O582P351P994
57697C32995P801O361M095J594r53l335n018n741n975o176n945m527k017M20J717
57682C15296K038K601M354P056R854J2603J6088K0796K6126L1297L6668M3490
$$ plain form
57785 402315 406108 409711 413548 417801 421810 424979 427650 430460 433341 435627 436782 436666 435538 433988
57771 433988 432370 430153 426461 421315 415621 409810 403407 396203 388819 381524 373442 363697 352694 341574
57757 341574 330917 320738 311324 303271 296796 291550 287056 283069 279677 277218 275934 275621 275849 276446
57743 276446 277389 278324 278756 278686 278444 277966 276955 275713 274891 274322 273068 270871 268607 266963 265650 264400
57727 264400 263724 264026 264829 265616 266660 268284 270003 271209 272200 273691 275800 278169 280600 282800 284005
57712 284005 283799 283088 283380 285180 287722 290149 292291 294441 297023 300536 305271 311068 317650 325001 332995
57697 332995 340796 347157 351252 352846 351893 348558 343540 337799 331824 325648 319703 315176 313159 313579 315296
57682 315296 317334 319935 324289 331345 341199 353802 369890 390686 416812 448109 484777 528267
57670E28267N2661O4441P9050R6357J14094J26417J25031J03264O0908O223m7419
57659A309294q8283j11199j17523j12072j00376q6990p4318o2715n2130m3209
57649D60479l6276l0336k4362j9037j5754j4255j2823j0706q835p841o919n327
57637B68008l711l024k970k492j320j67L01J22l20p37j041j217j222r95n98k63
57621B48354j28j36k91p37j301j383p06R6J79m49j064j191r33n27j51N2J59N01
57603B40344J105J389R70L03o0l44r89j613j493p32p1K24L28Mj212k943m133m328
57585B26749l973l427k585j551p46l16j29l88j322k373k600k016j506j425j283
57570B01109r33r19j301j238l05P18R39N26K29L55O99R58Q37K00n55p86m85k70
$$ plain form
57670 528267 580928 645369 724419 820776 934870 1061287 1186318 1289582 1350490 1356713 1309294
57659 1309294 1221011 1109812 992289 880217 779841 692851 618533 555818 503688 460479
57649 460479 424203 393867 369505 350468 334714 320459 307636 296930 288095 280254 273335 268008
57637 268008 264297 261273 258303 255811 254491 254324 254625 254747 254427 253690 252649 251432 250210 249215 248617 248354
57621 248354 248226 248090 247799 247062 245761 244378 243672 243768 243947 243498 242434 241243 240310 239783 239632 239684 239843 240344
57603 240344 241449 242838 243808 244111 244051 243707 242718 241105 239612 238880 238809 239033 239361 239365 238153 235210 231077 226749
57585 226749 222776 219349 216764 215213 214467 214151 214022 213634 212312 209939 207339 205323 203817 202392 201109
57570 201109 200176 199257 197956 196718 196413 197131 198070 198596 198825 199180 199879 200837 201674 201874 201319 200533 200048 199778
57552A99778m17m65m9O09J214J716J930J600J080J204K191L289L778L583K748
57537B23789J230m34j156o13K19L45p4l44k68j3M29R96J280J069P30O15N40K96
57519B28636J77M80J004J466J981K579K872K622K260K253K417K346K130K057J983
57504B57263J563Q70K83l4j25K2L26M81L13L5j01j50k54l89n32p27p29j83P06
57485B58638J123O39k72j024j540j777j318r5J086J384R59N30K98K6j63J65R85
57468B59644J708J872J547J134J052J521K320K931L110L155L347L452L080K320
57454B92193J719J733K382L217L556L123K463K291K436K068J121O15J171K053
57440C22141K281J962J789J816J666J523J916K705L118K869K526K680L211L523
$$ plain form
57552 199778 199361 198896 198847 199456 200670 202386 204316 205916 206996 208200 210391 213680 217458 221041 223789
57537 223789 225019 224585 223429 222816 223035 223380 223306 222962 222694 222681 223110 224106 225386 226455 227185 227800 228340 228636
57519 228636 228813 229293 230297 231763 233744 236323 239195 241817 244077 246330 248747 251093 253223 255280 257263
57504 257263 258826 259696 259979 259945 259820 259842 260168 260649 260962 260997 260896 260746 260492 260103 259571 258844 258115 257932 258638
57485 258638 259761 260400 260128 259104 257564 255787 254469 254374 255460 256844 257803 258333 258631 258657 258494 258659 259644
57468 259644 261352 263224 264771 265905 266957 268478 270798 273729 276839 279994 283341 286793 289873 292193
57454 292193 293912 295645 298027 301244 304800 307923 310386 312677 315113 317181 318302 318917 320088 322141
57440 322141 324422 326384 328173 329989 331655 333178 335094 337799 340917 343786 346312 348992 352203 355726
57426C55726L221K496J994K169K677K715K086J470J458J797J999K060K136K039
57412C86043J682J547K072K936L546L835M014L971L582L224L262L381L170K988
57398D29253L379L998M044L598L481L847L962L482K991L023L389L819M463N364
57384D82093O013N908N171M303L700L606M114M924N424N303M850M544M622N192
57370E49767O281P611Q621R021R130R419R942J0439J0809J1240J1871J2530J2917
57357F79598J3014J3115J3322J3222J2488J1644J1597J2219J2168J0656Q773Q215
57345H20031R069R777R245Q079P536Q012Q990R977J0920J1845J2497J2490J1817
57332I50285J1051J0846J1197J1521J1563J1731J2279J2722J2654J2600J3259
$$ plain form
57426 355726 358947 361443 363437 365606 368283 370998 373084 374554 376012 377809 379808 381868 384004 386043
57412 386043 387725 389272 391344 394280 397826 401661 405675 409646 413228 416452 419714 423095 426265 429253
57398 429253 432632 436630 440674 444272 447753 451600 455562 459044 462035 465058 468447 472266 476729 482093
57384 482093 488106 494014 499185 503488 507188 510794 514908 519832 525256 530559 535409 539953 544575 549767
57370 549767 556048 563659 572280 581301 590431 599850 609792 620231 631040 642280 654151 666681 679598
57357 679598 692612 705727 719049 732271 744759 756403 768000 780219 792387 803043 811816 820031
57345 820031 829100 838877 848122 856201 863737 871749 880739 890716 901636 913481 925978 938468 950285
57332 950285 961336 972182 983379 994900 1006463 1018194 1030473 1043195 1055849 1068449 1081708
57321A081708J4227J4360J3428J2434J2264J2752J3342J3856J4264J4403J4361
57310A231399J4589J5241J5817J5908J5872J6343J7307J8137J8358J8036J7581
57299A414588J7422J7819J8693J9674K0403K0761K0736K0322J9714J9427K0005
57288A629564K1576K3719K5752K7151K7849K8153K8287K8176K7714K7106K6699
57277A921746K6613K6791K7269K8085K9005K9692L0064L0219L0132K9827K9685
57266B239128L0027L0496L0410K9882K9903L1092L2832L4040L4419L4536L4943
57255B591708L5639L6308L6810L7339L8192L9319M0221M0472M0338M0509M1233
57244C018088M2115M2869M3765M4976M5959M6010M5298M4822M5255M6254M7006
$$ plain form
57321 1081708 1095935 1110295 1123723 1136157 1148421 1161173 1174515 1188371 1202635 1217038 1231399
57310 1231399 1245988 1261229 1277046 1292954 1308826 1325169 1342476 1360613 1378971 1397007 1414588
57299 1414588 1432010 1449829 1468522 1488196 1508599 1529360 1550096 1570418 1590132 1609559 1629564
57288 1629564 1651140 1674859 1700611 1727762 1755611 1783764 1812051 1840227 1867941 1895047 1921746
57277 1921746 1948359 1975150 2002419 2030504 2059509 2089201 2119265 2149484 2179616 2209443 2239128
57266 2239128 2269155 2299651 2330061 2359943 2389846 2420938 2453770 2487810 2522229 2556765 2591708
57255 2591708 2627347 2663655 2700465 2737804 2775996 2815315 2855536 2896008 2936346 2976855 3018088
57244 3018088 3060203 3103072 3146837 3191813 3237772 3283782 3329080 3373902 3419157 3465411 3512417
57233C512417M7203M7152M7109M6874M6188M5268M4651M4590M4875M5301M5980
57222D017608M7050M8370M9779N1340N3079N4713N5967N6980N8040N9061N9608
57211D611595N9369N8294N6434N3994N1319M8497M5144M1079L6987L3810L1630
57200E128152K9804K8155K7233K7310K7947K8836L0364L2820L5633L7959L9671
57189E473884M1217M2816M4375M5954M7797M9821N1513N2386N2329N1553N0435
57178F004080M9249M7851M5670M2245L7759L2864K8042K3320J8463J3287P850
57167F350680K469k519p174j1942j6995k1726k5250k7401k8856l0153l0950l0561
57155F119622k8959k6883k4897k2705j9528j4998r454l562K135P400J2428J7832
$$ plain form
57233 3512417 3559620 3606772 3653881 3700755 3746943 3792211 3836862 3881452 3926327 3971628 4017608
57222 4017608 4064658 4113028 4162807 4214147 4267226 4321939 4377906 4434886 4492926 4551987 4611595
57211 4611595 4670964 4729258 4785692 4839686 4891005 4939502 4984646 5025725 5062712 5096522 5128152
57200 5128152 5157956 5186111 5213344 5240654 5268601 5297437 5327801 5360621 5396254 5434213 5473884
57189 5473884 5515101 5557917 5602292 5648246 5696043 5745864 5797377 5849763 5902092 5953645 6004080
57178 6004080 6053329 6101180 6146850 6189095 6226854 6259718 6287760 6311080 6329543 6342830 6350680
57167 6350680 6353149 6350630 6343456 6331514 6314519 6292793 6267543 6240142 6211286 6181133 6150183 6119622
57155 6119622 6090663 6063780 6038883 6016178 5996650 5981652 5972198 5968636 5970771 5978171 5990599 6008431
57143F008431K4157L1053L6898L9413L6858K8947J7002L327r806k0865k9097l4142
57131F132176l5982l5180l2795k9817k6732k3702k0987j9165j8923k0516k3239
57120E845138k5588k6183k4472k0357j3597m046P740K0831L4714M9244O4128P9340
57108E986892R5909J15450J38999J67298K02136K46340L02490L72903M60999N71213
57098H660629P07136Q70872J063957J286848J536891J808512K095790K392892
57090B0423527K691871K982966L257834L509514L729001L906160M032725M091923
57082D8625521M035697L782445L260588K468594J490760M51186n46263j440092
57074F2128436k197436k800234l246025l548733l729519l806998l795733l708758
$$ plain form
57143 6008431 6032588 6063641 6100539 6139952 6176810 6205757 6222759 6226086 6216280 6195415 6166318 6132176
57131 6132176 6096194 6061014 6028219 5998402 5971670 5947968 5926981 5907816 5888893 5868377 5845138
57120 5845138 5819550 5793367 5768895 5748538 5734941 5730895 5738635 5759466 5794180 5843424 5907552 5986892
57108 5986892 6082801 6198251 6337250 6504548 6706684 6953024 7255514 7628417 8089416 8660629
57098 8660629 9367765 10238637 11302594 12589442 14126333 15934845 18030635 20423527
57090 20423527 23115398 26098364 29356198 32865712 36594713 40500873 44533598 48625521
57082 48625521 52661218 56443663 59704251 62172845 63663605 64114791 63568528 62128436
57074 62128436 59931000 57130766 53884741 50336008 46606489 42799491 39003758 35295000
57066C5295000l558267l355936l114793k849484k573584k297746k030763j780544
57058A3733883j552854j350230j172720j018839q85762p70251o70231n84684n11909
57049E216403m49197l94492l47121l06458k71140k40130k13374j90769j71381
57040B632341j54308j39388j26563j15308j05250r6586q9287q2578p5757o8987
57030A578329o2744n6890n0777m4037l6886k9754k2761j5432p029K774J3752K5834
57018A294379L9487N5181P3101R3230J13610J26964J21137Q7124K8417l8936r6618
57007A897076j34199j50764j50557j39419j23390j07172r2659p9541o7331n6293
56997G95751m6895l9268l3263k8407k3964j9511j5306j1760q833o276m091k217
$$ plain form
57066 35295000 31736733 28380797 25266004 22416520 19842936 17545190 15514427 13733883
57058 13733883 12181029 10830799 9658079 8639240 7753478 6983227 6312996 5728312 5216403
57049 5216403 4767206 4372714 4025593 3719135 3447995 3207865 2994491 2803722 2632341
57040 2632341 2478033 2338645 2212082 2096774 1991524 1894938 1805651 1723073 1647316 1578329
57030 1578329 1515585 1458695 1407918 1363881 1326995 1297241 1274480 1259048 1252019 1254793 1268545 1294379
57018 1294379 1333866 1389047 1462148 1555378 1668988 1795952 1917089 2004213 2032630 1993694 1897076
57007 1897076 1762877 1612113 1461556 1322137 1198747 1091575 998916 919375 852044 795751
56997 795751 748856 709588 676325 647918 623954 604443 589137 577377 568544 562268 558177 555960
56985E55960o0L006O671R519R814O474k33q488j5658j9811k0758j9691j8001j6447
56971D72297j5072j3495j1430r023o643m390k122N7J799L206N070Q141J2303J6732
56957D57430K0563K3086K3339J9970J2052N12j1469k0260k4408k5230k4612k3015
56945D27958k0105j6425j3149j0550p895m820j708J352M853Q865J2732J6171J9837
56932D17116K4369K9467L3920L5746L2335K1887N674j1871k6038l4668l8164l7846
56920D51927l4980l0723k6018k1554j7910j5382j3488j1346q821o795o015o194
56908B52701o469o174n012l232j727j242j280o87O03J494J629K044L366M671N026
56893B45711N009N730P282R225J1764J5223J8987K2004K3785K3878K1095J4665
$$ plain form
56985 555960 555900 558906 565577 575096 584910 591384 591151 582663 567005 547194 526436 506745 488744 472297
56971 472297 457225 443730 432300 423277 416634 412244 410122 410179 411978 415184 420254 428395 440698 457430
56957 457430 477993 501079 524418 544388 556440 556952 545483 525223 500815 475585 450973 427958
56945 427958 407853 391428 378279 367729 359834 355014 353306 354658 359511 368376 381108 397279 417116
56932 417116 441485 470952 504872 540618 572953 594840 600514 588643 562605 527937 489773 451927
56920 451927 416947 386224 360206 338652 320742 305360 291872 280526 271705 264910 258895 252701
56908 252701 246232 240058 235046 231814 230087 228845 227565 226878 227481 228975 230604 232648 236014 240685 245711
56893 245711 250720 256450 263732 272957 284721 299944 318931 340935 364720 388598 409693 424358
56881D24358N823k917r934j4924j7661j7694j5428j2320r610p433n233k412J322
56868C15937N608R535J2617J5570J9500K4623L0458L6958M4340N1569N5677N3028
56856F75420M1463K1969j040k1528l5148m1274m1897l9093l4100k7976k1742j5705
56844D59349r513l057L297R370J5421K1760K8681L6754M6589N8203P0806Q2565
56832H20225Q9849Q7351P0786M0595K862l3615o1536p7655q2901q0588p3969o4933
56820F36471n4608m4241l4765k6020j7364q854j061O024J3027K0306K8048L7024
56808E53987M7956N9623O8216O9059N9029L8070R758j9575m3514n8561o4803o4231
56796F55014n9098n1551m3461l5897k9038k2762j6941j1422o299k094J058M231
$$ plain form
56881 424358 430181 427264 417330 402406 384745 367051 351623 339303 329693 322260 317027 314615 315937
56868 315937 321545 331080 343697 359267 378767 403390 433848 470806 515146 566715 622392 675420
56856 675420 716883 738852 737812 716284 681136 639862 597965 558872 524772 496796 475054 459349
56844 459349 449836 446779 450076 459446 474867 496627 525308 562062 608651 666854 737660 820225
56832 820225 910074 997425 1068211 1108806 1111668 1078053 1016517 938862 855961 775373 701404 636471
56820 636471 581863 537622 502857 476837 459473 450619 449558 455582 468609 488915 516963 553987
56808 553987 601943 661566 729782 798841 857870 895940 905698 886123 842609 784048 719245 655014
56796 655014 595916 544365 500904 465007 435969 413207 396266 384844 378545 376451 377509 381740
56784C81740Q853J5083K1794K7908L2613L4270L0531K0364N383j1111k5846l6355
56772E05227m1406m1483l8398l3954k9205k4815k1244j8308j5444j2765j1075
56761B17130j0508j0049q882p436o479n883n040l940l102k721k563k463k455k532
56747A43077k586k506k132j437p91o46q19o13J30O57L34m50q69p68o98j054j561
56730A27268j589q08M00J176J019L40n2P5L56O05J022J615J982J849J365P63J64
56713A37550k35k24M8J91M3k75o57r56q61l56m7l59p10l56L04K75l88o71l18j25
56693A31873l67l06K96N56J5l98J81J173J526J234R04N91O6l10KO90R21N09K7
56674A39183j19j00j74l01k73K5M09M34n7m32J32J485K488K429J807J442J447
$$ plain form
56784 381740 390593 405676 427470 455378 487991 522261 552792 573156 578539 567428 541582 505227
56772 505227 463821 422338 383940 349986 320781 295966 274722 256414 240970 228205 217130
56761 217130 206622 196573 187691 180255 173776 167893 162853 158913 155811 153090 150527 148064 145609 143077
56747 143077 140491 137985 135853 134416 133625 132979 132160 131547 131677 132334 132668 132218 131349 130581 129883 128829 127268
56730 127268 125679 124871 125271 126447 127466 127806 127754 127829 128185 128790 129812 131427 133409 135258 136623 137386 137550
56713 137550 137315 137091 137139 137330 137373 137098 136441 135485 134624 134268 134221 133862 133152 132796 133100 133375 132987 132316 131998 131873
56693 131873 131506 131200 131496 132052 132067 131669 131850 133023 134549 135783 136687 137278 137344 137034 137036 137726 138647 139156 139183
56674 139183 139064 138964 138790 138489 138216 138241 138650 139084 139027 138595 138727 140212 142700 145129 146936 148378 149825
56657A49825J442J248R36N86L74M91P94R59J078J466J829J460M55j05M68J700
56641A65006K850L741M222L790K379P96k15p37j086j184r99q44q00n36j02j7k08
56624A76056P5P48O23o08j427o55O48Q48K60L66J161J166j59j615k079j730j198
56607A72480o53j71j01n80j198j466j283q41m33l37n78q13p19l07K99J074J800
56590A66173K001J565J034R39J187J444J659J812J654J156P83Q64J117J155J002
56575A85545Q00O07P44J617K885L591L568L719M444M898M515M242N216P129Q927
56560B42447J0267J1298J1744J1436J1094J1414J1855J1450J0374R546R169Q695
56548C70789P906O993N864M362K840J680O00p99k286l586n074o945q426q850q846
$$ plain form
56657 149825 151267 152515 153451 154037 154411 154902 155696 156655 157733 159199 161028 162488 162943 162838 163306 165006
56641 165006 167856 171597 175819 179609 181988 182784 182569 181832 180746 179562 178563 177719 176919 176383 176281 176264 176056
56624 176056 176131 176879 177502 176894 175467 174812 175460 176308 176568 176934 178095 179261 179102 177487 175408 173678 172480
56607 172480 171827 171656 171555 170975 169777 168311 167028 166187 165754 165417 164839 164026 163307 163000 163299 164373 166173
56590 166173 168174 169739 170773 171712 172899 174343 176002 177814 179468 180624 181407 182271 183388 184543 185545
56575 185545 186345 186952 187696 189313 192198 195789 199357 203076 207520 212418 216933 221175 226391 233520 242447
56560 242447 252714 264012 275756 287192 298286 309700 321555 333005 343379 352925 362094 370789
56548 370789 378695 385688 391552 395914 398754 400434 401034 400235 397949 394363 389289 382344 373918 365068 356222
56533C56222r360j0133j0404j0395j0751j1045j0335q866p752p221o605n790n353
56520B42212n281m897m032l198k644k271k208k485k493j891j511k132k865k304
56506B02000p68J89J82K02N51M10m60j253j591j908k196j893j210j087j514j393
56490A88261m22L01j9q61j463j663j311j34J323J825J018q9n47m25j36J64K76
56473A86098P6N4P68J719J904J411J193J308Q57k13q42o57n30r19j112o14J03
56456A90604P43J660K666K670J290l97j273j279o80N28J839K127J054l88j244
56441A99920j493j225j65J404K373K222J641J286R11K62k03j03K69O14J021J319
56425B10053J061M16P8Q9j24m09L5J011J318P21L64P56R99O19M24P92Q07P9k84
$$ plain form
56533 356222 346862 336729 326325 315930 305179 294134 283799 274933 267181 259960 253355 247565 242212
56520 242212 236931 232034 228002 224804 222160 219889 217681 215196 212703 210812 209301 207169 204304 202000
56506 202000 201232 201421 201603 201805 202356 202766 202306 201053 199462 197554 195358 193465 192255 191168 189654 188261
56490 188261 187839 188140 188121 187260 185797 184134 182823 182689 184012 185837 186855 186766 186219 185794 185658 185822 186098
56473 186098 186174 186228 186996 188715 190619 192030 193223 194531 195388 195175 194333 193676 193146 192227 191115 190501 190604
56456 190604 191347 193007 195673 198343 199633 199236 197963 196684 196004 196532 198371 200498 201552 201164 199920
56441 199920 198427 197202 197037 198441 200814 203036 204677 205963 206874 207136 206933 206830 207099 207713 208734 210053
56425 210053 211114 211530 211608 211697 211573 211164 211199 212210 213528 214249 214613 215369 216368 216987 217411 218203 219010 219089 218805
56406B18805L77R10K11r22j160o12j36K20P32R85O09K33M76Q61P82O59R72J157
56388B25159O69K73R05J932K031J194N87P16R75Q33M72K40K56N00Q25J057J223
56371B39847J322R10l55j740k054j353q29p77j66J295K246J710N50q2l73q35r80
56354B38336k67P11J181J369J624J414L69o82q61n58m60k50N52J378J550J573
56338B46979K177K858K727K139K097K588K757K353J857J597J621K042K555K279
56324B78626Q93o31j262j109o28L47J767K525J801N55L90J454K611L154L232L014
56308B96739K558K209K236K401K466K638K940K865K300J973K322K754K743K697
56294C31841L027L339L348L501L923L881L171K834L471M074L580K464J679J241
$$ plain form
56406 218805 219182 220092 220303 219381 218221 217609 217473 217693 218425 219410 220019 220252 220728 221589 222371 223030 224002 225159
56388 225159 225828 226101 227006 228938 230969 232163 232750 233466 234441 235274 235746 235986 236242 236742 237567 238624 239847
56371 239847 241169 242079 241724 239984 237930 236577 235748 234971 234805 236100 238346 240056 240606 240524 240151 239316 238336
56354 238336 238069 238780 239961 241330 242954 244368 244737 244055 243194 242636 242176 241926 242478 243856 245406 246979
56338 246979 249156 252014 254741 256880 258977 261565 264322 266675 268532 270129 271750 273792 276347 278626
56324 278626 279519 278888 277626 276517 275889 276236 278003 280528 282329 282884 283274 284728 287339 290493 293725 296739
56308 296739 299297 301506 303742 306143 308609 311247 314187 317052 319352 321325 323647 326401 329144 331841
56294 331841 334868 338207 341555 345056 348979 352860 356031 358865 362336 366410 369990 372454 374133 375374
56280C75374J007J585L157M564M903M903N481O126O133O170P100Q341Q967R352
56266D53163J0249J1293J2008J3161J5466J8025J9734K1195K3549K6468K9096
56255F53407L1859L5475L9132M1783M4259M8063N2750N6653N9505O2205O4546
56244A189637O5363O4601O3110O0582N5700M8341L9771L0689K0648R503k012j3078
56232A632855k3005l1040l7096m2254m7293n1397n3471n4020n4343n4653n4361
56221A129922n3365n1701m8796m4632m0614l7769l5117l1546k8022k6022k4886
56210G07452k2911k0088j7627j5622j3454j1676j1150j1000r699p675o582o537
56198E53431o276n501m845m089k699j584j984l079l005j855j332j803k079j790
$$ plain form
56280 375374 376381 377966 381123 385687 390590 395493 400974 407100 413233 419403 426503 434844 443811 453163
56266 453163 463412 474705 486713 499874 515340 533365 553099 574294 597843 624311 653407
56255 653407 685266 720741 759873 801656 845915 893978 946728 1003381 1062886 1125091 1189637
56244 1189637 1255000 1319601 1382711 1443293 1498993 1547334 1587105 1617794 1638442 1647945 1645933 1632855
56232 1632855 1609850 1578810 1541714 1499460 1452167 1400770 1347299 1293279 1238936 1184283 1129922
56221 1129922 1076557 1024856 976060 931428 890814 853045 817928 786382 758360 732338 707452
56210 707452 684541 664453 646826 631204 617750 606074 594924 583924 574225 566550 559968 553431
56198 553431 547155 541654 536809 532720 530021 528437 526453 523374 520369 518514 517182 515379 513300 511510
56184E11510j661j614q65L24J022J440K318K995K358J116Q60J400J389J032J574
56169E25198K652K826K349K701L691L770L055L260M640N710N996O401O857O342
56155E85448N332N579P208Q552R018R685J0934J1956J2809J4486J6881J8972K0983
56142G37843K4089K8082L1717L5163L9593M4733M9542N4978O3246P4220Q5381
56131A268587R5097J03096J07807J06483R8440Q5706P0619N5352M3310L7479L6893
56120B108869L7312L5476L0320K1042P740o157j5871k0254k1951k3004k3864k6507
56108B103151l4294m7723o3523p8433r0840r8738r9983r5321q7815p8822o7684
56097A259975n5379m4731l6555k9254k2539j7860j4785j0936o103k566q32J130
$$ plain form
56184 511510 509849 508235 507370 507694 508716 510156 512474 515469 517827 518943 519803 521203 522592 523624 525198
56169 525198 527850 530676 533025 535726 539417 543187 546242 549502 554142 559852 565848 572249 579106 585448
56155 585448 590780 596359 603567 612119 621137 630822 641756 653712 666521 681007 697888 716860 737843
56142 737843 761932 790014 821731 856894 896487 941220 990762 1045740 1108986 1183206 1268587
56131 1268587 1363684 1466780 1574587 1681070 1779510 1865216 1935835 1991187 2034497 2071976 2108869
56120 2108869 2146181 2181657 2211977 2233019 2240759 2234602 2218731 2198477 2176526 2153522 2129658 2103151
56108 2103151 2068857 2021134 1957611 1879178 1788338 1689600 1589617 1494296 1406481 1327659 1259975
56097 1259975 1204596 1159865 1123310 1094056 1071517 1053657 1038872 1027936 1021833 1019267 1018435 1019565
56085A019565L867N693O491Q194J0800J2084J1952J2947J5541J7142J6645J5817
56073A156738J5286J3433J0237P998P244O094M471M487N958O165M975N396Q043
56060A256525R995J0242J1237J3679J4940J4278J4463J6613J8320J8569J9482
56049A418343K1550K2250K1160K1285K3615K5446K5727K6685K8546K8356K5854
56038A688817K4800K6535K7967K7912K9373L3413L6812L8170M0186M3655M5457
56027B063097M4912M5643M8708N0510N0023N1209N5456N8770N9389O0984O5232
56016B653933O8552O9444P1613P6479Q0257Q1851Q5556R2362R7004R7608R9629
56005C574288J05952J11874J14577J18461J26125J33130J37025J42441J51855
$$ plain form
56085 1019565 1023432 1029125 1035616 1043810 1054610 1066694 1078646 1091593 1107134 1124276 1140921 1156738
56073 1156738 1172024 1185457 1195694 1203692 1210936 1217030 1221501 1225988 1231946 1238111 1243086 1248482 1256525
56060 1256525 1266520 1276762 1287999 1301678 1316618 1330896 1345359 1361972 1380292 1398861 1418343
56049 1418343 1439893 1462143 1483303 1504588 1528203 1553649 1579376 1606061 1634607 1662963 1688817
56038 1688817 1713617 1740152 1768119 1796031 1825404 1858817 1895629 1933799 1973985 2017640 2063097
56027 2063097 2108009 2153652 2202360 2252870 2302893 2354102 2409558 2468328 2527717 2588701 2653933
56016 2653933 2722485 2791929 2863542 2940021 3020278 3102129 3187685 3280047 3377051 3474659 3574288
56005 3574288 3680240 3792114 3906691 4025152 4151277 4284407 4421432 4563873 4715728
55996D715728J60552J66335J74578J87929K00863K10302K21358K36537K50152
55987F524334K59931K72834K92479L12547L29819L51398L81299M12832M42543
55978I580016M78290N24634N74318O23440O80381P49995Q24883R02865R96306
55969A5935128J112843J244868J390463J565762J783749K042103K347148K727986
55961C0150050L211030L803509M516960N378518O400576P570811Q895602J0426896
55953H0353952J2238414J4428393J7169603K0696049K5197625L0733812L7097870
55946B37915718M3361995M7303022M5679074L5991582J8684528k330792k1654463
55939D04950664l5289862m2125294m3338299m0922308l6659519l1798608k7060789
$$ plain form
55996 4715728 4876280 5042615 5217193 5405122 5605985 5816287 6037645 6274182 6524334
55987 6524334 6784265 7057099 7349578 7662125 7991944 8343342 8724641 9137473 9580016
55978 9580016 10058306 10582940 11157258 11780698 12461079 13211074 14035957 14938822 15935128
55969 15935128 17047971 18292839 19683302 21249064 23032813 25074916 27422064 30150050
55961 30150050 33361080 37164589 41681549 47060067 53460643 61031454 69927056 80353952
55953 80353952 92592366 107020759 124190362 144886411 170084036 200817848 237915718
55946 237915718 281277713 328580735 374259809 410251391 428935919 426605127 404950664
55939 404950664 369660802 327535508 284197209 243274901 206615382 174816774 147755985
55932A47755985k2752739j8958352j5702190j2981098j0738404q892915p387094
55925E0343193o176747n200714m398081l738114l204383k766539k393130k075425
55917B0390060j813908j594968j401762j234023j096685r80971q74848p80544
55909A0612351p04539o40868n80169n24952m80849m42449m02169l63999l34768
55900F137589l10283k83222k56597k36823k20974k02969j85287j72970j62624
55891D105840j48436j32897j21073j10200r5061p7966o3707m9970l2021j1736
55881C262773O846K5732M7821O8266P9117P8205O6306M1432M367l5312o7609r2865
55869C485079j16853j39661j57123j68699j75773j75785j66120j50913j36684
$$ plain form
55932 147755985 125003246 106044894 90342704 77361606 66623202 57730287 50343193
55925 50343193 44166446 38965732 34567651 30829537 27625154 24858615 22465485 20390060
55917 20390060 18576152 16981184 15579422 14345399 13248714 12267743 11392895 10612351
55909 10612351 9907812 9266944 8686775 8161823 7680974 7238525 6836356 6472357 6137589
55900 6137589 5827306 5544084 5287487 5050664 4829690 4626721 4441434 4268464 4105840
55891 4105840 3957404 3824507 3703434 3593234 3498173 3420207 3356500 3306530 3274509 3262773
55881 3262773 3269619 3295351 3343172 3411438 3490555 3568760 3635066 3676498 3680865 3645553 3577944 3485079
55869 3485079 3368226 3228565 3071442 2902743 2726970 2551185 2385065 2234152 2097468
55860B097468j23978j09907r5645q4490p5452o5626n6430n1075m8282m4661m0826
55849A301096l9261l8623l5968l2363l0697l0173k8217k5536k4192k3103k0426
55838I72537j7839j7591j7872j6033j3683j3620j4552j3849j2780j3814j5343
55827H05561j4381j2014j1005j0492q254n884o288q133q088o639o477o953n454
55814F95499k729j696k202j774l76Q9k63k21q93l897p551r080r099r832j0621
55799F35354r525p635p375q061p493o339o560p096n532k564l75J677N156P846
55785E81478N991K59n094q102r827j0462r364q051q612r834r151p535p972j0137
55771D83587j1134j0738j1193j2426j2179j0562r798r721q059n106l533l563k779
$$ plain form
55860 2097468 1973490 1863583 1767938 1683448 1607996 1542370 1485940 1434865 1386583 1341922 1301096
55849 1301096 1261835 1223212 1187244 1154881 1124184 1094011 1065794 1040258 1016066 992963 972537
55838 972537 954698 937107 919235 903202 889519 875899 861347 847498 834718 820904 805561
55827 805561 791180 779166 768161 757669 749415 743531 737243 729110 721022 714383 707906 700953 695499
55814 695499 692770 691074 688872 687098 686722 686811 686548 686327 685434 681537 673986 664906 655807 645975 635354
55799 635354 625829 618194 610819 602758 595265 588926 582366 575270 569738 567174 566799 568476 573632 581478
55785 581478 587469 587728 582634 574532 564705 554243 544879 536828 528216 518382 509231 501696 493724 483587
55771 483587 472453 461715 450522 438096 425917 415355 405557 395836 387777 382671 379138 375575 372796
55758C72796q85k62j359j864j004o93j769k843l451m678o169o102m702m313n493
55743C27209o364o167o089o270n400l792l383m221m242l009k332k640k197n98
55729B70505K73l88j108j162j729l175m073l873l842m476m596l796l242l364l160
55714B28794k367j948j937j294k61k80j194j193P7J020J102J518K313J782m23
55699B25709k335k774k870l550l974l535l118l350l618l587l739l815k846j285
55685A81313q89j869k398j550m69P4R15K479L654L732L445L290K644J311J60l96
55669A95446p65p02O19K630L579L154K873L419L773L395L009K582R61j716l525
55654B18732l602l294l624l754l049k527l022l721l748l540l618l539l041k725
$$ plain form
55758 372796 371911 371649 370290 368426 367422 366729 364960 362117 358666 353988 347819 341717 337015 332702 327209
55743 327209 320845 314678 308589 302319 296919 293127 289744 285523 281281 278272 275940 273300 271103 270505
55729 270505 270778 270390 269282 268120 266391 263216 259143 255270 251428 246952 242356 238560 235318 231954 228794
55714 228794 226427 224479 222542 221248 220987 220707 219513 218320 218397 219417 220519 222037 224350 226132 225709
55699 225709 223374 220600 217730 214180 210206 206671 203553 200203 196585 192998 189259 185444 182598 181313
55685 181313 180424 178555 176157 174607 174138 174212 175127 177606 181260 184992 188437 191727 194371 195682 195842 195446
55669 195446 194681 193979 194598 197228 200807 203961 206834 210253 214026 217421 220430 223012 223973 222257 218732
55654 218732 215130 211836 208212 204458 201409 198882 195860 192139 188391 184851 181233 177694 174653 171928
55640A71928k752k377j515j212j802k165j591q63p33q30p52p60p65j33R25J266
55624A55869O27J1j63o26j511j823j176m60j62K29P36N09n09j255j399j676k049
55607A45172j476j16L09q08j909j754j048p26m64J32N50N62P50J090P02l01n20
55590A40145L96J022O23L16Q72J356J106J100K026K849K680K356K786L364L468
55575A66465L936N489P171P955Q565J0081J1844J2364J1417R784P696M825J273
55562B68865k518o228r310j0911j0884j0094r209q157p155o942p428p426o408
55549A66195n242m594l992l181k819l039k833j797r97j163j538j438j411j774
55535A30377j631n95P9n85j606j655j032p09n70j01K68o3n88o05m77q51j397j440
$$ plain form
55640 171928 169176 166799 165284 164072 162270 160105 158514 157651 156918 156088 155336 154576 153811 153678 154603 155869
55624 155869 156496 156507 156344 155718 154207 152384 151208 150748 150586 150815 151551 152060 151551 150296 148897 147221 145172
55607 145172 143696 143580 143889 143081 141172 139418 138370 137644 137180 137312 137862 138424 139174 140264 140966 140665 140145
55590 140145 140541 141563 142186 142502 143374 144730 145836 146936 148962 151811 154491 156847 159633 162997 166465
55575 166465 170401 175890 183061 191016 199581 209662 221506 233870 245287 255071 262767 267592 268865
55562 268865 266347 260119 250809 239898 229014 218920 209711 201554 194399 187457 180029 172603 166195
55549 166195 160953 156359 152367 149186 146367 143328 140495 138698 137701 136538 135000 133562 132151 130377
55535 130377 128746 128151 128230 127645 126039 124384 123352 122643 122073 121972 122240 122177 121589 120984 120507 119656 118259 116819
55517A16819j074o30K3P68Q01j30j029j102q93j061j199q05l16j58P4N28M33l98
55499A10651p91j7Q69P86L18L96N28n0o66l25M06K66o35j168r75n48j46J69j5
55480A09053p78j302r96m52l25j86M15Q09L73j35K13Q66P96K87K72N81M24L5L17
55461A10267J191J696J480J052P91O41N20K62m04j174j207m78j52p88j311p31
55445A11655K26M22Q9J9Jm23o40P8J056J173O50M17M03m1o01m47K35O35P91J317
55425A17015K054K400K546L052L601L495L047L140L772M256M536N049N580N408
55411A68951M391K867Q72j557l716m914n363n560n384m738m260m368m344l549
55397A29328k634k301j898o13P75R97K86l09q23j822k652k156p45P7q5m04n59
$$ plain form
55517 116819 115745 115115 115138 115906 116707 116577 115548 114446 113553 112492 111293 110488 110172 110014 110088 110616 111049 110651
55499 110651 109860 109843 110712 111498 111816 112212 112740 112690 112024 111699 112105 112371 111736 110568 109593 109045 108899 109068 109053
55480 109053 108275 106973 105977 105525 105200 105014 105429 106238 106611 106476 106689 107555 108351 108638 108910 109491 109915 109950 110267
55461 110267 111458 113154 114634 115686 116477 117118 117638 117900 117496 116322 115115 114637 114485 113697 112386 111655
55445 111655 111881 112303 112392 112411 112412 111989 111349 111427 112483 113656 114306 114723 115126 115085 114484 114037 114272 114907 115698 117015
55425 117015 119069 121469 124015 127067 130668 134163 137210 140350 144122 148378 152914 157963 163543 168951
55411 168951 173342 176209 177081 175524 171808 166894 161531 155971 150587 145849 141589 137221 132877 129328
55397 129328 126694 124393 122495 121882 122657 123654 123940 123631 122808 120986 118334 116178 115433 115510 115425 115021 114462
55380A14462q79j138q87o51j074j321j73J693K381J615Q63Q16P33K69J6J4l82
55363A16357r83r00m06p24j758k006j126n61j034j375o81J11j25r21j184p57j48
55346A01779M21Q76J067J125J285J105k1j435j593k28J160J447J123R17N51k58
55330A09321q33m82M26J078J144N73n73j592j432j64P97N69n4J1N59P43L91j29
55312A10353o85j177j128l29N73Q19M97K57M12P86J027P50j94j270j587r73j76
55295A07955K07L28L56M0n40n95K71J235J267M84j57k15q2j83m39n66m55k68l04
55276A08339o72j041r14k80L50N95O32P77R67R17N42Q9j03J11N62R67J238J385
55258A14461J110Nj626k655k333j151n7O88J315J681J522J172J172J290Q28j99
$$ plain form
55380 114462 113583 112445 111558 110907 109833 108512 108339 110032 112413 114028 114891 115707 116440 116709 116725 116739 116357
55363 116357 115374 114474 114068 113344 111586 109580 108454 107893 106859 105484 104803 104914 104789 103868 102684 101927 101779
55346 101779 102200 103076 104143 105268 106553 107658 107637 106202 104609 104381 105541 106988 108111 109028 109579 109321
55330 109321 108488 108006 108432 109510 110654 111227 110654 109062 107630 107466 108263 108832 108778 108789 109348 110091 110482 110353
55312 110353 109668 108491 107363 107034 107607 108426 108923 109180 109592 110378 111405 112155 111961 110691 109104 108131 107955
55295 107955 108162 108490 108846 108886 108346 107751 108022 109257 110524 111008 110851 110636 110554 110371 109932 109366 108911 108643 108339
55276 108339 107667 106626 105712 105432 105782 106377 107009 107786 108753 109670 110212 110301 110198 110309 110871 111838 113076 114461
55258 114461 115571 115576 113950 111295 108962 107811 107754 108442 109757 111438 112960 114132 115304 116594 117422 117223
55242A17223r83j085q78q32r56j002p55j50M82N19j23o50m15J46L11K25M10P01
55224A12188O47N70R57J264N72o92j129m06L64L63o9n13j086j572j172L18J897
55207A12501K438J788N92l51m78J7J27p74j829j703m99M73O23N36M44j84j254
55190A12467j677r83r4J22j6R4L30L74L93N20L99j46o95q80q78q23m63K49R09
55171A09202J291J589J801J619J107P43O26M05J05J15L04J97L3N18J377J442M93
55154A22967l49m61n82j236j695j315p30p28r84q25m03j62L7L96N14M7n76q07
55136A13108p31n81k39K49L70M9qN18Q82N03p7j89r4j89p1O11J098N36n76j001
55116A14168m87J68M46N18O10P16Q46R17O63J70Q5P07J347J201M64j43m25o03
$$ plain form
55242 117223 116240 115155 114277 113445 112489 111487 110732 110582 111064 111583 111460 110810 110395 110541 110852 111077 111487 112188
55224 112188 112835 113405 114362 115626 116198 115506 114377 113971 114335 114698 114629 114116 113030 111458 110286 110604 112501
55207 112501 114939 116727 117319 116968 116490 116507 116634 115860 114031 112328 111829 112302 112925 113461 113905 113721 112467
55190 112467 110790 109807 109713 109835 109819 109913 110243 110617 111010 111530 111929 111783 111088 110208 109330 108507 108044 108293 109202
55171 109202 110493 112082 113883 115502 116609 117352 117978 118383 118488 118603 118907 119104 119137 119655 121032 122474 122967
55154 122967 122618 122157 121575 120339 118644 117329 116599 115871 114887 114062 113659 113497 113534 113930 114444 114491 113915 113108
55136 113108 112377 111796 111557 111806 112176 112225 112217 112735 113617 114120 114043 113854 113760 113571 113500 114111 115209 115745 115169 114168
55116 114168 113681 113849 114295 114813 115423 116139 116985 117902 118565 118735 118820 119527 120874 122075 122539 122396 121971 121368
55098A21368n54k6O19O83O0o30q32n36j19j2k89m69o1O39Q42M43J35J90M2n40
55078A20953q20l16K97K33k40m35l54l40l10j39j78n94p84k45M95O61L80K40L00
55059A18804L31N12R90J253Q61K75P8m9o11j124q10m0J20m09o50r5P53J329J546
55040A23064J391Q58L39K74M94N58N64P79P14l60j986k673j730j25P65N32l12
55023A23146j093j353j035n98n44p56o54k4P51J298J589J620J282O45O1k34k67
55006A23834j66m3p0l14n55m64L1P16J262J318P75P7p0L81O11L3q86j282r92m56
54986A23740J22Q82J744K271K087J152j47r80o50N05J244Q69J3m03l23l6O95K048
54968A34833L172K959J579K77k39l18l86m56o10j046j412r52M19J790K283J911
$$ plain form
55098 121368 120814 120788 121407 122090 122150 121520 120688 120152 120033 120021 119732 119263 119202 119841 120683 121126 121261 121451 121493 120953
55078 120953 120133 119817 120114 120347 120107 119672 119318 118978 118668 118529 118351 117757 116973 116728 117223 117884 118264 118504 118804
55059 118804 119135 119647 120637 121890 122751 123026 123104 123055 122444 121320 120510 120470 120590 120181 119531 119436 120189 121518 123064
55040 123064 124455 125313 125652 125926 126420 126978 127542 128321 129035 128675 126689 124016 122286 122161 122926 123458 123146
55023 123146 122053 120700 119665 119067 118523 117767 117113 117089 117840 119138 120727 122347 123629 124274 124335 124101 123834
55006 123834 123668 123625 123555 123241 122686 122222 122253 122969 124231 125549 126324 126401 126331 126712 127323 127356 126470 125188 124196 123740
54986 123740 123862 124744 126488 128759 130846 131998 131851 130871 130221 130726 131970 132839 132852 132449 132126 132090 132785 134833
54968 134833 138005 140964 142543 142820 142581 142263 141877 141421 140811 139765 138353 137401 137820 139610 141893 143804
54952A43804J226O72M28N28Q41J270J945K931L778L889L383L130L754M968O103
54937A82650O994Q051R535J0990J1529J0761R270P884O553M397R33l193o855r380
54923B50119j0665j0947j0759j0570j0163q928p030n566n078m699l431j631m28
54910A60224k02m88q99j249j127k80P31J116R47R36J301J699K122L033M547O178
54894A78589P467Q373R017R548J0203J0975J1305J0493Q359N163J196l047o652
54881B60989q878r832j0099j0014r682r316q924q154o949n942n490m938l649k181
54867A56941j488j409j061l90j30m27o48n48m76m54j31L05K17l51o97p34j145
54850A47374k079k722k558k061j808j742j719j914k213j998j078j59J19O7L38
$$ plain form
54952 143804 145030 145702 146130 146658 147499 148769 150714 153645 157423 161312 164695 167825 171579 176547 182650
54937 182650 189644 197695 207230 218220 229749 240510 249780 257664 264217 268614 269547 266354 259499 250119
54923 250119 239454 228507 217748 207178 197015 188087 181057 175491 170413 165714 162283 160652 160224
54910 160224 160022 159534 158635 157386 156259 155979 156710 157826 158773 159709 161010 162709 164831 167864 172411 178589
54894 178589 186056 194429 203446 212994 223197 234172 245477 255970 264329 269492 270688 267641 260989
54881 260989 252111 242279 232180 222166 212484 203168 194244 186090 179141 173199 167709 162771 159122 156941
54867 156941 155453 154044 152983 152593 152463 152036 151388 150840 150364 149910 149779 150084 150301 149950 149253 148519 147374
54850 147374 145295 142573 140015 137954 136146 134404 132685 130771 128558 126560 125482 125323 125442 125509 125847
54835A25847R58J394J359J052Q43R14J079R28L84l8J27N13L99j79m71j11N19J013
54817A36530J333J391J006M35K61N18N56O3m42l98M1L75M23L57M05P10J104J118
54799A45786N63O5L64J155J381P85L41Q01J636J889J586J642K695M459O141P191
54783A78480P677Q065Q697R536J0498J1595J2544J2595J1317R206P043M992K894
54770B95139J040j91j148k529m299n823o762p048o288m344k419k213l857n840
54756B43418p076p859q480q354p154n648m610l790k703j626r81m71M04J433K099
54741A88602K481L151M449O313Q452J0317J1318J1373J0808R548P013L208r02
54728B76131m468p483r951j1178j0762r587q940r017r090q709p987o904n293l429
$$ plain form
54835 125847 126805 128199 129558 130610 131453 132367 133446 134374 134758 134720 134847 135360 135759 135580 135109 134998 135517 136530
54817 136530 137863 139254 140260 140695 140956 141474 142030 142093 141651 141253 141294 141669 142092 142449 142854 143564 144668 145786
54799 145786 146349 146414 146778 147933 149314 150099 150440 151241 152877 154766 156352 157994 160689 165148 171289 178480
54783 178480 186157 194222 202919 212455 222953 234548 247092 259687 271004 280210 287253 292245 295139
54770 295139 296179 295988 294840 292311 288012 282189 275427 268379 262091 257747 255328 253115 249258 243418
54756 243418 236342 228483 220003 211649 204495 198847 194237 190447 187744 186118 185137 184666 185070 186503 188602
54741 188602 191083 194234 198683 204996 213448 223765 235083 246456 257264 266812 273825 277033 276131
54728 276131 271663 264180 254229 243051 232289 222702 213762 204745 195655 186946 178959 172055 166762 163333
54714A63333j919j045p37j089k208l515l936l000j429l49j83m61n44k41K22O65
54698A43564J127J541J556R98K82n7j43m81r78r33j38O18N68k9l46j26J50k3o25
54679A46525j242j439j132o47l95m13l95j54J80M08M31K27j20l78m27m49n64n22
54661A39494j51J22j49n48k36P62J511J473J126J060J197J183R51N03k23r86j206
54644A45883o71J50O84P82M99j35q79j291j191q50n65l88k87j98RK70K05k43l86
54625A41398L09J210J291O99M46O92N53k79j045j252j234j054k23R78J293L48
54609A44130n98n58k19m60p25j81N74M07m39p54k37L94Q17J247J377N70q31j577
54591A42937j132k41K85M64N51M07l2k95J23J044J716J545O12m73j115j227j102
$$ plain form
54714 163333 161414 160369 159632 158543 156335 152820 148884 145884 144455 144106 143923 143462 142918 142677 142899 143564
54698 143564 144691 146232 147788 148786 149068 149011 148868 148387 147409 146476 146338 146956 147524 147495 147149 147023 147173 147150 146525
54679 146525 145283 143844 142712 142065 141670 141257 140862 140708 140888 141296 141727 141954 141834 141456 141029 140580 140016 139494
54661 139494 139343 139465 139316 138768 138532 139294 140805 142278 143404 144464 145661 146844 147795 148298 148075 147089 145883
54644 145883 145212 145362 146046 146828 147327 147192 146313 145022 143831 142981 142416 142028 141741 141543 141552 141822 142027 141784 141398
54625 141398 141707 142917 144208 144907 145353 146045 146598 146319 145274 144022 142788 141734 141511 142489 143782 144130
54609 144130 143532 142974 142755 142295 141570 141389 141963 142370 141931 141177 140940 141334 142151 143398 144775 145345 144514 142937
54591 142937 141805 141564 141849 142313 142864 143271 143239 142944 143067 144111 145827 147372 147984 147511 146396 145169 144067
54574A44067q81m62Q5L80K20j50m57p14r22q85n73k74j49j4J65J38m7J30P88J192
54554A41637O99k43o35j32P54J424J630J389R28O40P30J006J106Q49L23j09P2
54537A52068R29J690J516O71K19N34Q89O61O2n30j082j450j290q03p06j079j191
54520A51108q19o73r98r45p3O47K68o77j077q12l89J16P76J143R31O67P69O72
54502A50634j00q44p52l12m28p73m35L56N65J05j43J38L98L35J72l2k74o0R58
54483A49508K049K251J878J910K212J733M72k90M5N08J06q65j490j393p67mM33
54466A58296L14m5k29l78q03j210j048m98k42l85m91m88o43q13o26k83k41k66
54448A49921J55O59M55j88j80O65J362J324R70N88j34j068j406q88k57K9M06J111
$$ plain form
54574 144067 143186 142724 142809 143189 143409 143259 142802 142088 141166 140281 139708 139434 139285 139271 139436 139574 139527 139657 140445 141637
54554 141637 142336 142093 141458 141326 142080 143504 145134 146523 147451 148091 148821 149827 150933 151782 152105 151996 152068
54537 152068 152997 154687 156203 156874 157093 157627 158516 159177 159239 158709 157627 156177 154887 154084 153378 152299 151108
54520 151108 150289 149616 148618 147673 147600 148247 148515 147838 146761 145949 145560 145676 146452 147595 148526 149193 149962 150634
54502 150634 150534 149690 148938 148626 148198 147425 146990 147346 147911 148016 147873 148011 148409 148744 148916 148884 148610 148550 149508
54483 149508 151557 153808 155686 157596 159808 161541 162013 161723 161768 162276 162382 161517 160027 158634 157867 157863 158296
54466 158296 158610 158565 158336 157958 157155 155945 154897 154399 154157 153772 153281 152793 152150 151337 150711 150428 150187 149921
54448 149921 150076 150735 151190 151002 150822 151487 152849 154173 155143 155731 155597 154529 153123 152235 151978 152007 152413 153524
54430A53524J506J107M32J44J06j29n46q63r59o87J23J139J559J067K58j75j51
54413A57455K5Q9j18m60m28J85O56K57m29k10Q20J298O91J7N5K23j73p26p57m25
54393A58045j86M7M94R40J203J482J701J289J64p90q94n57m18l93k38k36n94p96
54375A60263m35J9J6j59n4Om71j128j230p85k90J26N52P08M38L93J212K267K274
54356A63722J087q8k88J77M77K68j98m68j45P76J727K049J677J084N85J02m14
54339A72130p26n59J39J186K173K624K408J910J594J534J580J732J970J868R37
54324A92500o37j992k461k240k049k295k740k904k625k085j481r31o75r04j240
54309A65241r01K15J080P82j54n18j85j57q52j438j194m88K6L90Q31R55K30j045
$$ plain form
54430 153524 155030 156137 156569 156713 156819 156690 156144 155281 154322 153635 153758 154897 156456 157523 157781 157606 157455
54413 157455 157480 157569 157451 156991 156563 156748 157404 157661 157232 157022 157842 159140 159831 159848 159903 160126 159953 159227 158470 158045
54393 158045 157859 157906 158400 159340 160543 162025 163726 165015 165179 164389 163495 162938 162520 162127 161889 161653 161059 160263
54375 160263 159828 159847 159863 159704 159650 159656 159185 158057 156827 156042 155752 155878 156430 157138 157576 157969 159181 161448 163722
54356 163722 164809 164721 164433 164610 165087 165355 165157 164689 164544 165320 167047 169096 170773 171857 172442 172544 172130
54339 172130 171404 170845 170984 172170 174343 176967 179375 181285 182879 184413 185993 187725 189695 191563 192500
54324 192500 191863 189871 187410 185170 183121 180826 178086 175182 172557 170472 168991 168060 167385 166481 165241
54309 165241 164340 164555 165635 166417 166263 165745 165560 165403 164551 163113 161919 161431 161457 161847 162678 163633 163863 162818
54291A62818j910j745p37M38J094R34K66l06n03m56k14K80P34O61K01J15P04J365
54273A63739J534J414J336J061L06n64r72q78n31P5R65J701J719J021J25n24q16
54256A70711q78r78j277j574j511j120p56m71m4L55K81k0K97J272J810J273M98
54239A67868M38P06L63n27j172j422j722k088k054j555r54l59L78J047J267J115
54223A61329R45P56M31L46Q89J553J393M43k92l00j61m12p36o28k64j23k40l17
54205A64612k43j21L2K28L05R3k51l60j10J81J21l33q89j259j312r90l45K15J65
54186A59739m06o86k09M21M43L00J010K349K786J566j65r26o67l18k32l7L67N39
54168A65874J43o36j330j517j122o00n00p50q02n32l86m14j13M84N32j87n34L43
$$ plain form
54291 162818 160908 159163 158426 158864 159958 160892 161158 160852 160349 159893 159679 159959 160693 161354 161555 161670 162374 163739
54273 163739 165273 166687 168023 169084 169390 168826 167854 166976 166445 166520 167485 169186 170905 171926 172051 171527 170711
54256 170711 169833 168855 167578 166004 164493 163373 162617 162146 162102 162457 162738 162718 163015 164287 166097 167370 167868
54239 167868 168306 169012 169375 168848 167676 166254 164532 162444 160390 158835 157881 157522 157900 158947 160214 161329
54223 161329 162274 163030 163461 163807 164696 166249 167642 168085 167793 167493 167332 166920 166184 165556 165292 165169 164929 164612
54205 164612 164369 164248 164280 164508 164813 164906 164655 164295 164185 164366 164487 164154 163265 162006 160694 159704 159359 159574 159739
54186 159739 159333 158647 158438 158859 159302 159602 160612 162961 165747 167313 167148 166222 165555 165237 165005 164968 165335 165874
54168 165874 166017 165381 164051 162534 161412 160812 160312 159562 158760 158228 157842 157428 157315 157799 158331 158144 157610 157953
54150A57953J518J544N59o9K15O94P48N54M22M05O30J133J435R99J14m77o45q30
54132A66902r94n60N51J632K112K036J603R34M15M98J030J314J010M71J45J80
54116A79279N23Q99P10l61j723k459k454k275k093j608r62p78j091j126m68L67
54100A64380P77Q23P83O77N76P73J207J280O80j09m27k15J72M72N24K44j48j83
54082A72286J82L90K7n47o80k15M64R07Q99M89k5l20l92n05p15p00j99O40J427
54063A73413J872J907J712J648J869K056J755J057O04Q93J767K641L007K803K484
54048B01488K623L198L590L582L953N484P730R531J0596J1698J3312J4903J5684
54035C07372J5188J2918Q385K141l898p845r339r307q671p791o742n570m312l100
$$ plain form
54150 157953 159471 161015 161574 161505 161720 162414 163162 163716 164138 164543 165173 166306 167741 168740 168854 168377 167732 166902
54132 166902 165908 165348 165899 167531 169643 171679 173282 174216 174631 175129 176159 177473 178483 178954 179099 179279
54116 179279 179802 180701 181411 181050 179327 176868 174414 172139 170046 168438 167476 166698 165607 164481 164013 164380
54100 164380 165157 165980 166763 167440 168016 168789 169996 171276 171956 171847 171420 171205 171377 171849 172373 172617 172469 172286
54082 172286 172468 172858 172885 172338 171658 171443 171907 172814 173713 174202 174177 173857 173465 172960 172245 171545 171346 171986 173413
54063 173413 175285 177192 178904 180552 182421 184477 186232 187289 187893 188786 190553 193194 196201 199004 201488
54048 201488 204111 207309 210899 214481 218434 223918 231648 241179 251775 263473 276785 291688 307372
54035 307372 322560 335478 343863 346004 342106 334261 324922 315615 306944 299153 292411 286841 282529 279429
54021B79429k193j746j646j668j618j313p10j06O1k98q34j193j230r23m77m35
54005B63100j199k381l164l359l504l821l833l287k750k809l170l110k497j789
53991B22427j308r40n63k75k69n51q14o37oM38M5r35j571j440j002o99l43K11
53973B11768M81Q1n06n28p9J27j65n30o82p65q04n34qJ91k19o36k70P07J312J070
53953B10011P05J213K523L486L201J997R68P94J231J612J626J550J868K585L084
53938B38454K893K509K969M478N988O495O277O275O778P396Q053R057J0186J0561
53924C28369R669P871N708L328R23r16j685j481o55O30K171L367L538K541Q96
53909C64274n75j235j054o42n70o11n1J062J633Q26p55j780j774j474j660k226
$$ plain form
54021 279429 277236 275490 273844 272176 270558 269245 268535 268429 268490 268192 267358 266165 264935 264012 263535 263100
54005 263100 261901 259520 256356 252997 249493 245672 241839 238552 235802 232993 229823 226713 224216 222427
53991 222427 221119 220179 219616 219341 219072 218521 217707 217070 217064 217502 217547 216612 215041 213601 212599 211900 211557 211768
53973 211768 212249 212330 211824 211296 211217 211344 211179 210649 209967 209202 208398 207864 207856 208047 207828 207192 206922 207629 208941 210011
53953 210011 210716 211929 214452 217938 221139 223136 224104 224898 226129 227741 229367 230917 232785 235370 238454
53938 238454 241347 243856 246825 251303 257291 263786 270063 276338 283116 290512 298565 307622 317808 328369
53924 328369 338038 345909 351617 354945 355868 354952 353267 351786 351131 351761 353932 357299 360837 363378 364274
53909 364274 363699 362464 361410 360768 360198 359587 359536 360598 362231 363057 362302 360522 358748 357274 355614 353388
53893C53388k573k443k048j621j202q76q62j224j652j756j430p20M85K228M125
53878C41819N760P451R883J2594J3597J1121N415j677q380j3644j6739j7360j6170
53865C33670j4399j2756j1227r852q884q216p392o350n455m705l666k398j675
53852B36695j919k535k758k622k634k860k878k408j599p91k37M2K05L45L66K42
53836B14654K64O24R58P22M8l56j43K60K54k41p64o62L69J740K203J167m28j193
53818B19476r91q37j245j636j428q04k29J02J43j7K6N51J100J085Q97J467K689
53801B20349L405L146K761K969L415L616L749L915L624K747K048K095K384K264
53787B62487J887J607J257P92Q28J660K438K240J326N09q4p70j363j509j514j913
$$ plain form
53893 353388 350815 348372 346324 344703 343501 342625 341763 340539 338887 337131 335701 334981 335466 337694 341819
53878 341819 347579 355030 364913 377507 391104 402225 407640 405963 397583 383939 367200 349840 333670
53865 333670 319271 306515 295288 285436 276552 268336 260944 254594 249139 244434 240768 238370 236695
53852 236695 234776 232241 229483 226861 224227 221367 218489 216081 214482 213691 213454 213496 213701 214046 214412 214654
53836 214654 214918 215542 216500 217222 217270 216914 216771 217031 217285 217044 216280 215618 215987 217727 219930 221097 220669 219476
53818 219476 218485 217648 216403 214767 213339 212535 212306 212408 212551 212534 212560 213111 214211 215296 216193 217660 220349
53801 220349 223754 226900 229661 232630 236045 239661 243410 247325 250949 253696 255744 257839 260223 262487
53787 262487 264374 265981 267238 268030 268858 270518 272956 275196 276522 277031 276947 276177 274814 273305 271791 269878
53771B69878k534k801k726k810l189l524l466k735j277J58K87j113k555k690k078
53756B36825k055k522k333j457j183k031k904k747j924j428j568j891j877j297
53742B09608l46L49K29n20j104r54j30R29J657J512M38q29j417j204o92k66n1
53725B07209j81n53n16L75J490J803J381J227J607J570N39n17k57J186K287J893
53709B20543L92r04j144n14K99Q49J031P97K49j15J57P58R00N04M17J137K018
53692B27374K193J680R94K97l45n13M2Q17J256J562K027K152J403L14j97l18r12
53675B39826j826j969j094k36j09j97J50P15R71Q55N08j13q54j199r09m21k06
53658B33892k14j40Q3L51N70O03L99K59N67J145J339Q53Q0m70o54n00l0N72R04
$$ plain form
53771 269878 267344 264543 261817 259007 255818 252294 248828 246093 244816 244974 245261 244148 241593 238903 236825
53756 236825 234770 232248 229915 228458 227275 225244 222340 219593 217669 216241 214673 212782 210905 209608
53742 209608 209262 209611 209840 209320 208216 207262 207132 208061 209718 211230 211668 210839 209422 208218 207526 207260 207209
53725 207209 207028 206475 205959 206334 207824 209627 211008 212235 213842 215412 215951 215434 215177 216363 218650 220543
53709 220543 220935 220031 218887 218373 218672 219521 220552 221349 221598 221483 221640 222398 223298 223802 224219 225356 227374
53692 227374 229567 231247 232241 232538 232193 231680 231722 232539 233795 235357 237384 239536 240939 241253 241056 240738 239826
53675 239826 238000 236031 234937 234701 234592 234395 234545 235260 236231 237086 237594 237481 236627 235428 234519 234098 233892
53658 233892 233678 233538 233621 233972 234542 235145 235544 235803 236370 237515 238854 239707 239787 239317 238663 238163 238133 238705 239609
53639B39609P14R1o30r95o18L40J105J035L62k04l46k43j29k01o53j240j203l04
53621B36490N93P29O68J298K177K199J594J684K680L306K894K366K516K744K298
53606B66236J629J556J947K149K002J698J246Q21J024K010K917K867K112J508
53592B91722J308J148Q61N78K82r9l60l16k02l76p25p54j54Q58J563J088p47k822
53574B92853l555k607j163l24%K91M27J90N8N81J420J779J582J425J586J764J773
53557B98080J805J951J914J389M57m75j065j363j696k085k023j225l63l82j108
53542B93811j405q39k11j47j39L83R69R36O20Q73J835K951L885M648N072M987
53526C18229M734M839N323N830O278O817P336P573P533P428P368P505Q109R089
$$ plain form
53639 239609 240323 240414 239784 238789 238171 238511 239616 240651 241013 240809 240463 240220 240091 239890 239237 237997 236794 236490
53621 236490 237083 237812 238480 239778 241955 244154 245748 247432 250112 253418 256312 258678 261194 263938 266236
53606 266236 267865 269421 271368 273517 275519 277217 278463 279284 280308 282318 285235 288102 290214 291722
53592 291722 293030 294178 295039 295617 295899 295800 295440 295124 294922 294546 293821 293067 292913 293771 295334 296422 295675 292853
53574 292853 289298 286691 285528 285204 285204 285495 285922 286112 286170 286751 288171 289950 291532 292957 294543 296307 298080
53557 298080 299885 301836 303750 305139 305596 305121 304056 302693 300997 298912 296889 295664 295301 294919 293811
53542 293811 292406 291567 291356 291209 291070 291453 292422 293358 293978 294851 296686 299637 303522 308170 313242 318229
53526 318229 322963 327802 333125 338955 345233 352050 359386 366959 374492 381920 389288 396793 404902 413991
53512D13991R800R813R528R543R863J0285J1097J2602J4342J5545J6146J6631
53500E59186J7128J7303J7025J6422J5499J4383J3702J3967J4758J5145J4830
53489G29348J4224J3681J3340J3470J4068J4395J3860J3137J3395J4520J5189
53478H82627J4722J3702J2643J1325R845R029R181R428R079Q624Q552Q129O471
53465A013357M162K555J748N52j578l765n154o153p648r648j1365j2344j2874
53452I51845j3310j3553j3414j3185j3435j4325j5319j5800j5778j5778j6076
53441G91872j6305j5906j4823j3603j2846j2645j2539j2019j1013r905r023q268
53429F42977p283n891m296k898j998j553j115k01J207K609L613M443N576P007
$$ plain form
53512 413991 423791 433604 443132 452675 462538 472823 483920 496522 510864 526409 542555 559186
53500 559186 576314 593617 610642 627064 642563 656946 670648 684615 699373 714518 729348
53489 729348 743572 757253 770593 784063 798131 812526 826386 839523 852918 867438 882627
53478 882627 897349 911051 923694 935019 944864 953893 963074 972502 981581 990205 998757 1006886 1013357
53465 1013357 1017519 1020074 1021822 1022374 1020796 1017031 1011877 1005724 998076 988428 977063 964719 951845
53452 951845 938535 924982 911568 898383 884948 870623 855304 839504 823726 807948 791872
53441 791872 775567 759661 744838 731235 718389 705744 693205 681186 670173 660268 651245 642977
53429 642977 635694 629803 625507 622609 620611 619058 617943 617742 618949 621558 625171 629614 635190 642197
53415F42197Q215Q791Q907R132R982J1618J3691J5512J6552J6883J7048J7533
53403G96061J8505J9890K1431K2783K3809K4809K6170K7755K8972K9558L0041
53392A069784L1181L3090L5138L6693L7684L8377L8821L8796L8310L7813L7620
53381A473307L7399L6619L5390L4380L3817L3081L1550K9391K7206K5219K3253
53370A820612K1204J9038J6449J3052R014N098J973m40k825n796r431j3411j7620
53357A856917k2356k7728l3000l7009l9313m0467m1109m1374m1346m1363m1439
53346A450413m1022l9928l8877l8471l8135l6994l5316l4136l3627l2957l1721
53335A049229l0461k9570k8664k7448k6337k5699k5140k4072k2500k0722j8792
$$ plain form
53415 642197 650412 659203 668110 677242 687224 698842 712533 728045 744597 761480 778528 796061
53403 796061 814566 834456 855887 878670 902479 927288 953458 981213 1010185 1039743 1069784
53392 1069784 1100965 1134055 1169193 1205886 1243570 1281947 1320768 1359564 1397874 1435687 1473307
53381 1473307 1510706 1547325 1582715 1617095 1650912 1683993 1715543 1744934 1772140 1797359 1820612
53370 1820612 1841816 1860854 1877303 1890355 1899369 1904467 1906440 1906000 1903175 1897379 1887948 1874537 1856917
53357 1856917 1834561 1806833 1773833 1736824 1697511 1657044 1615935 1574561 1533215 1491852 1450413
53346 1450413 1409391 1369463 1330586 1292115 1253980 1216986 1181670 1147534 1113907 1080950 1049229
53335 1049229 1018768 989198 960534 933086 906749 881050 855910 831838 809338 788616 769824
53324G69824j6791j5237j4537j4227j3319j1414r114p318o409o133n966n546m839
53311F38974m031l244k443j523l89R96K487L782M761N679O781P835Q438Q704R230
53296F86037J0293J1501J2402J3027J3693J4575J5637J6721J7610J8263J9032
53285H48791K0245K1505K1877K1033J9755J9001J8769J8259J6908J4955J3042
53274A054140J1566J0365Q975P299N847N048M408K941M63k157m260o146q173r895
53260A080421j0841j1513j2762j4425j5587j6095j6853j8506k0584k2321k3571
53249H97363k4584k5361k5700k5510k4772k3555k2212k1229k0607j9830j8726
53238F45277j7852j7608j7455j6671j5560j5111j5580j6126j5988j5278j4451
$$ plain form
53324 769824 753033 737796 723259 709032 695713 684299 675185 667867 661458 655325 649359 643813 638974
53311 638974 634943 631699 629256 627733 627344 628340 630827 634609 639370 645049 651830 659665 668103 676807 686037
53296 686037 696330 707831 720233 733260 746953 761528 777165 793886 811496 829759 848791
53285 848791 869036 890541 912418 933451 953206 972207 990976 1009235 1026143 1041098 1054140
53274 1054140 1065706 1076071 1085046 1092345 1098192 1103240 1107648 1110589 1111052 1108895 1104635 1098489 1090316 1080421
53260 1080421 1069580 1058067 1045305 1030880 1015293 999198 982345 963839 943255 920934 897363
53249 897363 872779 847418 821718 796208 771436 747881 725669 704440 683833 664003 645277
53238 645277 627425 609817 592362 575691 560131 545020 529440 513314 497326 482048 467597
53227D67597j3614j2773j2134j1676j0866r336p606o530o205n940n295m545m091
53214C56986l901l748l634l690l908m116m103l750l238l075l661m674n238m805
53200C01445l646k408j498j026r46j069j181j337j759k303k399j814j089q50j019
53185B77101j147j226j609k275k670k365j482m57K84M73J56k41l21k05k98o41
53169B63077r07j041j405k153k810k858k404j992j905j951j904j775j626j385
53155B36961j032p96r37j325j515j348j177j294j416j130o40n63r92j368j357
53140B20071j232j198r39k70L56M79L30L67M80L31Q1J25L54L12L1m4K01M85P32
53121B21052J063J274J016N59N85J143J498J156L97m01j203j859j913j267m58
$$ plain form
53227 467597 453983 441210 429076 417400 406534 397198 389592 383062 376857 370917 365622 361077 356986
53214 356986 353085 349337 345703 342013 338105 333989 329886 326136 322898 319823 316162 311488 306250 301445
53200 301445 297799 295391 293893 292867 291921 290852 289671 288334 286575 284272 281873 280059 278970 278120 277101
53185 277101 275954 274728 273119 270844 268174 265809 264327 263870 264154 264627 264783 264542 264221 264016 263718 263077
53169 263077 262170 261129 259724 257571 254761 251903 249499 247507 245602 243651 241747 239972 238346 236961
53155 236961 235929 235133 234196 232871 231356 230008 228831 227537 226121 224991 224351 223788 222796 221428 220071
53140 220071 218839 217641 216702 216432 216788 217267 217597 217964 218444 218775 218856 218981 219335 219647 219678 219634 219835 220320 221052
53121 221052 222115 223389 224405 224964 225549 226692 228190 229346 229743 229342 228139 226280 224367 223100 222642
53106B22642R2M71O38Q6j241k391k464j810j360j175m96Q43J919J867Q95j36p35
53089B17645j057j390j671j584j010k68J97K84K73M17P35J214J822K256K066J292
53073B21221O30N60O93L65l84r98j335j777k360k455j613l13N45N72O0n49r87
53056B11875j037n87J11N23L47j57n43o83p66r41j213j507j653j393p34j89k61
53039B01192p25q72n16k21l30m23q9L45M18L82O92J061P89p2p09o46j81K91O39
53020B01025O00j02j116j561j110l90k4L6J9j49l99k79L46Q51O69Q5l20n54q89
53001A96738j101p82k31k37r61j640j534p09K18P20O65K87K8K08P05J072R74M55
52983A94875j48m28j88M20J011J332J368J154O83R2l90p35j065j199o89M95J671
$$ plain form
53106 222642 222734 223205 223843 223929 222688 220297 217833 216023 214663 213488 212992 213835 215754 217621 218516 218380 217645
53089 217645 216588 215198 213527 211943 210933 210665 210862 211146 211419 211836 212571 213785 215607 217863 219929 221221
53073 221221 221851 222411 223104 223469 223085 222087 220752 218975 216615 214160 212547 212234 212779 213351 213411 212862 211875
53056 211875 210838 210251 210362 210885 211232 211075 210532 209849 209083 208142 206929 205422 203769 202376 201642 201453 201192
53039 201192 200467 199595 199079 198858 198528 198105 198016 198361 198779 199161 199853 200914 201703 201631 200922 200276 200095 200386 201025
53020 201025 201625 201523 200407 198846 197736 197346 197322 197358 197377 197228 196829 196550 196896 197747 198416 198501 198181 197627 196738
53001 196738 195637 194855 194624 194387 193426 191786 190252 189543 189761 190481 191146 191433 191461 191669 192374 193446 194420 194875
52983 194875 194727 194299 194111 194531 195542 196874 198242 199396 200079 200171 199781 199046 197981 196782 196093 196588 198259
52966A98259K117J789J117M78J14K12O09O96N1r90j759k054k145k219k199k028
52950A92048j672r90J1Q86J050M66k92n74j92M75P19J46p21q02K69J526J774R69
52932A95096M4l31k01J58N32O49M25L19P69J266P96o90j910j750n42N61R13O54
52914A96758R5n82j125j317j263j201j047m83M03R16M98m90j017m71P41J727K062
52897A94204K005J949K000K082K037J560M25j018j936j893j363j075j166j324
52883A96487j434j558j464p34N72J774K171J637O35j35k39J27L81L55N11J091
52867B00177J566J452J193J460J804J112n57j679j156L29J342J376Q97M08J82
52852B09906N27J487K388K352J255k83j768l157m317m768m259l233k367j830j241
$$ plain form
52966 198259 200376 202165 203282 203760 203874 204086 204695 205391 205442 204452 202693 200639 198494 196275 194076 192048
52950 192048 190376 189386 189397 190283 191333 191799 191507 190933 190741 191216 191935 192081 191360 190558 190827 192353 194127 195096
52932 195096 195140 194809 194608 194766 195298 195947 196372 196691 197460 198726 199522 198832 196922 195172 194630 195191 196104 196758
52914 196758 196853 196271 195146 193829 192566 191365 190318 189835 190238 191154 191652 191162 190145 189674 190415 192142 194204
52897 194204 196209 198158 200158 202240 204277 205837 206262 205244 203308 201415 200052 198977 197811 196487
52883 196487 195053 193495 192031 191297 191869 193643 195814 197451 198086 197951 197712 197839 198220 198575 199086 200177
52867 200177 201743 203195 204388 205848 207652 208764 208207 206528 205372 205701 207043 208419 209316 209724 209906
52852 209906 210433 211920 214308 216660 217915 217632 215864 212707 208390 203622 199363 196130 193763 191933 190692
52837A90692l07P87J627K062K270K391K312J905J361J035J035J203J486K143L469
52822B15471N416P481Q852Q690O578K890j353n010p287p900p210o161n641n678
52808B09138n512m598l315k440k214k198j831q59N51J803K087J051o70j941k161
52793A86891j601p74R2Q49J181R71O56P59J147J161N18l06o99n66j84K40N69O21
52775A91525M03K94N55Q28N61j13m88k57J54L93O85J179J413R20N3m34l55j54
52757A97162j57k79m18n48n22j64L06M55K26n0k69o68j189j293p12k5j6o43j021
52738A90175m41Q13J781J852J378J125J251J140L63n62p94l33J7k24o21n09J36
52721A96547P20O35k31j298j648r01J74M11l37j002p34O6M44J47k74l23O8P71
$$ plain form
52837 190692 190385 191172 192799 194861 197131 199522 201834 203739 205100 206135 207170 208373 209859 212002 215471
52822 215471 220887 228368 237220 245910 252488 255378 254025 249015 241728 233828 226618 220457 214816 209138
52808 209138 203626 199028 195713 193273 191059 188861 187030 186171 186722 188525 190612 191663 190993 189052 186891
52793 186891 185290 184516 184608 185457 186638 187609 188265 189024 190171 191332 191850 191544 190845 190279 190095 190335 190904 191525
52775 191525 191928 192222 192777 193605 194166 194053 193565 193308 193462 193855 194540 195719 197132 198052 198105 197671 197316 197162
52757 197162 197005 196726 196308 195760 195238 195074 195380 195835 196061 196011 195742 195074 193885 192592 191880 191855 191839 191196 190175
52738 190175 189734 190547 192328 194180 195558 196683 197934 199074 199437 198875 198081 197748 197765 197541 196920 196411 196547
52721 196547 197267 197902 197671 196373 194725 193824 193998 194409 194072 193070 192336 192402 192846 192993 192719 192396 192464 193235
52703A93235J551J969J640O73l91j075j242r73m24J86O72R51R31N41J0j42K67
52686A98379P10N78P7m4M17Q12N87K3k42o5K11L11K30jl22m56j40M23O83M05o4
52665B02512l63n23o37m45K32R04R31N05N58J421K240K087J167M36L08M03L42
52648B12078J85L7j84m44m62j71O1j18n51p43m03L40J100J579J768J849J826J417
52630B19164M41p90j729k139k144j858j373r81r67j147j028n02M1L46N65Q07Q85
52613B07591O85L55j9m48o62k29O93J324J265R60Q24N65q2n61k47M74P08M09L06
52594B13911O22P18J66o40j115j103o30K31J046J097L09m12k35N77J136J118R29
52577B17725Q52O27J3o94r71p02k86j60l75o93r31j040r05l73L75P02J32r25j450
$$ plain form
52703 193235 194786 196755 198395 199068 198677 197602 196360 195387 194963 195149 195821 196772 197703 198244 198254 198112 198379
52686 198379 199089 199667 199744 199700 200117 200929 201516 201539 201297 201232 201443 201754 201984 201983 201661 201205 201065 201488 202171 202576 202512
52665 202512 202149 201626 200989 200544 200776 201680 202611 203116 203674 205095 207335 209422 210589 211025 211333 211736 212078
52648 212078 212263 212300 212116 211672 211210 211039 211100 210982 210431 209688 209285 209625 210725 212304 214072 215921 217747 219164
52630 219164 219605 218815 217086 214947 212803 210945 209572 208591 207624 206477 205449 204947 204988 205334 205899 206706 207591
52613 207591 208276 208631 208612 208164 207502 207273 207966 209290 210555 211515 212339 212904 212822 212261 212014 212488 213196 213605 213911
52594 213911 214533 215251 215417 214777 213662 212559 211929 212160 213206 214303 214612 214200 213965 214542 215678 216796 217725
52577 217725 218577 219204 219217 218523 217552 216850 216564 216404 216029 215336 214405 213365 212460 212087 212462 213164 213296 212371 210921
52558B10921q68L38J164J073L74k05j89K33M24L0n38o00j43J28k52q77j059p05
52540B09249k72j08k27n85j058j258q00J23Q60J093J147J413J808K035J987J636
52524B17043Q81q8o06k08O32J022Q11O78J024J453J583J661J914J840Q68n31j230
52507B28747q96l72m53q85r59o10m45q64j562j873j418l89O39J191J217R49N38
52490B22555L3l49k83K04O65P67O62O61Q28J094J465J818J793J279P70Q05J227
52473B35994J425J244J115J282J368R58J33p53j437j674j157J3R81P55p06k264
52457B37277k656j728m88J6k33l81J52R76J302R06K56j90l91m51l62j83j29k92
52439B33401m84n49n71o46o47m58j95l0l3l03r30j577j540o76J02j34j015j299
$$ plain form
52558 210921 210053 210391 211555 212628 213002 212797 212608 212841 213265 213295 212757 212157 212014 212142 211890 211013 209954 209249
52540 209249 208977 208869 208642 208057 206999 205741 204941 205064 205924 207017 208164 209577 211385 213420 215407 217043
52524 217043 217924 217836 217230 217022 217654 218676 219487 220165 221189 222642 224225 225886 227800 229640 230508 229977 228747
52507 228747 227851 227479 227026 226141 225182 224572 224127 223263 221701 219828 218410 218021 218660 219851 221068 222017 222555
52490 222555 222588 222239 221956 222160 222825 223592 224254 224915 225743 226837 228302 230120 231913 233192 233962 234767 235994
52473 235994 237419 238663 239778 241060 242428 243386 243519 242766 241329 239655 238498 238511 239492 240247 239541 237277
52457 237277 234621 232893 232405 232421 232188 231807 231959 232935 234237 235143 235399 235209 234818 234367 234005 233822 233693 233401
52439 233401 232917 232368 231797 231151 230504 230046 229851 229821 229788 229485 228555 226978 225438 224762 224864 224730 223715 222416
52421B22416n72K69L54l8k0P44J813K560K701K522K773L929N479O373O444O651
52405B64398P562Q329P795N986L699J185j709m472o153o651o698o559n807m554
52391B56351l695l513l149k065j036r15j291j289r39p79o23P2J008J310R49P99
52375B41195J254J717J681J422J307J145O59N4k91l20k16r8rL3Q8J85J23k09m31
52356B49289m9P34J209J219J373J913K090J240j4l75M72J509J720J276J054J391
52340B66051J738J544J086J048J494J737J374R36J154K005K914L596M090M177
52326B94944L544K517J889J861J818J375J005J281K008K543K666K719L051L635
52312C26856M137M201L854L609L926M533M662M020L151K764L066L823M565M710
$$ plain form
52421 222416 221844 222113 222467 222429 222409 223153 224966 227526 230227 232749 235522 239451 244930 251303 257747 264398
52405 264398 271960 280289 288084 294070 297769 298954 297245 292773 286620 279969 273271 266712 260905 256351
52391 256351 252656 249143 245994 243929 242893 241978 240687 239398 238459 237680 237057 237129 238137 239447 240396 241195
52375 241195 242449 244166 245847 247269 248576 249721 250380 250434 250143 249823 249607 249509 249500 249533 249621 249806 249929 249720 249289
52356 249289 249240 249974 251183 252402 253775 255688 257778 259018 259004 258629 259101 260610 262330 263606 264660 266051
52340 266051 267789 269333 270419 271467 272961 274698 276072 277008 278162 280167 283081 286677 290767 294944
52326 294944 298488 301005 302894 304755 306573 307948 308953 310234 312242 314785 317451 320170 323221 326856
52312 326856 330993 335194 339048 342657 346583 351116 355778 359798 362949 365713 368779 372602 377167 381877
52298C81877L955K755J949J782J714J324P52J36o53j448j589q07K93J035J406
52283C94481J600J488J106J062J720K513K745K649K864L263L213K795K837L665
52269D28001M588M792M169L162K250J724J632J765J900J988K024J984K067K652
52255D64698L644M261L945L105K472K100J556Q24K72j7j68M4R65K254L024K816
52239D95795J972J109P47J255K492L649M083M204M799N646N728M826L936L847
52225E44088M218M433M519M768N063N181N270N529N773N782N773O160O942P576
52211F21075P360N972L908K334K086K876L819M568N325N902N741M946M329M151
52197F84392L730K724J871J745J745J116L51M42J226J555J050O18J009J815K187
$$ plain form
52298 381877 385832 388587 390536 392318 394032 395356 396108 396244 395591 394143 392554 391747 392040 393075 394481
52283 394481 396081 397569 398675 399737 401457 403970 406715 409364 412228 415491 418704 421499 424336 428001
52269 428001 432589 437381 441550 444712 446962 448686 450318 452083 453983 455971 457995 459979 462046 464698
52255 464698 468342 472603 476548 479653 482125 484225 485781 486605 486877 486860 486692 486736 487701 489955 492979 495795
52239 495795 497767 498876 499623 500878 503370 507019 511102 515306 520105 525751 531479 536305 540241 544088
52225 544088 548306 552739 557258 562026 567089 572270 577540 583069 588842 594624 600397 606557 613499 621075
52211 621075 628435 634407 638315 640649 642735 645611 649430 653998 659323 665225 670966 675912 680241 684392
52197 684392 688122 690846 692717 694462 696207 697323 697674 698116 699342 700897 701947 702565 703574 705389 707576
52182G07576J972J591J189M81n95j485j582r69l66k31k81j65k52j118k442l139
52166G00184k720j818j067k49R51J998K087J361P77Q83J331J594J621J662J852
52151G10447K162K500K780K914K714J908N11p94j136m96K03K92J14J72J69m09
52135G24051j137j019R6J293J817J830J805J858J944K068K078J683J018P60J320
52120G41465K233K728K615K292K052J775J250N33j19n52r67j765l076m461n340
52105G40663n654n853o135o136n571m736m079l480k498j126J49J081J979L095
52091G01699M197M933N373N769O027N854N287M632L881K670J037k70n89j43K89
52076G50646L07J21P5L70J189K489L690M038L502K883K833L125L145K746K250
$$ plain form
52182 707576 709548 711139 712328 712809 712214 710729 709147 708178 707812 707581 707300 707135 706883 705765 703323 700184
52166 700184 697464 695646 694579 694330 695281 697279 699366 700727 701504 702387 703718 705312 706933 708595 710447
52151 710447 712609 715109 717889 720803 723517 725425 725936 725142 724006 723510 723713 724005 724119 724291 724460 724051
52135 724051 722914 721895 721991 723284 725101 726931 728736 730594 732538 734606 736684 738367 739385 740145 741465
52120 741465 743698 746426 749041 751333 753385 755160 756410 756943 756824 756272 755305 753540 750464 746003 740663
52105 740663 735009 729156 723021 716885 711314 706578 702499 699019 696521 695395 695544 696625 698604 701699
52091 701699 705896 710829 716202 721971 727998 733852 739139 743771 747652 750322 751359 751089 750500 750357 750646
52076 750646 750953 751074 751149 751519 752708 755197 758887 762925 766427 769310 772143 775268 778413 781159 783409
52061G83409J817J297O15m3m83o45m27L33J471K245J795R7j733k391j735q26n28
52044G84268n42k12K19j07j296k541l369m197n321o175o195n723n389n052m161
52029G34207k789j541n41O63K203L582M368M674M760M683M484M299M051L380K103
52014G72586N19q41j635j839j778j958k584l249l452l406l799m739n540n781n998
51999G26506o833q023q814r145r711j0959j2545j4012j5373j6730j7710j7722
51987E78929j6713j5270j3954j2798j1572j0230q890p528n958m121k187l73J110
51974D70445J931J801Q51m38j797l343m955n921n641m497l446k823k161j199m49
51959D38358m00p24o67k2P93J425J951K560L295M108M910N489N612N259M651M042
$$ plain form
52061 783409 785226 786523 787138 787095 786612 785967 785540 785873 787344 789589 791384 791481 789748 787357 785622 784796 784268
52044 784268 783726 783514 783733 783626 782330 779789 776420 772223 766902 760727 754532 748809 743420 738368 734207
52029 734207 731418 729877 729336 729999 732202 735784 740152 744826 749586 754269 758753 763052 767103 770483 772586
52014 772586 773105 772264 770629 768790 767012 765054 762470 759221 755769 752363 748564 743825 738285 732504 726506
51999 726506 719673 711650 702836 693691 683980 673021 660476 646464 631091 614361 596651 578929
51987 578929 562216 546946 532992 520194 508622 498392 489502 481974 476016 471895 469708 469335 470445
51974 470445 472376 474177 475028 474590 472793 469450 464495 458574 452933 448436 444990 442167 440006 438807 438358
51959 438358 437958 437234 436567 436545 437338 438763 440714 443274 446569 450677 455587 461076 466688 471947 476598 480640
51943D80640L647L664M050M291L793K657J740J671K046J913Q81o10j980l037l877
51928E01489m644n543o634p456p254n914m334l479l245k718j411K13J492K250
51914D52812K529K070N44j801m109n594o178o289o246n953n247m301l485k960
51900D05792k653k593k831k937k083k7K350M046N208O839R361J2174J4658J6936
51886D64240J9279K1348K2503K2654K2473K2866K4394K7084L0600L4492L8001
51875G49934L9395L6036K6100J0605o773k2153l3374l9837m1645l9687l5727l1460
51863F11414k7529k3980k1151j9391j8289j7065j5696j4859j4744j4655j3954
51852D10101j2727j1234r399p210n251m238m105l942k942j269J96R32J336K054
$$ plain form
51943 480640 484287 487951 492001 496292 500085 502742 504482 506153 508199 510112 510993 510383 508403 505366 501489
51928 501489 496845 491302 484668 477212 469958 464044 459710 456231 452986 450268 448857 449070 450562 452812
51914 452812 455341 457411 457955 456154 452045 446451 440273 433984 427738 421785 416538 412237 408752 405792
51900 405792 403139 400546 397715 394778 392695 392668 395018 399064 404272 411111 420472 432646 447304 464240
51886 464240 483519 504867 527370 550024 572497 595363 619757 646841 677441 711933 749934
51875 749934 789329 825365 851465 862070 855297 833144 799770 759933 718288 678601 642874 611414
51863 611414 583885 559905 538754 519363 501074 484009 468313 453454 438710 424055 410101
51852 410101 397374 386140 376741 369531 364280 360042 355937 351995 349053 347784 347980 348912 350248 352302
51838C52302K990L498L460L376L321K652J372P95J885L532L737K306J048J157
51824C87431J685J055q83l041m478m965m680m092l853m163m398l799k390q81J36
51809C48684N43M91K51J30K64N90J129K006K947L233K529J457Q20N30j40j350
51793C64114k419k797k768k936l357l501k874j501J51J588K646L493M253M765
51779C58857M716L991K743J247k18j397k205k800l326l729l870l845l867l908
51765C42389l667l053k428k203k297k180j504m67M70J072J389J446J187P51M83
51750C31388M76L61j32o50o24j25J80Oj19M03J427K311K673K602K313J964J640
51733C46094J264O06k90q19l16J141K737L765M214M440M511M148L211K096J552
$$ plain form
51838 352302 355292 358790 362250 365626 368947 371599 372971 373766 375651 379183 382920 385226 386274 387431
51824 387431 389116 390171 389288 386247 381769 376804 372124 368032 364179 360016 355618 351819 349429 348548 348684
51809 348684 349227 349718 349969 350099 350363 350953 352082 354088 357035 360268 362797 364254 365074 365604 365464 364114
51793 364114 361695 358898 356130 353194 349837 346336 343462 341961 342112 343700 346346 349839 354092 358857
51779 358857 363573 367564 370307 371554 371336 369939 367734 364934 361608 357879 354009 350164 346297 342389
51765 342389 338722 335669 333241 331038 328741 326561 325057 324590 325060 326132 327521 328967 330154 330905 331388
51750 331388 331864 332225 332093 331443 330819 330694 330874 330880 330761 331164 332591 334902 337575 340177 342490 344454 346094
51733 346094 347358 347964 347674 346855 346539 347680 350417 354182 358396 362836 367347 371495 374706 376802 378354
51718C78354K047L349M796N985P071Q204Q944Q415O168K642j163m336o357p069
51704D17050o590n233l370j292Q18K670L699L271J276j482l802n109n818o475
51690C89613o849o290m926l937m332n727o742o550n631m918m640m279l468k448
51676C18876j605r81m11J71Q55J811K946L746L961M224N325O924P662O757M849
51661C65110K951J247n00j989k622k453k127j925j567r14j98N92J834L452M468
51646C65359L816J422j719m327n623n690n221m724l971k601j077l70n93p61k80
51631C33640J42l03j167j456j170j105j417j470j075q38j074j250q89k87P3J83
51615C20537K50K77K97N42J037J479J844K621M034N534O468O789O769O473O032
$$ plain form
51718 378354 380401 383750 388546 394531 401602 409806 418750 427165 433333 435975 434812 430476 424119 417050
51704 417050 410460 405227 401857 400565 401383 404053 407752 411023 412299 410817 407015 401906 396088 389613
51690 389613 382764 376474 371548 367611 363279 357552 350810 344260 338629 333711 329071 324792 321324 318876
51676 318876 317271 316290 315879 316050 316905 318716 321662 325408 329369 333593 338918 345842 353504 360261 365110
51661 365110 368061 369308 368808 366819 364197 361744 359617 357692 356125 355211 355013 355605 357439 360891 365359
51646 365359 369175 370597 368878 364551 358928 353238 348017 343293 339322 336721 335644 335274 334681 333920 333640
51631 333640 333782 333479 332312 330856 329686 328581 327164 325694 324619 323781 322707 321457 320568 320281 320354 320537
51615 320537 320787 321064 321361 321903 322940 324419 326263 328884 332918 338452 344920 351709 358478 364951 370983
51600C70983N913O407P215Q012Q841R407Q619N784J885j278k919l405k929j174
51586D21361J735N097Q492J1800J4244J4691J3364J2171J2584J3829J3824J1275
51574E54467O452N71m766q034q451o217j882M081J0899J7323K2437K6174K8681
51561F41735K9727K9319K8388K7996K8096K7617K5565K1526J5477P879j82p653
51549H75490j4383k0867k7196l2626l6233l7686l7431l6339l4985l3085k9945
51538E34714k5644k1323j7920j5197j2472r842p889o660n719n033m926n226n236
51525C91627m650l871l369l197l169l052k644k021j618j615j542r92m42o65j506
51510C57274j959j436l04P57J322J224O77L43O53J099Q40j64j277k162k831k928
$$ plain form
51600 370983 376896 383303 390518 398530 407371 416778 425397 431181 433066 431788 428869 425464 422535 421361
51586 421361 423096 428193 436685 448485 462729 477420 490784 502955 515539 529368 543192 554467
51574 554467 560919 561490 556724 548690 540239 534022 532140 536221 547120 564443 586880 613054 641735
51561 641735 671462 700781 729169 757165 785261 812878 838443 859969 875446 883325 883143 875490
51549 875490 861107 840240 813044 780418 744185 706499 669068 632729 597744 564659 534714
51538 534714 509070 487747 469827 454630 442158 432316 424427 417767 412048 407015 402089 396863 391627
51525 391627 386977 383106 379737 376540 373371 370319 367675 365654 364036 362421 360879 359887 359445 358780 357274
51510 357274 355315 353879 353575 354332 355654 356878 357555 357898 358551 359650 360490 360326 359049 356887 354056 351128
51494C51128k105j039r43j872k540k118j232p96q15p92n16J3P16J194J087R27
51478C40297J710L235M005L260K059J557J290K27j379k410k595k607k728k587
51464C43334k122j747j511r49O2R83J425J633K063K849L908N319P319R847J2116
51449C84529J2762J0954P399L851J500L50J87J174K959M051L078K64l089o120
51435D23849q572r879r291p106m828l663l359k795j333O27K162K642K184J351
51421C81989M28q01k460m123n164n378m979m282l629l280l108k702k070j721j777
51406C36943j534m40R88J877K191K509K986L328L538L915M476N100O083P790R828
51391C89578J1350J2236J3247J4954J7229J9825K2734K5839K8909L2128L5990
$$ plain form
51494 351128 349023 347984 347041 345169 342629 340511 339279 338483 337668 336876 336360 336373 337089 338283 339370 340297
51478 340297 342007 345242 349247 352507 354566 356123 357413 357640 356261 353851 351256 348649 345921 343334
51464 343334 341212 339465 337954 337005 337067 338050 339475 341108 343171 346020 349928 355247 362566 372413 384529
51449 384529 397291 408245 415644 419495 420995 421345 421532 422706 425665 429716 432794 433058 429969 423849
51435 423849 415277 405398 396107 389001 384173 380510 377151 374356 373023 373650 375812 378454 380638 381989
51421 381989 382417 381616 379156 375033 369869 364491 359512 355230 351601 348321 345213 342511 340441 338720 336943
51406 336943 335409 334969 335957 337834 340025 342534 345520 348848 352386 356301 360777 365877 371960 379750 389578
51391 389578 400928 413164 426411 441365 458594 478419 501153 526992 555901 588029 624019
51380F24019M0441M4674M7974N0123N0696M8730M3658L6185K7644J8739R284r14
51368A041253j1391k1313l0153l7859m4350m9028n1150n0730m8782m6345m3508
51357F06644l9701l4786k9501k4942k1790j9800j7879j4960j1258q237o887o444
51345C70459n487l909k829k718k667j840o68r3k72n92o15m65m46o63r92j217j186
51328C43800q67k96M49J089J179N95k29p62r44j014j032r59r57j177j426j451
51312C35998j362j362j374j362j637k272k597k057j193r52j270j343j065j094
51298C15058j490j498q42j17L65J001J798K109J896K195L506M830N189N233O222
51283C45455P939Q829P920N740L357J317m18k021l444m283m188l480k992l012
$$ plain form
51380 624019 664460 709134 757108 807231 857927 906657 950315 986500 1014144 1032883 1042167 1041253
51368 1041253 1029862 1008549 978396 940537 896187 847159 796009 745279 696497 650152 606644
51357 606644 566943 532157 502656 477714 455924 436124 418245 403285 392027 383790 376903 370459
51345 370459 364972 361063 358234 355516 352849 351009 350341 350248 349976 349384 348769 348304 347858 347195 346203 344986 343800
51328 343800 342933 342637 343086 344175 345354 345949 345720 344958 344014 343000 341968 341009 340052 338875 337449 335998
51312 335998 334636 333274 331900 330538 328901 326629 324032 321975 320782 319830 318560 317217 316152 315058
51298 315058 313568 312070 311228 311111 311476 312477 314275 316384 318280 320475 323981 328811 334000 339233 345455
51283 345455 353394 362223 370143 375883 379240 380557 380139 378118 374674 370391 366203 362723 359731 356719
51269C56719k983k503j984j757j286j27R32P83k49p33j81L53K2n61m48Q5pq88
51251C45187j542j212m12q4k64j86M73J162J400J476J702J630P42l98o85p4K93
51234C49208k41r69r73l74J10J45j74o93j006m39J147K901L884M072L928L501
51218C64027K630J661J137R71O42N2m52p89j136j350j121o65n73q78r91p10n55
51201C61900q59j102o43L28J079J346J545K021K499K513K145K049K647L599M306
51186C85373M740N307N944N913M814L187J808O98o28k228l622m457m828m956n030
51171C92035n230n634n978n831n009l726k425j582j395j524j359q13m72o83r59
51156C49415o61J03P55J022R50N81K06M92J596K470K036Q08L01Q59J210L76r84
$$ plain form
51269 356719 353736 351233 349249 347492 346206 346079 347011 347794 347545 346812 346631 346984 347006 346445 345997 346082 346075 345187
51251 345187 343645 342433 342021 341937 341673 341487 341960 343122 344522 345998 347700 349330 350072 349674 348989 348915 349208
51234 349208 348967 347998 347025 346651 346761 346906 346732 346039 345033 344594 345741 348642 352526 356598 360526 364027
51218 364027 366657 368318 369455 370426 371068 371120 370668 369879 368743 367393 366272 365607 365034 364156 363165 362455 361900
51201 361900 361041 359939 359296 359624 360703 362049 363594 365615 368114 370627 372772 374821 377468 381067 385373
51186 385373 390113 395420 401364 407277 412091 415278 417086 417784 417156 414928 411306 406849 402021 397065 392035
51171 392035 386805 381171 375193 369362 364353 360627 358202 356620 355225 353701 352342 351529 351057 350374 349415
51156 349415 348754 348857 349612 350634 351584 352165 352371 352863 354459 356929 358965 359773 360074 360933 362143 362519 361535
51139C61535j684j488r20k56N26J337K115L044M088M671M378L689L425L659L738
51124C91857L234K317J212o9j361k234k503k563k906l442l593l049k177j576j393
51109C71754j263r60p63r22j077o93k5K1q59j776j760j007m51l85k27M27J249
51092C61283J863K373K836K834K172J585J917K743K649J060r36j937j845j586
51078C77011j664j726j355o53Q7P28J191J388J410J518J780K030K155K208K109
51063C88217J699J191J154J868K922L640L674L069K053J002L58M09J241K870N144
51048D20511P501R277J0373J1197J1862J1899J1005R539Q032O650N458M692M323
51035E32319L726K294O0k576n336p880r591j0148r943r452q517o854m935l651
$$ plain form
51139 361535 359851 358363 357443 357187 357713 359050 361165 364209 368297 372968 377346 381035 384460 388119 391857
51124 391857 395091 397408 398620 398551 397190 394956 392453 389890 386984 383542 379949 376900 374723 373147 371754
51109 371754 370491 369531 368768 367846 366769 366076 366051 366072 365213 363437 361677 360670 360219 359834 359607 360034 361283
51092 361283 363146 365519 368355 371189 373361 374946 376863 379606 382255 383315 382379 380442 378597 377011
51078 377011 375347 373621 372266 371613 371700 372428 373619 375007 376417 377935 379715 381745 383900 386108 388217
51063 388217 389916 391107 392261 394129 397051 400691 404365 407434 409487 410489 410847 411256 412497 415367 420511
51048 420511 428012 437289 447662 458859 470721 482620 493625 503164 511196 517846 523304 527996 532319
51035 532319 536045 538339 538399 535823 530487 522607 513016 502868 492925 483473 474956 468102 463167 459516
51021D59516l198k923k200r83L93J497J995K006K127K714L383L686L911M639N841
51006D82404P006P903Q515Q536P775O846O591O924P078O922P099P795Q402Q560
50992E88356Q724R236R648R407Q681Q117Q153Q721R259Q919P233M584J558j928
50978F88668o166j0502j3580j4841j4870j4278j3265j2298j1947j1641r979o851
50966E48450l968k521j509N19L275N516P088Q669J0152J0905J1351J2682J4927
50953F25536J6795J7658J8473K0211K2569K4859K7256L0311L3757L6504L7493
50942I11422L6040L1724K4624J5819P150K18m427p241r061j0574j2231j4296j6751
50929I52416j9215k1269k2902k4318k5369k5613k5081k4400k3869k2968k1270
$$ plain form
51021 459516 456318 453395 451195 450212 450605 452102 454097 456103 458230 460944 464327 468013 471924 476563 482404
51006 482404 489410 497313 505828 514364 522139 528985 535576 542500 549578 556500 563599 571394 579796 588356
50992 588356 597080 606316 615964 625371 634052 642169 650322 659043 668302 677221 684454 689038 690596 688668
50978 688668 682502 672000 658420 643579 628709 614431 601166 588868 576921 565280 555301 548450
50966 548450 544482 541961 540452 540971 544246 549762 556850 565519 575671 586576 597927 610609 625536
50953 625536 642331 659989 678462 698673 721242 746101 773357 803668 837425 873929 911422
50942 911422 947462 979186 1003810 1019629 1026779 1026997 1022570 1015329 1006268 995694 983463 969167 952416
50929 952416 933201 911932 889030 864712 839343 813730 788649 764249 740380 717412 696142
50918F96142j9287j7739j6438j4721j2705j1173j0265r269p846o548n729m825
50906E59597l318j724r46j011j202j151j048q79k88N63P31l41j823k284j371r7
50890E43408N79P71J012J190Q40J24k47m9K12K24K68M57L29l01o81n6J146J839
50872E51065J754J661K155K897L214K940K397K011K047K526L211L916M756N896
50858E92446P130Q085Q740R365R976J0282J0260J0328J0836J1728J2825J4096
50846G16097J5486J6795J7895J8820J9592K0221K0915K2016K3594K5414K7351
50835I44196K9540L2078L4928L8137M1744M5362M8302N0343N1950N3421N4202
50824A424203N3384N0576M5975L9917L2762K4954J6743P978j394j0725j9033k5934
$$ plain form
50918 696142 676855 659116 642678 627957 615252 604079 593814 584545 576699 570151 564422 559597
50906 559597 556279 554555 553609 552598 551396 550245 549197 548318 548030 548593 549324 548983 547160 544876 543505 543408
50890 543408 543987 544758 545770 546960 547800 547924 547677 547628 547840 548064 548332 548789 549118 548817 548136 548080 549226 551065
50872 551065 552819 554480 556635 559532 562746 565686 568083 570094 572141 574667 577878 581794 586550 592446
50858 592446 599576 607661 616401 625766 635742 646024 656284 666612 677448 689176 702001 716097
50846 716097 731583 748378 766273 785093 804685 824906 845821 867837 891431 916845 944196
50835 944196 973736 1005814 1040742 1078879 1120623 1165985 1214287 1264630 1316580 1370001 1424203
50824 1424203 1477587 1528163 1574138 1614055 1646817 1671771 1688514 1696492 1695098 1684373 1665340 1639406
50812A639406l1785l6859m0865m3334m4244m3961m2844m1113l8956l6528l3854
50801A205063l0825k7338k3409j9227j5083j1205p618m222r96J911M251N784O413
50788A083499O366O157O173O208N629M096J996Qj647l254m998o642p953r216j0998
50773A075424j3462j6152j8494k0278k1619k2678k3557k4319k4843k4746k3588
50762H41688k1308j8435j5857j4189j3238j2095j0057p406n094l606k524j327
50750G16552j36P34J519K721M290N601O351O868P573Q493R502J0543J1487J2177
50736H04275J2737J3476J4294J4672J4494J4400J4918J5606J5597J4726J3606
50725I62801J2666J1731J0572R434Q665Q183P595O821O377O958Q773J1357J4061
$$ plain form
50812 1639406 1607621 1570762 1529897 1486563 1442319 1398358 1355514 1314401 1275445 1238917 1205063
50801 1205063 1174238 1146900 1123491 1104264 1089181 1077976 1070358 1066136 1065140 1067051 1071302 1077086 1083499
50788 1083499 1089865 1096022 1102195 1108403 1114032 1118128 1120124 1120132 1118485 1115231 1110233 1103591 1095638 1086422 1075424
50773 1075424 1061962 1045810 1027316 1007038 985419 962741 939184 914865 890022 865276 841688
50762 841688 820380 801945 786088 771899 758661 746566 736509 729103 724009 720403 717879 716552
50750 716552 716416 717150 718669 721390 725680 731281 737632 744500 752073 760566 770068 780611 792098 804275
50736 804275 817012 830488 844782 859454 873948 888348 903266 918872 934469 949195 962801
50725 962801 975467 987198 997770 1007204 1015869 1024052 1031647 1038468 1044845 1051803 1060576 1071933 1085994
50712A085994J6619J9095K1506K3844K6345K9162L1638L2456L1004K8124K5040
50701A370827K1897J7980J3145Q252M209J250o94j570j496j096j105j892l427
50688A426280n481p691r702j1406j2801j3500j2812j0398o554j692M011J0212
50676A348466J6102K0984K4846K7999L0414L1743L1797L0569K8036K4459K0711
50665A636126J7756J5752J4086J2297J0497Q845P068M759J932r88l633n966q083
50652A710448r728j0115q510n092r63K937O691J0938J5825K0827K5307K8820L0942
50639A818327L1407L0402K8378K5567K2157J8707J5811J3348J0783Q306P065P907
50627B038165J0192J1822R976K146j2190l0176m6482n6497n8895n5234m7943l9074
$$ plain form
50712 1085994 1102613 1121708 1143214 1167058 1193403 1222565 1254203 1286659 1317663 1345787 1370827
50701 1370827 1392724 1410704 1423849 1432101 1436310 1437560 1436866 1435296 1433800 1432704 1431599 1429707 1426280
50688 1426280 1420799 1413108 1403406 1392000 1379199 1365699 1352887 1342489 1335935 1334243 1338254 1348466
50676 1348466 1364568 1385552 1410398 1438397 1468811 1500554 1532351 1562920 1590956 1615415 1636126
50665 1636126 1653882 1669634 1683720 1696017 1706514 1715359 1722427 1727186 1729118 1728130 1724497 1718531 1710448
50652 1710448 1700720 1690605 1682095 1677003 1676040 1678977 1685668 1696606 1712431 1733258 1758565 1787385 1818327
50639 1818327 1849734 1880136 1908514 1934081 1956238 1974945 1990756 2004104 2014887 2023193 2030258 2038165
50627 2038165 2048357 2060179 2070155 2072301 2060111 2029935 1983453 1926956 1868061 1812827 1764884 1725810
50615A725810l0074k1605j3570n834J154O664J0296J1887J1169P971K530m734
50603A701664j3354k2433l0682l7399m2965m7795n1240n2250n0810m7876m4243
50592A260617m0249l6300l2716k9095k4761j9849j5138j0795o144q85M279Q535
50580A057499J1778J4304J6175J7234J7219J5815J3016R495O049K766o08l559
50568A177183m937m347k579m63J908M621P626J1252J6035K1519K6223K9402L1970
50555A315413L4905L7531L8330L6733L3303K8761K3909K0039J8166J7952J8339
50544A623381J9082K0789K3570K6663K9454L1931L4047L5610L7160M0052M5066
50533A966805N1399N7633O3359O9246P5752Q2345Q8076R2455R5421R6639R5340
$$ plain form
50615 1725810 1695736 1674131 1660561 1654727 1655881 1662545 1672841 1684728 1695897 1703868 1706398 1701664
50603 1701664 1688310 1665877 1635195 1597796 1554831 1507036 1455796 1403546 1352736 1304860 1260617
50592 1260617 1220368 1184068 1151352 1122257 1097496 1077647 1062509 1051714 1045570 1044685 1048964 1057499
50580 1057499 1069277 1083581 1099756 1116990 1134209 1150024 1163040 1172535 1178584 1181350 1180742 1177183
50568 1177183 1172246 1167899 1165320 1164857 1166765 1171386 1179012 1190264 1206299 1227818 1254041 1283443 1315413
50555 1315413 1350318 1387849 1426179 1462912 1496215 1524976 1548885 1568924 1587090 1605042 1623381
50544 1623381 1642463 1663252 1686822 1713485 1742939 1774870 1808917 1844527 1881687 1921739 1966805
50533 1966805 2018204 2075837 2139196 2208442 2284194 2366539 2454615 2547070 2642491 2739130 2834470
50522B834470R0927Q3442P3145O0007M4080K6201P634j0964k9547m7596o3923
50511C067876p7871q9796r9818j06829j09531j07889j02735r4479q3186o9669
50501B126073n5415m1408k7701j4189j041J1625K3759L4918M4225N0760N3469
50490B205075N1024M2588K8837J1618p369k6858m5235o0663p2300q0602q6020
50479A960095q8209q7052q3592p9358p5073p0717o6337o2165n8150n3971m9574
50468A185897m5235m1115l7032l2777k8433k4315k0629j7256j3951j0778q164
50457I06212o332m905l373j699j86J149K382L141K946K230K186L274M537M912
50443I16474M693N019O252P530P939P514O942O735O986P778R366J1789J4491J6614
$$ plain form
50522 2834470 2925397 3008839 3081984 3141991 3186071 3212272 3219906 3208942 3179395 3131799 3067876
50511 3067876 2990005 2900209 2800391 2693562 2584031 2476142 2373407 2278928 2195742 2126073
50501 2126073 2070658 2029250 2001549 1987360 1986319 1997944 2021703 2056621 2100846 2151606 2205075
50490 2205075 2256099 2298687 2327524 2339142 2331773 2304915 2259680 2199017 2126717 2046115 1960095
50479 1960095 1871886 1784834 1701242 1621884 1546811 1476094 1409757 1347592 1289442 1235471 1185897
50468 1185897 1140662 1099547 1062515 1029738 1001305 976990 956361 939105 925154 914376 906212
50457 906212 899880 894975 891602 889903 889717 890866 893248 896389 899335 901565 903751 907025 911562 916474
50443 916474 921167 926186 932438 939968 947907 955421 962363 969098 976084 983862 993228 1005017 1019508 1036122
50429A036122J7759J8179J8206J7940J7691J8292K0309K3249K6122K8733L1768
50418A274370L5719M0294M4934M9186N2474N4229N4568N4271N3742N2534N0183
50407A816504M6984M3454L9450L4317K7648J9483J0015n32j1863k3742l5910m7644
50395A918164n7675o4926o9276p1317p1538o9960o6450o1132n4482m7086l9237
50384A245085l0846k1917j3044n023J949Q296J4199J9220K2911K5237K6079K4765
50372A316911K0677J4060N914k790j1493j9782k7031l2523l5944l7751l8774l9264
50360A112210l8714l6953l4887l3447l2257l0395k8185k6948k6817k6281k4355
50349G72971k1904k0010j8310j5998j3483j1770j0884j0129r330q626p514n424
$$ plain form
50429 1036122 1053881 1072060 1090266 1108206 1125897 1144189 1164498 1187747 1213869 1242602 1274370
50418 1274370 1310089 1350383 1395317 1444503 1496977 1551206 1605774 1660045 1713787 1766321 1816504
50407 1816504 1863488 1906942 1946392 1980709 2008357 2027840 2037855 2037323 2025460 2001718 1965808 1918164
50395 1918164 1860489 1795563 1726287 1654970 1583432 1513472 1447022 1385890 1331408 1284322 1245085
50384 1245085 1214239 1192322 1179278 1174255 1176204 1184500 1198699 1217919 1240830 1266067 1292146 1316911
50372 1316911 1337588 1351648 1357562 1354772 1343279 1323497 1296466 1263943 1227999 1190248 1151474 1112210
50360 1112210 1073496 1036543 1001656 968209 935952 905557 877372 850424 823607 797326 772971
50349 772971 751067 731057 712747 696749 683266 671496 660612 650483 641153 632527 625013 619589
50337F19589k969j398q45l12O86J647K266K903L688M229M561N321O651P839Q364
50322F62220Q524Q659Q595Q317Q311Q790R285R564J0228J1841J4071J6303J8491
50309H03199K0615K1801K0757J6961J0912L509m178j0824j5322j7466j7786j6834
50297H15344j5031j3038j1599j0823j0054q702o947n497m817m766m869m765m374
50284G10062l720k795j736q46k35N02J845L624N102N847O106O228O217O022N907
50269G48130O111O597P352Q612J0349J1865J2346J1690J0383Q798O970M913K730
50256H56846M93j636l303m278m809n278n721o035o436p081p413o668n111l985
50242G89585l938m199l775k835k236k091j652n27P21J388J474J462J617J856K108
$$ plain form
50337 619589 616620 615222 614377 614065 614751 616398 618664 621567 625255 629484 634045 639366 646017 653856 662220
50322 662220 670744 679403 687998 696315 704626 713416 722701 732265 742493 754334 768405 784708 803199
50309 803199 823814 845615 866372 883333 894245 897754 893576 882752 867430 849964 832178 815344
50297 815344 800313 787275 775676 764853 754799 746097 739150 733653 728836 724070 719201 714436 710062
50284 710062 706342 703547 701811 700965 700730 701232 703077 706701 711803 717650 723756 729984 736201 742223 748130
50269 748130 754241 760838 768190 776802 787151 799016 811362 823052 833435 842233 849203 854116 856846
50256 856846 857339 855703 852400 848122 843313 838035 832314 826279 819843 812762 805349 798681 793570 789585
50242 789585 785647 781448 777673 774838 772602 770511 768859 768332 769053 770441 771915 773377 774994 776850 778958
50227G78958K540L478N194P629J0263J2459J4101J5666J7519J9316K0364K0447
50215I27934J9959J9274J8273J6658J4592J2808J2033J2198J2292J1207Q846O041
50203A092115L257j75n036j0775j5892j9681k2661k5068k5938k4341k0877j7015
50191I07913j3277r027l979R41M351N363L563j124p864j4639j9195k0571j9582
50178H12873j7833j6327j4877j2741r735o620m345l129k485k030j806j917k184
50165G16844k262j863q52N11J562J868J890K464L587M301L958K988K054J112j29
50150G38033j372k095k461l121m144m877m923m639m455m249l630k559j410o25
50136F93473m44p76j271j659k028k503k800k490j717j117q96m91M82J551K105
$$ plain form
50227 778958 781498 784976 790170 797799 808062 820521 834622 850288 867807 887123 907487 927934
50215 927934 947893 967167 985440 1002098 1016690 1029498 1041531 1053729 1066021 1077228 1086074 1092115
50203 1092115 1095372 1095197 1090161 1079386 1063494 1043813 1021152 996084 970146 945805 924928 907913
50191 907913 894636 885609 881630 882571 886922 892285 895848 894724 886860 872221 853026 832455 812873
50178 812873 795040 778713 763836 751095 741360 734740 730395 727266 724781 722751 720945 719028 716844
50165 716844 714582 712719 711867 712378 713940 715808 717698 720162 723749 728050 732008 734996 737050 738162 738033
50150 738033 736661 734566 732105 728984 724840 719963 715040 710401 705946 701697 698067 695508 694098 693473
50136 693473 693029 692253 690982 689323 687295 684792 681992 679502 677785 676668 675772 675281 675763 677314 679419
50121F79419K446L332M680N505N305M897N447P150R298J1314J3175J4860J5999
50108G82827J6422J6692J7761K0084K3304K6753L0052L3182L6048L8258L9317
50097A080700L9001L7484L5193L2684L0598K9456K9273K9384K8795K6729K2794
50086A422091J6807Q769q51j1029k0532k8412l4230l8122m0641m2259m2848m1897
50074A146846l9430l6345l3512l0800k7478k3397j9203j5452j2227r743q621r008
50062H81630r949j0187r415q267p243o267n160l975k734j329J26J274K004K617
50048H23125L284L705L537K901K121J333O51M81J084J880J765L46j489k546k630
50033H39548k598l212m289n023m893m045k928j908j236j085j382j731j819j755
$$ plain form
50121 679419 681865 685197 689877 695382 700687 705584 711031 718181 727479 738793 751968 766828 782827
50108 782827 799249 815941 833702 853786 877090 903843 933895 967077 1003125 1041383 1080700
50097 1080700 1119701 1157185 1192378 1225062 1255660 1285116 1314389 1343773 1372568 1399297 1422091
50086 1422091 1438898 1447667 1446816 1435787 1415255 1386843 1352613 1314491 1273850 1231591 1188743 1146846
50074 1146846 1107416 1071071 1037559 1006759 979281 955884 936681 921229 909002 899259 890638 881630
50062 881630 871681 861494 852079 843812 836569 830302 825142 821167 818433 817104 817230 818504 820508 823125
50048 823125 826409 830114 833651 836552 838673 840006 840657 841138 842222 844102 845867 846213 844724 842178 839548
50033 839548 836950 833738 829449 824426 819533 815488 812560 810652 809416 808331 806949 805218 803399 801644
50019H01644j652r46J224M755Q176R984J0018R071P624N656L501J913J076L69
50005H62413n33j066p70k95p28k335m500o663q619j0099j0766j0678j0232r587
49991G85542q585p229n709m028k024J41K145M258P211J1109J4974J7778J9461
49978H35044K0477K0842K0246J8969J8010J8199J9451K1060K2474K3675K4825
49967A063272K5597K4987K1985J6456R204J151p183j5366k2592k7880l0633l0973
49955A028025k9751k8305k7757k8196k8771k8763k8233k7453k6220k4248k1849
49944G28479j9598j7509j5219j2927j1450j1101j1115j0538r320q144p386o754
49932E87418n881m868m009l238k162o18J075K583L996N534P036Q196R139J0245
$$ plain form
50019 801644 799992 799046 800270 805025 813201 823185 833203 842274 849898 855554 859055 860968 862044 862413
50005 862413 861880 860814 860044 859749 859021 856686 852186 845523 836904 826805 816039 805361 795129 785542
49991 785542 776957 769728 764019 759991 757967 758108 760253 764511 771722 782831 797805 815583 835044
49978 835044 855521 876363 896609 915578 933588 951787 971238 992298 1014772 1038447 1063272
49967 1063272 1088869 1113856 1135841 1152297 1161501 1162652 1155469 1140103 1117511 1089631 1058998 1028025
49955 1028025 998274 969969 942212 914016 885245 856482 828249 800796 774576 750328 728479
49944 728479 708881 691372 676153 663226 651776 640675 629560 619022 609702 601558 594172 587418
49932 587418 581537 576669 572660 569422 567260 566642 567717 570300 574296 579830 586866 595062 604201 614446
49918F14446J1404J2007J1890J1662J1808J1956J1386R840P476M512J506n41j054
49905G18298p06q28k117m346p020r705j1944j3476j4469j5031j4794j3530j1834
49892E98498j0395q901o690m292l114l438l958l694l228l407l823l467k177n75
49878E37339R02K092K673K534K373L125M851O820Q545J0101J1433J2093J1727
49865F16608J0437Q517O199L779J679K71k63j08n7j234m031p405r747j0423j0082
49850F04140r546q923p943o573n100l864l094k785k518j726k72J386K686L455
49836E59323L851M113M525N363O579P715Q251Q013P159N978M813L956L401K840
49822F35880K130J567J349R37n72l294o193q090q794q881q744q282p439o469n562
$$ plain form
49918 614446 625850 637857 649747 661409 673217 685173 696559 706399 713875 718387 719893 719352 718298
49905 718298 717592 716764 714647 710301 703281 693576 681632 668156 653687 638656 623862 610332 598498
49892 598498 588103 579202 572512 568220 565106 561668 557710 554016 550788 547381 543558 540091 537914 537339
49878 537339 538241 540333 543006 545540 547913 551038 555889 562709 571254 581355 592788 604881 616608
49865 616608 627045 635562 641761 645540 647219 647490 647227 647119 647062 645828 641797 634392 624645 614222 604140
49850 604140 594594 585671 577728 571155 566055 562191 559097 556312 553794 552068 551796 553182 555868 559323
49836 559323 563174 567287 571812 577175 583754 591469 599720 607733 614892 620870 625683 629639 633040 635880
49822 635880 638010 639577 640926 641863 641291 637997 631804 623714 614920 606039 597295 589013 581574 575105 569543
49807E69543m642l728l113k898k686k125j438j076r65o17R5P05P82M94M58J242
49791E50031K991N232P100Q028Q239Q361Q665Q991R205R289Q986P940O276M553
49777F53887L091J793O67j11q06k130m267o505q250r782j1498j2924j3263j2525
49763E77377j1357j0039q422o784n838n713n700n249m642m301m010l249k059j017
49749D98997m77j68L89J293K110K247J540N98L63J206K510L388L759M384N775
49734E27914P406Q280Q057P167N934M248K291R56Q80J477J503N24q58k116l404
49719E70259m922o377p424q041q212p703o551n314m429l697k769j810j192q99
$$ plain form
49807 569543 564901 561173 558060 555162 552476 550351 548913 547837 546872 546255 546350 547055 547837 548331 548789 550031
49791 550031 553022 558254 565354 573382 581621 589982 598647 607638 616843 626132 635118 643058 649334 653887
49777 653887 656978 658771 659438 659327 658521 656391 652124 645619 637369 627587 616089 603165 589902 577377
49763 577377 566020 555981 547559 540775 534937 529224 523524 518275 513633 509332 505322 502073 500014 498997
49749 498997 498520 498352 498741 500034 502144 504391 505931 506529 506892 508098 510608 513996 517755 522139 527914
49734 527914 535320 543600 551657 558824 564758 569006 571297 572253 573133 574610 576113 576637 575779 573663 570259
49719 570259 565337 558960 551536 543495 535283 527580 521029 515715 511286 507589 504820 503010 501818 500919
$$ [...]
##END NTUPLES=NMR SPECTRUM
##END=
