##TITLE=AC1670_HONAH14361_8570817_kuR3e2hGd2
##JCAMPDX= 6.0         $$ Bruker NMR JCAMP-DX V2.0
##DATA TYPE= NMR SPECTRUM
##DATA CLASS= NTUPLES
##ORIGIN= BRUKER
##OWNER= Administrator
$$ 1.72 TOPSPIN		Version 2.1
$$ 2014-04-11 20:48:04.083 -0700  Administrator@X
$$ Compression mode = diff/dup
##.OBSERVE FREQUENCY= 400.02188249412
##.OBSERVE NUCLEUS= ^1H
##.ACQUISITION MODE= SIMULTANEOUS (DQD)
##.ACQUISITION SCHEME= undefined
##.AVERAGES= 64
##.DIGITISER RES= 22
##SPECTROMETER/DATA SYSTEM= spect
##.PULSE SEQUENCE= noesygpps1d.comp
##.SOLVENT NAME= COFFEE_meoh
##.SHIFT REFERENCE= INTERNAL, COFFEE_meoh, 1, 14.96094
##AUDIT TRAIL= $$ (NUMBER, WHEN, WHO, WHERE, PROCESS, VERSION, WHAT)
$$ ##TITLE= Audit trail, TOPSPIN		Version 2.1
$$ ##JCAMPDX= 5.01
$$ ##ORIGIN= Bruker BioSpin GmbH
$$ ##OWNER= Administrator
$$ $$ E:\/data/COFFEE/nmr/AC1670_HONAH14361_8570817_kuR3e2hGd2/12/pdata/1/auditp.txt
$$ ##AUDIT TRAIL=  $$ (NUMBER, WHEN, WHO, WHERE, PROCESS, VERSION, WHAT)
(   1,<2014-04-11 20:47:58.848 -0700>,<Administrator>,<X>,<go>,<TOPSPIN 2.1>,
      <created by zg
	started at 2014-04-11 20:36:29.299 -0700,
	POWCHK enabled, PULCHK disabled,
       configuration hash MD5:
       C8 4E 4E 5D D3 5C D8 9E 9F 52 82 E0 59 8A DE 15
       data hash MD5: 64K
       9C 07 48 7C 36 07 7C 16 06 0D 36 9B 86 D5 FC E4>)
(   2,<2014-04-11 20:48:01.895 -0700>,<Administrator>,<X>,<proc1d>,<TOPSPIN 2.1>,
      <Start of raw data processing
       efp LB = 0.3 FT_mod = 6 PKNL = 1 PHC0 = 0 PHC1 = 0 SI = 128K 
       data hash MD5: 128K
       F3 66 53 1F 5B 72 95 83 4E E9 4C 29 F0 57 8C 0A>)
(   3,<2014-04-11 20:48:02.911 -0700>,<Administrator>,<X>,<proc1d>,<TOPSPIN 2.1>,
      <pk PHC0 = -84.41895 PHC1 = 0 
       data hash MD5: 128K
       1B E0 E6 FA D5 07 59 EC 03 96 CD 5B B2 6E 0D 53>)
(   4,<2014-04-11 20:48:03.427 -0700>,<Administrator>,<X>,<proc1d>,<TOPSPIN 2.1>,
      <abs ABSG = 1 
       data hash MD5: 128K
       10 55 89 5D 4E C3 8C DD E8 18 75 36 98 3D 78 BC>)
(   5,<2014-04-11 20:48:03.552 -0700>,<Administrator>,<X>,<proc1d>,<TOPSPIN 2.1>,
      <abs ABSG = 2 
       data hash MD5: 128K
       C3 ED B4 F5 59 46 1F 41 33 42 D7 AB 75 3F F8 93>)
(   6,<2014-04-11 20:48:03.661 -0700>,<Administrator>,<X>,<proc1d>,<TOPSPIN 2.1>,
      <abs ABSG = 3 
       data hash MD5: 128K
       E3 AE 83 8E 29 3C DA FD AA DE 1A 72 20 90 10 31>)
(   7,<2014-04-11 20:48:03.755 -0700>,<Administrator>,<X>,<proc1d>,<TOPSPIN 2.1>,
      <abs ABSG = 4 
       data hash MD5: 128K
       2F 30 D2 61 24 5B 78 8B 08 32 BB FA 60 7E D2 1E>)
(   8,<2014-04-11 20:48:03.848 -0700>,<Administrator>,<X>,<proc1d>,<TOPSPIN 2.1>,
      <abs ABSG = 5 
       data hash MD5: 128K
       E3 FE 33 AD F4 81 5E B8 7E 72 69 C8 34 D9 5C 11>)
$$ ##END=
$$ 
$$ $$ hash MD5
$$ $$ 86 4E 34 62 11 FB 00 84 D7 7E 0E 86 CA A2 36 A5
##$RELAX= 
##$RELAX= 
##$RELAX= 
##$RELAX= 
##$RELAX= 
##$RELAX= 
##$RELAX= 
##$RELAX= 
$$ Bruker specific parameters
$$ --------------------------
##$DU= <E:\>
##$EXPNO= 12
$$ [...]
##$TP07= 0
##$TPNAME0= <>
##$TPNAME1= <>
##$TPNAME2= <>
##$TPNAME3= <>
##$TPNAME4= <>
##$TPNAME5= <>
##$TPNAME6= <>
##$TPNAME7= <>
##$TPOAL= (0..7)
0.5 0.5 0.5 0.5 0.5 0.5 0.5 0.5
##$TPOFFS= (0..7)
0 0 0 0 0 0 0 0
##$TUNHIN= 0
##$TUNHOUT= 0
##$TUNXOUT= 0
##$USERA1= <user>
##$USERA2= <user>
##$USERA3= <user>
##$USERA4= <user>
##$USERA5= <user>
##$V9= 5
##$VALIST= <valist>
##$VCLIST= <CCCCCCCCCCCCCCC>
##$VD= 0
##$VDLIST= <DDDDDDDDDDDDDDD>
##$VPLIST= <PPPPPPPPPPPPPPP>
##$VTLIST= <TTTTTTTTTTTTTTT>
##$WBST= 1024
##$WBSW= 4
##$XGAIN= (0..3)
0 0 0 0
##$XL= 0
##$YL= 0
##$YMAX_a= 6452779
##$YMIN_a= -13082044
##$ZGOPTNS= <>
##$ZL1= 120
##$ZL2= 120
##$ZL3= 120
##$ZL4= 120
##$ABSF1= 14.96094
##$ABSF2= -5.597241
##$ABSG= 5
##$ABSL= 3
##$ALPHA= 0
##$AQORDER= 0
##$ASSFAC= 0
##$ASSFACI= 0
##$ASSFACX= 0
##$ASSWID= 0
##$AUNMP= <proc_prof1d_extract.lims>
##$AXLEFT= 0
##$AXNAME= <>
##$AXNUC= <1H>
##$AXRIGHT= 0
##$AXTYPE= 0
##$AXUNIT= <>
##$AZFE= 0.1
##$AZFW= 0.1
##$BCFW= 0
##$BC_mod= 0
##$BYTORDP= 0
##$COROFFS= 0
##$CY= 15
##$DATMOD= 1
##$DC= 0
##$DFILT= <>
##$DTYPP= 0
##$F1P= 0
##$F2P= 0
##$FCOR= 0.5
##$FTSIZE= 131072
##$FT_mod= 6
##$GAMMA= 0
##$GB= 0
##$INTBC= 1
##$INTSCL= 1
##$ISEN= 128
##$LB= 0.3
##$LEV0= 0
##$LPBIN= 0
##$MAXI= 10000
##$MC2= 0
##$MEAN= 0
##$ME_mod= 0
##$MI= 0
##$NCOEF= 0
##$NC_proc= -2
##$NLEV= 6
##$NOISF1= 0
##$NOISF2= 0
##$NSP= 0
##$NTH_PI= 0
##$NZP= 0
##$OFFSET= 14.96094
##$PC= 1
##$PHC0= -84.41895
##$PHC1= 0
##$PH_mod= 1
##$PKNL= yes
##$PPARMOD= 0
##$PPDIAG= 0
##$PPIPTYP= 0
##$PPMPNUM= 2147483647
##$PPRESOL= 1
##$PSCAL= 4
##$PSIGN= 0
##$PYNMP= <proc.py>
##$REVERSE= no
##$SF= 400.020009662713
##$SI= 131072
##$SIGF1= 0
##$SIGF2= 0
##$SINO= 400
##$SIOLD= 131072
##$SPECTYP= <>
##$SREGLST= <1H.CDCl3>
##$SSB= 0
##$STSI= 131072
##$STSR= 0
##$SW_p= 8223.68421052631
##$SYMM= 0
##$S_DEV= 0
##$TDeff= 65536
##$TDoff= 0
##$TI= <>
##$TILT= no
##$TM1= 0
##$TM2= 0
##$TOPLEV= 0
##$USERP1= <user>
##$USERP2= <user>
##$USERP3= <user>
##$USERP4= <user>
##$USERP5= <user>
##$WDW= 1
##$XDIM= 131072
##$YMAX_p= 384184071
##$YMIN_p= -13440
##$CURPLOT= <Network HP LaserJet P1505>
##$CURPRIN= <$Network HP LaserJet P1505>
##$DFORMAT= <normdp>
##$LAYOUT= <+/1D_H.xwp>
##$LFORMAT= <normlp>
##$PFORMAT= <normpl>
##$SURQMSG= 1
$$ End of Bruker specific parameters
$$ ---------------------------------
##NTUPLES= NMR SPECTRUM
##VAR_NAME=  FREQUENCY,     SPECTRUM/REAL,   SPECTRUM/IMAG
##SYMBOL=    X,             R,               I
##VAR_TYPE=  INDEPENDENT,   DEPENDENT,       DEPENDENT
##VAR_FORM=  AFFN,          ASDF,            ASDF
##VAR_DIM=   131072,        131072,          131072
##UNITS=     HZ,            ARBITRARY UNITS, ARBITRARY UNITS
##FACTOR=    0.0627417313425164, 1,          1
##FIRST=     8223.62146879497, 3793,         -61117
##LAST=      0,             6102,            -60568
##MIN=       0,             -13440,          0
##MAX=       8223.62146879497, 384184071,    0
$$ Real data points
##PAGE= N=1
##DATA TABLE= (X++(R..R)), XYDATA
$$ [...]
63857A134248M8620M8647M8112M6703M4752M2266L8698L3846K8201K2171J5601
$$ 1134248 1182868 1231515 1279627 1326330 1371082 1413348 1452046 1485892 1514093 1536264 1551865
63846A551865Q358R37n987j2314j8478k4749l0839l6107m0139m3122m5647m7993
$$ 1551865 1560223 1561160 1555173 1542859 1524381 1499632 1468793 1432686 1392547 1349425 1303778 1255785
63834A255785m9765n0489n0305m9665m8518m6488m3909m1857m0853m0141l8794
$$ 1255785 1206020 1155531 1105226 1055561 1007043 960555 916646 874789 833936 793795 755001
63823G55001l6977l5437l4190l2530l0260k8013k6174k4195k1500j8523j6188
$$ 755001 718024 682587 648397 615867 585607 557594 531420 507225 485725 467202 451014
63812D51014j4663j3262j1612j0160r290q555p345n995n433n875o528o736o685
$$ 451014 436351 423089 411477 401317 392027 383472 376127 370132 364699 358824 352296 345560 338875
63799C38875o667o318n253l960l350l585m005m098l935l683l334k974k772k646
$$ 338875 332208 325890 320637 316677 313327 309742 305737 301639 297704 294021 290687 287713 284941 282295
63785B82295k421k300k586k961k708j811j069r05p93k63K44J26m37q93j160j407
$$ 282295 279874 277574 274988 272027 269319 267508 266439 265534 264741 264478 264722 264848 264411 263518 262358 260951
63769B60951j362o85J79K95n75j677k177j887j099k58J96P8k60k53J49M42K74
$$ 260951 259589 258904 259083 259378 258803 257126 254949 253062 251963 251705 251901 251979 251719 251466 251615 252057 252331
63752B52331j52m16l67j40O0Q5q2k24n7M88J229J932K447K753K946L164L310L086
$$ 252331 252179 251763 251396 251256 251316 251401 251319 251095 251038 251526 252755 254687 257134 259887 262833 265997 269307 272393
63734B72393K473J964K056K596L003K993K755K547K509K815L564M434M921N026
$$ 272393 274866 276830 278886 281482 284485 287478 290233 292780 295289 298104 301668 306102 311023 316049
63720C16049N293N953O421N968M613L027J696O01l64j092j555k061k902l823m226
$$ 316049 321342 327295 333716 339684 344297 347324 349020 349621 349257 348165 346610 344549 341647 337824 333598
63705C33598l918l403l156l014k533j729r86l53N00J559K278K364K210K241K310
$$ 333598 329680 326277 323121 320107 317574 315845 314859 314506 315006 316565 318843 321207 323417 325658 327968
63690C27968K172K082K395K852K858K259J357L69n50r40m17N75J069Q01N64J088
$$ 327968 330140 332222 334617 337469 340327 342586 343943 344312 343762 342822 342405 342980 344049 344850 345414 346502
63674C46502K109K852L001K818K657K711L054L559L835L519K633J506M13n29j294
$$ 346502 348611 351463 354464 357282 359939 362650 365704 369263 373098 376617 379250 380756 381169 380640 379346
63659C79346j922k571l381m296n148n888o539o854o308m706k708j360j021j075
$$ 379346 377424 374853 371472 367176 362028 356140 349601 342747 336439 331733 329025 327665 326644 325569
63645C25569q45l96j06J35O98J435J846J989K479L425M170M311M316M642M993
$$ 325569 324724 324328 324222 324357 325055 326490 328336 330325 332804 336229 340399 344710 349026 353668 358661
63630C58661M957M814N045N508N787N948O336O928P554Q419R748J1188J2290J3279
$$ 358661 363618 368432 373477 378985 384772 390720 397056 403984 411538 419957 429705 440893 453183 466462
63616D66462J4588J5970J6961J7956J9818K2467K4867K6503K7856K9187K9796
$$ 466462 481050 497020 513981 531937 551755 574222 599089 625592 653448 682635 712431
63605G12431K8957K6829K3985K0591J6581J2111P481K934j154m247o088o928p202
$$ 712431 741388 768217 792202 812793 829374 841485 848966 851900 850746 846499 840411 833483 826281
63592H26281p280p585q511j0122j2161j4357j6384j7792j8503j9219k0590k2092
$$ 826281 819001 811416 802905 792783 780622 766265 749881 732089 713586 694367 673777 651685
63580F51685k2475k1303j9265j7040j4777j2725j1201r705p163l586m91R47J242
$$ 651685 629210 607907 588642 571602 556825 544100 532899 523194 516031 512445 511954 512901 514143
63567E14143J517K063K676L546M775N695N680N231N449O615Q150R607J1046J2598
$$ 514143 515660 517723 520399 523945 528720 534415 540095 545326 550775 557390 565540 575147 586193 598791
63553E98791J4352J6553J9428K2963K7090L1692L6148L9427M1076M1456M0562
$$ 598791 613143 629696 649124 672087 699177 730869 767017 806444 847520 888976 929538
63542I29538L7448L1514K3588J4896N835l176j0480j4364j5161j4687j3780j1871
$$ 929538 966986 998500 1022088 1036984 1042819 1039643 1029163 1014799 999638 984951 971171 959300
63530I59300r014o843o834q827j1798j5281j9276k3489k7301l0260l2173l2977
$$ 959300 950286 943443 936609 927782 915984 900703 881427 857938 830637 800377 768204 735227
63518G35227l2737l1571k9580k7076k4701k2793k0870j8380j5815j4209j3614
$$ 735227 702490 670919 641339 614263 589562 566769 545899 527519 511704 497495 483881
63507D83881j2959j1570r950q806q192p899p870p767p006n641m533m123l809l065
$$ 483881 470922 459352 449402 440596 432404 424505 416635 408868 401862 396221 391688 387565 383756 380691
63493C80691k415k513k969k929k338j737j174k58Q95J754K413L569N303O649O772
$$ 380691 378276 375763 372794 369865 367527 365790 364616 364358 365253 367007 369420 372989 378292 384941 391713
63478C91713N965N145M861N082N520N689M963L170R63p10j565k068k676l292l621
$$ 391713 397678 402823 407684 412766 418286 423975 428938 432108 433071 432361 430796 428728 426052 422760 419139
63463D19139l669l691l759l651l135k255j334p31n65o01n10k32L2K72Q49K023
$$ 419139 415470 411779 408020 404369 401234 398979 397645 396914 396349 395748 395238 395006 395038 395310 396159 398182
63447C98182L553N054O506P991R174R658R916J1079J3657J7022K0483K4179K8353
$$ 398182 401735 406789 413295 421286 430460 440118 450034 461113 474770 491792 512275 536454 564807
63434E64807L2358L5106L6200L5908L4166L0388K4416J7139R985M099rk266k642
$$ 564807 597165 632271 668471 704379 738545 768933 793349 810488 820473 824572 824563 822297 819655
63421H19655r14K960Q141J3200J7438K1502K5960K9764L0991K8990K4855J9796
$$ 819655 818741 821701 829842 843042 860480 881982 907942 937706 968697 997687 1022542 1042338
63409A042338J4089P932K341j627m100o151q484j0800j2371j2915j2918j3286
$$ 1042338 1056427 1064359 1066700 1065073 1060973 1054822 1046338 1035538 1023167 1010252 997334 984048
63397I84048j4723j7315k0672k4295k7697l0390l2083l2876l2951l2170l0354
$$ 984048 969325 952010 931338 907043 879346 848956 816873 783997 751046 718876 688522
63386F88522k7857k5470k3641k2094k0267j7839j4882j1781r019o793m853k946
$$ 688522 660665 635195 611554 589460 569193 551354 536472 524691 515672 508879 504026 501080
63374E01080j181L13J841L818O143Q356J0247J1829J3030J4029J5559J8142K1181
$$ 501080 499899 500212 502053 505871 512014 520370 530617 542446 555476 569505 585064 603206 624387
63361F24387K3668K5603K7803L0375L2532L3994L5399L6885L7383L5895L2654
$$ 624387 648055 673658 701461 731836 764368 798362 833761 870646 908029 943924 976578
63350I76578K8382K3278J7381J1233N450J68m486p917r766j0559j1103j1601j2021
$$ 976578 1004960 1028238 1045619 1056852 1062302 1062470 1057984 1050067 1040301 1029742 1018639 1007038 995017
63337I95017j2777j4443j7044k0128k3218k5808k7556k8800l0247l1587l1234
$$ 995017 982240 967797 950753 930625 907407 881599 854043 825243 794996 763409 732175
63326G32175k8243k3698j9312j5325j0964o389k813q93k78p54k663o078j0487
$$ 732175 703932 680234 660922 645597 634633 628244 625431 624538 624260 623506 620843 614765 604278
63313F04278j5358k0074k3374k4117k2736k0881j9298j7235j4300j1631j0332
$$ 604278 588920 568846 545472 521355 498619 477738 458440 441205 426905 415274 404942
63302D04942r781q624o769n258m468l638k339j403j860l410m540m104k519j203
$$ 404942 395161 386537 379768 374510 370042 366404 364065 362662 360802 357392 352852 348748 346229 345026
63288C45026j023j558j875j677j334j079p59l34m8K1J42M43O15L23l99j249j892
$$ 345026 344003 342445 340570 338893 337559 336480 335721 335387 335339 335360 335502 335945 336560 336883 336484 335235 333343
63271C33343j951j175J29J138J282Q18M91P60J467K065K079J602J372K044L331
$$ 333343 331392 330217 330346 331484 332766 333584 334075 334835 336302 338367 340446 342048 343420 345464 348795
63256C48795M253M292L891L635L549L527L821M605N414N706N716O131P039P847
$$ 348795 353048 357340 361231 364866 368415 371942 375763 380368 385782 391488 397204 403335 410374 418221
63242D18221Q192Q293Q401Q565R106J0571J2776J4558J5078J4977J5515J6819
$$ 418221 426413 434706 443107 451672 460778 471349 484125 498683 513761 528738 544253 561072
63230E61072J7798J7800J7529J7970J9058J9938K0098J9709J9181J8980J9632
$$ 561072 578870 596670 614199 632169 651227 671165 691263 710972 730153 749133 768765
63219G68765K1184K2708K3074K2349K1797K2170K2655K1926J9690J6628J3272
$$ 768765 789949 812657 835731 858080 879877 902047 924702 946628 966318 982946 996218
63208I96218R569N387P37m444j0117j5699k0319k3620k5862k7196k7400k6442
$$ 996218 1005787 1011174 1011911 1007467 997350 981651 961332 937712 911850 884654 857254 830812
63196H30812k4793k2881k0562j7531j3920j0220o765l573m71K825O573J0617J4351
$$ 830812 806019 783138 762576 745045 731125 720905 714140 710567 710096 712921 719494 730111 744462
63183G44462J7326J9790K2252K4634K6328K7149K7722K8636K9549K9612K8672
$$ 744462 761788 781578 803830 828464 854792 881941 909663 938299 967848 997460 1026132
63172A026132K7526K6830K6287K5304K3980K2849K1657J9252J4957R516M123j109
$$ 1026132 1053658 1080488 1106775 1132079 1156059 1178908 1200565 1219817 1234774 1244290 1248413 1247304
63160A247304p052j4038k1154k7243l2138l6468m0470m3470m4647m4060m2632
$$ 1247304 1240252 1226214 1205060 1177817 1145679 1109211 1068741 1025271 980624 936564 893932
63149H93932m1150l9510l7179l4168l1149k8542k5984k2931j9489j6280j3716
$$ 893932 852782 813272 776093 741925 710776 682234 656250 633319 613830 597550 583834
63138E83834j1779j0319r172q068o754n303l992k969k256j973k154k420k228j411
$$ 583834 572055 561736 552564 544496 537742 532439 528447 525478 523222 521249 519095 516675 514447 513036
63124E13036k34J041K275L198L531L475L586M042M382M170L601L203L173L247
$$ 513036 512802 513843 516118 519316 522847 526322 529908 533950 538332 542502 546103 549306 552479 555726
63110E55726L030K360J439O78L10J45p4j71K85J336K498L293L582L383K795K172
$$ 555726 558756 561116 562555 563233 563543 563688 563614 563443 563728 565064 567562 570855 574437 577820 580615 582787
63094E82787J956K145K264K038J748J782K139K520K587K025Q27l99q12l20L19
$$ 582787 584743 586888 589152 591190 592938 594720 596859 599379 601966 603991 604818 604419 603607 603287 603606
63079F03606M84L72L84M70M99P66J575K648L522M247N098N963O552P064Q017R486
$$ 603606 604090 604462 604846 605316 605815 606581 608156 610804 614326 618573 623671 629634 636186 643250 651267 660753
63063F60753J1103J2663J4189J5566J6701J8033K0218K3220K6341K9151L1801
$$ 660753 671856 684519 698708 714274 730975 749008 769226 792446 818787 847938 879739
63052H79739L4334L6452L8201M0211M2796M5366M7164M8196M8951M9657N0254
$$ 879739 914073 950525 988726 1028937 1071733 1117099 1164263 1212459 1261410 1311067 1361321
63041A361321N0777N1216N1344N1178N1388N2524N4029N4682N4081N2857N1407
$$ 1361321 1412098 1463314 1514658 1565836 1617224 1669748 1723777 1778459 1832540 1885397 1936804
63030A936804M9101M5139L9513L2596K4320J4459L425p901j9045k9973m0283m9067
$$ 1936804 1985905 2031044 2070557 2103153 2127473 2141932 2145357 2137456 2118411 2088438 2048155 1999088
63018A999088n5781o0669o4019o5535o4867o2278n8326n3168m6724l9302l1509
$$ 1999088 1943307 1882638 1818619 1753084 1688217 1625939 1567613 1514445 1467721 1428419 1396910
63007A396910k3674j5809q041n70O695J3861K0475K5862L0171L4326L8719M2604
$$ 1396910 1373236 1357427 1349386 1348816 1355511 1369372 1389847 1415709 1445880 1480206 1518925 1561529
62995A561529M5187M6687M7816M8771M9389M9868N0557N1212N1135N0076M8288
$$ 1561529 1606716 1653403 1701219 1749990 1799379 1849247 1899804 1951016 2002151 2052227 2100515
62984B100515M5778M2044L6700K9746K1152J0723j330j4121k6630l8255m8751
$$ 2100515 2146293 2188337 2225037 2254783 2275935 2286658 2285328 2271207 2244577 2206322 2157571
62973B157571n8074o6371p3731p9628q3136q3967q2930q0975p8240p4450o9911
$$ 2157571 2099497 2033126 1959395 1879767 1796631 1712664 1629734 1548759 1470519 1396069 1326158
62962A326158o5376o1087n6605n1685m6746m2286l8306l4618l1388k9036k7690
$$ 1326158 1260782 1199695 1143090 1091405 1044659 1002373 964067 929449 898061 869025 841335
62951H41335k7007k6464k5632k4332k2615k0701j8806j7115j5814j4981j4356
$$ 841335 814328 787864 762232 737900 715285 694584 675778 658663 642849 627868 613512
62940F13512j3454j2090j0685r752r277q766p968p156o596o050n084l727k513
$$ 613512 600058 587968 577283 567531 558254 549488 541520 534364 527768 521718 516634 512907 510394
62927E10394j884j777j889k158k707l458l991l874l128k231j722j714j818j571
$$ 510394 508510 506733 504844 502686 499979 496521 492530 488656 485528 483297 481575 479861 478043 476472
62913D76472j037q54j517k611l124k551j482p37l79L9L47k43j794l017k543n42
$$ 476472 475435 474581 473064 470453 467329 464778 463296 462559 462180 462219 462566 462323 460529 457512 454969 454427
62897D54427J537K625K792K527K019J378Q99P03M98Q6k76k94j35j09j71r2J17
$$ 454427 455964 458589 461381 463908 465927 467305 468204 468907 469405 469491 469215 468921 468786 468677 468506 468414 468531
62880D68531L96R54J857K535K284J232K20l35q49j716k607k966k767k421k204
$$ 468531 468927 469881 471738 474273 476557 477789 478009 477674 476825 475109 472502 469536 466769 464348 462144
62865D62144k108k077k084k060j945j779j629j519j498j577j579j226n23J79O22
$$ 462144 460036 457959 455875 453815 451870 450091 448462 446943 445445 443868 442289 441063 440540 440719 441341
62850D41341Q85J147J428J710K013K221K061J459O57j43r27j456j170J15J655
$$ 441341 442226 443373 444801 446511 448524 450745 452806 454265 454922 454779 453852 452396 451226 451341 452996
62835D52996K420K142J368P02L79M81R76J505J609J331J248J753K539K955K671
$$ 452996 455416 457558 458926 459628 460007 460488 461464 462969 464578 465909 467157 468910 471449 474404 477075
62820D77075J943J337J287J753K317K644K822L064L274L222L001K951L141L388
$$ 477075 479018 480355 481642 483395 485712 488356 491178 494242 497516 500738 503739 506690 509831 513219
62806E13219L781M650N893O816P018P011P494Q319Q699Q347P903Q103R029J0316
$$ 513219 517000 521650 527543 534359 541377 548388 555882 564201 572900 581247 589150 597253 606282 616598
62792F16598J1741J3290J4903J6538J8515K1345K5069K9042L2636L6032L9969
$$ 616598 628339 641629 656532 673070 691585 712930 737999 767041 799677 835709 875678
62781H75678M4732M9766N4399N8639O2962O7561P2077P5920P8557P9580P8894
$$ 875678 920410 970176 1024575 1083214 1146176 1213737 1285814 1361734 1440291 1519871 1598765
62770A598765P6804P3547O8723O1558N1852M0277K7613J4143P5j3822k6614l8048
$$ 1598765 1675569 1749116 1817839 1879397 1931249 1971526 1999139 2013282 2013357 1999535 1972921 1934873
62758A934873m8535n8260o6695p3064p7014p8690p8491p6944p4532p1439o7489
$$ 1934873 1886338 1828078 1761383 1688319 1611305 1532615 1454124 1377180 1302648 1231209 1163720
62747A163720o2660n7517n2888m9098m5687m2007l7926l3883l0280k7045k3796
$$ 1163720 1101060 1043543 990655 941557 895870 853863 815937 782054 751774 724729 700933
62736G00933k0367j7111j4634j3163j2224j1008r122o946n155l994l100k013o73
$$ 700933 680566 663455 648821 635658 623434 612426 603304 596358 591203 587209 584109 582096 581423
62723E81423O56J716K470L077L820M943O395P851R117J0435J2172J4276J6356
$$ 581423 582079 583795 586265 589342 593162 598105 604500 612351 621468 631903 644075 658351 674707
62710F74707J8313K0537K3315K6435K9612L3073L7254M2065M6876N1303N5550
$$ 674707 693020 713557 736872 763307 792919 825992 863246 905311 952187 1003490 1059040
62699A059040N9964O4617O9640P5370Q1717Q7686R2104R4759R6178R6335R4272
$$ 1059040 1119004 1183621 1253261 1328631 1410348 1498034 1590138 1684897 1781075 1877410 1971682
62688A971682Q9266Q1612P1807N9557M4377K6896Q735q929k5937m2260n7327p0470
$$ 1971682 2060948 2142560 2214367 2273924 2318301 2345197 2353932 2345003 2319066 2276806 2219479 2149009
62676B149009q1423q9952r5554r8144r8582r7799r5707r1618q5770p9568p4119
$$ 2149009 2067586 1977634 1882080 1783936 1685354 1587555 1491848 1400230 1314460 1234892 1160773
62665A160773o9109o3533n7168n0790m5227m0641l6742l3277l0172k7406k4934
$$ 1160773 1091664 1028131 970963 920173 874946 834305 797563 764286 734114 706708 681774
62654F81774k2626k0273j7791j5502j3983j3426j3232j2582j1324j0025r092q296
$$ 681774 659148 638875 621084 605582 591599 578173 564941 552359 541035 531010 521918 513622
62642E13622p294o240n401m533l204j625n56k91l69m07o67j385k125k297k009
$$ 513622 506328 500088 494687 490154 486950 485325 484769 484478 484109 483702 483035 481650 479525 477228 475219
62627D75219j846k060k410k675k821k729k258j533q21j44N89J190J415J523K075
$$ 475219 473373 471313 468903 466228 463407 460678 458420 456887 456066 455922 456511 457701 459116 460639 462714
62612D62714L068L768L635L069K955L814N459P254Q558R165R509J0250J1637J3505
$$ 462714 465782 469550 473185 476254 479209 483023 488482 495736 504294 513459 522968 533218 544855 558360
62598E58360J5740J8340K1007K3288K5280K7695L0876L4224L6918L8715L9667
$$ 558360 574100 592440 613447 636735 662015 689710 720586 754810 791728 830443 870110
62587H70110L9484L7830L4911L1238K6929K1797J5894R526K766m378j1411j7539
$$ 870110 909594 947424 982335 1013573 1040502 1062299 1078193 1087719 1090485 1086107 1074696 1057157
62575A057157k2491k6704l0538l3765l5926l6767l6272l4782l3147l2187l1644
$$ 1057157 1034666 1007962 977424 943659 907733 870966 834694 799912 766765 734578 702934
62564G02934l0213k7112k3219k0129j8369j7049j5231j3004j1111r899q981p771
$$ 702934 672721 645609 622390 602261 583892 566843 551612 538608 527497 517598 508617 500846
62552E00846o151m585l626l332l263k987k449j826j232p31l22J70R93J964K408
$$ 500846 494695 490110 486484 483152 479889 476902 474453 472627 471395 470664 470342 470512 471505 473469 475877
62537D75877J950J158R13J335J808K031K421L363M565N494O036O507P264Q596
$$ 475877 477827 478985 479898 481233 483041 485072 487493 490856 495421 500915 506951 513458 520722 529318
62523E29318J0632J3114J5543J7784K0242K3206K6386K9418L2444L5746L9229
$$ 529318 539950 553064 568607 586391 606633 629839 656225 685643 718087 753833 793062
62512G93062M2733M6477N0496N3906N5608N5626N4941N3876N1478M6830M0171
$$ 793062 835795 882272 932768 986674 1042282 1097908 1152849 1206725 1258203 1305033 1345204
62501A345204L2352K3858J4857N715l138j1430j8700k4144k7359k8872k9367k8774
$$ 1345204 1377556 1401414 1416271 1421986 1418848 1407418 1388718 1364574 1337215 1308343 1278976 1250202
62489A250202k6750k3631k0060j5938j0737m847L81M191P120R747J1567J1696
$$ 1250202 1223452 1199821 1179761 1163823 1153086 1148239 1148620 1152811 1159931 1169678 1181245 1192941
62477A192941J0073P200L175k160q281j4037j8859k3274k7994l2940l7489m1282
$$ 1192941 1203014 1210214 1213389 1211229 1202948 1188911 1170052 1146778 1118784 1085844 1048355 1007073
62465A007073m4334m6514m7353m6499m4151m0954l7624l4611l1858k8829k5045
$$ 1007073 962739 916225 868872 822373 778222 737268 699644 665033 633175 604346 579301
62454E79301k0812j7158j4735j3001j0898q237n861m444l719l128k616k352k079
$$ 579301 558489 541331 526596 513595 502697 494460 488599 484155 480436 477308 474692 472340 470261
62441D70261j347j93Q95J565J799J705J559J757K197K006M90j714l190l459l415
$$ 470261 468914 468721 469616 471181 472980 474685 476244 478001 480198 482204 482694 480980 477790 474331 470916
62426D70916l911m705n068m850m396l988l767l863m159m196l730l085k726k692
$$ 470916 467005 462300 457232 452382 447986 443998 440231 436368 432209 428013 424283 421198 418472 415780
62412D15780k714k609k259j624j025j002j605k131j998j447r90n70K00J281K288
$$ 415780 413066 410457 408198 406574 405549 404547 402942 400811 398813 397366 396376 395806 396006 397287 399575
62397C99575L017L444L446L082K889L311M048M447M342L934L292K632K661L667
$$ 399575 402592 406036 409482 412564 415453 418764 422812 427259 431601 435535 438827 441459 444120 447787
62383D47787M646M426L552L718N221O416O205N616O057P202P826P864Q314R467
$$ 447787 452433 456859 460411 464129 469350 475766 481971 487587 493644 500846 508672 516536 524850 534317
62369E34317J0555J1064J1310J1762J2699J4538J7573K1262K4621K7533L0829
$$ 534317 544872 555936 567246 579008 591707 606245 623818 645080 669701 697234 728063
62358G28063L4940L9288M3292M7061N0580N3005N3509N2283N0004M6707M1914
$$ 728063 763003 802291 845583 892644 943224 996229 1049738 1102021 1152025 1198732 1240646
62347A240646L5585K8204K0149J1640L328l871r738j5007k0410k5883l0851l4882
$$ 1240646 1276231 1304435 1324584 1336224 1339552 1335681 1325943 1310936 1290526 1264643 1233792 1198910
62335A198910l7810l9583m0274m0102l9173l7453l5160l2885l1076k9576k7947
$$ 1198910 1161100 1121517 1081243 1041141 1001968 964515 929355 896470 865394 835818 807871
62324H07871k6102k4279k2631k1190k0156j9706j9516j8885j7578j6166j5279
$$ 807871 781769 757490 734859 713669 693513 673807 654291 635406 617828 601662 586383
62313E86383j4785j4063j2847j1457j0227r127q029p011o177n411m498l449k514
$$ 586383 571598 557535 544688 533231 523004 513877 505848 498837 492660 487249 482751 479302 476788
62300D76788j906j615j475j291r26l64L07R73J522J832J836J747K030K872L743
$$ 476788 474882 473267 471792 470501 469575 469211 469518 470491 472013 473845 475681 477428 479458 482330 486073
62285D86073L849L021J954J362J291J430J798K572L424L649L157K810L429M762
$$ 486073 489922 492943 494897 496259 497550 498980 500778 503350 506774 510423 513580 516390 519819 524581
62271E24581N795N943N591N570O533Q736J1956J5433J8294K0375K2435K5373K9331
$$ 524581 530376 536319 541910 547480 554013 562749 574705 590138 608432 628807 651242 676615 705946
62258G05946L3803L8384M3037M7687N1889N5042N6724N6744N5055N1720M6825
$$ 705946 739749 778133 821170 868857 920746 975788 1032512 1089256 1144311 1196031 1242856
62247A242856M0358L2394K3438J4350N676k718j1110j9243k6516l2699l8035m2653
$$ 1242856 1283214 1315608 1339046 1353396 1359072 1356354 1345244 1326001 1299485 1266786 1228751 1186098
62235A186098m6312m8852n0384n0895n0073m7863m4837m1626l8284l4638l0909
$$ 1186098 1139786 1090934 1040550 989655 939582 891719 846882 805256 766972 732334 701425
62224G01425k7444k4064k0379j6719j4019j2645j1922j1105j0181r458q882q271
$$ 701425 673981 649917 629538 612819 598800 586155 574233 563128 552947 543489 534607 526336
62212E26336p762p457o962n818m249k947k210j749j273p88l77n9J27K56O84J652
$$ 526336 518574 511117 504155 498337 494088 491141 488931 487182 485909 485121 484744 484685 484812 485068 485752 487404
62196D87404K799L601M232N391P173Q728R374R535J0013J0825J1274J1100J0846
$$ 487404 490203 493804 498036 503427 510600 519328 528702 538237 548250 559075 570349 581449 592295
62183E92295J0992J1172J0617R200P677O775O318N579M410L662M176N768P602
$$ 592295 603287 614459 625076 634276 641953 648728 655046 660625 665035 668697 672873 678641 686243
62170F86243R399J1732J5096J9256K3655K8011L2242L6165L9547M2190M3675M3309
$$ 686243 695642 707374 722470 741726 765381 793392 825634 861799 901346 943536 987211 1030520
62158A030520M0654L5921K9691K2551J5280Q883L875l61m923j0037j4788j8290
$$ 1030520 1071174 1107095 1136786 1159337 1174617 1183500 1187375 1187014 1182091 1172054 1157266 1138976
62146A138976k0667k2665k4565k5837k5861k4761k3354k2194k0807j8220j4290
$$ 1138976 1118309 1095644 1071079 1045242 1019381 994620 971266 949072 928265 910045 895755
62135H95755j0119o872m549k484p13o6p52j708j798j089m05PN90J505K337K913
$$ 895755 885636 878764 874215 871731 871018 870952 870200 868492 866694 865605 865200 865207 865797 867302 869639 872552
62119H72552L694N023O513P586Q210Q599Q531P584N943M330L056J678k56k594
$$ 872552 876246 881269 887782 895368 903578 912177 920708 928292 934235 938565 941621 943299 943043 940449
62105I40449m870o675p533o976n232l390k356j924j381o68k45j03L21J244K388
$$ 940449 935579 928904 921371 914395 909163 905773 903417 901493 900112 899444 899199 899096 899417 900661 903049
62090I03049L726N612P846R464R927R937J0522J1777J3103J4294J5735J7625J9674
$$ 903049 906775 912387 920233 929697 939624 949561 960083 971860 984963 999257 1014992 1032617 1052291
62077A052291K1573K3252K4603K5371K5524K5457K5595K5842K5557K4195K1942
$$ 1052291 1073864 1097116 1121719 1147090 1172614 1198071 1223666 1249508 1275065 1299260 1321202
62066A321202J9665J8132J7382J7047J7019J7349J7563J6758J4558J1540Q417
$$ 1321202 1340867 1358999 1376381 1393428 1410447 1427796 1445359 1462117 1476675 1488215 1496632
62055A496632N374K451l3k009m111o913j0039j2724j5032j7859k1735k6273l0806
$$ 1496632 1502006 1504457 1504424 1502415 1498304 1491391 1481352 1468628 1453596 1435737 1414002 1387729 1356923
62042A356923l4955l8543m1412m3554m4970m5432m4728m3152m1334l9547l7613
$$ 1356923 1321968 1283425 1242013 1198459 1153489 1108057 1063329 1020177 978843 939296 901683
62031I01683l5466l3273l0995k8320k5202k2007j9065j6528j4702j3882j3746
$$ 901683 866217 832944 801949 773629 748427 726420 707355 690827 676125 662243 648497
62020F48497j3494j2878j2425j2352j1946j0629q978p960p509o730n342m010l131
$$ 648497 635003 622125 609700 597348 585402 574773 565795 557835 550326 543596 538254 534244 531113
62007E31113k163n47J275K378K582K594L011L663M104M308M584M970N037M329
$$ 531113 528950 528403 529678 532056 534638 537232 540243 543906 548010 552318 556902 561872 566909 571238
61993E71238K755N97j666l492m568n159n924p213q684r759j0244j0251r843r089
$$ 571238 573993 574590 572924 569432 564864 559705 553781 546568 537884 528125 517881 507630 497787 488698
61979D88698q292p776p438o873n883m622l344k356j930j883j460k59R70J178O19
$$ 488698 480406 472630 465192 458319 452436 447814 444470 442114 440184 438301 436841 436582 437552 438730 439349
61964D39349O63J853L127L373K869K522K468K288K089K363L012L474L741M374
$$ 439349 440012 441865 444992 448365 451234 453756 456224 458512 460601 462964 465976 469450 473191 477565
61950D77565N453O338O738P239Q390R810J0755J1282J2246J4243J6845J9015K0081
$$ 477565 483018 489356 496094 503333 511723 521533 532288 543570 555816 570059 586904 605919 626000
61937F26000K0266K0309K0637K0990K0895K0248J9292J8134J6626J4719J2640
$$ 626000 646266 666575 687212 708202 729097 749345 768637 786771 803397 818116 830756
61926H30756J0626Q627O338L462l6l794p212r819j1441j1963j1259r531p405n219
$$ 830756 841382 850009 856347 859809 859773 855979 848767 838948 827507 815544 804285 794754 787349 782130
61912G82130k484J349N757R453J1894J3720J5448J6580J6459J5331J3797J1726
$$ 782130 779646 780995 786752 796205 808099 821819 837267 853847 870306 885637 899434 911160
61900I11160Q580M575O01k983o650j0613j4215j6780j8404j9439j9689j8839j7386
$$ 911160 919740 924315 924916 921933 915283 904670 890455 873675 855271 835832 816143 797304 779918
61887G79918j6385j6199j6027j4949j3144j1801j1846j2886j3542j2806j0983
$$ 779918 763533 747334 731307 716358 703214 691413 679567 666681 653139 640333 629350
61876F29350r148p926p082o271n530m831l696j841J81J569K313L063M060M944
$$ 629350 620202 612276 605194 598923 593393 588562 584866 583025 583206 584775 587088 590151 594211 599155
61862E99155N669O883Q995J1474J3514J5044J6542J8256K0102K2198K4898K8103
$$ 599155 604824 611707 620702 632176 645690 660734 677276 695532 715634 737832 762730 790833
61850G90833L1050L3014L4074L4884L5717L5968L4816L2286K9189K5910K1716
$$ 790833 821883 854897 888971 923855 959572 995540 1030356 1062642 1091831 1117741 1139457
61839A139457J5800Q775K314k685o781j0557j3366j4111j2776j0359p535m124
$$ 1139457 1155257 1164032 1166346 1163661 1156880 1146323 1132957 1118846 1106070 1095711 1088176 1084052
61827A084052J72N080R896J3864J6409J7371J7035J5579J2592P559Q40o308j2795
$$ 1084052 1084224 1089304 1099200 1113064 1129473 1146844 1163879 1179458 1192050 1199609 1200449 1194141 1181346
61814A181346j8484k3736k8603l2607l5253l6535l6898l6745l6025l4514l2435
$$ 1181346 1162862 1139126 1110523 1077916 1042663 1006128 969230 932485 896460 861946 829511
61803H29511l0416k8670k6690k4010k0896j7953j5422j3307j1774j0822r941q718
$$ 829511 799095 770425 743735 719725 698829 680876 665454 652147 640373 629551 619610 610892
61791F10892p491o752o201n228m074l587l841l996l642l266l189k941k161j328
$$ 610892 603401 596649 590448 585220 581146 577559 573718 569722 566080 562814 559625 556684 554523 553195
61777E53195j058j273j488j431j050m05N8k56j226j927j758j105n63r5N59J239
$$ 553195 552137 550864 549376 547945 546895 546490 546548 546292 545066 543139 541381 540276 539713 539618 540177 541416
61761E41416J680K037K503K843K742K296J728J063M46K76N82P37K87l90p42p66
$$ 541416 543096 545133 547636 550479 553221 555517 557245 558308 558754 559030 559612 560349 560636 560246 559504 558738
61745E58738o56l63q1m86j648k393j641J4J142J437J791K634L412L772M112M721
$$ 558738 558082 557719 557638 557152 555504 553111 551470 551484 552626 554063 555854 558488 561900 565672 569784 574505
61729E74505N195N093M500L743L108K924L365M078M516M636M636M243L016J353
$$ 574505 579700 584793 589293 593036 596144 599068 602433 606511 611027 615663 620299 624542 627558 628911
61715F28911K86J01M5m42j060j552k313l526m513m611m220m275n010n809o019
$$ 628911 629197 629298 629343 628901 627841 626289 623976 620450 615937 611326 607106 602831 597821 592012 585993
61700E85993n441m254k920k063k050k691l483l968l836l047k041j506j670k070
$$ 585993 580552 576298 573378 571315 569265 566574 563091 559123 555287 552240 550199 548693 547023 544953
61686E44953k169j899j468j035p47p82j016j021o12j74j84o69j310j759j757j265
$$ 544953 542784 540885 539417 538382 537635 536853 535837 534816 534204 534030 533846 533177 531867 530108 528351 527086
61670E27086o91n98j028j440j539j637k002k319k193j813j625j752k040k379k540
$$ 527086 526395 525797 524769 523329 521790 520153 518151 515832 513639 511826 510201 508449 506409 504030 501490
61655E01490k092r81R8M04L1l35l65k57j93j12P6M96J389K685L621L377K155J092
$$ 501490 499398 498417 498515 498919 498950 498615 498250 497993 497800 497688 497764 498260 499649 502334 505955 509332 511487 512579
61637E12579R42J230R39l12j986l296l952m219m415m437l923k880j836j234r88
$$ 512579 513521 514751 515690 515378 513392 510096 506144 501925 497510 493073 489150 486270 484434 483200 482212
61622D82212q47q51j046j083o05J03L83Q1l85q15j500k511l307l425l198l396
$$ 482212 481365 480514 479468 478385 477780 477883 478266 478347 477962 477147 475647 473136 469829 466404 463206 459810
61606D59810m291n384n984n887n427n022m749m377l790l255l133l430l804l937
$$ 459810 455519 450135 444151 438264 432837 427815 423066 418689 414899 411644 408511 405081 401277 397340
61592C97340l731l244k666k289k262k369k290k023j871k031k436k887l113k759
$$ 397340 393609 390365 387699 385410 383148 380779 378489 376466 374595 372564 370128 367241 364128 361369
61578C61369j767p39n00j158k005k407k435k395k244j820j348j177j214r97l73
$$ 361369 359602 358863 358363 357205 355200 352793 350358 347963 345719 343899 342551 341374 340160 339163 338790
61563C38790K65M67K19q6r5K02M35K37l49q27p84l29J27M02O67J057J420J497
$$ 338790 339055 339522 339741 339655 339560 339762 340197 340434 340085 339258 338474 338145 338272 338674 339341 340398 341818 343315
61545C43315J220P53L25J22K79Q63J802K773L281L060K400J941K028K431K727
$$ 343315 344535 345288 345613 345735 346014 346877 348679 351452 354733 357793 360193 362134 364162 366593 369320
61530C69320K688K157R23q84k506l209l146l108l404l535l114k511k255k216j957
$$ 369320 372008 374165 375088 374204 371698 368489 365343 362235 358831 355296 352182 349671 347416 345200 343243
61515C43243j483j113p61m9Q92J327Q48o1p13j043j407j812j831j245m37l3l17
$$ 343243 341760 340647 339886 339837 340729 342056 342904 342843 342130 341087 339680 337868 336037 334792 334355 334322 334005
61498C34005j011j487j235k77Q25J429J298O48j58p93r86o54r9J76Kk15KN30P02
$$ 334005 332994 331507 330272 329995 330820 332249 333547 334195 334037 333244 332258 331604 331505 331681 331683 331468 331470 332000 332702
61479C32702J54n97o31L30J605K341K358K047J672J198P30O52J081J495J315O61
$$ 332702 332856 332259 331628 331958 333563 335904 338262 340309 341981 343179 343909 344561 345642 347137 348452 349113
61463C49113K03K43K91k64j342k225k329j709q28r2L15L72K55L29Q01J381J527
$$ 349113 349316 349559 349850 349586 348244 346019 343690 341981 341153 341061 341376 341748 342003 342332 343133 344514 346041
61446C46041J111N84L74M15N36R09J775K865L578L694L506L280L026K782K685
$$ 346041 347152 347736 348110 348525 349061 349970 351745 354610 358188 361882 365388 368668 371694 374476 377161
61431C77161K662K442K011J652J494J415J413J618J887J880J691J784K160K250
$$ 377161 379823 382265 384276 385928 387422 388837 390250 391868 393755 395635 397326 399110 401270 403520
61417D03520J846J426J179O20l52q95n70l71j323k726l089k382j953k267k363
$$ 403520 405366 406792 407971 408591 408239 407344 406774 406403 405080 402354 399265 396883 394930 392663 390300
61402C90300j751j328j805k446k300j681j458j575j335p22l95n55o61l44J27L87
$$ 390300 388549 387221 385416 382970 380670 378989 377531 375956 374621 373899 373504 372949 372288 371944 372071 372458
61386C72458M57M81L99J14k78n38n31l06K3M86J284K440L470L667K824J501M36
$$ 372458 372915 373396 373795 373909 373631 373093 372562 372256 372279 372765 374049 376489 379959 383626 386450 387951 388387
61369C88387m6K0N47J444K490L396L950M023L648L066K563K229K125K545L704
$$ 388387 388341 388361 388908 390352 392842 396238 400188 404211 407859 410925 413488 415717 417842 420387 424091
61354D24091N170O118O332O491P230Q413R584J0644J1652J2357J2427J1949J1231
$$ 424091 429261 435379 441711 448202 455432 463845 473429 484073 495725 508082 520509 532458 543689
61341E43689J0269Q861P146N653M714M081L201J799J89j031j668k221l232m449
$$ 543689 553958 562819 569965 575618 580332 584413 587614 589413 589602 588571 586903 584682 581450 577001
61327E77001n109n037m924n287n678n316m121k729j681j009m40J84O89P37L73
$$ 577001 571892 566855 561931 556644 550966 545650 541529 538800 537119 536110 535670 535854 536543 537280 537653
61312E37653K05O67J309J574K079M041P265R895J0755J0788J1373J2235J2124
$$ 537653 537858 538525 539834 541408 543487 547528 554793 564688 575443 586231 597604 609839 621963
61299F21963J0787Q939O822M176J311j068l044n251p465q651q527p946p531p045
$$ 621963 632750 641689 648511 652687 653998 652930 649886 644635 637170 628519 619992 612046 604515 597470
61285E97470o368n953n857n371m193k994k267j498j00J576K898L912M932N734
$$ 597470 591102 585149 579292 573921 569728 566734 564467 562969 562869 564445 567343 571255 576187 581921
61271E81921O001O054O342O633O477O193O510P457Q387R019R665J0472J1199J1851
$$ 581921 587922 593976 600318 606951 613428 619621 626131 633588 641975 650994 660659 671131 682330 694181
61257F94181J2764J3857J4432J4051J3037J1764R989P387M318J507q58l111n298
$$ 694181 706945 720802 735234 749285 762322 774086 784075 791462 795780 797287 796429 793318 788020
61244G88020o993q058r007j0219j1244j1285j0184q469o608m784l333k677k657
$$ 788020 781027 772969 763962 753743 742499 731214 721030 712561 705953 701169 697836 695159 692502
61231F92502k540j994j476j322r82J91J828K943L245L308L600L963M139M086L746
$$ 692502 689962 687968 686492 685170 684188 684379 686207 689150 692395 695703 699303 703266 707405 711491 715237
61216G15237L038K232J769J630J426J209J543K550L478L631L198K816K735K807
$$ 715237 718275 720507 722276 723906 725332 726541 728084 730634 734112 737743 740941 743757 746492 749299
61202G49299L010L548M591O205Q365J0861J3377J5803J8226K0570K2636K4487
$$ 749299 752309 755857 760448 766653 775018 785879 799256 815059 833285 853855 876491 900978
61190I00978K6258K7390K6712K3737J9508J5672J3027J1273R786Q168O308M388
$$ 900978 927236 954626 981338 1005075 1024583 1040255 1053282 1064555 1074341 1082509 1088817 1093205
61178A093205K730J345j95k134m124n758p189q796j0503j1964j3246j4774j6644
$$ 1093205 1095935 1097280 1097085 1094951 1090827 1085069 1077880 1069084 1058581 1046617 1033371 1018597 1001953
61165A001953j8413j9609k0195k0483k0819k1289k1502k0856j9175j7000j5045
$$ 1001953 983540 963931 943736 923253 902434 881145 859643 838787 819612 802612 787567
61154G87567j3486j1896r736o848l793j657j115j486j289QJ461K025J674O98j135
$$ 787567 774081 762185 752449 745601 741808 740151 739036 737550 736261 736269 737730 739755 741429 742127 740992
61139G40992l732n860o391n945n948o311n449k707O07L065M831O901R520J2136
$$ 740992 737260 731400 725009 719064 713116 706805 701356 698649 699256 702321 707152 714053 723573 735709
61125G35709J4327J6120J7707J9296K1083K3079K5152K7326K9585L1471L2418
$$ 735709 750036 766156 783863 803159 824242 847321 872473 899799 929384 960855 993273
61114I93273L2579L2649L2772L2361L1203K9884K8782K7423K5306K2698K0012
$$ 993273 1025852 1058501 1091273 1123634 1154837 1184721 1213503 1240926 1266232 1288930 1308942
61103A308942J7175J4074J0942P722L678j657p679j3496j8855k3643k7295k9606
$$ 1308942 1326117 1340191 1351133 1358855 1362533 1360876 1353197 1339701 1320846 1297203 1269908 1240302
61091A240302l1456l3690l5783l6670l6406l5872l5219l3933l2145l0467k8651
$$ 1240302 1208846 1175156 1139373 1102703 1066297 1030425 995206 961273 929128 898661 870010
61080H70010k5908k2646k0357j9358j8186j5762j2832j0441q308n812l488k326
$$ 870010 844102 821456 801099 781741 763555 747793 734961 724520 716212 710400 706912 704586
61068G04586k210k209j938j530p64P06K387L341L494L696M435N348O086O916Q218
$$ 704586 702376 700167 698229 696699 695935 696641 699028 702369 705863 709559 713994 719342 725428 732344 740562
61053G40562R888J1548J3024J4482J6313J8779K1531K3683K4692K5047K5667K6852
$$ 740562 750450 761998 775022 789504 805817 824596 846127 869810 894502 919549 945216 972068
61041I72068K8203K9332L0149L0627L0883L1328L2169L2894L2799L2044L1553
$$ 972068 1000271 1029603 1059752 1090379 1121262 1152590 1184759 1217653 1250452 1282496 1314049
61030A314049L1840L2484L2815L2678L2440L2673L3802L5675L7461L8437L8842
$$ 1314049 1345889 1378373 1411188 1443866 1476306 1508979 1542781 1578456 1615917 1654354 1693196
61019A693196L9622M1471M4560M8910N4446O0856O8047P6581Q7002R8972J11930
$$ 1693196 1732818 1774289 1818849 1867759 1922205 1983061 2051108 2127689 2214691 2313663 2425593
61008B425593J26553J44688J68122J98473K38091K89584L54149M31713N23277
$$ 2425593 2552146 2696834 2864956 3063429 3301520 3591104 3945253 4376966 4900243
60999D900243O32545P66210R34873J151588J420828J720439J995169K176616K217297
$$ 4900243 5532788 6298998 7233871 8385459 9806287 11526726 13521895 15698511 17915808
60990A7915808K108513J869481J528662J123380P12735L73636J66460R6529J09300
$$ 17915808 20024321 21893802 23422464 24545844 25258579 25632215 25798675 25895204 26004504
60981B6004504J24611P7792o3965l08641o46980j049148j461375j816326k055460
$$ 26004504 26129115 26206907 26142942 25834301 25187321 24138173 22676798 20860472 18805012
60972A8805012k149454k105300j957946j752379j526463j303689j096401r11668
$$ 18805012 16655558 14550258 12592312 10839933 9313470 8009781 6913380 6001712
60964F001712p53241o20958n11911m22950l51466k94563k49130k12748j83613
$$ 6001712 5248471 4627513 4115602 3692652 3341186 3046623 2797493 2584745 2401132
60955B401132j59855j39912j23242j09595r7844q6687p6196o7451o0721n5239
$$ 2401132 2241277 2101365 1978123 1868528 1770684 1683997 1607801 1540350 1479629 1424390
60945A424390n0664m7482m5784m4842m4097m3564m3023m1824l9803l7487l5190
$$ 1424390 1373726 1326244 1280460 1235618 1191521 1147957 1104934 1063110 1023307 985820 950630
60934I50630l2801l0496k8653k6901k4407k1401j9211j8344j7700j6258j4419
$$ 950630 917829 887333 858680 831779 807372 785971 766760 748416 730716 714458 700039
60923G00039j2986j1895j0782r892r475r058q207p341o872o176m519k493j400
$$ 700039 687053 675158 664376 654484 645009 635951 627744 620403 613531 607355 602836 600343 598943
60910E98943j403j366n06P50J641K036K255K468K604K511K034J104k18j800l432
$$ 598943 597540 596174 595668 596418 598059 600095 602350 604818 607422 609933 611967 613071 612853 611053 607621
60895F07621m708n210n061m905n119n359n199m862m858n215n538n646n704n811
$$ 607621 602913 597703 592642 587737 582618 577259 572060 567198 562340 557125 551587 545941 540237 534426
60881E34426n852n750n545n262m928m573m073l176j901p67l35o90j405j896j654
$$ 534426 528574 522824 517279 512017 507089 502516 498443 495267 493366 492599 492264 491574 490169 488273 486619
60866D86619m57J350L045M157M804N245N416N194M874N042N986P357Q401Q503
$$ 486619 486162 487512 490557 494714 499518 504763 510179 515373 520247 525289 531275 538632 547033 555536
60852E55536P701O579N585M619L581K904L015L498L581L287L234L304K539O31
$$ 555536 563237 569816 575401 580020 583601 586505 589520 593018 596599 599886 603120 606424 608963 609594
60838F09594j497l027m185n342o125o182n991o118o295o080n784n850n861n171
$$ 609594 608097 605070 600885 595543 589418 583236 577245 571127 564832 558752 552968 547118 541257 536086
60824E36086m105l571l728l963m025m227m571m565m040l432l100k941k782k700
$$ 536086 531981 528410 524682 520719 516694 512467 507896 503331 499291 495859 492759 489818 487036 484336
60810D84336k807l020l081k632j502j56N83N87P65J841L281M022L850L352K901
$$ 484336 481529 478509 475428 472796 471294 471138 471721 472308 473073 474914 478195 482217 486067 489419 492320
60795D92320K481K302K730L676M661N433N965O141O009O055O543O917O656O343
$$ 492320 494801 497103 499833 503509 508170 513603 519568 525709 531718 537773 544316 551233 557889 564232
60781E64232O950Q269R159R219R150R391R486R082Q548Q160P580O646O022O495
$$ 564232 571182 579451 588610 597829 606979 616370 625856 634938 643486 651646 659226 665872 671894 678389
60767F78389Q001R757J1104J1909J2427J2884J3162J2927J2273J1899J2229J2738
$$ 678389 686390 696147 707251 719160 731587 744471 757633 770560 782833 794732 806961 819699
60755H19699J2785J2708J3299J4374J4908J4466J3601J2778J1949J1308J1278
$$ 819699 832484 845192 858491 872865 887773 902239 915840 928618 940567 951875 963153
60744I63153J1470J0686Q519N993M089K460L12k227m428o107p641r146j0418j1550
$$ 963153 974623 985309 993828 999821 1003910 1006370 1006682 1004455 1000027 993920 986279 977133 966715 955165
60730I55165j2967j4717j6175j6597j5966j5138j5051j5666j5999j5405j4438
$$ 955165 942198 927481 911306 894709 878743 863605 848554 832888 816889 801484 787046
60719G87046j3911j3550j2491j0799r528r228r419r644r988j0283r949r062q593
$$ 787046 773135 759585 747094 736295 726767 717539 708120 698476 688488 678205 668256 659194 650601
60706F50601q966r352r043q619q905r587r794r450r102q889q563q235q166q059
$$ 650601 641635 632283 623240 614621 605716 596129 586335 576885 567783 558894 550331 542096 533930 525871
60692E25871p431o488n934n943o012n779n349m824m100l195k298j458n90K31P27
$$ 525871 518440 511952 506018 500075 494063 488284 482935 478111 474011 470816 468518 467060 466470 466701 467428
60677D67428O95J29p48j390j220l15M91N33j1o04j098j478j351m80M99O45o2p52
$$ 467428 468123 468252 467504 466114 464894 464579 465070 465603 465592 464988 463890 462412 461061 460581 461080 461725 461663 460911
60659D60911r04q36q90p84j47Q86J961L038M207N193N430M739L629K856K686K790
$$ 460911 460007 459171 458281 457497 457350 458236 460197 463235 467442 472635 478065 482804 486433 489289 491975 494765
60643D94765K760K571K332J946J270M80r7m74q33r35l18Q39J630J537J037P33
$$ 494765 497525 500096 502428 504374 505644 506124 506027 505553 504720 503785 503467 504306 505936 507473 508510 509243
60627E09243M16m61j760k715k909k687k613k887l271l454l415l492l890m236l958
$$ 509243 509659 509198 507438 504723 501814 499127 496514 493627 490356 486902 483487 479995 476105 471869 467911
60612D67911l119k399k123j889j342p76n79o59q22j196j796k152j885j301q70
$$ 467911 464792 462393 460270 458381 457039 456263 455684 455025 454203 453007 451211 449059 447174 445873 445003
60597D45003n14L9O38J003J343J969K544K447J756J214J302J789K169K015J131
$$ 445003 444489 444528 445166 446169 447512 449481 452025 454472 456228 457442 458744 460533 462702 464717 465848
60582D65848j65j009p61J89Q40P54L28J10K97R15J915L105M364N877P787R757
$$ 465848 465683 464674 463913 464102 464942 465696 466024 466134 466431 467346 469261 472366 476730 482607 490394 500151
60566E00151J1312J2567J4004J5634J6816J7000J6248J4921J3178J0824P537L337
$$ 500151 511463 524030 538034 553668 570484 587484 603732 618653 631831 642655 650192 653529
60554F53529r62m159n808o707p768q788q849p674n867m010k205m26J362L430O053
$$ 653529 652567 648408 642600 635893 628125 619337 610488 602814 596947 592937 590732 590306 591668 595098 601151
60539F01151Q940J1435J3321J4910J6422J7690J8426J8295J6805J3796R927O103
$$ 601151 610091 621526 634847 649757 666179 683869 702295 720590 737395 751191 761118 767221
60527G67221K458j362n007p427q201q051p758p332o613n872n269m373k870j305
$$ 767221 769679 768317 763310 755883 747682 739631 731873 724541 717928 712056 706787 702414 699544 698239
60513F98239n44p15j137j075j71J510L399M663M941M848N351O782Q790J1164J4285
$$ 698239 697695 696980 695843 694768 694597 696107 699506 704169 709110 713958 719309 726091 734881 746045 760330
60498G60330J8658K4229L0398L6551M2407M7801N2394N5896N8420O0105O0222
$$ 760330 778988 803217 833615 870166 912573 960374 1012768 1068664 1127084 1187189 1247411
60487A247411N7201N0116L9795K7966J5489K141j2014k5849l7982m7743n5109
$$ 1247411 1304612 1354728 1394523 1422489 1437978 1440119 1428105 1402256 1364274 1316531 1261422
60476A261422o0169o2964o3532o1954n8600n4355n0066m5719m0714l5103k9963
$$ 1261422 1201253 1138289 1074757 1012803 954203 899848 849782 804063 763349 728246 698283
60465F98283k6184k3457k0882j8164j5689j3713j2072j0573r268q273p615p214
$$ 698283 672099 648642 627760 609596 593907 580194 568122 557549 548281 540008 532393 525179
60453E25179o883o382n590m620l681k937k512k419k430k224j708j107p07o81j034
$$ 525179 518296 511914 506324 501704 498023 495086 492574 490155 487725 485501 483793 482686 481979 481298 480264
60438D80264j508j639j270q86r75j217r39l15l36j354k449k702k340j993j467
$$ 480264 478756 477117 475847 474961 473986 472769 471830 471515 471179 469825 467376 464674 462334 460341 458874
60423D58874j91J446K238J706P22L50P10J349K090K893L214K347N36q70q57P7
$$ 458874 458683 460129 462367 464073 464795 465145 465855 467204 469294 472187 475401 477748 478284 477414 476557 476634
60407D76634O84O45P37J307J559Q32j75l34K96P09N66N31R60J323J204R55R70
$$ 476634 477318 477963 478700 480007 481566 482398 482223 481889 482185 482894 483460 483991 484951 486274 487478 488433 489403
60390D89403J049J033J284J993K597K546K123J898J806J466J005Q60J047J285
$$ 489403 490452 491485 492769 494762 497359 499905 502028 503926 505732 507198 508203 509063 510110 511395
60376E11395J614K105K292J725R48R79J783K205J661R59J010J535J713J467J332
$$ 511395 513009 515114 517406 519131 520079 521058 522841 525046 526707 527666 528676 530211 531924 533391 534723
60361E34723J397J250Q39O56Q82J040P29L13M91J408K514L233L518L775M382N318
$$ 534723 536120 537370 538209 538865 539747 540787 541516 541829 542320 543728 546242 549475 552993 556768 561150 566468
60345E66468O156O477O318O165O372O714O600N641L945J933K6j605l152m883o578
$$ 566468 572624 579101 585419 591584 597956 604670 611270 616911 620856 622789 622815 621210 618058 613175 606597
60330F06597p464p122o142n472n250m923m360m012l853l172j824p71p06r29m75
$$ 606597 599133 592011 585869 580397 575147 570224 565864 561852 557999 554827 553003 552232 551526 550597 550122
60315E50122L88P89Q38J405K599L732M679N970P505Q577R509J1790J5879K0092
$$ 550122 550510 551299 552137 553542 556141 559873 564552 570522 578027 586604 596113 607903 623782 643874
60301F43874K2624K3706K4646K5489K4885K1941J7037J0999M491j743o946j0939
$$ 643874 666498 690204 714850 740339 765224 787165 804202 815201 819692 817949 811003 800064
60289H00064j4023j6151j6826j5931j4171j2471j1344j0927j1188j1857j2498
$$ 800064 786041 769890 753064 737133 722962 710491 699147 688220 677032 665175 652677
60278F52677j2878j3058j3084j2816j2146j1140r896q457o986n769m937m410m143
$$ 652677 639799 626741 613657 600841 588695 577555 567659 559202 552216 546447 541510 537100 532957
60265E32957m188m379m209l298j919q19m63n91n44J2Q21J368J378R50L47j82m64
$$ 532957 528769 524390 520181 516883 514964 514145 513682 513091 512547 512559 513380 514748 516126 517076 517423 517241 516777
60248E16777m10j3O76J518K204K378K002J421R25M11k88r53j171q87l79J42O22
$$ 516777 516367 516354 517030 518548 520752 523130 525132 526553 527478 527889 527601 526648 525477 524590 524211 524353 524975
60231E24975R19R78J159J915L084L978M257M240M260M233M037L852L903M243M878
$$ 524975 525894 526872 528031 529946 533030 537008 541265 545505 549765 553998 558035 561887 565790 570033 574911
60216E74911N715O358O437O193O140O145N644M888M959O112P126P008O361O218
$$ 574911 580626 586984 593421 599614 605754 611899 617543 622431 627390 633502 640628 647636 653997 660215
60202F60215O295N604M248L334L253L204K444J062n48k053k968k969k589k772
$$ 660215 666510 672114 676362 679696 682949 686153 688597 689659 689111 687058 684090 681121 678532 675760
60188F75760l588m208m270m359m785m925m330l638l621l954l773l037k500k530
$$ 675760 672172 667964 663694 659335 654550 649625 645295 641657 638036 634082 630309 627272 624772 622242
60174F22242k741k695k379j851j068k06L04K88O0K6K83P05J145J401J287R12O98
$$ 622242 619501 616806 614427 612576 611508 611302 611606 611894 611954 611980 612263 612968 614113 615514 616801 617713 618411
60157F18411Q67J072Q05J06l93j70O24J411J856K099K477L064L572L689L519L577
$$ 618411 619278 620350 621155 621261 620868 620698 621322 622733 624589 626688 629165 632229 635801 639490 643009 646586
60141F46586M233N277O260P090P963Q689Q735Q048P284O758N804L878J842J152
$$ 646586 650819 656096 662356 669446 677409 686098 694833 702881 710165 716923 722727 726605 728447 729599
60127G29599J830K238J091j112l006l864l724k769j349k11P3k36l73J8P06J345
$$ 729599 731429 733667 734758 733646 730640 726776 723052 720283 718934 718723 718796 718560 718187 718205 718911 720256
60111G20256J704J535O89o56k113l351m179m502m441m281m142l950l852m223m996
$$ 720256 721960 723495 724184 723528 721415 718064 713885 709383 704942 700661 696519 692569 688717 684494 679498
60096F79498n395m739l221j606m51J14K86O26J674L181M135M080L770M034M553
$$ 679498 674103 669364 666143 664537 664086 664200 664486 665112 666786 669967 674102 678182 681952 685986 690539
60081F90539M580M234M129M144L581K351Q81r19l421o021p359p106o484o631p394
$$ 690539 695119 699353 703482 707626 711207 713558 714439 713520 710099 704078 696719 689613 683129 676498 669104
60066F69104q090q502q618q242p475o897o708o387n640m948m638m189l243k470
$$ 669104 661014 652512 643894 635652 628177 621280 614572 608185 602545 597597 592959 588770 585527 583057
60052E83057k482k566j702k68N04O20J425L465N543O445O479O565O653O060M863
$$ 583057 580575 578009 576307 576039 576543 577163 578588 582053 587596 594041 600520 607085 613738 619798 624661
60037F24661L923L619L392K639J440J66j105k490l949n318o531p561q316q780
$$ 624661 628584 632203 635595 638234 639674 639840 638735 636245 632296 626978 620447 612886 604570 595790
60023E95790r092r310r268q851q308p917p523o712n501m471m061l990l636k800
$$ 595790 586698 577388 568120 559269 550961 543044 535521 528809 523308 518837 514776 510786 507150 504350
60009E04350j898j401j214p48L85J822K785L022L132L710M561N134N471O054O741
$$ 504350 502452 501051 499837 499089 499474 501296 504081 507103 510235 513945 518506 523640 529111 535165 541906
59994E41906O752N898N136N365O212O570N989M924L859K793J592L52p02j451k005
$$ 541906 548658 554556 559692 565057 571269 577839 583828 588752 592611 595404 596996 597348 596646 595195 593190
59979E93190k664l658m802n579n738n508n202m899m658m523m191l289k191j826
$$ 593190 590526 586868 582066 576487 570749 565241 560039 555140 550482 545959 541768 538479 536288 534462
59965E34462k235k140o56J275K098J745J481J959K626K902K882K675K119J390
$$ 534462 532227 530087 529431 530706 532804 534549 536030 537989 540615 543517 546399 549074 551193 552583
59951E52583J092J412J873K099K245K427K418K091J574Q15m10j936l277m308n212
$$ 552583 553675 555087 556960 559059 561304 563731 566149 568240 569814 570629 570219 568283 565006 560698 555486
59936E55486n745n396m422l757l668l427k696k177k294k287j432l49o5l40n7J076
$$ 555486 549741 544345 539923 536166 532498 529071 526375 524198 521904 519617 518185 517836 517771 517431 517374 518450
59920E18450K217K640K447K004J470J042J043J553K292K998L568L908L934L780
$$ 518450 520667 523307 525754 527758 529228 530270 531313 532866 535158 538156 541724 545632 549566 553346
59906E53346L679L641L498L249L100L205L451L525L170K551K309K913L984M709
$$ 553346 557025 560666 564164 567413 570513 573718 577169 580694 583864 586415 588724 591637 595621 600330
59892F00330M964N405O229O615N866M490L435K827K247J825K074K858L455L659
$$ 600330 605294 610699 616928 623543 629409 633899 637334 640161 642408 644233 646307 649165 652620 656279
59878F56279L911M241M034L062K004J425R40r2j553k846l801m707n628o273o495
$$ 656279 660190 664431 668465 671527 673531 674956 675896 675804 674251 671405 667604 662897 657269 650996 644501
59863F44501o496o408o033n195m129l421l398l625l075j130J485L156L063K133
$$ 644501 638005 631597 625564 620369 616240 612819 609421 605796 602721 601591 603076 606232 609295 611428
59849F11428J930K861M120N207O591Q539J0153J0361R362Q296P597O628M935L050
$$ 611428 613358 616219 620339 625546 632137 640676 650829 661190 670552 678848 686445 693073 698008 701058
59835G01058J749J254J458K254L135L134J796j92j953l611n865q725j1415j3329
$$ 701058 702807 704061 705519 707773 710908 714042 715838 715646 713693 710082 704217 695492 684077 670748
59821F70748j4320j4261j3131j1594j0609j0288r780q479o780n427m714m518m549
$$ 670748 656428 642167 629036 617442 606833 596545 586765 578286 571506 566079 561365 556847 552298
59808E52298m305l279j590l8O97O15R8m76p86p44p78j398k333k742k423k079k128
$$ 552298 547993 544714 543124 543086 543783 544398 544496 544020 543234 542490 541712 540314 537981 535239 532816 530737 528609
59791E28609k007j223l52k54q27j258j212j078j223j685k360k986k983j978m67
$$ 528609 526602 525379 525027 524773 523946 522688 521476 520398 519175 517490 515130 512144 509161 507183 506716
59776E06716N33M95k00p80o55L22J766K884L070K439J615J086R86J286J918K641
$$ 506716 507249 507744 507544 506764 506109 506431 508197 511081 514151 516590 518205 519291 520277 521563 523481 526122
59760E26122L129L216L026K910L247M106N036N445N246M863M582M294M022M127
$$ 526122 529251 532467 535493 538403 541650 545756 550792 556237 561483 566346 570928 575222 579244 583371
59746E83371M674N022M528L395K417K015J905J581Q83J17k44r2J45O4p2K50Q20
$$ 583371 588045 593067 597595 600990 603407 605422 607327 608908 609791 609908 609664 609572 609717 609781 609709 609959 610779
59729F10779R24N71O86J646K471K114R04M1J52R58J872K271J673M21k86K56J286
$$ 610779 611703 612274 612960 614606 617077 619191 620095 620136 620288 621246 623118 625389 627062 627483 627197 627453 628739
59712F28739J676J459J405J631J786K143L212M387M442L405K662K781K663J455
$$ 628739 630415 631874 633279 634910 636696 638839 642051 646438 650880 654285 656947 659728 662391 663846
59698F63846P4q8Q77J776K036K051K103J913J217J23j163k392l130l100k671k488
$$ 663846 663920 663832 664709 666485 668521 670572 672675 674588 675805 675928 674765 672373 669243 666143 663472 660984
59682F60984k466j790j75J343J448J18j384k143k524l276m272m769m622m492m848
$$ 660984 658518 656728 656553 657896 659344 659462 658078 655935 653411 650135 645863 641094 636472 631980 627132
59667F27132n430n856o060n909n010l419j980j397j352j080m40K02P76J494K216
$$ 627132 621702 615846 609786 603877 598867 595448 593468 592071 590719 589639 589199 589401 590177 591671 593887
59652E93887K584K721L078L502L195J802L7j088j331j339j895l150m477n018m559
$$ 593887 596471 599192 602270 605772 608967 610769 610806 609718 608387 607048 605153 602003 597526 592508 587949
59637E87949l716l198l097l077k848k163p90R50J944J383j06j084r87n11l97o33
$$ 587949 584233 581035 577938 574861 572013 569850 569060 570010 571954 573337 573231 572147 571160 570649 570252 569619
59621E69619r69j487k254k900k888k070q39O2j0j025k142k474j840n48J167K978
$$ 569619 568650 567163 564909 562009 559121 557051 556212 556274 556264 555239 553097 550623 548783 548235 549402 552380
59605E52380M113M029L223K529J789K37j799k803k031m94M69P11P16N22Qm14l18
$$ 552380 556493 560522 563745 566274 568063 568300 566501 563698 561667 561173 561642 562353 563069 563591 563599 563185 562867
59588E62867o9k62p07p90n85p12j232j556j511j692k465l346l711l614l468l279
$$ 562867 562798 562536 561829 561039 560454 559742 558510 556954 555443 553751 551286 547940 544229 540615 537147 533868
59572E33868k789k154j944k270k424j714m38L86K10m99r30p84k68L44Q41J031
$$ 533868 531079 528925 526981 524711 522287 520573 520135 520521 520731 520232 519302 518518 518250 518594 519435 520466
59556E20466R48R64J331J781J910J842K040K527K776K499K095K179K905L975N180
$$ 520466 521414 522378 523709 525490 527400 529242 531282 533809 536585 539084 541179 543358 546263 550238 555418
59541E55418O728R042J2136J5283J7520J8534J8683J8074J6100J2360P615L224
$$ 555418 562146 571188 583324 598607 616127 634661 653344 671418 687518 699878 707493 710717
59529G10717kj944k544j799j94J629L542N607P244P528O322M373K213k80l151
$$ 710717 710715 708771 706227 704428 704234 705863 709405 715012 722256 729784 736106 740479 742692 742412 739261
59514G39261n987q472j0627j2330j3280j3580j3648j3377j2203j0248q551p797
$$ 739261 733274 724802 714175 701845 688565 674985 661337 647960 635757 625509 616958 609161
59502F09161p531p021o185n203m028k776j926j558j048o1P65P72K86K3J14L99
$$ 609161 601630 594609 588424 583221 579193 576417 574491 572933 571885 571824 572589 573361 573647 573670 573784 574183
59486E74183J125K390L470L714L775M886O995Q733R303R386R928J0870J1533J1557
$$ 574183 575308 577698 581168 584882 588657 593543 600538 609271 618574 627960 637888 648758 660291 671848
59472F71848J0929R587P523N071K623K96j778l054k935j534L11J946L524N535
$$ 671848 682777 692364 699887 704958 707581 707877 706099 703045 700110 698576 698887 700833 704357 709892
59458G09892P972J0281J2057J3445J4765J6099J7361J8475J9296J9593J9296J8440
$$ 709892 717864 728145 740202 753647 768412 784511 801872 820347 839643 859236 878532 896972
59446H96972J6685J3343Q319K581k834p839j2681j6776j9080j9567j9241j8686
$$ 896972 913657 927000 935319 937900 935066 927227 914546 897770 878690 859123 839882 821196
59434H21196j7516j5546j3540j2266j1497j0509r066p461n946m420k457M26M125
$$ 821196 803680 788134 774594 762328 750831 740322 731256 723795 717849 713429 710972 711398 715523
59421G15523P666J0167J2108J4772J8343K1559K3509K4656K5524K5407K3293J9210
$$ 715523 723189 733356 745464 760236 778579 800138 823647 848303 873827 899234 922527 941737
59409I41737J3808P255m89q704j6071k1403k3690k2093j6960j0464n252k431j514
$$ 941737 955545 962800 962311 953607 937536 916133 892443 870350 853390 842926 837674 835243 833729
59396H33729j988m034p845j3015j8601k3291k5758k5558k3607k1210j8789j6119
$$ 833729 831741 827707 819862 806847 788246 764955 739197 713639 690032 668822 650033 633914
59384F33914j3313j0799q526o138l805k102j073k05O70J225J437J728K200K480
$$ 633914 620601 609802 601276 595138 591333 589231 588158 587953 588623 589848 591285 593013 595213 597693
59370E97693K467K547K851K975K776K850L760N251O575P366P861Q424R129R786
$$ 597693 600160 602707 605558 608533 611309 614159 617919 623170 629745 637111 644972 653396 662525 672311
59356F72311J0313J1040J2515J4834J7410J9595K1328K2844K4056K4735K5081
$$ 672311 682624 693664 706179 721013 738423 758018 779346 802190 826246 850981 876062
59345H76062K5529K5961K5645K3994K1079J7361J3285R168N150J168k830o764
$$ 876062 901591 927552 953197 977191 998270 1015631 1028916 1038084 1043234 1044402 1041572 1034808
59333A034808j0616j4451j8095k1035k2964k4047k4355k3563k1757j9958j9087
$$ 1034808 1024192 1009741 991646 970611 947647 923600 899245 875682 853925 833967 814880
59322H14880j8722j7740j5936j4141j2869j1725j0263q643p283o419o053n859
$$ 814880 796158 778418 762482 748341 735472 723747 713484 704841 697558 691139 685086 679227
59310F79227n139l495j473N7R93J825K598K988L264M148N615O950Q129J0017J2826
$$ 679227 674088 670593 669120 669177 670170 671995 674593 677581 680845 684993 690608 697558 705687 715704 728530
59295G28530J5473J7023J7690J7717J6357J2944Q154L178j766o932j1455j3661
$$ 728530 744003 761026 778716 796433 812790 825734 833888 837066 835300 828368 816913 803252
59283H03252j3004j0726q309o047l489n79K183M418O206P820R402J0888J2159
$$ 803252 790248 779522 771213 765166 761677 761098 763281 767699 773905 781725 791127 802015 814174
59270H14174J3129J3738J3851J3283J1936R819O977L512k99m089p575j0568j2865
$$ 814174 827303 841041 854892 868175 880111 889930 896907 900419 900120 896031 888456 877888 865023
59257H65023j4405j5444j6281j6782j6563j5609j4326j2912j1168r107p209n748
$$ 865023 850618 835174 818893 802111 785548 769939 755613 742701 731533 722426 715217 709469
59245G09469m303k433m89Q96J900L398N650P730Q505P891O764N866N203M454L573
$$ 709469 705166 702733 702244 703140 705040 708438 714088 721818 730323 738214 744978 750844 756047 760501 764074
59230G64074K754J989R09q94l541o781j0046j2582j3839j3889j3377j2848j2263
$$ 764074 766828 768817 769726 768832 765291 758510 748464 735882 722043 708154 694777 681929 669666
59217F69666j1322j0057q838p880o979n858m575l490k853k504k052j346o17m5
$$ 669666 658344 648287 639449 631569 624590 618732 614157 610667 607814 605310 603258 601912 601295 601250
59203F01250N71J403K074K123J935K438L719M676M531L921L880M348M530M305
$$ 601250 601821 603224 605298 607421 609356 611794 615513 620189 624720 628641 632521 636869 641399 645704
59189F45704M307M794N361N784O296O912P185O903O374N860N252M496L840L516
$$ 645704 650011 654805 660166 665950 672246 679158 686343 693246 699620 705480 710732 715228 719068 722584
59175G22584L577M114N143O243O931P404Q318R678J0701J0953J0956J1210J1373
$$ 722584 726161 730275 735418 741661 748592 755996 764314 773992 784693 795646 806602 817812 829185
59162H29185J0833R557P743N149J563k341n343o977p991r342j1085j2453j2841
$$ 829185 840018 849575 857318 862467 864030 861689 856346 849369 841378 832036 820951 808498 795657
59149G95657j2514j2259j2411j2496j1922j0831r891r355q820p904o726n548m337
$$ 795657 783143 770884 758473 745977 734055 723224 713333 703978 695158 687254 680528 674980 670643
59136F70643k921j389j20M71K47m25p88l45O04J382J812K271K949L624M204M991
$$ 670643 667722 666333 666213 666684 666931 666506 665718 665373 665977 667359 669171 671442 674391 678015 682219 687210
59120F87210O127P303Q220Q946R565R862R686R258Q914Q804Q999R557J0198J0327
$$ 687210 693337 700640 708860 717806 727371 737233 746919 756177 765091 773895 782894 792451 802649 812976
59106H12976R643Q481P290O104M817L580K603J781R09J3p82j513k139k317j812
$$ 812976 822619 831100 838390 844494 849311 852891 855494 857275 858184 858197 857415 855902 853763 851446 849634
59091H49634j029p79j408k463l287l721m150m934o002p006p818q675r759j0829
$$ 849634 848605 847826 846418 843955 840668 836947 832797 827863 821861 814855 807037 798362 788603 777774
59077G77774j1464j1564j1340j0953j0364r582q733p982p519p443p478p038n949
$$ 777774 766310 754746 743406 732453 722089 712507 703774 695792 688273 680830 673352 666314 660365
59064F60365m813m180l702k811j948k108l165l701k902j700j439k094k599k440
$$ 660365 655552 651372 647670 644859 642911 640803 637638 633937 631035 629335 627896 625802 623203 620763
59050F20763k043j774j414p83k88m26j033j323p68K94J010R77N91M22N49P27R61
$$ 620763 618720 616946 615532 614749 614461 614035 613002 611679 610911 611205 612215 613192 613783 614205 614754 615481 616442
59033F16442J486K365L497M827O217P330Q085Q999J0414J1678J1898J1383J1408
$$ 616442 617928 620293 623790 628617 634834 642164 650249 659248 669662 681340 693238 704621 716029
59020G16029J2421J3368J3108J1744J0008Q115N763K928J03k084l217l377l138
$$ 716029 728450 741818 754926 766670 776678 784793 790556 793484 793587 791503 788286 784909 781771
59007G81771k972k594j340O98K538L519M110N255P292R688J1387J1413R668P292
$$ 781771 778799 776205 774865 775563 778101 781620 785730 790985 798277 807965 819352 830765 840433 847725
58993H47725N608M719L748K388J210L26j105l521o117p964r076r777r893r296
$$ 847725 853333 858052 861800 864188 865398 865724 864619 861098 854981 847017 837941 828164 818271 808975
58979H08975q467p662o302l993j506K41J545L344N678P770R265J0415J1306J1890
$$ 808975 800508 792846 786544 782551 781045 781286 782831 786175 791853 799623 808888 819303 830609 842499
58965H42499J2573J3842J5228J5600J4526J2674J0753Q677N908K194k151o334
$$ 842499 855072 868914 884142 899742 914268 926942 937695 946372 952280 954474 952323 945989
58953I45989r590j1858j3842j6026j7997j9079j9240j8857j7974j6477j4660j2925
$$ 945989 936399 924541 910699 894673 876676 857597 838357 819500 801526 785049 770389 757464
58941G57464j1166r122p141n864n271m791m201l767l565l393l313l613m112m260
$$ 757464 746298 737176 730035 724171 718900 714109 709908 706141 702576 699183 695870 692257 688145 683885
58927F83885l968l760l913m031l629k724j719j042r54j346j670j388m72P53K048
$$ 683885 679917 676157 672244 668213 664584 661860 660141 659099 658145 656799 655129 653741 653269 654022 656070
58912F56070L244M001M168M219M810N939P065P996R131J0722J2449J3841J4757
$$ 656070 659314 663315 667483 671702 676512 682451 689516 697512 706643 717365 729814 743655 758412
58899G58412J5289J5525J5551J5523J5648J6151J7127J8334J9360K0209K1472
$$ 758412 773701 789226 804777 820300 835948 852099 869226 887560 906920 927129 948601
58888I48601K3599K6249K8578K9889K9757K7958K4721K0705J6256J1019M752j849
$$ 948601 972200 998449 1027027 1056916 1086673 1114631 1139352 1160057 1176313 1187332 1192084 1190235
58876A190235p776j2858j7609k2112k5723k7849k8482k7980k6793k5374k3914
$$ 1190235 1182459 1169601 1151992 1129880 1104157 1076308 1047826 1019846 993053 967679 943765
58865I43765k2242k0301j8405j6771j5126j3361j2073j1760j1889j1574j0947
$$ 943765 921523 901222 882817 866046 850920 837559 825486 813726 801837 790263 779316
58854G79316j0834j1228j1102r894q300p212o690o339o110o212o589o886o821
$$ 779316 768482 757254 746152 736258 727958 720746 714056 707717 701607 695395 688806 681920 675099
58841F75099o412n916n618n508n287m865m588m692m776m313l506l052l122l148
$$ 675099 668687 662771 657153 651645 646358 641493 636905 632213 627437 623124 619618 616566 613444 610296
58827F10296k655j838j164p67l47M99J825L100L674L619L710M358N011N011M515
$$ 610296 607641 605803 604639 603872 603525 604024 605849 608949 612623 616242 619952 624310 629321 634332 638847
58812F38847L964L239K054Q00J04j58n68j088j095m97M0%n05j184j906k553l123
$$ 638847 642811 646050 648104 648904 649008 648850 648282 647194 646099 645602 645642 645642 645137 643953 642047 639494 636371
58795F36371l801m451m313k877q71M37P68Q62J214J655K174L090M248M953M925
$$ 636371 632570 628119 623806 620929 620058 620495 621263 622125 623339 624994 627168 630258 634506 639459 644384
58780F44384M625M443M267L966L644L229K474J435M05o52j925l091l636l837m544
$$ 644384 649009 653452 657719 661685 665329 668558 671032 672467 672872 672220 670295 667204 663568 659731 655187
58765F55187n818o669o363n271m131l210k422j649o69O36J832K286K101K024K385
$$ 655187 649369 642700 636337 631066 626935 623725 621303 619654 618985 619621 621453 623739 625840 627864 630249
58750F30249K765K846K842K899K921L117M006N522O791P125O695O129N927O293
$$ 630249 633014 635860 638702 641601 644522 647639 651645 657167 663958 671083 677778 683907 689834 696127
58736F96127O950P079O264N368N645O965P961P959P594P287O458M812L262K737
$$ 696127 703077 710156 716420 721788 727433 734398 742359 750318 757912 765199 771657 776469 779731 782468
58722G82468L006L431M031M953N663N559M991M781N052N174M636L470K034P68
$$ 782468 785474 788905 792936 797889 803552 809111 814102 818883 823935 829109 833745 837215 839249 840017
58708H40017j62j163k823m980o869q315j0073j2508j4860j6330j7209j8097j8640
$$ 840017 839855 838692 835869 830889 824020 815705 805632 793124 778264 761934 744725 726628 707988
58695G07988j8045j6411j4702j3436j2262j0792r207p830o683n666m957m857n296
$$ 707988 689943 673532 658830 645394 633132 622340 613133 605303 598620 592954 587997 583140 577844
58682E77844n664n351m459l732l630l769l523k786j725k09J845L890N278O219
$$ 577844 572180 566829 562370 558638 555008 551239 547716 544930 543205 542996 544841 548731 554009 560228
58668E60228P415Q939J0305J1481J2854J4170J4501J3452J1544R206O363L127
$$ 560228 567643 576582 586887 598368 611222 625392 639893 653345 664889 674095 680458 683585
58656F83585K5k732n339p548q696q778q587q516q191p547p193p280p040o000m678
$$ 683585 683610 680878 675539 667991 659295 650517 641930 633414 625223 617676 610483 603203 596163 590163 585485
58641E85485l579k371o71J195K771M013M829M843M130L376K865K143J060K15j61
$$ 585485 581906 579535 578864 580059 582830 586843 591672 596515 600645 604021 606886 609029 610089 610304 610143
58626F10143o68j538j930j196J13J228K289L776N619P605R849J2125J3553J3716
$$ 610143 609475 607937 606007 604811 604924 606152 608441 612217 617836 625441 635290 647415 660968 674684
58612F74684J3273J2773J1683R397O434L748J554l90k046l367m652n897o536o465
$$ 674684 687957 700730 712413 721810 728244 731992 733546 733156 731110 727743 723091 717194 710658 704193
58598G04193o479p001p256o512n232m141l049j538P1J409K937N141P641R925J2097
$$ 704193 697714 690713 683457 676945 671713 667572 664523 662985 663056 664465 667402 672543 680184 690109 702206
58583G02206J3988J4591J3540J2120J1541J1158R809P911O703O152N401M675M994
$$ 702206 716194 730785 744325 756445 767986 779144 788953 796864 803567 809719 815120 819795 824789
58570H24789O328P721R089J1185J3971J6594J8969K1824K4993K7132K7422K6277
$$ 824789 831117 838838 847927 859112 873083 889677 908646 930470 955463 982595 1010017 1036294
58558A036294K4182K1060J7092J2971Q987M851O97k725n126o997q500r041q419
$$ 1036294 1060476 1081536 1098628 1111599 1120586 1125437 1126134 1123409 1118283 1111286 1102786 1093745 1085326
58545A085326p581p730r113j1145j3214j5116j6920j8712k0355k1491k1878k1542
$$ 1085326 1077745 1070015 1060902 1049757 1036543 1021427 1004507 985795 965440 943949 922071 900529
58533I00529k0544j8935j7077j5469j3971j1843q946o179m169k349p8K039K914
$$ 900529 879985 861050 843973 828504 814533 802690 793744 787565 783396 781047 780969 783008 785922
58520G85922K608K264K716L847N035N583N169M362M160M501M134K548J006O98
$$ 785922 788530 790794 793510 797357 802392 807975 813144 817506 821666 826167 830301 832849 833855 834553
58506H34553Q42k7j752k941l136l185l678m377n009n589o045o340o595o496n228
$$ 834553 835395 835368 833616 830675 827539 824354 820676 816299 811290 805701 799656 793316 786721 780225 774997
58491G74997k849q63l66m65K47J591K622L694N869Q875J1418J3216J5007J6684
$$ 774997 772148 771285 770919 770454 770701 772292 774914 778608 784477 793352 804770 817986 832993 849677
58477H49677J7184J6184J4474J2570J0346P889N404K404j627n929r110j0898j1961
$$ 849677 866861 883045 897519 910089 920435 928324 933728 936132 934505 928576 919466 908568 896607
58464H96607j2324j1479r727p836n623k462J054L665N395P245R084R734R121Q346
$$ 896607 884283 872804 863077 855241 849618 847156 848210 851875 857270 864515 873599 883333 892454 900800
58450I00800P534N561K213j244m061o688r089j0212r821r091q726p988o366m619
$$ 900800 908334 913895 916108 914864 910803 904115 895026 884814 874993 865902 857176 849188 842822 838203
58436H38203l419k275o31J165K665M033N404O592P833R697J1933J3475J3982J4092
$$ 838203 834784 832509 831878 833043 835708 839741 845145 851737 859570 869267 881200 894675 908657 922749
58422I22749J3927J2678J0165P410N178L091P41j507l339n022o699q075r105j0043
$$ 922749 936676 949354 959519 966929 972107 975198 975939 974432 971093 966071 959372 951297 942192 932149
58408I32149j0684j0582j0028r703r399q402p014o184n751m691l144k311k199
$$ 932149 921465 910883 900855 891152 881753 873351 866337 860153 854402 849711 846567 844256 842057
58395H42057j363O17K304K617K107J439L88r39j643j623k031l214l815k833j200
$$ 842057 840694 841311 843615 846232 848339 849778 850166 849227 847584 845961 843930 840716 836901 834068 832868
58380H32868k37J33P15J725K985M436N779O572P135Q313J0026J1263J1802J2543
$$ 832868 832631 832764 833479 835204 838189 842625 848404 854976 862111 870424 880450 891713 903515 916058
58366I16058J3797J4744J5033J5353J5998J6328J6095J5832J5502J4388J2639
$$ 916058 929855 944599 959632 974985 990983 1007311 1023406 1039238 1054740 1069128 1081767
58355A081767J1207R934P633M503K376J920J626M40o79p70m32k04O86K764N137
$$ 1081767 1092974 1102908 1110541 1115044 1117420 1119340 1120966 1121406 1120727 1119957 1119525 1119321 1120007 1122771 1127908
58340A127908P120R399J2432J5195J6730J7512J8259J8754J8799J8895J9055J8374
$$ 1127908 1135028 1144427 1156859 1172054 1188784 1206296 1224555 1243309 1262108 1281003 1300058 1318432
58328A318432J6539J4419J2457J0165P681O083N409M341K613J737K478L618M186
$$ 1318432 1334971 1349390 1361847 1372012 1379693 1385776 1391185 1395526 1398139 1399876 1402354 1405972 1410158
58315A410158M898O339P707Q469R360J0786J2067J3084J4658J6432J6735J5471
$$ 1410158 1415056 1421395 1429102 1437571 1446931 1457717 1469784 1482868 1497526 1513958 1530693 1546164
58303A546164J4758J5673J6756J6900J7115J8127J8768J8280J7901J8650J9758
$$ 1546164 1560922 1576595 1593351 1610251 1627366 1645493 1664261 1682541 1700442 1719092 1738850
58292A738850K0598K1791K3213K3515K2871K3405K5588K7152K6993K7017K8469
$$ 1738850 1759448 1781239 1804452 1827967 1850838 1874243 1899831 1926983 1953976 1980993 2009462
58281B009462K9734K9707L0023L1792L3394L3915L5454L9420M3680M6114M8049
$$ 2009462 2039196 2068903 2098926 2130718 2164112 2198027 2233481 2272901 2316581 2362695 2410744
58270B410744N1384N5191N7977O0522O3735O6512O8312P0886P4790P7364P6911
$$ 2410744 2462128 2517319 2575296 2635818 2699553 2766065 2834377 2905263 2980053 3057417 3134328
58259C134328P5710P6057P6685P6018P5469P6309P6923P6488P7608Q1859Q6497
$$ 3134328 3210038 3286095 3362780 3438798 3514267 3590576 3667499 3743987 3821595 3903454 3989951
58248C989951Q9259R2508R8753J06079J12105J18316J26170J33263J38014J43771
$$ 3989951 4079210 4171718 4270471 4376550 4488655 4606971 4733141 4866404 5004418 5148189
58238E148189J53302J63674J71769J80183J92025K04661K14856K25451K40272
$$ 5148189 5301491 5465165 5636934 5817117 6009142 6213803 6428659 6654110 6894382
58229F894382K56948K71806K87390L07704L30360L51222L72693L99425M29953
$$ 6894382 7151330 7423136 7710526 8018230 8348590 8699812 9072505 9471930 9901883
58220I901883M60755M94445N35459N81954O30684O85256P50520Q23889R01989
$$ 9901883 10362638 10857083 11392542 11974496 12605180 13290436 14040956 14864845 15766834
58211A5766834R90392J096384J218369J354073J512586J705710J935161K203409
$$ 15766834 16757226 17853610 19071979 20426052 21938638 23644348 25579509 27782918
58203B7782918K529955K941200L453789M087153M881376N876765P083980Q504994
$$ 27782918 30312873 33254073 36707862 40795015 45676391 51553156 58637136 67142130
58195F7142130J0183005J2209887J4698405J7769998K1503613K5749985K9921811
$$ 67142130 77325135 89535022 104233427 122003425 143507038 169257023 199178834
58188A99178834L3049447L4176686L2766736K8766839K2405017J4075563M441369
$$ 199178834 232228281 266404967 299171703 327938542 350343559 364419122 368860491
58181C68860491n484629j4508766k1603151k6192328k8246593k8194087k6714649
$$ 368860491 363375862 348867096 327263945 301071617 272825024 244630937 217916288
58174B17916288k4501730k2094960j9829038j7852364j6160380j4649300j3201897
$$ 217916288 193414558 171319598 151490560 133638196 117477816 102828516 89626619
58167H9626619j1760081j0333688q963039p688087o539179n531991m664902l927803
$$ 89626619 77866538 67532850 58569811 50881724 44342545 38810554 34145652 30217849
58159C0217849l311768k805494k389659k044267j757939j523231j328485j162471
$$ 30217849 26906081 24100587 21710928 19666661 17908722 16385491 15057006 13894535
58151A3894535j022277r08342q15400p35646o66859o09765n60810n14927m72295
$$ 13894535 12872258 11963916 11148516 10412870 9746011 9136246 8575436 8060509 7588214
58142G588214m35267m01398l66462l31776l01690k75992k51369k28382k10499
$$ 7588214 7152947 6751549 6385087 6053311 5751621 5475629 5224260 4995878 4785379
58133D785379j97628j86650j77122j70798j66531j61118j54342j48198j42140
$$ 4785379 4587751 4401101 4223979 4053181 3886650 3725532 3571190 3422992 3280852
58124C280852j33862j23960j15211j08037j00881r4082q9084q4811p9033p2513
$$ 3280852 3146990 3023030 2907819 2799782 2698901 2604819 2515735 2430924 2351891 2279378
58114B279378o7823o4861o1450n7479n4579n2515m9679m6454m4442m3160m0952
$$ 2279378 2211555 2146694 2085244 2027765 1973186 1920671 1870992 1824538 1780096 1736936 1695984
58103A695984l8322l6859l5858l3546l0738k9550k9447k8228k6259k5882k7198
$$ 1695984 1657662 1620803 1584945 1551399 1520661 1491111 1461664 1433436 1407177 1381295 1354097
58092A354097k8114k8172k8635k9116k7840k5087k2987k1869k0208j8113j7436
$$ 1354097 1325983 1297811 1269176 1240060 1212220 1187133 1164146 1142277 1122069 1103956 1086520
58081A086520j8299j8779j8272j8046j8355j8078j7427j7939j9377j9590j7965
$$ 1086520 1068221 1049442 1031170 1013124 994769 976691 959264 941325 921948 902358 884393
58070H84393j6264j5543j4904j3807j2969j2429j1127r112p875p961q302q312
$$ 884393 868129 852586 837682 823875 810906 798477 787350 778238 770363 762402 754100 745788
58058G45788q545q982q755p894p463p689p834p922q491q767p402n097m074m767
$$ 745788 737243 728261 719506 711612 704149 696460 688626 680704 672213 663446 656044 650947 646873 642106
58044F42106n446n344n643o802p473o855n906n403m867m206m398n544o160n420
$$ 642106 636660 631316 625673 618871 611398 604543 598637 593234 588367 584161 579763 574219 568059 562639
58030E62639m504m794o104p488q491q907q539p816p438p197o304m997m329m361
$$ 562639 558135 553341 547237 539749 531258 522351 513812 505996 498558 491361 485057 480060 475731 471370
58016D71370m147l587l499l719l129j838j326j866j901o86M55M32O9M18J034J163
$$ 471370 467223 463636 460137 456418 453289 451451 450125 448259 446358 445672 446127 446559 446628 447046 448080 449243
58000D49243J217J915L005L857M344M435L914L175L111L650L589K398R99J78m66
$$ 449243 450460 452375 455380 459237 463581 468016 471930 475105 478216 481866 485455 487853 488852 489030 488564
57985D88564j289j754j607j636k358l058k991k527k332k383k467k679k738j940
$$ 488564 487275 485521 483914 482278 479920 476862 473871 471344 469012 466629 464162 461483 458745 456805
57971D56805m13O59P66Q21J506K092J855J403J580K015J943J512J215Q05j26j168
$$ 456805 456392 457051 457817 458638 460144 462236 464091 465494 467074 469089 471032 472544 473759 474564 474438 473270
57955D73270j725k098k921m035m735m779m394l743l052k796l058l124k343r26
$$ 473270 471545 469447 466526 462491 457756 452977 448583 444840 441788 438992 435934 432810 430467 429541
57941D29541N61J911L038L715M187N339P512R731J0871J1069J1132J1061J0126
$$ 429541 430102 432013 435051 438766 442953 448292 455804 465535 476406 487475 498607 509668 519794
57928E19794Q156N910M115K741J317m21k296l895n031n967o967p780p991p771
$$ 519794 527950 533860 537975 540716 542033 541612 539316 535421 530390 524423 517456 509676 501685 493914
57914D93914p736q019q156p875p356o688n834n223n436o116o166n316m614m886
$$ 493914 486178 478159 470003 462128 454772 448084 442250 437027 431591 425475 419309 413993 409379 404493
57900D04493n611n879n625n297m966m480l950l521l044k466k102k081j987j416
$$ 404493 398882 393003 387378 382081 377115 372635 368685 365164 362120 359654 357552 355471 353484 352068
57886C52068m82N08J402K030K224K214K417K653K201R36l63j078j413j766k156
$$ 352068 351586 352094 353496 355526 357750 359964 362381 365034 367235 368171 367808 366730 365317 363551 361395
57871C61395k592l209l754l705l198k949k966k359q94L42N57N44J461L163M581
$$ 361395 358803 355594 351840 348135 344937 341988 339022 336663 335769 336111 336668 337212 338673 341836 346417
57856C46417N266N655O183O848P412P536P124O702O939P579P688P118O738O743
$$ 346417 351683 357338 363521 370369 377781 385317 392441 399143 406082 413661 421349 428467 435205 441948
57842D41948O021L853J213o14j622k374k656k157j658k155l266l777l422k934
$$ 441948 447969 451822 453035 452421 450799 448425 445769 443612 441954 439799 436533 432756 429334 426400
57828D26400k657k332k093k393k978l005k333j708j558j494j132o49k73N7K96
$$ 426400 423743 421411 419318 416925 413947 410942 408609 406901 405343 403849 402717 402068 401795 401852 402148
57813D02148J41m63j138j530j653j691j852k368l333m447n222n463n306m894m293
$$ 402148 402289 401826 400688 399158 397505 395814 393962 391594 388261 383814 378592 373129 367823 362929 358636
57798C58636l663l243l153l256l190k612j604q07p05q87n30L86J022Q91M11J25
$$ 358636 354973 351730 348577 345321 342131 339519 337915 337108 336403 335516 334986 335372 336394 337285 337696 337821
57782C37821J27N02J402K368K527J935J861L024M476M970M545L993L523K951K499
$$ 337821 337948 338450 339852 342220 344747 346682 348543 351567 356043 361013 365558 369551 373074 376025 378524
57767C78524K356J898M18j736l628m976o094p010p448p436p087o234n025m323
$$ 378524 380880 382778 383196 381460 377832 372856 366762 359752 352304 344868 337781 331547 326522 322199
57753C22199m616n030m439l131k229j911j385l92M73Q56R42P52J85k93j05L28
$$ 322199 317583 312553 308114 304983 302754 300843 299458 299066 299539 300395 301337 302089 302274 301981 301876 302204
57737C02204R9o64q54j29O45Q65R25J204J410J415J715K492L039K719J826J014
$$ 302204 302303 301639 300785 300656 301301 302166 303091 304295 305705 307120 308835 311327 314366 317085 318911 319925
57721C19925M87J93K01L92K81l02q18p66m60o23j414k289k681k480j987j586j470
$$ 319925 320412 320605 320806 321198 321479 321177 320359 319593 319133 318510 317096 314807 312126 309646 307659 306073 304603
57704C04603j529j519j288q80n04m20n99m67M93J790K182J251K3m59m95q69j394
$$ 304603 303074 301555 300267 299387 298883 298463 297864 297397 297890 299680 301862 303113 303136 302677 302182 301313 299919
57687B99919j353q72o85p45l06P23J645K240L088M506O295Q663J2287J7106K2132
$$ 299919 298566 297694 297009 296264 295958 296681 298326 300566 303654 308160 314455 323118 335405 352511 374643
57672C74643K6962L2490L9509M7234N3809N7662N7944N4242M6400L4434J8549
$$ 374643 401605 434095 473604 520838 574647 632309 690253 744495 790895 825329 843878
57661H43878k13j9271l5338m6396n2442n4293n2513m7867m1797l5716l0128k4981
$$ 843878 843665 824394 789056 742660 690218 635925 583412 535545 493748 458032 427904 402923
57649D02923k0402j6693j3874j1637r556p358n311m202m303m503l365j128M17
$$ 402923 382521 365828 351954 340317 330761 323403 318092 313890 309587 305084 301719 300591 301008
57636C01008L40k33J18J229K031K204K167K046J701J341J193Q18l44j885k696
$$ 301008 301348 301115 301233 302462 304493 306697 308864 310910 312611 313952 315145 315963 315619 313734 311038
57621C11038k358j573j255j651k409k982k950k262j256l10L66N25r4j173j726
$$ 311038 308680 307107 305852 304201 301792 298810 295860 293598 292342 292032 292398 292923 292829 291656 289930
57606B89930j166j89N2n04p63n1R10Q97k69j474j565o40O4m77k024l492m187m227
$$ 289930 288764 288575 288627 288123 287360 287309 288219 289116 288847 287373 285808 285168 285232 284755 282731 279239 275052 270825
57588B70825l937l419k793k341k106j797j327j050j154j303j237j270j785k461
$$ 270825 266888 263469 260676 258335 256229 254432 253105 252055 250901 249598 248361 247091 245306 242845
57574B42845k639k209j706j521j455j133n39o2p0n26r87j070q13m47J8O57J159
$$ 242845 240206 237997 236291 234770 233315 232182 231643 231581 231511 230985 229998 228928 228115 227668 227686 228343 229502
57557B29502J033M07J33P61J865K659K919K956K938K665K003J204P65J024J762
$$ 229502 230535 230942 231075 231836 233701 236360 239279 242235 245173 247838 249841 251045 251810 252834 254596
57542B54596K307K223J883J916K204J989J089L18L29O18K74o52j192p70J37P12
$$ 254596 256903 259126 261009 262925 265129 267118 268207 268525 268854 269472 269746 269094 267902 267132 267269 267981
57526B67981P13N33N79Q42J058J176J400J798K069J962J716J761K116K446K585
$$ 267981 268694 269227 269806 270648 271706 272882 274282 276080 278149 280111 281827 283588 285704 288150 290735
57511B90735K573K311J711J066P50O46M01K25N97J235J198K12q79j302j210j021
$$ 290735 293308 295619 297330 298396 299146 299792 300193 300418 301015 302250 303448 303660 302781 301479 300269 299248
57495B99248p49m14l88p62j030r24r30j367j627j044k6M61K15j62k22l0K17L79
$$ 299248 298499 298085 297697 296935 295905 294981 294051 292684 291057 290013 289987 290448 290663 290501 290279 290249 290466 290845
57477B90845L14J54L91J203J956J853Q84k09p52n15K85J003R91M24K85J059J965
$$ 290845 291159 291313 291704 292907 294863 296716 297600 297391 296639 296124 296409 297412 298403 298827 299112 300171 302136
57460C02136K105J790J988K821L563L848L923L847L312K397J663J360J179R32
$$ 302136 304241 306031 308019 310840 314403 318251 322174 326021 329333 331730 333393 334753 335932 336864
57446C36864Q58J027J076Q28O92J153K113L044L561L668L555L338K987K443J768
$$ 336864 337722 338749 339825 340653 341345 342498 344611 347655 351216 354884 358439 361777 364764 367207 368975
57431C68975J159Q41J044J867K972L598L374K954L244L979L962K860J855K029
$$ 368975 370134 370975 372019 373886 376858 380456 383830 386784 390028 394007 397969 400829 402684 404713
57417D04713K970L642L780L631L025J850R50J411K970M199M276L749L428L359
$$ 404713 407683 411325 415105 418736 421761 423611 424561 425972 428942 433141 437417 441166 444594 447953
57403D47953L155K781K605K921L476L576K805J858K043L650N344N752N064M467
$$ 447953 451108 453889 456494 459415 462891 466467 469272 471130 473173 476823 482167 487919 492983 497450
57389D97450M501M828N229N758O173O205O274O979P973Q253P560O584N750M844
$$ 497450 501951 506779 512008 517766 523939 530144 536418 543397 551370 559623 567183 573767 579517 584361
57375E84361M022M037N019N897N745N020M862N529O214O198N714N618O403P618
$$ 584361 588383 592420 597439 603336 609081 614101 618963 624492 630706 636904 642618 648236 654639 662257
57361F62257Q358Q299Q037Q206Q635Q774Q607Q553Q664Q580Q285Q226Q661R321
$$ 662257 670615 678914 686951 695157 703792 712566 721173 729726 738390 746970 755255 763481 772142 781463
57347G81463R860J0221J0464J0569J0467J0142R750R702J0249J0945J1047J0676
$$ 781463 791323 801544 812008 822577 833044 843186 852936 862638 872887 883832 894879 905555
57335I05555J0841J1830J2511J1923J0829J0572J1149J1594J1784J2479J3754
$$ 905555 916396 928226 940737 952660 963489 974061 985210 996804 1008588 1021067 1034821
57324A034821J4775J5132J5207J5148J4674J4059J4078J4785J5341J5298J5025
$$ 1034821 1049596 1064728 1079935 1095083 1109757 1123816 1137894 1152679 1168020 1183318 1198343
57313A198343J4702J4056J3338J3422J4475J5594J6179J6725J7739J8798J9227
$$ 1198343 1213045 1227101 1240439 1253861 1268336 1283930 1300109 1316834 1334573 1353371 1372598
57302A372598J8995J8483J8097J8319J9393K0587K0787K0096J9879K0793K1850
$$ 1372598 1391593 1410076 1428173 1446492 1465885 1486472 1507259 1527355 1547234 1568027 1589877
57291A589877K2083K2027K2663K3827K4654K4952K5167K5420K5422K5209K5260
$$ 1589877 1611960 1633987 1656650 1680477 1705131 1730083 1755250 1780670 1806092 1831301 1856561
57280A856561K5946K7233K8670K9589K9714K9696L0400L1536L1849L1005L0300
$$ 1856561 1882507 1909740 1938410 1967999 1997713 2027409 2057809 2089345 2121194 2152199 2182499
57269B182499L0958L2559L3866L4554L5181L6014L6731L7100L7273L7502L7965
$$ 2182499 2213457 2246016 2279882 2314436 2349617 2385631 2422362 2459462 2496735 2534237 2572202
57258B572202L8716L9515L9941L9861L9524L9185L9056L9471M0508M1458M1584
$$ 2572202 2610918 2650433 2690374 2730235 2769759 2808944 2848000 2887471 2927979 2969437 3011021
57247C011021M1448M2343M4231M5491M5248M4725M5498M7446M9479N1274N3178
$$ 3011021 3052469 3094812 3139043 3184534 3229782 3274507 3320005 3367451 3416930 3468204 3521382
57236C521382N5013N6197N6766N7278N7893N8354N8618N8851N8943N8645N8081
$$ 3521382 3576395 3632592 3689358 3746636 3804529 3862883 3921501 3980352 4039295 4097940 4156021
57225D156021N7632N7529N7814N8400N8901N8918N8732N9157O0417O1865O3088
$$ 4156021 4213653 4271182 4328996 4387396 4446297 4505215 4563947 4623104 4683521 4745386 4808474
57214D808474O4479O6275O8007O9487P1333P3707P5412P5322P4088P3376P3879
$$ 4808474 4872953 4939228 5007235 5076722 5148055 5221762 5297174 5372496 5446584 5519960 5593839
57203E593839P5016P6148P7107P7701P7616P6789P5400P3659P1979P0848P0116
$$ 5593839 5668855 5745003 5822110 5899811 5977427 6054216 6129616 6203275 6275254 6346102 6416218
57192F416218O8889O6721O4288O2329O0451N7695N3822M9478M5464M2347M0241
$$ 6416218 6485107 6551828 6616116 6678445 6738896 6796591 6850413 6899891 6945355 6987702 7027943
57181G027943L8531L6336L3649L1329K9689K7990K5838K4007K3170K2750K1824
$$ 7027943 7066474 7102810 7136459 7167788 7197477 7225467 7251305 7275312 7298482 7321232 7343056
57170G343056K0323J8526J6324J3706J1080Q314M437q33o289j0880j5096j9713
$$ 7343056 7363379 7381905 7398229 7411935 7423015 7431329 7435766 7434933 7428644 7417764 7402668 7382955
57158G382955k4213k7644l0018l1704l2372l1705l0202k8221k5301k1519j8204
$$ 7382955 7358742 7331098 7301080 7269376 7237004 7205299 7175097 7146876 7121575 7100056 7081852
57147G081852j6005j3656j0167o829n281n022m866n658r176j5261k2170k8976
$$ 7081852 7065847 7052191 7042024 7035195 7029914 7024892 7020026 7014368 7005192 6989931 6967761 6938785
57135F938785l5506m0694m3286m3597m2500l9418l3549k6138j9136j2471n288
$$ 6938785 6903279 6862585 6819299 6775702 6733202 6693784 6660235 6634097 6614961 6602490 6597202
57124F597202Q50L050J103k256m890o341n953k956J708O654J3075K3353L6756
$$ 6597202 6598052 6601102 6602205 6599949 6595059 6588718 6582765 6579809 6581517 6588171 6601246 6624599 6661355
57111F661355M9882O1831P5760R4916J20151J51722J90090K34396K83487L39471
$$ 6661355 6711237 6773068 6848828 6943744 7063895 7215617 7405707 7640103 7923590 8263061
57101H263061M07639M92721N98386P30247Q95270J097814J340072J626179J960610
$$ 8263061 8670700 9163421 9761807 10492054 11387324 12485138 13825210 15451389 17411999
57092A7411999K341552K760529L208725L677635M152484M611150N030676N389414
$$ 17411999 19753551 22514080 25722805 29400440 33552924 38164074 43194750 48584164
57084D8584164N666840N855781N973494O032571N978334N671246M968934L844290
$$ 48584164 54251004 60106785 66080279 72112850 78091184 83762430 88731364 92575654
57076I2575654K418674Q80843o16278j990571l205068m240254n086008n735815
$$ 92575654 94994328 95875171 95258893 93268322 90063254 85823000 80736992 75001177
57068G5001177o178521o401798o406912o216800n870442n413812m894202m354303
$$ 75001177 68822656 62420858 56013946 49797146 43926704 38512892 33618690 29264387
57060B9264387l825800l328259k873190k466727k109521j798473j530364j302580
$$ 29264387 25438587 22110328 19237138 16770411 14660890 12862417 11332053 10029473
57052A0029473j111013r49967q14506p01118o06207n26018m58098m00966l52539
$$ 10029473 8918460 7968493 7153987 6452869 5846662 5320644 4862546 4461580 4109041
57043D109041l10577k74384k44136k18706j96058j75581j57985j42973j29093
$$ 4109041 3798464 3524080 3279944 3061238 2865180 2689599 2531614 2388641 2259548
57034B259548j16006j04711r5122q5462p4676o3588n2870m1500k8092j2373N389
$$ 2259548 2143542 2038831 1943709 1858247 1783571 1719983 1667113 1625613 1597521 1585148 1590537
57023A590537K4728M3625N8110O4674O2519N2622L5524J1289j8896n2016q3735
$$ 1590537 1615265 1658890 1717000 1781674 1844193 1896815 1932339 1943628 1924732 1872716 1788981
57012A788981j09135j23928j26600j19528j07344r4003q1486p0327o0399n1311
$$ 1788981 1679846 1555918 1429318 1309790 1202446 1108443 1026957 956630 896231 844920
57002H44920m2989l5926l0500k6283k2585j9484j7500j6516j5740j4768j3856
$$ 844920 801931 766005 735505 709222 686637 667153 649653 633137 617397 602629 588773
56991E88773j3100j2083j0596q992p508n885m081k768k609l399m526n970q328
$$ 588773 575673 563590 552994 544002 536494 530609 526528 523760 521151 517752 513226 507256 498928
56978D98928j1944j6367k0531k3171k3414k1545j9002j7004j5273j2684r024n356
$$ 498928 486984 470617 450086 426915 403501 381956 362954 345950 330677 317993 308969 303613
56966C03613k583m82J538L538N497P962J1410J5228J8001J8778J7487J4337R544
$$ 303613 301030 300548 302086 305624 311121 319083 330493 345721 363722 382500 399987 414324 423868
56953D23868L691k294p886j3199j8182k1995k3612k2889k0661j7853j4826j1600
$$ 423868 427559 425265 417379 404180 385998 364003 340391 317502 296841 278988 264162 252562
56941B52562q237m809j173K819O962J0847J4426J8009K1603K4527K6013K5844
$$ 252562 244325 239516 238343 241162 248124 258971 273397 291406 313009 337536 363549 389393
56929C89393K3987J9918J3068M036n325j3342j9637k4560k8025k9349k8159k5076
$$ 389393 413380 433298 446366 450402 445077 431735 412098 387538 359513 330164 302005 276929
56917B76929k1468j8600j6795j5330j3305j0699q333o853o086n487m741l765k616
$$ 276929 255461 236861 220066 204736 191431 180732 172399 165546 159460 153973 149232 145467 142851
56904A42851j641j305j494j446o86M19J433K641M415O260P316P714Q640J0928
$$ 142851 141210 139905 138411 136965 136279 136698 138131 140772 145187 151447 158763 166477 175117 186045
56890A86045J4169J7350J9823K1391K1916K1243J9335J6209J1800O140k84o438
$$ 186045 200214 217564 237387 258778 280694 301937 321272 337481 349281 355421 355137 348699
56878C48699j1220j4131j5420j5527j4525j2313r101n315j163L297P779J2033
$$ 348699 337479 323348 307928 292401 277876 265563 256462 251147 249984 253281 261060 273093
56866B73093J6444K1739K7936L4291M0281M5797N0067N1339M8327M1282L1175
$$ 273093 289537 311276 339212 373503 413784 459581 509648 560987 609314 650596 681771
56855F81771J8630M446r623k1660l0755l6674l8923l7221l2526k6477j9894j2664
$$ 681771 700401 704847 695224 673564 642809 606135 567212 529991 497465 470988 451094 438430
56843D38430m840L192J1519K0640L0563M0904N1778O3362P4280Q1588Q2924P7990
$$ 438430 433590 436782 448301 468941 499504 540408 592186 655548 729828 811416 894340 972330
56831I72330O7499N1703L0780O203j9149m2159o0431p2483p7740p6605p0464o1369
$$ 972330 1039829 1091532 1122312 1128515 1109366 1067207 1006776 934293 856553 779948 709484 648115
56819F48115n1345m1523l1884k2020j2028k344P038J6682K6932L7341M6812N3874
$$ 648115 596770 555247 523363 501343 489315 486971 494009 510691 537623 574964 621776 675650
56807F75650N6960N4929M7595L5636K0153K525j5576l2533m6985n7544o2811o2507
$$ 675650 732610 787539 835134 870770 890923 893448 877872 845339 798354 740810 677999 615492
56795F15492n8216n2233m5706l8445l0346k2136j4692q326k801K533Q460J5109
$$ 615492 557276 505043 459337 420892 390546 368410 353718 345392 342591 345124 353584 368693
56783C68693K1460K6259K9095K9871K7721K1705J2458J933q598j8944k8350l5065
$$ 368693 390153 416412 445507 475378 503099 524804 537262 539195 530597 511653 483303 448238
56771D48238l8158l8494l7197l4376l0208k6041k3117k1035j8646j5930j3759
$$ 448238 410080 371586 334389 300013 269805 243764 220647 199612 180966 165036 151277
56760A51277j2258j0598q370o142m614l905l725l644l242k456j746j448j219n98
$$ 151277 139019 128421 120051 113909 109295 105390 101665 98021 94779 92323 90577 89129 87910 87312
56746H7312J48L24j58p21j000j174j395j418r88k18N29Q49M67m41j160j017j75
$$ 87312 87460 87784 87626 86905 85905 84731 83336 81918 80930 80712 81241 82090 82557 82116 80956 79939 79764
56729G9764N58P03N49N43O34M98J23j72k05p3K14Q85J965K903L013K310J535J224
$$ 79764 80322 81025 81574 82117 82751 83249 83372 83200 82995 82922 83136 84021 85986 88889 91902 94212 95747 96971
56711I6971J094O31j06o02o00k68J77O14Q94R54R75J097J095P48L07J07o6o45
$$ 96971 98065 98696 98590 97988 97388 97120 97297 97911 98805 99759 100734 101831 102926 103674 103981 104088 104022 103377
56693A03377j396j587j069n09m20n56m76k12q3k24m91n58j71M34N14k36j005p95
$$ 103377 101981 100394 99325 98816 98396 97840 97364 97152 97069 96845 96354 95796 95625 96059 96573 96337 95332 94537
56675I4537J32N56K1o76p57k75M57J292J728J037n51j696j556p47j74K78J072
$$ 94537 94669 95225 95246 94570 93813 93538 93995 95287 97015 98052 97501 95805 94249 93502 93328 93606 94678
56658I4678J849J860J160N24M80J032J981K826K751J485m9o98m28n4J63Q02K136
$$ 94678 96527 98387 99547 100071 100551 101583 103564 106390 109141 110626 110577 109879 109451 109397 109560 110362 112498
56641A12498L453L809K996J634N60K96Q16J647K240K297J850J186P38P33R34R16
$$ 112498 115951 119760 122756 124390 124950 125246 126062 127709 129949 132246 134096 135282 136020 136753 137687 138603
56625A38603O36L89K53Mm13q01j121j425j383n87N12Q22J02n53j90P58J302J240
$$ 138603 139239 139628 139881 139885 139472 138671 137550 136125 134742 134155 134667 135489 135591 135038 134848 135606 136908 138148
56607A38148R47M20n12j456j767j498j269j297j253j039r58j119j199j033r15
$$ 138148 139095 139515 139003 137547 135780 134282 133013 131716 130463 129424 128466 127347 126148 125115 124200
56592A24200j064j137n87N32J407J251K45n64m09L36P50M92nk87j80L77J189J588
$$ 124200 123136 121999 121412 121944 123351 124602 124847 124283 123874 124210 124960 125452 125447 125160 124980 125357 126546 128134
56574A28134J115M02N05J444K266K580K912L379L287K546K334L568N680P578Q938
$$ 128134 129249 129651 130156 131600 133866 136446 139358 142737 146024 148570 150904 154472 160152 167730 176668
56559A76668R804R842Q898P592O497N390M096L146K758K077M68j157j573j130
$$ 176668 186472 196314 205212 212804 219301 224691 228787 231933 234691 236768 237236 236079 234506 233376
56545B33376j077j552j640j213j176j870k566k694k570k599k687k712k841l099
$$ 233376 232299 230747 229107 227894 226718 224848 222282 219588 217018 214419 211732 209020 206179 203080
56531B03080l282l353l441l418l013k318j708j354j322j833k799l398k893j690
$$ 203080 199798 196445 193004 189586 186573 184255 182547 181193 179871 178038 175239 171841 168948 167258
56517A67258q32o68q15j154j868k555k426j566j006j268j652j325m77O3j01o02
$$ 167258 166426 165758 164943 163789 161921 159366 156940 155374 154368 153100 151448 150123 149646 149709 149608 149006
56501A49006q07l85L47O74K53m65q21p36n45l21P2N02O93O97O94M92j46q13p80
$$ 149006 148199 147814 148161 148835 149088 148623 147802 147066 146521 146200 146272 146774 147467 148164 148858 149350 149204 148391 147611
56482A47611j6O92O72k2q71j296r20O2Q64R01M67K55L85M43K83J74L15O37J034
$$ 147611 147595 148287 148959 148937 148066 146770 145850 145912 146776 147677 148144 148399 148784 149227 149510 149684 149999 150636 151670
56463A51670J367J414J199J077J142R86N28M07R51J354P94j58l05L65Q23P16P32
$$ 151670 153037 154451 155650 156727 157869 158855 159383 159790 160741 162095 162889 162731 162426 162791 163614 164330 165062
56446A65062J210J513J134M56N9l3j12l41o67p94k42J011K126K170J261K59l79
$$ 165062 166272 167785 168919 169375 169434 169401 169289 168948 168281 167487 167245 168256 170382 172552 173813 174072 173693
56429A73693p73q59l98L18N97K72k62p93j314j374l82J274K373K322J740J341
$$ 173693 172920 172061 171663 171981 172578 172850 172588 171795 170481 169107 168725 169999 172372 174694 176434 177775
56413A77775R89K56p68j557j737j360q59o67o62k20Q12J623J504R69R58J309J062
$$ 177775 178764 179020 178252 176695 174958 173598 172739 172072 171410 171190 172002 173625 175129 176098 177056 178365 179427
56396A79427J09n55l17L40P80R79J137J268J368J417J147M07k71j74O22J438K008
$$ 179427 179536 178981 178664 179004 179784 180763 181900 183168 184536 185953 187100 187507 187236 187062 187684 189122 191130
56379A91130K530K851K600K072K036K520K709K202J521J185J073R04O58L30j45
$$ 191130 193660 196511 199111 201183 203219 205739 208448 210650 212171 213356 214429 215333 215991 216321 216176
56364B16176o31r85j411k039k364j865r23k96L5N64J104J077P31P79R65L88o77
$$ 216176 215545 214560 213149 211110 208746 206881 205958 205662 205697 206261 207365 208442 209173 209952 210917 211305 210628
56347B10628p36P11K331K802K390K044K021K121K351K645K589K005J358J175J496
$$ 210628 209892 210603 212934 215736 218126 220170 222191 224312 226663 229308 231897 233902 235260 236435 237931
56332B37931K081K652K807K357J769J683J957J938J549J307J323J274J246J560
$$ 237931 240012 242664 245471 247828 249597 251280 253237 255175 256724 258031 259354 260628 261874 263434
56318B63434J744R44m93j133m33M90N57P2q6L23J037J794K274K224K010K346L301
$$ 263434 265178 266122 265629 264496 264063 264553 265110 265182 265096 265419 266456 268250 270524 272748 274758 277104 280405
56301B80405M212M672M753M344L295K224J994K261J784M35l22N55K334L708M300
$$ 280405 284617 289289 294042 298386 301681 303905 305899 308160 309944 310379 310057 310612 312946 316654 320954
56286C20954M486M575M712M900M789M147L558L827M684N130N065N366O282P015
$$ 320954 325440 330015 334727 339627 344416 348563 352121 355948 360632 365762 370827 376193 382475 389490
56272C89490P131P154P410P529P465P856Q948J0203J1308J2495J3711J4566J5341
$$ 389490 396621 403775 411185 418714 426179 434035 442983 453186 464494 476989 490700 505266 520607
56259E20607J6864J9228K1799K4558K8106L2277L6159L9704M3832M8749N3760
$$ 520607 537471 556699 578498 603056 631162 663439 699598 739302 783134 831883 885643
56248H85643N8809O4544P0532P5266P8337Q0855Q3269Q4574Q4128Q2381P9212
$$ 885643 944452 1008996 1079528 1154794 1233131 1313986 1397255 1481829 1565957 1648338 1727550
56237A727550P3462O4845N4514M3107L0171J6156K765r465k1777l4386m5344n3434
$$ 1727550 1801012 1865857 1920371 1963478 1993649 2009805 2012570 2003105 1981328 1946942 1901598 1848164
56225A848164n9867o5739o9968p1518p1574p1614p1134o9194o6532o4144o1296
$$ 1848164 1788297 1722558 1652590 1581072 1509498 1437884 1366750 1297556 1231024 1166880 1105584
56214A105584n6991n2092m8052m4733m1334l8177l5737l3093k9349k5511k3043
$$ 1105584 1048593 996501 948449 903716 862382 824205 788468 755375 726026 700515 677472
56203F77472k1517j9570j7308j5733j4639j3003j0907r309q341p392o361n438
$$ 677472 655955 636385 619077 603344 588705 575702 564795 555486 547145 539753 533392 527954
56191E27954m269k696j593j652k093j869j333j362j784j961k087k468k513j722
$$ 527954 523685 520989 519396 517744 515651 513782 512449 511087 509303 507342 505255 502787 500274 498552
56177D98552q33n70l01O81J678J823J657J997K352K155K291L658N282N786N741
$$ 498552 497719 497149 496848 497529 499207 501030 502687 504684 507036 509191 511482 515140 520422 526208 531949
56162E31949O600Q151R034R106R394J0180J0934J1693J2808J3804J3962J3622
$$ 531949 538549 546700 555734 564840 574234 584414 595348 607041 619849 633653 647615 661237
56150F61237J3704J4481J5914J8295K1397K4114K6177K9010L3612L9111M4871
$$ 661237 674941 689422 705336 723631 745028 769142 795319 824329 857941 897052 941923
56139I41923N2303O2709P4871Q6890R8811J11011J21379J26798J26602J22230
$$ 941923 994226 1056935 1131806 1218696 1317507 1428518 1549897 1676695 1803297 1925527
56129A925527J14455J03516R1204Q0035P0607O1922N3747M6431L8904K9397J7978
$$ 1925527 2039982 2143498 2234702 2314737 2385344 2447266 2501013 2547444 2586348 2615745 2633723
56118B633723O390m363j4374k3309l0684l7410m5229n4819o5910p8439r1793j03650
$$ 2633723 2640113 2635750 2621376 2598067 2567383 2529973 2484744 2429925 2364015 2285576 2193783 2090133
56106B090133j11558j15206j15473j12180j04729r4176q2615p1117n9878m9571
$$ 2090133 1978575 1863369 1747896 1635716 1530987 1436811 1354196 1283079 1223201 1173630
56096A173630m0740l2837k5544j9868j6252j3085r121n716m367l710j643J098
$$ 1173630 1132890 1100053 1074509 1054641 1038389 1025304 1016183 1010467 1006100 1002390 1000747 1001845
56084A001845K415K547L263M515M996N142O436Q390R210Q883Q855R345R620J0180
$$ 1001845 1004260 1006807 1010070 1014585 1019581 1024723 1031159 1039549 1048759 1057642 1066497 1075842 1085462 1095642
56070A095642J1933J3921J4651J4759J5777J7178J7463J7093J7483J8171J7848
$$ 1095642 1107575 1121496 1136147 1150906 1166683 1183861 1201324 1218417 1235900 1254071 1271919
56059A271919J7068J7028J6939J5666J4621J5662J7538J7831J7166J7896J9900
$$ 1271919 1288987 1306015 1322954 1338620 1353241 1368903 1386441 1404272 1421438 1439334 1459234
56048A459234K1353K2369K4103K5479K4736K3137K3202K4491K4998K5339K7358
$$ 1459234 1480587 1502956 1527059 1552538 1577274 1600411 1623613 1648104 1673102 1698441 1725799
56037A725799K9996L0927L1057L2969L6196L8606M0927M5104M9611N1554N2110
$$ 1725799 1755795 1786722 1817779 1850748 1886944 1925550 1966477 2011581 2061192 2112746 2164856
56026B164856N4494N7906N9130N8924O0833O4512O6386O6326O7587P0537P2557
$$ 2164856 2219350 2277256 2336386 2395310 2456143 2520655 2587041 2653367 2720954 2791491 2864048
56015B864048P3807P6943Q1429Q4247Q5876Q9446R4440R7678R9917J04786J11662
$$ 2864048 2937855 3014798 3096227 3180474 3266350 3355796 3450236 3547914 3647831 3752617 3864279
56004C864279J16621J19963J25653J33677J40389J46005J54060J63893J71603
$$ 3864279 3980900 4100863 4226516 4360193 4500582 4646587 4800647 4964540 5136143
55995E136143J78077J87729J99857K09927K18981K32394K49595K64950K78740
$$ 5136143 5314220 5501949 5701806 5911733 6130714 6363108 6612703 6877653 7156393
55986G156393K96915L19753L41682L62701L88789M20326M51855M84046N23594
$$ 7156393 7453308 7773061 8114743 8477444 8866233 9286559 9738414 10222460 10746054
55977A0746054N70503O18451O68632P29378Q01150Q76989R59193J059356J180164
$$ 10746054 11316557 11935008 12603640 13333018 14134168 15011157 15970350 17029706 18209870
55968A8209870J314688J466347J650961J876459K141302K457246K852761L351218
$$ 18209870 19524558 20990905 22641866 24518325 26659627 29116873 31969634 35320852
55960C5320852L970605M747698N731187O943015Q381104J0075684J2115956J4618618
$$ 35320852 39291457 44039155 49770342 56713357 65094461 75170145 87286101 101904719
55952A01904719J7706432K1484720K5887705L0425225L4136701L5951791L5180229
$$ 101904719 119611151 141095871 166983576 197408801 231545502 267497293 302677522
55945C02677522L1668292K5579570J7203928P054759l953272j4568965k3525528
$$ 302677522 334345814 359925384 377129312 384184071 380230799 365661834 342136306
55938C42136306k9893800l3302284l3975216l2570524k9875627k6544067k3021497
$$ 342136306 312242506 278940222 244965006 212394482 182518855 155974788 132953291
55931A32953291j9607154j6500105j3795362j1500730r588123q020310o742591
$$ 132953291 113346137 96846032 83050670 71549940 61961817 53941507 47198916
55924D7198916n689205m811895m085620l486124k983053k557047k202926j911645
$$ 47198916 41509711 36697816 32612196 29126072 26143019 23585972 21383046 19471401
55916A9471401j665682j454683j279089j135010j010552r00019q07322p32038
$$ 19471401 17805719 16351036 15071947 13936937 12926385 12026366 11219044 10487006
55908A0487006o65345o02933n49307n05843m66176m26846l91731l62551l34994
$$ 10487006 9821661 9218728 8669421 8163578 7697402 7270556 6878825 6516274 6181280
55899F181280l07333k83385k64113k45226k25639k09622j98099j86353j72644
$$ 6181280 5873947 5590562 5326449 5081223 4855584 4645962 4447863 4261510 4088866
55890D088866j60869j52352j43108j31709j21922j15054j07186r6624q6846p9519
$$ 4088866 3927997 3775645 3632537 3500828 3378906 3263852 3156666 3060042 2973196 2893677
55880B893677p1591o1878n3811m9179m5588m2391m2766m7443n2649n6607o1889
$$ 2893677 2822086 2760208 2706397 2657218 2611630 2569239 2526473 2479030 2426381 2369774 2307885
55869B307885o8927p3427p3050p0904o9631o7498o3118n8622n5270n0993m5067
$$ 2307885 2238958 2165531 2092481 2021577 1951946 1884448 1821330 1762708 1707438 1656445 1611378
55858A611378m0438l8642l7027l3751l1038l0808l1381l1113l1198l2356l2687
$$ 1611378 1570940 1532298 1495271 1461520 1430482 1399674 1368293 1337180 1305982 1273626 1240939
55847A240939l1270l0105l0237k9726k7580k5831k5524k4500k1498j8705j7859
$$ 1240939 1209669 1179564 1149327 1119601 1092021 1066190 1040666 1016166 994668 975963 958104
55836I58104j7438j6007j4900j5133j5036j3356j1646j1331j1267j0437r983j0618
$$ 958104 940666 924659 909759 894626 879590 866234 854588 843257 831990 821553 811570 800952
55824H00952j0857r881r303j0205j1209j1270j1512j2487j2543j0845r169q778
$$ 800952 790095 780214 770911 760706 749497 738227 726715 714228 701685 690840 681671 672893
55812F72893q337o719n159m668m082k498r93j75J220L531M810M180L734M988O137
$$ 672893 664556 657837 652678 648010 643928 641430 640437 640262 641482 645013 649823 654003 657737 662725 668862
55797F68862N069K537J18k573o220r571j1182j1641j1965j1612r991q184p317
$$ 668862 673931 676468 676586 674013 667793 658222 647040 635399 623434 611822 601831 593647 586330
55784E86330o820n953n406n860o668p317q406r899j0299q793o408l933q14K778
$$ 586330 579510 573557 568151 562291 555623 548306 539900 530001 519702 510909 504501 500568 499754 502532
55770E02532N167N686N686N728M293P52k975n374p488j0265j2261j2011j0560
$$ 502532 507699 513385 519071 524799 529092 529844 526869 521495 514007 503742 491481 479470 468910
55757D68910r543q782p670o948p097o898n565m435m726n449n430n470o541p687
$$ 468910 459367 450585 442915 435967 428870 421972 416407 411972 407246 401797 396367 390897 384356 376669
55743C76669p720p269p187o682n036l463l225l483k916j962j557j256n61m32j574
$$ 376669 368949 361680 354493 347811 342775 339312 336087 332604 329688 327726 326169 324913 324352 323920 322346
55728C22346k747k726k334k743l353l325l479m560n308m406k863k183j797o01
$$ 322346 319599 316873 314539 311796 308443 305118 301639 297079 291771 287365 284502 282319 280522 279921
55714B79921N22K37m62K93K063K932K697K704L166L017K078J146L12r23k219k900
$$ 279921 280443 280680 280218 280511 282574 285506 288203 290907 294073 297090 299168 300314 300626 299703 297484 294584
55698B94584l383m477n731o084n584m977m286l329k770l048l145k017m47K37M16
$$ 294584 291201 286724 280993 274909 269325 264348 260062 256733 253963 250915 247770 245753 245306 245543 245959
55683B45959J324K717L366L270L523M304M736M427L693K582J001n35j485k153
$$ 245959 247283 250000 253366 256636 260159 264463 269199 273626 277319 279901 280902 280367 278882 276729
55669B76729k986l640l731l536l040j523P97K125J504M97Q54J973K354K187K489
$$ 276729 273743 270103 266372 262836 259796 258273 259070 261195 262699 263196 264050 266023 268377 270564 273053
55654B73053K940K720K352K572K421P62j378k262k364l362n033n760n583n984
$$ 273053 275993 278713 281065 283637 286058 286820 285442 283180 280816 277454 272421 266661 261078 255094
55640B55094o994p035n739m486m029l752l445l667m195m055l248k650k194j095
$$ 255094 248100 241065 235326 230840 226811 223059 219614 215947 211752 207697 204449 201799 199605 198510
55626A98510J77K32q39j419r54o04r75j269j120j323k114k445j784r67o76m43
$$ 198510 198687 198919 198080 196661 195707 195103 194128 192859 191739 190416 188302 185857 184073 183106 182430 181987
55610A81987P5J90o63j952k883l295l229k575j595r78r98j235j349j429j518j478
$$ 181987 182062 182252 181589 179637 176754 173459 170230 167655 166060 165082 164084 162849 161500 160071 158553 157075
55594A57075j338j103m96M23P91L8r82j012j29O76J150J642J842J107m1l58K62
$$ 157075 155737 154634 154138 154561 155352 155390 154408 153396 153267 153943 155093 156735 158577 159684 159643 159285 159547
55577A59547P87Q77J304K363L310L634L662L715L732L915M649N671O161N763M688
$$ 159547 160334 161211 162515 164878 168188 171822 175484 179199 182931 186846 191495 197166 203327 209090 213778
55562B13778L061J040p25j805k770m164n320n383m947n139n609n226m300m146
$$ 213778 216839 217879 217154 215349 212579 208415 203095 197712 192765 187626 182017 176791 172491 168345
55548A68345m594m062k255p57m96n55o2M71L90J2k31l91k25R13K654L494K721
$$ 168345 163751 159689 157434 156677 156181 155626 155564 156035 156425 156437 156206 155815 155590 156503 159157 162651 165372
55531A65372J404P45N45k5j056k059k685k780k318j675j430j662k057k538l074
$$ 165372 166776 167521 168066 168041 166985 164926 162241 159461 157143 155468 154038 152376 150319 147781 144707
55516A44707l117k239j146q95j299j347j001j083j464j029K93J148Q40L15M82
$$ 144707 141590 139351 138205 137310 136011 134664 133663 132580 131116 130087 130380 131528 132368 132683 133165
55501A33165R29R66O34J20p08j588j783j227p99r74j184r21l90J79Q18J169P25
$$ 133165 134094 135060 135694 135814 135106 133518 131735 130508 129709 128735 127551 126630 126240 126419 127237 128406 129131
55484A29131k9lO61N70p11j833j708r42n58n42m08j19L03J029J660J317J01o96
$$ 129131 129102 129099 129760 130330 129619 127786 126078 125136 124578 124036 123628 123509 123812 124841 126501 127818 127919 127223
55466A27223l99J76L40O26J437J867R94o00j616j599q91J22Q99P39k62r45n90
$$ 127223 126824 127000 127340 127966 129403 131270 132264 131664 130048 128449 127558 127680 128579 129318 129056 128111 127521
55449A27521M0j34j027j773j880j323k58P60R45K53n26r41j236j287m34J058J702
$$ 127521 127561 127427 126400 124627 122747 121424 121166 121926 122871 123124 122598 121657 120421 119134 118700 119758 121460
55432A21460Q38k96m04J19L11L10O28Q60M31j03R1O97R25R00J146J272O21k31
$$ 121460 122298 122002 121598 121717 122028 122338 122966 123826 124257 124154 124245 124942 125867 126767 127913 129185 129806 129575
55414A29575j06R07J555J359J096J311J481R98O9p26j163j384j565j718j632j154
$$ 129575 129469 130376 131931 133290 134386 135697 137178 138176 138245 137519 136356 134972 133407 131689 130057 128903
55398A28903o67q74j800k486k153j229o74o96p19l48K51P20Q58O77M55M65N93
$$ 128903 128236 127362 125562 123076 120923 119694 119020 118324 117605 117257 117508 118228 119086 119763 120218 120683 121276
55381A21276N22L92N93R16O94l6l66M9M34K04j66j92k81p72j017m24M33O83M87
$$ 121276 121798 122190 122783 123699 124393 124357 123991 124040 124474 124678 124512 124320 124039 123267 122250 121826 122259 122942 123429
55362A23429M74N28J79k92l08j22m20j115j484j326j069r60r05r11r45o25K27
$$ 123429 123903 124431 124610 124318 124010 123888 123468 122353 120869 119543 118474 117514 116609 115698 114753 114128 114355
55345A14355J011J072N90J35k11n14l27O30J603J584P57R5j64n60j120j148m77
$$ 114355 115366 116438 117028 117163 116952 116438 116111 116741 118344 119928 120685 120780 120616 120056 118936 117788 117311
55328A17311J05o9p24j152r86l81J58J29l76o19j52N09O41L40J58J06j74n58n83
$$ 117311 117416 117347 116623 115471 114485 114104 114262 114391 114015 113396 113244 113753 114394 114734 114892 114998 114824 114266 113683
55309A13683k50Q5M23R01J137O74l9n9P13J422J516J216P45Oq02j086p10k45j08
$$ 113683 113433 113518 113941 114842 115979 116653 116614 116555 117268 118690 120206 121422 122167 122173 121371 120285 119575 119330 119222
55290A19222j05K0J58J96K74L77J98l73r75j226j183j117j087q43j07R95J785
$$ 119222 119117 119137 119295 119491 119765 120142 120340 119967 118992 117766 116583 115466 114379 113536 113429 114424 116209
55273A16209J650R13O25J143J574J144M56M13N80j59j542j984q58N01O78K2r6
$$ 116209 117859 118772 119397 120540 122114 123258 123714 124127 124707 124548 123006 121022 120164 120665 121343 121365 121269
55256A21269Q05J955K457K085J120k0r44j401j361r52m52j92k81m30l25j06j49
$$ 121269 122074 124029 126486 128571 129691 129671 128727 127326 125965 125013 124561 124369 124088 123658 123333 123227 123078
55239A23078m17m46m8L56K87k14p04q30o01l00k28l62l28J25O82P75L03k40m46
$$ 123078 122661 122215 122167 122523 122810 122596 121892 121062 120461 120161 119933 119571 119243 119368 120050 120825 121128 120888 120442
55220A20442m85p26j091j049l24O66J213J143R14Q24N36k53j009q78J08R62R74
$$ 120442 119957 119231 118140 117091 116767 117433 118646 119789 120703 121527 122063 121810 120801 119923 120031 120993 121967
55203A21967L81k08n16n28l96n49j233j779j187L40J321R20ql29j57j24r6L31
$$ 121967 122348 122140 121624 121096 120700 120151 118918 117139 115952 116292 117613 118533 118525 118196 118039 117915 117819 118150
55185A18150P47M71k49o80p69q96p75J10J278J613J030N89Q80J330J298R02M63
$$ 118150 118897 119368 119119 118439 117670 116774 115999 116109 117387 119000 120030 120619 121499 122829 124127 125029 125492
55168A25492l5n86r53j004p99k91M54P83R4j095j563r61j33K51M08N54L38k87
$$ 125492 125457 124871 123918 122914 122115 121824 122278 123061 123155 122060 120497 119536 119403 119654 120062 120616 120954 120667
55150A20667n38J13J034J264Q17M66N38O74N38K35k8j90k23m2L43P25P88L57l25
$$ 120667 120129 120242 121276 122540 123357 123823 124361 125035 125573 125808 125780 125590 125367 125325 125668 126393 127181 127538 127213
55131A27213o95m37P5K01j17k89J08P45R90N80k31j056j630j799j419m48Q25J713
$$ 127213 126518 126081 126156 126357 126240 125951 126059 126804 127794 128374 128143 127087 125457 123658 122239 121791 122616 124329
55113A24329J605O31l76p57o30m52l27p0L31O78Q56Q83Q27Q65J124J315R46J43
$$ 124329 125934 126565 126189 125432 124802 124350 124023 123953 124284 124962 125818 126701 127528 128393 129517 130832 131778 131921
55095A31921k78P1N33M38J58L51P10M18m64j069j089j070j249j043l0J255J868
$$ 131921 131643 131714 132247 132685 132843 133194 133904 134322 133858 132789 131700 130630 129381 128338 128308 129563 131431
55078A31431J459M82l08m68k21j52m14n06j37J87m3m75m83k15k42n29o31o37r28
$$ 131431 132890 133372 133064 132596 132375 132223 131809 131303 131166 131353 131310 130835 130352 130137 129895 129366 128735 128098 127170
55059A27170j154n90N31J062M97m75j073j163p57K31J363J774J257N95M67P68
$$ 127170 126016 125426 125957 127019 127516 127041 125968 124805 124048 124279 125642 127416 128673 129268 129735 130503
55043A30503J094J200P37m59j635j540j01J268J442Q52M87N07N42N73P01O23Q8
$$ 130503 131597 132797 133534 133075 131440 129900 129799 131067 132509 133361 133848 134355 134897 135470 136171 136794 136882
55026A36882n31p85q63j120j270p44L62J259J307N17o06j366j281n69p1l56j098
$$ 136882 136351 135566 134703 133583 132313 131569 131931 133190 134497 135014 134408 133042 131761 131192 131121 130765 129667
55009A29667j502j177l73L78P07O89P61J115J328J027O74R97J664J513L31o29
$$ 129667 128165 126988 126615 126993 127700 128389 129150 130265 131593 132620 133294 134291 135955 137468 137799 137170
54993A37170l42O61J274J340J365J337Q09j59r31j034m55N70J524J695Q84j82
$$ 137170 136828 137489 138763 140103 141468 142805 143614 143455 142524 141490 141035 141605 143129 144824 145708 145526
54977A45526o72o28n77n22l3P84J258J093O72L52O6j97j07M71J129J363J156Q03
$$ 145526 144854 144226 143649 143127 143094 143878 145136 146229 146901 147253 147319 147122 147015 147486 148615 149978 151134 151937
54959A51937M87K12Nj80n83j262j700j194J45J266J338P55M60N47K74n43j071
$$ 151937 152424 152636 152641 152461 151878 150616 148916 147722 147867 149133 150471 151226 151686 152233 152507 151964 150893
54942A50893p25p5J12M1K85O13L49l26n19L1O90J042J445K239L214M027M540M653
$$ 150893 150168 150093 150205 150246 150531 151144 151493 151167 150648 150679 151369 152411 153856 156095 159309 163336 167876 172529
54924A72529M375M195M706N770O677P091P122O536M841K317j0j631k942m193n019
$$ 172529 176904 181099 185805 191575 198252 205343 212465 219001 223842 226159 226149 224518 221576 217383 212364
54909B12364n363n843o656p028o376n189m260l701l320l144l026k451j365n01
$$ 212364 207001 201158 194502 187474 181098 175909 171649 167948 164628 161484 158458 156007 154642 154141
54895A54141k91k05K43N94L58M7M23J281J878K025J988J814J609K009L438N244
$$ 154141 153850 153645 153888 154482 154840 154887 155310 156591 158469 160494 162482 164296 165905 167914 171352 176596
54879A76596O426O829O855O497N571M514L910L389K017l26k724m365n187n434
$$ 176596 183022 189851 196706 203203 208774 213288 217198 220587 222604 222278 219554 215189 210002 204568
54865B04568n395n470n841o111n796n033m234l336k156j141r42j343j499j185
$$ 204568 199173 193703 187862 181751 175955 170922 166688 163352 161196 160055 159113 157770 156271 155086
54851A55086j023j364j806j937j873j862j875j814j663j327p35q6L50N84O99N28
$$ 155086 154063 152699 150893 148956 147083 145221 143346 141532 139869 138542 137807 137721 138071 138655 139354 139882
54835A39882k6n54n91k88r1K3L13N84M64K08L90Q98J028O00J01k35o13r09o17
$$ 139882 139856 139302 138711 138423 138332 138355 138668 139252 139716 139924 140314 141212 142240 142840 142941 142706 142093 141184 140567
54816A40567K08P98O91K16k30n58m74M26J693K067J073k32p35o65p57p51J53J727
$$ 140567 140775 141573 142264 142480 142250 141692 141218 141644 143337 145404 146477 146245 145510 144845 144088 143337 143490 145217
54798A45217K660K183Q65k88q49r03n94o1N38J173J809K035J289j67j001j44J754
$$ 145217 147877 150060 150925 150637 149788 148885 148291 148230 148768 149941 151750 153785 155074 154907 153906 153762 155516
54781A55516K875K346J206R47J677K301K148J658J505J821K468L481M851O280
$$ 155516 158391 160737 161943 162890 164567 166868 169016 170674 172179 174000 176468 179949 184800 191080
54767A91080P435Q147Q258P632O542N491M474K919P05j374k627l408m461n764
$$ 191080 198515 206662 214920 222552 229094 234585 239059 241978 242683 241309 238682 235274 230813 225049
54753B25049o705p027o950o548n753m795m035l443k813k320k265k346j969j257
$$ 225049 218344 211317 204367 197819 192066 187271 183236 179793 176980 174660 172395 170049 168080 166823
54739A66823j025j569k072j583j65J191J680J412J173J498K140K601L024M031
$$ 166823 165798 164229 162157 160574 160409 161600 163280 164692 165865 167363 169503 172104 175128 179159
54725A79159N579O695O688O025N464M968M159L238K528J510n82l363n411n906
$$ 179159 184738 191433 198121 204146 209610 214578 218737 221975 224503 226013 225431 222068 216657 210751
54711B10751n321m598m311m613n200n283m350k994k249k192j981j265o08m47n29
$$ 210751 205430 200832 196521 191908 186708 181425 177075 174081 171832 169640 167659 166394 165786 165339 164810
54696A64810n65n92n66l71l85j077j981k057j281p70j044j297r45o12p98p64K22
$$ 164810 164245 163653 163087 162716 162331 161254 159273 157216 155935 155165 154121 152824 151879 151267 150469 149705 149927
54679A49927J393J482N58k63m83m70l38J72P90Q19K71k1L35P41N66n5o61j108
$$ 149927 151320 152802 153360 153097 152614 152144 151806 151978 152768 153587 153858 153837 154172 154913 155479 155424 154763 153655
54661A53655j416j467j243r79p93m35K38Q68J022P96O56P35P09L26k34o67r16
$$ 153655 152239 150772 149529 148550 147757 147322 147560 148428 149450 150246 150902 151637 152346 152672 152438 151771 150855
54644A50855j036r47n06J73P58R85P99K96k34l26J77P24N57k44p48m02K28L24
$$ 150855 149819 148872 148366 148539 149297 150282 151081 151377 151143 150817 150994 151718 152275 152031 151283 150881 151109 151433
54626A51433o4l29l00k63k48nL54L42k12r59j500j659j354o80n8K10M64J193K107
$$ 151433 151369 151040 150740 150477 150229 150224 150578 150920 150708 149749 148249 146590 145236 144556 144498 144708 145172 146365 148472
54607A48472K365J693O30l40j116j400p23N56J145L43r59j322m68O60J188J128
$$ 148472 150837 152530 153160 152820 151704 150304 149581 150137 151282 151625 150666 149344 148876 149536 150724 151852
54591A51852J007J158J375J184M23m35q42q69r82j181j015n13l28p28j056o78
$$ 151852 152859 154017 155392 156576 156999 156564 155722 154853 153871 152690 151675 151162 150834 150106 149050 148372
54575A48372J00N25M00J35P4K41M65M38k9n67m32N15J417J411O76j7l85o82r48
$$ 148372 148472 148997 149397 149532 149606 149847 150312 150750 150721 150154 149722 150237 151654 153065 153741 153724 153339 152657 151709
54556A51709q81m48q5j30m27n53k33M91J245J507J034J95l07q0O14J192J411J564
$$ 151709 150828 150380 150295 150165 149738 149185 148952 149443 150688 152195 153229 153424 153117 153037 153651 154843 156254 157818
54538A57818J916K107J466P9r47p19L64J255J608J700J363J35j486k138j334k05
$$ 157818 159734 161841 163307 163386 162439 161720 162084 163339 164947 166647 168010 168145 166659 164521 163187 162982
54522A62982J08j10O5O74R84O90R3n15r98j073n37K88Q27R04O88K89k32n97n63
$$ 162982 163090 162980 163045 163719 164703 165393 165486 164971 163973 162900 162363 162651 163478 164382 165070 165359 165127 164530 163967
54503A63967l00j27r6j44l25n16k55N81J249R34o2o64m20M6R2o9J35P34J166R84
$$ 163967 163667 163540 163444 163300 162975 162459 162204 162785 164034 164968 164906 164242 163822 163868 163960 163891 164026 164760 165926 166910
54483A66910L54j67j94J34M20M44K36j52o21p98k86P58J668K011J875J450P93
$$ 166910 167264 167097 166903 167037 167457 167901 168137 167985 167364 166566 166280 167038 168706 170717 172592 174042 174835
54466A74835J59k1J93K22j71n14m72m01o01o83k87J78J79p9j50j80m45n19Q3Q14
$$ 174835 174994 174973 175166 175388 175217 174703 174231 173830 173229 172546 172259 172437 172616 172537 172387 172207 171762 171243 171326 172140
54446A72140O65k77q83o68l53n63q75o23M0M60L53l1l66m80l76k25k44l86l57
$$ 172140 172805 172528 171645 170977 170624 170061 169186 168563 168603 169063 169416 169385 169019 168539 168163 167938 167694 167308 166951
54427A66951j6L89M97K01k50l98N3R01J560J672J476J367J305R66L04l46o05l59
$$ 166951 166935 167324 167821 168022 167772 167374 167427 168328 169888 171560 173036 174403 175708 176674 176978 176632 176027 175668
54409A75668J82M68P5o83r21l13L34J76m57n26K51J137J429J275J264J740K491
$$ 175668 175850 176318 176393 175710 174789 174476 174810 174986 174529 174003 174254 175391 176820 178095 179359 181099 183590
54392A83590K850K150N16r60j228l77O19R94O03m33j789k747k664j702o85j51
$$ 183590 186440 188590 189106 188146 186918 186541 187160 188154 188757 188324 186535 183788 181124 179422 178737 178586
54376A78586j2J8J03L63P09O99N5p24q66l64J19L05O19J269J746J505P10l5l47
$$ 178586 178574 178592 178695 179058 179767 180466 180521 179797 178931 178567 178686 178991 179610 180879 182625 184130 184840 184805 184458
54357A84458k73r0p7l30p20j070j212q82N6J092J367Q65O17J199J674R59m16j058
$$ 184458 184185 184095 184018 183688 182968 181898 180686 179804 179860 180952 182319 183184 183801 185000 186674 187633 187217 186159
54339A86159p62n43q17r61p32o95j013j037n67k54l01K7R79J568J082K89L08J035
$$ 186159 185397 184854 184037 183076 182344 181649 180636 179599 179032 178778 178477 178504 179483 181051 182133 182422 182730 183765
54321A83765J640J924K189K359K107J553J073P63O94J154J975K158R80q31j925
$$ 183765 185405 187329 189518 191877 193984 195537 196610 197373 198067 199221 201196 203354 204334 203503 201578
54306B01578j940j631j638j920k131j914j030J37N41k81j366j506q79o11r67j157
$$ 201578 199638 198007 196369 194449 192318 190404 189374 189511 190052 189771 188405 186899 186020 185409 184442 183285
54290A83285p99m48m27k62L88J084J354J311J132O19k69j064j457j743k132k147
$$ 183285 182486 182038 181611 181349 181737 182821 184175 185486 186618 187237 186968 185904 184447 182704 180572 178425
54274A78425j332j37N62O01N52Q15J187J354J283J122R79Q82P55M39l1l42k87
$$ 178425 177093 176956 177518 178119 178671 179486 180673 182027 183310 184432 185411 186293 187048 187487 187456 187114 186827
54257A86827n6R4K67O75J131J283J176J069Q17Q1q12r97l74K3n24j310j297p66
$$ 186827 186771 186865 187132 187807 188938 190221 191397 192466 193283 193364 192552 191555 191181 191204 190680 189370 188073 187307
54239A87307q25j552j796r12L56J052J098P86Q1q29j103k80P44P42k00r00p98
$$ 187307 186482 184930 183134 182222 182578 183630 184728 185514 185595 184766 183663 183383 184127 184869 184669 183769 182971
54222A82971m65m51n53m62l13k38m8K96L88km73m72m9K64J13k97m56l6P51J328
$$ 182971 182506 182055 181502 181040 180727 180489 180441 180737 181125 181123 180650 180178 180129 180393 180506 180209 179753 179717 180468 181796
54202A81796J324Q66J56q25j850k114j075N61J466J257P33N79O60P12Q53J100
$$ 181796 183120 183986 184142 183317 181467 179353 178278 178839 180305 181562 182295 182874 183534 184246 185099 186199
54186A86199J135Q92P23O53K44m72p36k85lo17j422j169J65J387J601J006L02
$$ 186199 187334 188226 188949 189602 189846 189374 188638 188353 188350 187733 186311 185142 185307 186694 188295 189301 189603
54169A89603o0j5K12L32L28L91L88j72j316k275k405j991j633j329p96k24N2K27
$$ 189603 189543 189528 189740 190072 190400 190791 191179 191007 189691 187416 185011 183020 181387 180058 179262 179038 179090 179317
54151A79317O04P62M2j283k174k171j757j383q60M7J078J791K018J853J567J469
$$ 179317 179921 180683 180725 179442 177268 175097 173340 171957 171097 171144 172222 174013 176031 177884 179451 180920
54135A80920J549J340N94j37k27J5k43j008j415j073n74l80j26O09J471J885J883
$$ 180920 182469 183809 184403 184266 184039 184054 183811 182803 181388 180315 179741 179361 179235 179844 181315 183200 185083
54118A85083J860J832J502Q72L98N22J203J862J826J055K86J73M21K47l70o59
$$ 185083 186943 188775 190277 191149 191547 192069 193272 195134 196960 198015 198301 198474 198895 199142 198772 198113
54102A98113l14Lk82q44j124j187j319j294p41Q7N74N92N62P18Q93R30Q57O13
$$ 198113 197799 197802 197520 196676 195552 194365 193046 191752 191011 191098 191672 192264 192826 193544 194437 195367 196224 196837
54084A96837L8p65j326j198l75O13J039N88k27n05K8P62J084J107J163J114P06
$$ 196837 196875 196110 194784 193586 193211 193824 194863 195451 195224 194719 194747 195509 196593 197700 198863 199977 200683
54067B00683K93M37R30R43K91k46n3M78O16L10P3J13K03K59N61J232J877J956
$$ 200683 200976 201413 202343 203286 203577 203331 203278 203756 204372 204682 204755 204868 205071 205330 205891 207123 209000 210956
54049B10956J470J037J191J802K294K458K709L457M437N079N305N568O106O631
$$ 210956 212426 213463 214654 216456 218750 221208 223917 227374 231811 236890 242195 247763 253869 260500
54035B60500O921P209P691Q026P758P061O569O569O702O446N607M338L047K303
$$ 260500 267421 274630 282321 290347 298105 305166 311735 318304 325006 331452 337059 341397 344444 346747
54021C46747K417L003L257K822K130J726J609J358O57n19j986l362m243m576m711
$$ 346747 349164 352167 355424 358246 360376 362102 363711 365069 365726 365207 363221 359859 355616 351040 346329
54006C46329m775m391l310k069j471j501j243J40K752O193R835J2765J4017J3197
$$ 346329 341554 337163 333853 331784 330313 328812 327569 327709 330461 336654 346489 359254 373271 386468
53992C86468J0729P292L281j070n419r386j2630j4753j5424j4782j3461j2002
$$ 386468 397197 404489 407770 406700 401281 391895 379265 364512 349088 334306 320845 308843
53980C08843j0524r029p704o654n709m767m050l733l583l255k684j951j066j71
$$ 308843 298319 289290 281586 274932 269223 264456 260406 256673 253090 249835 247151 245200 244134 243963
53966B43963L42K90J6j73m78j121j673j491o97n7P6J65P37J711K642L217L366
$$ 243963 244305 244595 244611 244438 243960 242839 241166 239675 238978 238921 238997 239162 239899 241610 244252 247469 250835
53949B50835L160K794K481K282K156K153K429L055L956M917N502N319M567M047
$$ 250835 253995 256789 259270 261552 263708 265861 268290 271345 275301 280218 285720 291039 295606 299653
53935B99653M237M662M656M395M554N136N419N080M562M218L855L360L092L346
$$ 299653 303890 308552 313208 317603 322157 327293 332712 337792 342354 346572 350427 353787 356879 360225
53921C60225L908M542N302O106O501O358O285O882P923Q746R156R402R556R377
$$ 360225 364133 368675 373977 380083 386584 392942 399227 406109 414032 422778 431934 441336 450892 460269
53907D60269Q729P633O063M002J758j10j201j534j550j878k864m145m917m854
$$ 460269 468998 476631 482694 486696 488454 488344 487143 485609 484059 482181 479317 475172 470255 465401
53893D65401m495m516m996n615o252o943p556p952q299q838r463r874r927r565
$$ 465401 460906 456390 451394 445779 439527 432584 425028 417076 408777 399939 390476 380602 370675 361110
53879C61110q620p116n594m625m132l664l144k898k980l084l127l355l752l887
$$ 361110 352490 345374 339780 335155 331023 327359 324215 321317 318337 315253 312126 308771 305019 301132
53865C01132l528l029k833k922k989k869k614k292j956j659j456j400j540j783
$$ 301132 297604 294575 291742 288820 285831 282962 280348 278056 276100 274441 272985 271585 270045 268262
53851B68262j821j471r78p56q71j071j187j194r45l17M54J031J557K461L638M385
$$ 268262 266441 264970 263992 263236 262365 261294 260107 258913 257968 257651 258105 259136 260693 263154 266792 271177
53835B71177M351M052M229N229P175J0140J3790J7279J9958K1680K2102K0354
$$ 271177 275528 279580 283809 289038 296213 306353 320143 337422 357380 379060 401162 421516
53823D21516J6019R994L687k285p947j2853j6020j6936j6030j4149j2128j0624
$$ 421516 437535 447529 451216 448931 440984 428131 412111 395175 379145 364996 352868 342244
53811C42244r532p767m472n01K311L543M720P001R404J0203R251P847O787N708
$$ 342244 332712 324945 320473 319972 322283 325826 330546 337547 346951 357154 366405 374252 381039 386747
53797C86747M270K871J897J062l1j150j698j513j064r52j385k059k495k517k404
$$ 386747 391017 393888 395785 396847 396816 395666 393968 392455 391391 390439 389054 386995 384500 381983 379579
53782C79579k492k751k898k867k960l457m268m969n195n017m946n378o071o349
$$ 379579 377087 374336 371438 368571 365611 362154 357886 352917 347722 342705 337759 332381 326310 319961
53768C19961n956n425n356n614n569m880l803k836k419k756l547m006l552k484
$$ 319961 314005 308580 303224 297610 292041 287161 283358 280522 278103 275347 271800 267794 264242 261758
53754B61758j619j414j692k100k301j953j043k00o0m30n90l97l27l89N6J134J988
$$ 261758 260139 258725 257033 254933 252632 250679 249636 249436 249376 248946 248356 247959 247632 247243 247299 248433 250421
53737B50421J944J490J418J625J471Q53J28n93j394j960j860j346j073j050n63
$$ 250421 252365 253855 255273 256898 258369 259222 259350 258757 257363 255403 253543 252197 251124 250074 249511
53722B49511O64J959K553K459K146J828J453J073Q42Q06R21J197J568J750J494
$$ 249511 250175 252134 254687 257146 259292 261120 262573 263646 264488 265294 266215 267412 268980 270730 272224
53707B72224R93P46R88J445J784K162K975M085M679M209L192K656K882L227L105
$$ 272224 273217 273963 274951 276396 278180 280342 283317 287402 292081 296290 299482 302138 305020 308247 311352
53692C11352K621K085J470O88n0n28p93q95p02l07j78m65n97p1O73Q09K08n52
$$ 311352 313973 316058 317528 318216 318166 317638 316845 315950 315248 314941 314763 314298 313701 313630 314303 315112 315320 314768
53674C14768j106j477j546j058k17L69M12R0m85j323k045k000j143k31J18L2r3
$$ 314768 313662 312185 310639 309581 309364 309733 310145 310235 309750 308427 306382 304382 303239 303008 303126 303158 303065
53657C03065k23m94p77q33o37l16J5K53K99K37K48K99J88l1j6L82Q66J082R77
$$ 303065 302842 302348 301571 300738 300101 299785 299800 300053 300352 300589 300837 301136 301324 301293 301277 301659 302525 303607 304584
53638C04584P67P91J338K291K963K694J654O55J91J23K60O44J152J404J336J358
$$ 304584 305351 306142 307480 309771 312734 315428 317082 317737 317928 318051 318311 318955 320107 321511 322847 324205
53622C24205J686K047K241K487K957L428L743M100M562M747M427L999L943M194
$$ 324205 325891 327938 330179 332666 335623 339051 342794 346894 351456 356203 360630 364629 368572 372766
53608C72766M361M275L947L411K909K845L213L472L297K996K823K472J728J017
$$ 372766 377127 381402 385349 388760 391669 394514 397727 401199 404496 407492 410315 412787 414515 415532
53594D15532O87L19m99j248j165n30l37q53j375j397j142r20p11n46o59j050j408
$$ 415532 416219 416538 416039 414791 413626 413096 412759 411906 410531 409134 407992 407072 406361 405815 405156 404106 402698
53577D02698j609j806k015k082k084k264k557k661k552k387k015j246n34n84j176
$$ 402698 401089 399283 397268 395186 393102 390838 388281 385620 383068 380681 378666 377420 376886 376302 375126
53562C75126j225k63R11J372J127O69K23j5L46J227J766J429R39J321K363K959
$$ 375126 373901 373638 374549 375921 377048 377717 377940 377925 378271 379498 381264 382693 383632 384953 387316 390275
53546C90275K799K771L559M734N561O000O426O896P264P738Q668R797J0240R450
$$ 390275 393074 395845 399404 404138 409699 415699 422125 429021 436285 444023 452691 462488 472728 482178
53532D82178P922O662O124N907N578N345N746O758P662P878P621P545P908Q454
$$ 482178 490100 496762 502886 508793 514371 519716 525462 532220 539882 547760 555381 562926 570834 579288
53518E79288R006R866J1364J3311J5078J6240J6920J7502J8258J9289K0680K2380
$$ 579288 588294 598160 609524 622835 637913 654153 671073 688575 706833 726122 746802 769182
53506G69182K4052K5189K5516K5137K4364K3509K2811K2299K1739K0962K0204
$$ 769182 793234 818423 843939 869076 893440 916949 939760 962059 983798 1004760 1024964
53495A024964J9875J9924J9856J9440J9030J9006J9195J9242J9080J8727J8021
$$ 1024964 1044839 1064763 1084619 1104059 1123089 1142095 1161290 1180532 1199612 1218339 1236360
53484A236360J7017J6354J6630J7581J8401J8703J8579J7984J6771J5336J4359
$$ 1236360 1253377 1269731 1286361 1303942 1322343 1341046 1359625 1377609 1394380 1409716 1424075
53473A424075J3783J2701J0635Q168N987L873J208j919m727o696q103r600j1472
$$ 1424075 1437858 1450559 1461194 1469362 1475349 1479222 1480430 1478511 1473784 1467088 1458985 1449385 1437913
53460A437913j3260j4129j3891j3509j4118j5536j6476j6414j6420j7596j9482
$$ 1437913 1424653 1410524 1396633 1383124 1369006 1353470 1336994 1320580 1304160 1286564 1267082
53449A267082k0733k0846k0362j9761j9131j8698j8726j8844j8318j7108j5881
$$ 1267082 1246349 1225503 1205141 1185380 1166249 1147551 1128825 1109981 1091663 1074555 1058674
53438A058674j4841j3384j1186q852p034n555l972k457j463q51kJ332K812M099
$$ 1058674 1043833 1030449 1019263 1010411 1003377 997822 993850 991393 989930 989079 989077 990409 993221 997320
53424I97320N175O049O647P081P796R181J1124J3109J4697J5927J7177J8713K0382
$$ 997320 1002495 1008544 1015191 1022272 1030068 1039249 1050373 1063482 1078179 1094106 1111283 1129996 1150378
53411A150378K1924K3399K5059K6824K8188K8831K9115K9786L1324L3658L6376
$$ 1150378 1172302 1195701 1220760 1247584 1275772 1304603 1333718 1363504 1394828 1428486 1464862
53400A464862L9056M1450M3518M5273M6687M7906M9345N1203N2966N3915N4110
$$ 1464862 1503918 1545368 1588886 1634159 1680846 1728752 1778097 1829300 1882266 1936181 1990291
53389A990291N4299N4723N4772N4114N3403N3159N2682N0954M8229M5672M3651
$$ 1990291 2044590 2099313 2154085 2208199 2261602 2314761 2367443 2418397 2466626 2512298 2555949
53378B555949M1382L8305L4744L1018K6932K2501J8331J4745J1205P175K892j311
$$ 2555949 2597331 2635636 2670380 2701398 2728330 2750831 2769162 2783907 2795112 2802287 2805179 2803868
53366B803868n899j1545j8060k4604l0760l6690m2347m7180n0690n2814n3816
$$ 2803868 2797969 2786424 2768364 2743760 2713000 2676310 2633963 2586783 2536093 2483279 2429463
53355B429463n4106n4172n4271n4180n3456n1846m9394m6482m3929m2594m2429
$$ 2429463 2375357 2321185 2266914 2212734 2159278 2107432 2058038 2011556 1967627 1925033 1882604
53344A882604m2389m1705m0841m0557m0643m0321l9522l8686l7615l5584l2652
$$ 1882604 1840215 1798510 1757669 1717112 1676469 1636148 1596626 1557940 1520325 1484741 1452089
53333A452089k9757k7401k5193k2906k0966j9498j7983j6291j5201j5185j5520
$$ 1452089 1422332 1394931 1369738 1346832 1325866 1306368 1288385 1272094 1256893 1241708 1226188
53322A226188j5291j4636j4220j4089j3782j3150j2334j1295j0028q897q096p130
$$ 1226188 1210897 1196261 1182041 1167952 1154170 1141020 1128686 1117391 1107363 1098466 1090370 1083240
53310A083240n444l291j317L56K004L534M660N616O911Q509R963J1285J2948J4948
$$ 1083240 1077796 1074505 1073188 1073544 1075548 1079082 1083742 1089358 1096269 1104778 1114741 1126026 1138974 1153922
53296A153922J6623J7529J8048J8913K0512K2648K4667K5919K6439K6902K7545
$$ 1153922 1170545 1188074 1206122 1225035 1245547 1268195 1292862 1318781 1345220 1372122 1399667
53285A399667K7598K6356K4386K2793K1630K0032J7759J5460J3427J1219Q736
$$ 1399667 1427265 1453621 1478007 1500800 1522430 1542462 1560221 1575681 1589108 1600327 1609063
53274A609063O548M709K332j087m756p694r944j2069j4090j5698j7069j8701k0736
$$ 1609063 1615611 1620320 1622652 1621565 1616809 1609115 1599171 1587102 1573012 1557314 1540245 1521544 1500808
53261A500808k2938k5045k6665k7268k6843k6223k6273k6986k7845k8582k9057
$$ 1500808 1477870 1452825 1426160 1398892 1372049 1345826 1319553 1292567 1264722 1236140 1207083
53250A207083k8881k7852k6538k5729k5508k5394k5149k4865k4506k4005k3672
$$ 1207083 1178202 1150350 1123812 1098083 1072575 1047181 1022032 997167 972661 948656 924984
53239I24984k3856k4251k4188k3504k2538k1448k0173j8973j8174j7347j5611
$$ 924984 901128 876877 852689 829185 806647 785199 765026 746053 727879 710532 694921
53228F94921j2942j0458r097q657q487q412q583q949r425j0160j1125j1766j1607
$$ 694921 681979 671521 662424 653767 645280 636868 628285 619336 609911 599751 588626 576860 565253
53215E65253j1001j0789j1242j1875j2170j2076j1748j1138j0104q752p510o785
$$ 565253 554252 543463 532221 520346 508176 496100 484352 473214 463110 454358 446848 440063
53203D40063o546o340n862n435n534n927n742m714l818m143n419o295n955m865
$$ 440063 433517 427177 421315 415880 410346 404419 398677 393963 390145 386002 380583 374288 368333 363468
53189C63468l884l319l088l188l493l474k764j829j556k142k893l138k890k480
$$ 363468 359584 356265 353177 349989 346496 343022 340258 338429 336873 334731 331838 328700 325810 323330
53175C23330k008j506j198j233j328j140p79o03n69l25J78O08Q73J157J245M91
$$ 323330 321322 319816 318618 317385 316057 314917 314138 313535 312966 312641 312819 313427 314300 315457 316702 317193
53159C17193j133k488k491j478p24p38q47m65O1J32k39o87j141j627j828j368
$$ 317193 316060 313572 311081 309603 308879 308141 307294 306829 306890 307022 306783 306096 304955 303328 301500 300132
53143C00132m90J14J08k30n00n79m58j70M2j68p62j226j164p81n62o65q50q22
$$ 300132 299642 299756 299864 299634 299134 298555 298097 297927 297969 297801 297039 295813 294649 293868 293306 292641 291791 290969
53125B90969m28L09J099J430J075M03j6q7j47l09l06oL18M20M35N69P10O49M01
$$ 290969 290541 290850 291949 293379 294454 294857 294841 294754 294607 294298 293992 293986 294304 294724 295159 295728 296438 297087 297488
53106B97488O4m36j066j410j120n38l99q58j264j078n82m48q47j332j445j197
$$ 297488 297552 297116 296050 294640 293520 292982 292583 291725 290461 289383 288801 288353 287506 286174 284729 283532
53090B83532r68j100j544j816j424m67L42L51l77j214j622j492j021n19k99m24
$$ 283532 282564 281464 279920 278104 276680 276213 276555 276906 276529 275315 273693 272201 271180 270661 270362 269938
53074B69938m95k2Q33J229O40l43o05J28R70J003L64j06R1P28J255J237M87o31
$$ 269938 269443 269421 270254 271483 272123 271780 271175 271303 272273 273276 273640 273534 273625 274353 275608 276845 277332 276701
53056B76701j213o60M40Q61L45k8O19J715K116J696J286J320J434J300J031O52
$$ 276701 275488 274828 275268 276129 276474 276446 277065 278780 280896 282592 283878 285198 286632 287932 288963 289615
53040B89615n4r35j339j050p42j067j694j813j279o93n00n02l36mJ90M5l75q40
$$ 289615 289561 288626 287287 286237 285495 284428 282734 280921 279642 278949 278449 277947 277611 277607 277797 277842 277467 276627
53022B76627j210j476j610j376m94Q89K154K678K302J340L17k52j60K57M03Q9
$$ 276627 275417 273941 272331 270955 270461 271350 273504 276182 278484 279824 280141 279889 279729 279986 280389 280478
53006B80478k88l18j08J6j7j54m99j015j178m78P31J441J222P93R87J545J484
$$ 280478 280190 279872 279764 279780 279763 279609 279110 278095 276917 276439 277170 278611 279833 280626 281613 283158 284642
52989B84642N08n22p59m80n31r41q35K27J472J924J657J399J301Q22j12p23l66
$$ 284642 285150 284628 283869 283389 282858 281917 281082 281309 282781 284705 286362 287761 289062 289884 289772 289049 288683
52972B88683O41J530J935K011K013K153K442K464J657J74r98j139o50l48l40j81
$$ 288683 289324 290854 292789 294800 296813 298966 301408 303872 305529 305703 304705 303566 302916 302568 302228 302047
52956C02047J63K44j08n72r21j178j200p46j13p3q58j749j970j663j458j491j366
$$ 302047 302210 302454 302346 301774 300853 299675 298475 297729 297616 297543 296685 294936 292966 291303 289845 288354 286988
52939B86988r80p08p30p00l81j42l60n71O0J376K024J063p21j705j350m89J6R7
$$ 286988 286008 285300 284570 283870 283489 283347 282987 282416 282476 283852 285876 286939 286218 284513 283163 282674 282690 282787
52921B82787j74r56j938k073q25Q61J554J010J76j72j14p4l40r96j734j807q05
$$ 282787 282613 281657 279719 277646 276821 277682 279236 280246 280422 280250 280136 280062 279722 278726 276992 275185 274380
52904B74380N73J179Q19L03J17p9m93o12jR52J570J631J212M01l60l03O40J310
$$ 274380 274953 276132 276951 277254 277371 277292 276799 276187 276186 277138 278708 280339 281551 281952 281592 281289 281929 283239
52886B83239O16r19j744j249l30L6j29l68o74j220j700j624j028l96R9O63J245
$$ 283239 283855 282936 281192 279943 279613 279649 279520 279152 278478 277258 275558 273934 272906 272510 272609 273272 274517
52869B74517J362Q37K57K70P18R18P36P79J457K299K536K084J567J497J750J826
$$ 274517 275879 276716 276973 277243 277961 278879 279615 280394 281851 284150 286686 288770 290337 291834 293584 295410
52853B95410J379M21p59j840k633l087l167k932k668k682k903k971k830k839l033
$$ 295410 296789 297210 296451 294611 291978 288891 285724 282792 280124 277442 274539 271568 268738 265899 262866
52838B62866k748j529l9N56k3r70j574j793j644q21N87J657J560O23j06k12k19
$$ 262866 260118 258589 258550 259106 259083 258113 256539 254746 253102 252281 252868 254525 256085 256708 256602 256390 256171
52821B56171n64q73n60K16O29K28m83o18R3J156J994K516K905L143L026K456J572
$$ 256171 255607 254734 254174 254390 255019 255247 254764 254146 254239 255395 257389 259905 262810 265953 268979 271435 273007
52804B73007O70Q6o8j81q48k047k971l027k645k551k575j981q22j05m13j138j384
$$ 273007 273677 273763 273695 273514 272666 270619 267648 264621 261976 259425 256850 254869 254047 253942 253529 252391 251007
52787B51007j000l32M48J179J427R98M68N81J216J535J142N81N06Q03Q30L34k39
$$ 251007 250007 249675 250123 251302 252729 253727 254195 254776 255992 257527 258669 259250 259756 260559 261389 261723 261484
52770B61484l64j63j39k84Q6J327K597K659J431J62j34K08K28k94p51o78l02j50
$$ 261484 261120 260957 260818 260534 260620 261947 264544 267203 268634 268796 268662 268870 269098 268804 268053 267375 267073 266923
52752B66923m53j007j423j521j412j208p95j17M59N20L18M99J132J532J312R23
$$ 266923 266470 265463 264040 262519 261107 259899 259104 258987 259446 259966 260284 260783 261915 263447 264759 265682
52736B65682Q31P91M73J67L09P40J055J318J707J855J339N53K56M18L56n6k58
$$ 265682 266513 267304 267777 267944 268253 268993 270048 271366 273073 274928 276267 276820 277076 277494 277850 277794 277536
52719B77536j44l38j036j463r71M3Q33J268J506J359O61j5R3Q48J291R44L73K91
$$ 277536 277392 277054 276018 274555 273584 273627 274460 275728 277234 278593 279254 279239 279332 280180 281471 282415 282788 283079
52701B83079O07O97L32r5j55N9J33q4k97k00P4J44r9l57l01J51Q86J643J911J239
$$ 283079 283686 284383 284715 284620 284465 284524 284657 284573 284276 284076 284150 284294 284195 283838 283537 283688 284574 286217 288128 289367
52681B89367j59j368j619r96j16O15J086J121O33lj79J96O29P43O51M81O2o22
$$ 289367 289208 287840 286221 285225 285109 285724 286810 287931 288564 288561 288382 288578 289207 289950 290601 291082 291144 290522
52663B90522j106r90n49l48m11k94J34N35P23R83J546K157K353J925R63k62j323
$$ 290522 289416 288426 287877 287529 287118 286824 286958 287493 288216 289199 290745 292902 295255 297180 298143 297881 296558
52646B96558j853j932j999k166k069j576j173j235j309p82Q7M81L01K87Q35J472
$$ 296558 294705 292773 290774 288608 286539 284963 283790 282555 281246 280464 280551 281032 281333 281620 282455 283927
52630B83927J819K336L494M706M868L770K333J397Q08l8j185k074k351k346k548
$$ 283927 285746 288082 291576 296282 301150 304920 307253 308650 309458 309420 308235 306161 303810 301464 298916
52615B98916k871k758j985j011l59K3M53Q39P33O7o58r29o58o3N10O71L56J48
$$ 298916 296045 293287 291302 290291 289932 289955 290408 291247 291980 292047 291389 290460 289802 289739 290249 290920 291276 291424
52597B91424O64J551J737R56K81O27J404J446P98O10J385K255K245J469P18M19
$$ 291424 292088 293639 295376 296332 296613 297240 298644 300090 300888 301498 302883 305138 307383 308852 309570 309989
52581C09989M72P17J104J495J679J547J123M44l79j068j335j120o52k64j88m30
$$ 309989 310461 311178 312282 313777 315456 317003 318126 318570 318191 317123 315788 314668 314016 313752 313564 313134
52565C13134p80r80r71r14r66j053r84p76p31j109j677j829j230k53L90M05J20
$$ 313134 312354 311374 310403 309489 308523 307470 306486 305710 304979 303870 302193 300364 299134 298881 299271 299676 299796
52548B99796l1J7L1j56m81o48k96O71J775K240J711O01l73q10p88n98n38p59j077
$$ 299796 299765 299782 299813 299657 299176 298528 298232 298903 300678 302918 304629 305230 304857 304047 303259 302661 302123 301364 300287
52529C00287j057m46M86J185J291Q67L02N0L26R28J452J642J482R94L41M3O58
$$ 300287 299230 298784 299270 300455 301746 302613 302915 302965 303291 304219 305671 307313 308795 309789 310130 310173 310831
52512C10831K062L434M077L988L465K651J657P33l0q44j767k491k858l139l464
$$ 310831 312893 316327 320404 324392 327857 330508 332165 332898 332868 332024 330257 327766 324908 321769 318305
52497C18305l424k746j914j515j358r16k54J07J42K77N45N30J75q4m9L1O5L03
$$ 318305 314881 312135 310221 308706 307348 306432 306178 306285 306427 306704 307249 307779 307954 307870 307821 307852 307917 308220
52479C08220P40R69Q59P93J026J326J507J746K138K394K322K187K254K413K535
$$ 308220 308960 309929 310788 311581 312607 313933 315440 317186 319324 321718 324040 326227 328481 330894 333429
52464C33429K765L135L209K673J852J205N27p68k600m056m385l816l161k874k765
$$ 333429 336194 339329 342538 345211 347063 348268 348795 348027 345427 341371 336986 333170 330009 327135 324370
52449C24370k544k328k456k930l323l272k809k117j206j09Q29J196R75M94Nl32
$$ 324370 321826 319498 317042 314112 310789 307517 304708 302591 301385 301276 302105 303301 304276 304770 304775 304443
52433C04443k87K23P68P74K42k72m13l19j47J16L13J54k07j96K94O24L95J63O38
$$ 304443 304156 304379 305147 305921 306163 305891 305478 305159 305012 305128 305441 305595 305388 305192 305486 306110 306505 306668 307306
52414C07306J628K379K748L301M293N212N594N782O526P984R462J0157J0006R559
$$ 307306 308934 311313 314061 317362 321655 326867 332461 338243 344769 352753 362215 372372 382378 391937
52400C91937R047P842N122J063l021n862p280p909q176p985p278o427n807n243
$$ 391937 400984 408826 413948 415011 411990 406128 398848 390939 382763 374778 367500 361073 355266 350023
52386C50023m187k532r23p1J24M63J420K602L315L363L038K628K329K394K958
$$ 350023 345836 343304 342381 342310 342434 342897 344317 346919 350234 353597 356635 359263 361592 363986 366944
52371C66944L751M251M126L424K513J994K199K558J935J01j662k043j367q89r70
$$ 366944 370695 374946 379072 382496 385009 387003 389202 391760 393695 393796 392134 390091 388724 387835 386865
52356C86865r23m37M3L45P65J128Q39J43J12R36J476J141R17J686K717K930K650
$$ 386865 385942 385505 385548 385893 386658 387786 388625 388768 388880 389816 391292 392433 393350 395036 397753 400683 403333
52339D03333K804L192L010K635L318N239P174Q212Q631Q949R276R800J0937J2527
$$ 403333 406137 409329 412339 414974 418292 423531 430705 438917 447548 456497 465773 475573 486510 499037
52325D99037J3707J4012J3960J4196J4594J4582J3938J2985J2352J2599J3644
$$ 499037 512744 526756 540716 554912 569506 584088 598026 611011 623363 635962 649606
52314F49606J4534J4371J3568J3508J4820J6629J7832J8395J8936J9648K0295
$$ 649606 664140 678511 692079 705587 720407 737036 754868 773263 792199 811847 832142
52303H32142K0836K1393K1693K1214J9911J8352J7060J6003J4800J3113J0761
$$ 832142 852978 874371 896064 917278 937189 955541 972601 988604 1003404 1016517 1027278
52292A027278P741M384J453k91p50o32p66j339j937k297k655l280m009m434m344
$$ 1027278 1035019 1039403 1040856 1040565 1039815 1039183 1038417 1037078 1035141 1032844 1030189 1026909 1022900 1018466 1014122
52277A014122l834l118k452j915j219l5J318K037J965K049L134M812O125O911
$$ 1014122 1010288 1007170 1004718 1002803 1001584 1001549 1002867 1004904 1006869 1008918 1012052 1016864 1022989 1029900
52263A029900P725Q690R468J0221J1604J3545J5024J5420J5397J5943J7100J8028
$$ 1029900 1037625 1046315 1055783 1066004 1077608 1091153 1106177 1121597 1136994 1152937 1170037 1188065
52251A188065J7972J6776J4840J2879J1430J0341R096P663O507N640M358K393
$$ 1188065 1206037 1222813 1237653 1250532 1261962 1272303 1281399 1289062 1295569 1301209 1305567 1307960
52239A307960N95j01M7Lo28j340j746k143k993m234n265n430m588l378k782l117
$$ 1307960 1308555 1308454 1308501 1308504 1307876 1306536 1304790 1302647 1299654 1295420 1290155 1284725 1280137 1276759 1273977 1270860
52223A270860l723l874l730l908m325m181l093j632n55P0O60J409K217L043L952
$$ 1270860 1267137 1263263 1259533 1255625 1251300 1247119 1244026 1242394 1241839 1241909 1242569 1243978 1246195 1249238 1253190
52208A253190M801N226N076M689M616N141O086P002P495P487P327P566Q450R636
$$ 1253190 1257991 1263217 1268293 1272982 1277598 1282739 1288825 1295827 1303322 1310809 1318136 1325702 1334152 1343788
52194A343788J0500J0753J0561J0085R213P916O513N272L950K160N7j773l097
$$ 1343788 1354288 1365041 1375602 1385687 1394900 1402816 1409329 1414601 1418551 1420711 1420768 1418995 1415898
52181A415898m252n545o873q043r049r748r747q933p920p499p801q240q245p669
$$ 1415898 1411646 1406101 1399228 1391185 1382136 1372388 1362641 1353708 1345788 1338289 1330488 1322248 1314003 1306334
52167A306334o594n064l198j283L49J553K376K867K956K513J598N74j20l61m03
$$ 1306334 1299740 1294676 1291478 1290195 1290544 1292097 1294473 1297340 1300296 1302809 1304407 1304981 1304861 1304500 1304097
52152A304097n01n61k93L17Q58R16O61P57J572K499K445J040r20k389l162l730
$$ 1304097 1303596 1303035 1302742 1303059 1303917 1304833 1305494 1306251 1307823 1310322 1312767 1313807 1312887 1310498 1307336 1303606
52136A303606m373m763m420l210j451K84J527K400L602N648Q199J0470J2126J3479
$$ 1303606 1299233 1294470 1290050 1286840 1285389 1285673 1287200 1289600 1293202 1298850 1307049 1317519 1329645 1343124
52122A343124J4907J6480J8004J9071J9271J8791J8524J9013J9616J9389J8605
$$ 1343124 1358031 1374511 1392515 1411586 1430857 1449648 1468172 1487185 1506801 1526190 1544795
52111A544795J8363J8877J9217J8948J8799J9283J9828J9951K0297K1588K3257
$$ 1544795 1563158 1582035 1601252 1620200 1638999 1658282 1678110 1698061 1718358 1739946 1763203
$$ [...]
##END NTUPLES=NMR SPECTRUM
##END=
