##TITLE=AC1673_DOMAH14364_8571129_bUIXJt5RoU
##JCAMPDX= 6.0         $$ Bruker NMR JCAMP-DX V2.0
##DATA TYPE= NMR SPECTRUM
##DATA CLASS= NTUPLES
##ORIGIN= BRUKER
##OWNER= Administrator
$$ 1.72 TOPSPIN		Version 2.1
$$ 2014-04-11 17:19:53.476 -0700  Administrator@X
$$ Compression mode = diff/dup
##.OBSERVE FREQUENCY= 400.02188249412
##.OBSERVE NUCLEUS= ^1H
##.ACQUISITION MODE= SIMULTANEOUS (DQD)
##.ACQUISITION SCHEME= undefined
##.AVERAGES= 8
##.DIGITISER RES= 22
##SPECTROMETER/DATA SYSTEM= spect
##.PULSE SEQUENCE= zg30
##.SOLVENT NAME= COFFEE_meoh
##.SHIFT REFERENCE= INTERNAL, COFFEE_meoh, 1, 14.98509
##AUDIT TRAIL= $$ (NUMBER, WHEN, WHO, WHERE, PROCESS, VERSION, WHAT)
$$ ##TITLE= Audit trail, TOPSPIN		Version 2.1
$$ ##JCAMPDX= 5.01
$$ ##ORIGIN= Bruker BioSpin GmbH
$$ ##OWNER= Administrator
$$ $$ E:\/data/COFFEE/nmr/AC1673_DOMAH14364_8571129_bUIXJt5RoU/10/pdata/1/auditp.txt
$$ ##AUDIT TRAIL=  $$ (NUMBER, WHEN, WHO, WHERE, PROCESS, VERSION, WHAT)
(   1,<2014-04-11 17:19:45.085 -0700>,<Administrator>,<X>,<go>,<TOPSPIN 2.1>,
      <created by zg
	started at 2014-04-11 17:18:39.307 -0700,
	POWCHK enabled, PULCHK disabled,
       configuration hash MD5:
       C8 4E 4E 5D D3 5C D8 9E 9F 52 82 E0 59 8A DE 15
       data hash MD5: 64K
       DF E6 72 11 8A A0 6C D4 79 46 30 D6 77 83 D4 41>)
(   2,<2014-04-11 17:19:48.866 -0700>,<Administrator>,<X>,<proc1d>,<TOPSPIN 2.1>,
      <Start of raw data processing
       efp LB = 0 FT_mod = 6 PKNL = 1 PHC0 = 0 PHC1 = 0 SI = 32K 
       data hash MD5: 32K
       DC 3A D7 19 33 D4 16 14 F8 C2 57 4A E1 48 8E CF>)
(   3,<2014-04-11 17:19:49.444 -0700>,<Administrator>,<X>,<proc1d>,<TOPSPIN 2.1>,
      <pk PHC0 = 92.8125 PHC1 = 0 
       data hash MD5: 32K
       64 FB FB D3 34 33 87 CA C6 0B B7 FE B0 96 7D FD>)
(   4,<2014-04-11 17:19:49.663 -0700>,<Administrator>,<X>,<proc1d>,<TOPSPIN 2.1>,
      <abs ABSG = 1 
       data hash MD5: 32K
       21 68 53 04 A6 F6 E4 F6 A3 4B B5 FC 93 53 85 99>)
(   5,<2014-04-11 17:19:49.851 -0700>,<Administrator>,<X>,<proc1d>,<TOPSPIN 2.1>,
      <abs ABSG = 2 
       data hash MD5: 32K
       B4 1B A7 DE 2E 45 13 A9 5C E5 E7 7F 3B B6 9C 6A>)
(   6,<2014-04-11 17:19:49.944 -0700>,<Administrator>,<X>,<proc1d>,<TOPSPIN 2.1>,
      <abs ABSG = 3 
       data hash MD5: 32K
       49 D3 41 D6 D2 C8 93 73 BD FF 9C 1E 1C 69 4D F5>)
(   7,<2014-04-11 17:19:50.022 -0700>,<Administrator>,<X>,<proc1d>,<TOPSPIN 2.1>,
      <abs ABSG = 4 
       data hash MD5: 32K
       44 8C 48 00 43 67 A3 20 8B 70 BE 52 49 E1 C3 DF>)
(   8,<2014-04-11 17:19:50.101 -0700>,<Administrator>,<X>,<proc1d>,<TOPSPIN 2.1>,
      <abs ABSG = 5 
       data hash MD5: 32K
       2C BB A4 B1 3D 51 D6 18 B5 3D 3D 23 C4 E9 C4 D6>)
$$ ##END=
$$ 
$$ $$ hash MD5
$$ $$ 67 7A 40 EF A3 BC 88 CE 90 21 A0 8C BB A5 ED F2
##$RELAX= 
##$RELAX= 
##$RELAX= 
##$RELAX= 
##$RELAX= 
##$RELAX= 
##$RELAX= 
$$ Bruker specific parameters
$$ --------------------------
##$DU= <E:\>
##$EXPNO= 10
##$NAME= <AC1673_DOMAH14364_8571129_bUIXJt5RoU>
$$ [...]
##$TP= (0..7)
150 150 150 150 150 150 150 150
##$TP07= 0
##$TPNAME0= <>
##$TPNAME1= <>
##$TPNAME2= <>
##$TPNAME3= <>
##$TPNAME4= <>
##$TPNAME5= <>
##$TPNAME6= <>
##$TPNAME7= <>
##$TPOAL= (0..7)
0.5 0.5 0.5 0.5 0.5 0.5 0.5 0.5
##$TPOFFS= (0..7)
0 0 0 0 0 0 0 0
##$TUNHIN= 0
##$TUNHOUT= 0
##$TUNXOUT= 0
##$USERA1= <user>
##$USERA2= <user>
##$USERA3= <user>
##$USERA4= <user>
##$USERA5= <user>
##$V9= 5
##$VALIST= <valist>
##$VCLIST= <CCCCCCCCCCCCCCC>
##$VD= 0
##$VDLIST= <DDDDDDDDDDDDDDD>
##$VPLIST= <PPPPPPPPPPPPPPP>
##$VTLIST= <TTTTTTTTTTTTTTT>
##$WBST= 1024
##$WBSW= 4
##$XGAIN= (0..3)
0 0 0 0
##$XL= 0
##$YL= 0
##$YMAX_a= 636868
##$YMIN_a= -540712
##$ZGOPTNS= <>
##$ZL1= 120
##$ZL2= 120
##$ZL3= 120
##$ZL4= 120
##$ABSF1= 14.98509
##$ABSF2= -5.573092
##$ABSG= 5
##$ABSL= 3
##$ALPHA= 0
##$AQORDER= 0
##$ASSFAC= 0
##$ASSFACI= 0
##$ASSFACX= 0
##$ASSWID= 0
##$AUNMP= <proc_prof1d_extract_pilot.lims>
##$AXLEFT= 0
##$AXNAME= <>
##$AXNUC= <1H>
##$AXRIGHT= 0
##$AXTYPE= 0
##$AXUNIT= <>
##$AZFE= 0.1
##$AZFW= 0.1
##$BCFW= 0
##$BC_mod= 0
##$BYTORDP= 0
##$COROFFS= 0
##$CY= 15
##$DATMOD= 1
##$DC= 0
##$DFILT= <>
##$DTYPP= 0
##$F1P= 0
##$F2P= 0
##$FCOR= 0.5
##$FTSIZE= 32768
##$FT_mod= 6
##$GAMMA= 0
##$GB= 0
##$INTBC= 1
##$INTSCL= 1
##$ISEN= 128
##$LB= 0
##$LEV0= 0
##$LPBIN= 0
##$MAXI= 10000
##$MC2= 0
##$MEAN= 0
##$ME_mod= 0
##$MI= 0
##$NCOEF= 0
##$NC_proc= -8
##$NLEV= 6
##$NOISF1= 0
##$NOISF2= 0
##$NSP= 0
##$NTH_PI= 0
##$NZP= 0
##$OFFSET= 14.98509
##$PC= 1
##$PHC0= 92.8125
##$PHC1= 0
##$PH_mod= 1
##$PKNL= yes
##$PPARMOD= 0
##$PPDIAG= 0
##$PPIPTYP= 0
##$PPMPNUM= 2147483647
##$PPRESOL= 1
##$PSCAL= 4
##$PSIGN= 0
##$PYNMP= <proc.py>
##$REVERSE= no
##$SF= 400.02
##$SI= 32768
##$SIGF1= 0
##$SIGF2= 0
##$SINO= 400
##$SIOLD= 32768
##$SPECTYP= <>
##$SREGLST= <1H.CDCl3>
##$SSB= 0
##$STSI= 32768
##$STSR= 0
##$SW_p= 8223.68421052631
##$SYMM= 0
##$S_DEV= 0
##$TDeff= 65536
##$TDoff= 0
##$TI= <>
##$TILT= no
##$TM1= 0
##$TM2= 0
##$TOPLEV= 0
##$USERP1= <user>
##$USERP2= <user>
##$USERP3= <user>
##$USERP4= <user>
##$USERP5= <user>
##$WDW= 1
##$XDIM= 32768
##$YMAX_p= 464066960
##$YMIN_p= -732300
##$CURPLOT= <Network HP LaserJet P1505>
##$CURPRIN= <$Network HP LaserJet P1505>
##$DFORMAT= <normdp>
##$LAYOUT= <+/1D_H.xwp>
##$LFORMAT= <normlp>
##$PFORMAT= <normpl>
##$SURQMSG= 1
$$ End of Bruker specific parameters
$$ ---------------------------------
##NTUPLES= NMR SPECTRUM
##VAR_NAME=  FREQUENCY,     SPECTRUM/REAL,   SPECTRUM/IMAG
##SYMBOL=    X,             R,               I
##VAR_TYPE=  INDEPENDENT,   DEPENDENT,       DEPENDENT
##VAR_FORM=  AFFN,          ASDF,            ASDF
##VAR_DIM=   32768,         32768,           32768
##UNITS=     HZ,            ARBITRARY UNITS, ARBITRARY UNITS
##FACTOR=    0.250966925370066, 1,           1
##FIRST=     8223.43324360094, -7049,        -46535
##LAST=      0,             3321,            -228253
##MIN=       0,             -732300,         0
##MAX=       8223.43324360094, 464066960,    0
$$ Real data points
##PAGE= N=1
##DATA TABLE= (X++(R..R)), XYDATA
$$ [...]
23808 271938 -10388 -174709 186509 144452 22906 101813 289420 -219586 6747 -43071 -194183
23797 -194183 -174903 288640 -44571 -245596 286241 -87994 204876 -327508 93691 -142259
23786 -217028 -24596 -27396 11697 -39169 -217618 -173267 -37592 -329958 63240 -143032 -69838
23774 -220727 102667 -266550 101048 60422 -105799 71297 11616 360463 146707 189107
23764 189107 -121108 -134632 18851 -143534 80677 -114156 -188256 -67786 -239368 378900
23753 46506 -275504 162448 106222 -87180 -93313 175235 188911 -50240 210405 -169156 -249052
23742 -249052 -564 128333 -81815 457162 -148512 -273396 27939 -266526 -95483 -93387 299529
23730 254755 104884 133799 -61928 72545 46443 -164432 281590 -157869 208061 -294335
23719 -33212 -58284 43355 -214565 -100094 -189699 245777 -61019 177926 403082 145640
23708 -28636 -147864 -223363 -155280 128919 59782 -422298 -96670 7951 197343 27636 -347657
23696 -153545 275727 242705 -70109 102311 -337803 -155143 -33706 119096 58463 -42692
23685 -14945 558 -76451 32247 -117352 311863 79090 -93265 318817 42424 161716 -117576
23673 -158218 -199274 204308 -100441 117178 -288742 -217977 130596 -84992 -125760 45076
23662 318863 -42789 -314736 146532 -158124 -212075 42128 -324116 -139871 339725 229624
23652 229624 153532 164633 -74253 -102040 -3349 188722 -55306 22997 92460 32308 162861
23641 162861 -33466 -51581 151063 4087 -177634 135915 106795 -1049 190908 244412 371736
23630 371736 356596 230156 262946 304577 137993 220477 -92765 116392 69601 230584 -184355
23618 -106867 -13111 10438 -247320 -168101 280018 28244 -168609 388141 -39903 34853 -153981
23606 -46218 31709 247634 -89170 -458933 -71301 -59005 176528 -91833 -47607 242343 -47487
23594 -81902 -104914 -145472 257174 2806 146805 214002 66032 -22911 240791 -16527 -200707
23583 -200707 47109 -315443 -356445 26464 -108875 -53777 124815 422026 221754 65986
23572 62883 172269 -22008 -81138 9190 -125835 -95326 135114 -10387 -162977 30768 -165890
23560 76728 -323213 -108403 -310273 -105878 -58190 -122220 2126 15260 -352686 -9198 -363573
23549 -363573 273313 276375 158288 138965 227302 -273591 -72641 41900 36501 125116 117900
23538 117900 -68357 -36754 166004 -30170 -110687 -116421 70832 -139156 -274218 -26023 147223
23526 9894 23665 -123263 104079 13126 -76872 -190269 131596 -215705 -114119 89920 49431
23515 49431 324362 81891 4243 -135730 330853 -74388 244743 447667 -297619 249892
23504 122973 -200135 -188596 -417871 194837 87021 -219943 -2317 318205 89011 -58538 -65945
23493 -65945 82722 42574 13750 -91389 37400 240861 6177 7995 -197508 320 -8978 383922
23480 315389 -142725 -86159 -164698 -13027 -243743 -132349 221782 -33708 -4111 4956 -66696
23468 -382 -442483 -132446 -106261 -417365 154171 -90273 3025 238925 93152 -214059 -126446
23457 -126446 -103079 -23674 -139597 350051 -229350 446488 92818 157188 -47596 38350 -254897
23445 -236515 30686 404311 86129 87587 275607 -180111 -44022 56035 68244 212117 -224219
23433 34585 106182 -22201 -167799 -220529 -112887 121144 126242 -328384 89217 146929 -343253
23421 161102 94152 -194039 -435583 -60833 97767 -254764 -22073 -21746 251665 231968 119727
23410 119727 -54917 -307948 -102764 -63766 -100197 -201644 60235 -243756 14276 -294884
23399 -126045 73866 140815 -111270 319882 -10974 -139876 43628 -181918 -244549 -90748 -59169
23388 -59169 230927 102199 -94781 -157052 -39708 59672 -99375 -42494 -92561 35650 166907
23377 166907 -171422 -33524 -88971 -106043 -59914 187420 250391 63440 330380 37489 -93381
23365 -221640 57767 229664 -193582 150710 -391217 -27087 -442335 300130 82556 109802
23355 109802 -360661 -58736 -306717 127740 79206 -154970 -157859 45728 180335 -90527 -144324
23344 -144324 214751 -63720 68917 -76979 -178967 -65389 207355 -167559 -110965 -48681 -71144
23333 -71144 -307122 -175785 -112207 -155287 223969 -41938 -199185 44545 390867 47339 14503
23321 81165 212971 104946 -291338 20757 212085 -405359 74761 49655 -73327 -128387 -343243
23310 -343243 70869 104457 -264462 -113539 356126 26738 57106 115149 -80201 221285 81413
23298 -83098 -46713 -9501 -13543 -97057 50589 16502 160768 -28104 -266623 -235754 -47926 15801
23285 -39731 -204724 91489 62500 -189566 237469 -190733 239004 -95546 -157541 69878 88823
23274 88823 61056 -356265 -99399 -91290 -47039 -7327 -182695 -83727 105277 52980 -168008
23262 -303808 -85167 10779 33983 143980 146463 -111392 193926 -10903 16647 -163769 249491
23250 -24003 195302 18284 59587 -126970 100696 96479 69081 -126517 -109641 -152964 -86156
23239 -86156 -183704 -238173 -53067 72543 -131481 7209 -13684 228220 55230 102766 19681
23227 178288 19644 -31452 199336 -29777 27750 143609 60277 391665 205758 300676 180363
23216 180363 169964 35966 84866 -12543 -111653 -47373 50591 41896 -223633 105797 183037
23205 183037 156348 -82979 -5425 -377677 345784 278285 -171047 180409 298376 -87361 -101499
23194 -101499 197799 -41276 94494 58009 51737 112070 86044 -39373 222605 217081 24328
23182 57229 434526 149455 -117900 -113627 -126515 -1626 132639 -102780 -146363 12939 -136376
23170 -533318 166597 133044 -194056 -10348 5425 -5752 25160 -31177 -279111 -157931 -148581
23159 -148581 113618 113812 -138475 -78500 -19363 -89916 104619 -113839 -150429 66321 77094
23148 77094 5116 -496932 -86938 -258815 268110 -277825 -55881 92633 -106703 67749 -120406
23136 -175805 -37046 195055 14022 -55682 289765 126572 46957 -54828 -369577 89547 -100756
23124 360264 243446 51644 192496 -34697 240742 -169268 72751 55218 247367 -135545
23113 71512 27698 -211085 -234759 281434 -68487 227899 268379 86907 -95365 79918 -135679
23101 -107426 -142975 -245442 -77186 -74208 -74354 81043 -91338 -5866 -201458 159704 -285399
23089 -140708 -220868 96823 48383 -15704 -48997 244313 12368 27940 -14877 165159 269993
23078 269993 -241777 -212673 60252 74201 -53124 -76879 -312357 97695 134797 -164709 114206
23066 -223388 -250591 70398 -193429 -24210 108199 327893 145385 -120836 -194688 -285164
23056 -285164 95820 283697 67912 50861 2402 -157658 -442184 23727 593 21314 -278014
23044 -301716 1080 283792 -125656 29747 99465 130826 -63616 -124052 228122 -189759 45191
23032 247938 18054 -17709 209460 119915 -346547 -105422 -102899 64289 317811 -143138 261601
23020 -71854 -25927 104255 25737 -70338 -90439 -16469 65643 68925 -328467 77029 -168103
23008 298015 108431 -47019 -38810 -147650 -59323 -367306 -63565 298838 -75963 28945 138037
22997 138037 137368 -326516 173940 155061 -76475 -44190 -24626 -191251 48810 138256 -128822
22985 -154 -48045 23317 320244 61316 159247 166675 -260743 76580 77614 -217129 30581 -392665
22972 -99237 -15212 30699 84980 6801 265340 -256692 76846 149787 -112196 145489 103242
22961 103242 -93665 -90049 18508 -45759 -164109 -145623 296902 97797 155925 26085 -246956
22949 205734 -165449 107152 105040 44412 172843 -234533 132300 107460 172983 -212122
22938 -66947 -16213 113106 150901 -306427 -31910 71358 -20041 140223 -224477 -295473 -337084
22927 -337084 -53460 -42377 -238723 358395 189971 21084 30052 -210221 -26954 -186083 -113889
22916 -113889 -160758 -123283 5175 211230 275320 169562 -39669 135325 118360 -177991 119062
22904 90600 -166719 79908 -241478 100440 -107963 -134848 32084 23602 -225320 -155198 -24299
22892 255125 -113661 -170327 -206080 22907 -399356 171224 -252307 -238182 90597 -192365
22881 163506 -196128 162316 -221847 248433 1658 45963 172105 -129429 -262976 -109387
22870 -132564 -203312 -106452 -136091 -99119 -35737 -216258 -130478 300155 -27776 126607 488001
22859 488001 -151282 41402 138604 -73045 -155644 -162444 94452 23072 -113598 74064 -279223
22847 151 -133913 482049 318907 -308834 299119 10354 -160168 -117508 -318411 181807
22836 -20362 -30698 140691 -383496 90152 8887 -306144 -2560 -98919 -22052 -221193 157943
22824 88443 -134083 458410 222347 82689 -88512 -112981 -45663 142236 53357 -119 -191836
22813 -191836 -45779 108957 313297 104723 -49344 107268 45444 19805 -63049 -514233
22803 -514233 87399 140851 -217393 -45043 260013 -109051 10390 -244706 -64857 -279709
22793 -279709 -224051 -133746 12988 -253254 199617 -99202 -24745 89457 -51196 168514 -212844
22781 76588 181341 207159 -88471 -132625 -56168 -196354 116884 -184768 24477 199055 -91915
22769 49766 -137024 -109086 -304972 34076 -437485 -12898 -58523 205162 188955 -173072 148231
22757 -31689 -435823 -124411 84052 284937 39223 -139016 -300495 194637 -59617 67443
22746 146993 -5087 -58348 -223385 -266063 -73379 -53286 -83129 -25355 166542 -201982 -314551
22735 -314551 76206 -75702 -56724 110743 126779 -66405 -66007 48806 34241 -109670 -188185
22724 -188185 111485 -454739 144611 118387 23674 7613 -30498 -154051 -94958 -8064 -55410
22713 -55410 223861 -507733 -228088 -271804 -95444 52629 -82383 -308762 -108102 -58784 189867
22701 70393 104551 145561 -264299 -124939 118641 73732 115991 -116270 -53823 178997 127205
22690 127205 320437 90274 -138173 -232080 -318350 72685 -171496 -180164 70493 -62111 22193
22678 121263 83283 12406 170463 36359 -265481 -147016 -74521 -169654 201955 -54778 -135120
22667 -135120 -262728 87168 -52289 -28709 -136838 84064 -174030 215634 -22986 -68820 591
22655 -121602 -18346 -97463 50205 -67880 102361 56972 75096 -216968 -323386 11951 -78101
22643 -14006 -209172 -164551 388698 140149 130136 -157367 -234688 -84680 -50789 30910 179208
22632 179208 245653 -337633 -62352 -14156 19980 204532 -294126 -67700 217946 -126449
22621 -331108 245766 134342 7174 -294646 -38920 123945 -240377 -94671 -194559 -168033 -142938
22610 -142938 218199 -102011 78218 189922 69653 89558 -464496 180575 86918 20151
22599 33494 -13613 26695 -510906 -387890 -61500 48219 408843 89890 65149 -159756 -33741
22587 85349 62457 -152293 -92947 -23157 -190915 -135579 -108049 -327851 -29728 28668 114829
22576 114829 2101 296946 -220693 -92152 -119215 -41591 -166358 -89372 77242 368445 224193
22565 224193 -25780 41382 148044 -90176 144951 -29981 -51781 -43267 -122678 -82066 -370950
22554 -370950 71690 -50943 -212189 25190 133194 30344 100188 -110000 -260236 64824 80016
22543 80016 -251960 250482 -187894 -165832 172096 -179719 -244254 162239 -156902 -22917
22532 -22009 -67012 -119635 -157204 -148754 -165734 55643 -352392 -77429 71214 146178 195280 -56029
22519 -240863 -401855 -68424 -24224 -119841 -80834 -13192 224921 -58184 336143 10925 -158931
22507 174842 -361572 -216661 -149892 -12348 -270819 -148962 131189 -65436 148494 -23479
22496 -270738 9755 -77226 14297 44333 -182054 -401372 -57637 329744 308540 11888 139676
22485 139676 184302 -270478 195357 -280435 -180551 84917 -31495 101397 46879 -55226 -61032
22474 -61032 -131390 -137524 -150826 -128950 91570 -28788 -21946 -49886 -262370 -211632 -226806 87808
22461 -93112 -67408 -8501 -7314 -268645 18894 -261580 -282391 -349510 -168445 -78745 -90662
22450 -90662 44111 -170057 -121310 -39300 61181 -60274 180265 113567 100555 -64411 240805
22438 158332 170563 -4315 -33054 93082 -5328 -163372 82101 -134989 -19614 -242749 142980
22426 108933 -137229 -15023 18933 171834 135551 278878 -15538 -192228 59111 -83286 174225
22414 165661 144287 -99044 -32045 -16166 157678 -177341 -144080 -45690 -166494 -58428 -34135
22403 -34135 -14256 239184 186426 -51723 -252648 -196441 74738 123118 31069 14710 -41727
22391 133788 -152043 247082 -166756 -34876 -249085 -197562 -213020 -189735 -28448 128249
22380 51581 -83112 80767 109040 -91252 52805 73241 -90115 18631 -5048 -125713 -307096
22369 -307096 -465043 188266 59444 17288 -338964 -378335 8754 -415576 -144460 -149744 -197265
22358 -197265 -322316 -51314 -26584 -140563 85033 144030 281498 67152 -66143 -7131 -172792
22347 -172792 190145 -333873 196690 -107027 -39120 167037 289121 -15803 -148438 -106092
22337 -106092 -55915 -40207 -248999 365535 59197 -28548 -60161 -203392 99196 -50188 11498
22325 16043 293629 -26995 -69848 -115450 -38787 190535 94465 -86108 -34950 -120029 118103
22313 -285681 -29401 -20539 233325 -266733 -69623 -269098 -21300 127302 -8861 8767 -154947
22301 -302415 -58785 32711 35185 82592 -33249 -46342 -39931 -116156 217201 -91554 6039 -89884
22288 152256 -84906 -178578 364521 -299479 -512563 -136811 7089 63769 -200438 505732
22277 -519910 -38022 194161 82425 -200718 -16994 -232827 181430 -59067 -166008 25972
22266 -105416 39740 -169420 -516701 -165063 -140431 -43301 123880 153299 43072 -58361 -260357
22255 -260357 -207907 -87200 -59501 -299684 -247523 -145245 135474 -139795 -148253 20496 -237543
22243 303297 203247 208290 61499 57516 -199784 103662 138778 36950 55095 -71986 -146166
22232 -146166 -202249 -108872 -93157 -20678 -65115 -158764 -75285 146970 141530 18467 -134814
22220 -39255 -52025 169490 5486 -49075 -13164 -25851 8468 73687 63651 -43255 129422 72303
22208 72303 -144456 -202851 -163576 -224218 -445261 -28972 193153 -370984 16947 -33998 136753
22196 -77407 268682 -177891 -6511 -53739 36212 139679 402386 -67549 151365 -193965 469331
22184 -150237 -19298 -229314 11174 -1635 -142838 -12422 78310 -177223 30139 -138754 -17851
22172 -193331 195460 226540 -78281 157639 264223 -41777 -93334 -24961 262573 -292285
22161 -28352 -229185 -102286 -38425 -44450 23353 107028 -198787 -74030 205950 79916 -10799
22149 202064 -115665 -73841 -84114 -166657 -70405 -104778 -280105 121386 228294 -37357 -32872
22138 -32872 -105466 16545 -267220 -57609 -285063 1428 277045 -186836 -446458 -156857 -179599
22127 -179599 -95498 -80579 -230490 7368 -245071 47709 -2918 15294 -58876 -267065 8312
22115 -206628 -11866 148228 -124385 -71644 174067 151023 40860 83149 -15413 242151 -12790
22103 -242146 -127788 -39632 157219 -25497 -89738 -56014 96210 -103770 -46509 -21278 136047
22091 -16954 252859 -426631 -113202 -345839 -8328 28388 20748 -114768 429701 -239753 -75330
22079 -402068 108574 -113467 -240879 -316672 140873 348986 -36541 -190575 44580 -275793
22068 -298486 -169987 -19304 54558 -14861 -147933 142323 -3411 -59480 -258342 268910 -243918
22056 397267 150234 -317644 23150 15971 -119468 12983 19769 114423 220144 -158839 -101241
22045 -101241 36952 -164497 -350205 37627 -273988 -127583 66637 38061 -337758 285824
22034 -77635 -32436 -34588 -107247 -166648 -115621 306888 -59225 -226907 -384966 73261 -93474
22022 -99717 139009 -246136 164477 193080 -39972 14563 41805 -122103 122755 -280587
22011 -131319 -148879 31550 -265946 -55268 -169667 -12444 -106257 231133 -47385 92667 -79523
21999 396711 -96769 -76128 106968 -125122 90916 128785 -55170 -306992 -175294 -85692 -299779
21988 -299779 88913 138630 -107653 -57121 -172070 -206828 183474 -120281 241915 -49300
21977 -251258 -83045 50436 15872 135638 -220311 -85814 -55992 -222281 114978 -229848
21966 -82123 -40110 -147092 -176313 -124010 -305546 105797 -201232 62659 -123974 94856 182412
21955 182412 23487 -38195 -250384 111716 -122783 -37150 -3857 -127480 50974 -150354 -265886
21944 -265886 -454514 -192566 -61313 -245953 -110849 -148944 56486 -113262 -319455 278057
21933 37429 126448 74421 127100 -28212 227209 -126315 -329124 140480 -40742 -457096 19049
21921 -61063 -76667 68632 -61809 16485 138502 2628 -188438 -215624 129721 17637 -48061
21909 -234166 -47150 -250402 -281750 139509 54927 87022 153383 -228067 114203 -148488
21898 -241612 -451116 48273 -95208 89619 64761 33136 84762 -432709 -206663 -107467 -46812
21886 151870 33444 87612 175354 71625 -87734 55478 -262753 29479 -43062 -18473 -60976
21875 -60976 325181 -117968 -124893 -151559 35955 -27824 -133748 2471 401045 -122122 3116
21863 -207377 -93434 -134629 -47244 -36829 73866 -109282 -202718 99555 211048 -139226 322341
21851 70249 65076 -15983 109718 -6072 41079 -306715 297161 -49022 -52146 -100928 -278333
21840 -278333 119635 -156752 -247583 -48317 -293704 -270039 270968 -265304 340855 -57617
21829 -94946 38315 -61047 -265638 199826 117189 311781 85942 -480967 -13938 58966 131241
21818 131241 30399 -127237 -24306 104011 -6384 -370689 191628 18059 -137132 137552
21807 75307 -62865 237541 -192419 -128530 -88926 -57327 -380573 -171355 -153991 -256887 169713
21795 -42641 62495 -335934 -108393 -284117 -84805 98531 38630 111692 416971 21501 -149181
21783 -65878 -109165 82633 190099 -94140 -273705 7867 -4936 -229480 -305499 -154006 281775
21771 37955 -125448 36170 17262 -161081 -30528 161715 141001 10839 -335229 -299513 -85815
21759 -289629 -114433 -50896 290396 -82532 137644 -146108 -225739 -94447 -328352 124421
21748 -153902 21277 -123382 -142664 10298 9849 -297429 67392 80076 -385264 63727 -127814
21736 -93623 -117096 -249928 31254 281945 -394266 170095 -29071 -45317 129705 71985 76139
21725 76139 -246877 -60327 181112 -136613 -178233 26539 -51462 -151011 -286276 -3553 131131
21713 -292467 387319 14329 30500 -242130 -98802 -149946 -255064 102240 98260 -66056 83701
21701 -176179 78218 -167079 -53691 -158950 -142021 -113448 -14821 -113458 -430413 52907 -76542
21689 -156867 -109698 -79992 8955 -150037 -344623 -151787 -101137 102660 -53767 -53627 -41585
21678 -41585 -115593 131570 234160 -59542 -94323 -156428 -159133 97968 195899 -143913 -278557
21667 -278557 -210685 303987 326855 -260906 -35152 -197338 1767 -100997 66517 189840 43327
21655 -11447 301587 43211 119303 41534 -239154 -79326 118523 -169733 -25528 -141764 -125189
21644 -125189 132412 35787 218613 152313 -252225 -78863 124160 -172406 334397 -119092
21633 -220056 -235492 16313 93048 -88372 100228 91500 249689 283225 -156252 -173080 76156
21621 -254844 -208788 151112 -248221 239320 -176630 -101846 406140 -92456 25325 -9194 155693
21609 189989 210243 -97136 17795 74630 -3881 -133225 -296687 -317920 55183 -168966 -364104
21598 -364104 -297792 428505 -254082 66596 -50889 -85800 -204988 -299328 -78043 -35217 115560
21586 138234 168188 185234 153778 -96282 101768 -297123 220133 -182694 -49642 -174538
21576 -174538 -79007 145845 189619 -189994 -252754 7132 111232 72787 -234110 -8923 57135
21564 309635 -215964 -188599 50322 6224 -214806 -105470 -69384 -250290 -137817 -68131 16649
21552 252047 -129213 -97583 47917 -191060 -108611 -262874 322847 97638 -50169 -215980
21542 -215980 -256710 1812 144672 -81492 37135 67145 83308 -327408 -59972 46012 -106347
21530 134488 240368 -178241 171825 23095 -96972 -161394 18254 32034 128405 40799 -31442
21518 -154278 -139354 -168787 127548 -225177 203888 268954 -567662 -90433 118028 -43684
21507 61001 -132542 30396 -321933 136550 -157179 -155478 -29600 -525478 259151 -214310
21496 -101864 -140718 117979 168500 31163 344080 177279 95901 -91811 -27166 -166000 264519
21484 163973 -246682 -188292 82203 197394 -264238 28409 -23721 -216500 -16057 -162005
21474 -162005 115629 -151571 -92295 -226561 -226003 -283262 -396299 -125367 -124841 -65854 -59480
21463 -59480 54825 -174198 -245003 120297 -270734 190136 -259681 -25156 -187992 -360017
21453 -360017 -105987 181231 115380 -185693 -8028 167550 24805 -257490 110942 -19903
21442 248959 -165378 168680 90001 272312 -19003 16495 69336 389341 474998 452737 343272
21431 343272 780606 202855 387542 -13246 240194 -39135 155778 -140416 -5153 -100285
21421 -100285 201756 -206646 -55481 -286877 -384334 -139542 -296504 -82613 -9652 -46012 -191426
21410 -191426 110356 -88159 -423748 76110 199085 13602 131183 63561 80262 384717
21400 384717 -313256 -249151 129034 -240757 -178723 20614 154643 166748 9809 23900 -188855
21388 154955 -34680 -145187 192136 -74413 -76307 118540 -67202 -9082 87515 27123 62982
21377 62982 -83264 -7940 63054 -25556 -175048 216569 66057 -178670 -126941 -5653 73045
21365 -125226 -105831 -313831 145381 -145990 -140644 118881 -10574 37828 39674 -282306 138627
21353 -51825 -34169 -155573 60738 -32406 -495722 -194798 -264891 -32603 65571 173913 -83431
21341 -413171 181385 -130122 129730 -20724 512566 -126842 -273391 213448 -283849 -438121
21331 -438121 62293 -46624 -144188 -101270 -284195 -271669 280712 -363663 54221 -48093 26656
21319 207413 222286 -32631 -157803 8546 -304069 -201720 21426 216970 -304770 -47563 47436
21307 235805 126503 114419 -81954 -129306 -213724 95281 439790 -123514 -203226 -120516 50245
21295 -131744 30370 -208658 -24802 76877 14892 173896 -415240 111401 45932 -81233 -139548
21284 -139548 -50413 22667 -105165 -193548 97256 -448805 -154552 140718 -143007 -291422
21274 -291422 269557 50789 -9068 -292331 63387 -83331 -63916 -141006 -167428 -138544 -108143
21263 -108143 -217052 -211638 821 -238464 -96896 236046 -86096 -135932 44054 -168017 213317
21251 138714 -47908 -46224 114120 72736 -89889 167908 -53792 64480 69322 -134871 -330381
21240 -330381 -322839 314200 -259692 136481 -149199 -238040 -184308 141381 22488 -186842
21229 133744 55957 -1827 16197 425314 -181094 361654 264067 -202368 -189313 35201 -269194
21217 -387999 -211436 -177451 61683 92981 -120016 -254155 -56307 120504 -41401 -166715
21207 -166715 -172964 -402794 -222036 -215797 -23150 -240650 -197279 -243398 -57535 -31226 176285
21195 136429 -185546 -103764 210520 127726 -194701 -73182 413376 71689 -138938 -166825
21185 -166825 -212971 -86720 237648 33956 -242918 -225088 138289 -282790 18386 -171497
21174 3245 -48277 98478 -287318 -115297 -62184 81857 32797 -197586 -23585 -207979 -47618
21162 -79105 -2508 319531 -12375 29999 -133751 222422 -128730 168591 -182207 203864
21151 65699 -230767 124849 -181638 -335601 138573 -97525 207019 16361 359821 -16706
21140 130086 -148412 -386402 34712 8666 110562 -229746 -168600 -48717 -322582 97776 -72253
21128 -137225 -219669 104671 505479 106535 82951 -168392 -257417 -52909 -119679 -2827 189751
21116 -52952 130093 15520 -388952 -157551 190878 -152818 91854 -37260 238886 -483712
21105 -471920 -290525 -64393 -44514 -517902 -52637 15771 -30435 -289521 47575 41880 62126
21094 62126 -49478 -443763 32551 22642 -220713 463098 -35606 -166470 -154495 -27293 -229490
21083 -229490 -66246 -215503 101920 -68420 -145358 168145 87040 -289876 24682 -122506
21072 -112676 -259276 -58047 51060 -153028 -170349 398119 59220 123363 -133195 6476 290343
21061 290343 -77202 -20446 122782 -23446 -43098 54212 -97580 385128 -179092 244805 -108870
21049 237480 -190241 -73854 -225352 91458 29386 281012 -97052 116618 -74436 -107527 -46106
21037 115044 109066 -17926 -81144 -263715 79954 -328449 268846 -192188 -98048 243149 219750
21026 219750 -104902 -246796 286860 113938 -166740 -44451 -380800 -109042 -102719 150430
21015 84890 -102141 36228 -460815 30604 108700 -254085 -85976 -73916 124947 -88737 -93488
21004 -93488 -83339 -354029 -15394 254090 -112824 -61107 222413 -342978 -111586 -186992
20994 -186992 45829 -130708 -158617 -125283 166958 245334 -210707 -54852 170772 49998 -2832
20982 -404193 -11162 -37444 -96560 -71145 -172838 73607 -114359 -103831 -246694 59693 -193910
20970 -236944 -134929 -304228 120659 -32650 -74086 98576 17129 77196 -24943 -42028 129501
20958 -17732 30162 -271036 187654 -43826 -214834 68376 -265498 -73450 117467 120806 -99271
20946 43965 -171570 24884 -310523 117602 295211 175712 225956 -85597 100821 276141
20936 276141 -83249 216867 -98687 7897 209108 -289257 95658 149407 -240385 19330 -283170
20924 -86384 -344061 -13783 140236 -62853 -107665 122217 76311 -163992 12327 -201602 -302470
20913 -302470 -100797 -115149 -28067 -292777 88101 231605 123338 134570 -78289 30284 -339387
20901 267512 -57441 152703 -62505 -49359 50413 -284987 -296748 -4512 33691 196493 -218037
20889 21306 397062 8794 -246030 157527 -95218 -218149 -389476 238168 103286 -149559
20878 118606 -17853 144757 -116012 -167633 -52481 -313536 -43290 -877 -211186 -304502 -49777
20866 -204290 41998 -339503 357657 -157658 -295779 80426 -290248 -1262 -456398 -198324
20855 -139228 16794 410897 70418 -201155 -235564 -169772 370162 239490 -185895 -68291
20844 -240003 -60003 -287442 -104520 333769 -277228 300444 -351854 -216614 -271474 -149639
20834 -149639 123408 -28157 82255 -20149 -89329 153427 214154 -267891 -394057 -94740 -224439
20823 -224439 -180470 22456 126930 198666 -123361 60841 -16996 54418 5313 -200118 101244
20811 -191358 -144491 149928 -38698 -18176 -323148 -87583 -10788 -202841 -98336 -269029 -286284
20800 -286284 -18926 189245 -86105 99113 -262804 -79137 172442 -337711 187995 -190676
20789 41027 42407 -215952 105672 -308389 179386 70926 -191889 35233 -31987 76328 77006
20778 77006 59170 117408 -129462 -334959 158493 -193765 -8459 1147 26397 -258275 -119600
20766 -276927 -45048 60936 58169 -9087 -213020 232250 -268572 91328 13750 -78222 -270965
20755 -270965 76879 34082 -93921 -151864 259560 -398423 373263 -58028 -284962 -83615 160934
20743 56483 -133445 -245956 -22880 -289877 -67551 -72997 146453 -255457 66092 -116564 -270151
20732 -270151 -252048 3817 98155 -258417 -126975 -362172 -161581 346134 142716 -116435
20721 -164232 -13988 -168917 36475 92736 -124043 -265604 139720 -10205 -233465 39598
20710 59851 -229335 284248 -249815 115579 -331960 -248812 -34967 -76329 -76066 -42518 -392049
20699 -392049 -417605 129337 -238059 98203 -18112 201545 214623 106090 -192968 -111747
20689 -111747 50899 186265 161862 222965 26489 161342 92789 -205769 -205326 290043 -69868
20677 -146209 -97990 80697 180229 -59113 134185 225237 -39695 -243257 -270464 110524 43264
20665 295399 -189866 -81681 -99329 135778 122559 101345 -96944 -3240 -89783 -20691 -356482
20654 -356482 -328710 -12933 46636 5369 113978 -126817 -56851 -30950 -175584 163049 -130805
20642 265321 -68858 123220 -201083 -164432 73757 187805 77445 -68670 187506 -209132
20631 -140397 124337 -175114 -155765 53825 -97588 -246054 -130283 -207978 -32430 -150165
20621 -150165 -251524 272133 -20667 -108159 -37305 201984 3502 -177303 121471 335128
20611 335128 16018 -92168 268280 -151786 -74283 -87505 -203955 -15124 -103321 -130778 -245107
20600 -245107 98374 14674 -160402 68768 -296442 -303176 -142717 -200783 -39202 116986 92343
20589 92343 -347554 -142152 307680 1677 179534 -64085 85414 483398 -176012 124309
20578 222946 63332 315740 -40127 187476 277128 350543 64153 -73920 -145871 -43449 -128116
20567 -128116 13206 672 21778 -45005 23206 144758 -186214 -169249 -115721 -196692 -261248
20556 -261248 -200485 217770 -105165 -144061 -135250 -323005 48645 -49001 -119697 8282 -146505
20544 -138106 218088 -118809 -169088 61929 -151122 38922 25413 43709 -127551 51710 -186169
20532 -167868 -60965 -12972 151532 113568 -323314 56181 13725 84535 -168714 -46563 -107215
20521 -107215 -92742 -244150 72188 32435 -259378 -149028 -99255 95313 -302737 -96964 -114891
20510 -114891 -105007 -139642 234499 -65073 113666 -149942 -256536 -122815 -17748 -178190
20500 -178190 106191 -188985 -51652 -52242 76839 -74998 5149 -124742 81997 -62832 199151
20488 -72011 -76153 -222866 88954 192245 -174339 84681 -8575 25378 -32927 38808 -26547
20476 -103398 -66259 342951 89122 138148 -18054 -44477 74065 553466 -97952 -15131 -20503
20465 -20503 149190 225745 140566 -19220 -322001 -15729 -203841 349738 110321 -438052
20454 44418 418035 -22631 368563 16580 -189172 -454382 -73751 -192767 -295136 -44007
20443 -9961 95388 134391 75971 -11597 89149 -76081 102747 -85212 -25031 77256 -159401
20431 -165769 -71039 55056 -279549 -284316 14615 -402170 241765 -102392 -68783 -37092 72947
20419 -178326 -144490 -139221 39967 -104186 -110341 -85941 -58398 178921 113498 39213 -189858
20407 -76726 -246359 -48498 -45133 -81116 -63695 130135 -219597 85408 -225507 -91317 116561
20395 -135117 -168592 -212606 108105 -24599 94902 -92914 122337 159133 -117331 92836 83796
20384 83796 -84943 4625 -33572 -305724 82280 -285607 -264359 2715 -52716 -286703 -430989
20373 -430989 -161075 59827 -60240 -51456 -102147 -92374 -177026 -298366 -177915 136485 -318513
20361 250047 234019 192943 152010 60040 210846 -174983 30330 -217137 -224155 129438 -98106
20349 -17682 -27883 -91296 -132963 115572 185894 -194947 -44174 263791 87223 -156542 131491
20337 -88444 -245771 -57556 -125225 -119876 -3286 -7793 205335 59444 282689 -176599 178314
20325 -264884 -200779 -146238 -44137 92989 -36520 18877 -254399 -217467 -172996 87534 155319
20314 155319 157343 -106868 96762 42651 103557 -102153 -134835 -2100 -2289 -208517 156910
20302 -35497 222611 -182589 -134594 -97322 -73737 -82290 -230461 320477 -51977 109988 -172216
20290 -74168 28657 30561 -114813 -226693 50383 -146010 189946 27568 -355232 118441 -125297
20278 -5626 -76681 -131293 5498 115053 -272962 51356 -214155 141114 -238132 -67044 -79260
20267 -79260 -2120 -191576 -7466 -19809 11873 224871 -71212 45664 -46264 -81701 257831
20255 -107031 -170582 -118860 -168526 -65197 -6941 -19762 -369008 -167473 -107286 92353 -270352
20243 -149006 -110691 -112784 -25478 -207163 -236801 51103 76360 338651 -597778 -41528 -29647
20232 -29647 -107424 12809 45864 -98754 -113326 -25870 173468 -121202 -66877 -125285 233776
20220 108832 88978 -329718 -10571 -36441 -80070 179679 127238 178034 -268839 -12874 -104810
20209 -104810 -159875 -246585 265063 -180486 81708 14225 436262 -104032 184866 -236629
20198 -279293 -269356 -118336 -177842 59575 -162976 -49592 -378596 -199890 -26674 114001 166402
20187 166402 -259380 -16729 -249230 -82575 305053 29425 307744 -211748 210851 -150452
20176 -106084 -38354 259758 35608 -310669 -222634 -233419 77866 334489 81965 -184134 200735
20164 -44903 119568 136674 -53145 -5441 71831 -40519 -10374 -132937 102819 -713419 -219791
20152 -195169 -123425 -80074 204185 -141680 241350 243811 66255 149795 56762 204180 -65770
20140 61474 -16584 -97371 277771 95025 85239 -287154 -22098 100579 -149573 -281266 -67679
20128 -86226 304927 88077 78849 -24470 194511 -56496 26372 -144518 -5554 326733 1697
20116 158340 19557 -286602 -62254 -167881 -252677 77045 -44487 -321796 -140786 10213 -410868
20104 102560 -222332 183627 210098 -150430 -245659 -304249 179778 93331 -342123 166183
20093 -293569 361670 -59744 13874 -332349 -36037 -189868 -168411 -207679 108208 -327727
20082 277493 44840 -42038 45098 8616 12765 -120001 -54785 -18886 -44780 -112337 176446
20070 -258823 37724 -64328 32698 -65554 -45631 -41769 39889 60331 -111957 97930 -141296
20058 112532 -124131 -58120 59377 92109 -74932 85183 -2651 -49049 -235401 -74071 95376
20046 108485 -109044 270037 28042 20385 76919 104633 -319696 -190998 277081 116529
20035 -99225 -133108 189240 -1412 -83908 -151289 -265060 -127602 57975 169755 -184599 -157894
20024 -157894 -277855 29616 368757 37825 -448626 -186279 -22409 -289982 70710 -341951
20013 101741 -273419 -86314 227695 -148672 111693 50895 -135721 -138246 132230 -335203
20002 24938 72215 324417 228624 -302285 -37824 -12266 -197713 17598 60610 34546 125059
19991 125059 286206 -144356 80637 -217812 -301782 -352039 109450 20006 -19650 -101616 -188521
19980 -188521 20244 -58512 -117043 15345 -12972 205061 -15924 -45215 -94987 -238820 -168884
19969 -168884 -3309 -94808 11341 -302570 334302 168161 -295199 -300017 28908 122304 14568
19957 -69450 -64033 -103253 103164 26068 -37194 -198967 -60465 171582 -2395 -33754 12011
19945 -88073 -135045 66807 -267787 -214526 -430654 -229742 -18132 -241803 -21843 -126748 -176287
19934 -176287 -80060 240187 179728 -319943 10397 17433 -183918 189389 -18798 -52503 -2866
19922 48122 -143656 -70752 -162754 -290685 -293341 -345442 -127410 -65390 -186636 -161478 -206719
19911 -206719 -240714 -130261 53473 -54574 41963 -344605 149422 -174948 129987 -257400
19900 -485158 90086 -184676 -103398 137617 -125127 -336192 -113655 -96808 -218106 37989
19889 136356 114293 10552 258660 54090 -260761 -86411 -367385 67266 -237018 167592
19878 36810 127407 129264 -15455 -49978 -36689 -377947 121321 155907 -108704 77797 -106804
19866 -100043 -160110 31340 -158657 90501 -164545 -87515 -89262 319970 -268283 16705 59480
19855 59480 -118015 97283 -31395 -45083 86206 -247952 -326808 -149070 -50584 -29393 -104917
19844 -104917 110394 -3406 -365581 225432 -64191 -113158 -14780 16723 -188749 -170144 -325172
19833 -325172 -147908 -80357 80040 -272042 -270120 302053 26710 -236774 5812 189832 200696
19822 200696 -414700 -201311 138433 73023 150439 -405738 113998 -27667 -213467 281835
19811 -124302 -317821 -191203 -263188 -108970 -40064 -126804 209657 -105947 87270 235237
19801 235237 -160342 -5855 -146876 136257 49325 -54543 -80569 -145289 265669 364943 -45671
19789 163431 20357 49881 -215939 -128051 62279 -191801 -3814 200257 58091 188503 -64790
19777 -51190 -258093 16650 54503 391370 274600 299170 173435 -5640 -461239 16661 -89420
19765 -75639 -82363 15166 -526002 -157366 -160879 91269 27107 96814 -221937 -151992 110893
19753 415027 151799 -179030 -45185 77215 -48749 22729 188093 -2250 80134 227267 19063
19741 -22255 -211412 -99199 68772 -117307 -64089 -254392 43394 132649 191737 -150179 -250913
19730 -250913 -193934 121091 -39876 316036 13045 241697 130219 -219436 -238156 -3385 -75455
19719 -75455 -302961 -301846 -318043 -189237 74821 -249261 137567 -182422 -86473 -2089 103254
19707 26725 -67996 56812 -33110 109552 -142665 73464 -300215 87075 -43709 59397 -65529
19695 -108193 173647 -70543 32719 -76615 73160 -46543 -194309 124263 -19195 -220157 315485
19683 -330814 -11638 204663 194560 -72692 -327367 39205 -107706 21865 -132790 -106285 -272929
19672 -272929 42639 108869 80153 251658 -132466 117110 -284090 -128531 -81057 236358
19661 68210 -6489 -195806 -264620 149509 -309764 -104097 96802 281557 279185 246277 -96268
19649 -195243 -71800 27955 -100644 -212125 -141766 -255969 -12366 -86374 91797 29195 -75288
19637 13071 36360 130820 182837 -47723 74696 -534266 -26565 165447 -200110 12431 -213542
19625 -39500 -161533 -904 -492096 303769 214555 -477571 -124407 152242 -43992 -484875 372155
19613 -254897 -72020 51010 -127267 -380044 -118206 -5779 -188046 52597 -222355 37339 -40741
19601 -130353 30185 88914 -87700 -40412 109831 -298690 -57149 -243383 152730 -247779
19590 -229355 -253146 27117 -64582 139030 194580 -239855 -840 -72998 -193399 -238067 191220
19578 -168883 -281216 23804 -376587 111263 -141182 -63258 3108 92792 27113 -400751 352853
19566 28047 8547 -309002 -37688 11571 -206507 76365 -223142 115138 -37570 62909 229858
19555 229858 -33356 -140086 99587 61711 64988 38607 25022 -47472 115484 24993 77680
19544 77680 -200016 -413766 -137068 -17378 173731 32658 47716 -333293 -41320 -32405 -4336
19532 2075 -131355 265203 261871 82446 -228140 -52529 -151202 -59820 -130322 107923 -135445
19520 124010 -122894 -74608 40333 -276504 241930 -235379 426778 8736 -48271 59640 19892
19508 -36773 140986 -165083 -1958 -202207 130768 -119160 -206766 -7217 -152291 -199247 -425619
19497 -425619 -115469 -43918 240530 91217 -18212 -2101 -91974 133095 -37228 -22382 238849
19485 -194449 228056 252633 163867 -177539 -89657 169540 72478 -53122 137976 -64228 -175155
19474 -175155 238275 -171253 120441 -52988 352926 -150521 -99454 -120693 -187184 -290542
19464 -290542 5251 -96546 -53267 -121279 18357 -357514 32314 -168583 -63274 -33013 96607
19452 193674 -55225 80463 -67243 126025 -65336 -209247 211014 -240554 8262 -8507 44852
19440 12274 -193976 -15082 -261598 42080 -85860 -121993 -64157 43793 539731 -125429 81448
19428 55663 -263336 -26945 -216108 164384 12318 149676 -83983 -33921 -63082 113039 -9044
19416 -292196 203378 -1460 -150006 -74408 -92682 -112510 120507 -382290 32483 -77797 -141976
19405 -141976 265228 1767 -202225 -109942 -64635 134732 8654 -84034 129291 -417180 -280876
19394 -280876 -82078 86082 -171042 -30167 83753 -112385 -223679 -159199 -167977 -267906 103625
19382 96363 -179620 -55619 -459622 -288942 354227 -127739 -39309 69270 147349 -170552
19371 99453 37044 103431 28718 -144574 266299 126246 -25280 45211 -170316 -54523 -537390
19360 -537390 -215538 -56775 -92865 -319977 -35360 223931 237011 -338926 -328242 -104283
19349 -262381 -21194 -128561 126694 -73643 270880 49015 11491 -29491 86792 128845 13535
19337 -194538 -36173 110081 -255190 -131343 -138484 -50033 -36344 -47322 136138 207529 -16231
19325 -114167 -41163 -182267 -37977 -371001 -92740 -31017 -119059 114458 217953 -188025
19314 -177559 -96732 -184655 -185710 -121015 -210445 -192393 -164869 -159898 -62898 54051 -283616 -98552
19301 -60716 -216383 -105278 -84822 166948 38951 165430 97193 -124956 122443 -141972
19290 -120388 -437386 -106585 -27194 -131207 -315310 59403 -117484 -387123 -191846 -144748
19280 -144748 -82457 -32162 -371462 -326652 188979 -297057 -287022 111399 -387763 -395685 67759
19268 180558 -56704 -39346 174493 -231355 -30660 -164954 -240908 37934 115665 -143289 29649
19256 -47279 278142 39255 -231139 -319313 16275 63212 -119285 7806 -116037 186996 63521
19244 -326510 3003 -221940 158648 -59611 52521 80225 -98437 75760 -82003 25081 -65634
19232 55023 -314471 22344 -104612 -181274 104445 58994 -168261 -280399 -122117 -75727
19222 -75727 37208 238006 87200 -149409 -252314 -238174 -50242 -386967 -133521 -226639 -135728
19211 -135728 49559 76093 94856 -49427 -111394 74368 -79388 -33473 -121464 148584 608001
19200 608001 -61997 -27311 -16522 167496 77075 252145 226068 -32267 -122886 68261 191853
19189 191853 -242400 187330 -73808 -78198 -191811 42808 37178 219045 323906 12736 142454
19178 142454 -467283 -169041 105152 -31974 -141249 -191526 -206622 130522 -30239 209714
19167 76008 102007 36438 -314361 101816 -237820 -230006 32379 -204415 -3435 -123206 -71129
19156 -71129 -318601 18205 161838 -290836 -238064 -60560 -226705 52892 -169754 -112922 -7143
19144 148141 -6121 -169126 -124690 -438957 -245972 289072 -261225 -74815 17106 -7017 214578
19132 -311866 122901 121395 -227375 28263 5378 -179787 -344299 -5406 -154595 -231520 75236
19120 214013 -96158 -27021 -60645 56734 -209867 67736 142271 -89429 -181560 203809 -89810
19108 -3890 -159753 -93739 -62163 94732 11981 -397235 -134571 90517 -121320 114083 114695
19097 114695 54282 -90183 145344 30595 4161 -122669 -8816 226378 109532 124317 -236174
19085 -76034 223401 33467 344396 -89590 -90015 100726 -108290 44764 -87528 -191919 343135
19073 14933 -8541 -76173 -129737 -59520 -211254 91052 -15302 -277732 -49070 -159236 38431
19061 -51702 -341891 -353580 -226406 -15547 -146340 -134322 90839 -366914 -221483 -103616
19050 -227090 -152323 162183 -77635 85481 198114 -261896 -147697 -141128 -395029 -281976
19040 -281976 -175361 16867 -271423 -21067 -285622 -344908 -109978 -179404 49121 -252885
19029 -197760 290551 -62753 -64679 51749 111401 -14264 -148037 -226344 -277907 -124686 140261
19017 74687 -193239 51043 -204314 -323480 -16772 28532 -42586 -183792 -151628 82250 159230
19006 159230 309501 228021 -190800 377401 -43426 -176028 -225531 -107246 -6123 79750 -372541
18994 34955 268933 -118385 -68237 241652 -25216 10683 -338234 -32803 55782 -222961 -88584
18982 80956 206894 -68987 -71133 -14573 75856 -47113 226515 194685 -49864 83940 -182237
18970 -208234 121151 97785 88667 127244 -33388 72087 -116769 88396 104870 -115931 -68848
18959 -68848 1742 -125270 -86414 -63380 -29835 -139475 -232740 -100418 -65301 -118684 -103668
18948 -103668 -201277 -15763 21108 -24109 355376 131638 106709 -197553 -12553 27804 -31609
18936 188969 -98027 -133515 46668 74224 -68816 8980 116986 -123025 -30253 19062 -83567
18924 161978 61276 -83001 65869 -220274 122911 199655 -117603 -192369 -384869 -89958 -53939
18913 -53939 -122509 1673 -141780 -130457 -396997 70939 -101063 -30003 -448949 18072 145977
18902 145977 49259 127007 -259290 -105761 -31579 -117722 161720 -317680 -191245 -68264
18891 -357434 -135105 -115198 143068 -180516 -151715 46774 -225505 -212729 96553 22108 118942
18880 118942 -59427 -324589 -105971 -214530 -47742 -80192 222400 -29553 -307347 -342534
18870 -342534 177537 -426831 -277304 -90024 -66098 -170134 30624 -112095 95718 -119996
18859 -37269 -156588 -79775 -234625 -250413 197011 -64205 -272301 -114908 257267 -234879
18848 -81737 135616 -288576 -56695 18509 -87322 70318 -96323 90310 -103844 -41307 -17099
18836 -153691 242959 -616 -67327 -137207 -291167 -130007 -187068 -53303 -17990 -125003 -105493
18825 -105493 27995 -171580 -319459 81689 42461 34685 83882 -171194 -63946 133840 108754
18814 108754 -148196 -78689 -279941 84255 -257863 -158982 -156275 201931 -301413 -199235
18804 -199235 92417 334980 78505 -22905 94675 -293586 -193886 -68186 -47503 296079 -93117
18792 -518740 -183760 -30138 -17797 -51035 -18176 112561 69487 30229 142640 -267014 -334229
18781 -334229 -92180 -182499 134812 -192927 -97875 -5143 -25362 439712 126284 -109355 102089
18769 225823 -8630 -70716 -113224 -81816 28711 28340 477958 -270443 -98074 -7513 -205736 66850
18756 334520 -78697 33778 -61564 -137682 -123219 115204 304071 136402 -281979 -134555
18745 -305636 -512165 -84035 -44917 -63836 -1647 -416293 -12330 -22958 -177062 -105171 55392
18733 193839 -101704 -213155 -72837 -183876 112685 -158822 16162 -120050 -56361 87108
18722 -49886 158280 29658 -190434 89219 -294206 -164734 63307 40907 -95291 3353 -7951
18710 -91854 -103848 -79627 46309 -36182 -314439 32306 36345 -371491 -28909 170152 -64293
18698 -104125 247559 112027 -75256 -231760 -166377 70873 204470 211839 50432 -317081 99462
18686 -23789 222267 -89717 -180908 -99795 115339 -369263 108092 -201848 -50282 107528
18675 -110901 -207370 -218541 43404 114174 -23699 67850 106731 137133 -186029 -142994 -276181
18664 -276181 -143127 -380440 161581 -7228 15754 -131770 -34490 -61669 -348105 -17371 -254177
18653 -254177 188190 -200003 13494 -59122 5856 53319 -97863 79435 71408 -397506 -40574
18641 -104706 -26183 33377 -48938 121188 140152 -89290 104323 242733 49065 -60186 -16266
18629 -182128 -306418 121066 -348204 27120 69688 -149024 -76521 -323502 -309902 -151854
18618 -68050 52164 -81830 -125793 -64484 682 -124658 141252 -293521 -129447 -231468 -14471
18606 -369250 -246740 71688 31472 -3954 -304084 26554 -126078 -96640 54363 209969 -256163
18594 -64475 170867 -68908 -126022 -97187 -84712 80731 189637 -24371 49730 -20895 -40068
18583 -40068 181170 -176530 70398 -38436 138275 9287 -18 -287494 88019 -470174 -145290
18571 -208571 -94215 -298196 -215389 68564 124227 -77722 -110158 -345392 -38256 -199825 -246653
18560 -246653 -251952 46032 -49245 155920 -285567 -199734 114444 201703 -114687 -152012 299594
18548 192785 -382334 -137103 -366224 -202344 -298266 -184434 161266 -185679 99376 -278318
18537 70259 -162251 -71783 -16982 203041 27617 12891 -309654 154386 -241262 -98098 -102596
18526 -102596 -9638 23913 3175 231493 -241167 67026 -250258 232011 -265761 -228068 -84542
18514 183367 -94543 -124285 -105153 -109076 -334899 14049 -125718 -56830 -58288 32140 136713
18503 136713 -255703 112540 -50568 -480264 -14471 246545 -124911 -297005 -208306 -215006
18493 -215006 -115762 -146943 -86419 -24623 -146426 91630 90319 -244919 98551 -201766 -51907
18481 140046 -135644 -389729 -289133 -271995 166711 -64187 -124014 124155 -200545 -38188
18470 142563 -28964 -93886 19178 200483 35197 -76463 -80764 73989 92617 -52981 108695
18458 -30189 54193 187343 -285155 17726 235484 128432 140270 -20638 -80512 228867 38778
18446 -180185 67417 25316 -5437 147342 91866 -75836 -244882 53117 11275 -30235 -298061
18435 -298061 -240374 63732 -161696 -251897 -32521 -113712 64493 45955 -89090 26236 164100
18424 164100 -122326 64589 -180703 153125 112825 58247 -122889 -29013 -93603 134946
18413 -48243 -386383 21957 -185489 -147682 85021 -208936 -979 -377592 -147038 102300 50816
18401 551132 49545 147240 -190541 53971 -8120 251490 -261000 59077 111478 -9724 -17014
18390 -17014 99302 -27050 -84908 -56396 31646 -72244 36495 189168 -271919 -35452 -152376
18379 -152376 -237916 -202635 -285178 -194977 39008 171597 15028 131368 -176952 126191 80183
18368 80183 -227961 -134007 146966 -5016 -134716 -79169 -188180 -247291 -348772 -107126 -134772
18357 -134772 -109743 -157751 -113024 -4607 -222538 -210304 -61597 12916 11322 68732 -107740
18345 92586 -110572 76135 -18881 102523 -94723 72274 -107937 176066 -401689 -40430 -175351
18334 -175351 -120266 121505 -12897 52086 -68113 -30971 99471 66895 -235297 30117 -34412
18322 163055 -96770 -439067 58322 -127198 8586 112008 -272695 -145628 -87012 50884 45045
18311 45045 -376054 -223804 52357 97439 -150957 -95603 103128 -36946 165160 -33685 -365314
18300 -365314 -394155 123830 -130287 116030 -200225 -207547 229896 -92370 -17921 -81516 -77769
18289 -77769 -52690 -61715 105594 -362626 201668 -186598 360676 112240 285145 -174645
18278 3579 352472 -59139 161086 -63424 -197018 -105983 -296150 64247 -152178 197027 -361767
18266 -259147 272408 -37774 260683 -144896 332879 -95018 305186 46666 -208777 -37377
18255 165458 -6879 -201931 -37917 -43750 -111475 10617 -135882 43697 56618 -175525 -232007
18244 -232007 -7885 418890 -19805 150410 -159036 -254986 -82461 16272 100118 -176838 -132684
18233 -132684 118188 -201119 -73393 12522 -438572 -16879 400248 114437 225889 118187
18223 118187 -246471 -76021 -25059 -197900 -20861 -401080 43998 18299 -295893 -24568 -27450
18212 -27450 -345260 107478 27420 -22725 -102988 -312156 186633 -20379 -475701 -285453
18202 -285453 239606 -273944 -141506 -226431 112146 -408590 201945 136965 -175564 364452
18191 122157 -290785 -41301 -152822 26332 47066 377219 48073 70007 155861 -130993 270575
18179 74824 37415 -117492 -92026 334852 -61287 156533 170892 91810 -51882 -66996 -35845
18168 -35845 -35529 49377 137131 -200090 -92919 -186175 -176807 15384 -259577 -117991 -128319 -173010
18156 -173010 -315014 46650 -338856 -222897 -261263 115603 49134 169004 -234434 -146231
18146 -146231 -232696 -430234 -19467 -4892 88747 331324 114564 25481 -316127 -109319 -63953
18135 -63953 -216924 7617 189189 114765 -324663 283861 -132361 256059 -154088 -36701
18124 -255252 155338 -69094 -56194 -97857 50892 -16386 254087 144961 202195 13396 -123337
18112 -368080 -65555 -67603 -2495 -30675 -4384 -14418 -124452 -23333 78345 69037 -369863 89029
18099 188421 -129911 115532 -180414 112907 -101481 75927 -206210 -57392 -46891 -79240
18089 -79240 -316314 -100387 109057 60876 -293415 234630 165366 -270210 46047 178831
18079 178831 63784 161193 -173545 -99654 129609 -85923 -101545 73956 -285782 19111 -191773
18067 28867 -160182 188359 148888 192372 -114077 51453 -298064 81007 184461 35674 -19671
18055 -175962 -97196 -112030 -92428 70500 252999 10773 -183826 -47022 -103132 -114754 24655
18043 -104785 29730 -147189 -71972 -387384 -395409 -123793 126980 -46329 87990 126334 -216777
18031 83673 -4035 -331076 -106514 -127098 -192057 -365713 -127796 195860 146108 -324047 103716
18019 202948 -166679 -58680 -443349 -193155 -21761 131898 100953 -74570 169049 130630
18009 130630 -5987 -259390 13325 -59215 105085 170563 124685 118348 -122312 -62723 119978
17997 -338453 -317612 89127 535825 -55952 -28011 192028 -293822 -255170 25199 -9851 30817
17985 -310763 50398 -250521 167803 -236255 -185651 -71872 -166418 -190375 448539 153971
17974 -59819 230662 90 -185367 -225848 -18596 -78643 59957 131158 145588 127092 -111796 102742
17961 -30219 -160729 56025 194480 62171 249368 75661 167562 230063 140019 93617 39883
17949 -128074 160144 -284941 -61656 71199 61049 9635 66115 -28759 -135865 -254907 133753
17937 417077 -61972 51257 -112035 -166723 -70962 -62280 102019 317499 36807 105200 38900
17925 181828 -317980 23978 220228 23162 -45832 280905 -68951 45688 -373555 -14340 -117211
17914 -117211 96436 -31334 302752 280672 -122112 -450485 -254292 -275451 13284 29060 -423295
17902 181259 120038 -48498 -367903 188850 -208779 28852 -332663 -66737 158978 -121204
17891 308846 75120 -210015 227412 -71922 30403 -28566 86378 243407 148937 325666 77720
17879 20596 6411 37818 15615 36965 76982 -50749 178405 -47393 222152 107284 49910
17867 20577 -44903 92546 127755 217110 133266 62173 147630 -224729 1542 203954 -24597
17855 110816 -66586 49737 -206530 33526 -172048 104408 -62319 -78801 17576 140060 66826
17843 19847 40533 128573 277434 19434 176043 -48842 24955 63401 -255229 -284170 39632
17831 -38621 51957 -80059 47120 155366 -311832 83048 176315 -175978 -224878 153352 104872
17820 104872 44690 75456 175416 -121896 -40621 -204846 -35088 138216 -38841 209376 106471
17809 106471 103166 -212143 15898 167285 196610 -124414 -213755 73321 -170199 332320 -101047
17797 99284 -196968 80039 -97145 330627 -73707 32715 194937 -188357 81434 167498 -388341
17785 -14394 75240 44404 2458 -97000 -144928 -26985 -85419 -159621 -489288 -43982 34241 118598
17773 118598 -133886 83295 -93274 279393 91404 -125868 -210500 -49035 -34057 208153 -117812
17761 52896 25109 -489815 -182649 -72018 66498 -59815 86010 38205 -206692 -243335 -221841
17750 -221841 243782 -54239 31028 -27634 36522 -281464 12661 -45303 -53664 -96735 64910
17738 -2942 130038 497306 188945 -50854 -372511 -155669 -97665 78370 2233 -238736 214836
17726 -280258 30435 -228169 -465655 -114266 208604 29123 -3804 -165540 125059 74863
17716 74863 -124333 -395883 89986 -234641 200161 126500 -137534 -121785 91552 -3994 200089
17704 122774 -157428 -38581 53025 22972 87493 163765 -125835 -202836 -102638 133886 -209099
17692 -115942 119488 -96155 87010 16648 -31120 71233 17289 117813 20382 46111 -153695
17680 -143526 79749 301599 -201797 12255 -147016 76623 385614 222833 193939 64121
17669 -19396 99956 -104233 105806 -77533 30210 372875 89986 -72127 300230 107052 157784
17658 157784 -47696 -335857 342873 134244 54677 -190206 17103 106570 136004 -165167
17647 329887 99740 -101900 -136252 9334 61662 -27595 -233748 54220 -170996 404836 78444
17635 34180 -243732 -101891 -48746 -182107 -15921 -152612 95424 86047 -348107 -8806 59216
17623 22685 290777 -137808 87576 221638 -425524 57684 27504 95780 -90818 64309 133499
17612 133499 -384761 33041 10955 54034 -124881 -82979 271942 127094 -25996 -53841 50223
17600 16061 -27903 -201512 -190130 -59609 -59785 -52193 7477 -73096 255225 -251866 -29110 214572
17587 -136475 -143934 293360 236074 76573 -33479 214864 265013 379409 186868 43460 103081
17576 103081 51226 3038 -40990 120939 143883 101842 71138 220092 -8162 383627 -37619
17564 -17023 94979 251767 130192 -72216 27603 43550 -230740 171191 -80399 -66540 -161174
17553 -161174 45069 -8118 198501 19546 -126778 249964 117450 402362 36088 37246 247937
17542 247937 -19755 133598 -120670 319458 101394 36279 70848 242873 -222313 -198336
17532 -198336 180507 -189449 95978 370682 -123845 -168100 -148039 1217 9042 235217 -48942
17520 -202085 -180077 -102842 -11093 -189581 -84568 -37781 489227 102465 79583 -272465 286670
17508 131354 -53050 61404 -55013 168007 216699 148226 -128859 40739 -24375 399220 158464
17496 224216 187406 43996 192308 -44908 133543 285700 161389 207200 294004 220490 -81035
17484 -123333 313689 292304 -12887 363120 379691 -2809 5346 -235296 118308 -39433 81878
17472 -10409 19380 -14536 167164 104978 352989 -54420 -190138 259265 51951 66335 490663
17461 490663 291772 118225 419417 21360 172414 420214 -75790 426320 185924 7772
17450 -1692 365629 136210 262425 128573 321520 540724 155060 270495 296294 59173
17439 264614 149256 114878 290495 118598 98957 443384 417964 63108 71721 190946 -51240
17427 17435 20600 309536 205263 196955 178983 44830 469245 291790 -29343 48807 31376
17416 31376 36759 210643 212755 283109 -146695 218967 447 -124350 -76403 -167732 -20352 74197
17403 434368 -72900 58382 -193345 -60691 -153462 361488 -8671 449924 260148 -24726 79205
17391 -77659 1004 110771 -155776 221416 32088 -39274 -94919 52920 125822 171211 270164
17380 270164 -75481 108263 388372 204383 333106 75843 45762 145567 -28144 339947
17369 280262 340594 79727 175126 -2085 58299 328126 -162599 -52809 87665 161500 253508
17358 253508 257841 274940 567560 218779 124065 -251577 -48718 223057 2329 161524 167360
17347 167360 94670 371987 265375 256090 -7095 102893 -41877 247685 55246 -190430 116643
17335 -63503 166492 285705 334194 -194689 208187 81797 119319 275957 -68213 311020
17324 42812 221576 85717 226646 198040 -59720 -177405 292764 160114 152266 243261 53708
17312 107438 73749 157052 282840 17656 310613 183440 28568 38518 475433 124156 206988
17301 206988 191319 273831 280534 273818 102981 -8800 479527 -45513 67364 167974 1623 212501
17289 212501 265530 101447 616354 -3183 -208431 -27073 270004 118866 -39396 -224881
17279 -224881 286654 -57734 286697 318681 112944 325484 67645 469094 219196 -48490
17268 490845 200786 543678 14761 359047 82878 -160445 440378 96632 59694 150685
17258 150685 73053 367966 403674 266691 25322 264277 155936 330781 -212129 262505
17247 214979 303433 235538 195561 289096 -130779 498170 177873 -108751 -65914 192050
17236 224592 283658 491983 459127 341939 44106 362164 379449 -14773 257431 25933 189038
17225 189038 526768 -53476 287703 396827 149014 -11089 82238 176010 266045 240421 250398
17214 250398 464423 151628 -278871 351247 -104761 223662 -29480 -117909 343702 277850
17204 277850 179055 70136 65482 463340 553745 270195 59298 128220 255218 297404 210036
17193 210036 347609 65004 233343 96810 90934 83383 129817 433661 490840 319594 279226
17182 279226 207971 281509 464642 8934 155382 290827 382723 601025 377959 162427
17171 346804 229134 150675 252150 207168 179867 -37550 236576 269676 -36502 381442 408970
17160 408970 488217 218874 382895 115406 622338 451219 155993 115433 251084 245636
17150 245636 444575 459420 276678 582429 86378 245867 15379 395072 81424 333736
17140 333736 387541 161739 592189 126137 26906 379986 454820 305321 381171 178620
17129 336462 358485 184751 333929 -134208 58143 309582 379925 295964 247598 162937 73165
17117 657338 614537 -10259 387796 428862 474975 379280 321309 314738 553743 181120 383219
17106 383219 484075 461444 421881 455137 662347 598853 264359 477174 324965 754703
17096 754703 478869 885092 490489 412312 496463 406963 570463 465616 582459 371371
17086 371371 402678 531724 498085 313002 343649 568506 416405 -33396 719379 671618
17076 671618 143033 673439 655087 356540 376689 357304 138479 314284 56238 279797
17066 279797 102115 346753 240479 578692 138422 461576 532396 404852 393575 559900
17056 559900 117053 489796 401397 380527 565742 510075 141830 388746 545138 413942
17046 413942 425019 552631 563382 626329 549065 544447 241266 764040 515295 727297 563632
17035 563632 719230 642932 393810 744067 727193 478254 832156 293084 439798 713967
17025 713967 385351 961505 803371 580390 502124 648965 862692 574152 669448 570756
17015 570756 687587 701351 692961 760322 638218 695202 550162 762120 905901 862266 857216
17004 857216 578791 648763 1090103 581250 860359 860309 671344 967719 378590 844269
16994 844269 789710 911099 963403 949345 547424 761064 819906 804517 927914 710926
16984 710926 872640 577562 927249 1114338 708467 765489 718457 620921 1172434 833940
16974 833940 1226610 1146279 1046785 754720 815607 711514 761877 1149715 876329 885021 1085489
16963 1085489 987197 932818 1316112 1221835 1027701 1171609 1410181 1075400 1210432 1067155
16953 1067155 904717 1366917 1069935 1191335 1055368 1043811 1495150 1318329 1182840 1254546
16943 1254546 888215 895535 1102898 1142670 1349610 1601281 1115398 1090795 1170498 1291507
16933 1291507 1447885 1449448 1394903 1145077 1347640 1506761 1322277 1375023 1459032 1563300
16923 1563300 1465964 1487547 1474159 1935478 1445094 1947816 1595797 1508406 1537388 1789654
16913 1789654 1672027 1550678 1749953 1607449 1439257 1561344 1501582 2048891 1734208 1776287
16903 1776287 2083643 2021124 1943665 1953430 1904891 1791192 2027801 1779771 2113606 1988439
16893 1988439 1976607 2056353 1976374 2179137 2009241 1980721 2147674 2160181 2129050 2256036
16883 2256036 2362841 2197878 2259285 2072374 2274564 2425817 2529563 2554736 2339724 2402737
16873 2402737 2673508 2676927 2611148 2569228 2497329 2886481 2884343 3078235 3059352 2833866 2885739
16862 2885739 3192276 2852702 3357496 3128157 2969672 3106039 3335600 3526951 3171581
16853 3171581 3050257 3794947 3333255 3567512 3405928 3431307 3645192 3752427 3644907 4022819
16843 4022819 3990171 4093156 4329499 4258646 4457397 4188766 4230572 4354140 4319513 4627122
16833 4627122 4209240 4731777 4855829 4560502 5315544 4987372 5179800 5168160 5343323 5351185
16823 5351185 5379415 5897648 5565292 6281653 5745180 6054151 6345364 6454002 6509693 6341278
16813 6341278 6705991 6732019 6885667 6833579 7332300 7572600 7799114 7809429 7638286 8153752
16803 8153752 8167673 8429864 8806116 9260049 9361202 9128464 9559477 9936463 9881920 10676748
16793 10676748 10766983 10902556 11082098 11556127 11597772 12269637 12256078 12589116 12916978 13616294
16783 13616294 13851267 14356303 14417883 15263427 15611035 15869167 16758647 17552984 17732954
16774 17732954 18415458 18634283 19522809 20285779 20834841 21466758 22421266 23010991 23937976
16765 23937976 24728124 26053580 26782643 28055464 29219077 30213231 31406050 32976794
16757 32976794 34192511 35742631 37480857 38658725 40494602 42496703 44168729 46702871
16749 46702871 48455601 51018400 53161601 56035188 59200689 61944067 65501774 68205902
16741 68205902 71911845 75965373 79842183 84331281 88753350 93653260 98760130 103725837
16733 103725837 109491955 114896127 120768057 126815805 132773205 138893576 144643413 150088996
16725 150088996 155438694 160064007 164571614 168100253 170699790 173093900 174145276 174392855
16717 174392855 173260566 171515284 169038849 165308249 161584880 156397522 151353552 146266731
16709 146266731 139872708 134019387 128110068 122173672 116030168 110180456 104448887 98954316
16701 98954316 93661180 88996280 84563109 79884381 75513545 71933387 68148173 64660420
16693 64660420 61170638 58062278 55261624 52708508 50013770 48020916 45268654 43217064
16685 43217064 41356257 39589260 37759097 36052370 34481229 33333416 31712715 30356103
16677 30356103 29076844 27856637 27145939 25334536 24843212 23834348 22700859 22340651
16669 22340651 21333446 20708667 19989949 18901689 18741926 17909719 17557680 16881158 16424101
16660 16424101 15755990 15186699 15013870 14386425 13753937 13357002 13467746 12756377 12547510
16651 12547510 11845811 11884863 11317930 11234145 10904440 10631852 10253129 10029074 9355186 9417500
16641 9417500 9257090 8931541 8887716 8832202 8277551 8301748 7969623 7916869 7890935 7434534
16631 7434534 7468254 7537356 6970037 6787466 6903657 6505505 6368584 6548945 5890043 5975265
16621 5975265 6057995 5831517 5681947 5451411 5513295 5132678 5275256 5086432 5171214 4996189
16611 4996189 4877112 4940682 4828424 4899299 4626824 4501559 4455568 4185743 4296088 3851420
16601 3851420 3968387 4267186 3789859 4404860 3696761 3736171 3420639 3563929 3576423 3349238
16591 3349238 3234013 3281114 3486598 3422298 3107714 3260003 3184504 3225490 2839991 2829358
16581 2829358 2939412 2862696 2783459 2890198 2970673 2629742 2555743 2623952 2871983 2725854
16571 2725854 2690011 2760332 2306800 2442598 2417880 2523327 2358275 2216698 2284408 2152540
16561 2152540 2552932 1973341 2281129 2179821 2027745 1974249 2029806 2139911 1978804 1836043
16551 1836043 2035591 2117035 2046787 1955512 1751251 1865277 1712305 2327187 1592121 1878810
16541 1878810 1764031 1782862 1649908 1634405 1527599 1378205 1224287 1811410 1347036 1574924
16531 1574924 1456403 1868281 1557653 1505797 1277266 1665651 1519113 1598112 1477997 1498388
16521 1498388 1347701 1272502 1417887 1123173 1671609 1357781 1371760 1480709 1232121 1241950
16511 1241950 1126877 1290433 897157 1332056 1169910 1201381 1164783 1172220 1310487 1146038
16501 1146038 1449744 722560 1407075 1390624 1370348 1004189 1048946 1289952 1301855 909895
16491 909895 1357955 1106933 885895 995083 1237481 974495 1206586 811314 924825 912077
16481 912077 861639 957708 1231421 684525 841953 804447 1197851 894598 919934 727706
16471 727706 867821 1195661 1056916 888940 626829 836182 812431 871837 964872 434958
16460 842581 949962 1042206 640097 777324 756685 542154 571932 736626 668585 805740
16450 805740 829882 673089 887776 577302 583055 887198 807566 1180834 801551 638186
16440 638186 998660 553230 834574 427021 569983 560642 448950 780270 687571 662511
16430 662511 536556 811544 487200 627113 594057 644727 895498 754825 658352 693811
16420 693811 813935 589996 318957 393077 630724 745559 750249 679761 542189 579569
16410 579569 611379 542632 521967 231393 624123 352788 624156 457515 327389 539798
16400 539798 599800 765082 602744 588731 430332 378930 421769 700710 683180 521929
16390 521929 638358 718539 797633 455040 305058 440347 392709 764771 444731 641543
16380 641543 642827 532117 266166 402251 204003 396376 507088 45453 482434 546709
16370 546709 319533 651655 386494 660194 436469 485513 325153 336197 333422 564994
16360 564994 183401 582536 486770 380001 344001 156013 419302 239158 255925 340015
16350 340015 252699 496503 412071 367162 512306 121584 582856 296904 483100 234840
16339 149440 362345 485152 367226 246243 474801 503370 196571 39648 417113 -54044
16328 428182 544883 812754 247139 12207 182220 431505 142581 688439 -25644 263204
16317 392226 163556 436813 150483 281734 371060 113267 228782 371440 296719 214131
16307 214131 399445 232631 306003 449636 359397 276439 185762 234897 180283 154677 297408
16296 297408 321439 34584 146895 440746 198608 339110 442490 -12769 46133 -92604
16285 411939 482254 264180 356373 226723 499334 198876 123215 -130885 198180 426517
16275 426517 87086 139182 81343 233964 453664 149239 428511 263504 403595 305921
16265 305921 305435 72852 181741 140818 -269079 -79951 233385 415528 69522 -32525 54390
16253 138339 9375 509338 465411 149840 368867 -82179 79181 130379 14748 71529 391271
16242 391271 125223 82349 57440 471602 231945 230912 145071 591607 413432 484046 208506
16230 162647 -23121 308412 323776 -73534 480196 42195 272245 178510 -110395 103349
16219 100275 -46537 104085 -105752 -57044 212562 255553 240673 184108 -2320 125511 267645
16208 267645 296267 -66383 21236 276237 137468 270886 250185 230193 223782 162071 259553
16197 259553 -13840 362897 -76590 -120506 96930 63328 287303 515904 286202 560174
16187 560174 46895 213131 94179 33160 115866 -76015 -13307 115794 80484 -24350 255726
16175 132880 133533 161825 268617 33743 -102474 -17559 -124864 -95924 163161 -225555 60796
16163 224436 -17731 142155 -112903 103626 9734 277007 -122048 50844 -70817 -118513 98759
16151 80591 -145159 3214 181431 254757 350408 202710 278155 31513 290386 317695 -126208
16139 288840 65967 -121128 44922 166908 -233885 65315 214464 247608 118830 246701
16129 246701 181132 285910 -44866 58553 -152151 49149 -24578 27389 -123754 309648 166272
16118 166272 64625 127513 123372 128444 111333 3816 -9801 405497 32500 -92522 -103019 -182482
16106 -182482 -95107 -160481 158038 -60009 187632 363815 381037 124684 -277458 -101545
16095 133458 519516 -120412 45589 57763 51616 36872 196456 325195 161394 74994 -364751
16083 26258 207008 -12454 -76346 71892 41841 201919 224613 -153856 -29218 181402 211345
16072 211345 120956 -130559 207260 5922 -325182 332155 -228146 124172 -723691 489611
16061 -29554 151589 -112878 72068 -141329 72328 81855 138256 -126837 102001 -15643 74429
16049 3360 -216029 13380 1723 56712 320743 -35618 -106873 110975 49024 -42934 -27737
16038 -27737 47805 30733 -151629 147004 16699 31737 -164784 253345 -69809 205795 -102518
16026 -318240 93394 -287128 -159117 9845 -1867 -414715 -93181 -70378 -345509 -179044 -689
16014 141162 -175591 -190215 -152169 -29508 254134 354820 156201 218849 -33832 -84904 221118
16002 201521 -167112 36500 111226 -280746 106978 282960 -89329 -157368 -78547 89587 245541
15991 245541 -316357 215367 131975 -155646 77396 17396 147624 171107 229176 263480 424492
15980 424492 166256 246767 320015 190138 -71230 283203 39804 143738 -367812 -850 -23523
15969 -23523 162473 -205995 72972 121606 42179 122338 -191656 -162711 -144394 234994 238651
15958 238651 -109360 117720 117241 323867 102737 52450 -247925 -251994 -224891 185306 150342
15947 150342 228657 170091 -135487 -374342 -121433 170680 -433464 181231 149103 194892
15937 194892 -246705 134949 -179903 -150810 111382 -2212 288981 -160577 -22383 203128
15926 -172929 -159362 -303206 18715 -26781 -1662 177870 18588 -186999 -241642 5571 -393017
15914 -22703 60642 -68998 -18350 -73491 -6679 12590 -241845 -312556 -54192 -252232 256902
15902 19901 -3077 8527 222045 -244261 -81906 77704 -47068 46062 -225576 164001 -96079
15890 -35810 -286018 -112844 -39742 5851 -296643 188093 -40555 -5260 194226 211006 -157359
15878 -269049 -378350 -226477 -292895 16064 -113347 -89779 313957 -3251 2091 5787 -86190
15866 -158572 1149 -20259 -9858 355053 -745 87746 -58000 -128597 224755 -59837 -60785 -94239
15854 -94239 -143434 43592 52510 221347 178414 -164647 80754 54689 -99632 -159279 -52179
15842 -26147 -24822 -199125 -196144 -72201 -311797 187562 -4323 172248 -416257 -48254 -111984
15831 -111984 -111134 31773 -190717 62678 13808 -124470 -253269 -226720 -313273 -207572 -187540
15820 -187540 -94845 -194295 -87409 -70730 -135594 238636 67221 -172501 -12517 -11395 -8751
15809 -8751 -208821 -135385 -315785 -231333 128889 -16726 -211632 -291621 -164052 -293790 -182677
15798 -182677 -108538 -36169 -134853 -246849 -240534 -154507 -101572 -150666 -200691 133680 128036
15787 128036 -101197 -27443 321872 -177259 69993 -168696 -42460 50068 -213650 263366
15776 118106 -171330 251877 -133351 39042 -337731 -266787 -183682 -196387 85769 -69657 -40193
15765 -40193 -52718 -123801 -284113 -156744 411719 -133818 20746 -210255 102050 18702
15754 -1650 5126 -180031 22468 288806 -278252 37264 100908 -3407 82849 13487 -237881
15742 -117094 -100216 -205774 96300 -249460 22804 128906 -98001 -267620 287530 45494
15731 81028 1781 -193262 143737 -192346 -45431 86073 119537 35245 -121301 250681 -74035
15719 -52329 21694 -185701 -287124 1907 -262321 -62240 69063 -99610 37231 -35674 -206790
15708 -206790 -306575 -268382 -81779 73099 -95738 -49093 -115725 -262364 -85778 212090 125066
15697 125066 -216984 64019 -117567 50324 -25196 44711 130561 -65960 157961 -494686 36855
15685 59568 -414430 72082 109774 -10375 -40567 231807 598338 -96944 229362 35195 -33709
15673 255299 62512 106192 177536 -94432 126043 84578 248280 -64375 -57207 -177195 49969
15661 -112169 134598 -93986 230234 -104715 270621 69817 2958 -371009 12832 -111053
15650 -187413 -117065 153944 384229 237628 -191411 -36792 45101 152923 -195460 -273037
15640 -273037 22749 209948 31559 -100960 121324 53529 -20657 58610 -95218 34140 27262
15629 27262 6504 51096 245580 -155975 -344943 -129291 -89622 76797 -79869 69343 -119595
15617 -14386 184810 -145586 37471 154090 82355 -129095 62392 -60503 -241549 172998
15606 -58473 68519 -284501 221536 435 83200 -71440 -49778 263094 30826 155546 94695
15595 94695 38591 80870 65045 407999 176756 -64435 22081 146761 164957 183460 11573
15583 -142197 330667 -158830 -479122 131397 264817 -243461 20355 -268090 236242 -72318
15572 -90684 -170491 353557 -116115 199524 17647 -140120 6921 10282 -220213 -119054 72381
15560 24230 538721 31914 250322 108128 -25673 392669 122121 109789 -101001 -212845
15550 -212845 17776 -144016 -338398 -266876 -18766 -110775 -306193 -137764 137743 -81589
15539 -66095 37250 158929 -41436 -19592 -411674 -71800 -179191 342726 -102967 -140577 -380209
15528 -380209 -141667 11970 -109078 211379 219141 255744 12294 -28871 98321 261628 112571
15516 218877 -11039 180157 229484 356703 24270 371602 -36686 -35730 270626 111172 183336
15505 183336 -122290 218464 -50401 -88691 -86934 -54240 -3553 -89909 -42497 -218423 30172
15493 7188 -577794 -437069 -119607 -163213 17191 156373 41339 -146082 245494 -218260
15482 -3527 -459486 12200 75482 -193609 155257 -109926 178933 137083 351188 -67661 -60921
15471 -60921 -21640 248139 -41326 -216231 -14267 1970 184249 122418 78533 -207186 78833
15459 -102682 123878 -108586 -97402 -301138 11946 343767 166096 -187304 -233461 299593
15448 85271 127213 -206839 14041 329861 216149 242244 93985 -426466 -60317 258296 233499
15437 233499 189995 42552 67276 -151152 192544 -450621 66782 -162191 -6398 9885 47157
15426 47157 44488 51034 -124320 142934 36943 -78377 262041 -272429 -79344 -203095 114443
15414 6885 -8497 -58168 -47751 -59999 -141303 83041 7450 89688 142607 89950 -236147 128051
15401 44246 55901 4392 -120344 -49289 35015 -163349 -310592 33831 176665 14608 95621
15390 95621 108867 -163245 27649 -41560 -108588 133928 77964 25676 211013 -98851 -49585
15379 -49585 60725 -285705 -49776 -104937 -44969 -4251 -8728 283290 -173916 -320620 -75653
15367 -28341 134414 5399 296806 -42259 39614 -207506 34652 155293 97818 205871 -293590
15355 155820 -80082 -138866 54350 106932 -316612 98327 305883 153497 -354660 -181205
15345 -181205 -127024 113805 -354266 26253 -27545 -63004 -170433 -124433 -121992 151201 450258
15334 450258 67696 -78285 -127995 121739 -45568 102145 200351 -106342 -193918 154351 -182471
15322 -56719 91501 112983 32418 -208649 -109835 -32747 22583 124514 294690 -157478 243350
15310 222251 253576 -9823 -196641 99575 272670 254008 69768 17164 139822 -94787 -174563
15299 -174563 -120109 150002 264631 93653 127842 -156659 209516 38084 -27472 363697
15288 14432 205411 173151 142806 -16599 150593 85723 -25417 155471 306053 133087 282361
15277 282361 256479 177323 -88957 -312697 106041 116182 11195 -364297 98369 193172 346099
15266 346099 -44640 121432 174770 17906 180407 86829 114180 -166232 186700 -169350
15255 109065 -190389 -483 -208925 79475 265875 371838 -61358 338026 43262 359353 1139953
15244 1139953 2288726 2408200 2361649 2373148 1458330 220529 274390 -95988 -82147 365007
15233 -95318 116951 -108119 316064 176702 93239 275563 345187 -197436 62079 140909
15223 140909 10194 200172 64479 257599 -111895 230815 -4338 -122085 172661 211328
15213 211328 3453 231593 205461 -77726 -505 39619 -376605 -507494 446928 165962 480180
15202 480180 270581 -8478 15506 49248 -121869 -198388 -143155 78436 285769 -56090 288057
15190 -293283 144896 103074 66807 188398 -93358 -75332 75588 200926 -128430 55248 183913
15179 183913 334736 103092 110589 -119031 -108165 -97972 105894 -31255 148854 -21982 51917
15167 -30174 512868 199883 165276 173545 82503 170964 396977 321636 32330 204207 -259945
15155 209258 61948 -108609 255818 19609 73604 125091 255956 173141 72184 -131058 80073
15143 334620 93019 210461 112282 -152621 324731 241224 288476 148189 -234740 257996
15132 79908 -140002 73522 339412 466047 -163066 253967 90617 -68757 134751 160109
15122 160109 59166 127129 143344 329898 491763 200963 120029 288868 -61483 -73905 223491
15110 317302 -68430 -101805 -85861 -180359 147220 133358 279853 286740 164181 68834 100295
15099 100295 -2173 121880 228522 9534 -42532 10610 62321 -135043 101445 295343 -152324
15087 220400 313293 269336 -9179 192181 272468 39811 -96734 211589 536389 407252 205731
15076 205731 60756 434581 368481 183685 68500 150832 151107 220824 245932 281450 423162
15065 423162 123232 68825 102874 355162 -49704 -140430 215309 194223 234051 273396 72297
15053 295489 2577 -24268 263614 209246 308716 -17640 28499 66714 221088 177547 458575
15042 458575 105197 -125993 50440 -32013 56861 -2624 121888 91149 102945 614962 92620
15030 172515 174910 100011 395962 161676 221792 -197112 139538 120631 177805 212674 455156
15019 455156 339192 130322 350035 418336 115609 55188 174235 341041 409236 172683
15008 401323 129056 153962 114040 194994 468882 26689 409092 351203 168788 195704 135708
14997 135708 265472 308687 59358 73256 193502 334208 484718 368375 212557 248980
14987 248980 275069 177809 421224 309910 391040 234337 -34693 276575 326835 354817 224395
14976 224395 238426 128374 266701 150357 -110062 164574 11492 258383 357864 96598
14965 44111 16825 532339 -593 621853 498478 358347 326924 105935 288654 31446 229606
14954 229606 370323 316984 56263 431069 140659 389285 -63061 505522 27152 270174
14944 270174 346776 281045 527043 461836 4331 593615 170470 294556 -14715 315004 369102
14933 369102 381685 59165 306993 246046 -61792 247033 294059 315252 511358 456888 360020
14922 360020 302421 422074 362453 99970 219479 355458 293342 326572 248544 302666 287825
14911 287825 203735 716408 216343 251743 163994 427365 438067 195046 117925 179513 312866
14900 312866 277151 82993 251263 227373 617124 378401 92093 446676 401235 322384 325854
14889 325854 476510 432899 256560 154254 655796 213851 295359 633951 171410 383052
14879 383052 486417 330342 336925 603362 617522 473624 310771 151249 228999 408493
14869 408493 571367 267338 343279 296096 627751 631727 353795 473800 421744 540758
14859 540758 237685 444353 526927 91182 366136 512988 483450 267974 -50570 361261
14848 240738 434695 753865 549734 76909 331022 460896 336772 584170 734946 500460
14838 500460 507947 315838 588160 347165 650545 569298 602233 752952 628667 788322
14828 788322 536271 464337 133186 257422 282016 360214 405767 491896 407697 480125 528519
14817 528519 502899 174470 597058 604804 293975 385928 368982 415940 670581 651365 527826
14806 527826 547653 481300 328445 560944 368401 535128 258851 287347 153800 552117
14796 552117 593161 492532 790364 469907 343726 721117 432609 610867 470848 431552
14786 431552 622182 529003 422511 369400 517026 405545 711194 507544 806253 407744
14776 407744 606391 808232 935693 690828 962927 717700 484653 552779 680402 808649
14766 808649 457031 680645 506706 659112 675964 699065 742816 581226 590991 823889
14756 823889 596510 698309 783207 887034 739834 746644 633180 611341 348106 617487
14746 617487 683989 337100 927329 668778 673362 405981 326427 716292 944832 896514
14736 896514 610361 751452 586718 536894 936985 665918 1071339 667569 728616 694776
14726 694776 487567 858000 824560 592208 1005414 667690 643816 815943 972839 988591
14716 988591 1119824 937445 1049684 787811 721446 730455 793765 824063 748273 639688 930524
14705 930524 955394 1171025 796707 591288 765482 994157 536602 1167307 788219 901130
14695 901130 937575 1025830 841673 717097 1058731 982864 1073877 719358 1018128 994524
14685 994524 893453 862738 1118577 857953 763913 973969 760403 1221171 1047882 823451
14675 823451 1067230 1020210 749643 1286755 1148513 1152498 1153617 771291 1166085 949647
14665 949647 1042216 1076795 1356099 1271142 1164176 998940 1094242 1137851 943671 856704 1294177
14654 1294177 1034903 1309088 742524 1233549 1403781 663639 1387242 1159180 1289457
14645 1289457 1356394 1007567 1187286 1290667 1210911 1277495 927100 1464372 1053546 1273856
14635 1273856 1089683 1304015 1468142 1139715 1451381 938546 1260705 1155606 1641702
14626 1641702 983929 1421670 1016644 1536978 1612310 1292014 1376952 1502297 1248907 1463259
14616 1463259 1402694 1492718 1526882 1681038 1537685 1365955 1623780 1504326 1369500 1401723
14606 1401723 1325074 1415298 1618223 1782701 1608439 1569739 1472986 1757338 1531064 1947610
14596 1947610 1683896 1646052 1525326 2150165 1649396 1673975 1644159 1790881 1641985 1750847
14586 1750847 2106924 1779933 1687570 2074993 2030757 1875606 1704506 2020313 2003408 1965733
14576 1965733 1875646 1882908 1981226 2137151 2012649 2243006 2274159 2390145 1944305 2173810
14566 2173810 2421804 2373627 2675126 2561827 2576793 2417846 2439043 2972859 2963275 2952375
14556 2952375 3138880 3159652 3673853 4103869 4028564 4625807 5691188 7429001 11548849
14547 11548849 23403989 38503540 38298571 21764759 9875211 5661229 4324979 5690454
14539 5690454 6593938 4926890 3090217 2631653 1858335 2098712 2130047 2060861 2324456
14530 2324456 2099099 2191218 2295051 2162276 2300075 2223943 2161833 2114515 2566568 2457316
14520 2457316 2194946 2495980 2748819 2490486 2510382 2395950 2764083 2289647 2856856 2334226
14510 2334226 2797164 2807303 2590668 2663137 2782968 2793455 3080409 2909330 2765632 3009295
14500 3009295 3204124 3272444 3096880 3272487 3129055 3127488 3239662 3666283 3190426 3676599
14490 3676599 3411977 3433132 3604712 3455580 3484014 3836253 3571848 3505599 3617807 3970349
14480 3970349 3794046 4084636 3916733 3992421 4047402 4074390 4372247 4286006 4298647 4674921
14470 4674921 4212434 4480816 4625922 4600324 4498183 4731469 4377082 4887857 4931935 4819389
14460 4819389 4815877 4995102 4794538 4951185 5052654 5096133 4921514 5309672 5296485 5369359
14450 5369359 5250988 5425928 5637970 5731759 5561058 5798679 5892427 5765741 6015587 5858739
14440 5858739 6176673 6035650 6171422 6191994 6413074 6058140 6394971 6607235 6834750 6823012
14430 6823012 7087304 7024871 6925720 6655219 7128397 7400224 7460236 7495094 7653127 7453176
14420 7453176 8079874 8099242 8050475 8386992 8289965 8435777 8898659 8341947 8966412 8852355
14410 8852355 9348132 9068885 9210808 9440221 9627650 9598305 9896103 10204616 10385055 10011777
14400 10011777 10512989 10811808 10752767 11066363 11067939 11425818 11369072 11761064 12206160 12099476
14390 12099476 12069899 12657453 12862122 13164732 13196019 13628689 13864381 13859372 14472570 14720441
14380 14720441 14831587 14876906 15485793 15599549 15423941 16245161 16211017 16881535 17048629 17381628
14370 17381628 17223587 18419423 18488058 18733242 19622577 19890878 19827571 20645427 21265885
14361 21265885 21210863 21580714 22463857 22737642 23573321 23708379 24546172 25086025 25722818
14352 25722818 26484638 27027815 27736195 28165287 29113643 29454719 30545912 31160393 32210985
14343 32210985 32971661 33456097 34937069 35958816 36634343 37797019 38886278 40163032
14335 40163032 41050925 42234001 43269972 44751784 46261325 47770764 49280601 50772041
14327 50772041 52284875 54085882 55882648 57854105 60041523 61992784 64006066 66352426
14319 66352426 69024096 71837638 74391507 76853701 80212791 83189206 86933858 90141527
14311 90141527 93939685 97560672 101571566 105774924 110338691 114769596 119799965 125182474
14303 125182474 131281266 136910362 143136554 149964062 157144439 164647938 172491143 181469919
14295 181469919 190080059 199837698 209871037 220219558 231548477 243372089 255454021
14288 255454021 268114162 281833359 295464000 309872117 324771765 339423566 354834299
14281 354834299 369673484 384633990 399002138 412593654 425826588 437463810 447507858
14274 447507858 455910120 461852324 464066960 461391220 456248840 454100119 450893151 448278930
14266 448278930 442041580 433361950 423566982 411406270 397460686 382442812 366992879
14259 366992879 351445697 335486185 319995653 305138753 290137757 276017678 262265352
14252 262265352 248670478 236476434 225712297 215447635 204814619 194521471 184863219
14245 184863219 175918195 167898277 159715279 152151335 144980516 138177165 132024059 126462142
14237 126462142 120835447 115817938 110340102 106053212 101344060 97558092 93528004 89849693
14229 89849693 86349350 82888936 79848043 76689146 73601468 71398979 68559897 66221471
14221 66221471 63747014 61741307 59607246 57922349 55799618 53765392 52071375 50688307
14213 50688307 49465298 47919970 46471327 44586870 43717014 42679876 41910086 40698921
14205 40698921 38950218 37741010 36998640 36043749 35195410 34436890 33258973 32242056 31207719
14196 31207719 30573057 30203006 29530084 28787810 27911032 27508811 26798674 25593598 25595617
14187 25595617 24869248 24251155 23660629 23183301 22604530 22269766 21494488 21407461 21078605
14178 21078605 20193937 20236870 19972520 19205807 18922790 18406778 17969199 17649428 17145844
14169 17145844 16843470 16945011 16387081 16053799 15716621 15406410 14966997 15120316 14552838
14160 14552838 14140239 13807076 14111372 13561015 13472110 12881016 13096077 13015323 12493637 12431203
14150 12431203 11987341 12352606 11853912 11383518 11372799 11183425 10949894 10790884 10757419 10582553
14140 10582553 10312644 10337920 10075780 9803801 9666463 9336997 9506040 9796308 9253334
14131 9253334 9036148 8970223 9007024 8770786 8569371 8278912 8204407 8054160 7950472 7985965
14121 7985965 7881797 7981622 7616455 7881340 7427762 7502813 7327330 7061351 7399403 7008756
14111 7008756 6777559 6966479 6875233 6757194 6719535 6384604 6755195 6231353 6453370 6488046
14101 6488046 6655739 6098168 5785954 5798264 5743577 5661277 5607751 5706650 5830933 5434609
14091 5434609 5565487 5140841 5302448 4830109 5388896 5203473 5223289 5092782 4901156 4947068
14081 4947068 4941419 4962980 4977609 4849636 4645966 5014524 4505471 4243287 4352272 4436708
14071 4436708 4212540 4028534 4448278 4143167 4001881 4278913 4339324 4205425 4435256 4112440
14061 4112440 3882725 4277004 4321903 3652153 3883449 3726200 3702303 3613966 3748374 3951824
14051 3951824 3689218 3525464 3513673 3476864 3391293 3298621 3633032 3233512 3349873 3351560
14041 3351560 3281676 3291785 3400492 3034256 3079490 3321144 3191662 3134484 2924648 3385417
14031 3385417 3006662 3188233 2962391 2999868 2961354 3003905 2663831 2908877 2914525 2942317
14021 2942317 2756524 2481252 2886782 2390172 2422678 2441417 2575166 2460382 2647373 2740334
14011 2740334 2356344 2590006 2531210 2086615 2383935 2479445 2527437 2443464 2268354 2078487
14001 2078487 1913103 2185901 2325259 2127509 2025851 2054542 2160850 2274423 2297810 2195304
13991 2195304 2458137 2447533 3389733 5946118 15895411 33581249 39938655 27346658
13983 27346658 14977749 8768709 6213438 5079691 4190159 3997138 3208448 3128692 2979288
13974 2979288 2903371 2728757 2866773 2495133 2589028 2300716 2846569 2244613 2072442 2437436
13964 2437436 2313972 2354648 2271113 2090703 2236887 2136521 2100183 1945036 2156411 2170335
13954 2170335 2047038 1909300 1812500 1910276 2179464 2047055 1767497 1980221 1848070 2042943
13944 2042943 1956947 2042210 2048081 2098698 2122995 1608887 1730100 1719388 1903205 1638326 1566683
13933 1566683 1628250 1394294 1648259 1313461 1651278 1310007 1579960 1728020 1826636 1752483
13923 1752483 1795949 1475463 1496771 1737481 1346718 1491088 1668435 1354878 1541678 1442460
13913 1442460 1520561 1455576 1623519 1473210 1382842 1797135 1659435 1677131 1462439 1536472
13903 1536472 1785700 1468338 1241235 1297294 1235667 1497896 1288381 1337048 1380403 1431255
13893 1431255 1202254 1115742 1064932 1488733 1399821 1241538 1056907 1190480 1238305 1176619
13883 1176619 1345726 1363899 1219583 1021724 1361416 1510239 1419221 1180687 1327706 1138027
13873 1138027 1289073 1064135 902365 1578907 1250444 1230950 1149680 1376359 1160187 1297731
13863 1297731 1371557 976400 1237165 1346888 859011 1022238 1028624 1224714 1158115 1113461
13853 1113461 1268636 1142427 1019808 1187750 1246413 1304874 1011622 723908 800597 1030953
13843 1030953 1189048 890689 1054737 482996 941470 949629 619807 1097918 860291 1106853
13833 1106853 1138902 923816 960632 1231610 1093374 1003331 732539 943863 958756 516612
13823 516612 942000 966231 1232147 978001 729081 638728 1203298 688773 936819 962086
13813 962086 1172686 674670 800342 751291 795983 658461 715459 977536 872728 1096732
13803 1096732 1091827 508722 1026458 1024666 1055834 977184 332063 1094775 1295578 863233
13793 863233 659227 878071 833600 795576 675607 760205 788551 545770 752452 583105
13783 583105 656155 772660 789566 798143 653077 888347 640196 795890 629703 904943
13773 904943 846241 933032 479778 935225 725585 437610 472518 568928 754559 626028
13763 626028 719799 725325 1008002 588003 734917 563011 501585 576873 781571 504123
13753 504123 816106 765564 586806 388066 651150 708422 416169 683810 666208 446820
13743 446820 957386 403901 577620 538552 1061419 796654 559438 718354 800624 424752
13733 424752 459709 757792 589142 518206 497785 443068 387416 533064 544649 205055 702479
13722 702479 631903 625003 756227 498269 493677 450767 696679 614867 508179 414109 266135
13711 266135 688291 650839 545092 511767 727362 579295 824438 689377 534661 934452
13701 934452 740038 680856 294705 467970 508257 500032 427288 688834 393938 546398
13691 546398 212304 558000 419724 277307 117539 476880 448298 672874 275563 591512
13681 591512 383324 482349 362910 647343 632752 218244 696582 70048 308547 733161
13671 733161 522314 199060 473447 329479 214231 299141 565065 561971 690105 291558
13660 340648 305976 698278 455112 436374 686888 313089 663580 372146 248703 546434
13650 546434 329639 297823 634147 434115 245790 449068 598445 160458 433867 283918
13640 283918 304527 257237 269368 557468 329715 684971 445532 387109 723919 448943
13630 448943 567707 193571 100942 58940 509924 310152 620713 286314 165035 236251
13620 236251 396805 517225 434283 564589 656103 534503 548920 441689 238155 565616
13610 565616 346221 228331 143244 416508 388648 670941 451818 311066 495766 180694
13599 438579 325031 771784 455044 41885 414297 454539 431024 71000 676893 449841
13589 449841 253560 -45095 -13216 511594 391862 416457 455043 499405 311147 177857
13579 177857 220677 81524 375608 346393 225708 626245 245052 259339 297645 357905 174546
13567 457819 477225 578529 217831 216955 409669 216446 497292 93727 587548 84997 326854
13556 326854 132315 -62158 390495 432536 137864 337549 149181 435163 442375 165590
13545 660859 208186 266269 256889 399499 414042 495393 514523 557929 923 416815 636155
13534 636155 435701 340461 409240 253044 615285 460826 84094 459472 377370 249579
13524 249579 395897 147720 55117 216038 315737 184514 285275 94517 412123 142818
13513 186811 117156 551753 347774 343306 149582 328497 464312 -70475 122821 88038
13503 88038 252879 344887 234241 322512 518688 315843 108496 547508 351596 280079
13493 280079 278949 73070 -128778 466578 333725 273669 -18249 1753 450569 -95840 426205
13481 217176 93087 -24888 387765 367573 392002 162633 257182 -66227 115327 602688 467336
13470 467336 168378 58870 515705 325907 267881 475249 231303 280955 214133 281277
13460 281277 184081 181995 145193 234880 183453 -130913 186202 253316 256821 344995 189617
13449 189617 377654 452362 78632 247792 -55272 140352 102512 348387 2335 283277 200902
13438 200902 337025 313987 269140 410631 -81164 122237 353948 103312 251627 380332
13428 380332 286310 -1775 120067 163318 9197 195612 398522 251248 90136 23559 387065
13417 387065 93052 66316 224588 85472 114556 4012 301091 168116 -219969 394994 378323
13406 378323 5318 293515 323423 234429 -97021 163069 290628 -20530 -162748 53286 -54420
13394 104720 231246 -20475 17932 89469 165533 315560 312575 -61691 428190 146884 95192
13383 95192 380971 466192 198837 266383 -163110 126608 143863 418104 332491 136637
13372 21321 153036 117179 166246 294845 189179 198241 -285301 271192 380699 -18119 57064
13360 304747 335848 116502 153413 210882 292181 -41271 496190 206533 299297 184728 208220
13349 208220 196759 -22365 303317 280543 164522 415837 74457 306022 511582 335737
13339 335737 43876 319871 203302 338961 24814 157346 335176 325320 389064 150834
13328 72315 276234 113932 383989 27055 181352 -109547 119400 133150 339699 224738
13318 224738 288670 233493 208120 91795 307132 337533 73228 41480 135656 470025 296980
13307 296980 107598 117328 323552 -18915 225316 185809 80239 226827 308780 179015 -102231
13295 150267 109034 -26001 64242 48132 132767 -47774 -214783 202015 -62957 173211 507888
13284 507888 85567 340967 173422 90060 164397 320686 3685 200008 350201 411775 20532
13272 281608 302930 -117878 3023 157317 -65429 585141 84622 114528 -149779 247249 218524
13261 218524 155446 149005 -12974 -111922 577039 20407 -212804 63185 255037 -59444 -527468
13250 -527468 -191898 309965 106789 113508 6582 451980 -319528 239091 54567 -58953 15398
13238 149306 252736 587888 313949 116112 24607 69892 -41952 324588 231549 343383
13228 343383 -120375 229014 120078 290556 260597 67625 -49815 670317 -75133 202846
13217 241102 -111220 257431 -117013 446099 -246387 -5724 -36360 -160978 123642 -33412
13206 11437 -215412 392813 194299 231772 -88642 -141893 -59975 360479 229460 680 52435
13195 52435 356023 44849 97395 -187070 290371 141784 342739 68380 68029 -62512 230420
13183 239943 -99085 -77379 -25702 -172165 386240 26034 -150732 -17874 -115658 -294590 346863
13171 155780 242856 172026 225296 486252 128956 325628 170318 -456008 303495 251124
13161 251124 -109044 235682 325221 247431 -28388 14934 187114 62521 202122 165093 38785
13149 147482 98399 104998 -221343 -167 -171950 383120 201624 -46078 64075 -131123 47892
13137 90180 166716 218520 439291 167808 150623 -129239 343275 -3145 -99459 310432 97008
13125 255187 358470 255610 34971 109173 81665 189015 96160 306858 236281 161432 82425
13114 82425 38757 -170397 -130164 -137409 240374 -58727 210354 145752 221739 190463 -222037
13102 105105 -267440 345145 180609 135379 -3459 151255 194607 116915 242380 148054 -240005
13090 -46993 -166448 165287 -240579 224962 52926 238815 68670 281750 242029 -31197
13079 5195 -55654 102328 159407 -150452 166787 264680 -121549 -72102 -32612 48922 221466
13068 221466 -38031 -114027 281023 -160267 70239 219746 160300 183598 -143166 -52964 -205892
13057 -205892 65118 50207 59194 124254 143543 488674 -24473 175384 -78263 223499 -38696
13045 84037 -78630 -255283 224794 21644 95197 98873 52622 -152330 136537 59309 -186581
13033 113506 70441 41121 574244 108665 115025 -85184 21588 -36191 -27809 314779 -10327
13021 -131820 34019 251785 67921 230932 -154517 69863 226858 35653 -416780 233126
13010 -68833 5423 142229 376306 19839 100631 22663 -1266 -60028 92525 168763 183884 144370
12998 144370 -17111 53887 115049 65437 87803 -245309 203883 269916 -48722 135948 -99412
12986 383804 161963 -202327 -94443 364687 -264891 281996 -40541 -109403 48855 -275999
12975 -88907 177030 -131784 197866 -229473 74280 -194551 4342 1671 319687 258190 444947
12964 444947 33258 -30599 113025 97377 155346 -88163 28667 137988 -24284 134756 288246
12953 288246 -236384 -122143 75318 141952 126515 -168985 -126611 163670 -1034 28281 -165016
12941 206073 164965 238303 -11051 341809 256234 63200 -9759 7769 159828 -56865 195919
12929 73476 -116632 44726 150571 124646 168581 -259906 -60909 321224 12046 -112062 -442106
12918 -442106 85277 241697 -41513 80683 15091 306523 -165767 -34264 -195332 243777
12907 -198069 12292 4250 242150 -1957 104752 95968 -208130 -335442 344333 26622 -2261
12895 133279 294630 119706 57799 -133828 319033 642215 115461 163462 -9983 -77004
12885 -77004 27390 237590 -21764 -221965 -58699 -7000 -170608 197545 48487 163255 161226
12874 161226 427369 11706 -92661 96166 -69609 -113895 -25976 87156 143122 197951 445932
12863 445932 -84958 -47949 -179825 338055 -119893 -170317 89764 19063 -47886 177843 153506
12852 153506 -202012 -324717 28543 185046 51917 115874 88928 222466 -162773 139150
12841 241277 155489 173863 -63976 -123057 442244 -34487 136096 201232 -41926 279995 -78248
12829 -38122 7168 -412082 -374807 161991 11886 -220405 -76164 -67342 -38410 -189050 5103
12817 -137771 43303 -79620 275283 70171 -75203 9714 -47174 196779 79148 74717 -23229
12805 -125558 340836 134775 -411976 172212 35013 -38530 -36257 17842 218318 -133886
12794 245109 -55901 114255 -29470 354100 -37306 79286 -47821 -101918 -192732 200125 -60109
12782 -96904 -242413 -143515 126444 -9701 -109511 230025 5285 -3149 25668 119948 -192292
12770 236473 -261870 178248 9159 81234 40732 33172 130522 357252 -57392 -98483 -110709
12759 -110709 94392 6445 -12681 232900 -388500 168317 -26170 170023 -33853 -111128 138870
12747 -59540 -238984 -190157 -68683 172392 -203594 -98607 290350 89125 -23795 -134474 6932
12735 -203423 248676 233492 -16636 106941 39063 -27950 124592 -38085 -35184 176299 -126946
12723 185526 -141755 14700 -44722 140173 -177546 99411 291967 617836 281900 -162774
12712 -221906 -207910 -87541 612927 -81472 302272 209116 188467 133481 149661 349122 249
12700 53779 -106224 388053 -117727 49994 357323 -9742 374998 -292461 -16591 -114028 405570
12688 -188079 139238 -12494 -113053 248905 103367 123977 -70867 -84062 57672 -44282 174807
12676 -287432 346010 235462 -201574 154811 -39329 78019 -5492 -407172 32759 -134592
12665 -2507 6957 139055 128659 -20788 4045 148899 246289 29839 -46979 267133 -64361 143693
12652 202948 333279 -123247 84183 37374 18174 31440 -56185 -109605 294229 14564 246689
12641 246689 65987 115089 -8659 -142012 -217733 76144 146186 96667 -51996 -47147 -75401 62621
12628 2163 332906 320429 39210 377014 246757 38672 -173731 28488 294971 82253 -27780
12616 278284 23546 168490 -131556 -300842 18463 -32678 46203 -77136 -21200 362166 239553
12605 239553 391488 -31177 73411 -85889 -269503 376889 221295 -99886 -122798 215498
12594 -78812 -361854 6551 -185297 52012 215327 -213617 6505 149875 332920 -8278 311910
12582 93242 -103609 -78965 -200189 95587 -252081 158558 -29903 362283 -48752 68336 -104282
12570 -55791 114163 27596 -348851 35021 -7554 -44273 -44356 -209392 -47836 -186781 23515 240866
12558 240866 86542 173275 -249402 -302868 14364 -142126 307408 -2828 234130 102674 -79603
12546 -148008 239755 110296 109011 343392 268638 -96408 -108512 97775 -55172 103490 -68441
12534 -69698 78528 -133392 328133 528648 258797 -37805 -34640 70160 55193 42951 -1405
12522 164211 -121702 307784 7279 -222799 150428 -249346 377871 55986 -174912 -12540
12511 41658 63596 7190 267312 -46364 -101252 269559 231504 148114 207563 244669 13583
12499 -371721 243497 -39655 -183745 -2358 -246477 46264 25464 140802 -16762 42010 -102818
12487 231702 199734 -25236 -49028 34626 192490 -18387 -251645 -156331 55832 -35402 243960
12475 -4403 -66615 151990 -78703 18762 -248343 -113434 120296 -102074 -51124 -160324 -82178
12464 -82178 -23048 -320475 -219753 193763 62302 -188756 80835 98256 -263459 335295
12453 68803 14096 -32613 99105 -46148 94420 -4821 71073 -49845 -181012 27385 80176 22365
12440 211693 366737 95930 -104996 -330366 -525936 372068 -2384 23536 -179484 -144072
12430 -144072 -79553 -63846 -169276 254291 -243019 -90890 51433 -8540 -62719 -28083 99867
12418 -287711 -216932 -35315 77904 -113310 -143786 349036 242862 -200930 -45035 76 260092
12407 260092 -307085 -206842 211669 -455175 43244 100191 59568 -116197 269840 32883
12396 -106030 82025 95276 -11799 141349 -91118 -86641 356409 177852 390612 -197018 344294
12384 -158190 229855 -121484 -71899 -20027 106512 194298 -112026 313855 -71619 -122239
12374 -122239 -326160 -18701 -89183 -17474 -305216 265991 -24918 93638 -119478 370272
12363 201673 49953 353278 172308 70571 212439 175570 -141289 94186 165589 5500 -112031
12351 11474 -64886 -310929 -81962 250684 43691 142452 -100356 -200614 -39690 -40292 -150731
12340 -150731 -97107 5806 -165202 94502 -109735 188525 42948 -41683 -64882 208217 106625
12329 106625 17556 52556 163386 80334 291407 -210248 53461 -64053 -92473 25230 -87635
12317 89538 184778 356356 129690 -394425 -49358 -95244 -4142 19106 -27808 -175890 302381
12305 209152 -39435 -48164 89500 -231841 267637 -58928 93185 160292 399896 -181209 -53347
12293 -191311 390267 176253 -122131 385937 -350252 50523 89969 -83466 192185 -134177
12282 -220085 -87271 1663 68344 125969 -200699 -66539 15070 101837 300432 158396 119731
12271 119731 8513 105496 -105927 70577 324022 8491 166704 -251954 -44342 141978 -63346
12259 74924 463296 411129 1444 -8365 120143 111053 150805 196903 -71692 70991 74167 108253
12247 108253 207708 390108 155405 -73294 60625 -143016 13025 61893 34476 -114036 -192342
12236 -192342 -41957 134794 -106099 47441 -150917 -22232 210590 22084 336113 122414
12225 38897 72917 -72696 -22028 -4957 208619 -215115 276637 -4854 27288 167580 -86696
12213 51171 295724 -105920 343118 182176 74553 -81952 -141316 272086 338097 164757
12202 -25071 177222 254251 183484 313430 5402 200707 264618 194719 470167 131794 106625
12191 106625 -85158 -29415 100256 86038 64101 54275 -35119 174352 175335 9234 211102 -144924
12178 372884 215710 355644 -61007 170511 -179478 580 22400 179094 117497 -4056 211423
12166 284961 209622 202220 155090 -95583 425497 132910 221347 17511 -287503 -73255 276418
12154 250565 245707 77101 -247146 -60440 70187 7733 -12943 105151 9096 -30085 75449 245783
12142 245783 197566 -140586 -72558 -352342 295610 49014 -144353 -60176 223249 -48950
12131 218786 -86657 256775 -60374 -146631 25501 353684 -14902 69487 185283 -41681 -298027
12120 -298027 68279 88650 -268059 6559 163875 -98389 56340 -57645 12096 102592 -202298
12108 -103068 -550878 60380 -103191 161544 -102673 21688 202843 111392 -71624 371751
12097 -125463 21006 19129 -282457 -81486 -85507 -22456 -1768 27706 -247369 -266862 -41918 51290
12084 -139683 19458 9645 -169986 -3624 207206 129039 -177146 -225958 124163 197382 -24799
12072 121428 228034 -48444 -33506 -93764 32742 -127608 -18310 -402384 -11182 242740 777127
12061 777127 1150328 887187 258082 152153 151359 136659 60947 -26799 310970 -149607 -214869
12050 -214869 303404 121189 192592 -103754 34781 -214122 192695 15039 -22114 -3610 -26063
12039 -26063 -236237 -25296 -369990 -58723 -124531 -269373 -5797 216499 198468 62369 -116720
12027 265488 199792 123576 203565 -62582 -13717 16693 18032 338467 38180 55195 -17637
12015 45568 172511 -44034 64971 -163352 203315 316778 -321374 -133257 179608 10854
12004 218579 130931 73313 32705 19187 284759 -136439 131273 -193165 -196755 -73596 -64507
11993 -64507 209782 -12267 130368 295709 -143023 46027 -14626 -386094 124989 -60651
11982 -104702 157163 -263211 -61820 58243 70956 265588 -83446 63742 62426 66333 -187192
11970 -66203 -140908 -143646 104012 -125747 -103643 102406 -194859 35135 -199993 -89564 -81249
11959 -81249 -290254 -240023 -226532 285631 -139035 217124 -218244 -282969 -179245 -261284
11949 -261284 -36724 96966 -74806 -199312 64384 85591 288969 161661 263098 -32241 60950
11937 -192421 -84317 3311 92892 67277 -65378 -28915 -192053 -126402 165615 -87864 14992
11925 -102729 77526 63023 5716 -38581 -268824 -52758 225856 204156 283593 128154 -201115
11913 53471 -355347 58595 325634 -161572 127564 -164282 15165 131283 291316 233843
11903 233843 -100758 267555 -267533 -18271 -122347 -78150 228066 276625 -140229 -210211
11893 -210211 425671 -157357 1949 -44111 -106859 -91530 -218006 200929 220981 -79968 82866
11881 -154972 149077 -134825 175073 -108854 -106380 -448211 -29913 -178832 -77502 -225837
11871 -225837 -48505 -215070 -299292 -354328 -15004 -73711 -256341 -113853 -63533 -229500 210714
11859 -95065 -191208 12119 -10024 125307 29026 -390284 -224288 -49150 128427 347620 267045
11848 267045 126286 -87498 -451321 -113666 -150544 -12918 216824 52378 102010 207775
11838 207775 -66056 -174560 -151649 39182 175328 103691 -114014 -44991 -72103 -60146 -114765
11827 -114765 -58336 93953 -212472 103111 -174753 -102497 -436641 -255025 -58832 88913
11816 136569 -22029 -300133 -27806 -74483 -98272 -26003 -157594 -212530 171388 -91095 -154581
11805 -154581 -203280 18500 62011 107363 143277 -35047 -138116 -68694 -263148 -106784 -37237
11793 45374 69775 -78676 145740 -162621 166773 -545722 -11606 -220914 -75807 -170110 -407235
11782 -407235 23669 169568 -1394 -150219 -71445 -170411 126748 -7076 -76982 -159708 -235354
11771 -235354 -143658 -243931 -28869 -141218 -191022 -282790 -7537 182980 -351342 46891 117337
11760 117337 -235623 282445 -232624 210308 149927 -81247 174889 -113078 -134867 -65616
11749 17027 -230854 -143055 -150565 -308690 197007 -134141 28013 -281049 -143560 102878
11738 43462 -394943 202005 -61330 74898 -33139 147248 444028 -494694 -27948 -116823 -27759
11726 71790 77212 85519 112730 -44093 87173 17532 -31160 -118579 -84228 897 172931 -13081
11713 -114579 -65790 -106418 -201250 239219 -14748 -116885 -103159 76308 54697 402356 112199
11701 -5532 -55349 246362 -76388 -136636 -52782 -207902 126479 34575 -215072 253897 -112286
11689 324860 -147511 -182187 -292515 127448 -309080 -231396 -251938 218469 -86390 96245
11678 -61592 106158 202889 230942 -35836 -250 3938 -147467 168910 257544 438130 214217
11666 75716 1781 -10980 -178068 -191747 66942 104504 11020 433040 -105742 166419 125120
11655 125120 -60335 96572 -108118 -151642 -182940 39074 94062 154217 -158373 56810 -47993
11643 -126193 180907 -527761 130192 -125422 -72908 -189032 100408 103498 334974 -161046
11632 -30586 307535 56759 29179 -144543 -59424 -225643 336138 105216 2932 -78491 -2681
11620 -257229 78055 35346 146708 -160101 30896 -270229 -52574 77492 226794 158901 -110089
11608 29852 -78128 62252 131937 -239630 288517 -4556 3512 81128 142812 -294570 -187726
11597 -187726 120703 -88310 -59999 -20191 -241520 -377882 -40117 -144313 139909 12009
11586 -177671 37633 -55821 89309 134441 131991 225669 112399 237148 90331 -77093 -216054
11575 -216054 -169304 95953 567654 -168846 -94475 -32168 -71383 -166890 -138839 111418 -83903
11563 -63671 -127381 -231407 -130759 307197 -146886 73867 14308 144032 -150251 -195806
11553 -195806 172092 147553 -14604 -9071 466535 103983 -103708 26059 -138674 166566
11542 97246 -150802 242633 -8702 313959 111701 -109526 -99305 127904 134413 180515 -150161
11530 99020 -121003 -51045 119230 -111485 81843 81848 21465 -50689 171365 -37227 -10286 94338
11517 190489 -32704 -37508 71331 104319 71668 -67456 52898 256601 119505 162397 226910
11506 226910 117171 -105989 -80375 245838 3965 60586 -131139 -254390 -53058 97457 -77535
11494 395510 -74872 -219954 191584 -105505 359830 -121201 51566 344144 21004 13679
11484 13679 -703 126094 371665 246310 871 -9308 327434 57600 -107654 293328 -93311
11472 -165276 294182 62550 75939 85076 53522 105902 -34761 273774 116174 -244866 108867
11460 -66425 -45047 275205 213807 339454 -109231 41544 72578 -237852 225829 -67078 150194
11448 -263174 -133150 60690 -47406 -19715 15627 -177519 -181435 9338 -138668 40115 -290717
11436 274277 -24436 147737 68557 11833 4404 -14788 -106421 -121999 -222350 -239639 -12622
11424 109005 -259348 14478 259843 -90970 176636 -69922 69837 85885 300180 143105
11413 -150850 198874 202641 97422 -77766 36659 -232895 -292009 -31852 -473970 3855 -56649
11401 -54750 -273036 279235 -150462 -64981 131827 -53524 163553 69239 35512 377006
11391 377006 -91367 51220 -11221 -184662 63985 179079 -195483 -288883 -86610 5309 110333
11380 110333 115797 168297 -2168 132212 -152626 21850 82017 93658 131285 233578 200538
11369 200538 100359 -300370 213956 -379339 58063 -159985 -18309 -77043 -241895 -99174
11358 -253042 109881 13428 -343620 -83821 -84389 -117004 -231711 135557 -293985 290800 -12474
11346 -72624 83870 -31016 -227903 -40062 -209054 -6731 322556 -75772 53813 -91915 51056
11334 114667 -100330 -5085 -104254 -334116 -204006 -43418 -103595 102201 180458 167679 -12860
11322 -366854 5892 165318 248519 304147 267468 -92348 246502 -136167 56624 44464 39602
11311 39602 -132491 -75814 42260 98038 -249321 -350205 -64518 -28600 -138392 86626 -332374
11299 205734 -279050 -2403 94376 -130144 50328 101186 -200749 -42804 239335 -165135 -218043
11288 -218043 -140146 -214622 33356 -46792 -266544 -139369 -88640 186594 -442606 -23964 207729
11276 -95964 86878 -91976 175270 -167922 235234 -193686 -269266 -382797 -113118 -130907
11266 -130907 -129427 -258212 -18095 -310120 13020 -90002 -137417 18563 315872 100493 -2030
11254 -273958 165485 34511 45656 -118749 184816 -277241 -98078 -67984 184590 -22298
11243 -178111 105436 -357752 119172 -86662 -115351 134590 -46531 -287004 308912 -81238
11232 -114155 -18383 148965 144234 61462 -282235 7471 268323 98695 -83209 -144300 -165939
11221 -165939 79006 -182999 -19852 -112314 -191558 -259344 -209172 -30077 -16778 143394 198454
11210 198454 188266 127810 -165050 -15190 -49802 -74332 -175557 47314 -188542 294721 69718
11198 -168718 -109404 -275838 21951 -190747 -379649 -249990 -204103 123439 -56782 173158
11187 -241892 235075 -171024 -208496 14316 -154437 48534 -71407 18077 -163311 -33532 145917
11175 117128 147026 -55718 -29270 9305 -189938 -171775 -401945 69901 -28971 -45830 2359
11163 3264 71878 -177611 -21291 173911 180080 264514 24359 -43416 2592 -74234 192420 358723
11151 358723 27235 -14763 259350 -41160 -132456 -51075 -278952 266535 27078 194150 418058
11140 418058 76403 220544 333991 177074 -216497 115108 -30640 -146049 120552 200233
11130 200233 58590 -163990 -38037 -21024 -73529 -190326 27724 53353 22582 65917 24720
11118 -140391 -92407 183884 -276877 -273523 -66107 -30898 -296896 117161 5391 326073 105959
11106 42616 146163 307581 14463 -6677 -101104 80477 188019 267860 -134444 228735 101126
11094 449958 151562 -33092 -43154 285108 -167395 -17040 -15316 -119163 91958 39158 165802
11083 165802 137867 208710 -242174 402189 169472 -10227 143927 210938 229505 29564 277590
11072 277590 220002 -18915 -2382 142622 331545 233025 289350 552556 18352 538418 436896
11061 436896 272380 183422 394955 294705 -77079 275173 169891 475831 382069 403223
11051 403223 296312 501404 405576 550656 19894 448591 226609 484266 317188 577428
11041 577428 549400 649655 144237 177228 203253 477998 292800 289039 109293 430902
11031 430902 349447 509868 681959 399229 704621 578961 359408 633242 612315 389278
11021 389278 391629 647215 585258 333718 225301 537435 358196 300775 381768 619843
11011 619843 249020 120602 425799 415561 466359 543446 520130 334855 551562 491554
11001 491554 587537 624048 537604 376038 615382 250853 424663 396141 423260 536407
10991 536407 471948 456999 290086 513907 338226 565120 913822 547304 620763 525029
10981 525029 585312 1108786 668114 719304 1258914 1222146 1013156 1355313 1789902 2036674
10971 2036674 2061952 1888971 1970273 1898212 1751987 1968114 1395364 1076387 947517 1219362
10961 1219362 1159248 1247132 1092330 983165 1401167 903460 1030210 1036548 655495 552845
10951 552845 550342 850261 531213 374188 504470 -6798 19944 227896 307174 233910 249128
10940 249128 69137 112235 165772 42105 256986 -165231 -140523 324224 272503 161387 53477
10928 -15950 409682 148213 107076 224915 49458 92244 260539 -104722 340739 116040
10917 -87930 65848 24694 -203901 -55491 -64404 224901 -10094 -216792 -208678 -49240 -430885
10906 -430885 27078 -174003 50586 165961 -100415 -4270 -17828 -98143 60661 -26179 -175307
10895 -175307 -29028 105621 123170 -171109 309184 -39210 -214189 2844 106731 -18536 132049
10883 -112591 103835 72545 126163 -84897 -176006 169239 -269058 323469 -196768 -153441
10873 -153441 -164215 35091 245091 58704 -99684 -153451 192986 -128346 -203716 -23293 -178732
10862 -178732 -151014 -27139 79113 139645 -64146 -189167 -91384 287332 148461 139284 169746
10851 169746 -332758 -95336 -278258 141993 94472 -288056 -43324 84474 -316850 -71662
10840 17431 34377 76566 165054 21493 -76671 -204416 -62590 -107682 -198390 19877 59439
10829 59439 11223 131233 234459 30519 41804 -126943 -256912 -119197 -318177 226302
10818 293224 187338 -189797 126692 -262343 -352894 41968 65317 -191304 -142722 9317 107531
10807 107531 228546 7586 25244 -74338 -201718 -218641 -143999 138562 6235 114536 -106617
10795 -90333 225497 -297384 -176406 -245727 -180061 -33777 -217324 22226 116170 137862 170471
10784 170471 -190080 -203247 -177621 -9076 14422 -473343 -55623 177394 105006 90328 -284520
10772 -55378 -284099 12688 179885 -186418 -359105 -165136 -284434 -270751 44915 32090
10762 32090 -20962 -129382 162908 -149952 -284211 333648 -9814 36688 -29151 -48503 -24080
10750 -67048 -79871 115840 -276049 -182197 -125338 204560 -214444 60825 273422 -39845 307114
10738 -123812 -37797 -23590 115761 -6565 27653 -116293 -136775 -19565 24510 -52052 -64805
10727 -64805 -129152 140979 -114878 -203665 -3475 -17545 -180540 -124064 -220293 -179493 313219
10715 -207124 -228487 -263015 -25337 -131878 270913 -158610 13230 -56519 -299583 -283838 58018
10703 -175983 -109583 265047 97938 105842 -167875 141583 145758 -19040 -3016 307290 -113202
10691 19819 -192438 -167391 156392 -8546 -182997 -60687 -93653 -235647 179521 176182 -218052
10679 -169620 110732 -28919 115047 121550 -14636 38831 -426298 182332 -101387 -375476
10669 -375476 104870 -51007 65510 -302379 -90198 188863 162885 -212335 -150940 -156068 -218053
10658 -218053 -21861 38144 -14785 140663 -352288 -181127 -111058 66518 196472 113449 77021
10647 77021 -213910 295637 -242518 -38165 257928 -14816 -115451 350628 -95319 174878
10636 -20413 97375 -146182 161812 -464211 -234535 -287597 317675 -48508 152101 -411983
10625 -67277 -127827 -399364 112580 12201 -167624 -39381 -120842 167106 -70901 -93609 -131763
10614 -131763 -298942 -307717 20892 -405961 -94185 -136491 6988 29703 -354883 -65390 -232647
10603 -232647 195599 -33263 158008 50693 -189283 213290 173392 -82301 152148 197700
10593 197700 -10007 1530 87617 -455327 34285 110827 178323 -136633 24136 80739 76362
10582 76362 -30738 -125628 -49384 -215082 56407 49567 -106221 115744 -291009 -34541 128430
10570 -223910 49128 108877 94894 369366 140993 -433094 36739 -78627 31615 63440 96186
10559 96186 152280 -155375 212008 25147 -73903 -67068 19491 112658 -294084 -167343 -122206
10548 -122206 53443 -208153 17578 -401708 -9642 277206 297237 172828 143760 -38104 -210701
10537 -210701 -163306 110734 522088 -319401 144096 332541 145405 57145 -398495 89833
10526 314322 82951 -81032 138172 -77697 -178848 220147 -172604 -154322 473364 -164134
10515 4134 -172004 253820 -82846 -187953 -189274 60048 -152654 -219132 -64368 32309 -119631
10503 32896 164153 -120933 -192935 178031 -246250 -171658 99204 -118685 32623 232080
10493 232080 -130921 380992 -227820 -123179 -82419 -204327 -357356 67060 -39176 271347
10482 -98166 -42854 -117068 47765 63037 -136417 -7815 -140901 11838 -428653 -40147 110782
10470 135531 168521 -330541 -92308 -47356 20861 49925 18447 -12933 261211 -228848 -74966
10458 156609 -188995 -337304 -30260 -330258 28282 155651 49682 60169 -186186 -103969
10448 -103969 285304 50253 -282739 -194637 -351001 -84617 196831 -132304 81228 167474
10438 167474 98706 -49140 88571 19182 -221753 -8871 -197312 -24512 131724 270455 84135
10426 -82995 7993 371015 15071 -374643 73092 198790 128724 -78066 129784 94718 152901
10415 152901 64555 120739 235277 153414 143534 197585 -210328 26509 -101914 -296154 -100776
10403 44623 -100379 15250 -68548 230885 148152 -125960 74067 88926 -324909 -161912 151100
10391 -146518 178287 30239 -141963 142807 104884 214376 -125675 191828 -112089 -96459
10381 -96459 -50161 -158126 -210783 229037 233164 245794 345348 347731 241544 185556 190112 165987
10369 165987 -140157 115135 59258 80780 63569 444434 113216 -5098 329017 256360 120881
10357 213323 130825 524860 172513 267857 -38547 -175951 153209 35066 210827 454870
10347 454870 358915 121909 318925 -356665 22617 67717 128417 222325 6351 67419 -78016
10335 638979 209069 182636 -471740 138100 200724 -138462 -5447 81355 -25351 -132607 31961
10323 -26242 116439 331494 -111598 146624 189546 -69883 177013 -22728 35379 82738 -176233
10311 -87785 -58532 -175104 -2189 -153454 257212 37681 58157 -233355 291684 32128 -134533
10299 40914 250001 -128130 391211 -159897 122730 189299 -33336 -321175 190458 -36498
10288 -180380 -237135 -36591 -82068 -36764 44397 8592 -373597 -152128 -90759 154177 -338299
10276 112321 -122689 -228962 -306293 54501 -81680 -151891 -113774 -7594 -203200 127764 -41869
10264 -108880 -54076 -47573 -335564 -76734 215911 -145765 -297582 66520 209322 162718 497167
10253 497167 319805 254888 -35808 279644 116089 -23376 119359 292487 102719 -112016
10242 84710 -33920 98409 -206591 -3116 -48953 15504 32941 -284300 173674 27686 -175433
10230 -144502 124426 -296653 -241452 79722 -53504 31935 -30887 -83930 195157 -222819 232099
10218 -94616 -201746 -437177 -299213 -417720 -201931 29102 -234476 -49479 47841 -372060
10207 82053 8173 182400 -3837 158988 181011 -55198 153633 31640 225156 -216926 -266971
10196 -266971 -280264 64475 320757 -291070 266944 250654 -186484 -307888 71023 -334197
10185 -21251 -62393 -56792 -48099 -264015 110792 -48206 -333269 -35151 -90404 -66913 42483
10173 221286 -28399 -175118 -221538 -109711 -348164 58534 -364438 -301715 182610 -237733
10162 145948 109606 238780 13038 63107 73705 245630 -253691 -398539 -120016 328414
10151 -78775 -264955 21737 197324 134577 -160266 -290284 12903 -4045 25750 118021 82206
10140 82206 -66676 53334 -205759 91064 224444 -147391 -62704 244800 12980 -133808 -30542
10128 -278888 -33760 -194706 55958 -66870 -198953 -133515 -383413 111906 52085 -3048 -149107
10117 -149107 -85659 -269982 296019 269121 -82905 6480 -157151 343778 161006 -80990 219932
10105 -347292 81303 -130935 -139532 97961 -21041 -561106 -332083 16653 269470 45071 -267377
10093 -31621 33371 -251229 -342611 -349712 202955 154036 174365 85530 133532 192134 -158325
10081 131268 26253 60453 -136198 -260572 79953 129472 -73876 14864 -370826 -155219 55487
10069 17392 -59595 31407 -142230 -168152 -124813 -44865 -57622 94193 -93852 427895 14159
10057 -249589 -155349 -1417 -44457 -7663 -169700 -293379 -160448 -275076 -76892 115044 -97423
10045 -10934 557260 -276454 14569 222121 -110726 -120006 -113214 42094 -113416 148936 172855
10034 172855 -60452 -244377 -187069 -80664 53037 94671 32296 -81520 163560 -514888 -60076
10022 15734 -58747 -79836 -31638 -45387 -22116 32004 97103 -45329 -323109 15973 158650
10011 158650 -253922 -62594 -3308 -316077 -17604 -56981 166584 -524989 -335987 -120031
10000 161052 202055 -178650 23216 47545 -93715 85365 198030 33114 -106284 -112941 -74637
9989 -74637 272587 70352 171138 168811 -72437 -302828 6783 -25438 238145 -7308 -198710
9978 -198710 -100720 -44695 39995 190204 -14793 224640 -286311 -529083 128158 -73693 -111592
9967 -111592 -175225 171150 149129 75507 15235 6017 -61556 -37916 -93775 -172118 -290529
9956 -290529 -297307 -82586 -290800 -244566 -90777 -146837 -44804 37227 -27938 -147215 -122459
9945 -122459 -240940 -219842 -227932 -351667 -120143 -141636 24074 -248338 -165462 -249723 85719
9933 13874 -36768 -8933 -64688 -33034 -322916 -435712 -31264 -138953 -33691 -118586 43865
9921 14753 167341 -329952 93529 143938 -287836 132968 -41779 36616 -131339 -65983 -150281
9910 -150281 -501046 174050 -213263 127643 -262363 -346874 87983 -21274 86270 153396 231140
9899 231140 -383221 -150671 -275987 -64546 18067 -223980 -73505 28065 -277953 36035 223774
9888 223774 -96598 42421 220847 -21173 -267852 -17775 -305825 -108010 -68834 -284321 -31092
9876 74385 98645 -24407 -149960 135681 -51352 -333494 -78498 64439 378363 -151042 283491
9864 -164644 -228814 -189513 65968 5922 -9265 -74240 -293370 42371 110126 -101908 22552 57375
9852 57375 268367 -3438 -77008 -27823 -100653 -60056 -205870 46104 -185726 -193307 -361039
9841 -361039 -141591 -229943 72603 -192744 136150 -94993 -53372 162942 34188 211682 139965
9830 139965 -251808 431191 -22191 -97161 -96759 -118695 -111092 137943 -338923 -8511 116327
9818 45292 -288838 107285 120315 109662 41642 152785 -206295 -207170 -11351 -180487 89173
9806 196831 369002 24322 -92457 39140 -134943 -103005 -155926 -204362 -166186 -92699 117584
9794 199732 -299808 -17920 139750 -92860 325919 334223 -23633 -121943 7192 83890 132593
9783 132593 22572 -45940 -134807 -94698 -60939 -99560 -82597 -548452 -37921 -87953 -145045
9772 -145045 244725 -262295 54559 -132494 -269921 46733 -362264 -356487 -76652 -102595 213041
9760 -48498 134984 -169283 -24414 -3242 -276009 -206031 -127490 -285375 -2113 -318980 147908
9748 -109752 51914 -228029 46397 -146120 -368252 25818 207170 209682 -47162 152882 127634
9737 127634 -5144 135073 -67399 -31606 -353626 -5369 56625 -155616 -101061 -24844 -357782
9726 -357782 -115211 -459812 -392278 -38365 -35183 26652 -10081 105347 -201994 -267960 73546
9714 -70865 21159 75576 298391 146121 -43608 -366536 161701 -17121 2942 -334042 245069
9702 -40056 97073 -148599 -73008 44372 -225511 -56893 1836 116846 -107754 49583 -338413
9690 266460 -137089 -128454 137446 5856 12042 75496 -73974 -152553 -372136 -223834 114805
9678 -75335 -11455 -164480 -81799 -572 -269900 -105130 -88481 -389300 -113067 194007 -291391
9666 29423 22517 -142423 -462442 -23442 1893 19907 -379325 -147439 -60776 155857 67532
9654 -259459 -274261 213313 -271001 98993 201294 -366240 -231136 19129 -80542 338774
9643 -179616 157628 -446558 44421 165232 -312908 -154956 230751 20786 18855 50631 8996
9631 37014 -21085 -75519 24770 -83610 136732 -83535 130033 -178133 -108458 109016 40454
9619 134134 -219346 -15689 -7426 51125 -312157 -92119 -166687 -123565 -141214 -389116 -322 -61924
9607 -61924 -89658 253926 -121460 -241250 30116 -574435 -202942 -373130 -66066 63629 123952
9596 123952 -139627 503 -44422 -106408 100146 -33141 -86128 -100447 -203209 -41590 -74896
9585 -74896 -38078 13418 -159026 55480 -37161 -204400 10069 -117165 -183885 140708 -164203
9573 -5949 6340 -478952 -93895 372024 -11449 -131725 -386307 1135 -109514 -107719 376216
9561 -161112 -127624 -442868 -154181 -138192 140435 -125291 -411958 -118167 -44017 85356
9550 -152785 110825 -130741 82588 -207229 203618 25973 -200693 -4074 101677 -86518 -139969
9539 -139969 -487005 -73761 94046 99740 -15577 -222670 37049 -551312 138660 56676 -142284
9527 -230728 198491 -188871 -141260 -41577 -152998 -427617 -67767 -165728 -235726 160251 -473489
9515 -164918 -382597 207955 93365 231373 23136 -1298 -346278 -230677 -106729 -58084 -163205
9504 -163205 5200 2654 -237194 -138673 -76181 31639 16510 -35067 -44687 -10659 234173 -103249
9491 10247 -25193 -1377 14688 -168683 -126053 -129 -45855 -137202 -103492 193348 -159325 40085
9478 70255 -91477 -56246 -182310 -284880 -197461 133990 -116640 -268829 -11208 -158863 130160
9466 211107 158779 12741 -187611 250163 -238255 6873 -159270 -330827 290308 -157623
9455 -20732 -140211 -350209 47874 -195546 190543 -66859 -190917 141329 38236 -34495 -18404
9444 -18404 35996 6464 40976 -202288 103378 -410134 -143063 -33322 -190127 57972 150230
9433 150230 -130155 -445558 -296914 -106910 101811 14393 53270 871 -160553 33504 2752
9421 65112 -33240 2531 86842 -1295 1601 -163697 -183643 60969 -18598 64300 -38641 -340122
9409 -340122 9656 143995 -56833 62699 -105832 72182 -39211 -26926 -54667 -208874 -155202
9398 -155202 -138827 -296248 -59858 -195750 -182004 265426 -51717 102106 -208816 53105 65388
9387 65388 -185608 -34736 153984 -88078 -100097 45941 139995 -155937 123355 230482 -275476
9375 -38438 -2511 -42800 101518 175143 -102071 -126636 59465 234839 -196616 -183365 -203228
9364 -203228 32529 18403 -221341 -313683 -200541 211476 -156058 41185 -66052 -152126 -291798
9353 -291798 -181157 319302 65670 -204381 9074 -109597 -104524 -105524 -254258 -9149 -275901
9342 -275901 -92769 146611 -13390 16571 -84266 -232997 -14534 -44389 -169554 376822 -358310
9330 -192236 -72401 -169845 93740 -369287 -295939 -117902 -107297 -299451 103265 -136834 -389950
9319 -389950 -229793 59326 -115695 125267 -109994 382601 14781 -109952 -229941 -168874
9309 -168874 -49635 -296636 -108276 -228082 68704 -147284 -103415 -243637 280667 148456
9299 148456 -63225 149241 -148544 -92182 -230930 242815 31795 146506 -273209 -59934
9288 -35451 179723 -212776 107836 -145521 154727 61849 236360 -108319 62469 319461
9278 319461 -166903 -380951 -62625 210280 147690 -287165 -95216 -83632 -31677 -197534 -196282
9267 -196282 178430 185241 -256320 -54488 -78346 108896 -331731 7565 15789 -79957 24980
9255 -28153 -54003 85429 9290 -280580 -143907 -91419 47020 -134655 -95867 -296463 -158041
9244 -158041 -187977 -246063 -32916 -105264 -184994 -30367 46457 31165 -118947 -560476 -122501
9232 -139131 -20888 105864 405730 219713 -306660 18225 218564 -23412 45841 -283651
9221 -206962 -127141 -187647 98233 -17133 -104440 -17483 194691 -133402 224487 83923 -87388
9209 -71361 -18613 -4880 160865 -179470 69120 120576 -115733 -358882 -66610 -92188 76982
9197 -203734 -287678 -202629 -209316 -158634 1151 -83807 -229272 236293 -125177 -9364 -320247
9186 -320247 42616 -31986 -243741 75568 -185056 -517451 157218 11600 -265824 91913 25720
9174 -45482 268343 279008 81086 198695 -56792 -68880 -223873 -184225 -176891 -17290 -23479 -259824
9162 -259824 355974 -115990 41562 -116730 -24237 -166063 -53791 -78448 -146043 -101391 189118
9150 -68014 -213651 -197691 -12177 -229282 -172930 -54757 -71267 -34583 -95065 -239805 -146448
9139 -146448 -58488 147424 -22739 -116157 154342 -56048 251199 -13545 -282018 118726 -263832
9127 -28726 -77324 -64158 -3547 -102556 -315423 -137193 193776 78585 88285 27954 -285344
9115 183224 -36867 137704 -144878 -321251 104120 28456 -176941 -88675 -133822 -146430 115843
9103 -136101 -144706 -26367 160999 -200516 87320 -359274 -64928 -16782 74789 51357 68947
9092 68947 182995 11847 -323311 20031 -191934 77207 -324733 -285765 -145835 -331039 64746
9080 -124007 -254052 -40496 -27933 -36717 99577 19943 130798 -251903 -320430 52117 190012
9069 190012 99949 -152067 113077 -404289 -191002 -47983 -32033 -95339 369988 188103
9059 188103 250566 -317017 -241830 -91128 75968 97446 23515 -13599 73076 -9087 -110984
9048 -110984 -38861 176773 -13448 -110084 -27921 -207145 59297 139199 207403 233317 111694
9036 -196836 283835 -336770 -161398 348072 -11273 -231940 -207412 -49775 -178294 182744
9025 -335004 40433 185414 20288 -65013 117136 15371 228838 211390 -483344 225041 -4086
9013 15348 -114321 67041 -235339 -115213 -99362 -275071 -33543 222534 182680 -75671 -210387
9002 -210387 -60123 -238003 -83683 -123396 -320817 -382121 -383837 220176 250703 -156256 159764
8990 44904 -214914 124677 6472 -195183 -235776 294807 -67294 -165170 -76461 89820 30331
8978 -183279 -124748 72010 99551 -250987 178571 5006 227440 -185193 -43094 -250414 5633
8966 -208839 76921 127002 -268543 175617 -295171 -84298 -222512 -181828 -174723 -199194 -542622
8955 -542622 18669 -212924 -41213 -108971 -294298 119599 -194117 -361910 174379 -109410
8944 39102 -241631 -107506 43180 139370 2164 -87303 200861 110199 -87108 76202 216516
8933 216516 -48713 428086 -129247 140235 47967 278003 -59278 -76616 167686 531790
8923 531790 382186 1934343 3693965 3211317 1200129 -99495 183085 385793 -34520 -3910
8912 -107148 -114753 203443 -405346 -109587 253488 55089 60115 385673 8524 -25977 175356
8900 121090 146512 133266 -138533 -27156 -168979 -294135 -42399 -104471 -185872 -75790 -195497
8889 -195497 -189291 -262168 213360 -25884 133611 -335090 -311796 46266 73266 -100061 -168494
8878 -168494 -160431 -84974 -52498 -172332 -8339 62963 -72011 285084 -252642 -286922 -88451
8866 -30827 -218133 -290105 33807 -30804 3774 -154046 -181023 7125 -82894 304089 -140228
8854 43074 -125546 3216 352964 13918 -279692 -37736 -154305 284307 -133073 -51933 108604
8842 180244 3042 -102603 -11060 107273 65743 353326 -265519 -235266 -95408 81784 136753
8831 136753 -332936 17262 230651 -149422 -12473 57523 90912 -283242 -77611 -6091 -362131
8820 -362131 196214 155767 -108240 -187353 -176234 36118 -399828 115707 -32899 -64187 71078
8808 100566 52174 75161 207475 12355 -125674 95851 -250103 -227023 259645 21457 202670
8797 202670 40788 361096 1503 129814 -24915 -168715 -180221 -17434 169738 25143 -4228
8785 -263307 -28122 -12914 -142429 -97602 198669 -20228 -96501 96988 -38320 -144807 62912
8773 215434 135134 -215454 -115602 -259759 -109746 23631 -144850 -146400 -17387 30666 -126609
8761 173341 -33704 275239 -14532 -279135 -270450 106952 -918 15532 -91570 -140468 -220204 -95975
8748 184785 -277183 146958 -114686 251033 -386437 -19038 -51520 21688 3904 -122914 -47994
8736 -130374 -82888 309162 -230699 -280341 -171050 -57636 -25392 285998 -406448 -182379
8725 514 150349 -87333 -224810 -66737 18507 150628 -560256 -155756 -167080 -332843 78671
8713 -5936 31825 -402776 -139273 38823 -27367 -190040 -79674 18880 -81120 -334385 -37649
8701 -85822 386843 -106944 -212456 140402 245765 -314842 204288 -81061 -19183 -156724
8691 -156724 -5316 33987 118782 -23563 -119343 -302738 21087 73102 93311 -244870 -74252
8679 -6256 -408319 101001 -25213 -74592 142563 -36352 -80071 -5206 177139 -99230 214081
8667 -153747 -18794 114965 -240624 -175752 -140928 17511 22703 6031 -63243 -80031 -182906
8656 -182906 -349498 -325398 -73959 241308 -270658 54157 50422 -22802 -426180 53008 -114495
8644 -28561 101787 -288350 -157342 -168367 -108980 -220403 276611 5206 -99263 17073 -187112
8632 108847 -22404 -379231 -199840 -284441 -66750 198779 -120804 263489 -1950 -299845 -82725
8620 -121663 -16390 -117714 -77212 21260 130780 -212282 -170258 167289 255694 7324 -52850
8608 -151582 -113630 3661 29429 75719 -80789 -112690 33257 -218360 -72368 -38522 -146751
8597 -146751 -4979 -8949 -345010 -219013 -119139 -310363 86557 -294275 -130359 -309434 -200738
8586 -200738 -278444 -80405 111900 29153 -321450 -115995 14840 119760 187583 151651 99971
8575 99971 -118511 23147 -298616 -454817 77225 25377 -132651 -81585 -459811 -209167 185188
8563 166111 27272 217898 173111 -232365 168465 171171 31064 -339116 14816 -148081 -125322
8552 -125322 -266322 -6610 -270326 153976 -31788 21793 233316 -164416 31435 -130878 135389
8540 64541 167397 113219 -92540 -348628 -120355 -35146 -254831 -63758 76271 139018 123064
8529 123064 21289 30059 -127622 -139054 -339676 16600 -105853 -256269 250067 -166706 140316
8517 92206 -20234 160887 69137 216800 94937 143121 140884 -152877 -151984 -82623 254095 -6146
8504 208946 -25709 14272 94454 316193 233290 -184913 -642 48499 -101803 -116469 20024
8492 -177969 38776 -223577 -149227 -171934 -92929 152261 54133 195005 -292023 -156295 250540
8480 30288 -68004 38761 -106049 -153523 -63796 -12647 -155590 198950 -70481 -132436 -150700
8469 -150700 209279 -106802 55612 102255 -397793 -54938 108541 77102 -93593 -166009 -7275
8457 192906 -73953 6819 17664 124726 -75165 -140989 -51729 86403 225000 -46224 -128662
8446 -128662 -264658 -43699 -6375 -372324 -189367 -138924 -234461 52978 -247092 -304445 -18945
8434 -15543 -130404 -270490 -86676 15268 -96880 109243 -170619 -183908 -148194 125934 -451818
8422 -127230 -112518 -369851 92240 -117688 -170844 -120293 47844 231796 286912 38965 47705
8411 47705 179691 143400 -38373 -65725 121421 -300180 -42561 -265077 -116714 14178 -290617
8399 -169546 -302915 -71087 -137633 72444 162454 -27456 -4511 -518187 88055 -32860 276095
8387 143933 -164522 -208639 -155104 8615 -121077 176869 -25560 -259927 -175470 -254785 27435
8375 -47410 -64221 46957 -185319 201733 -15287 -306482 -24052 -80663 -221306 -198049 -161368
8364 -161368 -295734 92370 -96100 248429 366689 -67623 113734 -44723 -137439 -76558 -125499
8353 -125499 -6082 -153498 83593 1549 -108169 -123213 -405310 101800 19830 28196 314786
8342 314786 54106 -151219 -147695 236706 140203 -52830 91737 1165 115942 -80514 -174003
8331 -174003 -45370 133911 83901 -23905 44093 38022 -88602 -168119 103219 65646 72290 162873
8319 162873 69945 -178619 94735 -16438 -76228 -127154 322095 -83774 181330 -251586 101481
8307 -94044 -72249 -225515 -238348 43404 -421469 -42251 -36312 30486 32193 -145966 35830 -84445
8294 -129962 28394 39509 -160628 36744 -158126 -146320 39300 -188271 -86861 -49391 14583
8282 -27744 -277162 67358 79349 124453 -959 -214305 -71882 85011 -19672 -213693 235836
8270 -27857 -185644 438315 -28578 -186215 -64381 -197764 -316509 -38406 190074 -46590 205786
8258 40936 72443 -183338 120439 15926 61587 -112898 -115868 36101 -132514 -244988 10533
8246 16709 -290818 259024 14657 219292 -35904 -68803 70530 -222455 -249342 -36008 269975
8234 260778 -209532 -324320 -277319 -208659 -12765 -213592 -221002 -139662 -297530 -85543 -2136
8222 106921 -84755 79187 302349 -151177 -307305 -142035 -214454 -152470 375695 12944 -213188
8210 -92563 -155857 306950 76489 -48387 154695 -73908 -60442 221415 -47082 -96717 -75640
8199 -75640 -41035 271341 107319 -105497 -168490 60350 47961 28681 87107 154984 -5296
8187 -20750 -198133 -147003 225255 125038 -95893 -98906 159422 249874 282769 -168509 -181815
8176 -181815 29716 -195136 -30075 124310 -391092 -1550 119474 -179806 -263869 46682 -54436
8164 -160472 24042 96760 -292944 -123310 37778 3433 42467 -244825 -379573 -272971 85855
8152 139227 -427 -140064 -255727 -379305 1052 184281 10259 -165431 -121828 -233463 -138536
8141 -138536 -93193 21626 -308850 -102891 -204626 -48633 -81787 -64626 188628 54593 -100471
8129 -196232 144565 -555 38207 295378 11223 -88987 -29329 -17969 -109735 -86184 -190168
8118 -190168 195426 147535 214059 5917 -292199 656 274253 18246 -158332 -145327 -249552
8107 -249552 -217607 -179196 -17878 137320 -240136 16183 -335158 99399 -187627 138176 -71788
8095 -61294 -215248 -165664 -98921 -62620 211962 -168701 -27388 57143 191932 -26893 -44525
8084 -44525 75877 136167 -3059 -186826 -165371 28584 148747 -70021 130856 144255 -14245
8072 42097 513 -7669 -17280 -144432 -276244 4517 -230460 -165899 -266060 96811 303432 -318908
8059 -122272 -108765 128009 366037 -71911 46980 117804 -23680 101995 -331426 -76070 -243522
8048 -243522 -316767 16725 -207722 112266 166592 -51393 177814 271799 33477 -56871 -185953
8037 -185953 -123862 -146312 -44421 -230586 79722 -33227 160723 -197542 -179098 167660 -323576
8025 91468 39059 -58250 75568 -232817 -122810 13380 -80533 122810 -120498 -44402 45795
8013 218734 -135350 339375 -164599 81015 -52683 -286916 -109263 40382 -172569 -133256
8003 -133256 226767 47681 -12316 -288122 -64052 154527 86385 32413 -67155 -43140 62811
7991 -88034 -52991 -62746 -299611 169261 -211130 -347723 -196918 -182439 17111 -32038 275582
7979 -54677 262931 -142425 -263410 -55282 125870 -377318 -56871 -297715 92643 -164700
7968 89024 -116087 53584 -255667 -280486 132375 -2850 261941 -70184 141444 -45931 -486651
7957 -486651 -280367 -40354 50605 9364 -105921 -149626 26526 202335 -147161 163188 286677
7946 286677 -51261 106000 79547 -515090 -251766 166509 -64431 175803 391567 -95654
7935 -28428 326606 44344 -55239 -4590 -172189 19180 -121519 -18942 -158331 -415963 45389
7923 -221646 -203139 -43315 -237195 179655 344645 154514 107917 4654 -398958 57679 -152874
7911 -129609 91341 -181614 424392 -261774 262474 -61245 164196 -53302 -100929 -201416
7901 -201416 140727 -114680 -96292 94741 -203594 -169546 -179568 25839 -208638 324240 -94589
7889 158995 -4887 68420 -427775 -352038 -23166 1494 -14701 -241335 -336033 -282154 124698
7877 -535851 258190 144700 60224 -218854 25284 -271850 -79632 -146195 73236 69772 -160104
7865 -183521 80809 178260 -382543 145334 79572 -229905 -100317 9765 114270 -12666 202739
7853 -206564 -395321 479683 -103395 -48295 -175974 -318785 123540 -302874 225105 18453
7842 13916 53245 -174431 -99552 94558 6768 -59223 -78088 363844 140480 -68641 -224455
7831 -224455 -85835 8509 -86773 -16037 218689 93851 -121902 49752 -338242 -5129 46009
7819 -143307 2882 111932 33986 134526 -108846 -210946 198655 48589 -57583 95490 -27264
7807 -47815 -132100 -184638 142376 188708 -357803 27778 -106523 109290 90071 -64018 -28114
7795 -92044 147297 -206918 -93499 227565 -92630 -80674 -8254 -85963 68035 -78885 223685
7783 -74194 -31684 -7990 -49077 262836 180379 -185456 69389 -221050 -238353 147875 43997
7771 65699 -112865 -325707 215595 227195 24764 -95713 -165613 -290374 6324 80954 333362
7760 333362 -109917 -257029 -73789 -238145 10560 -182577 -15426 -38695 131960 245980
7750 245980 -2155 -239580 -66788 -438569 -208454 149016 62524 -83980 -520852 -228447 267239
7738 -122148 118765 -104248 -8226 -259422 96912 168953 160184 238250 111270 -191844 -116734
7727 -116734 100455 -347557 -92187 -194956 -451304 202367 -77172 134528 28302 -381944
7716 -6147 -226440 -136426 -13996 -53883 74180 62437 -433449 252659 353803 -177825 -274636
7705 -274636 431648 268429 -152050 63472 281840 -65156 131414 -145838 -52671 -12691
7694 -32463 -19705 62182 -371181 -241540 -227526 85254 40430 -58134 -7142 -79828 -209349
7683 -209349 263103 462460 -33885 -46302 -297481 -246920 -208175 -33888 4035 -133862 121664
7671 67802 -71764 -186096 53335 -108549 -237629 91818 -170776 34809 233256 -78348 -39802
7660 -39802 126628 -209082 -138365 -113462 -91153 84219 -72047 -275253 92215 272415 -6897
7648 -210181 -314443 82 -79150 109151 -75138 70083 -338846 -129292 221166 -193218 -195307
7637 -195307 -169734 -175078 -324025 133894 97212 -92634 -382127 184183 -161647 -128073 -72752
7626 -72752 295543 -305867 -35747 -62829 261967 289021 -473905 145802 245687 154324 106981
7615 106981 -153937 -140299 -253544 -278874 -67953 -223155 -70881 -292162 -261222 11792 -138411
7603 -102253 -118555 375695 -272032 -106204 94823 378131 35824 -56844 -129331 -83958 -342203
7592 -342203 -127501 -57910 -52374 -96408 36814 -62608 114867 -85119 233914 -2460 10045
7580 195232 -229478 -71636 51489 23519 -268296 61109 -236326 116127 -18142 210420 -3816
7568 231051 113710 -9639 141924 -182470 -139339 51184 57777 304627 -34744 -315080 -141660
7556 -193576 -14208 57723 69828 -383938 203367 -180762 47175 -27581 126951 -287668 28060
7544 -134451 -111336 311444 -3957 -259119 -79595 186273 81523 -22078 -170968 -56691 -338958
7533 -338958 210187 -65656 -90165 33910 -143373 -373138 -60976 43490 78369 -347656 -175541
7522 -175541 -29033 -270344 95087 194121 -327802 10775 -126569 189297 -169225 -73595 -23400
7510 156005 -262724 -221437 179686 123795 166281 -259912 -235316 -409761 -58808 -95015 -220234
7499 -220234 -164827 -121723 181032 110611 10737 -58452 -5584 33278 -26870 -111869 -238318
7488 -238318 -76713 78650 282459 43592 -51458 -91154 35386 -190855 44894 -114542 14760
7476 -334071 342086 -304213 -40613 137147 216647 5595 74383 -43389 -23873 -236458 -117458
7464 53799 -82652 88186 383685 -249556 -125800 -244769 -103451 -137040 -64404 -62753 422991
7452 13476 59987 -142076 79923 121502 143876 -13754 -226761 -24733 64860 -41872 292193
7440 86231 249062 -120943 -199596 -245956 22811 -355085 -142965 -215609 136096 -182656 267238
7428 -186786 -185132 212032 23229 124032 28154 -67464 346234 10043 -538403 -109573 -235603
7417 -235603 96791 394866 345436 -270033 -298276 -100789 191253 -30547 171701 -224947
7406 -30937 -247 -76077 244320 62826 -18962 -59613 -170090 -244912 120867 87088 163636 -73281
7393 -72872 -53500 -394499 -76684 -13141 136756 -274658 7139 -219095 -125211 -94689 53645
7381 -119233 -201560 -287553 -21717 -68457 213308 -57293 203629 -175048 53331 -213866 -484654
7370 -484654 -73606 -29893 -220680 217375 145024 -59211 -63639 144702 56188 18470 94127
7359 94127 -22908 9374 143108 -190657 -134194 234518 265175 -128888 -530924 -174274 62941
7347 -339614 -27388 -494242 169030 7296 8704 90754 -49408 7644 -182549 -44857 171602
7335 32169 -301630 -201131 -151961 -40070 -142499 -169058 -145434 -344073 97993 68573 -13074
7323 -121596 -77348 -16467 -270135 -145223 69059 332569 -120591 -89457 -37448 334887 -159955
7311 403629 -121326 198827 1003 -9741 -16172 -49802 -219980 24956 -101879 119578 241058
7300 241058 -215180 -194345 54944 400720 -47662 -140541 -196090 -203193 322168 -138106 165267
7288 -194585 -123150 130520 -27611 -112753 -96031 58730 59042 -92285 35282 -10820 238754 -323973
7275 78222 9641 46069 174245 210789 83529 227828 -155971 -225663 -62844 -107449 -90862
7264 -90862 -176147 -113404 -192078 85925 -154628 52884 -99442 -22264 -70909 -93781 -267719
7253 -267719 146156 -41867 -214907 58690 37221 -230500 -577469 -84773 -399161 -3478 68298
7241 -222129 -26232 43189 -107995 -88748 112073 202142 -46249 -117887 -177693 19425 120254
7230 120254 -247252 -50573 -103360 -79771 2705 251131 37206 306062 -22684 293089 -31799
7218 86078 -139465 -136583 184297 48240 216494 -544534 -126687 140873 -101405 24297 196311
7207 196311 27770 52504 105378 277319 5759 -198792 3883 -109617 -48812 -234818 -128101
7196 -128101 -314695 -240475 2020 331027 -338358 -57444 -38103 -218454 110863 214764 167857
7185 167857 -188705 -114683 22118 27269 -21945 18681 257342 37639 309571 -116463 -134394
7174 -134394 -2532 163098 266749 -25964 -290923 41662 -45094 -40646 -63200 -141741 88737
7162 -40391 -59162 -33051 78125 -69361 125456 -146134 -350703 -6842 -226489 -178076 -153601
7151 -153601 -383645 164515 -359873 -366502 54902 65590 143748 -252365 -155483 -114632 71559
7139 232284 -17364 -184412 176317 -493931 -142686 202466 68109 -105707 -67935 -150490
7129 -150490 232861 -250207 -230883 186343 -63371 28796 42153 20842 -15239 238182 249364
7118 249364 -260481 258387 -117587 -127929 -80110 -135218 162012 -55558 148755 98984 231325
7107 231325 227780 175575 -68964 198121 -176611 309270 -3804 -102929 116048 -299200 123103
7095 -109091 16134 235492 -108791 238363 220322 79912 24731 -38530 -11549 -141838 90400
7083 25675 -169943 44741 -11260 -34599 239989 -22021 -198243 51937 65543 12302 1534
7071 133802 320738 92589 -380493 85636 -200511 -339387 19376 103504 123889 -142107 285077
7059 -245045 -81389 -132299 305980 -32737 -92929 -116628 -268573 38529 -178440 -75343 83911
7047 -32806 61226 112296 -161838 -40216 -185058 -22831 53940 318311 -165190 -39034 -97329
7036 -97329 -149447 63843 -232057 170861 -44918 119081 212977 -199788 -50103 -214429 56013
7024 -217176 29705 68216 84630 -214581 -266898 242260 -24182 -38589 -28220 -311603 -65736
7012 141813 230087 100686 -92201 -21096 467649 47118 -33000 112579 -472281 -38773 365722
7000 -339027 419314 61976 219608 -99923 -53347 -40080 2948 231183 88219 347087 -140504
6988 -317150 20083 -46808 29246 127972 -137985 397342 -252297 -20874 -224029 55097 -127465
6976 120221 -82297 165090 -202666 42738 329647 -139217 49152 -212616 -62693 208237
6965 175822 148397 -257189 -693423 -216787 -118881 250524 -154894 27683 93461 195148
6955 195148 -123572 -83790 -24317 -192655 -44300 159733 123183 -145800 -108106 -132868 64415
6943 -226300 -260367 -70884 35011 -28592 141995 -274749 -240458 -164871 -229607 -97757 238980
6931 -90035 153145 -413378 69753 256330 -42684 -34505 152398 151100 -121578 -64789 135995
6919 214624 -361782 232405 164374 -97382 -78072 102407 -390675 188083 61280 -17374 -8188
6907 -39203 8304 21069 -109244 21513 318919 -51076 320116 -105723 -77147 154258 -46000
6895 -193281 179141 197972 -300376 131508 -122127 -138563 52093 143914 177375 175827 -155938
6883 106119 315267 -86632 -112625 313531 -29155 96097 92346 -185597 -190205 200296 -13666
6871 174000 -222640 -87 -150490 -77105 -306779 29818 4967 -130584 -216961 -376613 -239977
6860 -239977 -72631 91531 151370 -185526 -99541 -252611 781 -235321 160020 137036 -85611
6848 411991 -11328 -106971 -177681 42421 -209668 20608 44638 -58810 -182688 -174878 -107108
6837 -107108 -9176 -356188 -161820 -54486 22440 -434008 -96260 64011 -53374 -175890 228487
6825 -155421 -94663 54564 -223369 -280366 145992 -149806 -206425 -25415 103207 -122034 231543
6813 301245 363595 -10470 225211 -263023 229007 411398 -105882 -291331 -20786 -105278
6803 -105278 92248 191405 -134641 169743 148246 109751 -410163 82434 -166476 -259833 4105
6791 1340 -205246 -36215 -69932 -247759 83612 -129756 -84125 -361308 -240390 106006 -12179
6779 196564 141388 80629 -165117 -8187 -240394 59308 -154975 -172872 208790 -287666 -115016
6767 311312 394001 -311690 273648 30444 206515 -229906 256290 81001 -52234 -149672 -332354
6756 -332354 145038 59364 -414154 -349255 -283601 -168096 22893 -131670 325627 165013
6746 165013 -194330 374049 31878 -131679 55564 -174340 -167265 148181 47376 318905 -117216
6734 -12624 49146 -55580 -50173 -61937 14953 46194 232117 -71812 -6869 243791 -157201 143104
6721 60704 -310429 -343763 -73402 211183 266554 -175190 139768 -1815 -123068 -224985 43505
6709 -20231 26923 -392277 48350 -150500 36130 -87017 64629 -61110 -258677 79894 -202055
6697 -26145 -22105 -185682 -169603 141638 -45750 -9328 -53110 -106023 106839 -178817 -147054
6686 -147054 -1101 156393 -6440 11837 43841 -31839 -242040 -68112 -105455 338828 -93368
6674 139453 118934 -27619 342043 -40351 60672 -114930 135924 120934 -85971 30524 192306
6663 192306 -133754 90444 -74926 220272 -41770 186977 111727 -115997 155331 50499 176110
6652 176110 128075 -273809 7230 112819 -96323 3451 -199655 -266385 -195165 204592 113810
6641 113810 -18172 -24833 -54205 157077 -24043 -338708 -35377 -337695 -47982 -301601 -150650
6629 181103 -51847 -98704 48152 112437 -11654 47171 131538 89291 -34635 -56420 109794
6617 -93540 -7228 52726 64042 15512 -210634 -222217 484960 23683 214692 91141 -157819
6605 19608 -262063 20887 250273 160288 253320 85985 97218 -369122 45753 -291019 -194775
6594 -194775 -114801 -89582 119923 17443 -30721 -135373 213171 327552 69619 -270898 1199
6582 9818 300857 23644 170218 229476 73285 93433 -397902 210332 8577 141084 -97959
6570 66539 -134210 -80327 -213772 250138 -8248 186872 164413 219989 -273944 197958 143663
6559 143663 -290035 -34564 -366170 266259 55143 -25344 -184969 53757 201432 -169253
6548 -282655 -299922 169163 24952 60377 -405723 -101815 -15144 -70320 -34208 -227898 24837
6536 -152239 26729 -136592 3272 -112494 16175 -365757 186147 137633 18980 -269020 -26094
6524 -264344 -341284 -129463 131426 255257 -212794 126178 267912 172599 42696 13991
6513 56011 216337 -2802 156448 -227446 -50586 94166 54075 -38286 -56069 -4036 -98076 39364
6500 311112 182016 140337 241003 76056 -292986 63354 -119009 -98492 -33592 -236357 -128785
6489 -128785 -127688 155480 139697 89635 -138610 108045 295353 63911 136279 126221 -164776
6477 -107112 57029 -158677 31203 -77868 -70624 -406694 176428 -100648 29408 -26763 28105
6465 -29012 225000 -101312 128798 295593 20325 -40053 -115412 -220611 175062 -96452 -182364
6454 -182364 55052 18478 159896 141819 -103882 -217858 -211799 -59481 50928 4855 -148090
6442 -109004 -122810 139449 -56748 -137095 -1353 -161582 283267 127146 160383 10598 58125
6431 58125 135058 -5834 104587 -71746 -96022 -128382 -4488 41634 -11976 34057 -50807 364435
6418 51403 -61907 109791 -77470 103815 -202056 -1106 -73063 171064 312936 -97247 -33669
6406 216456 27456 150515 -304341 69602 242861 215980 -88393 141199 8256 59488 -19473
6394 -200159 119000 243124 74431 363354 64095 136040 142668 116413 -70575 -88835 26840
6382 27300 -50035 -174459 -196072 41300 -256351 -132558 -39509 -216492 89762 -99467 -20565
6370 59773 56391 32249 263961 -60462 131962 -420263 362075 -159013 -192503 -118081 26239
6358 294607 25949 -92420 48569 101305 410492 -167059 -109406 94520 -10038 -202542 -4740
6346 -121034 -139257 240264 52504 -149719 -123177 5605 86980 -90820 -56820 -24970 151004
6334 -106087 -117883 -229069 131089 -16992 111839 140371 49952 -134684 -44682 182247 212098
6323 212098 -31572 -184640 -65943 -147598 21784 -108335 68606 383795 -17435 -184510 -84044
6311 -133870 354758 -42682 -142585 -63837 25861 -229237 -3214 -58507 -291811 -31731 -32333 -82643
6299 -82643 -148537 -134418 42623 -52647 -75499 -52012 64970 -507858 -19372 -89691 -213492
6288 -213492 -276614 251700 -66120 -136702 295192 -41108 -268035 30544 -375200 51145 38609
6277 38609 -330390 152021 47742 -91955 166703 93096 296048 29207 -224498 -60301 -44743
6266 -44743 -35161 40095 340555 -110623 -423469 2357 -50093 195555 -468452 -120955 -276342
6255 -276342 -96339 97318 -124805 -368393 408438 -26569 -29151 -148652 102434 125582 15427
6243 -205896 168977 97561 171391 -54235 126465 -125414 -44820 128689 -99053 128393 410580
6232 410580 -429930 -21366 123863 170851 9568 -228388 -108746 -280568 -40762 140945 275023
6221 275023 291878 -26898 380109 75846 -141781 -258994 65863 -13178 18788 -50487 -93 -196557
6209 -196557 157162 -83050 -138168 -78447 -255951 -199306 -246535 -335840 56830 14779 186908
6198 186908 304792 105394 -17935 -80443 -299368 -83603 -76345 -114508 282488 -53378 100993
6186 -171701 55827 -356062 -535312 436829 -75085 -188889 -276330 -31937 167576 95471 -81021
6174 -136036 133768 -189769 -32087 227288 131993 -324181 -71711 409714 5194 163786 203910
6163 203910 19959 20448 -132634 -90353 -146965 -74997 167350 -262995 -363747 -7969 -139763
6152 -139763 -43281 -425005 226233 -177954 28083 -75903 103715 -157050 253565 30428
6141 -507420 29858 -92102 -300985 -7542 28298 254721 -295979 14246 -112532 167917 -357942
6129 -43366 87741 103753 -42964 -382126 -146147 224240 -104684 93054 146010 158596 74931
6117 249446 2988 287515 -37194 351884 191577 -162473 67384 126554 87405 -114702 4772
6105 86517 -128458 -84708 97709 68520 206137 -99349 28970 -30058 -124889 -80217 240938
6093 328956 -83503 129916 -68784 119137 47666 -210496 18841 220978 -102128 37411 -158015
6081 83435 56696 134042 -218880 -290494 -318260 5525 84153 -301809 -514428 291317 98266
6069 -175180 -24415 40449 88374 17351 -165358 -264363 -192405 -116537 303727 -8713 109624
6057 219903 353743 9027 -27153 -77402 -118967 -22836 -50046 394 167998 219042 298659 107738
6044 -162011 -234885 81117 -329978 306416 -184948 187895 33025 -213042 107536 276899
6034 276899 -242184 35326 -77806 21024 -164908 307187 81665 136085 79843 44220 -78180
6022 138653 -62401 138856 -86097 26782 -350914 8917 -21700 -195940 -163062 14791 -138717
6010 60985 35341 134614 -129830 -160886 1012 78140 240131 5500 -181002 98367 58522 -15812
5997 237204 182936 189271 283102 -157933 -91913 -78980 -94174 -263137 164358 118360 85058
5986 85058 -106673 -128770 -51963 -1304 -88955 23552 -21658 -452 105380 16697 140094 -58091
5973 -205361 -244791 3873 -70071 -429353 140605 16198 29841 161224 -88829 -225966 45686
5961 -82130 -88042 -365449 -9253 36575 -136011 -69352 -3874 -28812 -3751 135272 323764 -18498
5948 82622 42959 -109996 -19022 9489 172047 265685 81961 184182 -39262 41348 185011
5937 185011 -131742 89652 51233 -41675 192441 -454822 -32888 170259 28505 296728 -256291
5925 -99679 64948 -33555 -127426 -333082 -192671 86515 127957 50619 345960 -133389 -169884
5914 -169884 117492 -197168 25909 247055 51615 14069 164244 147023 307229 -319400
5903 -35891 163697 -124034 -3287 148835 289420 22386 -63092 44796 -94089 -101 -17387 -225426
5891 -225426 -234131 138614 -125888 32432 25448 153990 -24628 39530 118847 -88158 230221
5879 200493 -183132 149331 160363 -90652 251884 -87643 445962 6312 -293438 -12997 13237
5867 108930 -358223 -63144 -116785 -96350 197812 109580 -134903 -359633 -22908 117138 35851
5855 -248448 -221357 -13510 319365 -97100 -137529 75310 -156566 78393 -315378 -98082 -361
5843 25112 2419 -68278 84690 59033 19594 -73866 51840 301504 91522 19168 480888 2119
5830 327150 30459 64323 11304 45424 141867 383748 -344623 -13976 -112927 68814 282934
5819 282934 303729 145264 -116958 -192627 -304086 -448671 -178821 -231 171471 225157 -157871
5807 175602 -334904 -71025 32387 -74917 -141283 95580 -309480 183124 -435142 454130 273603
5796 273603 150697 -114103 -111701 -12589 -76390 -6127 -408847 412193 -116221 181917 74600
5784 -78383 -241153 -88648 -74860 193392 -157706 56912 58927 -21561 363823 59229 139797
5773 139797 -94652 368723 -108555 -55559 102650 -31470 42305 -5368 -249868 83158 93416
5762 93416 -56067 5198 184534 -66814 -138636 -206607 39690 299429 -15265 -205191 266 -155341
5749 -255510 273831 45280 24475 -438268 -307566 -49476 -275691 -142576 -246733 12891
5738 -23019 -245930 113088 157959 149317 126135 89589 145710 34569 -197472 17632 -309647
5726 -130861 71390 384191 98298 178729 215 146424 26541 312226 25254 149546 110981
5715 110981 217805 41929 -99049 273468 -367691 417006 -14047 224741 52750 170044
5705 170044 142941 -154686 263035 -28698 17162 -82160 -51527 -135368 -84826 354093 -136036
5693 266309 -81419 -208610 187362 32610 30822 -272040 31895 29115 -37579 -122174 -161651
5682 -161651 -111303 -22225 -227387 -113084 -259796 5138 129322 -77911 201621 -173784 47800
5670 -182433 235521 -196082 -5987 94626 -137789 -119348 -472824 -70806 242737 -144432 -128989
5659 -128989 125177 23339 -305303 -30708 -20813 -143527 -143238 195738 60476 -64484 -142040
5648 -142040 -94842 -56836 197240 -199768 44005 418453 75468 124124 -151483 246595 -219691
5636 -412228 -87018 250046 114887 75694 117110 -3748 47336 -235899 207335 345240 -168105
5624 29766 -127413 -103000 99819 118743 -429079 -121137 -256743 202443 108308 113765 -35704
5612 44329 255466 -103081 161215 -241649 -39301 -74432 111778 210876 31963 345941 -198668
5600 88703 81562 -76205 42170 115425 -103854 465587 -42656 158585 -16060 -65442 222729
5588 -54794 40572 -35005 -43293 -10566 140770 21144 15539 211203 24099 -53591 127891 161959
5576 161959 -71603 1034 -166804 341408 -348437 -33197 -27757 -149115 923 -210600 -93665
5564 205566 -350656 -245304 -215908 280128 -8345 -300725 -235345 -105895 144644 -163858
5553 56854 -111253 -195358 201937 -119568 43021 -140944 -269232 -142460 41525 341593
5543 341593 317563 -334268 -209079 166346 -104996 79869 -189375 161701 327334 267911
5533 267911 8931 -37071 158277 -35487 194337 -189398 175463 49598 -54020 -52418 -89161
5522 -89161 -15706 -232321 122911 -10966 -39663 59227 230454 258599 -88946 59607 161215
5511 161215 -187424 -64074 -216478 126230 426551 31184 146034 -5186 -330659 255152
5500 -219344 165462 -160743 39162 -7868 196522 -121789 186796 97534 68512 163466 46347
5488 -112012 33631 -14218 -239989 -76774 -6430 327208 78005 -113723 -124464 -77119 272311
5476 266443 6919 3542 116799 -270556 -315338 -272189 -141202 141201 -106213 -162100 177474
5464 -104965 225076 65032 154175 -190055 -120854 -47390 -52316 -96633 4617 -92671 -60237 -19159
5451 5962 -33118 -25823 149267 -322738 22510 369248 -226493 9532 178214 -1805 -99745 129529
5438 1869 -121109 -20009 115044 -59873 -280583 200223 105432 191910 330394 11125 298509
5427 298509 8178 -349267 304096 162031 181022 113661 165208 -16004 -85281 -113881 -223434
5416 -223434 302006 118322 208334 -193069 317282 -180327 180506 -122814 -229646 -505295
5406 -505295 50392 -167286 -110544 -201524 -149707 -36069 -19528 -34108 -41812 -124476 -42516 -47875
5394 -47875 174102 85836 -22270 48751 242794 -33975 -157915 -6060 538014 -185233 -214145
5383 -214145 61368 12598 -101856 125017 42597 -164200 -346353 -81489 -196272 -181360 183632
5371 -159014 209986 -57991 -104126 -54336 233889 49894 -306733 66552 123679 166881 160664
5360 160664 91914 135987 -85360 -67430 241168 189151 -58709 -210401 -15476 32639 30336
5349 30336 -233800 -66593 -95941 -219301 59614 102269 104581 -259954 -182272 -150073 -277077
5338 -277077 -255339 -31593 37610 -278370 77941 -73181 -190169 -96247 -173216 -162524 -158969
5327 -158969 245765 -4245 -107459 96945 -192438 297630 129084 -11141 184316 15790 -78939
5315 -68267 147613 -78568 -207286 183139 98022 321888 174143 -81157 -199407 -281975 47933
5303 -61548 97862 245606 246543 -5524 -189206 19056 164310 108800 57698 -254466 16317 169103
5291 169103 -44404 -183113 -155796 36734 8951 -332885 232344 -259890 -119884 478009 280280
5280 280280 -52180 -288992 -66460 22850 204465 301043 299462 38387 -106698 -175644 -45947
5268 8016 263650 54454 296460 -183064 57062 163954 327779 -152460 -44632 -200136 197433
5256 -85975 17640 110422 -42627 -403894 137021 -60895 9961 -10513 -137367 101431 -85706
5244 129526 128925 -243612 297330 258031 145721 228225 -104639 -358686 -50743 -104550 -142991
5233 -142991 -38922 134069 8835 -301429 139144 -810 123891 199715 -67058 105931 358767
5222 358767 -45946 397828 29419 163878 -271980 -153710 28703 -71168 -11836 -409 11499
5210 320213 109795 43572 43996 141364 -238577 100102 195493 -153889 -19841 -106074 261429
5198 423762 -138715 -19695 -260834 -120486 -249063 157482 41627 80459 46840 -484472
5187 -98787 -77704 -4255 171083 -81909 274190 58399 9431 -155009 175915 20457 230078
5176 230078 518278 -156313 -26976 219822 256561 -343367 -482148 -155076 -154194 97977 44307
5164 -249217 -122730 94022 286575 194099 -118138 -40257 -121224 -24518 10607 -240835 -98336
5152 -134800 29406 91225 105029 365942 149437 -136979 134574 -267598 -149730 -161435
5142 -161435 95930 -45327 100168 -40229 -48829 55075 -23251 67382 -46125 -62409 441133
5130 20391 359599 -2298 18546 -335559 -178059 -222968 102847 -93564 -108826 -22264 -36186
5119 -36186 -21145 -332378 -149918 151797 355818 154543 207147 -49335 66927 -333550 -181826
5108 -181826 -55660 218819 -7072 45695 214095 226793 -11321 -139925 -257115 67344 -170362
5096 143061 -243195 -416394 -49209 -194596 119842 -37803 48243 159077 -19194 -214246
5086 -214246 -93287 96013 -67842 -245339 -131774 70195 -128589 -184483 43452 -18160 138477
5074 -215593 -146763 -291953 139896 -117231 -29082 -156410 -280864 295987 -146757 -87208
5064 -87208 -39173 69272 18419 333716 91053 -86565 100368 -142967 -50268 -14151 -84736
5053 -84736 71409 -190128 -114576 -317214 45690 -146244 -46236 235315 -166996 245800 -216220
5041 91759 -60050 191819 -47581 272706 -28848 209563 241800 -162524 191988 -83861 -32361
5029 -136622 63432 -7806 -270674 -124301 220647 -180067 53875 -110492 -76908 -84741 -321438
5018 -321438 299656 -57862 56340 -147403 -209916 -62850 299600 -88523 169313 1510 -171910
5006 -22101 54660 40287 -118126 126902 13329 68410 24891 21254 -149079 -218452 222601
4994 -69494 -64234 -16728 -33364 -145213 59069 125751 -329094 -389549 9248 233266 -94983 -104083
4982 -104083 -275615 147321 -39767 21856 274471 77010 -311766 108695 79041 214577
4972 214577 132894 -104713 146470 -79966 228822 -74859 -56569 -196380 -171236 -66115 61318
4960 13067 39877 201952 52600 188883 233165 111334 -222272 -62283 13619 -223516 129555
4948 114503 55028 -112902 -137146 -74690 -3358 23294 136351 404354 -141149 19949 -198952
4936 -158687 200143 197147 -44358 -122032 93711 269231 70112 -131354 160959 108402 -341552
4924 122692 72822 63886 -269179 -26764 -108861 40558 -52736 139269 158969 -93648 93039
4912 329339 -245118 -46780 46135 123675 198571 36703 -14179 226283 -250486 224873 -5814
4900 -128353 16475 102664 74124 3886 -248937 -128347 -247683 -65890 -97448 20838 -48677
4888 70590 76757 276849 100079 103844 96039 -102938 243033 -75303 -211238 -63709 168445
4876 103097 8312 339637 -71523 -15281 -10628 172180 -19071 90800 -453341 -104864 125818
4864 42230 -89801 111960 186753 16695 -74 -144652 -62842 459300 -65262 113624 53376 131287
4852 131287 76383 270803 40485 198844 -59942 -146555 -330443 -47705 -91802 -16482 51365
4840 -105150 -222892 301597 153539 -270025 -88748 258610 19018 -185754 -160771 141268
4829 -148286 87517 -223988 -48445 -77641 19615 -98796 -119019 226136 210640 246554 309573
4818 309573 -278671 27998 -198677 -103953 -89998 -57946 -125620 -191455 9810 164428 -111726
4806 180941 -193483 -148703 325549 -178451 77099 -345853 -176310 -19444 -37338 163965
4795 250549 -112671 177969 -4731 27085 -18298 -79 -49038 -21912 100910 -126114 -217734 106174
4782 70369 109275 -46345 -86966 296424 -52013 312466 132311 102822 -105048 244503 -121676
4770 -158380 36268 -105324 -206712 -43534 -206514 -296223 -100630 -139820 260575 -28707 -42085
4759 -42085 -34166 141548 -176822 -135235 39271 302557 -31000 51718 113149 -40835 18120
4747 -140598 -251353 -185886 -37948 58862 75783 70345 15634 -102518 -25705 -352153 -14504
4735 160679 313261 -23808 -168988 -142624 501050 109892 303906 -34538 122919 125455 -170206
4723 -114639 178996 -179200 55557 -7726 197575 150276 213916 -75622 -186649 -14133 53205
4711 -37791 74066 -159755 -106496 22543 -242884 -5823 231495 23418 -99757 29978 -207945
4699 177475 -102703 95648 43370 474768 158572 -40975 231513 9780 -36117 -9901 -160751
4688 -160751 -187691 482421 -46188 107484 27705 159428 -39891 -38927 191069 142784 -60753
4676 -262367 -40251 -33862 180430 -173435 -65327 127016 15983 187560 -42540 -196126 276205
4664 -368414 -177883 16275 -148137 176045 -336510 -61243 -448203 52413 44708 256637 237626
4653 237626 7704 68503 -69313 287926 -259420 26926 -72845 -43656 -38344 -181958 41074
4641 423193 -194806 205517 -45339 14008 140296 -180523 -244306 -88935 18375 11695 264720
4630 264720 112051 5320 -265789 -250312 9993 165441 242699 287305 -260147 -46355 -118711
4619 -118711 256632 14948 -60416 175719 34284 152105 76595 177510 -68566 -103354 -105816
4608 -105816 -304125 9171 -3915 275807 -17359 -450908 10692 70514 -363084 239193 187815
4597 187815 -34881 160658 -76749 193305 1030 71784 -130118 189577 -14040 -209055 76178
4585 -280680 -30859 -312468 237388 59591 22513 -380674 63376 162890 109131 -23904 126181
4573 -112597 -238445 -20513 204819 -95071 -175311 76445 -33960 154184 42231 356130 -28964
4561 -35547 -126613 -141497 -143781 41327 72459 -72882 189322 175678 -178434 -314156 188542
4549 -233343 270950 138085 114165 -195008 -179846 -120600 50895 -2311 9442 132062 -45936
4537 -91650 237835 7955 -213230 179830 689 -42049 -292780 122883 23084 -68577 236423
4525 185265 238216 146400 -393155 138163 -119991 -358482 20074 -71731 171492 113354 -5222
4513 134892 -46585 -90816 208333 -126063 -405242 -21191 -237772 -129651 -52547 -105097 22534
$$ [...]
##END NTUPLES=NMR SPECTRUM
##END=
