##TITLE=AC1673_DOMAH14364_8571129_bUIXJt5RoU
##JCAMPDX= 6.0         $$ Bruker NMR JCAMP-DX V2.0
##DATA TYPE= NMR SPECTRUM
##DATA CLASS= NTUPLES
##ORIGIN= BRUKER
##OWNER= Administrator
$$ 1.72 TOPSPIN		Version 2.1
$$ 2014-04-11 17:32:54.432 -0700  Administrator@X
$$ Compression mode = diff/dup
##.OBSERVE FREQUENCY= 400.02188249412
##.OBSERVE NUCLEUS= ^1H
##.ACQUISITION MODE= SIMULTANEOUS (DQD)
##.ACQUISITION SCHEME= undefined
##.AVERAGES= 64
##.DIGITISER RES= 22
##SPECTROMETER/DATA SYSTEM= spect
##.PULSE SEQUENCE= noesygpps1d.comp
##.SOLVENT NAME= COFFEE_meoh
##.SHIFT REFERENCE= INTERNAL, COFFEE_meoh, 1, 14.96138
##AUDIT TRAIL= $$ (NUMBER, WHEN, WHO, WHERE, PROCESS, VERSION, WHAT)
$$ ##TITLE= Audit trail, TOPSPIN		Version 2.1
$$ ##JCAMPDX= 5.01
$$ ##ORIGIN= Bruker BioSpin GmbH
$$ ##OWNER= Administrator
$$ $$ E:\/data/COFFEE/nmr/AC1673_DOMAH14364_8571129_bUIXJt5RoU/12/pdata/1/auditp.txt
$$ ##AUDIT TRAIL=  $$ (NUMBER, WHEN, WHO, WHERE, PROCESS, VERSION, WHAT)
(   1,<2014-04-11 17:32:48.886 -0700>,<Administrator>,<X>,<go>,<TOPSPIN 2.1>,
      <created by zg
	started at 2014-04-11 17:21:18.833 -0700,
	POWCHK enabled, PULCHK disabled,
       configuration hash MD5:
       C8 4E 4E 5D D3 5C D8 9E 9F 52 82 E0 59 8A DE 15
       data hash MD5: 64K
       5F 2D 89 6C 65 14 1F 35 61 A7 43 C0 2D 2F 38 DE>)
(   2,<2014-04-11 17:32:51.948 -0700>,<Administrator>,<X>,<proc1d>,<TOPSPIN 2.1>,
      <Start of raw data processing
       efp LB = 0.3 FT_mod = 6 PKNL = 1 PHC0 = 0 PHC1 = 0 SI = 128K 
       data hash MD5: 128K
       2D 8C 1D 24 84 90 09 E4 43 BD 65 A9 EA D1 9E 8D>)
(   3,<2014-04-11 17:32:53.089 -0700>,<Administrator>,<X>,<proc1d>,<TOPSPIN 2.1>,
      <pk PHC0 = -85.00122 PHC1 = 0 
       data hash MD5: 128K
       BD 20 49 62 DF 48 34 D4 DA 6A 25 00 18 40 11 D9>)
(   4,<2014-04-11 17:32:53.682 -0700>,<Administrator>,<X>,<proc1d>,<TOPSPIN 2.1>,
      <abs ABSG = 1 
       data hash MD5: 128K
       60 A5 47 C9 15 4A 92 31 1B 43 86 03 B7 45 CF A8>)
(   5,<2014-04-11 17:32:53.823 -0700>,<Administrator>,<X>,<proc1d>,<TOPSPIN 2.1>,
      <abs ABSG = 2 
       data hash MD5: 128K
       38 65 1F 12 2A 9F 8C FF 65 9C AC AC FD 67 F5 B4>)
(   6,<2014-04-11 17:32:53.917 -0700>,<Administrator>,<X>,<proc1d>,<TOPSPIN 2.1>,
      <abs ABSG = 3 
       data hash MD5: 128K
       68 1C 46 C9 4A B9 36 C3 09 BA F8 2D 68 68 4D 29>)
(   7,<2014-04-11 17:32:54.057 -0700>,<Administrator>,<X>,<proc1d>,<TOPSPIN 2.1>,
      <abs ABSG = 4 
       data hash MD5: 128K
       BA 3D F3 6B 0F E2 8C FC 99 59 A0 60 D8 57 1B 16>)
(   8,<2014-04-11 17:32:54.151 -0700>,<Administrator>,<X>,<proc1d>,<TOPSPIN 2.1>,
      <abs ABSG = 5 
       data hash MD5: 128K
       97 93 BB 0D 0B 12 31 DA 78 0A 5C 24 69 9D BB C7>)
$$ ##END=
$$ 
$$ $$ hash MD5
$$ $$ 53 BA 00 89 37 19 EC 1B BB 97 D6 D1 87 F0 F9 12
##$RELAX= 
##$RELAX= 
##$RELAX= 
##$RELAX= 
##$RELAX= 
##$RELAX= 
##$RELAX= 
##$RELAX= 
$$ Bruker specific parameters
$$ --------------------------
##$DU= <E:\>
##$EXPNO= 12
$$ [...]
##$TP07= 0
##$TPNAME0= <>
##$TPNAME1= <>
##$TPNAME2= <>
##$TPNAME3= <>
##$TPNAME4= <>
##$TPNAME5= <>
##$TPNAME6= <>
##$TPNAME7= <>
##$TPOAL= (0..7)
0.5 0.5 0.5 0.5 0.5 0.5 0.5 0.5
##$TPOFFS= (0..7)
0 0 0 0 0 0 0 0
##$TUNHIN= 0
##$TUNHOUT= 0
##$TUNXOUT= 0
##$USERA1= <user>
##$USERA2= <user>
##$USERA3= <user>
##$USERA4= <user>
##$USERA5= <user>
##$V9= 5
##$VALIST= <valist>
##$VCLIST= <CCCCCCCCCCCCCCC>
##$VD= 0
##$VDLIST= <DDDDDDDDDDDDDDD>
##$VPLIST= <PPPPPPPPPPPPPPP>
##$VTLIST= <TTTTTTTTTTTTTTT>
##$WBST= 1024
##$WBSW= 4
##$XGAIN= (0..3)
0 0 0 0
##$XL= 0
##$YL= 0
##$YMAX_a= 5261642
##$YMIN_a= -11411596
##$ZGOPTNS= <>
##$ZL1= 120
##$ZL2= 120
##$ZL3= 120
##$ZL4= 120
##$ABSF1= 14.96138
##$ABSF2= -5.596802
##$ABSG= 5
##$ABSL= 3
##$ALPHA= 0
##$AQORDER= 0
##$ASSFAC= 0
##$ASSFACI= 0
##$ASSFACX= 0
##$ASSWID= 0
##$AUNMP= <proc_prof1d_extract.lims>
##$AXLEFT= 0
##$AXNAME= <>
##$AXNUC= <1H>
##$AXRIGHT= 0
##$AXTYPE= 0
##$AXUNIT= <>
##$AZFE= 0.1
##$AZFW= 0.1
##$BCFW= 0
##$BC_mod= 0
##$BYTORDP= 0
##$COROFFS= 0
##$CY= 15
##$DATMOD= 1
##$DC= 0
##$DFILT= <>
##$DTYPP= 0
##$F1P= 0
##$F2P= 0
##$FCOR= 0.5
##$FTSIZE= 131072
##$FT_mod= 6
##$GAMMA= 0
##$GB= 0
##$INTBC= 1
##$INTSCL= 1
##$ISEN= 128
##$LB= 0.3
##$LEV0= 0
##$LPBIN= 0
##$MAXI= 10000
##$MC2= 0
##$MEAN= 0
##$ME_mod= 0
##$MI= 0
##$NCOEF= 0
##$NC_proc= -2
##$NLEV= 6
##$NOISF1= 0
##$NOISF2= 0
##$NSP= 0
##$NTH_PI= 0
##$NZP= 0
##$OFFSET= 14.96138
##$PC= 1
##$PHC0= -85.00122
##$PHC1= 0
##$PH_mod= 1
##$PKNL= yes
##$PPARMOD= 0
##$PPDIAG= 0
##$PPIPTYP= 0
##$PPMPNUM= 2147483647
##$PPRESOL= 1
##$PSCAL= 4
##$PSIGN= 0
##$PYNMP= <proc.py>
##$REVERSE= no
##$SF= 400.020009485762
##$SI= 131072
##$SIGF1= 0
##$SIGF2= 0
##$SINO= 400
##$SIOLD= 131072
##$SPECTYP= <>
##$SREGLST= <1H.CDCl3>
##$SSB= 0
##$STSI= 131072
##$STSR= 0
##$SW_p= 8223.68421052631
##$SYMM= 0
##$S_DEV= 0
##$TDeff= 65536
##$TDoff= 0
##$TI= <>
##$TILT= no
##$TM1= 0
##$TM2= 0
##$TOPLEV= 0
##$USERP1= <user>
##$USERP2= <user>
##$USERP3= <user>
##$USERP4= <user>
##$USERP5= <user>
##$WDW= 1
##$XDIM= 131072
##$YMAX_p= 394212837
##$YMIN_p= -11580
##$CURPLOT= <Network HP LaserJet P1505>
##$CURPRIN= <$Network HP LaserJet P1505>
##$DFORMAT= <normdp>
##$LAYOUT= <+/1D_H.xwp>
##$LFORMAT= <normlp>
##$PFORMAT= <normpl>
##$SURQMSG= 1
$$ End of Bruker specific parameters
$$ ---------------------------------
##NTUPLES= NMR SPECTRUM
##VAR_NAME=  FREQUENCY,     SPECTRUM/REAL,   SPECTRUM/IMAG
##SYMBOL=    X,             R,               I
##VAR_TYPE=  INDEPENDENT,   DEPENDENT,       DEPENDENT
##VAR_FORM=  AFFN,          ASDF,            ASDF
##VAR_DIM=   131072,        131072,          131072
##UNITS=     HZ,            ARBITRARY UNITS, ARBITRARY UNITS
##FACTOR=    0.0627417313425164, 1,          1
##FIRST=     8223.62146879497, -631,         -42362
##LAST=      0,             357,             -43554
##MIN=       0,             -11580,          0
##MAX=       8223.62146879497, 394212837,    0
$$ Real data points
##PAGE= N=1
##DATA TABLE= (X++(R..R)), XYDATA
$$ [...]
65104 217393 209591 202332 196301 191941 188737 185672 182291 178908 175832 172881 169855 166998 164589 162408
65090 162408 160095 157954 156925 157555 159203 160458 160372 159250 158209 158005 158381 158543 158006 156774 155010 153059
65074 153059 151732 151912 153537 155426 156458 156739 157326 159032 161798 165008 168023 170460 172239 173472 174266
65059 174266 174773 175380 176459 177735 178308 177701 176578 175971 175988 175831 175025 174016 173356 172795 171572 169453 167138
65042 167138 165656 165396 165763 165656 164371 162086 159570 157506 156037 154767 153107 150782 148196 146244 145567
65027 145567 145998 146780 147270 147368 147388 147653 148161 148580 148639 148551 148845 149679 150573 151041 151262 151899 153337 155366 157482
65008 157482 159294 160714 162027 163769 166378 169885 173947 178047 181602 184152 185636 186405 186834 187014 186895
64993 186895 186462 185691 184654 183822 183884 184982 186546 188245 190696 194621 199581 204224 207704 210234 212166
64978 212166 213196 212812 211126 208910 206868 205014 202797 199901 196929 194965 194296 193920 192693 190580 188351
64963 188351 186424 184669 183099 181915 180930 179739 178534 178025 178314 178544 177905 176405 174419 172135 169762
64948 169762 167730 166238 165051 163984 163124 162370 161384 160349 160095 160905 161774 161597 160697 160405 161305 162618 163309
64931 163309 163169 162705 162459 162645 163187 163877 164534 164998 164999 164259 162845 161239 159970 159373 159691 160959 162642 163882
64913 163882 164456 165104 166592 168827 171275 173745 176306 178812 181136 183613 186687 190350 194454 199340 205503
64898 205503 212718 220103 227041 233552 239888 246335 253341 261174 269366 277014 283757 289935 295698 300409
64884 300409 303114 303284 301051 297105 292374 287398 281962 275667 268837 262387 256856 252126 248098 245017
64870 245017 242968 241654 240858 240569 240401 239519 237547 235077 232866 230954 228956 226756 224371 221478 217661
64855 217661 213088 208498 204502 201181 198246 195297 192102 188884 186246 184532 183385 182203 180907 179932
64841 179932 179520 179358 178955 178138 177115 176203 175538 175033 174596 174397 174745 175663 176767 177686 178473 179468 180914 182826
64823 182826 185108 187659 190439 193508 196927 200603 204384 208316 212571 217174 222133 227845 234896 243177
64809 243177 251563 258695 263835 266815 267699 266901 265208 263086 260165 255835 250203 244006 237860 232138 227403
64794 227403 224194 222305 220865 219326 217946 217168 216975 217055 217203 217343 217432 217520 217601 217346 216400 215114 214565 215534
64776 215534 217790 220633 223800 227435 231511 235804 240314 245291 250888 257158 264289 272309 280499 287615
64762 287615 293046 297538 302497 308739 316043 323655 330887 337358 343086 348418 353576 358109 361035 361685
64748 361685 360244 357290 352976 346942 338980 329525 319459 309644 300672 292735 285559 278682 272009 266043
64734 266043 261435 258365 256477 255276 254469 254040 254147 254898 256093 257305 258362 259656 261809 265092 269394
64719 269394 274603 280664 287207 293449 298731 303080 307086 311165 314941 317322 317251 314447 309492 303228 296191
64704 296191 288547 280299 271407 261948 252436 243777 236542 230393 224572 218975 214362 211437 210019 209256
64690 209256 208403 207278 206245 205886 206535 207985 209769 211733 214174 217455 221787 227332 234118 241738 249538
64675 249538 257312 265367 273643 281224 287127 291265 294124 295786 295869 294316 291612 288083 283509 277669 270944
64660 270944 264160 258102 253288 249921 247778 246301 245040 244025 243636 244137 245322 246549 247226 247465 248157
64645 248157 250150 253435 257434 262019 267718 274804 282786 291117 299875 309204 318442 326536 333258 339369
64631 339369 345437 351052 355400 358087 359012 357895 354525 349345 343202 336404 328444 318907 308421 298380
64617 298380 289744 282314 275227 268059 261315 255831 251778 248426 244942 241263 237938 235173 232419 229137
64603 229137 225725 223222 222084 221623 220855 219622 218560 218156 218294 218744 219695 221488 224083 227178 230871 235885
64587 235885 242952 252062 262461 273324 284326 295580 307149 318718 329676 339480 347879 354877
64575 354877 360573 365083 368527 370934 372140 371914 370283 367591 364098 359595 353684 346459 338663 330996
64561 330996 323485 315783 307937 300449 293584 287018 280405 273976 268256 263417 259245 255700 253071 251475
64547 251475 250518 249586 248312 246726 245191 244365 244897 246884 249717 252634 255232 257265 258256 257788 256123 254063
64531 254063 252071 249898 247175 244026 240816 237632 234396 231353 229025 227675 227071 226854 226935 227403 228219 229080
64515 229080 229585 229535 229159 229042 229702 231220 233394 236180 239771 244176 249005 253900 259021 264855 271550 278681
64499 278681 285602 291770 296651 299677 300605 299854 298262 296488 294734 292927 290931 288631 286094 283701 281961
64484 281961 281101 281013 281579 282762 284330 285872 287260 288654 289774 289617 287483 284005 280518 277506 274394
64469 274394 270849 267466 264907 263163 262135 262270 263933 266590 269320 271860 274479 277030 278918 279938
64455 279938 280438 280515 279774 278118 276189 274706 273751 272970 272123 271200 270380 270078 270665 271935 273238 274458 276407
64438 276407 279831 284416 289266 294166 299811 306840 315187 324501 334866 346883 361145 377749 396373
64425 396373 416906 439974 466656 497710 533484 574694 622807 679217 744276 817460 898083
64414 898083 985252 1077238 1171458 1265244 1356356 1442898 1523135 1595375 1657734 1708211 1745486
64403 1745486 1769527 1780861 1779357 1764377 1736100 1695849 1644810 1583215 1511336 1430723 1343904
64392 1343904 1253345 1161363 1070584 983574 901921 826245 757090 695130 640438 592208 549667
64381 549667 512851 482140 457254 437060 420232 405742 392829 380992 370228 361005 353606 347480
64369 347480 341450 334619 326907 318646 309992 301049 292350 284683 278322 272779 267546 262788 259076 256658
64355 256658 255317 254824 255178 256386 258304 260755 263652 266968 270666 274655 278663 282136 284420 285146 284392
64340 284392 282501 279781 276425 272623 268657 264782 260981 256923 252389 247770 243959 241687 241092 241944 243941
64325 243941 246624 249327 251612 253634 255832 258348 260982 263542 265888 267813 269330 271007 273452 276381
64311 276381 278654 279414 278781 277240 274847 271418 267098 262269 257054 251340 245193 238900 232755 227140 222634
64296 222634 219555 217437 215491 213637 212573 212673 213333 213685 213580 213493 213801 214615 216102 218464 221585 225116
64280 225116 228970 233452 238869 245263 252457 259998 267030 272737 277150 281211 285708 290352 294110 296354
64266 296354 297415 298134 299003 299759 299744 298779 297620 297275 297817 298260 297761 296425 294622 292053 288160 283125 277738
64249 277738 272417 267094 261966 257501 253554 249368 244833 241040 238983 238281 237769 236902 235973 235276 234835 234817
64233 234817 235563 237155 239423 242408 246308 250924 255581 259765 263565 267431 271761 276719 282152 287659
64219 287659 293029 298630 305111 312732 321228 330213 339438 348752 358297 368626 380116 392149 403437
64206 403437 413259 421919 429777 436427 441223 444121 445467 445219 442936 438474 432260 424926 416993 408927
64192 408927 401230 394381 388836 384980 382917 382308 382583 383280 384118 384892 385427 385491 384570 381899 376969 369972
64176 369972 361555 352266 342399 332244 322171 312407 302938 293640 284430 275373 266786 259128 252581 246856
64162 246856 241628 237043 233525 231125 229416 228016 226909 226200 225893 226066 226923 228470 230291 231938 233407
64147 233407 235051 237035 239081 240817 242256 243829 245874 248074 249515 249466 248116 246393 245001 243812 242284
64132 242284 240279 238210 236483 235131 234110 233634 233950 234894 235930 236724 237469 238636 240545 243291 246844
64117 246844 251042 255658 260646 266251 272658 279667 286915 294247 301478 307922 312727 315785 317828 319448
64103 319448 320592 321363 322706 325551 329547 333421 336638 339993 344353 349368 353847 357033 359056 360316
64089 360316 360827 360214 358137 354661 350349 345942 341815 337698 333056 327775 322388 317573 313474 309599 305354
64074 305354 300595 295629 290879 286707 283406 281014 279055 276852 274324 272212 271196 270957 270474 269135 267215
64059 267215 265310 263739 262612 262086 262214 262732 263246 263601 263946 264428 264992 265560 266383 268005 270658 273733 276213
64042 276213 277783 279244 281575 284884 288662 292739 297445 302904 308727 314482 319997 325055 329233 332244
64028 332244 334222 335553 336670 337967 339583 341298 343014 345168 348084 350965 352339 351710 349987 347988
64014 347988 345327 341384 336602 331979 327743 323373 318657 313946 309526 305470 302021 299399 297253 294978
64000 294978 292637 291004 290654 291539 293377 295823 298218 299880 300824 301675 302807 304180 306047 308996 312972
63985 312972 316994 320279 323094 326095 329415 332958 337037 342017 347599 353029 357880 362188 366077 369850
63971 369850 374257 380021 387020 394399 401593 408918 417124 426662 437478 449242 461694 474849 488878
63958 488878 503731 519107 534955 551809 570377 591009 613850 639298 667973 700382 737061
63947 737061 778916 827107 882687 946744 1020747 1106342 1204927 1317911 1447139 1594274 1759563
63936 1759563 1941809 2139725 2352622 2579522 2818265 3065950 3319518 3575055 3826891
63927 3826891 4068316 4293345 4497358 4676305 4826222 4943822 5026893 5073661 5082211 5051110
63917 5051110 4980512 4872448 4730288 4558404 4362076 4146988 3918382 3680754 3438295 3195210
63907 3195210 2955391 2722065 2498066 2286232 2089133 1908458 1744906 1598632 1469361
63898 1469361 1355979 1256502 1168909 1092056 1025525 968651 919905 877261 839032 804284 772630
63887 772630 743776 717264 692550 669252 647267 626668 607482 589544 572556 556376 541290
63876 541290 527843 516322 506530 498212 491464 486428 482771 479935 477892 477133 477892 479974 483591 489658
63862 489658 498750 510237 523066 537133 553251 571961 593020 615989 640754 667396 696099 727143
63850 727143 760473 795202 830000 864105 897601 930728 963457 995671 1027056 1056590 1082698
63839 1082698 1104154 1120442 1131214 1136118 1135343 1129561 1118908 1102733 1080902 1054600 1025182 992837
63827 992837 957284 919327 880726 842642 805118 768110 732183 698000 665729 635174 606025
63816 606025 577932 550882 525617 503138 483557 465876 449090 433135 418651 406223 396021
63805 396021 387691 380343 372973 365207 357464 350291 343899 338327 333579 329312 324833 319767 314410 309153
63791 309153 303866 298256 292581 287556 283632 280653 278211 276040 274105 272466 271140 270074 269278 268895 268934
63776 268934 269015 268673 267911 267047 266018 264371 262128 260086 258889 258236 257451 256461 255648 255067 254399 253550 252716
63759 252716 251874 250734 249180 247397 245521 243580 241754 240308 239295 238672 238616 239240 240071 240418 240347 240683 241828
63742 241828 243131 243819 244099 244889 246660 248971 251071 252639 253958 255569 257717 260105 262208 263876 265415
63727 265415 267183 269407 272391 276352 280859 284915 288005 290737 294062 298138 302358 306228 309694 312794
63713 312794 315535 318070 320439 322111 322268 320737 318308 315999 314321 313317 312866 312705 312471 312038 311700 311894
63697 311894 312816 314353 316157 317782 319009 320141 321640 323371 324560 324658 323856 322517 320604 318092 315563
63682 315563 313807 313020 312872 313147 313746 314223 314137 313929 314718 316917 319699 322181 324539 327385 330605 333579
63666 333579 336247 339151 342389 345293 347363 348892 350313 351400 351580 350759 349332 347436 344702 340877 336393
63651 336393 332058 328294 324859 321276 317368 313305 309342 305722 302838 301193 300981 301755 302756 303665 304889
63636 304889 307059 310265 313903 317244 320088 322860 326080 329860 333946 338126 342374 346620 350752 355080
63622 355080 360558 368078 377511 387710 397628 407291 417677 429817 444162 460588 478837 498919
63610 498919 521099 545467 571587 598732 626437 654581 682841 710280 735590 757590 775434
63599 775434 788631 797110 801232 801614 799037 794488 788967 782935 776116 768032 758560 747758 735369 720890
63585 720890 704092 685201 664651 643035 621261 600333 580840 562905 546625 532249 519862
63574 519862 509332 500741 494449 490450 488053 486592 486165 487163 489275 491499 493152 494352 495429 496447
63560 496447 497570 499404 502520 506868 512124 518469 526586 536943 549504 564247 581477 601478 624253
63547 624253 649978 679389 713180 750897 790663 829958 866348 897561 921474 936646 942958 941620
63535 941620 934600 924070 912095 900225 889083 878406 867697 856777 845584 833512 819263 801625
63523 801625 780407 756533 731230 705204 678515 651095 623326 596192 570888 548118 527747
63512 527747 509206 492180 476729 462809 450116 438528 428274 419320 410990 402662 394626 387669
63500 387669 381982 377039 372503 368484 364838 361022 357022 353698 351652 350215 348187 345226 341953 339001
63486 339001 336645 335152 334789 335484 337048 339645 343445 347890 352053 355824 360056 365299 371050 376557 381707
63471 381707 386624 390858 393577 394333 393265 390820 387707 384792 382505 380442 377974 375109 372346 369908
63457 369908 367686 365831 364763 364483 364449 364396 364774 366089 368232 370879 374162 378399 383300 388022 392133 396128
63441 396128 400864 406711 413503 421149 430095 441244 455481 473266 494561 519126 546673 576459
63429 576459 606702 634852 658865 678224 693570 705564 714531 721179 727179 734667 745316 759931
63417 759931 778629 801072 826640 854636 884295 914452 943315 968882 989647 1004879 1014393 1018308
63405 1018308 1017086 1011646 1003311 993483 983027 971826 959212 945054 930022 914443 897203 876475
63393 876475 851548 823433 793719 763448 733230 703689 675319 648358 623196 600512 580511
63382 580511 562447 545566 530350 518151 509543 503630 499130 495658 493698 493709 495630 499068 503640 509175
63368 509175 515782 523696 532995 543549 555340 568715 584146 601783 621445 643073 667027 693842
63356 693842 723737 756352 790774 825680 859570 891152 919615 944449 965046 980694 991065
63345 991065 996478 997556 994809 988780 980355 970484 959555 947304 933366 917681 900311 881152 859948
63332 859948 836458 810570 782527 753158 723724 695387 668867 644547 622709 603674 587924
63321 587924 576016 568047 563254 560439 558722 557381 555034 549807 540718 528413 514128 498452 481577
63308 481577 464242 447686 432827 420009 409290 400357 392366 384605 377280 371027 365704 360449 354997
63295 354997 350125 346431 343427 340351 337294 334835 332894 330677 327728 324489 321734 319815 318523 317408
63281 317408 316091 314483 312820 311393 310279 309455 309130 309656 311059 312865 314608 316286 317973 319166 319025
63266 319025 317491 315759 315174 315854 316809 317395 318054 319481 321525 323278 324008 323722 323062 322917 323891 325784 327698
63249 327698 328944 329693 330511 331568 332675 333829 335209 336758 338277 339859 341710 343576 344927 345782 346767
63234 346767 348169 349459 350073 350263 350837 352312 354538 356930 358900 360354 361965 364649 368507 372561 375764
63219 375764 378068 380223 382798 385767 388914 392278 396092 400448 405157 409972 414934 420355 426277 432120
63205 432120 437180 441413 445326 449133 452492 455187 457559 460068 462828 465782 468881 471806 473994 475397
63191 475397 476878 479437 483419 488857 496145 505651 516877 528700 540582 553050 566944 582605 599763
63178 599763 617791 635977 653980 672126 690894 710026 728553 745864 762378 778893 795520
63167 795520 811558 826301 839648 851911 863200 873186 881416 887641 891626 892726 890081 883438 873446
63154 873446 860830 845509 826995 805534 782330 758548 734592 710625 687407 666064 647069
63143 647069 629829 613536 598313 585206 574945 566977 560060 553714 548611 545437 543911 543256 543199 543917
63129 543917 545258 546670 548017 549958 553311 558295 564409 570767 576599 581767 586893 592725 599350 606350
63115 606350 613561 621122 628673 635207 640138 644123 648342 653194 658121 662541 666457 670115 673464 676170
63101 676170 677975 678893 679149 679088 679176 679998 682070 685485 689805 694528 699800 706502 715443 726446 738318
63086 738318 749713 759925 768875 776506 782511 786724 789512 791339 791945 790433 786427 780735 774426 767494
63072 767494 759028 748632 737156 725916 715615 706085 696679 686771 676315 666166 657586 651260 647045
63059 647045 644680 644209 645513 647998 651204 655311 660521 666272 671774 677193 683731 692347 702867 714451
63045 714451 726492 738753 750917 762447 773052 783115 793388 804107 814553 823801 831898 839843
63033 839843 848200 856233 862882 868229 873293 878468 882883 885453 885947 884638 881468 876088 868509 859213
63019 859213 848676 837217 825340 813831 803262 793565 784323 775483 767693 761898 758639 757733 758654
63006 758654 761215 765866 773345 784084 797932 814384 833013 853723 876638 901776 928854 957397
62994 957397 986981 1017266 1047935 1078843 1110254 1142611 1175779 1208733 1240386 1270765 1300957
62983 1300957 1331714 1362400 1391563 1418201 1441976 1462355 1478235 1488713 1493712 1493422 1487395 1474732
62971 1474732 1455103 1429142 1397803 1361842 1322107 1279928 1236747 1193440 1150260 1107451 1065646
62960 1065646 1025584 987648 951823 918045 886382 856772 828683 801317 774269 747863 722717
62949 722717 699145 677146 656809 638340 621667 606290 591648 577447 563650 550446 538337
62938 538337 527939 519398 512132 505348 498679 492226 486178 480658 475787 471660 468294 465755 464229 463727
62924 463727 463772 463644 462982 462009 461119 460375 459458 458006 455973 453629 451262 448939 446642 444499 442663 440980
62908 440980 439133 437217 435810 435228 435033 434649 434270 434757 436629 439525 442636 445432 447957 450731 454421
62893 454421 459419 465649 472810 480679 489061 497653 506255 514966 523863 532616 540788 548393 555704 562552
62879 562552 568356 572877 576393 578896 579662 577978 573954 568236 561238 553052 543940 534448 525005 515654
62865 515654 506218 496664 487349 478852 471369 464303 456831 448995 441737 435694 430481 425574 421315 418325
62851 418325 416239 413881 410754 407629 405529 404682 404629 404726 404296 402850 400578 398322 396665 395307 393619 391502
62835 391502 389359 387533 386179 385505 385653 386415 387400 388419 389369 389837 389287 387675 385665 384140 383713 384602
62819 384602 386600 389109 391509 393588 395393 396695 397050 396494 395790 395729 396406 397343 398027 398118 397505 396585 396222
62802 396222 396935 398185 398888 398656 398172 398255 398897 399375 399059 397936 396485 395199 394210 393340 392558 392310 393194 395323
62784 395323 398220 401363 404615 408049 411622 415221 418862 422693 426884 431643 437149 443274 449466 455140
62770 455140 460217 465123 470269 475651 480977 486039 490877 495614 500180 504209 507199 508725 508474 506252
62756 506252 502228 497137 491897 486792 481218 474446 466507 458112 449867 441896 434176 426933 420550 415204
62742 415204 410657 406341 401714 396732 391966 388099 385257 382979 380788 378566 376447 374716 373875 374393 376039
62727 376039 377705 378321 377909 377483 377919 379236 380991 383015 385498 388560 392032 395721 399748 404540 410443
62712 410443 417365 424829 432523 440789 450424 461935 475102 489376 504567 520939 538748 557974
62700 557974 578615 601051 625931 653702 684360 717709 753944 793917 838605 888066 941021
62689 941021 995722 1051232 1107528 1164356 1220392 1273705 1322587 1365554 1400918 1427040 1443091
62678 1443091 1449196 1445790 1433186 1411738 1382059 1344936 1301330 1252601 1200447 1146425 1091688 1037199
62666 1037199 983952 932825 884357 838746 795923 755725 718295 684256 654067 627168 602277
62655 602277 578779 557350 538915 523400 509895 497657 486432 475978 465817 455534 445112
62644 445112 435037 426165 419185 413909 409368 404933 401025 398344 396718 395303 393738 392441 391742 391243
62630 391243 390095 387565 383431 378318 373618 370490 368767 367247 365048 362234 359227 356332 353981 352667
62616 352667 352213 351635 350243 348552 347666 348064 349344 350892 352306 353277 353512 352901 351656 350231 349123 348581
62600 348581 348476 348552 348814 349469 350640 352379 354791 357676 360231 361777 362861 364869 368310 372195 375429
62585 375429 378081 380756 383444 385792 388002 390645 393782 396950 399774 401948 402919 402381 401019 399999 399621
62570 399621 399053 397439 394725 391353 387727 384126 380737 377609 374819 372605 370996 369553 367948 366621
62556 366621 366189 366383 366317 365803 365628 366309 367352 368012 368125 367885 367450 367166 367607 368900 370437 371706 372972
62539 372972 374714 376778 378570 379842 380865 382029 383547 385291 386729 387408 387748 388884 391297 394144 396477
62524 396477 398660 401890 406657 412445 418824 426040 434440 443940 454295 465549 478153 492899 510644
62511 510644 531730 555734 582104 610889 642365 676160 711374 747513 784592 822165 858905
62500 858905 893511 925498 954833 981195 1004040 1023115 1038595 1050894 1060613 1068410 1074708 1079705
62488 1079705 1083868 1088216 1093900 1101665 1111760 1124018 1137789 1152154 1166483 1180534 1193656 1204163
62476 1204163 1209953 1209690 1203126 1190440 1171721 1147060 1116730 1081154 1040953 997129 950986 903769
62464 903769 856484 810052 765400 723328 684366 648819 616820 588389 563575 542476 524929
62453 524929 510204 497302 485713 475725 467864 462099 457709 453884 450393 447692 446391 446600 447836 449610
62439 449610 452000 455410 459761 464158 467572 469770 471465 473569 476304 478911 480131 478987 475350 469942
62425 469942 463897 458235 453457 449352 445174 440273 434728 429345 424939 421662 419022 416399 413460 410230
62411 410230 407006 404180 401969 400254 398721 397220 395898 395021 394724 394925 395371 395775 396005 396215 396735 397830
62395 397830 399614 402124 405321 409016 412984 417230 421947 427088 432213 437025 441926 447639 454227 460901
62381 460901 466974 472757 479216 486874 495275 503437 510612 516736 522453 528685 535874 543556 550913 557847
62367 557847 565327 574538 585926 599194 614073 630822 650123 672704 699075 729418 763656 801703
62355 801703 843640 889537 939063 991213 1044284 1096089 1144388 1187382 1223871 1253042 1274418
62344 1274418 1288235 1295541 1297392 1293914 1284579 1269488 1249912 1227213 1201576 1172297 1139256 1103740
62332 1103740 1067761 1032811 999306 966931 935350 904739 875831 849382 825515 803555 782559
62321 782559 761944 741589 721510 701654 682036 662951 644963 628582 613903 600556 588099
62310 588099 576515 566184 557274 549347 541842 534890 529277 525463 522953 520895 519048 517807 517424 517637
62296 517637 518106 518778 519712 520939 522690 525377 529028 533004 536597 539698 542522 544999 546906 548472 550199
62281 550199 552086 553619 554717 556121 558516 561677 564869 567763 570577 573620 577185 581731 587635 594745
62267 594745 602578 611058 620775 632530 646914 664321 685008 708940 735926 766164 800519 839995
62255 839995 884837 934233 986832 1041398 1096827 1151578 1203441 1250291 1291178 1326273 1355533
62244 1355533 1377738 1391277 1395676 1391862 1380940 1363259 1338803 1308004 1271851 1231444 1187739 1141646
62232 1141646 1094238 1046854 1000940 957443 916412 877561 841361 809065 781370 757442 735714
62221 735714 715433 697013 681057 667551 655974 645714 636286 627512 619649 613048 607594 602754 598220
62208 598220 594239 591149 588871 587079 585709 585025 585257 586388 588309 591013 594542 598775 603439 608435 614081
62193 614081 620765 628268 635765 642802 650042 658602 668750 679799 691268 703485 716777 730676 744476
62180 744476 758100 771752 784934 796590 806235 814314 821344 827435 833028 839453 848165 859701 873921
62167 873921 891070 912066 937764 968380 1003583 1042595 1084049 1126194 1167585 1207353 1244652
62156 1244652 1278175 1306527 1328987 1345727 1357434 1364852 1368389 1367802 1362329 1351458 1335584 1315739
62144 1315739 1292812 1267354 1240059 1211941 1183866 1156213 1129203 1103211 1078451 1054642 1031420
62133 1031420 1009052 988327 969647 952540 936237 920446 905270 890605 876056 861523 847481
62122 847481 834465 822526 811469 801400 792655 785226 778684 772733 767480 763093 759620 757301 756628
62109 756628 757702 759891 762587 766045 771071 778155 787467 799391 814212 831129 848352 864391 878670
62096 878670 890673 899423 904584 907584 910808 915616 921613 927668 932991 937199 939883 940465 938411 933619
62082 933619 926855 919736 913917 910165 908411 908678 911735 918654 929778 944122 959849 975589 991496
62069 991496 1008883 1028680 1050424 1072938 1095655 1118937 1143328 1168954 1195461 1222019 1247355
62058 1247355 1270211 1289804 1305571 1316741 1322727 1323890 1321256 1315330 1305740 1292140 1274796 1254035
62046 1254035 1229809 1202291 1172392 1141090 1108574 1074581 1039361 1003820 968874 935119 903008
62035 903008 872848 844578 817926 792776 769139 746882 725846 706203 688305 672168 657408
62024 657408 643749 631312 620307 610680 602072 593978 585929 577744 569593 561644 553778 545920 538524
62011 538524 532253 527129 522393 517448 512611 508727 506335 505420 505730 506950 508693 510709 513144 516351 520385
61996 520385 524885 529504 534181 538764 542591 544865 545505 545287 544861 543894 541551 537667 532950 527980 522609
61981 522609 516633 510567 505206 500700 496614 492742 489340 486583 484386 482826 482177 482327 482639 482621 482355 482022
61965 482022 481418 480234 478465 476218 473513 470681 468551 467683 467590 467278 466449 465661 465414 465662 466276 467426 469315
61948 469315 471983 475463 479702 484264 488695 493357 499263 506765 514999 523190 531920 542382 554729 567954
61934 567954 581209 594393 607471 620178 632612 645255 657933 669455 678899 686664 693552 699213
61922 699213 702387 702574 700635 697598 693565 688131 681420 674361 668153 663636 661001 659998 660647 663697 669985
61907 669985 679224 689914 700766 711801 723628 735969 747532 757174 764626 770055 773515 775059 774906
61894 774906 773127 769503 764081 757669 751319 745329 739152 732357 725327 718788 712900 707156 701079 694693
61880 694693 688219 681532 674191 665909 656813 647208 637275 627149 617222 608107 600167 593201 586806 581069
61866 581069 576660 574070 572952 572513 572472 573307 575568 579351 584606 591570 600533 611483 624311 639159
61852 639159 656177 675144 695805 718415 743336 770080 797335 824146 850505 876617 902077
61841 902077 926089 947955 966953 982199 993173 1000077 1003235 1002490 997841 990371 981858 973588 966177
61828 966177 960394 957251 957056 959124 962789 968080 975076 983169 991370 998831 1004561 1007141 1005512 999823
61814 999823 990858 978795 963167 944072 922670 900230 877236 853730 830030 806682 783986 762115
61802 762115 741627 723376 707798 694481 682575 671479 661092 651587 643127 635783 629549 624354
61790 624354 620060 616504 613596 611308 609499 607724 605382 602252 598813 595830 593554 591520 589278 587139
61776 587139 585886 585802 586313 586723 586979 587464 588240 588915 589243 589492 590080 591164 592764 595086 598405 602736 607844
61759 607844 613480 619389 625234 630900 636878 643840 651583 658757 663997 667178 669191 670690 671534 671440 670571
61744 670571 669207 667259 664545 661317 658168 655532 653567 652364 651840 651508 650778 649543 648162 646861 645572
61729 645572 644359 643505 642958 642184 640906 639597 638796 638269 637380 636136 635243 635174 635698 636413 637211 637992 638390 638101
61711 638101 637224 635914 633957 631051 627422 623751 620441 617166 613283 608517 603233 598177 594037 591056
61697 591056 588804 586357 582941 578565 573964 569849 566392 563480 561184 559564 558147 556101 553088 549525
61683 549525 545808 541762 537213 532701 529013 526184 523574 520904 518552 516680 514677 511893 508546 505504
61669 505504 503319 501777 500277 498386 496068 493599 491274 489167 487215 485527 484406 484018 484212 484730 485349
61654 485349 485788 485761 485300 484778 484456 484282 484282 484842 486250 488249 490452 493002 496315 500224 503888 506653 508582
61637 508582 509944 510554 509985 508277 506110 504242 502917 501852 500591 498785 496247 493012 489491 486436 484496
61622 484496 483635 483141 482318 481137 480122 479698 479764 479852 479556 478777 477616 476073 473820 470349 465447 459590 453822
61605 453822 449131 445767 443082 440112 436468 432591 429114 426149 423423 420851 418516 416152 413240 409763
61591 409763 406353 403425 400660 397723 394976 392910 391146 388749 385432 381930 379131 377325 376361 376007 375977
61576 375977 375985 375980 376077 376144 375747 374648 373107 371570 370294 369403 368977 368933 368979 368903 368814 369009 369694 370834 372103 373021
61556 373021 373362 373402 373569 373923 374304 374897 376116 377894 379561 380637 381246 381557 381372 380665 380026 380000 380333 380417
61538 380417 380321 380750 382053 383846 385662 387493 389502 391601 393496 394947 395850 396256 396345 396220 395741 394772 393554
61521 393554 392492 391588 390482 389169 388284 388362 389026 389216 388193 386181 384138 383015 383140 384037 384784 384664 383622
61504 383622 382269 381526 382088 383916 386153 387758 388382 388500 388698 389053 389338 389525 389805 390232 390645 390890 390883 390466
61486 390466 389468 387976 386393 385141 384474 384533 385346 386650 387947 388990 390120 391854 394157 396322 397646
61471 397646 398070 398038 397939 397850 397737 397600 397369 396834 395884 394742 393787 393110 392365 391143 389465 387815 386696 386243
61453 386243 386264 386587 387208 388164 389396 390809 392345 393886 395201 396116 396711 397221 397828 398689 400062 402104 404540
61436 404540 406792 408557 410059 411622 413239 414765 416368 418470 421275 424460 427324 429223 430042 430413 431296
61421 431296 433116 435408 437535 439551 442014 444999 447736 449388 449927 450071 450515 451355 452152 452403 451970 451131
61405 451131 450221 449314 448266 446905 445059 442641 440036 438206 437875 438593 439050 438432 437056 435592 434215 432863
61389 432863 431805 431382 431403 431328 430996 430729 430803 431201 431906 433104 434937 437329 440086 442983 445752 448178 450261
61372 450261 452143 453943 455815 458000 460508 462818 464315 465067 465850 467318 469457 471976 474843 478126 481563
61357 481563 484709 487523 490534 494321 498964 504136 509647 515710 522588 530126 537925 545955 554678 564410
61343 564410 574829 585275 595195 603972 610736 615027 617478 619207 620502 620701 619372 616907 613793 610077
61329 610077 605880 601768 598071 594432 590620 587267 585055 583656 582255 580815 579880 579304 578226 576523 575325
61314 575325 575726 577624 580276 583357 586982 591177 595927 601459 607992 615443 623758 633276 644302 656458
61300 656458 668954 681349 693597 705346 715687 723705 728966 731439 731263 728747 724303 718238 710757
61287 710757 702229 693246 684305 675630 667389 659943 653749 649102 646008 644187 643134 642335 641621 641304 641909
61272 641909 643739 646692 650418 654658 659469 665102 671596 678559 685503 692343 699414 707037 715296 724274
61258 724274 734203 745220 757158 769762 782945 796552 809900 821768 830972 836931 839720 839722 837247
61245 837247 832451 825591 817280 808361 799435 790630 781876 773311 765351 758490 753116 749314 746677 744481
61231 744481 742291 740308 738946 738250 738003 738212 739099 740645 742633 745134 748510 752798 757511 762218 766918
61216 766918 771665 776321 780968 786039 791523 796399 799521 800934 801796 803118 805089 807524 810250 812923
61202 812923 815081 816786 818880 822331 827551 834496 843142 853668 866385 881654 899612 919819 941367
61189 941367 963457 985625 1007394 1028084 1047165 1064435 1079631 1092164 1101622 1108259 1112680 1115227
61177 1115227 1115983 1115134 1112895 1109156 1103575 1096068 1086912 1076376 1064446 1050958 1035834 1019156 1001162
61164 1001162 982201 962696 943189 924254 906159 888609 871217 854286 838715 824941 812529
61153 812529 801071 791000 783002 777065 772751 770089 769486 770844 773460 776816 780827 785266 789508 792976
61139 792976 795307 796003 794514 790874 785788 779860 773253 766390 760429 756531 754965 755378 757722 762491 770156
61124 770156 780767 794127 810042 828325 848688 870753 894205 918985 945173 972506 1000149
61113 1000149 1027278 1053886 1080547 1107247 1132909 1156417 1177785 1197818 1216688 1233326 1246419
61102 1246419 1255814 1262666 1268208 1272531 1274645 1273476 1268489 1259437 1246104 1228632 1207677 1183822 1157159
61089 1157159 1127992 1097597 1067529 1038254 1009231 980367 952587 926781 903004 881063 861135
61078 861135 843264 826938 811855 798626 787990 779586 772223 765285 759232 754739 751917 750454 749956
61065 749956 749913 749738 749158 748515 748474 749501 751668 754887 759209 764816 771757 779792 788629 798249 808939 821068
61049 821068 834958 850802 868446 887363 907109 927771 949721 973059 997591 1023185 1049684
61038 1049684 1076581 1103270 1129655 1156089 1182735 1209356 1235619 1261102 1285169 1307439 1328299
61027 1328299 1348373 1367673 1386014 1404077 1423066 1443320 1464277 1485842 1508646 1532855 1558111
61016 1558111 1585205 1616421 1653405 1695774 1742622 1794339 1851886 1915056 1982556 2053436 2127966
61005 2127966 2207822 2295916 2395164 2506941 2631737 2771459 2929306 3106593 3301773 3514091
60995 3514091 3746625 4004689 4294113 4623890 5008933 5467976 6021586 6696691 7532587
60986 7532587 8580299 9900062 11564721 13657330 16242043 19315859 22780360 26455147
60978 26455147 30108305 33475001 36283621 38329530 39577277 40202720 40513438 40796447
60970 40796447 41206933 41753432 42333311 42755791 42761302 42088331 40583986 38279560 35366909
60961 35366909 32102467 28720479 25400132 22267724 19402362 16841521 14594018 12653888
60953 12653888 11004548 9617754 8458009 7490657 6684624 6010165 5439487 4950745 4528760
60944 4528760 4161467 3837979 3550091 3292811 3062380 2855272 2669325 2503839 2357699
60935 2357699 2228526 2113718 2010827 1916689 1827803 1742212 1659977 1581571 1507003 1436635 1371417
60924 1371417 1311754 1257150 1207311 1162587 1123004 1087877 1056656 1029172 1004817 982559 962087
60913 962087 943922 928037 913414 899358 886206 874289 863232 852800 843391 835012 826643 817394
60901 817394 807542 797710 787665 776798 765275 753868 742844 731715 720024 707947 696176 685467
60889 685467 676157 667887 659911 651781 643679 636199 630053 625745 622995 620618 617541 613962 611009 609355
60875 609355 608763 608825 609304 609702 609376 608388 607616 607796 608959 610869 613305 615825 617927 619667 621522 623601
60859 623601 625644 627707 630013 632151 633535 634701 636979 640559 644076 646566 648623 650972 653161 654563
60845 654563 655621 657067 658648 659609 659781 659227 657529 654458 650782 647307 643587 638576 632250 625520 618889
60830 618889 612232 605682 599667 594103 588632 583678 580269 578667 577996 577480 577291 577916 579325 581089 582841
60815 582841 584416 585877 587564 589836 592739 596174 600269 605173 610635 616252 622041 628351 635371 643246
60801 643246 652500 663661 676455 689958 703611 717512 731698 745866 760088 775142 791677 809386
60789 809386 827345 844898 861907 878332 893914 908252 921051 932292 942132 950645 957718 963290
60777 963290 967478 970221 971076 969691 966261 961125 954069 944629 933074 920484 907693 894599 880731
60764 880731 866019 850721 835006 819074 803478 788852 775305 762352 749543 736896 724608
60753 724608 712548 700342 688001 676188 665621 656308 647658 639269 631285 623927 617102 610637 604536
60740 604536 598726 592831 586527 579916 573314 566882 560688 554924 549761 545229 541430 538574 536527 534684
60726 534684 532650 530710 529182 527683 525617 523058 520540 518183 515737 513336 511380 509667 507395 504244
60712 504244 500759 497468 494244 490828 487334 483774 479630 474439 468617 463225 459036 456042 453657 451151
60698 451151 448125 444874 442202 440599 439682 438595 436865 434784 433048 432199 432222 432603 432819 432874 433267 434441
60682 434441 436472 439234 442578 446173 449474 452120 454288 456541 459360 462852 466786 470889 475210 480146
60668 480146 485900 491933 497262 501396 504662 507569 510177 512335 514195 516114 518174 520105 521693 523047
60654 523047 524439 526008 527699 529473 531583 534517 538440 542729 546360 548900 550833 552719 554290 554746
60640 554746 553772 551782 549101 545400 540332 534458 529007 524634 520876 517061 513360 510428 508223 505910
60626 505910 503110 500576 499185 498740 498363 497792 497506 497610 497345 496031 493983 492089 490775 489750 488594 487217
60610 487217 485775 484424 483261 482340 481702 481421 481625 482375 483534 484786 485865 486784 487857 489444 491688 494491
60594 494491 497643 500800 503452 505300 506810 509027 512570 516984 521343 525151 528349 530762 532186 532959
60580 532959 533860 535294 536989 538587 540142 541894 543967 546522 549922 554510 560419 567665 576153 585477
60566 585477 595074 604826 615325 627407 641709 658844 679574 704363 732815 763873 796394 829199
60554 829199 860587 888335 910517 926289 935704 938880 935618 925980 911095 893087 874110 855552
60542 855552 838127 822278 808231 795999 785908 779074 776910 780120 788524 801939 820803 845850
60530 845850 877600 916360 962197 1014453 1071402 1130642 1189771 1246556 1298790 1344371 1381496
60519 1381496 1408690 1424857 1429681 1423945 1409308 1387698 1360893 1330411 1297574 1263676 1230146 1198385
60507 1198385 1169322 1143350 1120845 1102493 1088753 1079209 1072945 1069670 1070149 1075361 1085558 1100470
60495 1100470 1120354 1146486 1180549 1223795 1277033 1341139 1417001 1504640 1602449 1707294 1815056
60484 1815056 1920876 2019315 2105009 2173705 2223026 2252835 2265431 2265339 2258292 2249848 2244539 2245656
60472 2245656 2255047 2272815 2297300 2325331 2352363 2372755 2380705 2371482 2342022 2291020 2219373 2130615
60460 2130615 2029963 1922213 1810665 1698142 1588294 1485108 1391231 1307140 1231811 1163853
60450 1163853 1102274 1046787 997597 954690 917352 884509 855406 829663 806816 786243 767617
60439 767617 751157 737261 725963 716750 708830 701582 694923 689283 685173 682719 681587 681242 681212 681148 680700
60424 680700 679378 676621 672223 666717 661191 656581 653140 650447 647747 644324 639856 634569 628991 623648
60410 623648 619089 615931 614373 613692 612802 611499 610657 610898 611582 611536 610479 609199 608530 608625 609161 609803 610386
60393 610386 610929 611600 612521 613607 614612 615209 615019 613866 612226 611215 611784 613989 617133 620423 623302 625448
60377 625448 626835 627706 628218 628275 627982 628038 629206 631445 633940 635974 637432 638537 639594 641076 643536 647137
60361 647137 651463 655905 660050 663667 666595 668855 670666 672197 673424 674397 675464 677009 678988 680942
60347 680942 682579 684308 687177 692279 700129 710515 722867 736789 752202 768940 786221 802619
60335 802619 816673 827517 834891 838649 838523 834402 826582 815604 802091 786991 771761 757853 745920
60322 745920 735663 726420 717782 709809 702948 697637 693760 690643 687904 685986 685436 685885 686485 687187 688769
60307 688769 691516 694788 698221 702487 708382 715920 725002 736401 751266 769978 792091 816998 843857
60294 843857 871205 897499 921996 944337 963297 976834 983669 984262 979973 971752 959973 945113
60282 945113 928036 909580 890076 869379 847379 824516 801708 779805 759223 740145 722726
60271 722726 706960 692658 679814 668712 659404 651391 644184 637885 632838 629015 626144 624197 623173
60258 623173 622622 621988 621333 621170 621627 622328 623044 623883 624808 625582 626344 627655 629680 631671 632592 632022 630367
60241 630367 628443 626935 625940 624900 623165 620715 618199 616313 615416 615639 616968 619137 621738 624579 627810
60226 627810 631747 636727 642922 649999 657123 663693 669947 676420 682938 688723 693450 697626 701808 705981
60212 705981 709878 713480 717002 720734 725022 729999 735210 739871 743661 746986 750395 754056 757830 761427
60198 761427 764357 766101 766501 765738 763927 761123 757665 754009 750098 745371 739524 732829 725650 718199 710923
60183 710923 704485 699020 693926 688758 683938 680236 677972 677018 677106 677696 678006 677735 677505 678135 679651 681426
60167 681426 683059 684622 686207 687761 689408 691561 694609 698694 703727 709374 715026 720039 724079 727211
60153 727211 729645 731514 732805 733457 733601 733724 734415 735923 738124 741005 745015 750839 758903 769033 780384
60138 780384 791784 802497 812712 823045 833627 843963 853645 862723 871329 879381 886801 893542 899193
60125 899193 902989 904460 903779 901301 897242 892066 886690 881883 877633 873413 868936 864493 860735 858162
60111 858162 856503 854638 851625 847857 844598 842256 839863 836549 832715 829194 826076 823165 821044 820651
60097 820651 822039 824454 827607 832127 838761 847761 859061 872347 886738 900972 914239 926590 938382
60084 938382 949559 959576 967817 973969 978041 980001 979488 976166 970341 962757 953570 942133 928196
60071 928196 912776 897223 881876 866424 851235 837405 825509 815141 805749 797227 789490 782187
60059 782187 775108 768364 761933 755505 748970 742571 736384 730130 723762 717775 712590 708026 703728 699812
60045 699812 696735 694715 693583 693015 692640 692130 691470 691051 691209 691735 692088 692019 691725 691320 690424 688489 685468
60028 685468 681886 678089 673680 668040 661390 654854 649267 644257 638844 632626 625995 619443 613219 607565
60014 607565 602759 598819 595591 593192 592029 592256 593551 595509 597937 600671 603492 606428 609826 613919
60000 613919 618542 623441 628629 634276 640460 647224 654692 662835 671205 679221 686837 694860 704387 715751
59986 715751 727956 739321 748821 756638 763318 768662 771853 772480 770924 767707 762887 756328 748161 738796
59972 738796 728736 718630 709215 700847 693194 685753 678686 672883 669058 666951 665635 664571 664158 665165
59958 665165 667765 671320 674993 678324 681231 683833 686421 689322 692545 695773 698816 701859 705071 708270
59944 708270 711180 713726 715788 717033 717371 717263 717093 716453 714554 711203 706883 702071 697082 692476 688908
59929 688908 686437 684514 682674 680795 678684 676123 673440 671370 670091 668983 667619 666417 666019 666600 668117
59914 668117 670610 673764 676738 679076 681341 684223 687379 689898 691620 693220 695126 697199 699507 702549
59900 702549 706375 710174 713267 716016 719260 723149 727077 730647 734139 737988 742218 746502 750439 753617
59886 753617 755754 757137 758698 761242 764646 768152 771466 775093 779439 784006 787893 790831 793290 795620
59872 795620 797468 798086 796894 793739 788928 783187 777350 771893 766810 761872 756875 751676 746251 740817
59858 740817 735692 730976 726506 722149 718053 714557 711995 710524 709969 709858 709799 709817 710150 710829 711721 712923
59842 712923 714734 717197 719957 722705 725511 728724 732863 738683 746977 758073 771713 787513 805172
59829 805172 823999 842488 858741 871359 879870 884520 885916 884808 881976 878122 873712 868763 862791
59816 862791 855081 845026 832212 816498 798326 778863 759453 740922 723672 708186 694852 683321
59804 683321 672804 663253 655589 650325 646487 642518 637886 633208 629039 625251 621597 618207 615214 612314
59790 612314 609031 605271 601347 597522 593714 589725 585675 582018 579109 576841 574847 572932 571097 569229
59776 569229 567128 564899 562993 561674 560736 559939 559449 559499 559825 559804 559234 558686 558963 560296 562151 563853 565345
59759 565345 567243 570091 573720 577550 581369 585459 590020 594870 599778 604610 608980 612283 614496 616566
59745 616566 619462 622983 626031 627994 629348 630767 632149 632861 632686 632122 631718 631448 630901 629891 628598 627213
59729 627213 625783 624505 623758 623574 623364 622550 621267 620095 619318 618943 619212 620394 622020 623056 623051 622545 622135
59712 622135 621795 621461 621590 622526 623818 624830 625631 626642 627731 628533 629508 631761 635607 640068 644105 647703
59696 647703 651351 655037 658464 661935 666229 671458 676633 680674 683475 685594 687220 687996 687838 687289 686845
59681 686845 686379 685568 684467 683209 681483 678946 675992 673480 671707 670201 668491 666395 663511 659216 653568
59666 653568 647668 642754 639309 637256 636430 636453 636738 637113 638110 640155 642938 646048 649798 654726 660542 666298
59650 666298 671510 676468 681372 685706 688623 689635 688801 686510 683151 678921 673938 668510 663044 657618
59636 657618 652033 646477 641691 638115 635187 631956 628166 624376 621254 619081 617641 616163 613693 610062
59622 610062 606288 603612 602303 601791 601599 601508 601050 599608 597041 593705 589912 585910 582309 579867 578752
59607 578752 578474 578611 579115 579836 580296 580156 579594 579029 578678 578419 577956 577129 576184 575585 575433 575368 575191 575138 575239
59588 575239 575004 574293 573903 574544 575714 576431 576683 577093 577537 577277 576344 575491 574674 572886 569894 566876 564808
59571 564808 563282 561619 560116 559341 558972 558291 557334 556688 556515 556486 556423 556390 556367 556341 556455 556643 556429 555562 554487
59552 554487 553768 553429 553355 553844 555108 556549 557319 557478 557983 559604 562364 566034 570705 576903 585472 597144
59536 597144 611861 628676 646632 665293 683852 700107 711351 716511 716885 714792 712049 709737 708490
59523 708490 708392 708966 709763 710871 712647 715015 717225 718233 717302 714390 710050 704860 698912 691895 683620
59508 683620 674295 664346 654173 644114 634476 625500 617319 609928 603247 597345 592582 589249 587004 585042
59494 585042 583033 581516 580990 580969 580456 579164 577698 576700 576487 577540 580484 585092 589832 593097 594812 596409
59478 596409 599255 603516 608557 613978 619868 626204 632483 638140 643091 647564 651434 654106 655257 655471
59464 655471 655880 657244 659487 662109 664855 668013 672134 677558 684176 691640 699780 708780 719075 731201
59450 731201 745467 761375 777368 791620 803272 812655 820233 825766 828664 828623 825497 819002 809226
59437 809226 797242 784608 772224 760085 748142 736896 726992 718575 711226 704386 697830 691936 687528
59424 687528 685293 685386 687700 692349 699608 709526 721858 736274 752371 769775 788641 809768 833542
59411 833542 858833 883493 905834 924783 938642 944943 942373 932286 917719 901428 885489 872069
59399 872069 863195 859503 859903 862613 865907 867794 865892 858423 845263 827832 808244 788601 770462
59386 770462 754311 739679 726188 714384 705164 698607 693936 690658 689133 689720 691859 694497 697210
59373 697210 700490 704914 710376 716182 721648 726533 731151 736233 742606 750777 760677 771701 782956 793691
59359 793691 803774 813814 824608 836385 848698 861030 873330 885886 898909 912445 926559
59348 926559 941392 957056 973574 990861 1008616 1026253 1043052 1058506 1072510 1085238 1096754
59337 1096754 1106598 1113741 1117147 1116509 1112328 1105236 1095419 1082824 1067716 1050777 1032746 1014215 995728
59324 995728 977763 960582 944260 928972 915039 902657 891692 881847 872902 864818 857729 851922
59312 851922 847539 844181 840950 837118 832720 828369 824649 821884 820338 820172 821027 821949 822067 821291 820157
59297 820157 819062 817907 816464 814782 812996 810923 808217 805024 802292 801166 802050 804415 807601 811698
59283 811698 817617 826525 839434 857075 879550 905867 934202 962838 990480 1015385 1034832 1046413
59271 1046413 1049939 1047538 1041871 1034695 1026970 1019265 1011613 1003669 995567 988059 981264 973825 964117 951989
59257 951989 938641 925059 911336 897324 883018 868189 852493 836356 821171 808244 797840
59246 797840 789449 782601 777168 773222 770888 770174 770816 772441 774901 778277 782642 788084 794797 802677 810893
59231 810893 818401 824908 830809 836091 839956 841719 841469 839627 836456 832361 828064 823913 819429 814066
59217 814066 808160 802640 798049 794266 790983 788007 785241 782778 780963 780085 780093 780811 782238 784397 787074
59202 787074 789973 792971 796029 799080 802174 805454 808781 811709 814106 816399 818859 821057 822515 823566
59188 823566 824955 826710 828039 828379 828066 827865 828171 828801 829309 829443 829419 829763 830763 832166 833519 834698 836018
59171 836018 838002 841182 845887 852055 859418 867951 877817 888700 899591 909497 918068 925353 931409 936436
59157 936436 940816 944481 946587 946242 943289 938061 930870 922241 913055 903699 893478 881746 869305 857716
59143 857716 847337 837103 826292 815481 805385 795755 786012 776338 767424 759493 752158 745155 738779
59130 738779 733620 730045 727911 726688 725952 725742 726330 727724 729679 732180 735563 740203 746371 754380 764394
59115 764394 775954 788043 799823 811092 822010 832694 843180 853404 862939 870976 876843 880582
59103 880582 882849 884225 884647 883571 880765 876772 872343 867490 861641 854835 848156 842566 837881 833470
59089 833470 829435 826311 823926 821445 818400 814823 810385 804368 796765 788645 781106 774323 767780 760883
59075 760883 753189 744713 736275 728992 723104 717785 712374 707237 703080 699897 697038 693988 690769 687836
59061 687836 685837 685131 685317 685531 685366 685133 685171 685389 685691 686210 686788 686777 685803 684323 682942 681596 679950 678313
59043 678313 677518 677986 679310 680714 681582 681548 680526 678818 677064 675969 675916 676710 677738 678634 679769 681864
59027 681864 685214 689673 695326 702553 711335 721067 731276 741959 752867 762970 771116 776893 780486
59014 780486 782064 781772 780005 777223 773702 769844 766465 764308 763438 763503 764410 766313 769106 772470 776461
58999 776461 781616 788319 796248 804526 812219 818693 823749 827607 830743 833566 836080 837819 838236 837263 835271
58984 835271 832289 827679 821020 813161 805757 799801 795146 791422 788754 787447 787706 789912 794533 801340
58970 801340 809321 817790 827117 838004 850604 864723 880282 896935 913700 929559 944128 957208
58958 957208 968075 975853 980242 981293 978798 972570 963123 951380 937829 922544 905897 888541 870792
58945 870792 852712 834876 818424 804144 791946 781349 772050 763930 756919 751112 746676 743454 740837
58932 740837 738213 735430 732768 730542 728744 726983 724872 722491 720287 718431 716557 714373 712208 710626
58918 710626 709673 708890 707937 706887 706045 705767 706298 707482 708801 710096 712110 715893 721685 728809 736669 745522
58902 745522 756136 768949 783692 799706 816484 833902 851916 870181 888198 905895 923841
58891 923841 942791 963260 985480 1009412 1034665 1060694 1087134 1113531 1138721 1161076 1179583
58880 1179583 1194222 1205095 1211851 1214250 1212528 1206683 1196161 1180942 1162375 1142111 1120720 1098197
58868 1098197 1075415 1054003 1034811 1017334 1000687 984427 968416 952584 936991 921698 906613
58857 906613 891835 877863 864885 852146 838802 825276 812916 802328 792821 783533 774266 765104
58845 765104 755978 746999 738584 730913 723627 716248 708531 700399 692014 683930 676655 670033 663619 657649
58831 657649 652835 649081 645320 641059 637418 635926 636716 638451 639804 640477 640937 641677 642932 644840 647549
58816 647549 650980 654579 657682 660321 663304 667120 671105 674146 675906 676721 676598 675159 672595 669866 667700
58801 667700 665950 664064 661624 658376 654401 650483 647585 645652 643541 640514 637241 634927 633947 633838 634231
58786 634231 635243 637103 639880 643581 648240 653895 660548 668023 675875 683565 690718 697006 701956 705195
58772 705195 706819 707145 706200 703842 700213 695496 689374 681524 672737 664772 658741 654220 650202 646366 643043
58757 643043 640506 638765 637746 637238 636894 636549 636342 636424 636843 637806 639650 642389 645707 649564 654408 660614
58741 660614 668056 676333 685018 693583 701651 709497 717836 726845 735874 744288 752095 759509 766479 772973
58727 772973 779248 785484 791493 797060 802203 806951 811363 815941 821378 827669 834063 840206 846612 853585
58713 853585 860370 865943 870009 872608 873385 872000 868774 864085 857441 847962 835567 820946 804605 786769
58699 786769 768141 749815 732223 714844 697235 679874 663719 649303 636533 625077 614677
58688 614677 605177 596456 588382 580871 573942 567604 561670 555900 550424 545737 542077 539020 535903 532514
58674 532514 529224 526629 525221 525225 526563 529112 533045 538721 546169 555025 565106 576628 589541 602878
58660 602878 615043 624668 631108 634426 635103 633620 630188 624994 618577 611584 604186 596219 587953 580171
58646 580171 573412 567712 563263 560550 559454 558948 558289 558004 559109 561688 564851 567749 570035 571622 572568
58631 572568 573151 573536 573436 572462 570687 568585 566553 564850 563752 563446 563866 565013 567244 570950 576084 582274
58615 582274 589296 597186 605990 615501 625069 633607 640074 644125 646103 646472 645638 644245 642950 641696 639776
58600 639776 636836 633263 629432 625324 621189 617752 615262 613088 610895 609579 610290 613071 617155 622142
58586 622142 628225 635631 644559 655219 667260 679495 690899 701504 711664 720878 728190 733475 737497
58573 737497 740926 744166 747987 753414 760863 770067 780970 794135 810183 829235 850857 874174 898100
58560 898100 921775 944616 965706 983648 997559 1007729 1014613 1017601 1015723 1009444 1000863 992014 983633
58547 983633 975596 967795 960244 952799 945085 936606 926841 915342 901735 885764 867766 849103 831437
58534 831437 815286 799800 784250 768962 754513 741028 728953 719447 712922 708001 703236 699241
58522 699241 697770 699066 701586 704178 707085 710681 714566 718266 721667 724380 725646 725313 724105 722556
58508 722556 720440 717610 714698 712502 711131 710103 708894 707219 705127 702940 700850 698656 696233 694027
58494 694027 692562 691651 690657 689392 688205 687436 687407 688654 691405 695031 698827 703255 709647 718781 730419
58479 730419 743974 758724 773506 787140 799204 809678 817965 823112 824881 823767 820141 814255 806926
58466 806926 799155 791171 782840 774911 768681 764479 761667 760217 761018 764454 769907 776949 785849 796532
58452 796532 808150 820044 831987 843005 851183 855349 856090 854551 851111 845857 839472 832857 826449
58439 826449 820502 815461 811511 808260 805348 802948 801373 800695 801044 802729 805767 809766 814469 819947 826190
58424 826190 833051 840573 848707 856728 863674 869324 873932 877080 877884 876407 873803 870812 867187 862890
58410 862890 858795 855668 853306 851110 848771 846091 842885 839378 835947 832313 827728 822090 816098 810296
58396 810296 804882 800335 797129 794814 792568 790631 789842 789723 788645 786240 784086 783528 784310 785892 788514
58381 788514 792226 796375 800913 806851 814509 822611 830047 837285 845082 853064 860659 868364 876993 886539
58367 886539 896697 907606 919339 931666 945055 960703 978652 996976 1013757 1028723 1042077
58356 1042077 1053117 1061282 1067393 1072457 1076155 1077775 1077734 1076913 1075339 1072832 1070253 1068781 1068496 1068746 1069363
58341 1069363 1070555 1072318 1074949 1079439 1086353 1095012 1104692 1115814 1129004 1143892 1159945 1177598 1197202
58328 1197202 1217555 1236781 1254224 1270402 1285604 1299657 1312679 1325037 1336830 1348133 1359348
58317 1359348 1370661 1381662 1392012 1401855 1411162 1419566 1427308 1435413 1444396 1453880 1463942 1475499 1488656
58304 1488656 1502060 1514755 1527360 1540555 1553773 1566411 1578952 1591853 1604610 1616921 1629423
58293 1629423 1642351 1654940 1667149 1680345 1695232 1710748 1726283 1743234 1762939 1784727 1807445
58282 1807445 1831264 1856563 1882750 1909772 1939083 1971467 2005508 2039735 2074518 2110330 2146188
58271 2146188 2181714 2218821 2259353 2302853 2348513 2397374 2450492 2506879 2565366 2626591 2691004
58260 2691004 2756950 2822934 2889740 2958014 3025996 3092120 3157671 3224393 3291817 3359648 3430339
58249 3430339 3506336 3586975 3671003 3759730 3854689 3954735 4058709 4168451 4285927 4410098
58239 4410098 4540041 4678253 4827204 4985538 5151538 5327232 5515099 5714092 5923260
58230 5923260 6145652 6383864 6635481 6898199 7175716 7472887 7789046 8122373 8477076
58221 8477076 8859513 9270895 9710961 10185340 10702111 11264879 11876982 12548850 13293327
58212 13293327 14117618 15027731 16036552 17160061 18412125 19812368 21392071 23182515
58204 23182515 25207695 27503057 30133232 33177469 36711034 40824958 45662172 51425559
58196 51425559 58378343 66878329 77412079 90573397 107018116 127431196 152396209
58189 152396209 182047028 215660142 251532802 287225602 319879487 346437387 364021561
58182 364021561 370674277 366084804 351661705 329856300 303314577 274389942 245003705
58175 245003705 216595612 190109653 166091106 144831293 126431421 110813279 97785594
58168 97785594 87142937 78699182 72278055 67747327 65051350 64128199 64761141 66539232
58160 66539232 68950070 71442140 73394387 74148721 73214055 70487932 66268610 61057458
58152 61057458 55349482 49543084 43932487 38711255 33981969 29785635 26129930 22996038
58144 22996038 20338377 18095842 16206919 14615101 13268375 12121584 11139056 10292389
58136 10292389 9556730 8910274 8335313 7817901 7346917 6913671 6511542 6135860 5784466
58127 5784466 5457598 5156116 4880110 4629275 4403156 4200134 4017340 3852298 3703275
58118 3703275 3567325 3439668 3316151 3195049 3075827 2957910 2841776 2729571 2623138
58109 2623138 2522442 2426840 2336578 2252030 2172805 2098675 2030250 1967787 1910437 1857512 1809264
58098 1809264 1765588 1725152 1686750 1650408 1616320 1583757 1551849 1520488 1489691 1459074 1428636
58087 1428636 1399137 1371074 1344211 1318530 1294574 1272250 1250402 1228154 1205708 1183360 1160802
58076 1160802 1137998 1115692 1094428 1073926 1053849 1034212 1014663 994450 973590 953090 933503
58065 933503 914277 895005 876262 858647 841923 825604 809575 793709 777741 761900 746771
58054 746771 732240 717503 702448 688046 675106 663664 653933 646683 642069 638964 636008 632651 628960
58041 628960 625228 621996 619508 616887 612793 607147 601268 596161 591665 587330 582916 577798 571229 563585
58027 563585 556094 548965 541096 532089 523102 514946 506677 497066 486391 475852 466026 456805 448137 439958
58013 439958 431928 423869 416035 408572 401361 394675 389208 385111 381849 379343 378263 378755 379835 380586 381066
57998 381066 381572 381994 382498 383815 386154 388640 390541 392208 394155 396083 397582 398974 400630 402116 402838
57983 402838 402963 402925 402577 401571 400139 398812 397746 396854 396202 395785 395298 394590 393894 393368 392934 392765 393203 393956
57965 393956 394245 394209 395227 398191 402209 405722 408283 410559 413150 416082 418983 421114 421652 420415 417928
57950 417928 414498 409865 404102 398132 392810 388157 383954 380333 377254 374149 370804 367967 366401 365952
57936 365952 366222 367577 370644 375204 380303 385270 390141 395373 401468 408420 415232 420491 423854 426360
57922 426360 428963 431427 433110 433968 434098 433011 430230 426167 421642 416910 411833 406652 401895 397706 393806
57907 393806 389926 385903 381592 376961 372040 366664 360663 354317 348013 341452 334084 326452 320010 315207
57893 315207 310787 305559 299865 294642 289973 285461 281296 278098 276206 275680 276381 277607 278439 279010 280487
57878 280487 283218 285906 287345 287899 288322 288215 286778 284211 281162 277571 273246 268874 265225 261979 258527
57863 258527 255287 253010 251469 250145 249510 250167 251317 251735 251889 253384 256530 260163 263937 269024 276168
57848 276168 284462 292603 300168 307244 313854 320274 327050 334293 341567 348552 355058 360408 363779 365301
57834 365301 365907 365942 364877 362499 359397 355945 351827 346957 342032 337664 333662 329619 325607 321932 318694
57819 318694 315880 313444 311098 308554 306103 304411 303609 303125 302500 301766 300952 299830 298292 296415 294085
57804 294085 291221 288436 286751 286458 286863 287305 287705 287968 287607 286354 284539 282592 280685 279116 278404 278608
57788 278608 279058 279123 278849 278530 278132 277524 276931 276728 276996 277531 278181 278937 279824 280842 282000 283359 285048 287098
57770 287098 289188 290896 292395 294425 297159 299490 300068 298771 296572 294213 291691 288869 285732 282064
57756 282064 277545 272220 266351 259920 252961 246288 241026 237265 233897 229965 225585 221379 217627 214244
57742 214244 211118 208291 206063 204896 204791 204944 204537 203679 202932 202150 200636 198381 196260 194908 194220 194038
57726 194038 194499 195500 196587 197603 198791 200147 201442 203019 205685 209503 213401 216256 217742 217981 217187
57711 217187 215887 214679 213437 211532 209145 207446 207036 207068 206479 205378 204561 204373 204774 205953 208130 211048
57695 211048 214283 217779 221537 225108 227894 229738 230745 230774 229590 227421 225005 223106 222060 221631 221264
57680 221264 220827 221140 223434 228209 235042 243556 254099 267520 284874 307589 337328 375475 423148
57667 423148 481481 550775 628766 710197 788196 855505 904748 929565 927293 900466 855005 797158
57655 797158 732261 665174 600235 540437 487201 440890 401160 367115 337809 312738 291652
57644 291652 274111 259583 247715 238190 230482 224054 218588 213813 209430 205420 202091 199490 197221
57631 197221 195163 193929 194089 195209 196123 196031 194952 193349 191677 190195 188888 187569 186191 184930 183901
57616 183901 182996 182037 180888 179448 177828 176412 175355 174181 172447 170648 169729 169739 169831 169639 169684 170159 170349
57599 170349 169731 168722 167810 166829 165753 165259 165653 165966 165124 163493 162295 161883 161523 160642 159432 158300 157471
57582 157471 157092 157084 156918 155997 154256 152038 149565 146822 143805 140562 137221 134134 131592 129199 126120 122272
57566 122272 118693 116317 115022 114306 114130 114404 114371 113407 112000 111044 110599 110177 109882 110334 111608 113095 114367
57549 114367 115501 116617 117746 119029 120523 121911 122903 123720 124702 125798 126876 128107 129398 129897 128873
57534 128873 126769 124628 122769 120831 118817 117169 115962 114892 113920 113189 112450 111442 110609 110567 111029 111245
57518 111245 111367 112275 113985 115449 116186 116976 118432 119913 120615 120973 122112 124257 126445 127675 127810 127344
57502 127344 126727 126049 125231 124347 123649 123289 123151 123027 122766 122144 120901 119171 117603 116827 117005 117999 119553
57485 119553 121061 121740 121439 120829 120329 119506 118029 116557 115788 115209 113779 111538 109424 107693 105612 102812
57469 102812 99949 97819 96534 95813 95444 95256 95021 94497 93343 91294 88769 86834 85911 85036 83226 81037
57453 81037 79698 79152 78266 76764 75517 74834 73883 72214 70594 69815 69723 69929 70551 71718 73184 74951 77458
57436 77458 80612 83410 85120 86124 87038 87686 87573 86827 85985 85234 84461 83689 83016 82378 81767 81428 81560 82079
57418 82079 82828 83602 83912 83278 81998 81066 81040 81486 81792 81990 82477 83414 84642 85750 86032 84934 82877 81101
57400 81101 80424 80574 80889 81090 81153 81074 81135 81791 82925 83719 83667 83206 83022 83280 83880 84939 86583 88705 91254
57381 91254 94294 97464 99943 101351 102249 103351 104724 106043 107101 107701 107569 106789 105839 104849 103382 101300
57365 101300 99320 98205 97943 98088 98339 98355 97666 96415 95658 96260 97872 99575 101070 102611 104178 105471
57349 105471 106497 107482 108354 108870 109152 109603 110428 111546 112838 114100 115039 115630 116234 117047 117815 118372 119049
57332 119049 120100 121164 121843 122405 123364 124626 125628 126119 126303 126434 126744 127592 129158 131123 133056 134939
57316 134939 136968 139099 141241 143617 146437 149425 152218 155050 158501 162563 166455 169442 171524 173303
57302 173303 175479 178443 182098 186007 189845 193633 197537 201608 205786 209949 213953 217894 222281 227519
57288 227519 233223 238581 243480 248652 254575 260988 267732 275252 283754 292628 301432 310882 322051 334951
57274 334951 348596 362216 375829 389810 404520 420177 436637 453403 470250 487595 505977
57263 505977 525449 545779 566817 588392 610403 633402 658426 685636 713686 741123 767983
57252 767983 795399 824232 854900 888011 924051 962572 1002573 1043632 1085938 1129347 1173202
57241 1173202 1217108 1261139 1305186 1348619 1390628 1430469 1467455 1501108 1531195 1557359 1579198
57230 1579198 1597230 1613259 1628969 1644447 1658811 1671948 1684723 1697790 1711280 1725539 1741018
57219 1741018 1757318 1773417 1789229 1806000 1824774 1845206 1866389 1888167 1911019 1935091 1959942
57208 1959942 1985047 2010137 2035141 2060146 2085445 2111459 2138494 2166568 2195511 2225387 2256706
57197 2256706 2289910 2324629 2360028 2396000 2433333 2472267 2511592 2549881 2587004 2623501 2658931
57186 2658931 2692017 2722409 2751291 2780009 2808875 2837549 2865908 2894179 2922704 2951911 2982254
57175 2982254 3014027 3047388 3082415 3118917 3156346 3194236 3232456 3270668 3307904 3343303 3377002
57164 3377002 3409671 3441405 3471725 3500440 3527793 3553869 3578622 3602323 3625170 3646491 3665197
57153 3665197 3681138 3695251 3708157 3719267 3727420 3731802 3732000 3727698 3718569 3704171 3683947 3657836
57141 3657836 3626965 3593396 3559228 3526166 3495569 3468188 3444047 3423255 3406889 3396466 3392673
57130 3392673 3395263 3404076 3419316 3440731 3467088 3496562 3527165 3557007 3584742 3609695 3631194 3648247
57118 3648247 3660643 3669979 3678798 3689076 3702434 3721170 3747701 3783148 3827841 3883171 3951636 4035034
57106 4035034 4134170 4250886 4389505 4556145 4757880 5002963 5301181 5664169 6106601 6647104
57096 6647104 7306911 8108049 9074578 10235438 11623698 13271621 15206071 17445339 19993970
57087 19993970 22836511 25936604 29242661 32693953 36225372 39776141 43298809 46751162
57079 46751162 50065332 53120513 55753890 57809135 59183457 59839777 59788773 59067737 57730942
57070 57730942 55846276 53490601 50745071 47694099 44426728 41036218 37615885 34252248
57062 34252248 31018000 27967339 25135125 22539238 20184314 18065384 16170992 14485740
57054 14485740 12992196 11672185 10507522 9480386 8573827 7772548 7063455 6435409 5878602
57045 5878602 5384334 4945173 4554820 4207648 3898569 3623311 3378400 3160560 2966224
57036 2966224 2791802 2634432 2492345 2364439 2249521 2146062 2052717 1968762 1893676 1826340
57026 1826340 1765110 1708711 1656620 1608481 1563807 1522610 1485761 1454060 1427209 1404396 1385824
57015 1385824 1373246 1369181 1376234 1397338 1436106 1496713 1583534 1700490 1849372 2027479 2226280
57004 2226280 2432268 2628933 2798244 2921890 2984122 2976467 2901442 2771809 2605514 2420029
56994 2420029 2229501 2044478 1872215 1716846 1580130 1462609 1364031 1282973 1216872 1162895
56984 1162895 1118692 1082379 1052180 1026135 1001836 976545 948203 916486 882552 847700 812742
56973 812742 778480 745909 715629 687731 662574 641058 623737 610232 600005 593198 590297 591482
56961 591482 596847 606764 621334 639620 659857 680250 699166 714846 725502 729857 727599 719561
56949 719561 707487 693115 677218 659933 642117 625633 611830 600382 590236 581253 574213 569707
56937 569707 567872 569134 574374 584186 598363 616079 636108 656727 675641 690130 697414 695393 683524
56924 683524 663043 636207 605425 572916 540486 509195 479559 452276 428258 407724 389853
56913 389853 373787 359492 347220 336688 327348 318979 311434 304310 297555 291943 288169 285726 283424
56900 283424 280808 278409 276808 276237 276951 279300 283361 288974 296067 304503 313915 324333 336740 352199
56886 352199 370360 389371 407135 422125 433111 439060 439611 435225 426716 415027 401458 387574
56874 387574 374669 363520 354559 347988 343916 342874 346027 354399 368032 386530 410359 440917 479096
56861 479096 524235 574427 627119 678966 725592 762264 785289 793208 787011 769325 743271 711927
56849 711927 678470 645917 616205 589908 567341 549702 538665 535256 539812 552895 575607 609114
56837 609114 654335 711847 781161 859753 942999 1024897 1098509 1156394 1192119 1202393 1187804
56826 1187804 1151747 1099076 1035479 966777 897761 831557 770173 715346 668702 631415 604027
56815 604027 586606 579057 581472 594190 617479 651206 694791 747023 805379 865478 921421 966778
56803 966778 995696 1004227 991722 961014 916765 863501 805146 745524 688157 635408 588365 547592
56791 547592 513554 486387 465905 452039 444954 444766 451476 465072 485210 510700 539556 569453
56779 569453 597798 621537 637451 642917 636506 618354 590457 556306 519553 482749 447258 413840
56767 413840 382825 354137 327789 304242 283925 266716 252329 240745 231667 223966 216451 208931
56755 208931 201888 195475 189575 184480 180539 177325 174018 170570 167648 165543 163980 162876 162323 161855 160685
56740 160685 158770 156814 155151 153531 152039 151247 151199 151155 150689 150256 150377 150972 151790 152815 153964 155025 156086
56723 156086 157399 158691 159371 159542 160020 161125 162352 163453 164891 166716 167992 168114 168000 169048 171292
56708 171292 173282 173671 172383 170390 168745 167752 166875 165524 163888 162682 162148 161869 161610 161677 162139 162298 161403
56691 161403 159582 157723 156610 156352 156425 156101 155033 153460 151798 150253 149092 148860 149752 151048 151868 152264
56675 152264 152822 153464 153591 153329 153569 154672 156094 157427 158793 159992 160317 159680 158984 158915 159183 159405 159862
56658 159862 160807 161821 162468 162923 163384 163558 163376 163604 164995 167224 169283 170608 171364 172031 173167 175213
56642 175213 178046 180955 183347 185242 186916 188487 190058 191794 193637 195383 197123 199089 201008 202238
56628 202238 202669 202771 202647 201881 200557 199543 199400 199809 200331 200852 200984 200143 198729 198192 199150 200433 200653
56611 200653 199815 198605 197179 195713 195184 196238 197792 198055 196655 194705 193094 191864 191091 191146 191915 192649
56595 192649 192863 192709 192356 191547 190014 188003 186257 185641 186543 188399 190032 190769 191018 191524 192435 193454 194429
56578 194429 195348 196090 196681 197545 199070 201109 203202 205019 206429 207551 208945 211242 214333 217527 220767
56563 220767 225017 231051 238692 247735 258734 272052 286814 301668 316037 329766 342101 352081
56551 352081 359682 365677 370599 374656 378432 382698 387460 391913 395364 397647 398753 398706 397796 396376 394355
56536 394355 391291 386998 381732 375921 369951 364004 357852 351094 343852 336847 330480 324285 317658 310650
56522 310650 303654 296803 290183 284117 278758 273831 269246 265393 262333 259305 255660 251755 248239 245037
56508 245037 241739 238522 235898 233937 232378 231044 229541 227151 223827 220716 218822 217734 216578 215612
56494 215612 215654 216377 216520 215677 214676 214202 214156 214433 215186 216109 216467 216204 216211 217128 218485 219312 219077 217890 216322
56475 216322 215237 215327 216539 218183 219576 220365 220416 219830 218982 218232 217696 217572 218291 219922 221803 223247 224267
56458 224267 225083 225387 224815 223809 223225 223251 223407 223478 223724 224235 224734 225028 225189 225381 225869 226983 228691 230498
56440 230498 232183 234185 236747 239172 240549 240835 240603 240206 239916 240371 241948 243955 245254 245534 245330 245104
56424 245104 245006 245206 245728 246237 246636 247459 249035 250737 251858 252618 253467 253965 253465 252388 251639 251185 250426 249643
56406 249643 249739 250670 251481 251855 252394 253296 253981 254208 254419 254743 254704 254177 253674 253463 253269 253104 253516 254738 256298
56387 256298 257698 258860 259803 260546 261364 262491 263630 264395 265093 266280 267758 268964 270159 272176 274934
56372 274934 277264 278397 278735 278963 279279 279667 280111 280331 280026 279481 279221 279046 278247 276864 275896 276073 277106
56355 277106 278269 279099 279459 279570 279954 280731 281122 280352 278861 277797 277480 277268 276784 276322 276111 276129 276623 277870
56337 277870 279423 280523 281265 282462 284367 286479 288560 290867 293375 295811 298501 302152 306636 310991
56323 310991 314766 318454 322362 325971 328720 330722 332506 334544 337012 339455 340943 341209 341306 342385 344299
56308 344299 346327 348672 351928 355487 357958 359111 360025 361384 362985 364939 367860 371633 375272 378265
56294 378265 381010 383781 386399 389009 392078 395499 398775 402046 405822 409824 413329 416601 420608 425396
56280 425396 430061 434338 438859 443896 449248 455227 462219 469379 475515 481218 488281 496892 505366 512947
56266 512947 520856 530087 540201 550978 563299 577479 592553 608279 626226 647766 672441 699411
56254 699411 729223 763021 801170 843753 891467 945049 1004588 1070142 1142144 1220553 1304505
56243 1304505 1393298 1486791 1584371 1684477 1785449 1885668 1982496 2072373 2152505 2221371 2277347
56232 2277347 2318329 2343300 2352926 2347996 2328570 2295214 2249831 2194594 2131124 2061057 1986163 1907524
56220 1907524 1825886 1743096 1661804 1583486 1508197 1436386 1369146 1306386 1246680 1189572 1136239
56209 1136239 1087343 1042097 1000005 961594 926684 893908 862753 834175 808414 784216 761177
56198 761177 740763 723872 709358 696075 684394 674534 665428 656619 649272 643870 638806 632837 627086
56185 627086 622947 619742 616216 612783 610492 609033 607451 605664 603909 601857 599561 597966 597307 596433 594854
56170 594854 593881 594478 595691 596524 597622 599638 601657 602883 604292 607036 610681 614510 618954 624263 629424
56155 629424 633949 639081 645685 652690 659185 666194 674658 683662 692593 703112 716737 732261 747935
56142 747935 764685 784735 808274 833856 861126 891141 925076 964483 1011721 1068252 1133624
56131 1133624 1207672 1292190 1388430 1494259 1605486 1718536 1830089 1935998 2033040 2120630
56121 2120630 2199109 2267930 2327350 2379817 2427095 2467361 2497412 2516381 2525248 2524529 2514991 2499090
56109 2499090 2478944 2453831 2421675 2381474 2332132 2270814 2195478 2107969 2012366 1911600 1807919
56098 1807919 1704893 1606155 1513297 1427301 1350492 1284624 1228580 1180508 1140781 1110441 1088412
56087 1088412 1072794 1063148 1059011 1058100 1058800 1062414 1070077 1079507 1087999 1096540 1107584 1120673 1133806
56074 1133806 1147289 1162474 1178299 1192883 1207071 1222758 1239188 1254563 1269758 1286639 1304174
56063 1304174 1320041 1334642 1349621 1363886 1375129 1383901 1392177 1399330 1403738 1407008 1412278 1419511 1426670
56050 1426670 1434276 1444418 1456447 1468092 1479796 1493634 1509124 1524533 1541074 1561197 1583922
56039 1583922 1606437 1629042 1653828 1679904 1705013 1730586 1759972 1792768 1826149 1860678 1899399
56028 1899399 1942138 1986196 2031765 2081174 2133635 2186384 2240156 2297918 2359067 2420614 2483066
56017 2483066 2549184 2617940 2685912 2753773 2825109 2899782 2974931 3051619 3133720 3221065 3310595
56006 3310595 3403394 3503389 3609839 3718542 3829868 3948169 4073911 4204153 4340148 4486498
55996 4486498 4643308 4807346 4980289 5167360 5368432 5579212 5800576 6037698 6290797
55987 6290797 6556310 6836353 7136892 7457347 7792789 8146006 8526372 8937281 9376311
55978 9376311 9847375 10360604 10920605 11527662 12190426 12924465 13738644 14636222 15628434
55969 15628434 16733403 17964951 19339221 20889251 22654548 24660756 26932900 29526947
55961 29526947 32525218 36006619 40055572 44807071 50462713 57279043 65594754 75885586
55953 75885586 88762113 104915908 125090084 150002242 180037334 214776908 252744724
55946 252744724 291578390 328363090 359837877 382677613 394212837 393363383 381038133
55939 381038133 359629063 332058654 301069539 268945708 237433800 207719064 180500413
55932 180500413 156143051 134781867 116347125 100606014 87251454 75966689 66436824
55925 66436824 58361125 51486540 45617679 40591902 36265593 32526206 29292044 26489691
55917 26489691 24045664 21901716 20019328 18363326 16895470 15586964 14421594 13381903
55909 13381903 12445169 11595944 10829247 10137667 9507200 8928823 8402438 7925764 7489737
55900 7489737 7087810 6719704 6383129 6071204 5780645 5513480 5268402 5039177 4823550
55891 4823550 4625066 4444104 4275648 4117854 3974443 3846488 3729989 3623776 3531989 3456618
55881 3456618 3395216 3348130 3320585 3315332 3330227 3364784 3421393 3497224 3581621 3663989 3737897
55870 3737897 3795519 3825535 3820507 3781300 3711982 3615880 3498700 3369363 3234423 3095895 2956076
55859 2956076 2819171 2686408 2555146 2425203 2301051 2185836 2078365 1977924 1886695 1805047
55849 1805047 1729526 1658027 1592335 1533378 1478768 1427362 1381526 1342349 1307023 1273401 1242836
55838 1242836 1216068 1190562 1164514 1139531 1116903 1095057 1073039 1052660 1034774 1017135 998259
55827 998259 979793 962827 945499 926646 908196 891500 874742 856402 837945 820652 803044
55816 803044 783987 765251 748513 732741 716942 702728 691791 683494 677100 673738 674082 676765 681083
55803 681083 688533 699610 711804 722780 732822 742140 748705 751067 750563 748412 743201 733659 721412
55790 721412 708665 695450 681580 668994 659656 652965 647441 643116 640265 637709 634286 630088 624613
55777 624613 615950 603693 590383 578180 566425 554459 544248 537761 533983 531061 529297 529369 529473
55764 529473 526985 521575 514243 504800 492761 479436 466673 454566 442441 430940 421042 412244 403756
55751 403756 396372 391155 387363 383594 379913 376963 374074 370170 365648 361575 357879 353954 350179 347300
55737 347300 345221 343736 343366 344059 344210 342506 339657 337000 334534 331702 328808 326182 323083 318911 314375
55722 314375 310145 305593 300185 294743 289999 285344 280485 276805 275433 275374 275199 275234 276343 277954 279151
55707 279151 280493 282889 285779 288192 290446 292981 294596 293749 290649 286332 280708 273345 265215 257761
55693 257761 251015 244324 238035 232757 227899 222741 218124 215296 213843 212444 210914 209845 209080 208306 208334
55678 208334 210020 212608 214790 216602 218602 220011 219560 217451 214731 211499 207524 203861 201841 201021 200027
55663 200027 198906 198761 199607 200569 201827 204393 208210 212357 216936 222944 230320 237741 244230 249487 252946
55648 252946 254199 254123 253916 253207 250729 246693 242748 239609 236348 232123 227156 221954 216955 212913 210259
55633 210259 208074 205019 201229 197986 195720 193777 192024 191107 190948 190449 188973 186992 185111 183494 182287
55618 182287 181440 180122 177451 173897 170907 169187 168349 168057 168384 169018 169281 169009 168472 167509 165745 163535
55602 163535 161644 160123 158494 156905 155941 155425 154526 153104 151915 151466 151603 152170 153116 154015 154350 154219 154026
55585 154026 153739 153221 152869 152969 152863 151854 150517 149989 150305 150666 150980 151813 153104 154310 155811 158798 163677
55568 163677 169738 176405 183694 191437 199115 206512 213498 219216 222516 223219 222057 219529 215792 211401
55554 211401 207022 202539 197495 192185 187268 182620 177818 173427 170395 168379 166121 163406 161141 159505
55540 159505 157613 155222 153233 152089 151093 149796 148776 148499 148476 148097 147310 146078 144126 141681 139516 137861
55524 137861 136114 134036 132360 131740 131811 131718 130991 129646 128051 126943 126941 127766 128398 128135 127038 125439 123601
55507 123601 121807 120180 118487 116671 115291 114839 114902 114750 114454 114609 115312 116245 117348 118442 118644 117327
55491 117327 115357 114196 114045 114013 113766 113660 113534 112869 112084 112186 113073 113611 113470 113488 114071 114711 115271 116284
55473 116284 117585 118087 117413 116497 116081 115789 115103 114143 113061 111806 110861 111060 112233 113115 113028 112599 112442 112283
55455 112283 111837 111465 111431 111511 111715 112371 113125 112979 111790 110669 110466 110916 111635 112710 113828 114113 113505 113209
55437 113209 114052 115429 116539 117530 118659 119381 119107 118085 116820 115438 114283 114171 115360 117051 118597
55422 118597 120287 122271 123711 123919 123559 123755 124593 125341 125618 125627 125686 126114 127115 128332 129057 129246 129582 130187
55404 130187 130182 129084 127680 126885 126590 126305 126037 125743 124785 122855 120754 119380 118579 117797 117187 117131 117247 116847
55386 116847 115977 115169 114541 113921 113467 113387 113353 112876 112002 111056 110117 109250 108856 109163 109768 110229 110711 111493 112331
55367 112331 112878 113275 113719 113906 113509 112805 112239 111773 111214 110691 110240 109397 107873 106257 105364 105251 105502 106098
55349 106098 107303 108902 110241 110947 111183 111271 111403 111537 111380 110724 109886 109382 109120 108581 107907 107976 109027 110134
55331 110134 110602 111020 112196 113740 114596 114467 113963 113668 113690 113829 113694 113018 112235 112227 113114 113919 113906 113535 113546 113885
55311 113885 114165 114500 115096 115667 116018 116548 117397 117751 116894 115371 114179 113386 112547 111946 112264 113255 113860 113529
55293 113529 112596 111556 110759 110574 110999 111293 110777 109757 108859 107875 106253 104479 103809 104619 106081 107566 109366
55276 109366 111705 113922 115134 115249 114983 115174 116207 117859 119597 121088 122205 122465 121120 118362 115916
55261 115916 115636 117665 120549 122847 123984 123854 122585 120766 119255 118516 118465 118820 119237 119362 119206 119267 119819
55244 119819 120456 120781 121088 121669 121931 121126 119652 118717 118795 119276 119487 119203 118249 116540 114663 113540 113286 113129
55226 113129 112629 112293 112735 113877 115247 116490 117378 117783 117913 118171 118586 118748 118443 117996 117827 117959 118112 118087
55208 118087 118008 118283 119206 120413 120998 120530 119719 119635 120392 121077 120881 119857 118657 117936 117979 118522 118918 118721 118078
55189 118078 117390 116865 116652 116993 117834 118526 118394 117397 115928 114316 112927 112299 112540 112918 112638 111812 111089 110667
55171 110667 110321 110103 110265 110668 110974 111325 112161 113461 114783 115962 117109 118047 118468 118611 119131 120276 121754
55154 121754 123342 125004 126425 127111 127018 126561 125987 125281 124667 124596 125086 125598 125679 125417 125232 125516 126365 127365
55136 127365 127792 127347 126429 125357 123814 121563 119227 117600 116549 115461 114484 114400 115356 116587 117390 117614
55120 117614 117217 116163 114818 113761 113111 112633 112433 112893 113984 115307 116743 118362 119873 120928 121847 123229
55104 123229 124939 126366 127534 128960 130449 131116 130760 130165 129801 129238 128177 127127 126648 126761 127413 128740
55088 128740 130486 132001 133180 134651 136651 138479 139477 139816 139884 139684 139309 139276 139734 139972 139294 137940 136635
55071 136635 135747 135322 135413 135810 135854 135114 133978 133153 132840 132740 132554 132126 131349 130278 129111 127912 126614 125391
55053 125391 124659 124609 125094 125938 126869 127263 126674 125697 125450 126022 126274 125492 124361 123805 123748 123691 123803 124593 125909
55034 125909 127029 127539 127612 127595 127727 128028 128190 127887 127430 127638 128746 129973 130529 130477 130146 129339 127808 126047
55016 126047 124858 124361 124098 123930 124207 125129 126450 127738 128575 128632 127953 127072 126571 126608 127076 127946 129125 130249
54998 130249 131003 131496 132045 132823 133911 135330 136694 137168 136308 134754 133713 133826 134854 136184 137259 137697
54982 137697 137487 137142 137299 138057 138857 139057 138563 137936 137854 138393 138942 138989 138824 139064 139692 140088 139983 139698 139390
54963 139390 138832 138238 138514 140180 142564 144642 146172 147466 148414 148478 147542 146230 145392 145501 146449 147700 148777
54946 148777 149716 150731 151459 151123 149742 148559 148659 149623 150143 149695 148995 148988 149976 151674 153580 155268 156692
54929 156692 158292 160656 164189 169199 175929 184125 192842 201114 208704 215867 222533 228160 232272 234799
54915 234799 235868 235515 233641 230101 224892 218397 211320 204311 197742 191868 186905 182776 179067 175435
54901 175435 171912 168728 166045 163911 162222 160676 159066 157670 156999 157161 157805 158654 159590 160331 160771 161718
54885 161718 164441 169108 174425 179270 184006 189673 196600 204433 212889 221640 229766 236142 240242 242103
54871 242103 241760 239292 235173 230003 223978 217047 209423 201539 193717 186201 179319 173270 168036 163747
54857 163747 160735 158882 157412 155802 154469 154038 154290 154409 153890 152695 150829 148413 145957 143954 142336
54842 142336 140727 139037 137393 135819 134421 133533 133203 132920 132329 131830 131942 132531 133244 134189 135485 136596
54826 136596 136960 136949 137361 138160 138560 138206 137478 136724 135982 135360 135007 134730 134329 134149 134642 135510 135997 135931 135772
54807 135772 135837 136167 136942 138175 139169 139204 138697 138764 139662 140635 141245 141832 142566 143130 143570 144416 145572 146113 145663
54788 145663 145054 145056 145294 145089 144671 144797 145635 146689 147575 148402 149638 151889 155393 159428 162726 164902 167086
54771 167086 170731 176205 182989 190786 199775 209885 220333 229907 237537 242763 245916 247656 248142 246862
54757 246862 243456 238441 232850 227361 221948 216236 210007 203444 197028 191100 185625 180507 176029 172648
54743 172648 170491 169442 169504 170502 171565 171753 171423 172135 174725 178096 180458 181289 181565 182445 184419 187539
54727 187539 191825 197252 203638 210612 217615 224035 229527 234139 238056 241346 243879 245145 244089 239699
54713 239699 232110 222947 214225 206986 201063 195827 190875 186168 181782 177574 173161 168469 164232 161501
54699 161501 160538 160502 160355 159663 158425 156719 154865 153458 152724 152105 150929 149270 147768 146816 146311 146068 146011
54682 146011 146068 146206 146561 147186 147730 147698 147100 146577 146798 147833 149090 149781 149487 148430 147169 146024 144879
54665 144879 143538 142084 140845 140206 140490 141695 143170 143907 143463 142429 141673 141327 140859 140046 139420 139631 140671
54648 140671 141919 142842 143437 144036 144799 145564 146141 146571 146918 146963 146390 145344 144504 144467 145166 146027 146569 146712 146596
54629 146596 146320 145916 145504 145319 145457 145605 145237 144201 142945 142051 141716 141875 142525 143593 144666 145324 145668
54612 145668 146105 146638 146807 146438 145933 145733 145910 146453 147462 148756 149739 150026 149936 149979 150064 149691 148815 148064 148022
54593 148022 148569 149125 149359 149432 149557 149549 149009 147911 146735 145925 145398 144737 143691 142308 140782 139377 138299
54576 138299 137390 136196 134709 133734 134056 135426 136869 137853 138547 139055 139185 139107 139502 140746 142475 144203 145836
54559 145836 147285 148161 148315 148209 148344 148640 148755 148586 148015 146606 144163 141460 139784 139778 141058 142879 144752
54542 144752 146420 147713 148634 149409 150229 151018 151474 151426 151189 151450 152587 154118 155120 155302 155309 155833 156683 157023
54524 157023 156380 155173 154271 154149 154506 154669 154365 153944 153768 153702 153485 153319 153517 153784 153567 153115 153359 154471
54506 154471 155233 154371 152070 149733 148585 148880 150065 151207 151497 150832 149958 149793 150696 152344 154036 155009
54490 155009 154902 154165 153682 153846 154377 155096 156202 157546 158345 158201 157804 157994 158581 158806 158545 158351 158567 159117
54472 159117 159977 161079 161874 161769 161037 160588 160759 160972 160702 160164 159743 159307 158481 157274 156091 155246 154699 154097
54454 154097 153017 151354 149650 148856 149548 151365 153282 154414 154599 154272 153918 153745 153865 154523 155804 157194
54438 157194 157888 157647 157073 156887 157276 158058 159024 159834 159993 159364 158436 157746 157295 156820 156343 156061 155950 155914 156098
54419 156098 156657 157405 158117 158999 160396 162165 163745 164765 165205 165074 164342 163164 161825 160495 159281 158384
54403 158384 157973 158056 158734 160337 162950 166037 168879 171214 173154 174798 176288 177871 179394 180132 179620 178403
54387 178403 177350 176595 175808 175135 174997 175156 174909 174235 173848 174011 174121 173646 172711 171583 170315 169130 168418
54370 168418 168026 167256 165909 164676 164151 164131 164249 164642 165487 166443 167141 167755 168524 169169 169338 169301 169630 170459 171551
54351 171551 172785 174006 174667 174288 173175 172140 171528 171050 170505 170105 169991 169870 169302 168057 166182 164024
54335 164024 162242 161455 161754 162743 164072 165711 167723 170094 172862 176070 179482 182588 185094 187218 189337
54320 189337 191506 193465 194929 195671 195489 194362 192719 191254 190358 189736 188610 186322 182870 179006 175769
54305 175769 173666 172214 170458 168023 165526 163810 162949 162245 161114 159705 158694 158661 159678 161243 162589
54290 162589 163259 163441 163603 163889 164162 164488 165104 165832 166067 165648 165259 165609 166527 167287 167574 167682 167937 168402 169071
54271 169071 169920 170767 171399 171805 172047 171951 171322 170367 169606 169345 169534 170085 171006 172190 173398 174509 175534 176367
54253 176367 176776 176699 176345 175988 175787 175782 175853 175735 175304 174801 174595 174738 174928 174830 174333 173615 173036 172738 172224 170765
54233 170765 168481 166568 166037 166605 167332 167887 168507 169112 169343 169300 169303 168979 167574 165342 163624 163270 163795 164495
54215 164495 165423 166692 167692 167842 167564 167642 167940 167664 166719 165951 165945 166276 166223 165743 165378 165385 165314 164564 163264 162423
54195 162423 162962 164687 166506 167658 168291 168807 169168 169208 169135 169214 169239 168863 168336 168327 169007 169758 169925 169493 168869 168320
54175 168320 167856 167507 167448 167823 168569 169411 170029 170263 170193 170096 170275 170851 171601 172015 171616 170345 168617 167027 165965
54156 165965 165415 165034 164508 163921 163708 164132 164889 165328 164977 163829 162331 161252 161226 162135 163090 163345 163054 162819
54138 162819 162802 162765 162796 163284 164150 164753 164756 164621 164999 166023 167363 168617 169463 169790 169846 170017 170352 170631 170837 171113
54118 171113 171276 170965 170398 170302 170825 171189 170870 170508 171059 172434 173629 173983 173790 173813 174563 175904 177014 176944
54100 176944 175564 173755 172381 171447 170655 170319 170992 172378 173431 173662 173682 174196 174982 175222 174548 173342 172175
54083 172175 171289 170703 170549 171076 172280 173730 174880 175541 175947 176409 177049 177785 178406 178714 178820 179194 180144 181327
54065 181327 182118 182386 182487 182597 182602 182712 183517 185145 186886 187998 188435 188493 188220 187635 187149 187290 188214 189789
54047 189789 191877 194232 196420 198208 199731 201063 202041 202812 204035 206099 208557 210801 212842 214952 217108
54032 217108 219424 222649 227398 233205 239138 245058 251359 257691 263075 267393 271746 277004 282802 288393
54018 288393 293739 299270 305128 311272 318009 325837 334786 344225 353326 361525 368502 373806 376603 376087
54004 376087 372345 366541 359890 352630 344369 335199 325853 316849 308122 299643 291797 284970 279195 274372
53990 274372 270412 267009 263755 260681 258234 256491 254838 252644 249851 246616 242948 239108 235933 234122
53976 234122 233379 232771 231839 230878 230183 229504 228422 226909 225274 223780 222461 221301 220402 219926 219924 220264 220740
53959 220740 221247 221782 222300 222605 222425 221614 220386 219347 219204 220313 222540 225524 228899 232271 235298 238039
53943 238039 240964 244319 247632 250202 251961 253526 255457 257811 260378 263016 265702 268544 271781 275467
53929 275467 279103 281875 283366 283865 283986 284258 284999 286249 287726 289157 290702 292744 295237 297649 299734
53914 299734 302007 305217 309560 314631 319989 325548 331504 338043 345126 352585 360432 368909 377977 386872
53900 386872 394548 400508 404925 408001 409754 410463 410762 410951 410683 409706 408544 407927 407779 407223 405515 402601
53884 402601 398819 394539 390210 386282 382790 379166 374733 369345 363400 357321 351288 345520 340440 336275
53870 336275 332642 328980 325394 322617 320909 319456 317287 314489 311944 310013 308080 305515 302573 300137
53856 300137 298907 299090 300545 302934 305897 309397 313890 320017 328105 337879 348497 358812 367784 374682
53842 374682 378836 379385 375637 367818 357142 345038 332482 320077 308367 297757 288317 279967 272786
53829 272786 266919 262197 258066 254028 250090 246691 244186 242497 241350 240626 240176 239407 237700 235401 233813
53814 233813 233705 234267 234096 232832 231155 229548 228026 226955 227047 228233 229459 230006 230310 231064 232264 233704
53798 233704 235777 239041 243357 248104 252978 258005 263075 268091 273387 279388 285883 292107 297476 301833
53784 301833 305161 307564 309413 310990 312036 312181 311774 311684 312199 312649 312310 311181 309651 307886 305883 303763
53768 303763 301550 298895 295468 291602 288124 285461 283221 280750 277822 274577 271030 267023 262677 258471
53754 258471 254770 251519 248620 246304 244808 243859 242831 241367 239492 237249 234688 232231 230527 229692 229091
53739 229091 228087 226754 225622 225059 225092 225543 226056 226300 226338 226548 226942 226947 226204 225264 224990 225502 226121 226241 225883
53720 225883 225484 225574 226578 228515 230849 232865 234187 234798 234813 234554 234564 235042 235350 234603 232772 230809 229692
53703 229692 229784 231126 233702 237125 240564 243375 245665 247950 250483 253099 255511 257478 258854 259763 260638
53688 260638 261815 263058 263711 263400 262469 261631 261243 260978 260213 258710 256928 255684 255495 256134 256721 256378 255009
53671 255009 253466 252793 253233 254160 254924 255446 255854 255960 255479 254540 253528 252520 251264 249751 248372 247417 246767
53654 246767 246243 245992 246237 246750 246831 245976 244495 243366 243325 244111 244840 245125 245512 246628 248244 249607 250438 251110
53636 251110 251886 252543 252845 252898 252850 252679 252515 252766 253581 254480 254944 255200 256017 257760 259965 261841 262972 263490
53618 263490 263835 264445 265508 266957 268666 270649 272958 275532 278297 281297 284500 287573 290198 292649 295655
53603 295655 299435 303191 305871 307328 308366 309737 311438 313026 314212 314942 315210 315135 315091 315473 316342 317442
53587 317442 318505 319397 320055 320474 320676 320527 319733 318208 316340 314571 312835 310753 308353 306165 304566 303426
53571 303426 302508 301769 301072 300030 298498 296923 295902 295605 295830 296325 296676 296262 294855 293152 292227 292436 293194
53554 293194 293779 293945 293802 293625 293886 295033 296991 299209 301422 304052 307605 311919 316287 320155 323354
53539 323354 325794 327346 328135 328684 329578 331108 333340 336350 340169 344502 348816 352849 356893 361380 366310
53524 366310 371358 376503 382222 388979 396856 405829 416026 427290 438726 449300 459007 469037 480571
53511 480571 493681 507645 522061 537230 553529 570868 588874 607320 626069 644822 663228
53500 663228 681279 699265 717279 734973 751920 768037 783573 798874 814296 830093 846174
53489 846174 862195 878114 894374 911180 927892 943707 958788 974069 989844 1005223 1019268
53478 1019268 1032151 1044819 1057890 1071234 1084338 1096680 1107825 1117464 1125381 1131399 1135557 1138309
53466 1138309 1140147 1140956 1140149 1137504 1133338 1127682 1119986 1110042 1098618 1086608 1074014 1060411 1045966
53453 1045966 1031238 1016224 1000388 983581 966254 948777 931121 913285 895502 877945 860677
53442 860677 843888 827791 812303 797239 782746 769163 756572 745020 734979 726961 720656 715125
53430 715125 709870 705123 701088 697665 695084 694059 694956 697343 700651 704749 709648 715259 721818 729942
53416 729942 739765 750590 761975 774702 789940 807658 826519 845344 864139 883608 904178 925739
53404 925739 948077 971234 995424 1020754 1047263 1075300 1105623 1138764 1174357 1211414 1249332
53393 1249332 1288320 1328880 1371216 1415121 1459960 1504716 1548608 1591852 1635296 1679147 1722594
53382 1722594 1764912 1806227 1846746 1885901 1922932 1957825 1990925 2021951 2050159 2075304 2097668
53371 2097668 2117153 2133135 2145324 2154122 2159881 2162297 2160752 2154805 2144114 2128307 2107336 2081788
53359 2081788 2052586 2020405 1985428 1947471 1906319 1862218 1816205 1769746 1723807 1678435 1633382
53348 1633382 1588968 1545991 1504802 1464800 1425111 1385698 1347463 1311112 1276128 1241222 1205781
53337 1205781 1170476 1136331 1103610 1071939 1041219 1011883 984275 958177 933120 908947 885972
53326 885972 864773 845896 829536 815338 802552 790510 778961 768026 757931 748867 740974 734347
53314 734347 728978 724689 721226 718559 717050 717096 718537 720618 722698 724905 727982 732687 739481 748596 759948
53299 759948 772913 786461 799745 812639 825767 840082 856306 874581 894544 915757 938019
53288 938019 961218 985081 1009256 1033555 1057839 1081682 1104392 1125482 1144992 1163181 1180028
53277 1180028 1195178 1208384 1219824 1229869 1238536 1245254 1249253 1250198 1248411 1244533 1239021 1231996 1223422
53264 1223422 1213321 1201740 1188663 1174116 1158433 1142250 1125921 1108960 1090380 1069708 1047400
53253 1047400 1024067 999747 974356 948533 923361 899282 875839 852520 829276 806160 783120
53242 783120 760425 738666 717909 697395 676549 655845 636131 617435 599068 580701 562720
53231 562720 545594 529472 514360 500166 486530 473124 460229 448591 438559 429749 421649 414116
53219 414116 407119 400386 393696 387278 381572 376667 372171 367551 362447 356726 350462 343941 337594 331784
53205 331784 326569 321753 317218 313239 310279 308389 306924 305004 302210 298779 295232 291954 289045 286476
53191 286476 284348 282967 282407 282046 280946 278863 276505 274488 272413 269473 265758 262383 260295 259405 258922
53176 258922 258165 256943 255531 254432 253965 253934 253883 253656 253513 253670 253960 254006 253593 252860 252234 252045 252088 251775 250929
53157 250929 250180 250202 250812 251254 251093 250289 248618 245887 242765 240556 239835 239872 239660 238896 237671 235957 233892
53140 233892 232059 230909 230312 230110 230554 231569 232176 231534 230285 229927 230909 232227 232925 233114 233261 233385 233434
53123 233434 233816 234840 236031 236600 236425 236054 235876 235743 235430 235035 234854 235092 235773 236751 237833 239045 240657
53106 240657 242670 244384 244825 243687 241591 239366 237434 235925 234873 233982 232603 230484 228332 227091 226750
53091 226750 226453 225798 225368 225670 226200 226114 225422 224830 224572 224111 223078 221823 220771 219787 218589 217439 216917
53074 216917 217217 218057 219170 220378 221239 221160 220081 218703 217731 217131 216445 215665 215367 215952 217107 218174 218792
53057 218792 218989 218872 218517 218085 217727 217393 216993 216734 217041 218036 219348 220510 221254 221268 220097 217712 214995
53040 214995 213196 212845 213447 214210 214720 214863 214475 213351 211513 209285 207113 205288 203753 202204 200500 198876
53024 198876 197645 196804 196230 196093 196659 197680 198485 198847 199303 200297 201421 201944 201793 201488 201304 201091 200872 201005
53006 201005 201515 201780 201306 200522 200386 201307 202775 204061 204911 205476 205820 205775 205190 204245 203474 203474 204446 205945 207155
52987 207155 207633 207718 208098 208942 209647 209512 208465 207060 205924 205437 205788 207001 208846 210952 213123 215350
52971 215350 217442 218874 219237 218716 217876 217049 216136 215035 213978 213331 213184 213339 213646 214164 214955 215793 216159
52954 216159 215604 214175 212518 211466 211342 211670 211604 210716 209318 208046 207281 206951 206721 206217 205233 203888 202534
52937 202534 201354 200154 198785 197582 197009 196852 196229 194667 192784 191570 191230 191178 191049 191172 191907 192933
52921 192933 193506 193223 192318 191315 190650 190622 191371 192705 194058 194902 195305 195933 197275 198947 199982 199885 199153
52904 199153 198682 198890 199575 200385 201063 201365 201112 200424 199622 198852 198005 197135 196691 197120 198300 199582 200405 200748
52886 200748 200925 201077 201015 200576 199940 199484 199385 199587 200051 200782 201549 201882 201572 200993 200768 201195 202132 203293 204459
52867 204459 205551 206679 208077 209872 212007 214458 217283 220323 223101 225291 227139 229135 231427 233772
52853 233772 235855 237336 237772 236908 234968 232349 229153 225414 221579 218226 215344 212401 209216 206218 203794
52838 203794 201898 200516 199982 200457 201435 202098 202011 201275 200252 199393 199103 199543 200591 202059 203726 205170 205946
52821 205946 206023 205739 205179 203986 202008 199791 198098 197219 197042 197574 199031 201468 204614 208040 211381 214494
52805 214494 217411 219999 221649 221650 219958 217297 214417 211581 208868 206481 204468 202571 200636 198798 197036
52790 197036 195081 193126 192070 192445 193506 194085 193986 193803 193609 192758 191048 189303 188482 188764 189692 190731 191472
52773 191472 191778 191975 192566 193530 194242 194318 194133 194282 194790 195178 195087 194605 194144 194232 195262 197175 199360 200999
52755 200999 201534 200927 199689 198706 198730 199824 201389 202803 203905 204824 205609 206175 206460 206448 206201 205996 206262 207177
52737 207177 208417 209550 210543 211607 212536 212630 211536 209947 209069 209383 210244 210807 210968 211132 211479 211940 212688
52720 212688 213950 215261 215625 214698 213288 212311 211732 211006 210088 209367 208880 208289 207462 206441 204901 202408 199330
52703 199330 196885 195984 196359 196989 197059 196499 195985 196440 198099 200026 200946 200591 199771 199171 198771 198493 198588 199025
52685 199025 199233 198968 198889 199697 201120 202290 202762 202709 202521 202743 203976 206181 208334 209403 209419 208988 208108 206316
52667 206316 203871 201866 201043 201173 201742 202508 203218 203501 203430 203569 204120 204554 204500 204495 205323 206995 208946 210977
52649 210977 213412 216421 219651 222568 224807 226148 226488 225937 224800 223434 222183 221287 220669 219909 218676
52634 218676 217168 215967 215516 215838 216629 217501 218268 219144 220472 222116 223418 224033 224520 225602 227018 227702
52618 227702 227056 225509 223743 221989 220335 219089 218352 217637 216451 215090 214356 214543 215053 215023 214002 212118
52602 212118 210012 208609 208582 209816 211569 213228 214703 216106 217392 218460 219363 220205 220916 221287 221115 220309
52586 220309 219059 217939 217558 217958 218626 219290 220318 222018 223838 224891 225176 225643 226919 228562 229872 230883
52570 230883 231978 232900 232936 232133 231623 232335 233827 234861 234886 234477 234367 234567 234616 234285 233714 233006 232096 230985
52552 230985 229856 228843 227867 226807 225705 224740 224067 223756 223787 223988 224096 224023 224002 224301 224837 225324 225763 226472
52534 226472 227443 228037 227678 226754 226299 226791 227682 228245 228397 228397 228199 227688 227298 227742 229111 230749 232061 232967
52516 232967 233506 233709 234140 235890 239433 243864 247915 251435 255161 259158 262257 263341 262569 260972 259197
52501 259197 257081 254291 251003 247816 245203 243099 241101 239018 237092 235611 234476 233413 232478 232017 232083
52486 232083 232221 231926 231118 230106 229328 229216 230014 231546 233317 234990 236626 238389 240195 241823 243240 244660
52470 244660 246331 248334 250569 252860 255126 257415 259685 261672 263145 264224 265253 266402 267525 268355
52456 268355 268597 267981 266532 264731 263023 261219 258771 255592 252178 248988 246231 244186 243045 242252 240791
52441 240791 238541 236735 236487 237343 237832 237146 235748 234629 234480 235327 236431 236773 236083 235194 234953 235131 234969
52424 234969 234433 234100 234010 233549 232612 232032 232484 233581 234478 234907 235214 235634 235988 236039 235883 236009 236991 239013 241667
52405 241667 244326 246742 249172 252073 255876 260928 267311 274607 282058 288903 294492 298264 300006 300038 298885
52390 298885 296857 294216 291458 288907 286162 282576 278305 274352 271450 269463 267995 267047 266795 267179 268023
52375 268023 269252 270751 272314 273945 275882 278130 280368 282507 284961 287990 291052 293134 293577 292369
52361 292369 289947 286992 284221 282048 280466 279319 278507 277896 277390 277227 277808 278982 279986 280428 280925 282226
52345 282226 284022 285263 285512 285333 285270 285134 284617 284119 284446 285882 287947 290102 292290 294703 297319 300034
52329 300034 303110 307056 311937 317167 322248 327454 333404 340107 346830 352841 357900 362058 365450 368400
52315 368400 371358 374520 377755 380927 384021 386921 389564 392394 396226 401359 407264 413390 419904 427266
52301 427266 435400 443735 451854 459746 467474 474850 481411 486596 490164 492562 494614 496661 498235 498758
52287 498758 498253 497223 496188 495575 495611 495966 495904 495223 494697 495115 496252 497335 498210 499326 500734 501941 502803
52270 502803 503886 505717 508199 510957 513804 516695 519747 523509 528689 535200 541874 547579 552411 557392
52256 557392 563141 569272 575088 580420 585644 591122 596796 602208 606753 610048 612240 613952 615740 617561
52242 617561 618962 619793 620461 621354 622359 623339 624785 627403 631121 635165 639224 643878 649523 655548 661120
52227 661120 666303 671772 677736 683862 690076 696671 703597 710313 716535 722588 728765 734832 740536 746302
52213 746302 752978 760893 769371 777230 783775 789303 794669 800399 806439 812752 819688 827443 835533 843320
52199 843320 850837 858497 866131 873104 879525 886565 895102 904536 913460 921260 928533 936018 943545 950174
52185 950174 955127 958378 960305 960891 959594 956193 951549 947043 943346 940170 937177 934516 932201 929609
52171 929609 926142 922120 918515 915932 914200 912801 911381 909937 908922 909019 910436 912450 914000 914704 914924
52156 914924 914950 914675 914157 913867 914030 914119 913481 912208 910991 910337 910405 911493 914053 918078 922871 927695 932289
52139 932289 936509 939796 941393 941020 939087 936332 933416 930756 928527 926906 926483 928231 932715 939468 947471
52124 947471 956128 965395 975105 984786 994225 1003624 1012887 1021246 1028006 1033343 1037913 1041803 1044268 1044490
52110 1044490 1042330 1038329 1033182 1027283 1020781 1014125 1008405 1004795 1003526 1003724 1004445 1005585 1007635 1010889
52096 1010889 1015166 1019926 1024231 1026851 1026962 1024779 1021250 1017198 1012933 1008526 1004070 999691 995618 992194
52082 992194 989659 987988 987040 986664 986563 986406 986331 986967 988582 990557 992156 993427 994864 996546 998281 1000296
52066 1000296 1002934 1005772 1007945 1009407 1011021 1013228 1015521 1017639 1020407 1024674 1029971 1035022 1039296 1043331
52052 1043331 1047571 1051538 1054337 1055537 1055274 1053655 1050387 1045129 1038131 1030318 1022581 1015141 1007801 1000658
52038 1000658 994170 988540 983501 978881 975027 972368 970736 969344 967348 964360 960597 956699 953295 950608
52024 950608 948537 947072 946444 946860 948253 950375 953050 956308 960443 965894 972873 981101 990047 999359 1008854
52009 1008854 1018210 1026932 1034561 1040578 1044178 1044565 1041567 1035673 1027468 1017314 1005573 992744 979304
51996 979304 965696 952444 939794 927177 913497 898170 881588 864465 847180 829884 812718
51985 812718 795520 777621 758429 738212 718071 699121 681674 665156 648850 632812 617885
51974 617885 604672 592829 581870 572291 565195 560940 558965 558984 561421 566418 573303 581481 590988 601544
51960 601544 611767 620092 625970 629494 630367 628215 623719 618454 613448 608467 602904 596910 591426 587419
51946 587419 585322 585172 587136 591696 599077 608746 619952 632764 647833 664964 682642 699412 714992
51933 714992 729416 741786 750781 756087 758383 758057 754706 747904 737792 724906 709979 693887 677187
51920 677187 659763 641442 622847 604968 587994 571398 555349 541202 530169 522032 515675 510477
51908 510477 506780 505187 505855 508461 512580 517913 524096 530389 535821 539839 542581 544235 544294 541839 536486
51893 536486 528725 519412 509241 498636 487798 476939 466718 458280 452352 448479 445695 443958 444436
51880 444436 448358 456059 467144 481024 497098 514925 534471 555886 578863 602483 625686 647517
51868 647517 666853 682471 693649 700389 702894 701176 695360 685960 673656 659115 643162 626769
51856 626769 610649 595173 580803 568098 557014 546691 536384 526275 516917 508190 499363 490081
51844 490081 480720 471723 462999 454164 445064 435922 427242 419734 414172 410980 409907 410284 411716 414381
51830 414381 418510 423606 428426 431780 433208 432881 431231 428851 426451 424495 422931 421549 420484 420193 421042
51815 421042 423165 426471 430426 434010 436400 437722 438726 439694 439994 438689 435337 430315 424741 419977 416684
51800 416684 414378 412268 410435 409671 410237 411440 412549 413497 414537 415755 417153 418696 420084 420984 421582
51785 421582 422280 422715 421815 419129 415375 411291 406817 401957 397587 394535 392488 390783 389859 390868 394100
51770 394100 398866 404900 412790 422756 433821 444544 453910 461236 465931 467861 467574 465683 462324 457447
51756 457447 451333 444439 437043 429397 422028 415500 409931 405074 400784 397163 394248 391817 389613 387661
51742 387661 386339 386147 387371 389903 393387 397512 402134 407139 412328 417452 422285 426578 430127 432993
51728 432993 435598 438393 441395 444171 446400 448349 450651 453683 457354 461579 466533 472094 477190 480263
51714 480263 480633 479167 477367 475984 474710 473010 470948 469148 468163 467990 468185 468390 468626 469005 469361 469354 468790
51697 468790 467492 465038 461196 456725 453112 451205 450594 450597 451183 452271 452728 451100 447252 442457 437773 433131
51681 433131 428186 423329 419417 417018 416196 416526 416964 416260 414023 411030 408071 404932 401122 397244 394799
51666 394799 394657 396436 399485 403858 410059 418414 428969 441484 455011 467800 478141 485233 489043
51653 489043 489685 487498 483467 478873 474369 469841 465287 461227 458002 455248 452584 450395 449224 448482 446477
51638 446477 441954 435160 427249 419064 410852 402795 395272 388499 382296 376391 370862 366143 362642 360411
51624 360411 359167 358581 358479 358840 359674 360914 362331 363496 363983 363675 362767 361434 359672 357588 355564 353816
51608 353816 352025 349805 347447 345718 344923 344672 344681 345277 346805 348985 351276 353659 356681 360899 366592 373814
51592 373814 382322 391530 400852 410102 419320 428324 436682 444016 450018 454276 456491 456934 456386 455662 455478
51577 455478 456688 460132 466031 473904 483337 494580 508120 523954 541627 560881 581815 604300
51565 604300 627552 650565 673017 695649 719780 746496 776335 809572 846474 887083 930793
51554 930793 976258 1021599 1064500 1102241 1132103 1152151 1161647 1160699 1149635 1128884 1099289 1062209
51542 1062209 1019229 971912 921912 871095 821286 773848 729589 689043 652640 620515 592368
51531 592368 567786 546644 528942 514269 501702 490438 480350 471770 464841 459245 454438 449848
51519 449848 444937 439416 433598 428311 424220 421241 418713 416102 413416 411015 409201 408039 407357 406794 405890
51504 405890 404328 402124 399570 396986 394590 392484 390624 388816 386951 385321 384494 384698 385470 386093 386318
51489 386318 386439 386722 386993 386873 386262 385510 385112 385193 385269 384632 383088 381167 379428 377790 375850 373700 371948
51472 371948 370925 370338 369838 369570 369971 371394 374137 378429 383965 389660 394272 397301 399076 400127 400676
51457 400676 400632 399729 397741 394773 391338 387947 384702 381486 378431 375907 374163 373370 374030 376886 382143
51442 382143 389077 396747 404942 414049 423930 433325 440670 445382 448084 449638 450399 450580 450873 452103 454239
51427 454239 456207 456910 456204 454756 453186 451620 449911 448020 446055 443992 441460 438056 433997 430226 427541
51412 427541 425719 423898 421708 419507 417498 415308 412800 410666 409648 409503 409275 408446 407337 406521 406315
51397 406315 406812 408045 410043 413005 417283 422952 429510 436371 443632 452083 462466 474978 489454 505842
51383 505842 524539 546504 572951 604693 641869 684392 732385 785903 844475 907260 973314
51372 973314 1041119 1107955 1170336 1225158 1270174 1303596 1323877 1330085 1322117 1300497 1266385 1221840
51360 1221840 1169561 1112067 1051200 988400 925119 862915 803382 748006 697834 653280 614384
51349 614384 580992 552408 527278 504506 484128 466657 451737 438292 425937 415248 406406 398559
51337 398559 391007 384175 378758 374627 371261 368688 367198 366488 365919 365375 365191 365342 365430 365334 365248 365093 364571
51320 364571 363836 363492 363707 363849 363263 362045 360855 360222 360291 361012 362321 364081 366012 367756 369148 370419
51304 370419 371928 373627 375015 375707 375708 374944 372994 369744 365975 362672 359862 356766 353033 349192 345775
51289 345775 342670 339592 336729 334514 333058 332153 331646 331581 332176 333836 336971 341592 347268 353646 360712
51274 360712 368369 376015 382898 388700 393497 397295 399951 401439 401889 401366 399955 398054 396283 395001 394072
51259 394072 393165 392094 390795 389185 387188 384865 382362 379738 376823 373317 369152 364876 361508 359770
51245 359770 359441 359594 359438 358766 357702 356369 354886 353389 351919 350458 349204 348559 348664 349194 349837 350775
51229 350775 352360 354430 356312 357520 358194 358799 359629 360626 361527 362107 362410 362804 363720 365327 367458 369695
51213 369695 371513 372696 373872 376251 380294 384840 388182 389950 391273 393079 395073 396629 397834 399089
51199 399089 400334 401367 402453 403871 405272 406210 406969 408034 408977 408913 408036 407638 408285 408941 408433 407044 405974
51182 405974 405781 406111 406616 407343 408255 409070 409704 410422 411326 412069 412242 411844 411092 409932 407975 405020 401504
51165 401504 398252 395696 393443 390804 387740 385064 383571 383096 382635 381408 379649 378214 377488 376972 376116
51150 376116 375242 375130 375684 375676 374257 372211 371060 371160 371489 371316 371281 372433 374809 377452 379574 381210 382847
51133 382847 384745 386608 387747 387594 386162 384046 382038 380837 380916 382296 384471 386926 389802 393658 398526
51118 398526 403691 408566 413345 418471 423900 429179 433935 437870 440605 441933 442156 441882 441613 441678 442227 443020
51102 443020 443468 443238 442578 441807 440788 439256 437305 435107 432432 429019 425205 421609 418312 414906 411294
51087 411294 407804 404581 401570 399238 398557 399855 402237 404613 406931 409859 413543 417279 420317 422422
51073 422422 423565 423597 422634 421436 420946 421431 422387 423261 423941 424471 424729 424761 425166 426676 429451 433280 438389
51056 438389 445401 454336 464241 474186 484037 493722 502201 508067 511219 513390 516871 523027 531979 543079
51042 543079 555358 567895 580172 592182 604078 615768 626859 636878 645472 652494 657987 662054
51030 662054 664707 665772 664835 661314 654867 645873 635318 624001 612014 599237 586248 574372 564815
51017 564815 557919 553250 550157 548226 547339 547537 548798 550922 553496 555901 557517 558237 558722 559753 561276
51002 561276 562511 563146 563949 565771 568427 571057 573247 575187 576883 577944 578302 578598 579666 581896 585256
50987 585256 589662 595215 602216 610971 621423 633022 645091 657230 669263 681073 692767 704615
50975 704615 716275 726259 732801 735338 734683 731774 726799 719622 710524 700258 689672 679513 670316
50962 670316 662350 655859 651361 649443 650244 653456 658796 666089 674974 685013 696215 709000 723535
50949 723535 739551 756973 776236 797775 821663 848060 877585 910876 948077 989024 1033589
50938 1033589 1081396 1131319 1181550 1230094 1275055 1314758 1348014 1374387 1394142 1407974 1416627
50927 1416627 1420424 1419050 1412041 1399481 1381916 1359637 1332603 1301219 1266657 1230170 1192541 1154478
50915 1154478 1116911 1080375 1044620 1009474 975748 944569 915996 889048 863111 838631 816285
50904 816285 796043 777335 759688 742902 726992 712323 699586 689223 680917 673918 667815 662713
50892 662713 658629 655071 651434 647607 643838 640139 636244 632289 629014 626981 625883 625042 624326 624063 624240
50877 624240 624469 624743 625560 627093 628855 630499 632412 635129 638553 642230 646022 650103 654466 658888 663213
50862 663213 667442 671714 676470 682268 689126 696292 703077 709668 716739 724572 733038 742186 752242 763115
50848 763115 774482 786417 799481 814133 830425 848285 867703 888636 911110 935358 961507
50837 961507 989126 1017476 1046273 1075837 1106584 1138822 1173088 1210151 1250516 1294361 1342035
50826 1342035 1394176 1451128 1512708 1578701 1649109 1723593 1801116 1880448 1960618 2040414 2117765
50815 2117765 2190131 2255300 2311389 2356362 2388239 2405835 2408875 2397444 2371929 2333579 2284540
50804 2284540 2226921 2162149 2091510 2016905 1940626 1864566 1790096 1718575 1651355 1589093 1531476
50793 1531476 1477927 1428414 1383392 1343219 1307989 1277799 1252731 1232472 1216266 1203406 1193588
50782 1193588 1186591 1181776 1178182 1175112 1172366 1169779 1166840 1163038 1158503 1153841 1149126 1143392 1135547 1125562
50768 1125562 1114241 1101882 1087863 1071840 1054590 1037072 1019079 999676 978788 957580 937182
50757 937182 917758 899024 881003 863905 847772 832733 819337 808265 799826 793854 789804 786922
50745 786922 784775 783807 784920 788308 793285 799565 807980 819281 832756 846882 861102 876131 892670
50732 892670 910610 929567 949313 969400 989000 1007630 1025739 1044210 1063347 1082497 1100541
50721 1100541 1116719 1131098 1144241 1156386 1167159 1176272 1184183 1191695 1199200 1206832 1215207 1225348
50709 1225348 1237950 1253316 1272026 1294928 1322282 1353491 1387947 1425516 1465909 1508156 1551165
50698 1551165 1594335 1637058 1677858 1714509 1744955 1767968 1783248 1791247 1792736 1788297 1778514 1764757
50686 1764757 1749239 1733720 1718414 1702542 1685634 1667706 1648438 1627050 1603231 1577723 1551784
50675 1551784 1526397 1502187 1479808 1460194 1444420 1433331 1427144 1425464 1427800 1433882 1443191 1454427
50663 1454427 1465976 1477039 1487966 1499383 1511315 1523257 1534769 1545804 1556629 1567581 1578737
50652 1578737 1589786 1600440 1610919 1621708 1632837 1643919 1655120 1667543 1682277 1699485 1718971
50641 1718971 1741272 1767496 1798159 1832795 1870694 1911301 1953764 1996755 2039103 2080126 2119020
50630 2119020 2154539 2185866 2213453 2238362 2260972 2280968 2298407 2313931 2327645 2338341 2344061
50619 2344061 2342999 2333713 2315283 2288068 2254299 2217471 2181067 2147907 2120209 2099512 2086291 2079883
50607 2079883 2078910 2081643 2086088 2090068 2091410 2088023 2077973 2059828 2033098 1998229 1956143 1907830 1854269
50594 1854269 1796481 1735575 1672904 1610114 1548790 1490027 1434513 1382991 1336235 1294450 1257047
50583 1257047 1223415 1193813 1169234 1150370 1136963 1128256 1123802 1123593 1127475 1134782 1144771 1157232 1172273
50570 1172273 1189405 1207128 1223700 1238233 1250828 1261761 1270830 1277476 1281264 1282194 1280812 1278212 1275810
50557 1275810 1274919 1276513 1281255 1289604 1301854 1318289 1339227 1364620 1393483 1424029 1454687 1484896
50545 1484896 1514702 1543751 1571087 1596023 1618958 1641123 1663699 1687387 1712831 1741173 1773880
50534 1773880 1811943 1855324 1903344 1955638 2012690 2075495 2144822 2220889 2303626 2393106 2489603
50523 2489603 2593203 2703244 2818066 2935370 3052963 3169194 3282579 3390958 3491170
50514 3491170 3579703 3653593 3710660 3749138 3767610 3765442 3742994 3701196 3641244 3565066 3475871
50503 3475871 3377748 3274598 3169692 3066158 2967490 2877390 2799286 2735962 2689248 2659882 2647759
50492 2647759 2652272 2672060 2704417 2745361 2790395 2834845 2873513 2900877 2912380 2905479 2879351 2834081
50480 2834081 2770594 2691055 2598743 2497498 2391308 2283744 2177078 2072186 1969810 1871684
50470 1871684 1779812 1694907 1616256 1543014 1474870 1411618 1353035 1299525 1252047 1210914 1175134
50459 1175134 1143428 1115491 1091806 1072448 1056620 1043367 1032443 1024328 1019432 1017336 1016968 1017586 1019325
50446 1019325 1022545 1026966 1031990 1037669 1044711 1053504 1063732 1075108 1087819 1101942 1116822 1131406
50434 1131406 1144955 1157301 1168693 1179525 1189899 1199446 1207937 1215961 1224449 1233594 1242971 1252809 1264199
50421 1264199 1277679 1292504 1307960 1324712 1344132 1366848 1392799 1422274 1455999 1494320 1537078
50410 1537078 1584297 1636374 1693536 1755448 1821250 1889532 1958471 2026519 2092906 2157059 2217711
50399 2217711 2273018 2321382 2361590 2392324 2412182 2420274 2416320 2400186 2371764 2331313 2279582 2217770
50387 2217770 2147978 2073579 1998420 1925421 1856311 1792565 1735889 1687550 1647892 1616888 1594733
50376 1594733 1581580 1577044 1580208 1589785 1603946 1620235 1635966 1648652 1656045 1656185 1647777 1630508 1604923
50363 1604923 1572129 1533550 1490610 1444427 1395957 1346480 1297621 1250709 1206296 1164466 1125479
50352 1125479 1089935 1058348 1030557 1005524 981808 958573 936166 915641 897796 882782 870278
50341 870278 859560 849522 839282 828899 819109 810279 802015 793889 786090 779161 773502 769297 766509
50328 766509 764678 763103 761465 760092 759518 760122 762232 766045 771211 777052 783456 791018 799890 809059 817281
50313 817281 824397 831163 838204 845725 853951 863096 873009 883450 894637 906933 920153 933915 948654
50300 948654 965550 985190 1006887 1029469 1052101 1074020 1094124 1111405 1125542 1136835 1145999 1154485
50288 1154485 1164497 1177834 1194497 1212621 1229469 1242015 1246910 1241116 1223541 1196040 1162428 1126395
50276 1126395 1090291 1055484 1023232 994874 971329 952693 938424 927953 921068 917725 917532 919502
50264 919502 922449 925639 929051 932976 937573 942848 948981 956353 965153 975073 985522 996069 1006621
50251 1006621 1017248 1027869 1037963 1046469 1052189 1054687 1054756 1053692 1051990 1049075 1044426 1038477 1031988 1024883
50237 1024883 1016457 1006835 997496 989875 983842 978155 972205 966654 962245 958638 954873 950693 946906 944508
50223 944508 943734 944068 944975 946501 949194 953509 959343 966257 974044 982865 992783 1003487 1014610 1026109
50209 1026109 1038009 1049973 1061427 1072062 1082010 1091653 1101416 1111522 1121528 1130261 1136729 1141094
50197 1141094 1144341 1146949 1148360 1147717 1144545 1138523 1129251 1116670 1101250 1083383 1063085 1040862 1018434
50184 1018434 997826 979878 964289 950986 940629 933615 929346 926860 925643 925331 925026 923397 919442
50171 919442 912925 904360 894799 885371 876587 868185 859913 852169 845494 839658 833944 828369 823855 820824
50157 820824 818252 814755 810407 806781 805136 805105 805375 805172 804727 804560 804805 805160 805126 804199 802097 798950 795141
50140 795141 790945 786453 781780 777074 772294 767339 762563 758824 756697 755849 755491 755263 755353 755929 756968 758566
50124 758566 760851 763397 765215 765688 765267 764990 765537 766957 769017 771452 774053 776868 780263 784481 789299
50109 789299 794390 799852 805959 812589 819410 826655 835127 845277 856731 868950 881938 896075 911650
50096 911650 928855 947816 968255 989487 1011240 1034200 1059256 1086374 1114711 1143601 1172794
50085 1172794 1201769 1229606 1255826 1280793 1304910 1327706 1348034 1364928 1377987 1387146 1392286 1392975
50073 1392975 1388470 1378211 1362475 1342381 1319153 1293654 1266699 1239351 1212521 1186599 1161908
50062 1161908 1139301 1119800 1103656 1090180 1078584 1068682 1060710 1054735 1050346 1046753 1043159 1039263 1035411
50049 1035411 1032054 1029029 1025675 1021681 1017530 1013893 1010862 1008023 1005178 1002630 1000707 999280 997936 996480
50035 996480 995017 993560 991829 989673 987594 986601 987423 989872 992912 995317 996456 996744 997321 999032 1001630
50020 1001630 1004207 1006361 1008591 1011496 1014968 1018391 1021181 1022806 1022657 1020501 1016965 1013105 1009368 1005284
50006 1005284 1000227 994257 988177 982946 979047 976286 974241 972926 972823 974099 976073 977777 978833 979490
49992 979490 979976 980237 980144 979464 977590 973706 967319 958421 947297 934530 921075 907767 894793 882158
49978 882158 870679 861855 856530 854211 853959 855549 859441 866015 875182 886500 899349 913174 927690
49965 927690 942708 957738 972158 985909 999660 1014145 1029675 1046317 1063880 1081411 1097337
49954 1097337 1110618 1121286 1129469 1134512 1135694 1133269 1127912 1119498 1107476 1092381 1075932 1059326
49942 1059326 1042218 1023736 1003771 982803 961037 938381 914973 891185 867275 843511 820475
49931 820475 798759 778307 758486 738925 720040 702668 687474 674817 664839 657342 651723 647324
49919 647324 643878 641431 639905 639135 639377 641300 645114 649991 654843 659565 665041 672007 680449 690265 701878
49904 701878 715734 731524 748317 765275 781898 797749 812386 825621 837563 848393 858176 866692
49892 866692 873193 876451 875449 870087 861039 848972 834193 817076 798554 779968 762383 746068
49880 746068 730700 716162 703024 691934 682575 673769 664807 656200 648735 642352 636543 631472 627818
49867 627818 625652 624310 623483 623692 625418 628479 632654 638361 646246 656493 668932 683410 699493 716089
49853 716089 731954 746523 759901 772124 782818 791556 798238 803066 806372 808410 809025 807565 803356
49840 803356 796349 787085 776092 763576 749836 735763 722758 712021 703854 697556 692099 687011 682542
49827 682542 679018 676320 674222 673015 673384 675758 680103 686380 694691 704839 716090 727672 739318
49814 739318 751005 762363 772707 781677 789543 796751 803319 808814 812753 814832 814733 811948 806093 797582
49800 797582 787814 778379 769925 761953 753810 745571 737669 729899 721361 711524 701028 691222 683129 676941
49786 676941 672156 667951 663684 659479 656189 654484 654085 654191 654525 655502 657506 660594 665006 671312 679671
49771 679671 689397 699664 710291 721306 732062 741440 748961 755153 760669 765448 768959 770915 771462
49758 771462 770794 768822 765174 759396 751191 740557 727795 713477 698496 683962 670778 659247 649184
49745 649184 640373 632749 626226 620662 616107 612825 610868 609787 608968 608204 607803 608180 609474 611534 614179
49730 614179 617442 621571 626799 633087 640108 647520 655265 663613 672878 683014 693490 703744 713853
49717 713853 724591 736605 749677 762989 775890 787926 798112 804819 806797 804117 797826 788924
49705 788924 778028 765774 752985 740318 728123 716848 707314 700338 696173 694399 694196 694616 694815
49692 694815 694309 693086 691343 689226 686981 685242 684863 686363 689710 694648 700985 708506 716982 726597 738212
49677 738212 752801 770631 791194 813821 837897 862410 885705 906006 921997 932812 937880 937293
49665 937293 932305 925074 917696 911436 906674 903225 900656 898595 896833 894991 892015 886249 876297 861966
49651 861966 844416 825455 806659 788950 772723 758206 745626 735119 726582 719694 714078 709533
49639 709533 706213 704543 704696 706060 707468 708140 708262 708393 708470 707749 705646 702273 698016 693003 687292 681340
49623 681340 675856 671133 666812 662453 658154 654467 651838 650330 649780 649946 650458 650966 651555 652767 654972
49608 654972 657866 660807 663500 666020 668344 670290 671880 673352 674772 676023 677217 678644 680271 681739
49594 681739 682997 684276 685311 685294 684096 682868 682792 683737 684787 685676 686853 688515 690463 692761 695667 698928
49578 698928 702014 705038 708569 712436 715707 718153 720834 724804 730038 736143 743363 752208 762705 774683
49564 774683 788248 803196 818322 832180 844347 855295 865170 873423 879526 883366 884922 884252 881909
49551 881909 878754 875154 870890 866105 861797 858993 857721 857169 856681 856349 856713 858080 860050 861658 862075
49536 862075 861306 860087 859164 858833 859171 860374 862615 865800 869802 874937 881992 891667 904025 918567 934824
49521 934824 952772 972528 993552 1014314 1032975 1048420 1060570 1069866 1076902 1082647 1088546 1095794
49509 1095794 1104514 1113930 1123331 1132390 1140473 1146168 1148031 1145601 1139219 1128971 1114483 1095947 1074885
49496 1074885 1053496 1033442 1015482 999862 986568 975337 965884 958094 951690 945890 939929 933908
49484 933908 928667 924750 921947 919864 918337 917043 915353 913011 910611 908908 907975 907413 907089 907133 907390 907510
49468 907510 907539 907915 908755 909652 910386 911469 913674 917152 921245 925064 928048 930065 931149 931236 930133 927765
49452 927765 924398 920498 916302 911615 906088 899674 892707 885550 878313 871016 863917 857478 852012 847544
49438 847544 844128 842025 841354 841777 842869 844722 847773 852079 857311 863626 872063 883578 897923 914023
49424 914023 931502 951437 975319 1003350 1033905 1064505 1092917 1117052 1134201 1141444 1137604 1124678
49412 1124678 1106763 1087529 1069037 1052568 1039397 1030321 1025201 1023690 1025975 1032196 1041499 1052446
49400 1052446 1064311 1077338 1091745 1107058 1122670 1138531 1154988 1172122 1189435 1206127 1221491
49389 1221491 1235086 1246568 1255455 1261261 1263947 1264002 1261938 1257832 1251534 1243155 1233221 1222592 1212405
49376 1212405 1203701 1196783 1191128 1186302 1182764 1181361 1182278 1184992 1189136 1194834 1202153 1210698 1219873 1229116
49362 1229116 1237756 1245040 1250513 1254122 1255852 1255574 1253356 1249704 1245272 1240456 1235333 1229838 1224034 1218356
49348 1218356 1213572 1210254 1208326 1207312 1206977 1207419 1208635 1210327 1212107 1213518 1213931 1212846 1210365 1206928 1202621
49333 1202621 1197247 1191137 1185247 1180127 1175323 1170188 1164785 1159550 1154491 1149400 1144612 1140847 1138285 1136404
49319 1136404 1134864 1134024 1134245 1135075 1135555 1135206 1134390 1133697 1133310 1133090 1133052 1133403 1134107 1134714 1134838 1134696 1134985 1136273
49301 1136273 1138695 1142188 1146718 1152120 1157901 1163436 1168342 1172585 1176225 1179197 1181400 1182950 1184185 1185240
49287 1185240 1185697 1184935 1182922 1180412 1178152 1176163 1174096 1172156 1171273 1172409 1175947 1181703 1189091 1197279 1205635
49272 1205635 1214255 1223726 1234166 1244846 1255000 1264714 1274657 1285132 1295830 1306391 1316640 1326064
49260 1326064 1333541 1338102 1339894 1340000 1339247 1337607 1335025 1332396 1331190 1332122 1334670 1337875 1340986 1343091 1342715
49245 1342715 1338428 1329734 1317105 1301445 1283843 1265431 1246811 1227779 1208136 1188634 1170566 1154505
49233 1154505 1140100 1127119 1115996 1107208 1100751 1096473 1094281 1093688 1093667 1093454 1093178 1093352 1094083 1095174 1096684
49218 1096684 1098850 1101520 1104042 1105788 1106639 1106935 1107033 1106916 1106289 1105197 1104421 1104954 1107180 1110857 1115792 1121953
49202 1121953 1128978 1136254 1143665 1151620 1160019 1167901 1174616 1180793 1187420 1194325 1200180 1203933 1205720 1206490
49188 1206490 1207172 1208081 1208742 1208381 1206916 1205296 1204589 1204984 1206073 1207849 1210970 1216320 1224858 1237692 1255692
49173 1255692 1279111 1308021 1342926 1384212 1430909 1480486 1529794 1575664 1614748 1643904 1661456
49162 1661456 1667874 1665035 1655169 1640548 1623369 1605200 1586608 1567613 1548324 1528947 1509545 1490166
49150 1490166 1471107 1452765 1435382 1419159 1404458 1391649 1380796 1371651 1363845 1357015 1350982 1345999
49138 1345999 1342677 1341463 1342319 1344962 1349123 1354356 1360018 1365941 1372949 1382180 1393785 1406708 1419829
49125 1419829 1432949 1446514 1460795 1475782 1491639 1508752 1527214 1546646 1566773 1587972 1611024
49114 1611024 1636448 1664397 1695314 1730475 1771842 1821537 1881484 1952975 2035962 2128749 2228877
49103 2228877 2334449 2444227 2556312 2667348 2773567 2872044 2959799 3031509 3079473 3097408
49093 3097408 3084796 3047188 2992112 2924704 2846715 2758512 2661319 2558076 2453132 2351339 2256829
49082 2256829 2172041 2097669 2033462 1978948 1933494 1896032 1865023 1838817 1816068 1795935 1777898
49071 1777898 1761400 1745829 1730903 1716944 1704506 1693750 1684273 1675477 1667004 1659006 1652210 1647425
49059 1647425 1644589 1642454 1639767 1636749 1634869 1635036 1636628 1638565 1640697 1643555 1647193 1650955 1654321 1657376
49045 1657376 1660484 1664067 1668796 1675466 1684284 1694520 1705242 1716345 1728668 1743068 1759594 1777600
49033 1777600 1796410 1815582 1834509 1852173 1867634 1880643 1891495 1900477 1907839 1914199 1920285 1926030
49021 1926030 1930469 1932962 1934145 1935249 1936711 1937983 1938628 1939096 1940360 1943086 1947287 1952619 1958880 1966269
49007 1966269 1975020 1984812 1994772 2004220 2013211 2022180 2031390 2040964 2051110 2061751 2072115 2081203 2088754
48994 2088754 2095393 2101827 2108215 2114328 2119930 2124989 2129889 2135566 2142988 2152260 2162415 2172265 2181321 2189778
48980 2189778 2197853 2205384 2212061 2217786 2222602 2226214 2227784 2226520 2222538 2216812 2210151 2202506 2193497 2183238
48966 2183238 2172280 2160989 2149458 2137897 2126739 2116460 2107683 2101222 2097481 2095884 2095520 2096372 2099366
48953 2099366 2105135 2113380 2123630 2135942 2150425 2166535 2183309 2200047 2216421 2232232 2247524 2262677
48941 2262677 2277945 2292990 2307359 2321461 2336709 2354485 2375053 2397509 2420696 2444096 2467970
48930 2467970 2492764 2518561 2545197 2572784 2601810 2632623 2665043 2698621 2733154 2768790 2805694
48919 2805694 2843734 2882475 2921467 2960594 3000088 3040029 3079850 3118547 3155526 3191149 3226338
48908 3226338 3261730 3297210 3332170 3366154 3399251 3431872 3464173 3495865 3526666 3556674 3585961
48897 3585961 3614053 3640193 3664098 3686103 3706624 3725896 3744193 3761729 3778226 3793042 3805935
48886 3805935 3817250 3827148 3835122 3840597 3843521 3843984 3841706 3836455 3828577 3818482 3805818 3789816 3770444
48873 3770444 3748470 3724281 3697268 3666767 3633135 3597473 3560597 3522734 3484041 3444893 3405582
48862 3405582 3366221 3327200 3289419 3253687 3219906 3187111 3154370 3121478 3088822 3056917 3026187
48851 3026187 2996885 2968890 2941705 2915038 2889390 2865763 2844709 2825847 2808401 2792059 2777265
48840 2777265 2764859 2755488 2749200 2745415 2743320 2742395 2742643 2744470 2748375 2754562 2762672 2772060 2782492 2794346
48826 2794346 2807864 2822491 2837418 2852646 2869023 2887260 2907381 2929056 2951807 2974778 2997025
48815 2997025 3018383 3039524 3060816 3081654 3101393 3120381 3139516 3159167 3179187 3199637 3220786
48804 3220786 3242495 3264382 3286691 3310362 3336078 3363691 3392736 3422985 3454166 3485573 3516321
48793 3516321 3545830 3573788 3599939 3624305 3647499 3670356 3693037 3714598 3733564 3748892 3760398
48782 3760398 3768464 3773534 3775840 3775326 3771740 3764949 3755376 3743935 3731231 3716881 3699980 3680224 3658247
48769 3658247 3634734 3609673 3582692 3553735 3523069 3490911 3457536 3423553 3389592 3355767 3321806
48758 3321806 3287671 3253665 3219987 3186685 3154070 3122644 3092435 3062857 3033485 3004569 2976440
48747 2976440 2948751 2920795 2892396 2864065 2836357 2809660 2784750 2763068 2745956 2733554 2724580
48736 2724580 2717220 2710215 2703277 2696644 2690363 2684013 2677090 2669519 2661655 2653904 2646596 2640212 2635374 2632440
48722 2632440 2631325 2631874 2634108 2637822 2642325 2647066 2652353 2658853 2666388 2673877 2680639 2687128 2694023 2701166
48708 2701166 2707935 2714240 2720483 2726754 2732754 2738516 2744637 2751611 2759305 2767204 2774962 2782637 2790629 2799374
48694 2799374 2808907 2818770 2828536 2838219 2847901 2857223 2865702 2873416 2880766 2887681 2893673 2898782 2903859 2909724
48680 2909724 2916490 2923841 2931384 2938516 2944463 2948815 2951653 2952977 2952540 2950475 2947536 2944213 2940084 2934558
48666 2934558 2927847 2920605 2912881 2904096 2893939 2882617 2870155 2855985 2839510 2820680 2799717 2776439
48654 2776439 2750228 2720852 2689249 2657275 2626503 2597337 2569466 2542947 2518432 2496337 2476258
48643 2476258 2457357 2438992 2420857 2402848 2384991 2367207 2349082 2330231 2310981 2292237 2274507
48632 2274507 2257497 2240788 2224284 2207688 2190243 2171517 2151953 2132082 2111710 2090535 2069192
48621 2069192 2048910 2030347 2013434 1998214 1985113 1974418 1966104 1960297 1957350 1957346 1959868 1964301 1969958
48608 1969958 1975936 1981277 1985374 1988047 1989291 1989334 1988845 1988736 1989684 1992025 1995860 2000891 2006323 2011378 2015817
48593 2015817 2019542 2021855 2021690 2018612 2013167 2006198 1998281 1989845 1981353 1973070 1964928 1956807 1948821 1941295
48579 1941295 1934512 1928444 1922649 1916728 1911068 1906788 1904639 1904316 1905289 1907962 1913340 1921770 1932655 1945265
48565 1945265 1959118 1973564 1987705 2000872 2012593 2022045 2028153 2030432 2029170 2024654 2016897 2006478
48553 2006478 1995069 1984516 1975515 1967416 1959077 1949662 1938844 1926615 1913001 1897958 1881564 1864188
48541 1864188 1846216 1827808 1809191 1791029 1774037 1758261 1743114 1728167 1713556 1699760 1687374
48530 1687374 1677004 1668881 1662544 1657384 1653429 1651144 1650609 1651582 1654407 1659997 1668646 1679400 1690803 1701610
48516 1701610 1710447 1715584 1715833 1711514 1704138 1695295 1686096 1677374 1669996 1664863 1662618 1663192 1665742 1669397
48502 1669397 1674098 1680340 1688168 1697004 1706549 1717212 1729396 1742789 1756602 1769957 1781692 1790216
48490 1790216 1794017 1792225 1784664 1771880 1755253 1736566 1717060 1697182 1677334 1658334 1640885 1625138
48478 1625138 1611136 1599179 1589337 1581039 1573648 1567131 1561845 1557983 1555625 1554857 1555382 1556364 1557238 1558513
48464 1558513 1561349 1566418 1573485 1581881 1591047 1600834 1611609 1623811 1637139 1650363 1662223 1672162 1679927
48451 1679927 1684937 1686650 1685416 1682420 1678833 1675283 1671871 1668205 1663465 1656883 1648220 1637582 1624898
48438 1624898 1609851 1592304 1572545 1551297 1529658 1508876 1489862 1472915 1457959 1444769 1432833
48427 1432833 1421312 1409541 1397480 1385556 1374241 1363872 1354518 1345846 1337321 1328757 1320369 1312168
48415 1312168 1303715 1294705 1285392 1276213 1267400 1259204 1251946 1245440 1238855 1231639 1224197 1217166 1210490 1203821
48401 1203821 1197406 1191777 1186770 1181648 1176246 1171285 1167419 1164495 1161955 1159457 1156889 1154096 1150874 1147201
48387 1147201 1143347 1139719 1136440 1132980 1128446 1122509 1115914 1109826 1104713 1100002 1094727 1088378 1081316 1074528
48373 1074528 1068832 1064178 1059819 1055159 1050131 1044784 1039020 1033009 1027425 1022832 1019094 1015608 1011971 1008221
48359 1008221 1004707 1001877 999877 998207 996128 993579 991228 989479 987885 985813 983166 980137 976821 973473
48345 973473 970668 968720 967276 965865 964529 963570 963055 962872 962912 962921 962591 962021 961641 961504 961299 961185 961825 963259
48327 963259 964600 965323 966032 967451 969530 972153 975788 980598 985619 989664 992422 993982 994090 992736 990816
48312 990816 989235 987902 986355 984696 983135 981397 979490 978354 978800 980613 983649 988909 997320 1008211
48298 1008211 1020226 1032932 1046190 1058644 1068331 1074453 1077472 1078111 1077478 1077353 1078871 1081426 1084121 1087520
48284 1087520 1092697 1099603 1108017 1119078 1133923 1151641 1170570 1190947 1214308 1241021 1270567 1303604
48272 1303604 1341651 1385380 1435266 1493026 1560228 1636670 1722637 1821505 1937321 2071530 2225715
48261 2225715 2406406 2624010 2889605 3218257 3634432 4169786 4858965 5743881 6874245
48252 6874245 8282788 9947403 11780267 13652186 15413212 16888674 17888807 18268288
48244 18268288 17998163 17177117 15971089 14543468 13026356 11521512 10100533 8803381
48236 8803381 7647499 6640681 5783459 5065279 4467449 3971283 3560898 3220936 2936960
48227 2936960 2698266 2497173 2326127 2178181 2049346 1937536 1839681 1752223 1673659 1604055
48217 1604055 1542435 1486773 1435935 1389530 1346329 1304945 1265720 1230084 1198321 1169642 1143852
48206 1143852 1121093 1100297 1079874 1059833 1041548 1025567 1011263 998441 987576 978533 970701 964407
48194 964407 960442 957884 954099 947370 938177 927428 914893 900172 884086 868176 853356 839688
48182 839688 827012 815322 804830 795874 788486 782082 776022 770371 765530 761278 756950 752542 748892
48169 748892 746573 745301 744540 744010 743443 742473 741048 739451 737763 735831 733851 732357 731420 730439 729052 727722
48153 727722 727057 726899 726498 725346 723595 721789 720419 719605 719079 718526 717983 717733 717824 717859 717297 715839 713654
48136 713654 711362 709705 708951 708649 708155 707285 706345 705731 705764 706665 708326 710184 711668 712694 713524 714361 715325
48119 715325 716555 717896 718759 718755 718279 718030 718139 718316 718612 719325 720193 720464 719944 719354 719375 719899 720555 721479 723100
48100 723100 725400 727795 729629 730572 730668 730274 729979 730398 731907 734453 737512 740325 742328 743427 743893 744177
48084 744177 744817 746164 747885 749052 749084 748462 748155 748537 749267 750056 751038 752410 754228 756583 759559 763088
48068 763088 767199 772339 778889 786423 794042 801386 808625 815408 820678 823935 825883 827346 828098 827426 825299
48053 825299 822252 818381 813230 806640 799144 791457 784026 777034 770442 764053 757916 752510 748039 743649
48039 743649 738052 731066 723919 717788 712638 707893 703533 699861 696582 693002 689037 685275 681909 678350
48025 678350 674141 669595 665118 660462 655251 649800 644761 640167 635621 631347 628283 626865 626329 625548 624115
48010 624115 622283 620264 618047 615732 613586 611798 610354 609130 608000 607041 606686 607377 608906 610439 611386
47995 611386 611958 612643 613481 614201 614713 615044 615054 614679 614252 614067 613798 612849 611205 609413 607826 606426 605325
47978 605325 604766 604452 603480 601336 598547 596009 593973 591988 589648 587003 584324 581737 579122 576263 573046
47963 573046 569509 565748 561907 558326 555456 553346 551351 548735 545550 542553 540257 538410 536525 534536
47949 534536 532735 531313 530182 529070 527637 525667 523376 521452 520612 520997 521959 522513 522179 521546 521743 523149
47933 523149 524843 525657 525553 525517 526170 527071 527494 527388 527314 527744 528661 529701 530575 531416 532639 534252 535517 535696
47915 535696 534996 534274 533828 533132 531800 530174 528770 527748 527162 527087 527168 526706 525681 525127 525868 527328 528223
47898 528223 528105 527580 527329 527586 528450 529915 531547 532711 533270 533662 534233 534952 535761 536822 538228 539805 541315
47881 541315 542692 544061 545666 547626 549521 550454 549950 548739 548220 549149 551152 553425 555446 557042 558315
47866 558315 559610 561172 562677 563462 563335 562813 562540 562866 563997 565961 568117 569273 568819 567532 566822 567313
47850 567313 568489 569591 570437 571265 572099 572476 571869 570320 568557 567287 566454 565490 564324 563744 564482 566206
47834 566206 567743 568214 567726 567086 567153 568399 570732 573543 576022 577648 578523 579379 581219 584730 589839 595899
47818 595899 602368 609319 617295 626884 638476 652191 667874 685338 704814 726947 752119 779905
47806 779905 809478 840304 872024 903717 933750 960600 983510 1002228 1016426 1025638 1029565 1028190
47794 1028190 1021673 1010387 995006 976393 955326 932397 908133 883130 858201 834395 812622
47783 812622 793052 775028 757900 741853 727672 715766 705754 696943 688869 681361 674555 669010
47771 669010 665304 663177 661479 659365 657208 655801 655029 654042 652597 651375 650784 650216 648830 646484 643450
47756 643450 639779 635433 630652 625601 620008 613775 607660 602647 598781 595298 591882 589014 586988 585301
47742 585301 583336 580992 578326 575112 571268 567253 563564 560133 556690 553367 550378 547330 543524 538884
47728 538884 534003 529216 524255 519028 514216 510654 508423 506879 505365 503626 501742 500050 499082 499121 499742
47713 499742 500101 499848 499507 499805 500874 502354 504082 506217 508662 510756 511789 511653 510817 509895 509402 509640
47697 509640 510463 511253 511506 511359 511203 510909 509934 508313 506940 506585 506988 507314 507203 507000 507204 508131 509993 512844
47679 512844 516442 520489 525038 530344 536315 542452 548378 554168 560082 566230 572577 579022 585430 591778
47665 591778 598296 605168 612099 618539 624376 630028 635657 640777 644929 648324 651365 653884 655456 656316
47651 656316 657302 658836 660516 661919 663273 664993 666894 668308 668831 668618 668016 667228 666395 665858 666352 668956
47635 668956 674583 683178 693607 704747 716686 730555 747265 766930 789609 815959 846603 881141
47623 881141 918251 956673 995701 1034836 1073407 1110579 1145345 1176416 1202387 1222153 1235012
47612 1235012 1240472 1238302 1228740 1212229 1188904 1158809 1122793 1082676 1040234 996376 951623 906938
47600 906938 863598 822506 784139 748990 717521 689687 664969 642892 623241 605816 590389
47589 590389 576873 565198 555043 546085 538371 532100 527082 522895 519465 516938 515016 513078 511119
47576 511119 509848 509583 509664 509350 508721 508235 507905 507530 507343 507746 508586 509253 509408 509137 508500 507406 505918 504289
47558 504289 502680 501160 499782 498338 496253 493211 489781 486883 484750 482865 480860 478896 477213 475938
47544 475938 475402 475983 477420 478847 479768 480568 481842 483672 485813 488084 490241 491852 492670 492857 492667 492263
47528 492263 492100 492880 494644 496260 496392 494830 492489 490301 488513 486842 484840 482177 478958 475680 472631
47513 472631 469532 466079 462548 459421 456705 454154 451927 450347 449062 447220 444636 442093 440228 438605
47499 438605 436276 432867 428875 425197 422652 421591 421629 421943 422129 422519 423442 424480 424889 424629 424469 425017 426009
47482 426009 426761 427084 427495 428549 430169 431787 433009 433990 435137 436703 438766 441385 444559 448138 451956
47467 451956 455893 459656 462800 465366 468300 472718 478752 485573 492489 499398 506099 511897 516352 519976
47453 519976 523695 527871 532250 536602 540976 545471 550225 555627 562230 570396 580139 591286 603705 617554
47439 617554 633383 651725 672372 694318 716618 739003 761391 783124 803196 820990 836316
47428 836316 848875 858199 864124 866813 866246 862173 854725 844761 833411 821388 808835 795668 782026
47415 782026 768481 755765 744186 733499 723508 714547 707090 701131 696315 692384 688982 685266 680433
47402 680433 674587 668507 662495 656153 649278 642193 634939 627009 618350 609956 602771 596480 590022 583003
47388 583003 575979 569597 564079 559449 555661 552467 549611 547229 545744 545308 545594 546107 546439 546384 546117 546202
47372 546202 547130 548929 551445 554821 559306 564674 570275 575658 580777 585602 589956 593823 597407 600721
47358 600721 603356 604859 605144 604454 603057 601031 598189 594225 589061 583037 576651 570170 563683 557313 551107
47343 551107 544845 538341 531855 525839 520324 515013 509921 505382 501361 497265 492666 487757 482866 478007
47329 478007 473253 469113 466066 463890 461872 459564 457037 454536 452243 450364 449135 448654 448787 449257 449767
47314 449767 450118 450256 450153 449771 449321 449396 450312 451369 451375 450157 448923 448694 448976 448618 447472 446342 445498 444244
47296 444244 442056 439282 436334 432888 428479 423507 419117 416132 414400 413112 411539 409502 407383 405716
47282 405716 404717 404226 404031 404061 404276 404577 404930 405377 405894 406353 406662 406747 406408 405511 404402 403806 404152 405237 406682
47263 406682 408415 410460 412523 414181 415387 416504 417904 419798 422341 425585 429263 432825 435761 437861
47249 437861 439234 440180 440937 441375 441115 440181 439368 439533 440579 441551 441818 441736 441948 442467 442913 443421 444765 447450
47231 447450 451050 454654 457836 461001 464899 469921 475918 482565 489834 498077 507710 518864 531390 545143
47217 545143 560090 576005 592038 606730 618634 627094 632490 635728 637491 638024 637574 636824 636629 637343
47203 637343 638545 639574 640192 640594 640853 640601 639381 637148 634266 631026 627365 623079 618191 612980 607716
47188 607716 602548 597668 593372 589788 586592 583253 579642 576272 573791 572299 571318 570381 569476 568857 568622
47173 568622 568655 568993 570080 572534 576576 581707 587028 591947 596555 601330 606623 612570 619309 626972 635343
47158 635343 643771 651577 658510 664731 670421 675508 679659 682511 683967 684277 683703 682118 679137 674689 669185
47143 669185 662991 656010 648000 639172 630198 621745 614144 607350 600948 594339 587223 579908 573001 566919
47129 566919 561863 557953 555009 552413 549720 547391 546358 546800 547887 548906 550088 551943 554232 556117
47115 556117 557158 557673 558126 558430 557956 556111 552949 549338 546409 544727 543966 543370 542364 540757 538687 536517
47099 536517 534572 532830 531050 529252 527691 526226 524182 521198 517856 515007 512707 510282 507230 503549
47085 503549 499272 494314 488887 483636 479117 475422 472377 469812 467559 465489 463682 462303 461188 459818
47071 459818 457772 455041 451853 448509 445394 442777 440381 437516 433961 430473 428096 427056 426617 425932 424735
47056 424735 423218 421587 419900 418166 416384 414495 412487 410612 409316 408716 408216 406973 404871 402723 401319
47041 401319 400619 400262 400508 402032 404806 407840 410196 411765 412886 413772 414639 415885 417692 419671 421284
47026 421284 422427 423318 424147 425177 426799 429021 431161 432606 433659 435023 436650 437855 438568 439571 441258
47011 441258 442902 443675 443815 444227 445373 447201 449758 453024 456154 457731 457106 455029 452724 450765 449129
46996 449129 447851 447073 446664 446290 445893 445711 445842 446128 446499 447077 447838 448478 448711 448426 447457 445673 443579 442387
46978 442387 442941 444788 446761 448401 450242 452803 455935 459279 462698 465879 468109 469046 469468 470657 473071
46963 473071 475996 478442 480060 481200 482462 484256 486495 488615 490068 490801 491176 491575 492361 493986 496639
46948 496639 499735 502213 503546 504105 504403 504381 503738 502584 501368 500306 499243 498016 496693 495503 494789 494898
46932 494898 495823 497006 497820 498258 498818 499682 500423 500693 500813 501320 502147 502703 502726 502653 502995 503687 504301 504665 504955
46913 504955 505190 505028 504201 502972 501933 501364 501002 500501 500000 500074 501078 502628 503890 504401 504450 504582 504933 505319
46895 505319 505854 507073 509320 512364 515799 519495 523362 527037 530294 533619 537821 543037 548591 553921
46881 553921 559107 564285 569054 572949 576218 579689 583953 589001 594490 599985 604978 609048 612094 614231
46867 614231 615569 616340 617127 618445 620053 621082 621075 620576 620541 621393 622862 624406 625542 626050 626254 627000 628928
46850 628928 631806 634813 637486 640027 642682 645226 647345 649294 651842 655520 660114 664927 669462 673790
46836 673790 678301 683146 688020 692507 696554 700437 704260 707684 710249 711803 712498 712498 711971 711334 711201 711858
46820 711858 712929 713758 714147 714593 715804 718113 721344 725067 728905 732756 736836 741416 746439 751532 756574
46805 756574 762065 768707 776622 785232 793820 801944 809348 815929 821962 827929 833836 839020 842987 846171
46791 846171 849412 852889 856094 858837 861619 864898 868525 872198 876014 880136 884221 887686 890472 893210
46777 893210 896653 901203 906844 913122 919202 924343 928526 932432 936691 941322 945978 950524 955197 960327
46763 960327 966032 972120 978220 984069 989738 995514 1001509 1007600 1013869 1020947 1029601 1039920 1051173 1062658
46749 1062658 1074547 1087660 1102416 1118234 1134084 1149410 1164254 1178633 1192221 1204816 1216781
46738 1216781 1228706 1240711 1252294 1262774 1271689 1278872 1284494 1289047 1292988 1296218 1298189 1298691 1298357
46725 1298357 1298104 1298207 1298190 1297640 1296828 1296413 1296777 1297842 1299406 1301373 1303578 1305686 1307487 1309254 1311552 1314635
46709 1314635 1318135 1321380 1323934 1325750 1326882 1327172 1326235 1323742 1319754 1314700 1308892 1302052 1293487 1282777
46695 1282777 1270135 1256065 1240943 1225117 1209146 1193529 1178239 1162804 1146900 1130666 1114418
46684 1114418 1098258 1082047 1065653 1049194 1033114 1017975 1004073 991325 979539 968528 957787
46673 957787 946453 934103 921409 909448 898412 887605 876784 866764 858360 851278 844543 837571
46661 837571 830371 823064 815838 809149 803323 797986 792381 786255 779967 773770 767520 761156 754926 748902
46647 748902 742737 736238 729852 724287 719849 716314 713159 709632 704948 698939 692409 686499 681651 677471
46633 677471 673507 669763 666404 663450 661040 659637 659560 660375 661145 661368 661462 662251 664226 667369 671459 676273
46617 676273 681576 687153 692888 698718 704557 710370 716252 722217 727943 732907 736864 740028 742778 745330
46603 745330 747749 750069 752247 754110 755480 756371 757048 757990 759718 762385 765455 768055 769877 771524 773721
46588 773721 776362 778706 780427 782074 784352 787224 789978 791990 793268 794285 795499 797031 798666 800069
46574 800069 801035 801594 801872 801930 801810 801748 802131 803086 804217 804964 805212 805273 805292 805066 804651 804740 805946 807940 809754
46555 809754 810884 811646 812515 813653 815149 817166 819651 822350 825276 828691 832486 836107 839380 842836 846842
46540 846842 851041 855200 860008 866267 873701 881510 889795 899382 910170 920720 929895 938172 946802 956355
46526 956355 966661 977678 989635 1002443 1015667 1029254 1043828 1060028 1077770 1096426 1115641
46515 1115641 1135658 1156751 1178653 1200863 1223373 1246509 1269908 1292210 1312246 1330152 1346803
46504 1346803 1362476 1376715 1389337 1400701 1410848 1419086 1424814 1428285 1430263 1431245 1431272 1430161 1427755
46491 1427755 1424289 1420637 1417776 1415818 1413964 1411641 1409200 1407234 1405671 1403963 1401730 1398743 1394624 1389152
46477 1389152 1382671 1375639 1367854 1358603 1347527 1334931 1321199 1306322 1290078 1272420 1253580 1233934
46465 1233934 1213768 1193087 1171843 1150496 1130128 1111674 1095174 1080028 1065881 1052920 1041431
46454 1041431 1031539 1023422 1017399 1013685 1012254 1013068 1016231 1021800 1029502 1038701 1048639 1058829 1069303 1080404
46440 1080404 1092199 1104244 1115982 1127167 1137747 1147617 1156727 1165149 1172655 1178429 1181638 1182219 1180702
46427 1180702 1177357 1172041 1164898 1156600 1147687 1138120 1127794 1117122 1106654 1096266 1085191 1072960
46415 1072960 1060087 1047648 1036221 1025328 1014030 1002099 990382 979909 970846 962648 955120 948774
46403 948774 943990 940239 936564 932699 929394 927714 928241 930957 935559 941737 949209 957628 966451 974916
46389 974916 982295 988328 993470 998623 1004466 1010979 1017566 1023588 1028683 1032692 1035468 1036987 1037574 1037842 1038241
46374 1038241 1038645 1038480 1037367 1035577 1033688 1031769 1029233 1025677 1021526 1017451 1013422 1009058 1004883 1002423
46360 1002423 1002658 1004952 1008005 1011363 1015398 1020284 1025923 1032834 1042156 1054410 1068801 1084174 1100372
46347 1100372 1118297 1138870 1162209 1187682 1214519 1242339 1271237 1301347 1332360 1363584 1394423
46336 1394423 1424554 1453585 1480818 1505548 1527485 1546653 1562898 1575670 1584316 1588538 1588494 1584445
46324 1584445 1576479 1564716 1549733 1532540 1513980 1494333 1473625 1452139 1430388 1408718 1387227
46313 1387227 1366047 1345557 1326305 1308799 1293322 1279856 1268360 1259193 1252996 1249943 1249289 1249983 1251577
46300 1251577 1254363 1258816 1265245 1273770 1284231 1296236 1309626 1324747 1341823 1360231 1378876 1397215
46288 1397215 1415481 1434056 1453181 1473217 1494367 1515949 1536533 1555124 1571790 1586913 1600334
46277 1600334 1611569 1620367 1626620 1629988 1630013 1626487 1619514 1609452 1596954 1582717 1566969 1549526 1530521
$$ [...]
##END NTUPLES=NMR SPECTRUM
##END=
