##TITLE=AC1674_BRAAN14382_8571041_oG2NHC0tQb
##JCAMPDX= 6.0         $$ Bruker NMR JCAMP-DX V2.0
##DATA TYPE= NMR SPECTRUM
##DATA CLASS= NTUPLES
##ORIGIN= BRUKER
##OWNER= Administrator
$$ 1.72 TOPSPIN		Version 2.1
$$ 2014-04-11 19:10:32.361 -0700  Administrator@X
$$ Compression mode = diff/dup
##.OBSERVE FREQUENCY= 400.02188249412
##.OBSERVE NUCLEUS= ^1H
##.ACQUISITION MODE= SIMULTANEOUS (DQD)
##.ACQUISITION SCHEME= undefined
##.AVERAGES= 64
##.DIGITISER RES= 22
##SPECTROMETER/DATA SYSTEM= spect
##.PULSE SEQUENCE= noesygpps1d.comp
##.SOLVENT NAME= COFFEE_meoh
##.SHIFT REFERENCE= INTERNAL, COFFEE_meoh, 1, 14.96111
##AUDIT TRAIL= $$ (NUMBER, WHEN, WHO, WHERE, PROCESS, VERSION, WHAT)
$$ ##TITLE= Audit trail, TOPSPIN		Version 2.1
$$ ##JCAMPDX= 5.01
$$ ##ORIGIN= Bruker BioSpin GmbH
$$ ##OWNER= Administrator
$$ $$ E:\/data/COFFEE/nmr/AC1674_BRAAN14382_8571041_oG2NHC0tQb/12/pdata/1/auditp.txt
$$ ##AUDIT TRAIL=  $$ (NUMBER, WHEN, WHO, WHERE, PROCESS, VERSION, WHAT)
(   1,<2014-04-11 19:10:26.892 -0700>,<Administrator>,<X>,<go>,<TOPSPIN 2.1>,
      <created by zg
	started at 2014-04-11 18:58:57.189 -0700,
	POWCHK enabled, PULCHK disabled,
       configuration hash MD5:
       C8 4E 4E 5D D3 5C D8 9E 9F 52 82 E0 59 8A DE 15
       data hash MD5: 64K
       40 8C 98 90 6D 1C FD E8 68 44 A3 54 90 E1 A5 0F>)
(   2,<2014-04-11 19:10:29.955 -0700>,<Administrator>,<X>,<proc1d>,<TOPSPIN 2.1>,
      <Start of raw data processing
       efp LB = 0.3 FT_mod = 6 PKNL = 1 PHC0 = 0 PHC1 = 0 SI = 128K 
       data hash MD5: 128K
       6F 4F B3 31 33 75 28 23 3F 83 72 BE 7A 62 DB 6F>)
(   3,<2014-04-11 19:10:31.158 -0700>,<Administrator>,<X>,<proc1d>,<TOPSPIN 2.1>,
      <pk PHC0 = -85.03418 PHC1 = 0 
       data hash MD5: 128K
       2D 97 10 04 08 69 34 9C 58 2E 2E 13 9A 45 A5 A1>)
(   4,<2014-04-11 19:10:31.689 -0700>,<Administrator>,<X>,<proc1d>,<TOPSPIN 2.1>,
      <abs ABSG = 1 
       data hash MD5: 128K
       E3 18 45 94 50 72 D4 FB F1 84 3A B8 6A FE 54 19>)
(   5,<2014-04-11 19:10:31.830 -0700>,<Administrator>,<X>,<proc1d>,<TOPSPIN 2.1>,
      <abs ABSG = 2 
       data hash MD5: 128K
       97 14 BD F5 DE 5B 4C BA 82 23 68 6E 6B 7D 9F EB>)
(   6,<2014-04-11 19:10:31.939 -0700>,<Administrator>,<X>,<proc1d>,<TOPSPIN 2.1>,
      <abs ABSG = 3 
       data hash MD5: 128K
       E6 D8 19 89 66 EF 9A 36 67 9D 7D C2 72 B7 F3 0A>)
(   7,<2014-04-11 19:10:32.017 -0700>,<Administrator>,<X>,<proc1d>,<TOPSPIN 2.1>,
      <abs ABSG = 4 
       data hash MD5: 128K
       46 56 EF 8B 0F A3 69 E6 00 EB 4C E7 3F 7C 12 31>)
(   8,<2014-04-11 19:10:32.142 -0700>,<Administrator>,<X>,<proc1d>,<TOPSPIN 2.1>,
      <abs ABSG = 5 
       data hash MD5: 128K
       3D C8 82 EE EB 27 8E 9F 03 9C B1 E4 40 DA 7D 18>)
$$ ##END=
$$ 
$$ $$ hash MD5
$$ $$ 57 E8 11 A7 AB 9F 7C 52 95 C6 4C FE E8 FA EB 5E
##$RELAX= 
##$RELAX= 
##$RELAX= 
##$RELAX= 
##$RELAX= 
##$RELAX= 
##$RELAX= 
##$RELAX= 
$$ Bruker specific parameters
$$ --------------------------
##$DU= <E:\>
##$EXPNO= 12
$$ [...]
##$TP07= 0
##$TPNAME0= <>
##$TPNAME1= <>
##$TPNAME2= <>
##$TPNAME3= <>
##$TPNAME4= <>
##$TPNAME5= <>
##$TPNAME6= <>
##$TPNAME7= <>
##$TPOAL= (0..7)
0.5 0.5 0.5 0.5 0.5 0.5 0.5 0.5
##$TPOFFS= (0..7)
0 0 0 0 0 0 0 0
##$TUNHIN= 0
##$TUNHOUT= 0
##$TUNXOUT= 0
##$USERA1= <user>
##$USERA2= <user>
##$USERA3= <user>
##$USERA4= <user>
##$USERA5= <user>
##$V9= 5
##$VALIST= <valist>
##$VCLIST= <CCCCCCCCCCCCCCC>
##$VD= 0
##$VDLIST= <DDDDDDDDDDDDDDD>
##$VPLIST= <PPPPPPPPPPPPPPP>
##$VTLIST= <TTTTTTTTTTTTTTT>
##$WBST= 1024
##$WBSW= 4
##$XGAIN= (0..3)
0 0 0 0
##$XL= 0
##$YL= 0
##$YMAX_a= 6588996
##$YMIN_a= -13737237
##$ZGOPTNS= <>
##$ZL1= 120
##$ZL2= 120
##$ZL3= 120
##$ZL4= 120
##$ABSF1= 14.96111
##$ABSF2= -5.597072
##$ABSG= 5
##$ABSL= 3
##$ALPHA= 0
##$AQORDER= 0
##$ASSFAC= 0
##$ASSFACI= 0
##$ASSFACX= 0
##$ASSWID= 0
##$AUNMP= <proc_prof1d_extract.lims>
##$AXLEFT= 0
##$AXNAME= <>
##$AXNUC= <1H>
##$AXRIGHT= 0
##$AXTYPE= 0
##$AXUNIT= <>
##$AZFE= 0.1
##$AZFW= 0.1
##$BCFW= 0
##$BC_mod= 0
##$BYTORDP= 0
##$COROFFS= 0
##$CY= 15
##$DATMOD= 1
##$DC= 0
##$DFILT= <>
##$DTYPP= 0
##$F1P= 0
##$F2P= 0
##$FCOR= 0.5
##$FTSIZE= 131072
##$FT_mod= 6
##$GAMMA= 0
##$GB= 0
##$INTBC= 1
##$INTSCL= 1
##$ISEN= 128
##$LB= 0.3
##$LEV0= 0
##$LPBIN= 0
##$MAXI= 10000
##$MC2= 0
##$MEAN= 0
##$ME_mod= 0
##$MI= 0
##$NCOEF= 0
##$NC_proc= -2
##$NLEV= 6
##$NOISF1= 0
##$NOISF2= 0
##$NSP= 0
##$NTH_PI= 0
##$NZP= 0
##$OFFSET= 14.96111
##$PC= 1
##$PHC0= -85.03418
##$PHC1= 0
##$PH_mod= 1
##$PKNL= yes
##$PPARMOD= 0
##$PPDIAG= 0
##$PPIPTYP= 0
##$PPMPNUM= 2147483647
##$PPRESOL= 1
##$PSCAL= 4
##$PSIGN= 0
##$PYNMP= <proc.py>
##$REVERSE= no
##$SF= 400.020009591148
##$SI= 131072
##$SIGF1= 0
##$SIGF2= 0
##$SINO= 400
##$SIOLD= 131072
##$SPECTYP= <>
##$SREGLST= <1H.CDCl3>
##$SSB= 0
##$STSI= 131072
##$STSR= 0
##$SW_p= 8223.68421052631
##$SYMM= 0
##$S_DEV= 0
##$TDeff= 65536
##$TDoff= 0
##$TI= <>
##$TILT= no
##$TM1= 0
##$TM2= 0
##$TOPLEV= 0
##$USERP1= <user>
##$USERP2= <user>
##$USERP3= <user>
##$USERP4= <user>
##$USERP5= <user>
##$WDW= 1
##$XDIM= 131072
##$YMAX_p= 378594129
##$YMIN_p= -12133
##$CURPLOT= <Network HP LaserJet P1505>
##$CURPRIN= <$Network HP LaserJet P1505>
##$DFORMAT= <normdp>
##$LAYOUT= <+/1D_H.xwp>
##$LFORMAT= <normlp>
##$PFORMAT= <normpl>
##$SURQMSG= 1
$$ End of Bruker specific parameters
$$ ---------------------------------
##NTUPLES= NMR SPECTRUM
##VAR_NAME=  FREQUENCY,     SPECTRUM/REAL,   SPECTRUM/IMAG
##SYMBOL=    X,             R,               I
##VAR_TYPE=  INDEPENDENT,   DEPENDENT,       DEPENDENT
##VAR_FORM=  AFFN,          ASDF,            ASDF
##VAR_DIM=   131072,        131072,          131072
##UNITS=     HZ,            ARBITRARY UNITS, ARBITRARY UNITS
##FACTOR=    0.0627417313425164, 1,          1
##FIRST=     8223.62146879497, -2391,        -64507
##LAST=      0,             -591,            -65139
##MIN=       0,             -12133,          0
##MAX=       8223.62146879497, 378594129,    0
$$ Real data points
##PAGE= N=1
##DATA TABLE= (X++(R..R)), XYDATA
$$ [...]
$$ plain form
61550 375518 377542 378881 379746 380256 380296 380235 381055 383125 385329 386109 385220 383834 383043 382993 383526 384945 387671
61533 387671 391482 395480 398793 401123 402708 403827 404336 403707 401636 398548 395306 392430 389872 387525 385523
61518 385523 383859 382065 379711 377118 375142 374211 373893 373508 372809 371821 370364 368263 365931 364209 363449 363172
61502 363172 362893 362790 363134 363467 363069 362182 362059 363557 366227 369040 371518 373760 375739 377109 377654 377629 377630
61485 377630 378144 379053 379575 379074 378021 377680 378646 380233 381659 383195 385479 388152 390080 390843 391128 391615
61469 391615 392211 392667 393205 394093 395049 395520 395333 394708 393828 392721 391470 390338 389662 389652 390138 390532 390308 389606
61451 389606 389154 389487 390467 391615 392650 393543 394286 394832 395154 395273 395370 395839 397012 398780 400732 402735 405043
61434 405043 407764 410571 413155 415629 418216 420842 423312 425661 427985 430170 432147 434270 437009 440288
$$ packed form
61550C75518K024J339Q65N10M0o1Q20K070K204P80q89j386p91n0N33J419K726
61533C87671L811L998L313K330J585J119N09o29k071l088l242k876k558k347k002
61518C85523j664j794k354k593j976r31l18l85o99r88j457k101k332j722p60k77
61502C63172k79j03L44L33l98q87j23J498K670K813K478K242J979J370N45k5J
61485C77630N14R09N22n01j053l41R66J587J426J536K284K673J928P63K85M87
61469C91615N96M56N38Q88R56M71j87o25q80j107j251j132o76j0M86L94k24p02
61451C89606m52L33R80J148J035Q93P43N46L22J19R7M69J173J768J952K003K308
61434D05043K721K807K584K474K587K626K470K349K324K185J977K123K739L279
$$ plain form
61420 440288 443449 445870 447393 448193 448587 449000 449761 450791 451713 452313 452657 452681 452036 450630 449040 447999 447493
61403 447493 446678 444796 441972 439045 436787 435397 434534 433593 432024 429705 427153 425279 424784 425704 427379
61388 427379 428751 428894 427707 426209 425821 427104 429352 431628 433885 436711 440244 443909 447284 450657 454422
61373 454422 458302 461645 464331 466963 470040 473293 476076 478280 480503 483237 486193 488686 490589 492493
61359 492493 494889 497518 499806 501654 503525 505891 508927 512711 517484 523618 531410 540735 550754 560165
61345 560165 568078 574614 580472 586087 591450 596501 601153 604986 607473 608711 609539 610715 612203 613433
61331 613433 613980 613762 612744 610705 607390 602886 597869 593274 589561 586466 583622 581204 579617 578839 578631
61316 578631 579237 581261 584780 589143 593808 598896 604798 611762 620044 629964 641546 654552 669050 685413
$$ packed form
61420D40288L161K421J523Q00L94M13P61J030R22O00L44K4o45j406j590j041n06
61403D47493q15j882k824k927k258j390q63r41j569k319k552j874m95R20J675
61388D27379J372J43j187j498l88J283K248K276K257K826L533L665L375L373L765
61373D54422L880L343K686K632L077L253K783K204K223K734K956K493J903J904
61359D92493K396K629K288J848J871K366L036L784M773O134P792R325J0019R411
61345E60165P913O536N858N615N363N051M652L833K487J238Q28J176J488J230
61331F13433N47k18j018k039l315m504n017m595l713l095k844k418j587p78k08
61316E78631O06K024L519M363M665N088N902O964Q282R920J1582J3006J4498J6363
$$ plain form
61302 685413 703444 721932 739414 754985 768146 778434 785637 789944 791480 790100 786029 780221 773554
61289 773554 766093 757688 748838 740268 731950 723327 714354 705628 697611 690432 684357 679737 676402 673790
61275 673790 671818 671029 671711 673455 675797 678727 682270 686028 689548 692893 696523 700780 705685 711088 716878
61260 716878 723122 730063 737786 745964 754211 762608 771425 780244 787926 793727 797963 801149 802820 801879
61246 801879 798096 792628 786774 780583 773188 764431 755650 748509 743327 739011 734588 730257 726732 724122
61232 724122 721969 720109 718855 718462 718978 720677 724002 728924 734809 741187 748176 755853 763581 770539 776756
61217 776756 783150 790479 798588 806767 814568 822076 829474 836603 843101 848882 854268 859531 864500 868836
61203 868836 872636 876494 880985 886426 893211 902025 913374 927026 942213 958441 975955 995349 1016814
$$ packed form
61302F85413J8031J8488J7482J5571J3161J0288P203M307J536j380m071n808o667
61289G73554p461q405q850q570q318q623q973q726q017p179o075m620l335k612
61275F73790j972p89O82J744K342K930L543L758L520L345L630M257M905N403N790
61260G16878O244O941P723Q178Q247Q397Q817Q819P682N801M236L186J671r41
61246H01879l783n468n854o191p395q757q781p141n182m316m423m331l525k610
61232G24122k153j860j254l93N16J699L325M922N885O378O989P677P728O958O217
61217G76756O394P329Q109Q179P801P508P398P129O498N781N386N263M969M336
61203H68836L800L858M491N441O785Q814J1349J3652J5187J6228J7514J9394K1465
$$ plain form
61190 1016814 1039658 1062412 1083350 1101166 1115413 1126419 1134740 1140648 1144149 1145425 1145072 1143769 1141673
61177 1141673 1138242 1132656 1124447 1113882 1101865 1089391 1076810 1063579 1048819 1032146 1013906 994814
61165 994814 975595 956816 938609 920511 902000 883285 865190 848217 832201 817028 803124
61154 803124 790837 779856 769816 761113 754535 750265 747834 746908 747466 749111 750773 751335 750254 747444
61140 747444 742903 736662 729004 720599 712390 705247 699582 695388 692707 691852 693006 695945 700396 706466
61126 706466 714440 724500 736912 752099 770077 790163 811776 835164 860768 888172 916476 945438
61114 945438 975389 1006093 1036671 1066729 1096620 1126279 1154679 1180923 1205184 1228017 1249223
61103 1249223 1267906 1283310 1295151 1303422 1308203 1309392 1306389 1298418 1285403 1268184 1247653 1224092
$$ packed form
61190A016814K2844K2754K0938J7816J4247J1006Q321N908L501J276l53j303k096
61177A141673l431n586q209j0565j2017j2474j2581j3231j4760j6673j8240j9092
61165I94814j9219j8779j8207j8098j8511j8715j8095j6973j6016j5173j3904
61154H03124j2287j0981j0040q703o578m270k431r26N58J645J662N62j081k810
61140G47444m541o241p658q405q209p143n665m194k681q55J154K939M451O070
61126G06466P974J0060J2412J5187J7978K0086K1613K3388K5604K7404K8304K8962
61114I45438K9951L0704L0578L0058K9891K9659K8400K6244K4261K2833K1206
61103A249223J8683J5404J1841Q271M781J189l003p971j3015j7219k0531k3561
$$ plain form
61091 1224092 1197600 1168653 1137930 1106022 1073701 1042028 1011700 982553 954104 926342 899632
61080 899632 874156 849920 827170 806383 787861 771559 757192 744400 733016 723319 715775 710401
61068 710401 706585 703582 700897 698326 696190 695509 697119 700395 703624 706008 708503 712298 717378 723294
61054 723294 730409 739342 749725 760659 772085 784798 799332 815672 833794 853524 874174 895331
61042 895331 917894 943224 971259 1000380 1029087 1056835 1083353 1108496 1133087 1158654 1185760
61031 1185760 1213459 1240873 1268315 1296356 1324853 1353672 1383542 1415288 1448848 1483826 1520356
61020 1520356 1558537 1597625 1636859 1676882 1719478 1766222 1818275 1877203 1944805 2022015 2108893
61009 2108893 2205964 2314964 2438378 2579252 2741805 2931665 3155560 3421748 3740833 4124890
$$ packed form
61091A224092k6492k8947l0723l1908l2321l1673l0328k9147k8449k7762k6710
61080H99632k5476k4236k2750k0787j8522j6302j4367j2792j1384r697p544n374
61068G10401l816l003k685k571k136o81J610L276L229K384K495L795N080N916
61054G23294P115Q933J0383J0934J1426J2713J4534J6340J8122J9730K0650K1157
61042H95331K2563K5330K8035K9121K8707K7748K6518K5143K4591K5567K7106
61031A185760K7699K7414K7442K8041K8497K8819K9870L1746L3560L4978L6530
61020A520356L8181L9088L9234M0023M2596M6744N2053N8928O7602P7210Q6878
61009B108893R7071J09000J23414J40874J62553J89860K23895K66188L19085L84057
$$ plain form
60999 4124890 4585498 5134252 5786379 6563313 7492966 8612504 9972225 11622962 13572387
60990 13572387 15732233 17911340 19884394 21493070 22696970 23542592 24104266 24465202
60982 24465202 24732765 25022961 25390116 25766127 25985955 25887782 25396723 24526971 23329012
60973 23329012 21852343 20151704 18306027 16414589 14572276 12848441 11282243 9888486
60965 9888486 8665210 7600869 6680798 5890848 5217393 4646346 4163463 3755320 3409586
60956 3409586 3115062 2862324 2644277 2455485 2290986 2146206 2017928 1904591 1805178 1718085
60946 1718085 1641218 1572731 1511075 1454535 1401286 1350037 1300365 1252428 1206601 1163228 1122249
60935 1122249 1083113 1045507 1010085 977803 948517 921054 894992 871466 851522 834389 818343
$$ packed form
60999D124890M60608N48754O52127P76934R29653J119538J359721J650737J949425
60990A3572387K159846K179107J973054J608676J203900Q45622N61674L60936
60982B4465202K67563K90196L67155L76011K19828r8173m91059q69752j197959
60973B3329012j476669j700639j845677j891438j842313j723835j566198j393757
60965I888486j223276j064341r20071p89950o73455n71047m82883m08143l45734
60956C409586k94524k52738k18047j88792j64499j44780j28278j13337r9413q7093
60946A718085p6867o8487o1656n6540n3249n1249m9672m7937m5827m3373m0979
60935A122249l9136l7606l5422l2282k9286k7463k6062k3526j9944j7133j6046
$$ plain form
60924 818343 802860 788912 777322 767768 759458 751809 744247 736135 727358 718469 710053 702452 696148
60911 696148 691663 688730 686247 683458 680639 678248 676066 673671 671169 668815 666351 663318 659664 655564
60897 655564 651072 646497 642614 639789 637243 633972 630092 626557 623858 621846 620626 620609 621717 623390 625470
60882 625470 628251 631564 634650 637118 639263 641314 643211 645326 648495 652879 657594 661935 666289 671336
60868 671336 677006 682777 688445 694027 699477 705102 711716 719693 728325 736870 745816 756233 768080 780053
60854 780053 791173 801753 812652 824209 836121 847896 859125 869693 879970 890629 902095
60843 902095 914243 926588 938595 949882 960299 969890 978661 986509 993481 999899 1006064 1012047 1017998
60830 1017998 1024399 1031637 1039438 1047106 1054241 1060968 1067521 1073862 1079605 1084064 1086499 1086631 1084785 1081329
$$ packed form
60924H18343j5483j3948j1590r554q310p649p562q112q777q889q416p601o304
60911F96148m485k933k483k789k819k391k182k395k502k354k464l033l654m100
60897F55564m492m575l883k825k546l271l880l535k699k012j220j7J108J673K080
60882F25470K781L313L086K468K145K051J897K115L169M384M715M341M354N047
60868F71336N670N771N668N582N450N625O614P977Q632Q545Q946J0417J1847J1973
60854G80053J1120J0580J0899J1557J1912J1775J1229J0568J0277J0659J1466
60843I02095J2148J2345J2007J1287J0417R591Q771P848O972O418O165N983N951
60830A017998O401P238P801P668P135O727O553O341N743M459K435J32j846l456
$$ plain form
60816 1081329 1076157 1069045 1060277 1050427 1039648 1027693 1014615 1000983 987316 973663 959827 945667
60804 945667 931139 916414 902002 888425 875670 863299 851168 839683 829211 819585 810363 801300
60792 801300 792346 783402 774331 765183 756246 747926 740502 733876 727573 721199 714864 708918 703280 697312
60778 697312 690432 682624 674279 665768 657262 648690 639765 630317 620748 611923 604383 597867 591809 586115
60764 586115 581148 576999 573162 569078 564793 560799 557304 553966 550467 547057 544140 541457 538242 534357
60750 534357 530785 528553 527498 526627 525457 524414 523930 523837 523834 523897 523787 522676 519971 516383 513534 512265 511755
60733 511755 510583 508378 505943 503930 502015 499689 497382 496169 496447 497467 498250 498380 497681 495751 492406
60718 492406 488263 484270 480739 477316 473787 470306 466847 463045 458819 454689 451110 447810 444153 440023
$$ packed form
60816A081329n172p112q768r850j0779j1955j3078j3632j3667j3653j3836j4160
60804I45667j4528j4725j4412j3577j2755j2371j2131j1485j0472r626r222r063
60792H01300q954q944r071r148q937q320p424o626o303o374o335n946n638n968
60778F97312o880p808q345q511q506q572q925r448r569q825p540o516o058n694
60764E86115m967m149l837m084m285l994l495l338l499l410k917k683l215l885
60750E34357l572k232j055q71j170j043m84r3lO3j10j111k705l588k849j269n10
60733E11755j172k205k435k013j915k326k307j213K78J020P83J30o99j930l345
60718D92406m143l993l531l423l529l481l459l802m226m130l579l300l657m130
$$ plain form
60704 440023 436066 433021 431005 429478 427821 425915 424140 422848 421956 421126 420217 419434 419095 419398 420269 421316
60688 421316 422026 422222 422236 422537 423302 424519 426206 428216 430043 431355 432699 435226 439541 445067 450624 455381
60672 455381 459191 462317 465156 468094 471415 475150 478929 482080 484143 485394 486611 488241 490059 491788
60658 491788 493585 495609 497586 499336 501312 503933 506656 508504 509457 510526 512377 514585 516447 517803
60644 517803 518799 519409 519524 519042 517658 515049 511485 507765 504254 500486 495995 491006 486015 481161 476473
60629 476473 472255 468738 465672 462723 460007 457869 456397 455528 455302 455541 455576 454805 453415 452150 451447 451126
60613 451126 450781 450096 448915 447399 446037 445223 444900 444843 445087 445767 446689 447447 447868 448050 448063 447878 447522 447072
60595 447072 446614 446454 447093 448695 450736 452565 454089 455612 457262 459104 461620 465334 469878 473997 476780
$$ packed form
60704D40023l957l045k016j527j657j906j775j292q92q30r09p83l39L03Q71J047
60688D21316P10J96J4L01P65J217J687K010J827J312J344K527M315N526N557M757
60672D55381L810L126K839K938L321L735L779L151K063J251J217J630J818J729
60658D91788J797K024J977J750J976K621K723J848R53J069J851K208J862J356
60644E17803R96O10J15m82j384k609l564l720l511l768m491m989m991m854m688
60629D76473m218l517l066k949k716k138j472q69k26K39L5p71j390j265p03l21
60613D51126l45o85j181j516j362q14l23n7K44O80R22P58M21J82J3j85l56m50
60595D47072m58j60O39J602K041J829J524J523J650J842K516L714M544M119K783
$$ plain form
60580 476780 478468 479810 481036 481855 482237 482747 484007 486152 488952 492309 496335 500947 505745 510575 516009
60565 516009 522843 531204 540640 551034 562810 575937 589381 601970 613333 623385 631365 636192
60553 636192 637642 636536 633792 629882 625156 620062 614934 610074 606094 603597 602475 602163 602746 605114 609762
60538 609762 616129 623579 632475 643706 657559 673643 691511 710611 729783 747535 762836 775058
60526 775058 783277 786536 785205 781350 777062 772628 766892 759225 750530 742265 735086 728730 722836 717383
60512 717383 712445 707979 704033 700982 699391 699630 701575 704603 707913 711100 714530 719147 725888 735376
60498 735376 748084 764519 785047 809661 838126 870380 906650 947062 991229 1038209 1086820
60487 1086820 1135846 1183874 1229052 1269264 1302706 1328299 1345597 1354444 1354774 1346464 1329178 1302614
$$ packed form
60580D76780J688J342J226Q19L82N10J260K145K800L357M026M612M798M830N434
60565E16009O834Q361R436J0394J1776J3127J3444J2589J1363J0052P980M827
60553F36192J450j106k744l910m726n094n128m860l980k497j122l12N83K368M648
60538F09762O367P450Q896J1231J3853J6084J7868J9100J9172J7752J5301J2222
60526G75058Q219L259j331l855m288m434n736p667q695q265p179o356n894n453
60512G17383m938m466l946l051j591K39J945L028L310L187L430M617O741R488
60498G35376J2708J6435K0528K4614K8465L2254L6270M0412M4167M6980M8611
60487A086820M9026M8028M5178M0212L3442K5593J7298Q847L30q310j7286k6564
$$ plain form
60475 1302614 1267281 1224995 1178262 1129205 1079251 1029629 981551 935815 892745 852728 816307
60464 816307 783484 753463 725584 700201 678158 659552 643469 628811 615025 602122 590475
60453 590475 580593 572640 566025 559749 553284 546964 541475 537206 534086 531753 529753 527778 525845 524142
60439 524142 522698 521337 519929 518454 516788 514711 512270 509907 508021 506563 505286 504337 504252 505201 506397
60424 506397 506573 505198 503098 501707 501778 502966 504560 506240 507987 509615 510782 511409 511794 512253 512804 513255
60408 513255 513517 513765 514306 515270 516516 517915 519608 521743 523965 525534 526185 526579 527666 529818 532833 536488
60392 536488 540590 544616 547888 550270 552345 554680 557213 559612 561960 564719 568049 571506 574549 577096
60378 577096 579355 581243 582394 582872 583555 585411 588427 591571 593862 595197 596045 596678 596947 596688 596083 595651
$$ packed form
60475A302614l5333m2286m6733m9057m9954m9622m8078m5736m3070m0017l6421
60464H16307l2823l0021k7879k5383k2043j8606j6083j4658j3786j2903j1647
60453E90475r882p953o615o276o465o320n489m269l120k333k000j975j933j703
60439E24142j444j361j408j475j666k077k441k363j886j458j277r49q5R49J196
60424E06397J76j375k100j391P1J188J594J680J747J628J167O27L85M59N51M51
60408E13255K62K48N41R64J246J399J693K135K222J569O51L94J087K152L015L655
60392E36488M102M026L272K382K075K335K533K399K348K759L330L457L043K547
60378E77096K259J888J151M78O83J856L016L144K291J335Q48O33K69k59o05m32
$$ plain form
60362 595651 595892 596826 597851 598270 598059 597963 598764 600629 603195 605936 608293 609784 610371 610625 611331 612979 615751
60345 615751 619704 624754 630659 637163 643985 650552 656081 660205 663187 665213 665797 664296 660784 656012
60331 656012 650670 645107 639555 634160 628844 623546 618532 614153 610403 607084 604146 601469 598634 595572
60317 595572 593201 592544 593189 593493 592584 591336 591003 591670 592733 594325 597385 602455 609135 616808 625469 635756
60301 635756 648547 664524 683684 705072 727208 748864 769248 787473 802280 812579 818029 818789
60289 818789 814942 806610 794600 780378 765186 749565 733976 719365 706465 694789 683048 670690
60277 670690 658363 646784 635861 625320 615513 606966 599494 592400 585342 578484 572018 566121 561279
60264 561279 558008 556166 554973 553773 552393 550838 549131 547546 546528 546187 546130 545911 545438 544927 544723 545104
$$ packed form
60362E95651K41R34J025M19k11r6Q01J865K566K741K357J491N87K54P06J648K772
60345F15751L953N050N905O504O822O567N529M124K982K026N84j501l512m772
60331F56012n342n563n552n395n316n298n014m379l750l319k938k677k835l062
60317E95572k371o57O45L04r09j248l33O67J063J592L060N070O680P673Q661J0287
60301F35756J2791J5977J9160K1388K2136K1656K0384J8225J4807J0299N450P60
60289H18789l847q332j2010j4222j5192j5621j5589j4611j2900j1676j1741j2358
60277F70690j2327j1579j0923j0541r807q547p472p094p058o858o466n897m842
60264E61279l271j842j193j200j380j555j707j585j018l41n7k19m73n11k04L81
$$ plain form
60248 545104 545961 546692 546746 546218 545602 545079 544466 543786 543371 543296 543233 543011 542928 543304 544082 545043 546197 547885 550645
60229 550645 554896 560367 565964 570651 574469 578237 582360 586553 590781 595666 601642 608326 615140 622031
60215 622031 629164 636419 643707 651410 659947 669107 678263 687047 695455 703521 711352 719302 727582 735768
60201 735768 743100 749306 754805 760053 764991 769145 772059 773614 774102 773974 773404 772132 769822 766441 762162
60186 762162 757069 751225 744950 738812 733259 728311 723586 718592 713211 707947 703554 700254 697471 694416
60172 694416 690785 686830 682968 679598 677108 675724 675282 675248 675005 674180 672852 671517 670646 670154 669484 668334
60156 668334 667150 666679 667145 668069 668908 669705 670978 673049 675621 678159 680653 683706 687683 692048 695948
60141 695948 699338 703070 707811 713349 719082 724847 730946 737587 744560 751428 757926 764193 770517 776736
$$ packed form
60248E45104Q57P31N4n28o16n23o13o80m15p5o3k22q3L76P78R61J154J688K760
60229E50645M251N471N597M687L818L768M123M193M228M885N976O684O814O891
60215F22031P133P255P288P703Q537R160R156Q784Q408Q066P831P950Q280Q186
60201G35768P332O206N499N248M938M154K914J555M88j28n70j272k310l381m279
60186G62162n093n844o275o138n553m948m725m994n381n264m393l300k783l055
60172F94416l631l955l862l370k490j384m42l4k43q25j328j335q71m92o70j150
60156F68334j184m71M66R24Q39P97J273K071K572K538K494L053L977M365L900
60141F95948L390L732M741N538N733N765O099O641O973O868O498O267O324O219
$$ plain form
60127 776736 782101 786039 788945 791726 794613 796959 798319 799131 800073 801238 802314 803194 804014 804806 805429 805703
60111 805703 805401 804348 802656 800601 798151 794974 791080 787004 783129 779240 775056 770731 766480 762206
60097 762206 758049 754896 753641 754067 755012 755535 755470 755001 754359 754016 754592 756259 758507 760664 762484 764115
60081 764115 765692 767074 767939 768100 767706 767040 766128 764708 762543 759442 754921 748349 739751 730128 720579
60066 720579 711340 702055 692772 684131 676557 669653 662547 654754 646746 639741 634740 631619 629338 627108
60052 627108 625019 623405 622163 621177 621045 622737 626577 631971 638086 644461 651047 658037 665628 673649 681485
60037 681485 688557 694682 699739 703305 704977 704830 703187 700158 695882 690873 685594 679788 672799 664468
60023 664468 655184 645268 634940 624778 615447 606889 598476 590154 582736 576797 571930 567484 563523 560452
$$ packed form
60127G76736N365L938K906K781K887K346J360Q12R42J165J076Q80Q20P92O23K74
60111H05703l02j053j692k055k450l177l894m076l875l889m184m325m251m274
60097G62206m157l153j255M26R45N23o5m69o42l43N76J667K248K157J820J631
60081G64115J577J382Q65J61l94o66r12j420k165l101m521o572q598r623r549
60066G20579r239r285r283q641p574o904p106p793q008p005n001l121k281k230
60052F27108k089j614j242r86j32J692L840N394O115O375O586O990P591Q021P836
60037F81485P072O125N057L566J672j47j643l029m276n009n279n806o989q331
60023F64468r284r916j0328j0162r331q558q413q322p418n939m867m446l961l071
$$ plain form
60009 560452 558101 555752 553041 550437 548799 548657 549933 552189 555071 558438 562038 565240 567424 568661
59995 568661 569721 571355 573770 576837 580513 584925 590186 596279 602977 609930 616938 624045 631158 637613
59981 637613 642460 645230 646223 646112 645487 644718 643826 642418 640049 636781 633184 629857 627191 625511 624919 624975
59965 624975 624983 624839 625222 626749 629266 632148 634955 637561 639926 642060 643986 645518 646267 646089 645369 644641
59949 644641 644099 643656 643282 642986 642620 641966 640959 639636 637904 635557 632517 628926 625001 620890 616606 612046
59933 612046 607196 602387 598279 595473 594198 594386 595833 598149 600743 603168 605482 608100 611269 614898
59919 614898 618940 623672 629374 635877 642702 649557 656369 662779 668052 671903 675213 679473 685442 692583
59905 692583 699717 705836 710386 713372 715451 717424 719304 720251 719653 717845 715437 712459 708734 704716 701309
$$ packed form
60009E60452k351k349k711k604j638j42J276K256K882L367L600L202K184J237
59995E68661J060J634K415L067L676M412N261O093O698O953P008P107P113O455
59981F37613M847K770R93j11o25p69q92j408k369l268l597l327k666j680n92N6
59965F24975Qj44L83J527K517K882K807K606K365K134J926J532P49j78p20p28
59949F44641n42m43l74k96l66o54j007j323j732k347l040l591l925m111m284m560
59933F12046m850m809m108k806j275J88J447K316K594K425K314K618L169L629
59919F14898M042M732N702O503O825O855O812O410N273L851L310M260N969P141
59905F92583P134O119M550K986K079J973J880R47n98j808k408k978l725m018l407
$$ plain form
59890 701309 698958 697487 696683 696503 696863 697857 700116 704279 710011 716115 721790 727290 733269 739984 747316
59875 747316 755061 762865 770207 776672 781981 785686 787212 786415 783792 779993 775442 770536 765717 761090
59861 761090 756272 750896 745054 739068 733131 727322 721737 716391 711245 706458 702404 699314 697164 695979
59847 695979 695921 697014 699164 702596 707793 714774 722779 730915 738759 746134 752752 758461 763529 768307 772825
59832 772825 777035 781115 785159 788805 791550 793200 793648 792477 789250 784056 777352 769405 760331 750587
59818 750587 740892 731656 722865 714552 706966 700241 694333 689354 685532 682624 679824 676622 673521 671477
59804 671477 670689 670328 669507 668198 666933 665829 664305 661779 658318 654359 650002 644890 638760 631874 624885
59789 624885 618480 613076 608613 604590 600549 596556 592972 589793 586636 583511 581120 580020 579820 579614 579050
$$ packed form
59890G01309k351j471q04j80L60R94K259M163N732O104N675N500N979O715P332
59875G47316P745P804P342O465N309L705J526p97k623l799m551m906m819m627
59861G61090m818n376n842n986n937n809n585n346n146m787m054l090k150j185
59847F95979n8J093K150L432N197O981Q005Q136P844P375O618N709N068M778M518
59832G72825M210M080M044L646K745J650M48j171l227n194o704p947r074r744
59818G50587r695r236q791q313p586o725n908m979l822k908k800l202l101k044
59804F71477p88l61q21j309j265j104j524k526l461l959m357n112o130o886o989
59789F24885o405n404m463m023m041l993l584l179l157l125k391j100k00k06n64
$$ plain form
59774 579050 578523 578386 578504 578785 579686 581773 584843 587871 590022 591499 593180 595523 598221 601052 604621
59759 604621 609816 616654 624128 631202 637614 643638 649538 655478 661634 668037 674402 680376 685974 691665
59745 691665 697999 705080 712258 718497 723271 727051 730618 734022 736657 738299 739453 740506 741211 741365 741454
59730 741454 742061 743090 744166 745516 747734 750733 753588 755501 756449 756858 757177 757900 759439 761617 763619
59715 763619 764786 765300 765841 766849 768367 770412 773051 776132 779319 782472 785830 789633 793773 797909 801802
59700 801802 805437 808974 812738 817126 822238 827637 832648 836945 840654 843940 846781 849151 851034 852098
59686 852098 851757 849897 847270 844803 842736 840760 838748 836798 834667 831751 827759 822963 817725 812148
59672 812148 806293 800332 794310 788090 781668 775257 768978 762815 757004 752065 748285 745558 743838 743277
$$ packed form
59774E79050n27j37J18K81R01K087L070L028K151J477J681K343K698K831L569
59759F04621N195O838P474P074O412O024N900N940O156O403O365N974N598N691
59745F91665O334P081P178O239M774L780L567L404K635J642J154J053P05J54Q9
59730G41454O07J029J076J350K218K999K855J913R48M09L19P23J539K178K002
59715G63619J167N14N41J008J518K045K639L081L187L153L358L803M140M136L893
59700H01802L635L537L764M388N112N399N011M297L709L286K841K370J883J064
59686H52098l41j860k627k467k067j976k012j950k131k916l992m796n238n577
59672H12148n855n961o022o220o422o411o279o163n811m939l780k727j720n61
$$ plain form
59658 743277 743649 744176 744417 745001 746943 750391 754531 758633 762689 766912 770989 774057 775303 774494 771999
59643 771999 768333 763661 757800 750672 742609 734190 725984 718480 711982 706342 701056 695883 691183 687363
59629 687363 684114 680578 676310 671745 667590 663988 660503 656784 652933 649134 645234 640986 636572 632423
59615 632423 628472 624116 619227 614761 611833 610458 609746 609146 608850 609060 609605 610450 611907 613996 616104 617600
59599 617600 618388 618596 618132 616897 615138 613320 611896 611341 611967 613425 614768 615316 615116 614372 612991 611101
59583 611101 609474 608789 608690 608123 606473 603933 600980 597990 595212 592583 589593 585861 581873 578732 576995
59568 576995 576094 575016 573372 571638 570534 570269 570348 570018 568929 567410 566214 566044 567180 569282 571540 573221
59552 573221 574179 574861 575987 578274 582033 586608 590591 593206 595278 598247 602478 607438 613241 620892 630951
$$ packed form
59658G43277L72N27K41N84J942L448M140M102M056M223M077L068J246q09k495
59643G71999l666m672n861p128q063q419q206p504o498n640n286n173m700l820
59629F87363l249l536m268m565m155l602l485l719l851l799l900m248m414m149
59615F32423l951m356m889m466k928j375p12o00k96K10N45Q45J457K089K108J496
59599F17600P88K08m64j235j759j818j424n55O26J458J343N48k00p44j381j890
59583F11101j627o85r9n67j650k540k953k990k778k629k990l732l988l141j737
59568E76995r01j078j644j734j104k65P9l30j089j519j196j70J136K102K258J681
59552E73221R58O82J126K287L759M575L983K615K072K969M231M960N803P651J0059
$$ plain form
59537 630951 643221 657966 675854 695862 714603 729077 739322 747241 753604 757602 758859 758413 757670
59524 757670 757498 758376 760446 763313 766488 769908 773290 775309 774514 770992 766055 760310 753105 743998 733568
59509 733568 722460 710645 698120 685436 673093 661171 650040 640619 633336 627498 622244 617616
59497 617616 614169 612057 611048 610969 611586 612455 613391 614718 616584 618473 619961 621542 624033 627428 630980
59482 630980 634231 637310 640360 643432 647035 652068 658849 666627 674315 681362 687720 693310 697972 701717
59468 701717 704661 706693 707547 707294 706520 705935 706000 706968 709051 712312 716644 722134 729233 738200 748554 759556
59452 759556 771139 783702 796902 809414 820283 829916 839150 847727 854316 857768 857765 854493 848384 840213
59438 840213 830830 820712 810073 799333 789012 779197 769656 760485 752153 744805 738030 731575 725970
$$ packed form
59537F30951J2270J4745J7888K0008J8741J4474J0245P919O363L998J257m46p43
59524G57670j72Q78K070K867L175L420L382K019p95l522m937n745p205r107j0430
59509G33568j1108j1815j2525j2684j2343j1922j1131r421p283n838n254m628
59497F17616l447k112j009p9O17Q69R36J327J866J889J488J581K491L395L552
59482F30980L251L079L050L072L603N033O781P778P688P047O358N590M662L745
59468G01717K944K032Q54k53p74n85O5R68K083L261M332N490P099Q967J0354J1002
59452G59556J1583J2563J3200J2512J0869R633R234Q577O589L452ll272o109q171
59438H40213r383j0118j0639j0740j0321r815r541r171q332p348o775o455n605
$$ plain form
59425 725970 722163 720675 721243 723261 726614 732081 740715 752678 767009 782677 799422 817309 836181
59412 836181 856264 878543 903158 927421 946672 957635 960391 956973 949044 937415 922958 907228
59400 907228 892566 881988 878039 880639 886131 889399 887338 880107 869294 855654 838955 819443 798676
59387 798676 778712 760802 745050 731077 718552 707252 697204 689011 683488 680563 679028 677895
59375 677895 677609 679182 682468 686161 689510 693132 697893 703697 709789 715731 721601 727618 733933 740638
59361 740638 747718 755143 763105 771983 782029 793270 805698 819274 833796 849112 865417 883041
59349 883041 902022 922291 944101 967636 992176 1016265 1038914 1060144 1080178 1098575 1114342
59338 1114342 1126523 1134490 1138060 1137521 1133353 1125851 1115271 1102142 1086955 1069720 1050491 1030178
$$ packed form
59425G25970l807j488N68K018L353N467Q634J1963J4331J5668J6745J7887J8872
59412H36181K0083K2279K4615K4263J9251J0963K756l418p929j1629j4457j5730
59400I07228j4662j0578l949K600N492L268k061p231j0813j3640j6699j9512k0767
59387G98676j9964j7910j5752j3973j2525j1300j0048q193n523k925j535j133
59375F77895k86J573L286L693L349L622M761N804O092N942N870O017O315O705
59361G40638P080P425P962Q878J0046J1241J2428J3576J4522J5316J6305J7624
59349H83041J8981K0269K1810K3535K4540K4089K2649K1230K0034J8397J5767
59338A114342J2181P967L570n39m168p502j0580j3129j5187j7235j9229k0313
$$ plain form
59326 1030178 1010101 990710 971557 952553 934337 917199 900707 884924 871026 859962 851197
59315 851197 843520 836516 830443 825129 819938 814730 810094 806606 804309 802921 802145 801802 801906 802618 804031
59300 804031 806212 809477 814246 820443 827501 835309 844745 856862 871707 888053 903893 917026 925760
59287 925760 929623 929198 925048 917211 906015 892822 879443 867160 856727 848802 843726 841130 840457
59274 840457 841827 845945 853217 863276 875197 887930 900742 913539 926436 938792 949099 956251
59262 956251 960494 962577 962428 959366 953337 945122 935342 923953 910878 896607 881981 867705 854148
59249 854148 841367 829280 818068 808347 800680 794996 790729 787488 785356 784634 785504 787834 791173 795026
59235 795026 799286 804186 809659 815063 819752 823549 826330 827536 826625 823762 819542 814159 807375 799257
$$ packed form
59326A030178k0077j9391j9153j9004j8216j7138j6492j5783j3898j1064q765
59315H51197p677p004o073n314n191n208m636l488k297j388p76l43J04P12J413
59300H04031K181L265M769O197P058P808R436J2117J4845J6346J5840J3133Q734
59287I25760L863m25m150p837j1196j3193j3379j2283j0433p925n076k596o73
59274H40457J370M118P272J0059J1921J2733J2812J2797J2897J2356J0307P152
59262I56251M243K083j49l062o029q215r780j1389j3075j4271j4626j4276j3557
59249H54148j2781j2087j1212r721p667n684m267l241k132p22Q70K330L339L853
59235G95026M260M900N473N404M689L797K781J206r11k863m220n383o784q118
$$ plain form
59221 799257 790413 781418 772426 763490 754928 747201 740580 735066 730545 726942 724236 722331 721040 720353
59207 720353 720648 722285 724972 727913 730731 733932 738282 744047 750964 758557 766188 773155 779075 784029
59193 784029 788237 791864 795219 798615 801844 804276 805765 806957 808409 809957 811283 812498 813593 813987
59179 813987 813399 812731 813217 814862 816543 817546 818275 819442 821350 824173 828338 834223 841683 850080 858696
59164 858696 867118 875400 883852 892627 901521 910108 917716 923330 926088 926141 924521 921819 917488 910865 902387
59149 902387 893177 883797 874038 863704 853042 842560 832852 824347 816768 809111 800753 792328 784930
59136 784930 778684 772776 766751 761023 756049 751704 747718 744273 741825 740497 739846 739305 738916 739538 742042
59121 742042 746339 751677 757938 765970 776353 788562 801738 815550 829748 843634 856819 869968
$$ packed form
59221G99257q844q995q992q936q562p727o621n514m521l603k706j905j291o87
59207G20353K95J637K687K941K818L201M350N765O917P593P631O967N920M954
59193G84029M208L627L355L396L229K432J489J192J452J548J326J215J095L94
59179H13987n88o68M86J645J681J003P29J167J908K823M165N885P460Q397Q616
59164H58696Q422Q282Q452Q775Q894Q587P608N614K758N3j620k702m331o623q478
59149I02387r210r380r759j0334j0662j0482r708q505p579p657q358q425p398
59136G84930o246n908o025n728m974m345l986l445k448j328o51n41l89O22K504
59121G42042M297N338O261Q032J0383J2209J3176J3812J4198J3886J3185J3149
$$ plain form
59109 869968 883915 898387 912320 924999 936100 945082 951524 955787 958465 959516 958798 957084 955384
59096 955384 953503 950405 945898 940800 935463 929378 922423 915358 908820 902852 897696 893915 891245 888300
59082 888300 883954 878244 871479 863477 854259 844652 835373 826133 816423 806664 797775 789955 782683 775710
59068 775710 769301 763491 757726 751535 745173 739357 734423 729903 724986 719343 713374 707615 702174 696948
59054 696948 692033 687552 683315 679113 675245 672296 670422 669294 668617 668324 668374 668790 669754 671199 672536 673309
59038 673309 673924 675118 676873 678568 680068 681881 684218 686726 689307 692562 697232 703646 711769 721266
59024 721266 731635 742812 755484 770107 785804 801033 815105 828087 839472 848233 854299 858616
59012 858616 861464 862011 860038 856777 853310 849339 844494 839777 836661 835565 836299 839221 844643 851564 858363
$$ packed form
59109H69968J3947J4472J3933J2679J1101Q982O442M263K678J051p18j714j700
59096I55384j881l098m507n098n337o085o955p065o538n968n156l781k670k945
59082H88300m346n710o765q002r218r607r279r240r710r759q889p820p272o973
59068G75710o409n810n765o191o362n816m934m520m917n643n969n759n441n226
59054F96948m915m481m237m202l868k949j874j128o77k93N0M16R64J445J337P73
59038F73309O15J194J755J695J500J813K337K508K581L255M670O414Q123R497
59024G21266J0369J1177J2672J4623J5697J5229J4072J2982J1385Q761O066M317
59012H58616K848N47j973l261l467l971m845m717l116j096P34K922N422O921O799
$$ plain form
58997 858363 864662 871379 878911 886384 892913 898642 904061 908932 912496 914490 915479 916116 916281 915140 912140
58982 912140 907828 903380 899392 895627 892075 889696 889617 891953 895989 901356 908461 917704 928723 940701
58968 940701 953227 966650 981511 997741 1014560 1031183 1047413 1063461 1079375 1094898 1109542
58957 1109542 1122428 1132203 1137581 1137978 1133433 1124245 1111124 1095361 1078109 1059601 1039649 1018744
58945 1018744 997970 977957 958784 940844 924850 910919 898660 888463 881606 878554 878023 878352
58933 878352 879074 880492 882377 883900 884423 883617 881090 876555 870266 862911 855189 847699 840882 834770 829132
58918 829132 824080 820095 817229 814831 812419 810306 808953 808227 807783 807813 808928 811584 815992 822183 829780
58903 829780 838062 846728 856311 867528 880546 895204 911514 929488 948730 968658 988956 1009597
$$ packed form
58997H58363O299O717P532P473O529N729N419M871L564J994R89O37J65j141l000
58982I12140m312m448l988l765l552k379p9K336M036N367P105R243J1019J1978
58968I40701J2526J3423J4861J6230J6819J6623J6230J6048J5914J5523J4644
58957A109542J2886R775N378L97m545r188j3121j5763j7252j8508j9952k0905
58945A018744k0774k0013j9173j7940j5994j3931j2259j0197o857l052n31L29
58933H78352P22J418J885J523N23q06k527m535o289p355p722p490o817o112n638
58918H29132n052l985k866k398k412k113j353p26m44L0J115K656M408O191P597
58903H29780Q282Q666R583J1217J3018J4658J6310J7974J9242J9928K0298K0641
$$ plain form
58891 1009597 1030656 1052342 1074970 1098775 1124018 1151121 1180051 1209467 1237217 1261961 1283691
58880 1283691 1302474 1317462 1327548 1332211 1331280 1324653 1312842 1297124 1278563 1257464 1234317 1210429
58868 1210429 1186940 1163926 1141295 1119848 1100495 1083039 1066791 1051927 1039075 1027787 1016589
58857 1016589 1004654 992550 981268 971241 962348 954181 946187 938098 930227 922898 915679 907726 898772
58844 898772 889255 879547 869601 859275 848532 837422 826342 816130 807365 799718 792457 785458 779186
58831 779186 773864 769318 765545 762798 761036 759783 758605 757375 756241 755733 756699 759497 763329 766954 770090
58816 770090 773526 777770 782171 785609 787687 788950 790129 791354 792072 791725 790415 788698 786699 783906 780055
58801 780055 775744 771739 767981 763806 758932 753728 748642 743747 738816 733504 727606 721468 716077 712437
$$ packed form
58891A009597K1059K1686K2628K3805K5243K7103K8930K9416K7750K4744K1730
58880A283691J8783J4988J0086M663r31o627j1811j5718j8561k1099k3147k3888
58868A210429k3489k3014k2631k1447j9353j7456j6248j4864j2852j1288j1198
58857A016589j1935j2104j1282j0027q893q167p994q089p871p329p219p953q954
58844H98772r517r708r946j0326j0743j1110j1080j0212q765p647p261o999o272
58831G79186n322m546l773k747j762j253j178j230j134n08R66K798L832L625L136
58816G70090L436M244M401L438K078J263J179J225P18l47j310j717j999k793l851
58801G80055m311m005l758m175m874n204n086m895m931n312n898o138n391l640
$$ plain form
58787 712437 710928 711346 713261 716137 719519 723460 728469 734684 741423 747905 754078 760344 766733 772744
58773 772744 777720 781064 782345 781566 779031 774780 768574 760695 752181 743864 735727 727656 720122 713546
58759 713546 707632 702090 697490 694530 692973 692152 692106 693219 695049 696628 697830 699484 702070 705265 708916
58744 708916 713613 720008 728176 737868 748853 760755 772970 784960 796444 807369 818004 828905
58732 828905 840394 852127 863490 874251 884420 893663 901294 906717 909542 909518 906845 902397 897251
58719 897251 892125 887442 883510 880239 877154 874185 872046 871280 871360 871287 870608 869239 866793 862913 857908 852237
58703 852237 845567 837078 826461 813973 799848 784387 768316 752228 735957 719259 702806 687688
58691 687688 674241 662249 651918 643603 636693 629858 622459 614873 607534 600594 594437 589488 585430
$$ packed form
58787G12437j509M18J915K876L382L941N009O215O739O482O173O266O389O011
58773G72744M976L344J281p79k535m251o206p879q514q317q137q071p534o576
58759G13546n914n542m600k960j557q21m6J113J830J579J202J654K586L195L651
58744G08916M697O395Q168R692J0985J1902J2215J1990J1484J0925J0635J0901
58732H28905J1489J1733J1363J0761J0169R243P631N423K825k4k673m448n146
58719H97251n126m683l932l271l085k969k139p66Q0p3o79j369k446l880n005n671
58703H52237o670q489j0617j2488j4125j5461j6071j6088j6271j6698j6453j5118
58691F87688j3447j1992j0331q315o910o835p399p586p339o940o157m949m058
$$ plain form
58678 585430 581528 577821 575069 573420 572088 570574 569456 569685 571743 575632 581116 587872 595950 606025
58664 606025 618646 633365 649185 665458 681503 695729 706346 712942 716324 716899 714397 709237 702833
58651 702833 696070 688507 679576 669723 659893 650637 642125 634388 627225 620484 614609 610296 607531 605717
58637 605717 604768 605152 606687 608339 609513 610569 611668 612119 611451 610249 609223 608171 606587 604754 603510
58622 603510 603283 603936 605327 607539 610760 615208 620989 627873 635504 643951 653635 664561 675941 686721
58608 686721 696144 703815 709620 713662 715941 716210 714555 711877 709184 706550 703443 699909 696598 693675
58594 693675 690687 687668 685539 685168 686710 690094 695381 702411 710786 720507 732005 745261 759447 773724
58580 773724 787870 802002 816122 830040 843243 854813 864027 871099 876899 882118 887363 893808 902820
$$ packed form
58678E85430l902l707k752j649j332j514j118K29K058L889N484O756Q078J0075
58664F06025J2621J4719J5820J6273J6045J4226J0617O596L382N75k502n160o404
58651G02833o763p563q931r853r830r256q512p737p163o741n875m313k765j814
58637F05717r49L84J535J652J174J056J099M51o68j202j026j052j584j833j244
58622F03510k27O53J391K212L221M448N781O884P631Q447R684J0926J1380J0780
58608F86721R423P671N805M042K279K69j655k678k693k634l107l534l311k923
58594F93675k988l019k129l71J542L384N287P030Q375R721J1498J3256J4186J4277
58580G73724J4146J4132J4120J3918J3203J1570R214P072N800N219N245O445R012
$$ plain form
58567 902820 914862 929555 946798 967045 990492 1016962 1046574 1079441 1114427 1149073 1181137
58556 1181137 1209541 1233841 1253715 1269229 1280712 1288096 1291117 1290283 1286793 1281323 1273797 1264502 1254348
58543 1254348 1243621 1231372 1216475 1198578 1177753 1154032 1127708 1099457 1069822 1039224 1008616
58532 1008616 979427 952696 928817 908070 890578 875756 862769 851549 842425 834907 828031 821962
58520 821962 817861 815955 815059 814416 814676 816447 819071 821478 823242 824200 824021 822748 820947 818798 815891
58505 815891 812305 808930 806266 803829 801148 798363 795406 791680 787138 782784 779529 777384 776147 775941
58491 775941 776675 777959 779960 783319 787905 792873 798427 806282 817676 832097 848652 867527 889142
58478 889142 912842 937352 961816 985600 1007680 1026824 1041827 1051306 1054117 1050431 1041669 1029205
$$ packed form
58567I02820J2042J4693J7243K0247K3447K6470K9612L2867L4986L4646L2064
58556A181137K8404K4300J9874J5514J1483P384L021q34l490n470p526r295j0154
58543A254348j0727j2249j4897j7897k0825k3721k6324k8251k9635l0598l0608
58532A008616k9189k6731k3879k0747j7492j4822j2987j1220r124p518o876o069
58520H21962m101j906q96o43K60J771K624K407J764R58j79j273j801k149k907
58505H15891l586l375k664k437k681k785k957l726m542m354l255k145j237k06
58491G75941P34J284K001L359M586M968N554P855J1394J4421J6555J8875K1615
58478H89142K3700K4510K4464K3784K2080J9144J5003R479K811l686q762j2464
$$ plain form
58466 1029205 1013983 997359 980932 965254 950066 936045 924886 917285 912506 910492 912592 919298
58454 919298 928961 939839 951908 965390 978824 989921 997317 1000477 999101 993825 986427 978088 968274
58441 968274 956302 943039 930093 918266 907775 899055 892357 887378 884046 882693 882924 883603 884726
58428 884726 887929 894211 902527 911564 921466 932675 944479 955878 966547 975761 981846 984034 983588
58415 983588 981773 978055 971625 963242 954052 943902 932482 920827 909997 899427 888304 877495
58403 877495 868370 860660 853233 846147 840275 835728 832217 830117 829582 829415 828398 827004 826294 825997 825113
58388 825113 823462 821110 817204 811055 803558 796011 788547 781392 776669 776913 782289 790900 801279 813059
58374 813059 825933 839606 854272 869777 884957 899133 913393 929072 945892 963005 980790
$$ packed form
58466A029205j5222j6624j6427j5678j5188j4021j1159p601m779k014K100O706
58454I19298R663J0878J2069J3482J3434J1097P396L160j376n276p398q339r814
58441I68274j1972j3263j2946j1827j0491q720o698m979l332j353K31O79J123
58428H84726L203O282Q316R037R902J1209J1804J1399J0669R214O085K188m46
58415I83588j815l718o430q383r190j0150j1420j1655j0830j0570j1123j0809
58403H77495r125p710p427p086n872m547l511k100n35j67j017j394p10k97q84
58388H25113j651k352l906o149p497p547p464p155m723K44N376Q611J0379J1780
58374H13059J2874J3673J4666J5505J5180J4176J4260J5679J6820J7113J7785
$$ plain form
58363 980790 999947 1019764 1038890 1057051 1074557 1091077 1106312 1120756 1134245 1144982 1151585 1154933
58351 1154933 1156436 1155990 1153445 1150488 1148859 1147968 1146473 1144985 1145019 1146550 1148986 1153353 1160999 1171139 1182105
58336 1182105 1194129 1208482 1224741 1241390 1258305 1276255 1294673 1312149 1328292 1342926 1354591
58325 1354591 1362244 1367344 1371808 1375038 1375605 1374627 1374599 1375894 1377362 1379423 1383483 1389107 1394884 1401386 1410230
58310 1410230 1420841 1431247 1441556 1453552 1467317 1481295 1495322 1510605 1527022 1543353 1559781
58299 1559781 1577389 1595656 1613113 1629851 1646688 1662897 1677715 1693050 1711424 1732184 1753060
58288 1753060 1774425 1798400 1824767 1851515 1878657 1907630 1937711 1967003 1996277 2027890 2061566
58277 2061566 2095430 2130430 2169227 2211098 2252440 2292123 2332042 2372725 2413050 2454167 2499037
$$ packed form
58363I80790J9157J9817J9126J8161J7506J6520J5235J4444J3489J0737O603L348
58351A154933J503m46k545k957j629q91j495j488L4J531K436M367P646J0140J0966
58336A182105J2024J4353J6259J6649J6915J7950J8418J7476J6143J4634J1665
58325A354591P653N100M464L230N67r78k8J295J468K061M060N624N777O502Q844
58310A410230J0611J0406J0309J1996J3765J3978J4027J5283J6417J6331J6428
58299A559781J7608J8267J7457J6738J6837J6209J4818J5335J8374K0760K0876
58288A753060K1365K3975K6367K6748K7142K8973L0081K9292K9274L1613L3676
58277B061566L3864L5000L8797M1871M1342L9683L9919M0683M0325M1117M4870
$$ plain form
58266 2499037 2547961 2598974 2652529 2711137 2774458 2839507 2905720 2975026 3046915 3118296 3188289
58255 3188289 3258251 3327169 3392335 3454701 3518315 3584399 3651286 3720104 3794652 3875381 3959336
58244 3959336 4046387 4139666 4239598 4343648 4452351 4569333 4695005 4826623 4964898 5113853
58234 5113853 5273914 5442120 5619412 5810267 6014855 6229467 6455191 6697930 6959222
58225 6959222 7235822 7529203 7846329 8189963 8557697 8951769 9379825 9844598 10343404
58216 10343404 10879687 11464372 12104228 12800436 13560512 14399664 15328832 16354849 17494616
58207 17494616 18775540 20220996 21851970 23706056 25839137 28308933 31179681 34548130
58199 34548130 38544991 43310046 48992714 55780153 63895734 73572353 85074933 98769369
$$ packed form
58266B499037M8924N1013N3555N8608O3321O5049O6213O9306P1889P1381O9993
58255C188289O9962O8918O5166O2366O3614O6084O6887O8818P4548Q0729Q3955
58244C959336Q7051R3279R9932J04050J08703J16982J25672J31618J38275J48955
58234E113853J60061J68206J77292J90855K04588K14612K25724K42739K61292
58225F959222K76600K93381L17126L43634L67734L94072M28056M64773M98806
58216A0343404N36283N84685O39856O96208P60076Q39152R29168J026017J139767
58207A7494616J280924J445456J630974J854086K133081K469796K870748L368449
58199C4548130L996861M765055N682668O787439Q115581R676619J1502580J3694436
$$ plain form
58191 98769369 115151749 134847771 158651363 187419451 221442522 259392287 297786362
58184 297786362 331882114 357628916 373140543 378594129 375062404 363650221 345567796
58177 345567796 322556940 296845706 270550683 245093334 221093327 198681261 177860376
58170 177860376 158650418 141039614 124935852 110224407 96857714 84858918 74244841
58163 74244841 64969519 56933927 50015255 44076754 38976098 34586732 30808859 27557979
58155 27557979 24755145 22333189 20239880 18427436 16847104 15458374 14234124 13151471
58147 13151471 12185429 11315639 10530953 9822304 9177689 8588002 8050680 7563126 7118322
58138 7118322 6710432 6338791 6002700 5697546 5418924 5165133 4932673 4714707 4507043
$$ packed form
58191I8769369J6382380J9696022K3803592K8768088L4023071L7949765L8394075
58184B97786362L4095752K5746802J5511627N453586l531725j1412183j8082425
58177C45567796k3010856k5711234k6295023k5457349k4000007k2412066k0820885
58170A77860376j9209958j7610804j6103762j4711445j3366693j1998796j0614077
58163G4244841r275322q035592o918672n938501n100656m389366l777873l250880
58155B7557979k802834k421956k093309j812444j580332j388730j224250j082653
58147A3151471r66042q69790p84686p08649o44615n89687n37322m87554m44804
58138G118322m07890l71641l36091l05154k78622k53791k32460k17966k07664
$$ plain form
58129 4507043 4310840 4126837 3951852 3783515 3623433 3472880 3329967 3193626 3065860
58120 3065860 2947444 2835707 2729039 2629363 2537752 2451804 2369850 2293829 2225507 2163520 2106322
58109 2106322 2054357 2007128 1961811 1916941 1873963 1833221 1792133 1749371 1707099 1666845 1626797
58098 1626797 1585454 1544375 1504930 1465822 1426328 1388744 1355014 1323901 1293997 1266614 1243172
58087 1243172 1222391 1202571 1184166 1167772 1151931 1135225 1118343 1102050 1085321 1067396 1049296
58076 1049296 1031440 1012145 990429 967925 946120 924162 901446 879876 861264 844636 828303
58065 828303 812624 798604 785844 774002 764284 757321 751324 744411 737040 730299 723680 716442 709318
58052 709318 702825 695766 687439 679487 673394 667933 661318 654206 648253 643196 637733 631980 626767 621634
$$ packed form
58129D507043j96203j84003j74985j68337j60082j50553j42913j36341j27766
58120C065860j18416j11737j06668r9676r1611q5948q1954p6021o8322o1987n7198
58109B106322n1965m7229m5317m4870m2978m0742m1088m2762m2272m0254m0048
58098A626797m1343m1079l9445l9108l9494l7584l3730l1113k9904k7383k3442
58087A243172k0781j9820j8405j6394j5841j6706j6882j6293j6729j7925j8100
58076A049296j7856j9295k1716k2504k1805k1958k2716k1570j8612j6628j6333
58065H28303j5679j4020j2760j1842r718o963n997o913p371o741o619p238p124
58052G09318o493p059q327p952o093n461o615p112n953n057n463n753n213n133
$$ plain form
58038 621634 615713 609545 603990 598370 591686 584639 578441 572608 565875 558437 551350 544585 537498 530386
58024 530386 523816 517194 509783 502319 495923 490228 484287 478485 473757 469682 465282 461099 458562 457631
58010 457631 456757 454934 452364 449492 446845 445434 445896 447480 449019 450494 452515 454899 457137 459738 463773
57995 463773 469401 476065 483664 492367 501636 510644 519254 527503 534552 539309 541712 542334 541142 537727
57981 537727 532454 526395 520364 514705 509528 504383 498321 491112 483813 477383 471454 465322 459275 453954
57967 453954 449221 444766 441053 438522 436558 434436 432626 432038 432585 433616 435084 437141 439253 440949 442847
57952 442847 445695 448905 451252 452470 453074 453273 453337 454377 457340 461681 466343 471522 478047 485520 492690
57937 492690 499405 506619 514580 522513 530162 538201 546874 555311 562435 567647 570622 571356 570379 568048 563784
$$ packed form
58038F21634n921o168n555n620o684p047o198n833o733p438p087o765p087p112
58024E30386o570o622p411p464o396n695n941n802m728m075m400m183k537r31
58010D57631q74j823k570k872k647j411M62J584J539J475K021K384K238K601M035
57995D63773N628O664P599Q703R269R008Q610Q249P049M757K403O22j192l415
57981E37727n273o059o031n659n177n145o062p209p299o430n929o132o047n321
57967D53954m733m455l713k531j964k122j810n88N47J031J468K057K112J696J898
57952D42847K848L210K347J218O04J99O4J040K963M341M662N179O525P473P170
57937D92690O715P214P961P933P649Q039Q673Q437P124N212K975P34r77k331m264
$$ plain form
57922 563784 556896 547929 538112 527705 516052 503263 490648 479327 469372 460455 452483 445463 439535
57909 439535 435180 432684 431364 430080 428496 427176 426541 426425 426502 426388 425468 423461 421048 419230 418194 417454
57893 417454 416906 416955 417823 419521 422260 425979 429635 431866 432368 431859 430894 429499 427792 426027 424021 421291
57877 421291 417720 413426 408214 401954 395227 388730 382276 375337 368365 362483 357955 354041 350485 348047
57863 348047 347319 347896 348969 350084 351157 352492 354819 358634 363378 367966 372115 376447 381298 386217 390654
57848 390654 394426 397456 399839 402109 404643 406796 407530 406936 406185 405831 405248 404000 402701 401946 401275 399977
57832 399977 398391 397688 398603 400880 403780 406774 409785 412916 416031 418752 421072 423682 427212 431312 434954
57817 434954 437567 439371 440680 441432 441446 440687 439287 437590 435987 434265 431443 426818 420949 414994 409307
$$ packed form
57922E63784o888q967r817j0407j1653j2789j2615j1321r955q917p972p020n928
57909D39535m355k496j320j284j584j320o35j16P7j14r20k007k413j818j036p40
57893D17454n48M9Q68J698K739L719L656K231N02n09r65j395j707j765k006k730
57877D21291l571m294n212o260o727o497o454o939o972n882m528l914l556k438
57863C48047p28N77J073J115J073J335K327L815M744M588M149M332M851M919M437
57848C90654L772L030K383K270K534K153P34n94p51l54n83j248j299p55o71j298
57832C99977j586p03R15K277K900K994L011L131L115K721K320K610L530M100L642
57817D34954K613J804J309P52J4p59j400j697j603j722k822m625n869n955n687
$$ plain form
57802 409307 403410 397078 390525 383675 376235 368620 361876 356435 351662 346877 342116 337720 333890 331002
57788 331002 329617 329755 330617 331422 332298 334095 337588 342860 349151 355326 360905 366649 373704 382197 391146
57773 391146 399676 407702 415354 422292 427856 431567 433390 433717 432977 431015 427165 421391 414915 408994 403370
57758 403370 396808 389088 381485 375203 370159 365474 360413 354679 348516 342864 338818 336688 335948 336093 336879
57743 336879 337780 338022 337413 336497 335683 334833 333836 332880 331971 330862 329728 329248 329655 330277 330373 329978 329675 329937
57725 329937 330874 332234 333502 334430 335478 337269 339580 341479 342505 343097 343790 344588 345251 345525 345052 343699
57709 343699 341989 340470 338643 335474 331143 327296 325155 324261 323513 322607 321850 321322 320897 320607 320446 320279
57693 320279 320300 321040 322530 324020 324883 325221 325217 324626 323435 322371 322163 322811 324101 326317 329998 335616 344050
$$ packed form
57802D09307n897o332o553o850p440p615o744n441m773m785m761m396l830k888
57788C31002j385J38Q62Q05Q76J797L493N272O291O175N579N744P055Q493Q949
57773C91146Q530Q026P652O938N564L711J823L27p40j962l850n774o476n921n624
57758D03370o562p720p603o282n044m685n061n734o163n652m046k130p40J45P86
57743C36879R01K42o09r16q14q50r97r56r09j109j134m80M07O22R6l95l03K62
57725C29937R37J360J268R28J048J791K311J899J026N92O93P98O63K74m73j353
57709C43699j710j519j827l169m331l847k141q94p48r06p57n28m25k90j61j67
57693C20279K1P40J490J490Q63L38mn91j191j064k08O48J290K216L681N618Q434
$$ plain form
57676 344050 356711 374407 396631 422694 453215 489836 534019 587088 651105 728288 818597
57665 818597 917568 1016230 1103295 1168705 1206763 1216843 1201460 1164075 1108652 1040110 963907
57654 963907 885010 807590 735231 670517 614293 565854 524062 488152 457721 432489 412073
57643 412073 395734 382376 371051 361370 353321 346862 341766 337581 333668 329709 326264 324239 323525 322852
57629 322852 321381 319730 318825 318444 317710 316511 315446 314617 313423 311558 309412 307388 305468 303528 301530
57614 301530 299314 296717 293926 291370 289251 287490 286011 284699 283291 281783 280722 280576 281003 281316 281440
57599 281440 281712 281929 281498 280522 279793 279453 278545 276348 273439 270834 268618 266103 262998 259717 256629 253580
57583 253580 250311 246968 243977 241574 239557 237492 235142 232674 230414 228406 226298 223706 220656 217620
$$ packed form
57676C44050J2661J7696K2224K6063L0521L6621M4183N3069O4017P7183R0309
57665H18597R8971R8662Q7065O5410L8058J0080j5383l7385n5423o8542p6203
57654I63907p8897p7420p2359o4714n6224m8439m1792l5910l0431k5232k0416
57643D12073j6339j3358j1325r681q049o459n096m185l913l959l445k025p14o73
57629C22852j471j651r05l81p34j199j065q29j194j865k146k024j920j940j998
57614C01530k216k597k791k556k119j761j479j312j408j508j061j46M27L13J24
57599B81440K72K17m31r76p29l40r08k197k909k605k216k515l105l281l088l049
57583B53580l269l343k991k403k017k065k350k468k260k008k108k592l050l036
$$ plain form
57569 217620 215086 213019 210766 207632 203647 199607 196255 193622 191344 189383 188068 187542 187543 187803 188398 189554
57553 189554 191298 193363 195347 196886 197840 198441 199260 200923 203694 207160 210341 212325 213040 213375 214452
57538 214452 216688 219469 221650 222494 222317 222156 222639 223335 223512 223259 223252 223504 223206 222121 221347 222112 224282 226627
57520 226627 228168 228686 228350 227658 227532 228618 230430 231864 232632 233568 235376 237724 239832 241454 242880 244283
57504 244283 245462 246100 246092 245701 245481 245869 246742 247477 247486 246615 245146 243590 242406 241549 240315 237970 234623 231191
57486 231191 228424 226297 224500 223164 222722 223190 223960 224394 224428 224466 224728 224893 224441 223265 221788 220615 220225
57469 220225 220900 222448 223934 224159 222810 220830 219322 218389 217524 216775 216833 217970 219588 221079 222537 224255
57453 224255 225940 226929 227104 227141 227766 229010 230379 231590 232878 234470 236032 236968 237247 237521 238303 239372
$$ packed form
57569B17620k534k067k253l134l985m040l352k633k278j961j315n26JK60N95J156
57553A89554J744K065J984J539R54O01Q19J663K771L466L181J984P15L35J077
57538B14452K236K781K181Q44j77j61M83O96J77k53pK52k98j085p74P65K170K345
57520B26627J541N18l36o92j26J086J812J434P68R36J808K348K108J622J426J403
57504B44283J179O38ql91k20L88Q73P35Rq71j469j556j184q57j234k345l347l432
57486B31191k767k127j797j336m42M68P70M34L4L8K62J65m52j176j477j173l90
57469B20225O75J548J486K25j349j980j508r33q65p49N8J137J618J491J458J718
57453B24255J685R89J75L7O25J244J369J211J288J592J562R36K79K74P82J069
$$ plain form
57437 239372 240236 240866 241663 242902 244569 246528 248490 249926 250427 250207 249950 250277 251506 253716 256607 259381
57421 259381 261174 261724 261438 260956 260900 261745 263441 265238 266373 266910 267559 268773 270498 272670 275291 278028
57405 278028 280340 282179 284023 286118 288214 290102 291765 292821 292626 291297 290033 289889 290724 291882 293364
57390 293364 295681 298840 302186 305167 307766 310285 313115 316613 320818 325363 329984 334918 340418 346091
57376 346091 351168 355329 358786 361756 364354 366944 369890 372931 375389 377215 379247 382132 385470 388411
57362 388411 390664 392473 393920 394855 395507 396640 398912 402269 406113 409929 413710 417854 422708 428124 433527
57347 433527 438447 442981 447608 452640 457995 463460 468939 474328 479371 483811 487648 491130 494503 497827
57333 497827 501036 504096 507161 510600 514807 519854 525391 531018 536700 542682 549009 555345 561333 566981
$$ packed form
57437B39372Q64O30P97J239J667J959J962J436N01k20k57L27J229K210K891K774
57421B59381J793N50k86m82n6Q45J696J797J135N37O49J214J725K172K621K737
57405B78028K312J839J844K095K096J888J663J056j95j329j264j44Q35J158J482
57390B93364K317L159L346K981K599K519K830L498M205M545M621M934N500N673
57376C46091N077M161L457K970K598K590K946L041K458J826K032K885L338K941
57362C88411K253J809J447R35O52J133K272L357L844L816L781M144M854N416N403
57347D33527M920M534M627N032N355N465N479N389N043M440L837L482L373L324
57333D97827L209L060L065L439M207N047N537N627N682N982O327O336N988N648
$$ plain form
57319 566981 572643 578738 585490 592781 600140 607092 613666 620472 628161 636893 646351 656087 665776 675369
57305 675369 685149 695413 705925 715962 725159 733993 743130 752556 761824 770931 780332 790162 800057
57292 800057 809844 819817 830139 840542 850904 861611 872951 884507 895590 906003 916025 925926
57280 925926 935938 946567 958438 971831 986645 1002725 1019932 1037980 1056549 1075612 1095409
57269 1095409 1116080 1137435 1159059 1180514 1201567 1222365 1243246 1264274 1285141 1305666 1326060
57258 1326060 1346448 1366523 1386104 1405700 1425937 1446643 1467162 1487480 1508301 1529918 1551750
57247 1551750 1573273 1594801 1616983 1640040 1663854 1688395 1713632 1739369 1765549 1792385 1819842
57236 1819842 1847391 1874744 1902534 1931632 1961954 1992533 2022781 2053138 2084392 2116780 2149970
$$ packed form
57319E66981N662O095O752P291P359O952O574O806P689Q732R458R736R689R593
57305F75369R780J0264J0512J0037R197Q834R137R426R268R107R401R830R895
57292H00057R787R973J0322J0403J0362J0707J1340J1556J1083J0413J0022R901
57280I25926J0012J0629J1871J3393J4814J6080J7207J8048J8569J9063J9797
57269A095409K0671K1355K1624K1455K1053K0798K0881K1028K0867K0525K0394
57258A326060K0388K0075J9581J9596K0237K0706K0519K0318K0821K1617K1832
57247A551750K1523K1528K2182K3057K3814K4541K5237K5737K6180K6836K7457
57236A819842K7549K7353K7790K9098L0322L0579L0248L0357L1254L2388L3190
$$ plain form
57225 2149970 2183619 2217820 2253157 2290341 2329572 2370207 2411222 2451990 2492428 2532511 2572000
57214 2572000 2610758 2649001 2687054 2724947 2762332 2798758 2834077 2868672 2903249 2938286 2973754
57203 2973754 3009452 3045379 3081586 3117966 3154533 3191720 3229992 3269242 3308984 3349002 3389412
57192 3389412 3430232 3471478 3513670 3557679 3603948 3652353 3702934 3756192 3812533 3872049 3935120
57181 3935120 4002646 4075111 4151720 4230778 4310669 4390268 4468931 4546627 4623851 4700858 4776978
57170 4776978 4850894 4921456 4988062 5050521 5108922 5163445 5213976 5259934 5300647 5335814 5365516
57159 5365516 5390074 5410015 5425885 5437819 5445483 5448570 5447145 5441403 5431420 5417317 5399432 5378280
57147 5378280 5354701 5330010 5305507 5281701 5258504 5236237 5215811 5197846 5182347 5169495 5159953
$$ packed form
57225B149970L3649L4201L5337L7184L9231M0635M1015M0768M0438M0083L9489
57214B572000L8758L8243L8053L7893L7385L6426L5319L4595L4577L5037L5468
57203B973754L5698L5927L6207L6380L6567L7187L8272L9250L9742M0018M0410
57192C389412M0820M1246M2192M4009M6269M8405N0581N3258N6341N9516O3071
57181C935120O7526P2465P6609P9058P9891P9599P8663P7696P7224P7007P6120
57170D776978P3916P0562O6606O2459N8401N4523N0531M5958M0713L5167K9702
57159E365516K4558J9941J5870J1934P664L087j425n742r983j4103j7885k1152
57147E378280k3579k4691k4503k3806k3197k2267k0426j7965j5499j2852r542
$$ plain form
57136 5159953 5154067 5151501 5151984 5155533 5161415 5167675 5172190 5173452 5170016 5160431 5144538 5124013 5101009
57123 5101009 5077366 5055884 5040937 5036458 5044048 5063811 5095576 5137869 5187016 5239224 5293112 5349271
57111 5349271 5408950 5475235 5554486 5654377 5780799 5937937 6130028 6361105 6634671 6956702
57101 6956702 7338936 7797956 8353259 9029512 9859637 10883168 12143429 13689220 15575611
57092 15575611 17856614 20576756 23771902 27472460 31697858 36451574 41725875 47486789
57084 47486789 53603192 59760533 65469773 70219100 73665840 75717518 76471656 76115385
57076 76115385 74872023 72979547 70652962 68039480 65209428 62186779 58982855 55611604
57068 55611604 52096090 48474331 44797270 41117525 37481780 33934080 30521363 27291865
$$ packed form
57136E159953n886k566M83L549N882O260M515J262l436r585j5893k0525k3004
57123E101009k3643k1482j4947m479P590J9763L1765M2293M9147N2208N3888N6159
57111E349271N9679O6285P9251R9891J26422J57138J92091K31077K73566L22031
57101F956702L82234M59020N55303O76253Q30125J023531J260261J545791J886391
57092A5575611K281003K720142L195146L700558M225398M753716N274301N760914
57084D7486789O116403O157341N709240M749327L446740K051678P54138l56271
57076G6115385j243362j892476k326585k613482k830052l022649l203924l371251
57068E5611604l515514l621759l677061l679745l635745l547700l412717l229498
$$ plain form
57060 27291865 24288453 21542792 19071694 16875790 14942212 13250251 11775784 10493204
57052 10493204 9377388 8406129 7560540 6823483 6179028 5613483 5115510 4674977 4282835
57043 4282835 3932112 3617722 3335045 3079681 2848575 2640124 2452922 2285195 2135304
57034 2135304 2001700 1882326 1775167 1679483 1595494 1522746 1459767 1405496 1360073 1323931 1297025
57023 1297025 1279411 1272259 1277930 1298782 1334643 1380206 1425308 1459310 1475956 1473968 1453959 1416398
57011 1416398 1362536 1295576 1219943 1139990 1059638 982161 909489 841988 779420 721847 669495
57000 669495 622197 579366 540334 504676 472355 443513 417959 395104 374711 357385 343871
56989 343871 334200 328012 325389 326769 332334 342083 356072 373715 393070 411666 427929 441161 450518
$$ packed form
57060B7291865l003412k745661k471098k195904j933578j691961j474467j282580
57052A0493204j115816r71259q45589p37057o44455n65545m97973m40533l92142
57043D282835l50723l14390k82677k55364k31106k08451j87202j67727j49891
57034B135304j33604j19374j07159r5684q3989p2748o2979n4271m5423l6142k6906
57023A297025j7614p152N671K0852L5861M5563M5102L4002J6646j988k0009l7561
57011A416398n3862o6960p5633p9953q0352p7477p2672o7501o2568n7573n2352
57000F69495m7298m2831l9032l5658l2321k8842k5554k2855k0393j7326j3514
56989C43871r671o188k623J380N565R749J3989J7643J9355J8596J6263J3232R357
$$ plain form
56976 450518 455155 455325 452303 447116 440220 432459 425194 419140 413920 409165 405297 402863 401803 401826 403039
56961 403039 405906 411059 419318 431268 446469 463372 480113 494969 506199 512326 512863 508228 498741
56948 498741 484406 465957 445364 424753 405233 387150 370943 357219 346304 338240 333154 331315
56936 331315 332970 338328 347708 361643 380786 405389 434296 464429 491650 512402 524694 528083
56924 528083 523404 512290 496177 475580 450792 423217 395370 369443 346348 326151 308726 293785
56912 293785 280849 269531 259586 250689 242564 235366 229431 224653 220585 217130 214588 213035 212234 212129
56898 212129 212843 214226 216097 218900 223404 229689 237216 245908 256343 268812 283184 299861 319711
56885 319711 342378 365438 385808 401537 412008 417342 418214 415537 409598 400013 387067 372600 358991
$$ packed form
56976D50518M637J70l022n187o896p761p265o054n220m755l868k434j060K3J213
56961D03039K867N153Q259J1950J5201J6903J6741J4856J1230O127N37m635r487
56948D98741j4335j8449k0593k0611j9520j8083j6207j3724j0915q064n086j839
56936C31315J655N358R380J3935J9143K4603K8907L0133K7221K0752J2292L389
56924E28083m679j1114j6113k0597k4788k7575k7847k5927k3095k0197j7425j4941
56912B93785j2936j1318r945q897q125p198n935m778m068l455k542j553q01j05
56898B12129P14J383J871K803M504O285P527Q692J0435J2469J4372J6677J9850
56885C19711K2667K3060K0370J5729J0471N334Q72k677n939r585j2946j4467j3609
$$ plain form
56872 358991 347667 339042 333312 330707 331345 335414 343315 355322 371608 392992 421186 457758 502902
56859 502902 555041 610753 664766 711124 745540 766664 774935 770961 755581 730835 699874 665984
56847 665984 632064 600571 573324 551511 536125 527997 527203 533257 546415 568126 599734 641697
56835 641697 694838 761086 840976 930116 1019135 1097511 1157347 1194534 1208109 1199266 1170353 1124340
56823 1124340 1065138 997929 928261 860632 798102 742752 695660 656681 625268 601824 587736
56812 587736 584079 591006 608476 636970 677038 728097 787198 848393 903687 945852 971054 978902
56800 978902 970414 946701 909482 861790 807516 750483 694004 640741 592549 550512 515162 486484
56788 486484 463913 446935 435817 431470 434609 445387 463734 489236 520189 552966 582743 605102
$$ packed form
56872C58991j1324q625n730k605O38M069P901J2007J6286K1384K8194L6572M5144
56859E02902N2139N5712N4013M6358L4416K1124Q271l974j5380k4746l0961l3890
56847F65984l3920l1493k7247k1813j5386q128p94O054J3158K1711L1608M1963
56835F41697N3141O6248P9890Q9140Q9019P8376N9836L7187J3575q843k8913m6013
56823A124340n9202o7209o9668o7629o2530n5350m7092l8979l1413k3444j4088
56812E87736l657O927J7470K8494M0068N1059N9101O1195N5294M2165K5202P848
56800I78902q488k3713l7219m7692n4274n7033n6479n3263m8192m2037l5350k8678
56788D86484k2571j6978j1118m347L139J0778J8347K5502L0953L2777K9777K2359
$$ plain form
56776 605102 617380 619025 611030 594925 572134 544000 511927 477268 441290 405476 371511 340621
56764 340621 313126 288980 268407 251534 237589 225093 212998 201440 191374 183592 177861 172910
56752 172910 167579 162106 157869 155581 154272 152456 149775 146976 144771 143351 142571 141940 140804 139249 138388
56737 138388 139031 140423 141146 140871 140289 139695 138823 137935 137852 138683 139570 139968 140342 141302 142811 144505 146141 147561
56719 147561 148846 150616 153429 156724 159129 160035 160135 160294 160688 161334 162557 164499 166767 168949 170923
56704 170923 172423 173051 173051 173315 174154 174759 174391 173510 173138 173590 174333 174732 174433 173341 171673 169886 168297 167008
56686 167008 166256 166355 167068 167492 166859 165120 162708 160239 158489 157899 157845 157116 155465 154007 153664 153951 153892 153481
56668 153481 153517 154412 155894 157615 159421 161170 162742 164156 165343 166049 166233 166360 167026 168522 170897 174032
$$ packed form
56776F05102J2278J645p995j6105k2791k8134l2073l4659l5978l5814l3965l0890
56764C40621k7495k4146k0573j6873j3945j2496j2095j1558j0066p782n731m951
56752A72910n331n473m237k288j309j816k681k799k205j420p80o31j136j555q61
56737A38388O43J392P23k75n82n94q72q88q3Q31Q87L98L74R60J509J694J636J420
56719A47561J285J770K813L295K405R06J00J59L94O46J223J942K268K182J974
56704A70923J500O28%K64Q39O05l68q81l72M52P43L99k99j092j668j787j589j289
56686A67008p52R9P13M24o33j739k412k469j750n90n4p29j651j458l43K87n9m11
56668A53481L6Q95J482J721J806J749J572J414J187P06J84J27O66J496K375L135
$$ plain form
56652 174032 177452 180525 183125 185711 188535 191324 194000 197037 200623 204049 206570 208423 210369 212543
56638 212543 214354 215315 215482 215256 215211 215870 217175 218321 218466 217456 215675 213537 211466 209921 208999 208300
56622 208300 207580 207170 207287 207325 206406 204411 202027 199922 198293 196964 195503 193431 190730 187999 185784 183945
56606 183945 181980 179686 177219 174804 172724 171293 170502 170020 169752 169911 170239 169816 168264 166597 166193 167275
56590 167275 169060 171006 173122 175272 177054 178432 179854 181614 183502 185156 186384 187224 187945 188899 190135
56575 190135 191383 192617 194287 196658 199315 201696 203765 205754 207656 209494 211701 214724 218559 223166
56561 223166 228966 236446 245665 256558 269066 282312 294318 303575 310541 316630 322092 325968 327936
56548 327936 328983 330049 331006 331284 330750 329657 328270 326770 325108 322862 319632 315525 310915 305924 300645
$$ packed form
56652A74032L420L073K600K586K824K789K676L037L586L426K521J853J946K174
56638B12543J811R61J67k26m5O59J305J146J45j010j781k138k071j545r22o99
56622B08300p20m10J17L8r19j995k384k105j629j329j461k072k701k731k215j839
56606A83945j965k294k467k415k080j431p91m82k68J59L28m23j552j667m04J082
56590A67275J785J946K116K150J782J378J422J760J888J654J228Q40P21R54J236
56575A90135J248J234J670K371K657K381K069J989J902J838K207L023L835M607
56561B23166N800P480R219J0893J2508J3246J2006R257O966O089N462L876J968
56548C27936J047J066R57K78n34j093j387j500j662k246l230m107m610m991n279
$$ plain form
56533 300645 295549 290960 286395 281204 275686 270731 266482 262298 257982 254101 250939 248026 244908 241608
56519 241608 238219 234925 232508 231864 232641 233259 232724 231581 230636 229570 227553 224555 221284 218152 215050
56504 215050 212026 209571 208167 207798 207947 208034 207925 207985 208476 209092 209359 209265 209046 208624 207910 207497 208201 209831
56486 209831 211241 211789 211997 212512 213192 213597 213720 213736 213553 213075 212511 211975 211233 210223 209465 209542 210426 211624
56468 211624 212723 213575 214297 215275 216822 218593 219753 219938 219623 219308 218821 217853 216754 216296 216822 218008 219334
56451 219334 220498 221455 222232 222640 222192 220632 218554 217143 217051 217833 218556 218692 218302 217790 217678 218223 218978 219070
56433 219070 218190 217116 216990 218223 220229 222049 223055 223220 222849 222123 221040 219906 219538 220567 222713 225130
56417 225130 227298 229073 230109 230018 229132 228380 228256 228491 228859 229613 230843 232066 232783 233024 233024 232832 232550 232537
$$ packed form
56533C00645n096m589m565n191n518m955m249m184m316l881l162k913l118l300
56519B41608l389l294k417o44P77O18n35j143r45j066k017k998l271l132l102
56504B15050l024k455j404l69J49Q7j09O0M91O16K67r4k19m22p14m13P04J630
56486B09831J410N48K08N15O80M05J23J6j83m78n64n36p42j010p58P7Q84J198
56468B11624J099Q52P22R78J547J771J160J85l15l15m87r68j099m58N26J186J326
56451B19334J164R57P77M08m48j560k078j411r2P82P23J36l90n12j12N45P55R2
56433B19070q80j074j26J233K006J820J006J65l71p26j083j134l68J029K146K417
56417B25130K168J775J036r1q86p52j24K35L68P54J230J223P17K41%j92k82j3
$$ plain form
56399 232537 233060 233962 234902 235659 236158 236523 237161 238424 240129 241791 243260 244626 245612 245751 245207 244732 244656
56382 244656 244666 244718 245361 246789 248330 249296 249814 250377 251103 251822 252460 252981 253360 253858 254852 256133 256968 257205
56364 257205 257726 259356 261819 264250 266320 268332 270504 272629 274359 275473 275969 276107 276337 277145 278913
56349 278913 281603 284316 285695 285367 284676 285204 286869 288374 289235 290167 291509 292627 293215 294011 295715 298158
56333 298158 300996 304283 307843 311012 313581 316235 319571 323447 327627 332091 336309 339266 340819 342071
56319 342071 343785 345419 346371 347070 347974 348574 348431 348308 349146 350615 351767 352566 353685 355269 356955 358788
56303 358788 361265 364678 369062 374375 380173 385643 390530 395409 400498 405002 408367 411291 414661 418356
56289 418356 422069 426390 431844 437629 442665 447376 453064 459968 467230 474488 482230 490759 499994 510108
$$ packed form
56399B32537N23R02R40P57M99L65O38J263J705J662J469J366R86J39n44m75p6
56382B44656J0N2O43J428J541R66N18N63P26P19O38N21L79M98R94J281Q35K37
56364B57205N21J630K463K431K070K012K172K125J730J114M96J38K30Q08J768
56349B78913K690K713J379l28o91N28J665J505Q61R32J342J118N88P96J704K443
56333B98158K838L287L560L169K569K654L336L876M180M464M218K957J553J252
56319C42071J714J634R52O99R04O00j43j23Q38J469J152P99J119J584J686J833
56303C58788K477L413M384N313N798N470M887M879N089M504L365K924L370L695
56289D18356L713M321N454N785N036M711N688O904P262P258P742Q529R235J0114
$$ plain form
56275 510108 521260 532882 544356 556198 569417 583826 598234 612284 626978 643282 661345
56264 661345 681257 703531 728517 756161 786627 820551 858526 900976 948562 1002109 1062085
56253 1062085 1128732 1202744 1285326 1377566 1480082 1592962 1715580 1846858 1986267 2134103
56243 2134103 2289988 2451541 2615313 2778483 2938512 3091537 3232564 3357499 3463965
56234 3463965 3549979 3612947 3650518 3661868 3647718 3609512 3548962 3468211 3370190 3258533 3136734
56223 3136734 3007226 2871705 2732442 2592523 2454451 2319243 2187475 2060436 1939566
56214 1939566 1825508 1718575 1619492 1528706 1445436 1368321 1296655 1230249 1168643 1111390 1058726
56203 1058726 1011106 968361 929962 895573 864701 836445 810345 786830 766092 747314 729861
$$ packed form
56275E10108J1152J1622J1474J1842J3219J4409J4408J4050J4694J6304J8063
56264F61345J9912K2274K4986K7644L0466L3924L7975M2450M7586N3547N9976
56253A062085O6647P4012Q2582R2240J02516J12880J22618J31278J39409J47836
56243B134103J55885J61553J63772J63170J60029J53025J41027J24935J06466
56234C463965Q6014O2968L7571J1350j4150l8206o0550q0751r8021j11657j21799
56223C136734j29508j35521j39263j39919j38072j35208j31768j27039j20870
56214A939566j14058j06933r9083r0786q3270p7115p1666o6406o1606n7253n2664
56203A058726m7620m2745l8399l4389l0872k8256k6100k3515k0738j8778j7453
$$ plain form
56192 729861 714286 701068 689244 677574 666299 656514 648406 641363 635115 629497 623792 617650 612022
56179 612022 607824 604376 600573 596829 594332 593065 592259 592146 593398 595313 596429 596703 597341 598755 600410
56164 600410 602523 606123 611492 618072 625682 634258 642763 650097 656885 664753 674170 684736 697018 711981
56150 711981 728878 745962 763341 782975 805812 831129 859021 891437 930356 976958 1033010
56139 1033010 1101090 1182703 1277589 1384954 1503410 1629241 1756602 1880205 1996733 2103867
56129 2103867 2200042 2285632 2362618 2432494 2495580 2552034 2601551 2642089 2671062 2688180 2695321
56118 2695321 2693629 2682818 2663301 2636331 2601307 2555233 2495759 2423058 2338324 2242644 2138171
56107 2138171 2028568 1917469 1807900 1703309 1607056 1520410 1442782 1374123 1315058 1264702
$$ packed form
56192G29861j5575j3218j1824j1670j1275r785q108p043o248n618n705o142n628
56179F12022m198l448l803l744k497j267q06j13J252J915J116K74O38J414J655
56164F00410K113L600N369O580P610Q576Q505P334O788P868R417J0566J2282J4963
56150G11981J6897J7084J7379J9634K2837K5317K7892L2416L8919M6602N6052
56139A033010O8080Q1613R4886J07365J18456J25831J27361J23603J16528J07134
56129B103867R6175Q5590P6986O9876O3086N6454M9517M0538K8973J7118P141
56118B695321j692j0811j9517k6970l5024m6074n9474p2701q4734r5680j04473
56107B138171j09603j11099j09569j04591r6253q6646p7628o8659n9065n0356
$$ plain form
56097 1264702 1220862 1182811 1151478 1126535 1105864 1088405 1074859 1064933 1056610 1049031 1043438 1040302
56085 1040302 1038187 1036426 1036281 1038246 1040872 1043487 1047548 1053903 1061142 1068065 1075501 1084372 1094234 1104983
56071 1104983 1117677 1132446 1147873 1163568 1180946 1200374 1220170 1239545 1259747 1280982 1301089
56060 1301089 1318871 1335921 1353389 1369723 1383499 1395867 1408256 1420106 1430795 1441504 1453405
56049 1453405 1466222 1480141 1496701 1516198 1536726 1557274 1579186 1603269 1628366 1654302 1683050
56038 1683050 1715231 1748697 1782381 1818184 1856931 1895844 1932398 1967512 2002681 2037217 2070732
56027 2070732 2105094 2141421 2178218 2214775 2253122 2294393 2336861 2379966 2426517 2478322 2533527
56016 2533527 2590923 2652701 2719894 2789388 2858922 2930961 3008112 3088745 3170790 3255777 3345340
$$ packed form
56097A264702m3840l8051l1333k4943k0671j7459j3546r926q323p579n593l136
56085A040302k115j761j45J965K626K615M061O355P239O923P436Q871R862J0749
56071A104983J2694J4769J5427J5695J7378J9428J9796J9375K0202K1235K0107
56060A301089J7782J7050J7468J6334J3776J2368J2389J1850J0689J0709J1901
56049A453405J2817J3919J6560J9497K0528K0548K1912K4083K5097K5936K8748
56038A683050L2181L3466L3684L5803L8747L8913L6554L5114L5169L4536L3515
56027B070732L4362L6327L6797L6557L8347M1271M2468M3105M6551N1805N5205
56016B533527N7396O1778O7193O9494O9534P2039P7151Q0633Q2045Q4987Q9563
$$ plain form
56005 3345340 3437813 3532100 3630822 3735782 3844596 3955699 4072193 4196761 4327621 4463786
55995 4463786 4609148 4766652 4933619 5107798 5292711 5491702 5702279 5922151 6155345
55986 6155345 6406252 6673226 6954514 7254983 7580370 7930475 8304687 8708399 9147107
55977 9147107 9620441 10129183 10681646 11286018 11943896 12659234 13445835 14318073 15283479
55968 15283479 16353643 17552961 18907625 20437969 22173640 24165591 26473527 29158359
55960 29158359 32303453 36030449 40481785 45808029 52190042 59851807 69034738 79994489
55952 79994489 93059416 108679758 127429710 150037765 177367747 209974046 247092910
55945 247092910 285798063 321432539 349426691 367140699 374259028 371761386 360802818
$$ packed form
56005C345340R2473R4287R8722J04960J08814J11103J16494J24568J30860J36165
55995D463786J45362J57504J66967J74179J84913J98991K10577K19872K33194
55986F155345K50907K66974K81288L00469L25387L50105L74212M03712M38708
55977I147107M73334N08742N52463O04372O57878P15338P86601Q72238R65406
55968A5283479J070164J199318J354664J530344J735671J991951K307936K684832
55960B9158359L145094L726996M451336N326244O382013P661765R182931J0959751
55952G9994489J3064927J5620342J8749952K2608055K7329982L2606299L7118864
55945B47092910L8705153L5634476K7994152J7714008P118329k497642j0958568
$$ plain form
55938 360802818 342496207 318310900 290245543 260488232 230931640 202913823 177208994
55931 177208994 154137445 133717354 115813638 100234087 86766805 75196842 65317957
55924 65317957 56928365 49821589 43797132 38681150 34328651 30611938 27420419 24668402
55916 24668402 22289658 20224129 18417785 16830821 15434216 14199043 13097280 12110055
55908 12110055 11225585 10430361 9709995 9056293 8465285 7929720 7440360 6992635 6584999
55899 6584999 6212598 5869025 5552311 5262782 4996893 4749270 4518844 4306878 4110809
55890 4110809 3926012 3751838 3590167 3439684 3297261 3163298 3040081 2926254 2818413
55881 2818413 2716821 2624301 2540789 2464133 2394925 2335112 2282657 2232633 2182971 2134511 2086309
$$ packed form
55938C60802818j8306611k4185307k8065357k9757311k9556592k8017817k5704829
55931A77208994k3071549k0420091j7903716j5579551j3467282j1569963r878885
55924F5317957q389592p106776o024457n115982m352499l716713l191519k752017
55916B4668402k378744k065529j806344j586964j396605j235173j101763r87225
55908A2110055q84470p95224p20366o53702n91008n35565m89360m47725m07636
55899F584999l72401l43573l16714k89529k65889k47623k30426k11966j96069
55890D110809j84797j74174j61671j50483j42423j33963j23217j13827j07841
55881B818413j01592r2520q3512p6656o9208n9813n2455n0024m9662m8460m8202
$$ plain form
55870 2086309 2035782 1983040 1930476 1878378 1825126 1771364 1719844 1671411 1624878 1580427 1539371
55859 1539371 1500873 1462470 1423591 1385391 1347754 1309759 1272485 1238029 1206215 1175263 1144912
55848 1144912 1115862 1087130 1057223 1027155 999099 972922 947197 922544 900569 880429 860045
55837 860045 839868 821871 805526 788519 770944 755045 741093 727276 713567 702024 693031 684699
55825 684699 676323 669181 663554 657997 651939 646106 640048 632198 622832 614236 607448 601344 595267 589945
55811 589945 585436 580803 576333 573704 573406 574139 575138 577020 580047 583665 587956 593436 599208 603434 605807
55796 605807 607482 608394 606847 602067 595131 587039 577707 567132 555801 543928 531979 521809 515249
55783 515249 511596 508477 505030 502219 500232 497895 494762 491546 488347 484582 480857 478823 479089 481308
$$ packed form
55870B086309n0527n2742n2564n2098n3252n3762n1520m8433m6533m4451m1056
55859A539371l8498l8403l8879l8200l7637l7995l7274l4456l1814l0952l0351
55848A144912k9050k8732k9907l0068k8056k6177k5725k4653k1975k0140k0384
55837H60045k0177j7997j6345j7007j7575j5899j3952j3817j3709j1543q993q332
55825F84699q376p142n627n557o058n833o058p850r366q596o788o104o077n322
55811E89945m509m633m470k629k98P33R99J882L027L618M291N480N772M226K373
55796F05807J675R12j547m780o936q092r332j0575j1331j1873j1949j0170o560
55783E15249l653l119l447k811j987k337l133l216l199l765l725k034K66K219
$$ plain form
55769 481308 486139 494584 505143 514185 519741 522744 524087 522892 518391 511328 502586 492422 481842
55756 481842 472801 466154 461076 457089 454846 454281 453899 452771 451404 449743 446074 439044 429358 418529
55742 418529 407298 396148 385979 377226 369313 361768 354945 349015 343379 337679 332400 327884 323702
55729 323702 319455 315285 311217 306891 302248 297614 293008 288286 283939 280588 277688 273965 269210 264487
55715 264487 260612 257650 255808 255377 255806 256296 257305 259970 264034 267959 271122 274164 277017 278452 277988
55700 277988 276542 274737 272165 268778 265353 262104 258388 254295 250935 248626 246340 243570 241220 240078
55686 240078 239843 240218 241497 243524 245621 248105 252279 258283 264502 269855 275067 280807 286128 289715 291422
55671 291422 291641 290449 288299 286345 285139 284020 282479 281010 280000 279047 278098 277933 278738 279479 279510 279572 280329
$$ packed form
55769D81308M831Q445J0559R042N556L003J343j195m501p063q742j0164j0580
55756D81842r041o647n078l987k243n65l82j128j367j661l669p030r686j0829
55742D18529j1231j1150j0169q753p913p545o823n930n636n700n279m516m182
55729C23702m247m170m068m326m643m634m606m722m347l351k900l723m755m723
55715B64487l875k962j842m31M29M90J009K665M064L925L163L042K853J435m64
55700B77988j446j805k572l387l425l249l716m093l360k309k286k770k350j142
55686B40078k35L75J279K027K097K484M174O004O219N353N212N740N321L587J707
55671B91422K19j192k150j954j206j119j541j469j010r53r49j65Q05P41L1O2P57
$$ plain form
55654 280329 281179 281394 281280 281217 280685 279201 277184 274954 271798 266968 260741 253774 246342 238920 232454 227246
55638 227246 222524 217824 213745 210682 207894 204634 201145 197785 194380 191211 189357 189028 188715 187050 184505
55623 184505 182209 180240 178237 176705 176379 176936 177440 177430 176695 174801 171865 169055 167310 166195 164832 163180
55607 163180 161521 159511 156822 154097 152274 151465 151184 151008 150358 148550 145920 144034 143843 144378 144135 142932
55591 142932 141527 140363 139702 140105 141606 143098 143633 143675 144109 144764 145019 145095 145600 146403 147100 147983 149434 150983
55573 150983 152202 153984 157654 163138 169163 174942 180613 186333 191958 197348 202081 205238 206387 206388 206259
55558 206259 205719 203878 200920 197978 195595 193366 190891 188129 185011 181592 178434 176039 174141 172269
55544 172269 170639 169754 169582 169943 171179 173434 175696 176680 176473 176269 176725 177521 178330 179179 179847 179814 178868 177155
$$ packed form
55654B80329Q50K15j14o3n32j484k017k230l156m830o227o967p432p422o466n208
55638B27246m722m700m079l063k788l260l489l360l405l169j854l29l13j665k545
55623A84505k296j969k003j532l26N57N04j0p35j894k936k810j745j115j363j652
55607A63180j659k010k689k725j823q09k81j76o50j808k630j886j91N35k43j203
55591A42932j405j164o61M03J501J492N35M2M34O55K55P6N05Q03O97Q83J451J549
55573A50983J219J782L670N484O025N779N671N720N625N390M733L157J149Jj29
55558B06259n40j841k958k942k383k229k475k762l118l419l158k395j898j872
55544A72269j630q85j72L61J236K255K262R84k07k04M56P96Q09Q49O68l3r46j713
$$ plain form
55526 177155 174802 172087 169662 167862 166113 163748 161053 158695 156514 153827 150647 147591 144752 141635
55512 141635 138160 134940 132519 131006 130335 130238 130142 129761 129546 129986 130730 131074 130948 130716 130333 129528 128509 127711
55494 127711 127072 126273 125402 124672 123867 122779 121777 121142 120414 119290 118669 119635 121729 123437 124162 124493 124697
55477 124697 124268 123147 122183 122042 122521 123244 124227 125456 126539 127132 127253 127079 126756 126384 125798 124587 122766
55460 122766 121123 120359 120221 120028 119695 119544 119543 119470 119493 119765 119851 119341 118703 118697 119284 119966 120750 121788 122508 122210
55440 122210 121209 120311 119499 118347 117402 117719 119091 120152 120300 120227 120389 120311 119737 119188 118909 118346 117188 115989
55422 115989 115336 115203 115493 116366 117650 118726 119370 120036 121029 122130 123239 124594 126083 127134 127553 127777
55406 127777 128062 128173 128050 127964 127784 126969 125612 124603 124347 124117 123106 121425 119653 118095 116875 116107 115530
$$ packed form
55526A77155k353k715k425j800j749k365k695k358k181k687l180l056k839l117
55512A41635l475l220k421j513o71r7r6l81k15M40P44L44j26k32l83q05j019p98
55494A27711o39p99q71p30q05j088j002o35p28j124o21R66K094J708P25L31K04
55477A24697m29j121r64j41M79P23R83J229J083N93J21j74l23l72n86j211j821
55460A22766j643p64j38j93l33j51jp3K3K72Q6n10o38oN87O82P84J038P20k98
55440A22210j001q98q12j152r45L17J372J061J48p3J62p8n74n49k79n63j158j199
55422A15989o53j33K90Q73J284J076O44O66R93J101J109J355J489J051M19K24
55406A27777K85J11j23q6j80q15j357j009k56k30j011j681j772j558j220p68n77
$$ plain form
55389 115530 114648 113605 113274 114069 115291 116085 116425 116726 117047 117224 117314 117375 117209 116681 116034 115556 115271 115209 115568
55370 115568 116328 117038 117231 116857 116221 115760 115778 115971 115380 113468 111174 110069 110401 110837 110339 109411 109085 109512
55352 109512 110129 110584 110869 110954 110811 110569 110305 109989 109802 110095 110792 111308 111304 111139 111303 111809 112337 112571 112244 111320
55332 111320 110320 109997 110494 111229 111733 112060 112281 112171 111649 110991 110418 109997 110033 110864 112019 112366 111526 110467
55314 110467 110212 110555 110631 110240 109920 109978 110117 109931 109388 108854 108847 109666 111093 112574 113711 114390 114537 114183 113714
55295 113714 113528 113403 112800 111908 111707 112770 114549 116178 117425 118453 119178 119393 119235 119074 119053 119057 119028 119108 119467
55276 119467 119989 120101 119206 117549 116319 116393 117264 117760 117548 117192 117006 116798 116695 117169 118113 118860 119327 120202
55258 120202 121655 122819 122986 122533 122165 121935 121514 120835 120110 119749 120431 122469 124871 125951 125270 124080 123438
$$ packed form
55389A15530q82j043l31P95J222P94L40L01L21J77R0O1j66n28o47m78k85o2L59
55370A15568P60P10J93l74o36m61J8J93n91j912k294j105L32M36m98r28l26M27
55352A09512O17M55K85Q5j43k42k64l16j87K93O97N16mj65J64N06N28K34l27r24
55332A11320j000l23M97P35N04L27K21j10n22o58n73m21L6Q31J155L47q40j059
55314A10467k55L43P6l91l20N8J39j86n43n34pQ19J427J481J137O79J47l54m69
55295A13714j86j25o03q92k01J063J779J629J247J028P25K15j58j61k1Mk9Q0L59
55276A19467N22J12q95j657j230P4Q71M96k12l56j86k08j03M74R44P47M67Q75
55258A20202J453J164J67m53l68k30m21o79p25l61O82K038K402J080o81j190o42
$$ plain form
55241 123438 122919 121860 120790 120582 120958 120959 120441 120066 120063 119974 119546 119059 118755 118498 118119 117718 117609 118121 119264
55222 119264 120522 121232 121274 121003 120599 120056 119804 120439 121639 122300 122055 121690 121561 120808 118958 117274 117390 119270
55204 119270 121580 123517 125140 126369 126871 126835 126824 126901 126676 126126 125568 124913 123711 121974 120306 119291 119183
55187 119183 119958 121092 121608 121050 120205 120148 120795 121117 120592 119616 118636 117760 117232 117377 117893 117915 117044 115806 114959
55168 114959 114928 115968 118158 120933 123179 124243 124543 124909 125584 126172 126346 126288 126310 126268 125573 123976 122167 121212
55150 121212 121351 121797 121857 121731 121936 122400 122555 121999 120711 118955 117377 116782 117355 118373 119079 119506 120038 120576
55132 120576 120740 120584 120574 120997 121806 122788 123511 123522 123028 122986 123987 125432 126380 126802 127345 128233 129132 129834 130354
55113 130354 130574 130461 130356 130423 130123 129019 127782 127562 128551 130010 131463 132883 133870 133802 132937 132346 132459 132596
$$ packed form
55241A23438n19j059j070k08L76Jn18l75lq9m28m87l04k57l79m01j09N12J143
55222A19264J258P10M2k71m04n43k52O35J200O61k45l65j29p53j850j684J16J880
55204A19270K310J937J623J229N02l6j1P7k25n50n58o55j202j737j668j015j08
55187A19183P75J134N16n58q45n7O47L22n25r76r80q76n28J45N16K2q71j238q47
55168A14959l1J040K190K775K246J064L00L66O75N88J74n8K2m2o95j597j809r55
55150A21212J39M46O0j26K05M64J55n56j288j756j578n95N73J018P06M27N32N38
55132A20576J64j56j0M23Q09R82P23J1m94m2J001J445R48M22N43Q88Q99P02N20
55113A30354K20j13j05O7l00j104j237k20R89J459J453J420R87o8q65n91J13J37
$$ plain form
55095 132596 132215 131763 131914 132690 133767 134987 136111 136668 136510 136091 135881 135869 135959 136355 137223 138359 139530 140750
55077 140750 141851 142193 141287 139567 138153 137872 138720 140145 141552 142559 142946 142550 141345 139660 138145 137325
55061 137325 137264 137701 138263 138395 137486 135571 133682 133006 133716 134992 136065 136717 136910 136540 135706 134710 133622
55044 133622 132263 130762 129783 129885 130887 132078 132975 133701 134634 135801 136722 136951 136601 136093 135532 134771 134024
55027 134024 133766 133898 133707 132966 132414 132688 133470 134169 134753 135285 135315 134595 133776 133538 133586 133465 133719 135061 136805
55008 136805 137526 137083 136682 136954 137308 137297 137299 137516 137496 137121 137026 137615 138525 139386 140168 140543 139942 138689 138023 138510
54988 138510 139414 140109 141001 142380 143485 143653 143472 143808 144449 144760 145016 145943 147339 148241 148270 147877 147449 147051
54970 147051 146904 147274 147914 148402 148957 150200 152043 153540 153982 153569 152916 152434 152347 152767 153508 154095 154183 153827
$$ packed form
55095A32596l81m52J51P76J077J220J124N57j58m19k10j2R0L96Q68J136J171J220
55077A40750J101L42r06j720j414k81Q48J425J407J007L87l96j205j685j515q20
55061A37325o1M37N62J32r09j915j889o76P10J276J073O52J93l70q34r96j088
55044A33622j359j501r79J02J002J191Q97P26R33J167R21K29l50n08n61p61p47
55027A34024k58J32j91p41n52K74P82O99N84N32L0p20q19k38M8j21K54J342J744
55008A36805P21m43m01K72L54j1KK17k0l75r5N89R10Q61P82L75o01j253o66M87
54988A38510R04O95Q92J379J105J68j81L36O41L11K56R27J396R02K9l93m28l98
54970A47051j47L70O40M88N55J243J843J497M42m13o53m82q7M20P41N87Q8l56
$$ plain form
54952 153827 153321 152998 153148 153815 154615 155022 154954 154899 155341 156167 156754 156642 156065 155723 156021 156721 157505 158561 160250
54933 160250 162401 164471 166387 168648 171571 175063 179251 184596 191059 197890 204708 212181 221027 230897
54919 230897 240754 249868 257699 263329 265993 266070 264689 262310 258397 252521 245104 236924 228558 220556 213555
54904 213555 207785 202686 197388 191484 185257 179374 174451 170741 168089 166212 164963 164249 163904 163932 164769
54889 164769 166854 169905 172955 175279 177123 179468 183272 188876 195785 203009 209921 216963 225136 234601
54875 234601 244091 252009 257816 261922 264417 264576 261784 256472 249716 242172 233867 224951 216166 208319
54861 208319 201569 195431 189398 183442 178028 173709 170608 168235 165994 163864 162306 161398 160446 158721 156291
54846 156291 153831 151871 150544 149781 149296 148579 147401 146193 145492 145165 144717 144257 144513 145765 147319 148252
$$ packed form
54952A53827n06l23J50O67Q00M07o8n5M42Q26N87j12n77l42K98P00P84J056J689
54933A60250K151K070J916K261K923L492M188N345O463O831O818P473Q846R870
54919B30897R857R114P831N630K664P7j381k379l913n876p417q180q366q002p001
54904B13555n770n099n298n904o227n883m923l710k652j877j249p14l45K8Q37
54889A64769K085L051L050K324J844K345L804N604O909P224O912P042Q173R465
54875B34601R490P918N807M106K495J59k792n312o756p544q305q916q785p847
54861B08319o750o138o033n956n414m319l101k373k241k130j558r08r52j725k430
54846A56291k460j960j327p63m85p17j178j208p01l27m48m60K56J252J554R33
$$ plain form
54830 148252 148274 147752 147281 147360 148062 148883 149207 148975 148530 147854 146599 144980 144001 144402 145815 147233 147964 147847
54812 147847 146951 145445 143623 141789 140260 139460 139682 140676 141872 143075 144510 146149 147563 148565 149420
54797 149420 150241 150813 151281 152224 153626 154487 154060 152937 152272 152455 153225 154518 156298 157868 158381 158101 158353
54780 158353 160045 162740 165395 167542 169589 172225 175708 179696 183820 188460 194570 202541 211671 221084
54766 221084 230759 241085 251760 261798 270473 277604 282931 285813 285669 282383 276330 268391 259841 251719
54752 251719 244238 237035 229839 222563 215084 207545 200702 195335 191409 188370 186092 184743 183837 182385
54738 182385 180256 178477 177752 177536 177172 177266 179021 182585 186932 191267 195771 200828 206263 211737 217469
54723 217469 224052 231663 239729 247383 253978 259125 262483 263767 262990 260543 256892 252239 246526 239755
$$ packed form
54830A48252K2n22m71P9P02Q21L24k32m45o76j255j619r79M01J413J418P31j17
54812A47847q96j506j822j834j529q00K22R94J196J203J435J639J414J002Q55
54797A49420Q21N72M68R43J402Q61m27j123o65J83P70J293J780J570N13k80K52
54780A58353J692K695K655K147K047K636L483L988M124M640O110P971R130R413
54766B21084R675J0326J0675J0038Q675P131N327K882j44l286o053p939q550q122
54752B51719p481p203p196p276p479p539o843n367l926l039k278j349r06j452
54738A82385k129j779p25k16l64R4J755L564M347M335M504N057N435N474N732
54723B17469O583P611Q066P654O595N147L358J284p77k447l651m653n713o771
$$ plain form
54709 239755 232248 224588 217283 210437 203732 196804 189696 182967 177391 173537 171394 170202 168821 166675
54695 166675 164417 163324 163838 164993 165457 164811 163578 162287 160977 159485 157829 156240 155085 154740 155300
54680 155300 156336 157165 157417 157259 157062 156960 156786 156351 155721 155118 154541 153664 152326 150994 150335 150354 150408 150231
54662 150231 150400 151459 152964 153841 153521 152342 151049 150272 150265 150701 150773 149931 148528 147447 147154 147394 147697 147772
54644 147772 147483 146922 146587 147087 148480 150127 151326 151896 152052 151980 151703 151214 150635 150235 150344 151127 152354 153501
54626 153501 154100 154026 153459 152636 151708 150893 150680 151548 153236 154593 154676 153934 153711 154537 155582 156068 156424 157397
54608 157397 158635 159073 158489 157775 157598 157636 157439 157358 158089 159561 160795 160863 159785 158487 157978 158566 159769 160911
54590 160911 161714 162263 162619 162713 162527 162217 161955 161755 161461 160880 159967 158876 157808 156890 156332 156491 157448 158618
$$ packed form
54709B39755p507p660p305o846o705o928p108o729n576l854k143j192j381k146
54695A66675k258j093N14J155M64o46j233j291j310j492j656j589j155l45N60
54680A55300J036Q29K52j58j97j02j74m35o30o03n77q77j338j332o59J9N4j77
54662A50231J69J059J505Q77l20j179j293p77pM36P2q42j403j081k93K40L03P5
54644A47772k89n61l35N00J393J647J199N70J56p2k77m89n79m00J09P83J227J147
54626A53501N99p4n67q23r28q15k13Q68J688J357Q3p42k23Q26J045M86L56R73
54608A57397J238M38n84p14j77L8j97q1P31J472J234O8j078j298n09N88J203J142
54590A60911Q03N49L56R4j86l10k62k00k94n81r13j091j068r18n58J59R57J170
$$ plain form
54572 158618 159249 159343 159568 160210 160765 160783 160477 160143 159584 158669 157931 157991 158697 159443 160088 160913 161826 162312 162136 161640
54552 161640 161274 161177 161165 160859 159979 158800 158102 158363 159313 160552 162146 164094 165765 166619 167127 168170 169749
54535 169749 171147 172196 173491 175318 177277 179044 180691 182085 182692 182290 181224 179754 177769 175416 173439
54520 173439 172497 172491 172715 172378 171021 168954 167355 167380 168999 171095 172665 173399 173226 172093 170366 168698 167235
54503 167235 165614 163919 162902 162934 163494 164053 164784 165886 166874 167136 166787 166422 166341 166456 166634 166760 166710 166552
54485 166552 166491 166494 166382 166459 167395 169183 170847 171606 171767 171981 172281 172487 172982 174273 176045 177405 177917 177844 177544
54466 177544 177241 177229 177672 178241 178458 178391 178520 178993 179505 179883 180288 180759 181001 180806 180420 180295 180590 180936 180721
54447 180721 179734 178588 178255 179053 180355 181423 182096 182418 182121 181066 179864 179373 179654 180037 180153 180285 180597
$$ packed form
54572A58618O31R4K25O42N55J8l06l34n59r15p38O0P06P46O45Q25R13M86j76m96
54552A61640l66r7j2l06q80j179o98K61R50J239J594J948J671Q54N08J043J579
54535A69749J398J049J295J827J959J767J647J394O07m02j066j470j985k353j977
54520A73439r42oK24l37j357k067j599K5J619K096J570P34j73j133j727j668j463
54503A67235j621j695j017L2N60N59P31J102R88K62l49l65q1J15J78J26n0j58
54485A66552o1Lj12P7R36J788J664P59J61K14L00K06M95J291J772J360N12p3l00
54466A77544l03j2M43N69K17o7J29M73N12L78M05M71K42j95l86j25K95L46k15
54447A80721r87j146l33P98J302J068O73L22k97j055j202m91K81L83J16J32L12
$$ plain form
54430 180597 180614 179908 178889 178512 179162 180137 180319 179315 177871 177139 177586 178760 180027 181262 182721 184486
54414 184486 186241 187418 187474 186287 184459 183048 182702 183122 183491 183288 182614 181958 181835 182461 183572 184677 185621
54397 185621 186678 187985 189122 189480 188901 187846 187089 187310 188680 190654 192356 193271 193394 192842 191856 191157
54381 191157 191509 192586 192958 191751 189811 188628 188570 188872 189027 189344 190203 191414 192423 192754 192299 191583 191547
54364 191547 192601 193948 194352 193501 192226 191509 191745 192857 194498 196115 197283 198053 198636 198826 198227 196987
54348 196987 195855 195467 195990 197330 199141 200674 201291 201292 201699 203074 205057 207179 209512 212259 215244 218213
54332 218213 221244 224438 227537 230127 232048 233300 233785 233354 231992 229795 226994 224028 221311 218786 216095
54317 216095 213280 210919 209273 207745 205590 202843 200143 197873 195950 194308 193093 192329 191760 191099 190237
$$ packed form
54430A80597J7p06j019l77O50R75J82j004j444p32M47J174J267J235J459J765
54414A84486J755J177N6j187j828j411l46M20L69k03o74o56j23O26J111J105R44
54397A85621J057J307J137L58n79j055p57K21J370J974J702R15J23n52r86o99
54381A91157L52J077L72j207j940j183n8L02J55L17Q59J211J009L31m55p16l6
54364A91547J054J347M04q51j275p17K36J112J641J617J168P70N83J90n99j240
54348A96987j132l88N23J340J811J533O17JM07J375J983K122K333K747K985K969
54332B18213L031L194L099K590J921J252M85m31j362k197k801k966k717k525k691
54317B16095k815k361j646j528k155k747k700k270j923j642j215p64n69o61q62
$$ plain form
54302 190237 189180 188002 186830 185714 184574 183470 182867 183269 184611 186269 187719 188900 189858 190422 190563
54287 190563 190808 191828 193497 194700 194332 192498 190512 189714 190332 191545 192493 193022 193436 193804 193789 193196 192386
54270 192386 191973 192222 192931 193786 194570 195136 195532 196197 197563 199215 199973 199255 198046 197911 199234 201045 202527
54253 202527 203821 205207 206289 206567 206213 205697 205058 204187 203473 203413 203666 203263 201844 200099 198788 197890 196980
54236 196980 196023 195392 195302 195518 195546 195031 194034 193003 192327 191925 191401 190639 189965 189731 190010 190774 192004 193425
54218 193425 194461 194738 194491 194201 194024 193875 193918 194472 195380 195880 195361 194039 192707 191986 192030 192718 193728 194485
54200 194485 194455 193656 192620 191751 191015 190440 190530 191759 193832 195877 197347 198381 199312 200215 200978 201489 201675
54183 201675 201632 201736 202260 202833 202672 201499 199937 198836 198528 198831 199388 199774 199679 199241 198948 198967 198888 198300 197254
$$ packed form
54302A90237j057j178j172j116j140j104o03M02J342J658J450J181R58N64J41
54287A90563K45J020J669J203l68j834j986p98O18J213R48N29M14L68j5n93q10
54270A92386m13K49P09Q55P84N66L96O65J366J652P58p18j209j35J323J811J482
54253B02527J294J386J082K78l54n16o39q71p14o0K53m03j419j745j311q98r10
54236A96980r57o31r0K16K8n15r97j031o76m02n24p62o74k34K79P64J230J421
54218A93425J036K77k47k90j77j49M3N54R08N00n19j322j332p21M4O88J010P57
54200A94485l0p99j036q69p36n75R0J229K073K045J470J034R31R03P63N11J86
54183B01675m3J04N24N73j61j173j562j101l08L03N57L86r5m38k93J9p9n88j046
$$ plain form
54164 197254 195964 194535 193317 193012 193859 195052 195530 195121 194394 193676 192845 191956 191305 190858 190204 189246 188398
54147 188398 187942 187661 187308 187017 186978 187079 187150 187356 187999 188992 189786 189912 189572 189555 190460 191984 193138 193234 192435
54128 192435 191300 190137 189074 188410 188479 189294 190646 192422 194494 196413 197675 198262 198566 198815 198939 198962 199183
54111 199183 199872 201016 202427 203873 205139 206180 207197 208343 209453 210188 210369 210008 209271 208594 208543 209203
54095 209203 209943 210134 209893 209777 210029 210507 211059 211507 211544 211179 210960 211174 211145 210080 208400 207386 207637 208733
54077 208733 210399 212978 216502 220199 223295 225622 227093 227331 226315 224838 223894 223969 225163 227380 230061
54062 230061 232274 233587 234397 235067 235262 234630 233649 233205 233557 234301 235197 236611 239163 243170 248335 253871
54046 253871 259149 264356 270269 277402 285791 295618 307332 320835 335087 348921 361711 372945 381857
$$ packed form
54164A97254j290j429j218l05Q47J193M78m09p27p18q31q89o51m47o54r58q48
54147A88398m56k81l53k91l9J01P1K06O43R93P94J26l40j7R05J524J154R6p99
54128A92435j135j163j063o64O9Q15J352J776K072J919J262N87L04K49J24K3K21
54111A99183O89J144J411J446J266J041J017J146J110P35J81l61p37o77n1O60
54095B09203P40J91k41j16K52M78N52M48L7l65k19K14k9j065j680j014K51J096
54077B08733J666K579L524L697L096K327J471K38j016j477r44P5J194K217K681
54062B30061K213J313Q10O70J95o32r81m44L52P44Q96J414K552M007N165N536
54046B53871N278N207N913P133Q389R827J1714J3503J4252J3834J2790J1234Q912
$$ plain form
54033 381857 388151 392575 396029 398414 399127 398460 397678 397689 398281 398819 399149 399577 400312 401262 402260 403314 404492
54016 404492 405496 405531 403946 401059 397963 395345 392884 389916 386184 381696 376420 370624 365012 359942 354844
54001 354844 348982 342545 336368 330788 325379 319729 313986 308623 304118 300701 298062 295426 292367 289343
53987 289343 286957 284964 282634 279914 277480 275635 273902 271868 269761 267883 266040 263864 261343 258723
53973 258723 256272 254405 253638 253991 254655 254697 254068 253572 253797 254414 254694 254523 254553 255322 256577 257752 258833 260268
53955 260268 262128 263962 265620 267523 269816 271892 273319 274684 276809 279551 282170 284645 287765 291948
53941 291948 296829 302097 307860 313996 319929 325461 331180 337527 344000 349779 354779 359582 364559 369574
53927 369574 374387 378890 382986 386693 390449 395102 401397 409482 418879 428951 439471 450752 463035
$$ packed form
54033C81857O294M424L454K385P13o67p82J1N92N38L30M28P35R50R98J054J178
54016D04492J004L5j585k887l096k618k461k968l732m488n276n796n612n070n098
54001C54844n862o437o177n580n409n650n743n363m505l417k639k636l059l024
53987B89343k386j993k330k720k434j845j733k034k107j878j843k176k521k620
53973B58723k451j867p67L53O64M2o29m96K25O17K80j71L0P69J255J175J081J435
53955B60268J860J834J658J903K293K076J427J365K125K742K619K475L120M183
53941B91948M881N268N763O136N933N532N719O347O473N779N000M803M977N015
53927C69574M813M503M096L707L756M653O295Q085R397J0072J0520J1281J2283
$$ plain form
53914 463035 475784 487866 498566 508212 517634 527142 536248 544283 551076 557018 562487 567301 570784
53901 570784 572394 572169 570465 567498 563478 559038 555026 551718 548573 544928 540650 535986 531089 526009
53887 526009 520935 516171 511920 508263 505338 503467 503261 505510 510619 517857 525329 530906 533203 531718
53873 531718 526480 517849 506430 492743 477035 459689 441749 424625 409201 395442 382866 371137
53861 371137 360116 349679 339780 330611 322468 315511 309744 305139 301563 298583 295600 292314 288996 286182
53847 286182 284176 282860 281865 280774 279260 277310 275343 273874 272973 272247 271427 270788 270773 271340 271913 271918 271183
53830 271183 269855 268219 266665 265631 265343 265571 265716 265273 264347 263701 264200 266042 268593 271012 272932 274486
53814 274486 275851 276962 277712 278263 279077 280569 282713 285049 287237 289526 292446 296061 299895 303724 308097
$$ packed form
53914D63035J2749J2082J0700R646R422R508R106Q035O793N942N469M814L483
53901E70784J610k25j704k967m020m440m012l308l145l645m278m664m897n080
53887E26009n074m764m251l657k925j871k06K249N109P238P472N577K297j485
53873E31718n238q631j1419j3687j5708j7346j7940j7124j5424j3759j2576j1729
53861C71137j1021j0437r899r169q143o957n767m605l576k980k983l286l318k814
53847B86182k006j316r95j091j514j950j967j469r01p26q20o39j5N67N73Np35
53830B71183j328j636j554j034k88K28J45m43r26o46M99J842K551K419J920J554
53814B74486J365J111P50N51Q14J492K144K336K188K289K920L615L834L829M373
$$ plain form
53799 308097 313790 320946 329024 337373 345567 353363 360690 367648 374273 380412 386034 391427 396816 401970
53785 401970 406545 410540 414019 416590 417738 417552 416460 414299 410435 405013 399359 394638 390608 386158
53771 386158 380739 374680 368411 361993 355439 349016 343013 337445 332151 327080 322370 318165 314318 310383
53757 310383 306024 301417 297038 293047 289170 285283 281751 278901 276437 273745 270693 267837 265824 264845
53743 264845 264645 264826 265039 265069 264854 264377 263582 262506 261442 260764 260479 260108 259165 257754 256566 256221 256731 257638
53725 257638 258612 259745 261298 263329 265654 267984 269989 271394 272236 272973 274141 275897 278000 280121 281990
53710 281990 283362 284178 284752 285561 286746 288052 289275 290506 291887 293422 295189 297504 300658 304621 309119
53695 309119 313883 318659 323160 327138 330416 332775 333978 334116 333773 333618 333851 334168 334202 333844 333238 332625 332203
$$ packed form
53799C08097N693P156Q078Q349Q194P796P327O958O625O139N622N393N389N154
53785D01970M575L995L479K571J148j86j092k161l864n422n654m721m030m450
53771C86158n419o059o269o418o554o423o003n568n294n071m710m205l847l935
53757C10383m359m607m379l991l877l887l532k850k464k692l052k856k013r79
53743B64845k00J81K13L0k15m77p95j076j064o78k85l71r43j411j188l45N10R07
53725B57638R74J133J553K031K325K330K005J405Q42P37J168J756K103K121J869
53710B81990J372Q16N74Q09J185J306J223J231J381J535J767K315L154L963M498
53695C09119M764M776M501L978L278K359J203J38l43j55K33L17L4l58o06o13m22
$$ plain form
53678 332203 331991 331844 331694 331771 332434 333748 335267 336284 336296 335285 333678 332073 330925 330368 330257 330400 330731
53661 330731 331210 331575 331405 330608 329683 329163 328866 328077 326548 324846 323510 322352 321023 319836 319405 319701 320115
53644 320115 320420 321001 322145 323690 325460 327449 329421 330988 332332 334147 336509 338459 339221 339269 339567 340244
53628 340244 340797 341241 342114 343442 344618 345486 346734 348783 350964 352376 353212 354627 357405 361194 365154
53613 365154 368911 372680 376660 380686 384540 388327 392289 396326 400034 403293 406520 410114 413905 417505
53599 417505 421066 425221 430178 435218 439342 442273 444603 447008 449467 451309 451984 451649 450958 450349 449685
53584 449685 448633 447173 445591 444143 442965 442258 442271 442969 443797 443924 442865 441026 439608 439706 441325 443403
53568 443403 444951 445960 447041 448465 449978 451366 452668 453706 453877 452689 450261 447095 443598 440054
$$ packed form
53678C32203k12j47j50P7O63J314J519J017J2j011j607j605j148n57j11J43L31
53661C30731M79L65j70p97r25n20k97p89j529j702j336j158j329j187m31K96M14
53644C20115L05N81J144J545J770J989J972J567J344J815K362J950P62M8K98O77
53628C40244N53M44Q73J328J176Q68J248K049K181J412Q36J415K778L789L960
53613C65154L757L769L980M026L854L787L962M037L708L259L227L594L791L600
53599D17505L561M155M957N040M124K931K330K405K459J842O75l35o91o09o64
53584D49685j052j460j582j448j178p07J3O98Q28J27j059j839j418R8J619K078
53568D43403J548J009J081J424J513J388J302J038J71j188k428l166l497l544
$$ plain form
53554 440054 436883 434585 433377 433022 432989 432738 432019 431115 430723 431337 432749 434333 435818 437534 439801 442340
53538 442340 444604 446586 448937 452169 456031 459902 463620 467633 472426 478149 484788 492296 500395 508659
53524 508659 517135 526594 537676 549894 561978 573337 584769 597546 612147 628126 644917 662332
53512 662332 680343 698865 717926 737881 759189 781933 805586 829314 852650 875899 899780
53501 899780 924564 949687 974292 998001 1020985 1043466 1065509 1087228 1108804 1130178 1151084
53490 1151084 1171518 1191860 1212368 1232905 1253426 1274323 1295800 1317183 1337461 1356507 1375218
53479 1375218 1394367 1413818 1433001 1451684 1469951 1487803 1505048 1521334 1536051 1548534 1558612
53468 1558612 1566687 1572965 1576928 1577944 1576085 1571958 1566009 1558472 1549802 1540537 1530739 1520101 1508552
$$ packed form
53554D40054l171k298j208l55l3k51p19r04l92O14J412J584J485J716K267K539
53538D42340K264J982K351L232L862L871L718M013M793N723O639P508Q099Q264
53524E08659Q476R459J1082J2218J2084J1359J1432J2777J4601J5979J6791J7415
53512F62332J8011J8522J9061J9955K1308K2744K3653K3728K3336K3249K3881
53501H99780K4784K5123K4605K3709K2984K2481K2043K1719K1576K1374K0906
53490A151084K0434K0342K0508K0537K0521K0897K1477K1383K0278J9046J8711
53479A375218J9149J9451J9183J8683J8267J7852J7245J6286J4717J2483J0078
53468A558612Q075O278L963J016j859m127n949p537q670r265r798j0638j1549
$$ plain form
53455 1508552 1496313 1483315 1469091 1453401 1436496 1418669 1399988 1380640 1361065 1341491 1321696
53444 1321696 1301498 1281117 1260830 1240673 1220814 1201954 1184895 1169854 1156535 1144747 1134630
53433 1134630 1126303 1119626 1114338 1110241 1107123 1104648 1102445 1100462 1099272 1099801 1102484 1106749 1111660 1116998
53419 1116998 1123336 1131134 1140328 1150933 1163445 1178247 1195112 1213646 1233800 1255456 1277927 1300513
53407 1300513 1323446 1347717 1374025 1402251 1431840 1462292 1493403 1525534 1559637 1596622 1636672
53396 1636672 1679502 1725005 1773117 1823174 1874209 1926005 1979193 2034052 2089813 2145545 2201222
53385 2201222 2257395 2314154 2370936 2427125 2482263 2535748 2586866 2635306 2681293 2725022 2766203
53374 2766203 2804280 2838930 2870149 2897966 2922207 2942479 2958239 2968965 2974398 2974609 2969604 2958834
$$ packed form
53455A508552j2239j2998j4224j5690j6905j7827j8681j9348j9575j9574j9795
53444A321696k0198k0381k0287k0157j9859j8860j7059j5041j3319j1788j0117
53433A134630q327o677n288m097l118k475k203j983j190N29K683M265M911N338
53419A116998O338P798R194J0605J2512J4802J6865J8534K0154K1656K2471K2586
53407A300513K2933K4271K6308K8226K9589L0452L1111L2131L4103L6985M0050
53396A636672M2830M5503M8112N0057N1035N1796N3188N4859N5761N5732N5677
53385B201222N6173N6759N6782N6189N5138N3485N1118M8440M5987M3729M1181
53374B766203L8077L4650L1219K7817K4241K0272J5760J0726N433K11n005j0770
$$ plain form
53362 2958834 2941394 2916953 2886361 2851057 2811942 2769154 2722967 2674439 2624893 2575017 2524776
53351 2524776 2474131 2423568 2373990 2326268 2280754 2236997 2194038 2151216 2108595 2066380 2024148
53340 2024148 1981133 1937295 1893641 1851321 1810756 1771851 1734736 1699901 1667673 1637909 1610293
53329 1610293 1584773 1561573 1540775 1521975 1504434 1487543 1471015 1454598 1437877 1420566 1402852
53318 1402852 1385203 1367904 1351069 1334937 1319809 1305672 1292351 1280082 1269504 1260824 1253402 1246508
53306 1246508 1240176 1234964 1231115 1228549 1227523 1228696 1232297 1237692 1244086 1251393 1260144 1270736 1283181
53293 1283181 1297511 1314030 1333032 1354462 1377940 1402883 1428508 1453989 1478906 1503492 1528216
53282 1528216 1553145 1577887 1602002 1625137 1646761 1666144 1682861 1697116 1709285 1719214 1726224 1729871
$$ packed form
53362B958834j7440k4441l0592l5304l9115m2788m6187m8528m9546m9876n0241
53351B524776n0645n0563m9578m7722m5514m3757m2959m2822m2621m2215m2232
53340B024148m3015m3838m3654m2320m0565l8905l7115l4835l2228k9764k7616
53329A610293k5520k3200k0798j8800j7541j6891j6528j6417j6721j7311j7714
53318A402852j7649j7299j6835j6132j5128j4137j3321j2269j0578q680p422o894
53306A246508o332n212l849k566j026J173L601N395O394P307Q751J0592J2445
53293A283181J4330J6519J9002K1430K3478K4943K5625K5481K4917K4586K4724
53282A528216K4929K4742K4115K3135K1624J9383J6717J4255J2169R929P010L647
$$ plain form
53270 1729871 1730477 1728797 1725249 1719662 1711794 1701863 1690285 1676979 1661321 1642969 1622369 1600136 1576329
53257 1576329 1550869 1524469 1498339 1472851 1447148 1420410 1392890 1365322 1337901 1310482 1283396
53246 1283396 1257327 1232475 1208401 1184613 1160761 1136412 1111323 1086027 1061536 1038166 1015171
53235 1015171 991798 968317 945651 924393 904614 886429 870166 855839 842798 830190 817786
53224 817786 806126 795732 786253 776675 766391 755677 744885 733509 720583 705830 689919 673620
53212 673620 657263 641102 625611 611056 597162 583602 570541 558363 547068 536323 526019
53201 526019 516392 507608 499497 491743 484098 476339 468245 459812 451419 443567 436369 429378 422076 414521
53187 414521 407329 400907 394901 388596 381772 374985 369081 364572 361329 358694 356002 353262 351210 350420
$$ packed form
53270A729871O06j680l548n587p868r931j1578j3306j5658j8352k0600k2233k3807
53257A576329k5460k6400k6130k5488k5703k6738k7520k7568k7421k7419k7086
53246A283396k6069k4852k4074k3788k3852k4349k5089k5296k4491k3370k2995
53235A015171k3373k3481k2666k1258j9779j8185j6263j4327j3041j2608j2404
53224H17786j1660j0394r479r578j0284j0714j0792j1376j2926j4753j5911j6299
53212F73620j6357j6161j5491j4555j3894j3560j3061j2178j1295j0745j0304
53201E26019r627q784q111p754p645p759q094q433q393p852p198o991p302p555
53187D14521p192o422o006o305o824o787n904m509l243k635k692k740k052p90
$$ plain form
53173 350420 350513 350577 350166 349419 348334 346617 344370 342268 340754 339578 338474 337761 337803 338248 338319 337676 336579
53156 336579 335379 334258 333249 332117 330353 327719 324753 322302 320643 319398 318201 316985 315667 314020
53142 314020 311990 309758 307472 305251 303505 302768 303042 303680 304172 304724 305813 307415 309012 310176 310822 310986
53126 310986 310665 309960 309187 308763 309031 310113 311795 313586 314999 315899 316544 317296 318279 319292 319994 320226 320114
53109 320114 319848 319409 318630 317463 316007 314275 312174 309853 307843 306577 305855 304994 303506 301452 299206
53094 299206 297112 295400 294157 293244 292403 291629 291287 291701 292654 293498 293778 293657 293683 294166 294812 294980 294405 293620
53076 293620 293488 294260 295316 296009 296512 297462 298932 300202 300662 300554 300600 301149 301930 302480 302564 302292 301999 301922 301855
53057 301855 301304 300127 298867 298189 298120 298107 297749 297191 296799 296777 297144 297833 298676 299495 300307 301299 302482 303508
$$ packed form
53173C50420R3O4m11p47j085j717k247k102j514j176j104p13M2M45P1o43j097
53156C36579j200j121j009j132j764k634k966k451j659j245j197j216j318j647
53142C14020k030k232k286k221j746p37K74O38M92N52J089J602J597J164O46J64
53126C10986l21p05p73m24K68J082J682J791J413R00O45P52R83J013P02K32j12
53109C20114k66m39p79j167j456j732k101k321k010j266p22q61j488k054k246
53094B99206k094j712j243r13q41p74l42M14R53Q44K80j21K6M83O46J68n75p85
53076B93620j32P72J056O93N03R50J470J270M60j08M6N49P81N50Q4k72k93p7o7
53057C01855n51j177j260o78o9j3l58n58l92k2L67O89Q43Q19Q12R92J183J026
$$ plain form
53039 303508 303931 303586 302643 301359 299941 298585 297505 296818 296443 296219 296171 296484 297116 297547 297264 296503 296156 296739
53021 296739 297734 298240 297986 297413 296994 296969 297623 299201 301347 303066 303587 303089 302354 301928 301861 302129 302972 304630
53003 304630 306883 309027 310414 311004 311296 311702 312126 312228 311864 311161 310353 309820 310098 311496 313682 315935 317821
52986 317821 319406 320886 322311 323728 325252 326905 328566 330144 331630 332969 334178 335606 337702 340346
52972 340346 342664 343753 343536 342782 342409 342832 343837 345002 346199 347607 349164 350237 350139 348878 347060 345131
52956 345131 343154 341308 340039 339464 339033 338138 336854 335762 335155 334674 333677 331874 329641 327742 326659 326184
52940 326184 325713 324823 323438 321720 320145 319486 320133 321490 322532 322944 323190 323524 323690 323697 324037 324760 325148 324752
52922 324752 324081 323626 322915 321326 319305 317858 317191 316804 316757 317777 319924 322009 322763 322043 320659 319517
$$ packed form
53039C03508M23l45r43j284j418j356j080o87l75k24m8L13O32M31k83p61l47N83
53021B96739R95N06k54n73m19k5O54J578K146J719N21m98p35m26o7K68Q43J658
53003C04630K253K144J387N90K92M06M24J02l64p03q08n33K78J398K186K253J886
52986C17821J585J480J425J417J524J653J661J578J486J339J209J428K096K644
52972C40346K318J089k17p54l73M23J005J165J197J408J557J073r8j261j818j929
52956C45131j977j846j269n75m31q95j284j092o07m81r97j803k233j899j083m75
52940C26184m71q90j385j718j575o59O47J357J042M12K46L34J66PL40P23L88l96
52922C24752o71m55p11j589k021j447o67l87m7J020K147K085P54p20j384j142
$$ plain form
52906 319517 319151 319605 320372 320724 320432 319989 319946 320276 320604 320791 320971 321102 320817 319828 318386 317215 316953 317674
52888 317674 318960 320337 321496 322229 322477 322455 322362 321883 320439 318176 316231 315560 315898 316377 316733 317212 317590
52871 317590 317257 316343 315876 316511 317770 318924 319990 321415 323305 325568 328428 332114 336175 339664 341996
52856 341996 343213 343464 342757 341240 339203 336572 332866 327996 322737 318008 313898 309890 305925 302623 300346
52841 300346 298581 296637 294531 292702 291108 289217 286844 284476 282660 281592 281424 282396 284293 286177 287142
52826 287142 287147 286742 286172 285268 284077 283097 282680 282519 281993 280978 280139 280324 281659 283373 284613 285285 285866 286626
52808 286626 287525 288892 291451 295278 299198 301730 302410 301826 300720 299463 298144 296584 294435 291773 289433
52793 289433 288237 287969 287667 286864 285937 285222 284491 283557 282777 282520 282467 281946 280799 279592 278967 279091 279793 280995
$$ packed form
52906C19517l66M54P67L52k92m43m3L30L28J87J80J31k85r89j442j171k62P21
52888C17674J286J377J159P33K48k2r3m79j444k263j945o71L38M79L56M79L78
52871C17590l33r14m67O35J259J154J066J425J890K263K860L686M061L489K332
52856C41996J217K51p07j517k037k631l706m870n259m729m110m008l965l302k277
52841C00346j765j944k106j829j594j891k373k368j816j068j68R72J897J884R65
52826B87142Nm05n70r04j191r80m17j61n26j015q39J85J335J714J240O72N81P60
52808B86626Q99J367K559L827L920K532O80n84j106j257j319j560k149k662k340
52793B89433j196k68l02q03r27p15p31r34p80k57n3n21j147j207o25J24P02J202
$$ plain form
52775 280995 282767 284909 286765 287728 287911 288022 288523 289260 290023 290982 292259 293449 294006 293851 293256 292383 291398
52758 291398 290698 290506 290466 290187 289953 290254 290796 290757 290015 289405 289580 290272 290860 291116 291174 291291 291836 293089 294815
52739 294815 296408 297512 298167 298382 298159 297963 298475 299675 300835 301637 302628 304314 306490 308829 311401 314031
52723 314031 315832 316129 315428 314830 314819 315240 316073 317397 318753 319374 319109 318527 317966 317084 315542 313652 312072
52706 312072 311142 310794 310955 311717 313007 314230 314466 313300 311374 309851 309244 309122 309035 309235 310143 311496 312500
52689 312500 312683 312195 311413 310652 310289 310757 312288 314727 317590 320196 321962 322793 323107 323299 323332 323016 322462
52672 322462 321986 321728 321636 321635 321527 320910 319562 317852 316445 315668 315407 315484 315752 315922 315730 315331 315168 315413 315914
52653 315914 316676 317999 319937 322040 323900 325668 327636 329520 330610 330651 330184 329797 329335 328198 326345 324560
$$ packed form
52775B80995J772K142J856R63J83J11N01P37P63R59J277J190N57j55n95q73r85
52758B91398p00j92m0k79k34L01N42l9p42o10J75O92N88K56N8J17N45J253J726
52739B94815J593J104O55K15k23j96N12J200J160Q02R91J686K176K339K572K630
52723C14031J801K97p01n98j1M21Q33J324J356O21k65n82n61q82j542j890j580
52706C12072r30l48J61P62J290J223K36j166j926j523o07j22q7K00R08J353J004
52689C12500J83m88p82p61l63M68J531K439K863K606J766Q31L14J92L3l16n54
52672C22462m76k58r2jj08o17j348j710j407p77k61P7K68J70j92l99j63K45N01
52653C15914P62J323J938K103J860J768J968J884J090M1m67l87m62j137j853j785
$$ plain form
52637 324560 323607 323444 323530 323649 323958 324428 324786 325107 325905 327388 328984 329952 330178 330032 329712 329083 327989 326380
52619 326380 324275 321967 320133 319275 319019 318367 316745 314549 312575 311263 310642 310713 311538 312976 314605 316001
52603 316001 317042 317931 318992 320457 322352 324471 326456 328020 329169 330140 331146 332288 333695 335466 337395
52588 337395 339051 340311 341455 342449 342624 341663 340528 340604 341997 343496 344263 344627 345062 345353 345358 345670 346717
52571 346717 347792 347796 346577 344788 342821 340741 339001 338217 338188 337929 336814 335013 332734 329865 326722 324436
52555 324436 323975 325054 326430 327152 327177 326931 326714 326637 326851 327491 328314 328700 328374 328043 328784 330617 332223 332461
52537 332461 331730 331303 331674 332239 332367 332028 331389 330583 330032 330316 331357 332238 332186 331386 330612 330398 330794 331545 332175
52518 332175 332260 332022 332460 334479 337972 342040 346004 349889 353915 357880 361220 363564 365035 365969 366429 366122
$$ packed form
52637C24560r53j63Q6J19L09M70L58L21P98J483J596R68K26j46l20o29j094j609
52619C26380k105k308j834q58k56o52j622k196j974j312o21P1Q25J438J629J396
52603C16001J041Q89J061J465J895K119J985J564J149R71J006J142J407J771J929
52588C37395J656J260J144R94J75r61j135P6J393J499P67L64M35K91NL12J047
52571C46717J075Mj219j789j967k080j740p84k9k59j115j801k279k869l143k286
52555C24436m61J079J376P22K5k46k17p7K14O40Q23L86l26l31P41J833J606K38
52537C32461p31m27L71N65J28l39o39q06n51K84J041Q81n2q00p74k14L96P51O30
52518C32175Q5k38M38K019L493M068L964L885M026L965L340K344J471R34M60l07
$$ plain form
52502 366122 364797 362593 359890 356970 353927 350766 347454 344054 340981 338915 338130 338005 337568 336441 334929
52487 334929 333323 331643 330116 329340 329675 330797 332098 333235 334077 334465 334390 334271 334671 335766 337287 338903
52471 338903 340466 342000 343730 346060 349214 352797 356043 358691 361361 364757 368635 372002 374341 376047
52457 376047 377372 377514 375495 371724 367803 364647 361605 357732 353161 348630 344296 339897 335778 332809
52443 332809 331185 330022 328343 326064 323841 322313 321624 321426 321267 321056 321064 321344 321437 321016 320472 320396 320753 321129
52425 321129 321512 322111 322581 322297 321434 320944 321295 321991 322616 323548 325278 327694 330448 333386 336206 338325 339662
52408 339662 341074 343506 347186 352088 358592 366924 376446 386211 395907 405397 413680 419300 421857 422217
52394 422217 421092 418241 413423 407372 401247 395548 390165 385188 381005 377622 374495 371306 368560 367068
$$ packed form
52502C66122j325k204k703k920l043l161l312l400l073k066p85j25m37j127j512
52487C34929j606j680j527p76L35J122J301J137Q42L88p5j19M00J095J521J616
52471C38903J563J534J730K330L154L583L246K648K670L396L878L367K339J706
52457C76047J325J42k019l771l921l156l042l873m571m531m334m399m119k969
52443C32809j624j163j679k279k223j528o89j98j59k11QK80R3m21n44p6L57L76
52425C21129L83N99M70k84q63m90L51O96O25R32J730K416K754K938K820K119J337
52408C39662J412K432L680M902O504Q332R522R765R696R490Q283N620K557L60
52394D22217j125k851m818o051o125n699n383m977m183l383l127l189k746j492
$$ plain form
52380 367068 366974 367642 368513 369684 371467 373777 376353 379386 383338 388141 393098 397747 402267 406674 410188
52365 410188 412005 412513 413050 414438 416200 417378 417680 417538 417326 416893 415889 414301 412612 411520 411574 412933
52349 412933 415209 417527 419072 419830 420601 421963 423411 424007 423858 424407 426978 431439 436602 441560 446252
52334 446252 451040 456278 462259 469105 476623 484592 493298 503485 515555 528948 542508 555493 568136
52321 568136 581187 594961 609007 622753 636282 650241 665089 680742 696909 713484 730573
52310 730573 748489 767794 788939 811669 835094 858591 882289 906510 931133 955961 981358
52299 981358 1007875 1035179 1061749 1085829 1106573 1124329 1140057 1154443 1167343 1177987 1185808 1191068
52287 1191068 1194647 1197256 1198921 1199129 1197356 1193585 1188438 1182803 1177332 1172331 1167969 1164286 1161001 1157728
$$ packed form
52380C67068r4O68Q71J171J783K310K576L033L952M803M957M649M520M407L514
52365D10188J817N08N37J388J762J178L02j42k12m33j004j588j689j092N4J359
52349D12933K276K318J545P58P71J362J448N96j49N49K571M461N163M958M692
52334D46252M788N238N981O846P518P969Q706J0187J2070J3393J3560J2985J2643
52321E68136J3051J3774J4046J3746J3529J3959J4848J5653J6167J6575J7089
52310G30573J7916J9305K1145K2730K3425K3497K3698K4221K4623K4828K5397
52299I81358K6517K7304K6570K4080K0744J7756J5728J4386J2900J0644P821N260
52287A191068L579K609J665K08j773l771n147n635n471n001m362l683l285l273
$$ plain form
52273 1157728 1154522 1151884 1150139 1149168 1148902 1149641 1151613 1154669 1158778 1164337 1171506 1179587 1187719 1195949 1205060
52258 1205060 1215543 1227366 1240658 1255818 1272816 1291053 1310149 1330249 1351152 1371609 1390009
52247 1390009 1405668 1419132 1431327 1442627 1452647 1460671 1466287 1469751 1471813 1473180 1474113 1474437 1473761
52234 1473761 1471726 1468246 1463598 1458173 1452089 1445095 1436882 1427407 1416990 1406184 1395474 1384976 1374478
52221 1374478 1363859 1353426 1343695 1334963 1327200 1320233 1313867 1308019 1302936 1299175 1297051 1296240 1296172 1296736
52207 1296736 1298232 1300719 1303858 1307450 1311644 1316446 1321406 1326111 1330806 1336222 1342885 1350782 1359639 1369262
52193 1369262 1379524 1390111 1400442 1409979 1418631 1426678 1434163 1440459 1444664 1446410 1446130 1444524 1441967
52180 1441967 1438390 1433578 1427452 1420176 1412024 1403167 1393712 1384017 1374752 1366385 1358696 1351044 1343180 1335633
$$ packed form
52273A157728l206k638j745r71k66P39J972L056M109N559P169Q081Q132Q230R111
52258A205060J0483J1823J3292J5160J6998J8237J9096K0100K0903K0457J8400
52247A390009J5659J3464J2195J1300J0020Q024N616L464K062J367R33L24o76
52234A473761k035l480m648n425o084o994q213r475j0417j0806j0710j0498j0498
52221A374478j0619j0433r731q732p763o967o366n848n083l761k124q11o8N64
52207A296736J496K487L139L592M194M802M960M705M695N416O663P897Q857R623
52193A369262J0262J0587J0331R537Q652Q047P485O296M205J746k80j606k557
52180A441967l577m812o126p276q152q857r455r695r265q367p689p652p864p547
$$ plain form
52166 1335633 1329395 1325325 1323717 1324086 1325421 1326914 1328486 1330418 1332541 1334134 1334661 1334237 1333279 1331920 1329982
52151 1329982 1327340 1324233 1321291 1319259 1318546 1318963 1320046 1321568 1323561 1325885 1328119 1329954 1331459 1332813
52137 1332813 1333988 1334781 1335039 1334797 1334310 1334021 1334327 1335448 1337652 1341512 1347644 1356167 1366717 1379014 1393080
52122 1393080 1408848 1425960 1444124 1463367 1483678 1504686 1526007 1547644 1569753 1592076 1613940
52111 1613940 1634818 1654714 1674098 1693585 1713615 1734255 1755313 1776698 1798588 1821122 1844135
52100 1844135 1867377 1890869 1914710 1938475 1960982 1980718 1996436 2007465 2013828 2016263 2015871 2013260
52088 2013260 2007942 1998907 1986075 1971006 1955841 1941477 1927158 1911868 1895809 1880221 1866050 1853189
52076 1853189 1840941 1828903 1817300 1806712 1797592 1789983 1783711 1778848 1775851 1775171 1776946 1781211 1788070
$$ packed form
52166A335633o238m070j608L69J335J493J572J932K123J593N27m24r58j359j938
52151A329982k642l107k942k032p13M17J083J522J993K324K234J835J505J354
52137A332813J175P93K58k42m87k89L06J121K204L860O132Q523J0550J2297J4066
52122A393080J5768J7112J8164J9243K0311K1008K1321K1637K2109K2323K1864
52111A613940K0878J9896J9384J9487K0030K0640K1058K1385K1890K2534K3013
52100A844135K3242K3492K3841K3765K2507J9736J5718J1029O363K435l92k611
52088B013260n318r035j2832j5069j5165j4364j4319j5290j6059j5588j4171j2861
52076A853189j2248j2038j1603j0588r120p609o272m863k997o80J775M265O859
$$ plain form
52063 1788070 1797320 1808132 1819593 1831509 1844327 1858409 1873821 1890694 1909100 1928463 1947653
52052 1947653 1965865 1982840 1998065 2010465 2019431 2025668 2030332 2033579 2034500 2032398 2027513 2020541 2011964
52039 2011964 2002101 1991406 1980402 1969373 1958180 1946282 1933039 1918255 1902525 1886795 1871437
52028 1871437 1855844 1839084 1820884 1801912 1783173 1765195 1747679 1729826 1711058 1691666 1672836
52017 1672836 1655835 1640890 1626911 1612589 1597886 1584190 1572856 1563803 1555696 1547218 1537692 1526635
52005 1526635 1513308 1497068 1477984 1456862 1434730 1412286 1389666 1366615 1343002 1319187 1295785
51994 1295785 1273100 1250985 1229199 1207632 1186164 1164569 1142663 1120315 1097283 1073364 1048859
51983 1048859 1024628 1001463 979480 958216 937122 915857 894415 873148 852576 833051 814811
$$ packed form
52063A788070R250J0812J1461J1916J2818J4082J5412J6873J8406J9363J9190
52052A947653J8212J6975J5225J2400Q966O237M664L247R21k102m885o972q577
52039B011964r863j0695j1004j1029j1193j1898j3243j4784j5730j5730j5358
52028A871437j5593j6760j8200j8972j8739j7978j7516j7853j8768j9392j8830
52017A672836j7001j4945j3979j4322j4703j3696j1334r053q107q478r526j1057
52005A526635j3327j6240j9084k1122k2132k2444k2620k3051k3613k3815k3402
51994A295785k2685k2115k1786k1567k1468k1595k1906k2348k3032k3919k4505
51983A048859k4231k3165k1983k1264k1094k1265k1442k1267k0572j9525j8240
$$ plain form
51972 814811 798432 784884 774820 767933 763312 760404 759427 760818 764456 769539 775190 781110 787412 793711
51958 793711 798641 800616 799017 794319 787241 778314 768324 758496 749836 742592 736658 732139 729274 728143
51944 728143 728831 731564 736358 742796 750581 760016 771487 784579 798099 810851 822041 831194 838139
51931 838139 842998 845719 845717 842432 836205 828066 818554 807183 793257 776898 759088 741009 723490
51918 723490 706829 690943 675776 661621 648933 637870 628269 620134 613909 610122 608896 609880 612568
51905 612568 616645 622165 629352 638102 647686 657085 665499 672314 676738 677985 675986 671527 665464 658080
51891 658080 649560 640879 633759 629600 628604 630109 633695 639846 649461 662801 678954 696324 713472
51878 713472 729505 743866 756011 765362 771514 774497 774737 772559 767760 759987 749666 738184 726766
$$ packed form
51972H14811j6379j3548j0064o887m621k908r77J391L638N083N651N920O302O299
51958G93711M930J975j599m698p078q927r990r828q660p244n934m519k865j131
51944G28143O88K733M794O438P785R435J1471J3092J3520J2752J1190R153O945
51931H38139M859K721kl285o227q139r512j1371j3926j6359j7810j8079j7519
51918G23490j6661j5886j5167j4155j2688j1063r601q135o225l787j226R84K688
51905F12568M077N520P187Q750R584R399Q414O815M424J247j999m459o063p384
51891F58080q520q681p120m159r96J505L586O151R615J3340J6153J7370J7148
51878G13472J6033J4361J2145R351O152K983K40k178m799p773j0321j1482j1418
$$ plain form
51865 726766 715432 703485 690891 678657 667843 658683 650846 644129 638660 634663 632201 630919 629945
51852 629945 628344 625864 622950 619861 616121 611180 605293 599216 593156 586527 578851 570459 562088 554180
51838 554180 546896 540611 535885 532851 530942 529490 528472 528491 530000 532716 535836 538662 540891 542378 542881
51823 542881 542209 540579 538630 536941 535605 534360 533172 532470 532722 533868 535313 536404 536811 536580 536026 535539
51807 535539 535231 534746 533564 531510 528782 525610 522212 519082 516913 516034 516190 517007 518313 519858 521084
51792 521084 521561 521399 520913 520078 518650 516660 514421 512193 510168 508607 507559 506582 505196 503611 502506
51777 502506 502041 501618 500855 500388 501359 504302 508882 514585 521379 529583 539249 549794 560273 569919 578313
51762 578313 585095 589748 591744 590730 586551 579482 570683 561983 554614 548247 541681 534365 526751 519349
$$ packed form
51865G26766j1334j1947j2594j2234j0814r160p837o717n469l997k462j282r74
51852F29945j601k480k914l089l740m941n887o077o060o629p676q392q371p908
51838E54180p284o285m726l034j909j452j018J9J509K716L120K826K229J487N03
51823E42881o72j630j949j689j336j245j188p02K52J146J445J091M07k31n54m87
51807E35539l08m85j182k054k728l172l398l130k169q79J56Q17J306J545J226
51792E21084M77j62m86q35j428j990k239k228k025j561j048r77j386j585j105
51777E02506m65m23p63m67R71K943M580N703O794Q204R666J0545J0479R646Q394
51762E78313O782M653J996j014m179p069q799q700p369o367o566p316p614p402
$$ plain form
51748 519349 512161 505261 499276 494824 491819 489724 488303 487837 488740 491186 495038 499977 505761 512457 520265
51733 520265 529007 537990 546387 553612 559332 563483 566456 569006 571745 574851 578329 582192 586180 589599
51719 589599 591799 592648 592303 590710 587739 583748 579660 576314 573855 571702 568991 565164 560409 555647 551985
51704 551985 550105 550066 551491 553708 555852 557092 556929 555277 552363 548700 545112 542579 541769 542585 544126
51689 544126 545229 545214 544122 542216 539381 535218 529708 523536 517658 512715 508916 506245 504571 503612 502953
51674 502953 502155 500915 499255 497508 495986 494699 493566 492851 493172 495102 499034 505302 513960 524221 534523
51659 534523 543437 550294 554863 556842 556093 553155 549135 545150 542008 540149 539574 540003 541333 543726 546881
51644 546881 549517 550105 548054 543838 538069 530959 522655 513615 504467 495831 488295 482146 477082 472594
$$ packed form
51748E19349p188o900n985m452l005k095j421m66R03K446L852M939N784O696P808
51733E20265Q742Q983Q397P225N720M151K973K550K739L106L478L863L988L419
51719E89599K200Q49l45j593k971l991m088l346k459k153k711l827m755m762l662
51704E51985j880l9J425K217K144J240j63j652k914l663l588k533q10Q16J541
51689E44126J103j5j092j906k835m163n510o172n878m943l799k671j674r59o59
51674E02953p98j240j660j747j522j287j133p15L21J930L932O268Q658J0261J0302
51659E34523Q914O857M569J979p49k938m020l985l142j859n75M29J330K393L155
51644E46881K636N88k051m216n769p110q304r040r148q636p536o149n064m488
$$ plain form
51630 472594 468805 466445 465834 466305 467005 467864 469331 471483 473896 476284 478712 481146 483249 484782 485849
51615 485849 486601 486945 486713 485870 484366 482003 478687 474727 470698 467138 464437 462816 462134 461904 461845 462297
51599 462297 463767 466217 469355 473592 480012 489116 500175 512198 524902 538070 550434 560194 566655
51586 566655 570608 573057 574322 574550 574260 573891 573489 573396 574749 578556 584647 592209 601164 612246 625732
51571 625732 640916 657105 674495 693563 714012 734857 755472 776130 797487 819954 843816
51560 843816 869724 898738 931733 968852 1009407 1051966 1094259 1133332 1166367 1191619 1208424
51549 1208424 1216302 1214492 1202577 1181249 1152030 1116394 1075454 1030471 983318 936227 891071 848775
51537 848775 809355 772576 738591 707844 680482 656242 635005 616950 601906 588998 577478
$$ packed form
51630D72594l789k360o11M71P00Q59J467K152K413K388K428K434K103J533J067
51615D85849P52L44k32q43j504k363l316l960m029l560k701j621o82k30n9M52
51599D62297J470K450L138M237O420R104J1059J2023J2704J3168J2364R760O461
51586E66655L953K449J265K28k90l69m02r3J353L807O091P562Q955J1082J3486
51571F25732J5184J6189J7390J9068K0449K0845K0615K0658K1357K2467K3862
51560H43816K5908K9014L2995L7119M0555M2559M2293L9073L3035K5252J6805
51549A208424P878j810j1915k1328k9219l5636m0940m4983m7153m7091m5156m2296
51537H48775l9420l6779l3985l0747k7362k4240k1237j8055j5044j2908j1520
$$ plain form
51526 577478 567574 559889 554117 549022 543722 538377 533471 529017 524803 520976 517956 515935 514726 513911
51512 513911 512954 511401 509238 506917 504823 502848 500611 497896 494640 490732 486201 481623 477950 475766
51498 475766 474766 474106 473229 472299 471874 472267 473317 474713 476339 478231 480408 482962 486154 490160 494740
51483 494740 499437 504056 508622 512822 515914 517418 517690 517515 517251 516564 514903 512044 508195 503746 498964
51468 498964 493946 488772 483584 478344 472638 466079 458976 452306 446832 442440 438459 434446 430499 427023
51454 427023 424429 422888 422136 421626 421131 421158 422532 425658 430350 436346 443771 453085 464707 478600 493947
51439 493947 509233 522910 534247 543560 551650 559062 565843 571777 576583 579822 580793 578897 574289 567974
51425 567974 560958 553345 544594 534651 524401 514901 506587 499463 493592 488926 484957 481075 477227 473846
$$ packed form
51526E77478r904p685n772n095n300n345m906m454m214l827l020k021j209q15
51512E13911r57j553k163k321k094j975k237k715l256l908m531m578l673k184
51498D75766j000o60q77r30m25L93J050J396J626J892K177K554L192M006M580
51483D94740M697M619M566M200L092J504K72j75k64o87j661k859l849m449m782
51468D98964n018n174n188n240n706o559p103o670n474m392l981m013l947l476
51454D27023k594j541p52n10m95K7J374L126M692N996P425R314J1622J3893J5347
51439D93947J5286J3677J1337R313Q090P412O781N934M806L239R71j896m608o315
51425E67974p016p613q751r943j0250r500q314p124n871m666l969l882l848l381
$$ plain form
51411 473846 471213 469311 468174 467876 468144 468472 468739 469340 470601 472468 474875 477955 481680 485703 489832
51396 489832 494307 499303 504504 509558 514695 520539 527486 535688 545536 557747 572961 591531 613643
51383 613643 639391 668806 702107 739894 782758 830740 883411 940397 1001382 1065383 1130214
51372 1130214 1192711 1249391 1297090 1333542 1357665 1369213 1368104 1354290 1328282 1291494 1245896
51361 1245896 1193512 1136354 1076538 1016093 956603 899139 844507 793546 747244 706478 671456
51350 671456 641434 615220 591979 571372 553052 536529 521670 508894 498492 490013 482629 475914
51338 475914 470016 465237 461735 459458 458065 456978 455701 454002 451708 448704 445432 443051 442549 443723
51324 443723 445369 446352 446247 445242 443951 443207 443441 444186 444597 444423 444041 443657 443061 442256 441639 441354 440985 440187
$$ packed form
51411D73846k633j902j137k98K68L28K67O01J261J867K407L080L725M023M129
51396D89832M475M996N201N054N137N844O947Q202R848J2211J5214J8570K2112
51383F13643K5748K9415L3301L7787M2864M7982N2671N6986O0985O4001O4831
51372A130214O2497N6680M7699L6452K4123J1548j109j3814k6008l6788m5598
51361A245896n2384n7158n9816o0445n9490n7464n4632n0961m6302m0766l5022
51350F71456l0022k6214k3241k0607j8320j6523j4859j2776j0402q479p384o715
51338D75914n898m779l502k277j393j087j277j699k294l004l272k381n02J174
51324D43723J646R83j05j005j291p44K34P45M11j74l82l84n96q05o17k85l69p98
$$ plain form
51306 440187 439179 438379 438000 438202 439075 440111 440238 438862 436550 434253 432273 430437 428816 427573 426377
51291 426377 424734 422848 421544 421291 421823 422796 424300 426608 429895 434318 439981 446635 453733 460845 467715
51276 467715 473862 478580 481519 482959 483308 482665 481044 478701 475976 473061 470206 467963 466921 467225 468458
51261 468458 469834 470446 469686 467821 466041 465465 466026 466553 465979 464212 461717 458642 454775 450292 446033 442733
51245 442733 440191 437625 434896 432961 432860 434466 436520 437803 437975 437393 436543 435828 435564 435780 436082 435950
51229 435950 435279 434474 433928 433560 433085 432714 433232 435145 437952 440634 442752 444630 446453 447827 448466 448784
51213 448784 449383 450376 451693 453608 456212 458631 459653 459263 458834 459545 461305 463460 465874 468708 471616
51198 471616 473856 475096 475633 475891 476123 476568 477400 478387 478912 478578 477671 476881 476677 477090 478087 479832 482364
$$ packed form
51306D40187j008q00l79K02Q73J036J27j376k312k297j980j836j621j243j196
51291D26377j643j886j304k53N32R73J504K308L287M423N663O654P098P112O870
51276D67715O147M718K939J440L49o43j621k343k725k915k855k243j042L04J233
51261D68458J376O12p60j865j780n76N61N27n74j767k495l075l867m483m259l300
51245D42733k542k566k729j935j01J606K054J283J72n82q50p15k64K16L02j32
51229D35950o71q05n46l68m75l71N18J913K807K682K118J878J823J374O39L18
51213D48784N99R93J317J915K604K419J022l90m29P11J760K155K414K834K908
51198D71616K240J240N37K58K32M45Q32R87N25l34r07p90k04M13R97J745K532
$$ plain form
51181 482364 485117 487184 488173 488447 488239 486970 484013 479927 476212 473767 472184 470735 469305 468002 466407
51166 466407 463896 460462 456805 453767 452034 452061 453782 456452 459236 461943 464864 467984 470741 472555 473233
51151 473233 472901 471883 470736 470040 470002 470391 470908 471422 471798 471692 470727 468814 466296 463768 461767 460560 460152
51134 460152 460409 461025 461554 461752 461906 462495 463491 464451 465417 467203 470435 474740 479291 483714 487891 491341
51118 491341 493585 495021 496579 498448 499914 500593 501052 501789 502332 501999 501148 500941 501922 503415 504453 504895
51102 504895 505417 506674 508739 511309 514112 516939 519426 521197 522312 523288 524498 525754 526732 527528 528493
51087 528493 529694 530964 532322 533912 535505 536536 536690 536163 535304 534356 533496 532743 531806 530437 528926 527844
51071 527844 527331 527132 527257 527931 528905 529708 530793 533490 538275 543940 549229 554579 561343 569872 579392 589384
$$ packed form
51181D82364K753K067R89K74k08j269k957m086l715k445j583j449j430j303j595
51166D66407k511l434l657l038j733K7J721K670K784K707K921L120K757J814O78
51151D73233l32j018j147o96l8L89N17N14L76j06r65j913k518k528k001j207m08
51134D60152K57O16N29J98J54N89R96R60R66J786L232M305M551M423M177L450
51118D91341K244J436J558J869J466O79M59P37N43l33q51k07R81J493J038M42
51102E04895N22J257K065K570K803K827K487J771J115R76J210J256R78P96R65
51087E28493J201J270J358J590J593J031J54n27q59r48q60p53r37j369j511j082
51071E27844n13j99J25O74R74Q03J085K697M785N665N289N350O764Q529R520R992
$$ plain form
51055 589384 599797 609957 618508 624954 630424 636514 643988 652936 663420 675287 687869 700560 713522
51042 713522 727234 741380 754606 765381 772850 776997 778404 777946 776399 774036 770495 765030 757002
51029 757002 746312 733529 719531 705060 690669 676992 664731 654214 645220 637429 630914 626060
51017 626060 623155 622264 623336 626209 630538 635865 641769 647886 653910 659751 665676 672162 679582 687966
51003 687966 696937 705869 714329 722487 730936 740083 749910 760457 772091 784995 798680 812567 826883
50990 826883 842404 859208 876191 892029 906306 919474 932145 944816 957913 971615 985628
50979 985628 999572 1013632 1028480 1044435 1061028 1077572 1093945 1110675 1128523 1148307 1171022
50968 1171022 1197677 1228873 1264711 1305193 1350529 1400879 1456091 1515932 1580427 1649549 1722530
$$ packed form
51055E89384J0413J0160Q551O446N470O090P474Q948J0484J1867J2582J2691J2962
51042G13522J3712J4146J3226J0775P469M147J407m58j547k363l541n465q028
51029G57002j0690j2783j3998j4471j4391j3677j2261j0517q994p791o515m854
51017F26060k905q91J072K873M329N327N904O117O024N841N925O486P420Q384
51003F87966Q971Q932Q460Q158Q449R147R827J0547J1634J2904J3685J3887J4316
50990H26883J5521J6804J6983J5838J4277J3168J2671J2671J3097J3702J4013
50979I85628J3944J4060J4848J5955J6593J6544J6373J6730J7848J9784K2715
50968A171022K6655L1196L5838M0482M5336N0350N5212N9841O4495O9122P2981
$$ plain form
50957 1722530 1797873 1874267 1951151 2028034 2103426 2174953 2240616 2299685 2352330 2398792 2439167
50946 2439167 2473601 2502209 2524898 2541793 2554026 2563757 2573003 2582379 2591037 2597736 2601790 2603151 2601907
50933 2601907 2597954 2591033 2580878 2567243 2549872 2528516 2502911 2472560 2436578 2394020 2344694 2289595
50921 2289595 2230265 2167586 2101483 2031916 1959909 1887312 1815740 1746090 1678964 1614969 1554528
50910 1554528 1497834 1445241 1397297 1354054 1314694 1278227 1244418 1213601 1185812 1160612 1137708
50899 1137708 1117161 1098924 1082690 1068407 1056421 1046847 1039161 1032709 1027226 1022532 1018118 1013605 1009388
50886 1009388 1006295 1004669 1004176 1004460 1005556 1007688 1011099 1016062 1022566 1029932 1037279 1044546 1052668 1062479
50872 1062479 1073796 1085853 1098324 1111623 1126443 1143226 1161900 1181922 1202812 1224863 1249068
$$ packed form
50957A722530P5343P6394P6884P6883P5392P1527O5663N9069N2645M6462M0375
50946B439167L4434K8608K2689J6895J2233R731R246R376Q658O699M054J361j244
50933B601907l953o921j0155j3635j7371k1356k5605l0351l5982m2558m9326n5099
50921B289595n9330o2679o6103o9567p2007p2597p1572o9650o7126o3995o0441
50910A554528n6694n2593m7944m3243l9360l6467l3809l0817k7789k5200k2904
50899A137708k0547j8237j6234j4283j1986r574p686o452n483m694m414m513m217
50886A009388l093j626m93K84J096K132L411M963O504P366P347P267Q122R811
50872A062479J1317J2057J2471J3299J4820J6783J8674K0022K0890K2051K4205
$$ plain form
50861 1249068 1276105 1305797 1337960 1373434 1413647 1459329 1510361 1566991 1630546 1702561 1783646
50850 1783646 1873643 1972653 2081430 2200754 2330730 2470787 2620114 2778015 2943877 3116878
50840 3116878 3295592 3477705 3659990 3838607 4009608 4169391 4314885 4443514 4553186
50831 4553186 4642401 4710370 4757203 4784256 4794238 4790605 4776511 4754501 4727305 4698532 4672071 4650871
50819 4650871 4636485 4629415 4629096 4633411 4638813 4641380 4637648 4624487 4598737 4557515 4498744 4421266 4324769
50806 4324769 4210008 4078875 3933879 3777597 3612828 3443017 3271905 3102698 2937855
50797 2937855 2779671 2630519 2492290 2365886 2251548 2149459 2059683 1981668 1914298 1856571
50787 1856571 1808029 1768292 1736331 1710482 1689236 1671830 1657939 1646957 1637802 1629437 1621354 1613491
$$ packed form
50861A249068K7037K9692L2163L5474M0213M5682N1032N6630O3555P2015Q1085
50850A783646Q9997R9010J08777J19324J29976J40057J49327J57901J65862J73001
50840C116878J78714J82113J82285J78617J71001J59783J45494J28629J09672
50831D553186Q9215O7969M6833K7053R982l633j4094k2010k7196k8773k6461k1200
50819D650871j4386p070l19M315N402K567l732j3161k5750m1222n8771p7478r6497
50806D324769j14761j31133j44996j56282j64769j69811j71112j69207j64843
50797B937855j58184j49152j38229j26404j14338j02089q9776p8015o7370n7727
50787A856571m8542l9737l1961k5849k1246j7406j3891j0982r155q365q083p863
$$ plain form
50775 1613491 1605816 1598085 1589926 1581005 1571110 1560088 1547709 1533659 1517796 1500398 1482044 1463180
50763 1463180 1443956 1424374 1404365 1383662 1361982 1339654 1317822 1297712 1279821 1264114 1250802
50752 1250802 1240430 1233119 1228246 1225153 1223919 1225194 1229547 1237243 1248480 1263439 1282185 1304789 1331497
50739 1331497 1362436 1397219 1435382 1477415 1524940 1579434 1640968 1708602 1781729 1860436 1944576
50728 1944576 2033179 2125167 2220151 2317990 2417808 2517959 2616836 2713191 2805598 2892054 2970297
50717 2970297 3038205 3093785 3135189 3161221 3171828 3167970 3151191 3123476 3087459 3046407 3003810
50706 3003810 2962840 2926013 2895075 2871024 2854143 2844102 2840228 2841680 2847084 2853869 2858364 2857019
50694 2857019 2847515 2828375 2797889 2754262 2697040 2627856 2549480 2464508 2375070 2283149 2190635
$$ packed form
50775A613491p675p731q159q921r895j1022j2379j4050j5863j7398j8354j8864
50763A463180j9224j9582k0009k0703k1680k2328k1832k0110j7891j5707j3312
50752A250802j0372p311m873l093j234J275M353P696J1237J4959J8746K2604K6708
50739A331497L0939L4783L8163M2033M7525N4494O1534O7634P3127P8707Q4140
50728A944576Q8603R1988R4984R7839R9818J00151R8877R6355R2407Q6456P8243
50717B970297O7908N5580M1404K6032J0607l858j6779k7715l6017m1052m2597
50706C003810m0970l6827l0938k4051j6881j0041l874J452N404O785M495j345
50694B857019r504j9140l0486m3627n7222o9184p8376q4972q9438r1921r2514
$$ plain form
50683 2190635 2099409 2011725 1930084 1856147 1790013 1731053 1679295 1635589 1600651 1574501 1556728
50672 1556728 1546822 1544158 1548072 1557879 1572604 1590929 1611814 1634888 1659698 1684828 1708504 1729982
50660 1729982 1749671 1767850 1784092 1798120 1810520 1822195 1833634 1844917 1855878 1865989 1874690
50649 1874690 1882280 1890010 1898913 1909051 1920314 1933468 1949759 1969815 1993522 2020764 2051730 2086601
50637 2086601 2125411 2168091 2214265 2263093 2313734 2365766 2418794 2471860 2523727 2573680 2621726
50626 2621726 2668209 2713550 2757712 2798896 2832843 2854588 2861588 2854900 2837327 2811164 2777978 2739621
50614 2739621 2698572 2657512 2619042 2585423 2557924 2536400 2520011 2508192 2500474 2495536 2491205 2485542
50602 2485542 2477385 2465561 2448178 2423309 2390177 2349188 2300968 2245911 2184803 2119292 2051367
$$ packed form
50683B190635r1226q7684q1641p3937o6134n8960n1758m3706l4938k6150j7773
50672A556728r906k664L914R807J4725J8325K0885K3074K4810K5130K3676K1478
50660A729982J9689J8179J6242J4028J2400J1675J1439J1283J0961J0111Q701
50649A874690P590P730Q903J0138J1263J3154J6291K0056K3707K7242L0966L4871
50637B086601L8810M2680M6174M8828N0641N2032N3028N3066N1867M9953M8046
50626B621726M6483M5341M4162M1184L3947K1745P000o688j7573k6163l3186l8357
50614B739621m1049m1060l8470l3619k7499k1524j6389j1819p718m938m331n663
50602B485542q157j1824j7383k4869l3132m0989m8220n5057o1108o5511o7925
$$ plain form
50591 2051367 1982505 1913579 1845357 1778731 1714531 1653486 1596391 1543955 1496396 1453420 1414795
50580 1414795 1380678 1351262 1326327 1305371 1288013 1274079 1263439 1256015 1251768 1250427 1251306 1253575
50568 1253575 1256660 1260245 1264210 1268934 1275392 1284351 1295420 1307371 1319477 1332160 1346357 1362892
50556 1362892 1382599 1406264 1433789 1463813 1494854 1526650 1559774 1594061 1628096 1660340 1690217
50545 1690217 1717939 1743862 1768359 1791936 1815071 1838165 1861971 1887753 1916620 1948891 1984564
50534 1984564 2024213 2068783 2118488 2172651 2231043 2294858 2365771 2444270 2529481 2620599 2717849
50523 2717849 2821796 2932176 3047774 3167136 3288856 3411203 3531960 3648854 3759831
50514 3759831 3862604 3954162 4031245 4091490 4133873 4157980 4163212 4149098 4116151 4065931 4000224
$$ packed form
50591B051367o8862o8926o8222o6626o4200o1045n7095n2436m7559m2976l8625
50580A414795l4117k9416k4935k0956j7358j3934j0640p424m247j341Q79K269
50568A253575L085L585L965M724O458Q959J1069J1951J2106J2683J4197J6535
50556A362892J9707K3665K7525L0024L1041L1796L3124L4287L4035L2244K9877
50545A690217K7722K5923K4497K3577K3135K3094K3806K5782K8867L2271L5673
50534A984564L9649M4570M9705N4163N8392O3815P0913P8499Q5211R1118R7250
50523B717849J03947J10380J15598J19362J21720J22347J20757J16894J10977
50514C759831J02773R1558P7083O0245M2383K4107N232j4114l2947n0220o5707
$$ plain form
50503 4000224 3920717 3829806 3731325 3629939 3529823 3434114 3345377 3266039 3198285 3143847 3104032
50492 3104032 3079608 3070502 3075697 3093367 3120754 3153936 3188145 3218642 3241221 3252047 3247756 3226221
50480 3226221 3187011 3130818 3058749 2972490 2874787 2769073 2658541 2545805 2433150 2322471
50470 2322471 2214917 2111174 2012231 1919472 1833843 1755358 1683698 1618917 1561210 1510235 1465035
50459 1465035 1424718 1389026 1358261 1332787 1312569 1297149 1286045 1279073 1276106 1276597 1279612 1284409
50447 1284409 1290767 1298682 1308097 1319144 1332328 1348057 1366013 1385225 1404722 1423916 1442489 1460277
50435 1460277 1477329 1493763 1509332 1523290 1534892 1543999 1551081 1556653 1560911 1563917 1565929 1567390 1568748
50422 1568748 1570517 1573487 1578540 1586124 1596137 1608544 1623950 1643392 1667700 1697245 1732103 1772089
$$ packed form
50503D000224p9507r0911r8481j01386j00116r5709q8737p9338o7754n4438l9815
50492C104032k4424r106N195J7670K7387L3182L4209L0497K2579J0826m291k1535
50480C226221l9210n6193p2069q6259r7703j05714j10532j12736j12655j10679
50470B322471j07554j03743r8943r2759q5629p8485p1660o4781n7707n0975m5200
50459A465035m0317l5692l0765k5474k0218j5420j1104o972k967M91L015M797
50447A284409O358P915R415J1047J3184J5729J7956J9212J9497J9194J8573J7788
50435A460277J7052J6434J5569J3958J1602R107P082N572M258L006K012J461J358
50422A568748J769K970N053P584J0013J2407J5406J9442K4308K9545L4858L9986
$$ plain form
50410 1772089 1816735 1865582 1918535 1975676 2036638 2100391 2165537 2230527 2293729 2353809 2410185
50399 2410185 2462658 2510396 2551735 2585181 2610154 2626397 2633129 2629293 2614396 2588624 2552344 2506074
50387 2506074 2450870 2388313 2320124 2248223 2175139 2103762 2036428 1974509 1918999 1871119 1832084
50376 1832084 1802502 1782225 1770701 1767341 1771509 1782129 1797165 1813594 1828223 1838708 1843746 1842471
50364 1842471 1834061 1817985 1794259 1763290 1725780 1683001 1636916 1589629 1542646 1496623 1451611
50353 1451611 1407417 1363951 1321573 1281090 1243243 1208140 1175289 1144211 1114955 1088101 1064306
50342 1064306 1043813 1026299 1011197 998085 986797 977307 969682 964034 960317 958240 957562 958304 960327
50329 960327 962950 965582 968722 973581 980460 988167 995595 1003291 1012771 1024630 1038176 1052835 1069066
$$ packed form
50410A772089M4646M8847N2953N7141O0962O3753O5146O4990O3202O0080N6376
50399B410185N2473M7738M1339L3446K4973J6243O732l836j4897k5772l6280m6270
50387B506074n5204o2557o8189p1901p3084p1377o7334o1919n5510m7880l9035
50376A832084k9582k0277j1524l360M168J0620J5036J6429J4629J0485N038j275
50364A842471q410j6076k3726l0969l7510m2779m6085m7287m6983m6023m5012
50353A451611m4194m3466m2378m0483l7847l5103l2851l1078k9256k6854k3795
50342A064306k0493j7514j5102j3112j1288r490p625n648l717k077o78P42K023
50329I60327K623K632L140M859O879P707P428P696R480J1859J3546J4659J6231
$$ plain form
50316 1069066 1087712 1109059 1132786 1158251 1184375 1209551 1232135 1251042 1265847 1276561 1283509
50305 1283509 1287179 1287947 1286064 1282050 1276926 1271798 1267320 1263722 1261260 1260315 1261030 1263065 1265910 1269478 1274341
50290 1274341 1281356 1291184 1304357 1321573 1343079 1367077 1389022 1403544 1407655 1401978 1388951 1370523
50278 1370523 1347889 1322601 1296852 1272566 1250836 1232346 1217797 1207577 1201367 1198480 1198494 1201268
50266 1201268 1206309 1212396 1218088 1222609 1226165 1229469 1233176 1237767 1243494 1249987 1256108 1260714 1263609 1265323
50252 1265323 1266040 1265355 1263159 1259963 1255958 1250516 1243347 1235563 1228652 1222658 1216323 1209046 1201779 1195900
50238 1195900 1192047 1190393 1191226 1194655 1200176 1207134 1215377 1225155 1236659 1249985 1265232 1282338 1301100
50225 1301100 1321700 1344899 1371246 1400245 1430620 1461169 1491038 1519504 1546094 1570920 1594400
$$ packed form
50316A069066J8646K1347K3727K5465K6124K5176K2584J8907J4805J0714O948
50305A283509L670P68j883m014n124n128m478l598k462r45P15K035K845L568M863
50290A274341P015R828J3173J7216K1506K3998K1945J4522M111n677j3027j8428
50278A370523k2634k5288k5749k4286k1730j8490j4549j0220o210k887J4K774
50266A201268N041O087N692M521L556L304L707M591N727O493O121M606K895J714
50252A265323P17o85k196l196m005n442p169p784o911n994o335p277p267n879
50238A195900l853j654Q33L429N521O958Q243R778J1504J3326J5247J7106J8762
50225A301100K0600K3199K6347K8999L0375L0549K9869K8466K6590K4826K3480
$$ plain form
50214 1594400 1616596 1637166 1655986 1673421 1689847 1705102 1718430 1728655 1734357 1734118 1726801 1711698
50202 1711698 1688657 1658378 1622526 1583160 1541932 1499939 1458244 1418198 1381242 1348573 1320881
50191 1320881 1297972 1278501 1260452 1242158 1222833 1202202 1180012 1156044 1130389 1103540 1076364
50180 1076364 1050032 1025586 1003357 982975 964093 946940 931983 919339 908724 899730 891844 884390
50168 884390 876874 869410 862463 856220 850479 845154 840477 836564 833112 829826 826897 824729 823297 822177
50154 822177 821327 821502 823585 827563 832436 837163 841454 845513 849276 852277 854293 855716 856989 857864 857611
50139 857611 856003 853705 851501 849469 847383 845770 845968 848835 853818 859655 865692 872041 878705 885316
50125 885316 891932 899395 908395 918523 928745 938684 949036 960792 974445 989944 1007071 1025815
$$ packed form
50214A594400K2196K0570J8820J7435J6426J5255J3328J0225N702k39p317j5103
50202A711698k3041l0279l5852l9366m1228m1993m1695m0046l6956l2669k7692
50191A320881k2909j9471j8049j8294j9325k0631k2190k3968k5655k6849k7176
50180A076364k6332k4446k2229k0382j8882j7153j4957j2644j0615q994p886p454
50168H84390p516p464o947o243n741n325m677l913l452l286k929k168j432j120
50154H22177q50J75K083L978M873M727M291M059L763L001K016J423J273Q75k53
50139H57611j608k298k204k032k086j613J98K867M983N837O037O349O664O611
50125H85316O616P463R000J0128J0222R939J0352J1756J3653J5499J7127J8744
$$ plain form
50113 1025815 1046638 1070353 1097572 1128370 1162791 1201533 1245671 1295630 1350787 1410035 1472284
50102 1472284 1536277 1600558 1664012 1726217 1787020 1846202 1903871 1960751 2017442 2073385 2126889
50091 2126889 2175977 2218792 2253302 2277348 2289337 2288736 2275768 2250911 2214834 2168693 2114292 2053918
50079 2053918 1989926 1924326 1858782 1795063 1735215 1680898 1632523 1589465 1551216 1517982 1489956
50068 1489956 1466410 1445902 1427272 1410173 1394723 1380987 1368734 1357395 1346173 1334396 1321884
50057 1321884 1308910 1295830 1282894 1270341 1258321 1246610 1234595 1221825 1208531 1195476 1183332
50046 1183332 1172311 1162285 1153069 1144644 1137283 1131468 1127567 1125572 1125331 1126946 1130698 1136554 1144070 1152907
50032 1152907 1163173 1174987 1187980 1201570 1215526 1229816 1243892 1256704 1267633 1277055 1285664 1293466
$$ packed form
50113A025815K0823K3715K7219L0798L4421L8742M4138M9959N5157N9248O2249
50102A472284O3993O4281O3454O2205O0803N9182N7669N6880N6691N5943N3504
50091B126889M9088M2815L4510K4046J1989o01j2968k4857l6077m6141n4401o0374
50079B053918o3992o5600o5544o3719n9848n4317m8375m3058l8249l3234k8026
50068A489956k3546k0508j8630j7099j5450j3736j2253j1339j1222j1777j2512
50057A321884j2974j3080j2936j2553j2020j1711j2015j2770j3294j3055j2144
50046A183332j1021j0026r216q425p361n815l901j995k41J615L752N856P516Q837
50032A152907J0266J1814J2993J3590J3956J4290J4076J2812J0929R422Q609P802
$$ plain form
50020 1293466 1299782 1304178 1306988 1308798 1309553 1308306 1303875 1295763 1284506 1271244 1257063 1242784 1229060
50007 1229060 1216263 1204286 1192770 1181773 1171965 1164126 1158672 1155816 1155737 1158275 1162769 1168679 1176226
49994 1176226 1185972 1197887 1211303 1225797 1241646 1259314 1278889 1300071 1322282 1344642 1366372
49983 1366372 1387550 1409054 1431363 1453733 1474989 1494874 1514153 1533608 1553508 1573993 1595262
49972 1595262 1617044 1638189 1657021 1671795 1680714 1681965 1674302 1657616 1632651 1600184 1560823 1515728
49960 1515728 1467264 1418555 1372204 1329386 1290218 1254850 1224006 1198432 1178071 1162068 1149437
49949 1149437 1139401 1131132 1123595 1115917 1107747 1099039 1089658 1079430 1068463 1057177 1045979 1034969
49937 1034969 1023809 1011722 997859 981951 964573 946528 928071 909046 889744 871107 853885
$$ packed form
50020A293466O316M396K810J810P55j247m431q112j1257j3262j4181j4279j3724
50007A229060j2797j1977j1516j0997r808p839n454k856p9K538M494N910P547
49994A176226R746J1915J3416J4494J5849J7668J9575K1182K2211K2360K1730
49983A366372K1178K1504K2309K2370K1256J9885J9279J9455J9900K0485K1269
49972A595262K1782K1145J8832J4774Q919J251p663j6686k4965l2467l9361m5095
49960A515728m8464m8709m6351m2818l9168l5368l0844k5574k0361j6003j2631
49949A149437j0036q269p537p678q170q708r381j0228j0967j1286j1198j1010
49937A034969j1160j2087j3863j5908j7378j8045j8457j9025j9302j8637j7222
$$ plain form
49926 853885 837929 822668 808153 795297 785089 777807 772968 769804 767614 765887 764408 763384 763332
49913 763332 764627 767127 770328 773851 777593 781467 785421 789955 796290 805523 817626 831558 846229
$$ packed form
49926H53885j5956j5261j4515j2856j0208p282m839l164k190j727j479j024n2
49913G63332J295K500L201L523L742L874L954M534O335R233J2103J3932J4671
$$ [...]
##END NTUPLES=NMR SPECTRUM
##END=
