##TITLE=AC1681_2977_8571555_gdJ5YHvhbD
##JCAMPDX= 6.0         $$ Bruker NMR JCAMP-DX V2.0
##DATA TYPE= NMR SPECTRUM
##DATA CLASS= NTUPLES
##ORIGIN= BRUKER
##OWNER= Administrator
$$ 1.72 TOPSPIN		Version 2.1
$$ 2014-04-10 19:57:39.604 -0700  Administrator@X
$$ Compression mode = diff/dup
##.OBSERVE FREQUENCY= 400.02188249412
##.OBSERVE NUCLEUS= ^1H
##.ACQUISITION MODE= SIMULTANEOUS (DQD)
##.ACQUISITION SCHEME= undefined
##.AVERAGES= 8
##.DIGITISER RES= 22
##SPECTROMETER/DATA SYSTEM= spect
##.PULSE SEQUENCE= zg30
##.SOLVENT NAME= COFFEE_meoh
##.SHIFT REFERENCE= INTERNAL, COFFEE_meoh, 1, 14.98509
##AUDIT TRAIL= $$ (NUMBER, WHEN, WHO, WHERE, PROCESS, VERSION, WHAT)
$$ ##TITLE= Audit trail, TOPSPIN		Version 2.1
$$ ##JCAMPDX= 5.01
$$ ##ORIGIN= Bruker BioSpin GmbH
$$ ##OWNER= Administrator
$$ $$ E:\/data/COFFEE/nmr/AC1681_2977_8571555_gdJ5YHvhbD/20/pdata/1/auditp.txt
$$ ##AUDIT TRAIL=  $$ (NUMBER, WHEN, WHO, WHERE, PROCESS, VERSION, WHAT)
(   1,<2014-04-10 19:57:31.962 -0700>,<Administrator>,<X>,<go>,<TOPSPIN 2.1>,
      <created by zg
	started at 2014-04-10 19:56:25.894 -0700,
	POWCHK enabled, PULCHK disabled,
       configuration hash MD5:
       C8 4E 4E 5D D3 5C D8 9E 9F 52 82 E0 59 8A DE 15
       data hash MD5: 64K
       7B EC 34 39 C5 DC AF EF 57 82 0C 84 C5 FE D2 A3>)
(   2,<2014-04-10 19:57:35.240 -0700>,<Administrator>,<X>,<proc1d>,<TOPSPIN 2.1>,
      <Start of raw data processing
       efp LB = 0 FT_mod = 6 PKNL = 1 PHC0 = 0 PHC1 = 0 SI = 32K 
       data hash MD5: 32K
       92 46 86 78 C3 2B CE 74 2F B3 B5 EA C3 28 77 83>)
(   3,<2014-04-10 19:57:35.668 -0700>,<Administrator>,<X>,<proc1d>,<TOPSPIN 2.1>,
      <pk PHC0 = 94.58679 PHC1 = 0 
       data hash MD5: 32K
       85 35 D3 C5 B5 0C 2F 92 B2 19 FC 20 CE CE A1 C7>)
(   4,<2014-04-10 19:57:35.867 -0700>,<Administrator>,<X>,<proc1d>,<TOPSPIN 2.1>,
      <abs ABSG = 1 
       data hash MD5: 32K
       80 77 56 7F 5E 98 1B 70 85 61 CF 69 A8 40 DB A2>)
(   5,<2014-04-10 19:57:36.036 -0700>,<Administrator>,<X>,<proc1d>,<TOPSPIN 2.1>,
      <abs ABSG = 2 
       data hash MD5: 32K
       1E CC 9E 96 15 6C 67 89 F3 3A CE C4 9D 7C CA 2A>)
(   6,<2014-04-10 19:57:36.128 -0700>,<Administrator>,<X>,<proc1d>,<TOPSPIN 2.1>,
      <abs ABSG = 3 
       data hash MD5: 32K
       09 F4 4E 80 08 CF C7 E6 47 9B 7C 9D D6 F7 AF C2>)
(   7,<2014-04-10 19:57:36.358 -0700>,<Administrator>,<X>,<proc1d>,<TOPSPIN 2.1>,
      <abs ABSG = 4 
       data hash MD5: 32K
       CC 0C D2 3E 11 B7 96 44 83 F9 68 D9 14 6F 7F ED>)
(   8,<2014-04-10 19:57:36.449 -0700>,<Administrator>,<X>,<proc1d>,<TOPSPIN 2.1>,
      <abs ABSG = 5 
       data hash MD5: 32K
       4A D6 C6 75 4D 1A 22 DB 22 C3 54 CB 1A 2E 03 6D>)
$$ ##END=
$$ 
$$ $$ hash MD5
$$ $$ 5A 60 A5 66 23 45 2F F0 3A 0D AE 48 9D 30 DF ED
##$RELAX= 
##$RELAX= 
##$RELAX= 
##$RELAX= 
##$RELAX= 
##$RELAX= 
##$RELAX= 
$$ Bruker specific parameters
$$ --------------------------
##$DU= <E:\>
##$EXPNO= 20
##$NAME= <AC1681_2977_8571555_gdJ5YHvhbD>
##$PROCNO= 1
$$ [...]
150 150 150 150 150 150 150 150
##$TP07= 0
##$TPNAME0= <>
##$TPNAME1= <>
##$TPNAME2= <>
##$TPNAME3= <>
##$TPNAME4= <>
##$TPNAME5= <>
##$TPNAME6= <>
##$TPNAME7= <>
##$TPOAL= (0..7)
0.5 0.5 0.5 0.5 0.5 0.5 0.5 0.5
##$TPOFFS= (0..7)
0 0 0 0 0 0 0 0
##$TUNHIN= 0
##$TUNHOUT= 0
##$TUNXOUT= 0
##$USERA1= <user>
##$USERA2= <user>
##$USERA3= <user>
##$USERA4= <user>
##$USERA5= <user>
##$V9= 5
##$VALIST= <valist>
##$VCLIST= <CCCCCCCCCCCCCCC>
##$VD= 0
##$VDLIST= <DDDDDDDDDDDDDDD>
##$VPLIST= <PPPPPPPPPPPPPPP>
##$VTLIST= <TTTTTTTTTTTTTTT>
##$WBST= 1024
##$WBSW= 4
##$XGAIN= (0..3)
0 0 0 0
##$XL= 0
##$YL= 0
##$YMAX_a= 603970
##$YMIN_a= -510863
##$ZGOPTNS= <>
##$ZL1= 120
##$ZL2= 120
##$ZL3= 120
##$ZL4= 120
##$ABSF1= 14.98509
##$ABSF2= -5.573092
##$ABSG= 5
##$ABSL= 3
##$ALPHA= 0
##$AQORDER= 0
##$ASSFAC= 0
##$ASSFACI= 0
##$ASSFACX= 0
##$ASSWID= 0
##$AUNMP= <proc_prof1d_extract_pilot.lims>
##$AXLEFT= 0
##$AXNAME= <>
##$AXNUC= <1H>
##$AXRIGHT= 0
##$AXTYPE= 0
##$AXUNIT= <>
##$AZFE= 0.1
##$AZFW= 0.1
##$BCFW= 0
##$BC_mod= 0
##$BYTORDP= 0
##$COROFFS= 0
##$CY= 15
##$DATMOD= 1
##$DC= 0
##$DFILT= <>
##$DTYPP= 0
##$F1P= 0
##$F2P= 0
##$FCOR= 0.5
##$FTSIZE= 32768
##$FT_mod= 6
##$GAMMA= 0
##$GB= 0
##$INTBC= 1
##$INTSCL= 1
##$ISEN= 128
##$LB= 0
##$LEV0= 0
##$LPBIN= 0
##$MAXI= 10000
##$MC2= 0
##$MEAN= 0
##$ME_mod= 0
##$MI= 0
##$NCOEF= 0
##$NC_proc= -8
##$NLEV= 6
##$NOISF1= 0
##$NOISF2= 0
##$NSP= 0
##$NTH_PI= 0
##$NZP= 0
##$OFFSET= 14.98509
##$PC= 1
##$PHC0= 94.58679
##$PHC1= 0
##$PH_mod= 1
##$PKNL= yes
##$PPARMOD= 0
##$PPDIAG= 0
##$PPIPTYP= 0
##$PPMPNUM= 2147483647
##$PPRESOL= 1
##$PSCAL= 4
##$PSIGN= 0
##$PYNMP= <proc.py>
##$REVERSE= no
##$SF= 400.02
##$SI= 32768
##$SIGF1= 0
##$SIGF2= 0
##$SINO= 400
##$SIOLD= 32768
##$SPECTYP= <>
##$SREGLST= <1H.CDCl3>
##$SSB= 0
##$STSI= 32768
##$STSR= 0
##$SW_p= 8223.68421052631
##$SYMM= 0
##$S_DEV= 0
##$TDeff= 65536
##$TDoff= 0
##$TI= <>
##$TILT= no
##$TM1= 0
##$TM2= 0
##$TOPLEV= 0
##$USERP1= <user>
##$USERP2= <user>
##$USERP3= <user>
##$USERP4= <user>
##$USERP5= <user>
##$WDW= 1
##$XDIM= 32768
##$YMAX_p= 437769755
##$YMIN_p= -794515
##$CURPLOT= <Network HP LaserJet P1505>
##$CURPRIN= <$Network HP LaserJet P1505>
##$DFORMAT= <normdp>
##$LAYOUT= <+/1D_H.xwp>
##$LFORMAT= <normlp>
##$PFORMAT= <normpl>
##$SURQMSG= 1
$$ End of Bruker specific parameters
$$ ---------------------------------
##NTUPLES= NMR SPECTRUM
##VAR_NAME=  FREQUENCY,     SPECTRUM/REAL,   SPECTRUM/IMAG
##SYMBOL=    X,             R,               I
##VAR_TYPE=  INDEPENDENT,   DEPENDENT,       DEPENDENT
##VAR_FORM=  AFFN,          ASDF,            ASDF
##VAR_DIM=   32768,         32768,           32768
##UNITS=     HZ,            ARBITRARY UNITS, ARBITRARY UNITS
##FACTOR=    0.250966925370066, 1,           1
##FIRST=     8223.43324360094, -161881,      -122297
##LAST=      0,             -12083,          -56302
##MIN=       0,             -794515,         0
##MAX=       8223.43324360094, 437769755,    0
$$ Real data points
##PAGE= N=1
##DATA TABLE= (X++(R..R)), XYDATA
$$ [...]
$$ plain form
19567 117222 271273 136646 -212221 -285848 33479 -48850 177692 -155612 -27883 -422414
19557 -422414 203868 -225842 252630 140675 112008 98051 -193728 -428241 -221883 -235102
19547 -235102 -122720 -428543 -418835 -92248 -245075 -180049 -23367 -333457 47275 29613 -221721
19535 92861 -114246 -178789 -327408 -63006 -69083 -114849 -142016 -61805 180618 106354 15580
19523 261275 -106263 -105058 -222499 -104898 66310 -113527 -168049 138859 345991 -83722
19512 -208592 -529125 -261913 88214 277076 218132 -337128 35209 -510639 97461 53802
19502 53802 26058 153272 61244 292106 -171928 24430 29872 199994 179247 -108148 -90096
19491 -90096 122128 -59812 -223319 -140528 -192154 27550 167943 -112573 -29307 -269269 77677
$$ packed form
19567A17222J54051j34627b12221p3627C3479d8850A77692a55612b7883l94531
19557d22414B03868b25842B52630j11955k8667j3957a93728k34513K06358j3219
19547b35102J12382l05823R708i2248j52827O5026b3367l10090D7275j7662b21721
19535I2861a14246o4543j48619f3006o077m5766k7167f1805A80618p4264A5580
19523B61275a06263J205j17441a04898F6310a13527n4522A38859K07132h3722
19512b08592l20533b61913H8214J88862n8944c37128C5209e10639I7461m3659
19502E3802B6058J27214F1244K30862a71928B4430N442J70122k0747a08148J8052
19491i0096A22128e9812j63507Q2791n1626B7550J40393a12573b9307k39962G7677
$$ plain form
19479 -169922 12358 73646 -104774 238054 -102994 -61224 21461 -28817 -36058 76639 -223102
19467 -85764 196555 -174405 71021 12937 26751 189242 268534 -110318 -255479 -13327 -117262
19456 -117262 174566 -169383 -158145 -12721 -85384 24330 -187737 -214734 52181 -246198 27454
19444 -127537 -41767 206503 52013 -221135 -110307 -63596 -187170 95397 256546 67510
19433 -131560 30354 -40993 115795 94257 -177328 27069 157746 -73939 150691 131032 170499
19422 170499 -114674 -165147 11688 64613 52787 32709 -101670 -19258 109507 105614 302885
19411 302885 -87836 -54144 -178571 -136009 -187303 -125785 28881 -18186 -144098 -244756 -360163
19400 -360163 -162025 51864 -22023 -481 -14421 661 -26992 -53420 -86503 158262 63080 -252029
$$ packed form
19479a69922A2358O1288a04774B38054a02994M1770B1461b8817p241G6639b23102
19467h5764A96555a74405G1021A2937J3814J62491P9292a10318j45161a3327j03935
19456a17262A74566a69383J1238a2721p2663B4330a87737k6997E2181b46198B7454
19444a27537d1767B06503E2013b21135a10307M6711j23574I5397J61149F7510
19433a31560C0354d0993A15795k1538a77328B7069J30677g3939A50691j9659L9467
19422A70499a14674n0473A1688N2925j1826k0078a01670a9258A09507l893J97271
19411C02885h7836L3692j24427M2562n1294O1518B8881a8186j25912j00658j15407
19400c60163a62025E1864b2023d81j3940F61b6992k6428l3083A58262F3080b52029
$$ plain form
19387 53876 -5437 -270678 -159670 204327 -105914 -7924 197440 -152359 -109225 -343434 -75329
19375 -241609 -389200 -138169 -242912 -107157 -32222 -46599 113650 -206437 -18655 70552
19364 -392419 -122897 -270511 -144114 -19532 -205963 109192 -105464 52340 -93763 46163
19353 -91187 39018 249641 262488 -99284 283782 -214920 -391913 142887 -208080 71203
19342 -133980 -277769 16844 -46432 -437781 -31532 32318 54735 -216477 -298305 -291903 65395
19330 -78751 139934 -293131 -16102 -220977 -203303 -80295 -447360 -9619 -68840 158184 -234344
19318 -186373 82037 -15109 238062 -365869 -40641 -159507 -185750 -19056 153265 -31301 -288160
19307 -288160 -139945 210993 62938 31402 89929 -244352 -407495 72344 -95870 -85677 157416
$$ packed form
19387E3876e437k65241J11008B04327a05914g924A97440a52359M3134k34209g5329
19375b41609j47591a38169j04743a07157c2222j4377A13650b06437a8655G0552
19364c92419a22897j47614J26397a9532j86431A09192a05464E2340i3763D6163
19353i1187C9018K10623J2847i9284B83782b14920j76993A42887b08080G1203
19342a33980j43789A6844d6432l91349c1532C2318K2417b16477q1828O402F5395
19330g8751A39934b93131a6102k04875J7674h0295l67065i619n9221A58184b34344
19318a86373H2037a5109B38062c65869d0641j18866k6243a9056A53265c1301k56859
19307b88160a39945B10993F2938C1402N8527b44352j63143G2344i5870J0193A57416
$$ plain form
19295 30613 -6509 -193145 -23397 298450 -105559 -103518 -130123 -9971 467478 -133099 134379
19283 156901 -42657 -264459 -230208 -372391 -31654 84138 -14822 193737 -286891 345296
19272 -75542 -63293 -542871 -48557 315807 -140396 -239272 -237487 -58903 125205 -131006 125574
19260 -69077 -285182 -73710 177607 -54782 42902 -96041 4920 -142858 -181459 -51368 40389
19248 -335789 -309879 102824 282612 136868 -135981 105259 -320512 -14859 -58072 -45482
19238 -45482 525 -224377 -154334 28383 17528 -126183 -34097 73525 -17326 -98702 -294272
19227 -294272 -91716 -402054 -142440 -73439 -6618 99928 -294230 -323440 -146059 -377262 -114095
19215 -300879 -61331 -195981 -275838 49050 -77313 -22880 -90852 3277 -164708 45451 -210093
$$ packed form
19295C0613f509j86636b3397B98450a05559K041k6605i971D67478a33099A34379
19283A56901d2657k21802L4251j42183c1654H4138a4822A93737b86891C45296
19272g5542J2249m79578d8557C15807a40396r8876J785e8903A25205a31006A25574
19260f9077k16105g3710A77607e4782D2902i6041D920a42858l8601e1368D0389
19248c35789K5910A02824J79788A36868a35981A05259c20512a4859m3213J2590
19238d5482E25b24377P0043B8383j0855a26183c4097G3525a7326q1376j95570
19227b94272i1716l10338a42440O9001f618I9928b94230k9210a46059k31203a14095
19215c00879f1331j34650p9857D9050g7313b2880o7972C277a64708D5451b10093
$$ plain form
19203 -11604 -341781 152721 -387620 53287 -49731 178562 -76735 -133002 -19221 -286784 -138350
19191 927 -142642 44983 -340861 -97641 59969 16139 -185216 105892 -9976 -150294 149298
19179 -318471 104489 96410 -203645 -18650 315434 117343 83803 43279 -212694 -115300 -150330
19168 -150330 -123754 128446 -56824 398936 -300189 -292439 -113840 -339133 66669 10657 -170251
19156 10493 -270831 39752 106786 -89431 -116763 -232274 -406845 -353572 -62807 -455308 56388
19144 -407377 -53750 53405 15845 50274 -333934 257960 -112337 -224798 -30534 146269
19133 49179 -104230 208921 356580 -120303 -276421 -159962 -21478 -199380 -177984 -138112
19123 -138112 -59599 57102 -209281 8999 212122 95872 -3613 -368116 -216728 -302774 -379591
$$ packed form
19203a1604l30177A52721c87620E3287d9731A78562g6735n6267a9221k67563a38350
19191I27a42642D4983c40861i7641E9969A6139a85216A05892i976j40318A49298
19179c18471A04489q079b03645a8650C15434A17343l3540m0524b12694R7394l5030
19168a50330K6576A28446e6824C98936c00189P750a13840k25293F6669A0657a70251
19156A0493b70831C9752O7034h9431k7332j15511j74571N3273f2807l92501E6388
19144d07377e3750E3405A5845L4429c33934B57960a12337j12461c0534A46269
19133D9179a04230B08921J47659a20303j56118J16459b1478j77902K1396L9872
19123a38112e9599E7102b09281H999K03123I5872c613l64503J51388q6046p6817
$$ plain form
19112 -379591 81292 -84514 -204661 354478 -133312 -199234 -176310 119956 -244971 63104
19101 -93209 215665 131543 -30403 105898 -175580 -7438 50299 -402950 -12174 -159420 -469
19089 -239227 114772 99214 -225494 -196645 -23747 89379 40757 10882 240996 186567 -184603
19077 -85022 -287586 -314715 291290 275972 9134 -41250 45726 263493 -196824 -167010 226711
19065 -254886 -195233 63100 -175633 -136639 125107 -87672 12543 -346954 120243 -117958
19054 -77128 -51101 -22194 -392610 -153769 -52130 -173626 -420361 60652 1707 -315629 281177
19042 116212 -1145 332741 260412 -164949 -92027 199081 -205496 12606 155342 52933 316432
19031 316432 -465851 71632 117705 -241104 -42798 152995 -45142 -78247 230068 364848
$$ packed form
19112c79591H1292h4514j20147C54478a33312o5922K2924A19956b44971F3104
19101i3209B15665q4122c0403A05898a75580g438E0299d02950a2174j47246d69
19089b39227A14772j5558b25494K8849b3747H9379D0757A0882K30114n4429a84603
19077h5022k02564k7129B91290j5318I134d1250D5726K17767a96824K9814B26711
19065b54886N9653F3100a75633L8994A25107h7672A2543c46954A20243a17958
19054g7128K6027b2194l70416a53769e2130j21496k46735F0652A707c15629B81177
19042A16212a145C32741p2329a64949P2922A99081b05496A2606J42736E2933K63499
19031C16432d65851G1632M6073b41104d2798A52995d5142l3105B30068J34780
$$ plain form
19021 364848 -5213 -78176 301987 -6450 -298108 201384 55136 -120227 -120148 -110954 -41789 150489
19008 32074 -17196 -285291 63789 -82608 188635 -56545 139498 -75050 71888 -187410 10206
18996 64860 30876 -207587 -65163 -19322 27198 -290190 -34318 -106636 -59525 -379694 -40380
18984 -183976 -91868 -76438 79143 33457 116076 -6793 -245989 90177 136539 163302 -81421
18972 -113012 -98031 -40790 114967 -50363 -166361 -23265 32556 -177178 -27651 -226177 -189712
18961 -189712 47842 34707 286081 -74957 210 -137506 -235920 -129575 -330917 76665 49020
18950 49020 -100631 -23139 -9003 275617 -246086 -83048 -201535 357478 135996 183571 -148295
18938 -222774 127105 -23504 68122 115885 -38247 -79359 -24113 -20288 -30423 189964 -62303
$$ packed form
19021C64848e213p2963C01987f450k91658B01384E5136a20227P9R194d1789A50489
19008C2074a7196k68095F3789h2608A88635e6545A39498g5050G1888a87410A0206
18996F4860C0876b07587f5163a9322B7198b90190c4318p2318M7111l20169d0380
18984a83976i1868J5430G9143C3457Q2619f793k39196I0177M6362K6763h1421
18972a13012J4981d0790A14967e0363j15998b3265C2556a77178b7651j98526L6465
18961a89712D7842j3135K51374g4957B10a37506r8414J06345k01342G6665k7645
18950D9020a00631b3139i003B75617b46086h3048j18487C57478A35996M7575a48295
18938b22774A27105b3504F8122M7763c8247m1112b4113L825j0135A89964f2303
$$ plain form
18926 -82726 87548 -71946 143617 -234516 243105 -43652 18212 -282951 -89624 -288028 -183941
18915 -183941 -175458 -273130 -65739 20996 -192614 22908 132130 -244387 -87022 -33831 12566
18903 104010 -45372 -171748 104933 -227377 -227111 13575 -464082 -120490 81220 -75887 -261214
18892 -261214 -238056 -388748 -139209 -98088 35695 -40715 22918 -102109 2964 62510 262133
18881 262133 -465156 -345932 7791 51925 -166042 -250596 -54768 -88841 163808 -126269 -23083
18869 -18132 -221137 -348192 52225 90759 -366539 -24301 -65745 127155 149855 -126814 -16790
18857 -271892 -59114 -57001 -170818 -41515 -166853 -192885 -22689 199691 234082 -68805 -114107
18846 -114107 24812 -319749 235370 153282 72550 178559 -338166 67108 -66144 21244 81
$$ packed form
18926h2726H7548g1946A43617b34516B43105d3652A8212b82951h9624j98404J04087
18915a83941Q483r7672f5739B0996a92614B2908J09222b44387h7022c3831A2566
18903A04010d5372j26376A04933b27377K66A3575d64082a20490H1220g5887j85327
18892b61214K3158j50692a39209M1121C5695d0715B2918a02109B964N9546J99623
18881B62133d65156J19224G791M4134a66042q4554e4768l4073A63808a26269b3083
18869a8132k03005j27055E2225L8534c66539b4301m1444A27155K2700a26814a6790
18857b71892e9114K113j13817d1515j25338k6032b2689A99691L4391f8805m5302
18846a14107B4812c19749B35370q2088G2550J06009c38166F7108f6144B1244H1
$$ plain form
18834 165982 6889 -115834 31127 -173067 -99004 199593 16714 -32516 -201981 -144927 -143419
18823 -143419 55096 32670 69707 -122644 75200 106723 47853 186935 -35146 180851 283691
18812 283691 -76106 -174728 21542 -202267 260298 184000 311895 234213 320508 25416 217264
18801 217264 -480025 78288 50991 -34071 -64470 130742 -422597 27345 -126664 -54531 -32949
18790 -32949 -143282 32375 60542 -33165 -56337 -342745 26607 -88560 181418 -196263 -97050
18778 154514 -148743 -274599 -121483 197828 -11608 264955 30069 113321 -146256 -110576
18768 -110576 -32493 78450 -116893 -45363 -161704 -167732 -132433 -285514 -79617 172175 61059
18756 114243 -25049 41977 -221559 191340 118816 17191 -67122 283763 187354 21126 32263
$$ packed form
18834A65982F889a15834C1127a73067P4063A99593A6714c2516j69465N7054J508
18823a43419E5096k2426L7037a22644G5200L1523D7853J39082c5146A80851J02840
18812B83691g6106r8622B1542b02267B60298p6298J27895p7682Q6295B5416J91848
18801B17264d80025G8288k7297c4071l0399A30742d22597B7345a26664e4531K1582
18790c2949j10333C2375K8167c3165k3172k86408B6607h8560A81418a96263i7050
18778A54514a48743j25856a21483A97828a1608B64955C0069Q3252a46256L5680
18768a10576c2493G8450a16893d5363j16341o028L5299j53081g9617A72175F1059
18756A14243b5049D1977b21559A91340p2524A7191f7122B83763r6409B1126J1137
$$ plain form
18745 32263 -275481 -183473 -218970 256213 33408 -101852 -120232 -306634 86245 -74710 165361
18733 -50352 -244793 -249668 66012 -117523 353850 169388 83820 -220841 -15592 49397 66110
18722 66110 -79996 -110546 11152 -29278 77114 -433201 271060 -243350 -183399 -21369 -189286
18711 -189286 -1751 -183081 455296 -54744 -119677 -128966 -43897 -204202 138656 310559 -172289
18699 -22396 45171 -334956 26966 51634 -35391 -42270 -135187 181161 -70101 138679 66239
18687 59763 -6165 -8668 -49731 -89515 42576 40374 231119 -242662 -249158 -357731 -96732 -13549
18674 -46721 -2186 -258006 -203208 98461 243721 15546 -76881 -100295 -284576 -126409 -29525
18662 71211 -96897 113740 -230293 -77347 -128212 -270495 -163745 -155915 223335 -129143 198512
$$ packed form
18745C2263b75481R2008l5497B56213C3408a01852j8380j86402H6245g4710A65361
18733e0352j94441m875F6012a17523C53850A69388H3820b20841a5592D9397J6713
18722F6110g9996l0550A1152b9278G7114d33201B71060b43350N9951b1369j67917
18711a89286a751j81330D55296e4744o4933r289d3897j60305A38656J71903a72289
18699b2396D5171c34956B6966K4668c5391o879r2917A81161g0101A38679F6239
18687E9763f165k503m1063l9784D2576k202J90745b42662o496j08573i6732a3549
18674d6721b186k55820N4798I8461J45260A5546g6881k3414j84281a26409b9525
18662G1211i6897A13740b30293g7347n0865j42283J06750P830B23335a29143A98512
$$ plain form
18650 -10798 -233324 31873 159010 -418645 -75772 -206554 7215 -24227 -225662 -54106 -177979
18639 -177979 -162001 223925 -4006 25424 104173 -6697 5135 -84675 -231891 -282987 -164804
18628 -164804 -147364 -244988 -70732 -224865 197675 -101710 148997 9644 199649 -90225 -87088
18617 -87088 -25209 512391 -95835 -117185 -192612 36656 373878 11842 30961 -35651 -433351
18606 -433351 38909 -30266 -29754 63570 -84336 10654 -182856 311394 -293197 -72303 -58143
18595 -58143 -186058 -340452 -74412 -204773 -122365 242635 -202220 -5254 332171 64176 -119136
18583 102681 342990 20317 -123635 -17557 -12267 -129037 74412 227619 -220748 242244
18572 -219814 -36530 18446 -110906 -103776 69102 231332 -113004 2114 -95036 47030 -219631
$$ packed form
18650a0798k22526C1873J27137d18645g5772j30782G215b4227k01435e4106j23873
18639a77979J5978B23925d006B5424P8749f697E135h4675j47216n1096J18183
18628a64804J7440r7624g0732j54133A97675a01710A48997I644J90005i0225L137
18617h7088b5209E12391i5835k1350p5427C6656L37222A1842J9119c5651l97700
18606d33351C8909c0266N12F3570h4336A0654a82856C11394b93197g2303J4160
18595e8143j27915j54394g4412j30361Q2408B42635b02220e254C32171F4176a19136
18583A02681K40309B0317a23635a7557N290j16770G4412J53207b20748B42244
18572b19814c6530A8446a10906P130F9102J62230a13004B114i5036D7030b19631
$$ plain form
18560 -215 201205 -260766 -188060 137956 -389501 -173067 -15062 92238 -59974 98199 81432
18549 81432 294214 -83654 46767 14632 -49492 37930 -107660 220162 -221566 35296 32663
18538 32663 -122090 -245133 -118670 122567 -308266 -52592 -158404 -265284 19150 -94631
18527 98521 -92271 214222 -247589 -139861 -33790 -308425 -51497 -157900 357113 -120727
18516 -245748 -136141 -162773 31790 -240042 -170725 4876 12905 -386376 -144370 36069 43161
18505 43161 102884 -37454 -58656 -61200 -148859 15890 -144068 13891 -121065 -157224 -82489
18494 -82489 -170367 -297339 97590 111780 52983 -241849 -261894 -100955 -7365 -31766 -45919
18483 -45919 -299608 -161493 -263324 139953 -303633 153903 -132177 -131193 -3914 215493 471098
$$ packed form
18560b15B01205b60766P2706A37956c89501a73067a5062I2238e9974I8199j6767
18549H1432K12782h3654D6767A4632d9492C7930a07660B20162b21566C5296k633
18538C2663a22090j23043a18670A22567c08266e2592j05812j06880A9150i4631
18527I8521i2271B14222b47589J07728c3790k74635e1497j06403C57113a20727
18516b45748J09607k6632C1790b40042O9317D876Q029c86376a44370C6069P092
18505D3161N9723c7454k1202k544q7659A5890a44068A3891a21065l6159P4735
18494h2489q7878j26972I7590J4190E2983b41849k0045a00955g365k4401j4153
18483d5919k53689J38115j01831A39953c03633A53903a32177R84c914B15493K55605
$$ plain form
18472 471098 -22534 240624 123691 -504865 67798 -51506 -203654 -156101 143152 -108947
18461 219078 106008 -202256 100743 51587 -85401 125979 -103844 -229402 -194433 -141907
18451 -141907 -323904 -400987 17666 127907 -336146 -162490 104293 277436 -405319 34604
18440 -75159 -154277 -28286 -385305 -291938 80787 -119068 131419 80 -332452 -65656 -134684
18429 -134684 119696 54963 162607 -312916 136495 -309232 -11577 65989 4633 -93904 -138295
18418 -138295 -397848 -73272 -125891 -23665 23812 3725 -163196 -371348 200686 152819 438734
18407 438734 -74474 -251150 104794 -121752 -12432 36664 211181 -387948 219717 -103174
18396 -55887 -39028 -353394 38924 -4724 -13967 34225 -10246 137843 -199217 -6755 -110309
$$ packed form
18472D71098b2534B40624j16933e04865F7798e1506j52148M7553A43152a08947
18461B19078A06008b02256A00743m9156h5401A25979a03844j25558L4969N2526
18451a41907j81997p7083A7666J10241c36146a62490A04293J73143d05319C4604
18440g5159p9118b8286l57019R3367H0787a19068A31419H0c32452f5656o9028
18429a34684A19696E4963J07644c12916A36495c09232a1577F5989D633i3904m4391
18418a38295k59553g3272n2619b3665B3812C725a63196k08152B00686m7867K85915
18407D38734g4474j76676A04794a21752a2432C6664J74517c87948B19717a03174
18396e5887J6859l14366C8924d724r243C4225a0246A37843a99217f755j03554
$$ plain form
18385 -110309 14456 -206411 -104458 -203115 -80859 109878 86522 -201685 200540 26963
18374 -306544 -194955 388181 95480 -1373 -82357 35961 -139719 263501 -240486 -85600 12199
18362 -303622 -131161 572285 -111048 453779 102256 -240353 -42174 149899 -44725 94000
18351 390236 -129067 -195535 -153370 166327 -95867 108732 117654 61071 157905 -10749 129575
18339 -180185 -58069 -254649 131710 128035 55496 -127138 -70820 148603 116575 -367912 258555
18327 423025 181870 125955 -79368 227477 -124251 -47763 -95518 -120993 -173469 -419437 162357
18315 -34872 -143473 -126275 148580 -201034 -153890 -40575 187499 19680 16463 79190 -137772
18303 55371 -175266 -168796 -11427 26093 46808 202419 265611 2860 -251215 -11544 -226057
$$ packed form
18385a10309A4456b06411J01953r8657h0859A09878k3356b01685B00540B6963
18374c06544J11589C88181I5480a373q0984C5961a39719B63501b40486h5600A2199
18362c03622a31161E72285a11048D53779A02256b40353d2174A49899d4725I4000
18351C90236a29067o6468M2165A66327i5867A08732Q922n6583R6834a0749A29575
18339a80185e8069j96580A31710l675E5496a27138N6318A48603l2028c67912B58555
18327D23025A81870n5915g9368B27477a24251d7763m7755k5475n2476k45968A62357
18315c4872j08601J7198A48580b01034M7144d0575A87499A9680l217O2727a37772
18303E5371a75266O470a1427B6093K0715J55611O3192B860b51215a1544k14513
$$ plain form
18292 -226057 -136775 59841 -80633 -372549 -370894 202944 -4921 133304 -206240 -262094 165868
18280 -56833 -123560 -183747 -77155 -200036 -120208 27575 -230435 -149516 -146752 -2173 180677
18268 48802 -132439 -132056 -298572 -158062 -33886 161691 -369253 -14116 -217386 85265 -223686
18256 109201 -164827 -117834 -494432 80765 101330 -91401 -41456 -77306 18565 109778 66968
18245 66968 153891 -81582 12370 155259 -84353 71267 -101228 -81347 -244875 87536 33817
18233 199121 -214220 -355985 -77812 -139609 -11131 95098 -17105 -176315 -253702 -180958 -188550
18222 -188550 -178152 103125 -51233 -135050 31253 74588 114391 55581 159927 126475 -104663
18210 -138915 133327 271693 -205732 -47509 -3710 200517 34588 65241 25355 140998 35484
$$ packed form
18292b26057Q9282E9841h0633k91916J655B02944d921A33304b06240n5854A65868
18280e6833o6727o0187g7155j22881P9828B7575b30435Q0919K764b173A80677
18268D8802a32439L83j66516J40510c3886A61691c69253a4116k03270H5265b23686
18256A09201a64827M6993l76598H0765K0565i1401d1456l5850A8565R1213m2810
18245F6968Q6923h1582A2370J42889h4353G1267a01228J9881j63528H7536C3817
18233A99121b14220j41765g7812o1797a1131I5098a7105j59210p7387P2744p592
18222a88550J0398A03125e1233q3817C1253M3335L9803E5581J04346l3452a04663
18210a38915A33327J38366b05732d7509c710B00517C4588L0653B5355J15643C5484
$$ plain form
18198 131531 -193778 63363 -126430 344485 -86026 -59347 -331638 304340 220536 -118324
18187 -220768 89215 -120964 -47 -103287 277379 234026 -111802 200132 -170233 36127 10346
18175 -370354 113992 -50055 41897 -307697 122711 -62698 -5258 -199734 163132 57214 -306766
18163 -375810 -62981 12828 -75820 3023 25539 -259032 -208858 -182878 168410 -227483 -48091
18151 89811 -291985 -226762 -101948 -104685 88971 11102 -14279 -112655 397512 61045 -188551
18139 -48639 203526 -271021 -150500 160058 90389 -88845 9108 99727 338621 238640 101332
18127 246315 28412 304796 -213098 224458 136571 -1888 75739 -218320 369357 -29401 40660
18115 25305 31155 229413 -12622 105728 41039 -273524 -137094 -98659 -317468 203982 -25612
$$ packed form
18198A31531a93778F3363a26430C44485h6026K6679k72291C04340q3804a18324
18187b20768H9215a20964d7j03240B77379m3353a11802B00132a70233C6127A0346
18175c70354A13992e0055D1897c07697A22711f2698e258j94476A63132E7214c06766
18163c75810f2981A2828g5820C023K2516b59032N0174K5980A68410b27483d8091
18151H9811b91985O5223a01948k737H8971A1102a4279r8376C97512F1045a88551
18139d8639B03526b71021J20521A60058o9669h8845I108R0619K38894r9981A01332
18127B46315B8412K76384b13098B24458q7887a888G5739b18320C69357b9401D0660
18115B5305N850J98258a2622A05728D1039b73524J36430L8435k18809B03982b5612
$$ plain form
18103 -116904 68480 233931 213927 -301516 31868 -126725 -213572 163840 -49295 106167
18092 -388801 234295 408253 -157710 317442 144821 -140221 30190 17555 -14667 -15021 97717
18080 -261722 -152685 -15699 -129864 15325 -109035 -73696 72786 -186983 -232201 -164587 190982
18068 -39723 183034 -82350 39126 -501246 -29551 16228 29150 82198 -62723 -114727 149115
18056 -139138 -19245 -319696 96271 39945 275823 144283 -357585 -388164 34023 -447940
18045 -52342 -302570 -69328 -13748 -194314 156714 -201082 230715 209287 -79255 -100510 45421
18033 29928 103766 -174672 84109 -126029 162349 -255220 -142950 85565 -55912 -121776 45489
18021 -83637 67868 -172273 182718 -79353 -103017 -28059 331488 -17883 12734 387779 10295
$$ packed form
18103a16904F8480J65451k0004c01516C1868a26725q6847A63840d9295A06167
18092c88801B34295J73958a57710C17442A44821a40221C0190j2635a4667l54I7717
18080b61722J09037a5699j14165A5325a09035L5339G2786a86983m5218O7614A90982
18068c9723A83034h2350C9126e01246b9551A6228J2922N3048f2723n2004A49115
18056a39138a9245l00451I6271C9945K35878j31540c57585l0579C4023d47940
18045e2342k50228f9328a3748j80566A56714b01082B30715k1428g9255k1255D5421
18033B9928P3838a74672H4109a26029A62349b55220J12270H5565e5912o5864D5489
18021h3637F7868a72273A82718g9353k3664b8059C31488a7883A2734L75045A0295
$$ plain form
18009 -59482 220836 -259049 -118191 -413273 -212026 -341348 -133651 -96481 70737 -67020
17998 289285 185033 -184612 54303 -25883 -6026 -110779 218782 42012 325528 -176273
17987 -114595 -31176 -475390 -114494 -186621 55627 -172397 -157042 148326 143733 -59114 -265411
17976 -265411 -38677 103799 4514 -56211 -38899 -59956 -207892 -306518 279640 174593 -212988
17964 83467 -330583 256042 142865 211292 -29742 -91389 280918 -196094 23356 28192 -238344
17952 -52 5455 -303205 -96244 11223 37868 68115 -118615 -271658 115232 -137583 8061 -135196
17939 32761 -60335 98454 21445 121397 -111793 7514 96106 -60507 50799 61680 104264 222498
17927 222498 90016 -358099 -407555 -30450 79819 -28019 18337 39317 44762 -67291 88107
$$ packed form
18009e9482B20836b59049a18191k95082K01247j29322a33651L7170G0737f7020
17998B89285j04252a84612E4303b5883f026j04753B18782D2012K83516a76273
17987a14595c1176m44214a14494p2127E5627a72397J5355A48326m593e9114k06297
17976b65411c8677A03799D514e6211J7312k1057j47936r8626B79640j05047b12988
17964H3467c30583B56042j13177O8427b9742o1647B80918a96094B3356M836b38344
17952e2E455c03205i6244A1223K6645L0247a18615j53043A15232a37583H061a35196
17939C2761f0335I8454B1445R9952a11793G514Q8592f0507E0799J0881M2584J18234
17927B22498I0016c58099m9456c0450G9819b8019A8337K0980N445f7291H8107
$$ plain form
17915 -104258 11555 129358 3746 -146890 -312936 296006 76499 -164902 -391253 263884
17904 -64934 -169897 -217099 5359 -158241 38750 104579 178968 55630 36995 -31578 -329283
17893 -329283 -261980 -135166 71420 485140 56892 -120676 170230 95264 -39040 4198 260562
17882 260562 197973 -31772 -37484 -140323 197790 24067 276791 96804 -33754 -223125 64348
17870 143744 -94802 58796 94057 163628 134147 58369 333125 263504 -125254 125248 448555
17859 448555 144433 -95920 128634 -323885 -268431 -92894 -208033 -331914 -107871 155784
17848 -47229 -211692 -45066 59536 170593 59958 -80482 -41893 -115877 -223935 -243657 187080
17836 -113295 -408013 -175394 -20609 19484 -63234 -149146 169207 -7931 -120819 -137125 -118981
$$ packed form
17915a04258A1555J17803C746a46890j66046B96006G6499a64902k26351B63884
17904f4934j04963m7202E359a58241C8750O5829P4389E5630j8635c1578k97705
17893c29283O7303J26814G1420M13720E6892a20676A70230p4966c9040D198K56364
17882B60562o2589c1772n712j02839A97790B4067K52724I6804c3754j89371F4348
17870A43744i4802E8796L5261O9571k9481E8369K74756o9621a25254A25248L23307
17859D48555A44433i5920A28634c23885N5454i2894j15139j23881a07871A55784
17848d7229j64463d5066E9536J11057E9958h0482L8589p3984j08058j9722A87080
17836a13295k94718a75394b0609A9484f3234q5912A69207g931j12888j6306J8144
$$ plain form
17825 -118981 106457 17686 -136205 -130467 -45968 88586 -25026 8881 12900 151319 -61828
17813 135106 101534 -263001 124890 -218303 121273 35900 -58950 878 186535 397048 -131791
17801 226080 -119195 -70201 -203408 -115057 -93298 204886 142806 198858 -124393 -228360
17791 -228360 -143659 64467 123603 -30610 -136918 53863 -151687 163065 292248 -87071 53022
17779 -57280 -107453 64833 -69843 -273886 -13521 495250 54484 -20224 211458 -129409 -272536
17768 -272536 -19814 -61169 199392 -166522 -139365 -194321 338785 -46585 -232396 267788
17757 -214768 -154929 82456 -63265 109071 -92496 -57616 -134015 101641 -56894 90729 -11037
17745 -201143 98926 82714 234979 30470 -11144 -110362 272551 29722 17217 -39109 55391
$$ packed form
17825a18981A06457A7686a36205N738d5968H8586b5026H881M019J38419f1828
17813A35106l3572b63001A24890b18303A21273C5900e8950H78J85657K10513a31791
17801B26080a19195M8994j33207Q8351K1759B04886o2080N6052a24393j03967
17791b28360Q4701F4467N9136c0610j06308E3863a51687A63065J29183h7071E3022
17779e7280n0173F4833f9843k04043a3521D95250E4484b0224B11458a29409j43127
17768b72536a9814m1355A99392a66522K7157n4956C38785d6585j85811B67788
17757b14768N9839H2456f3265A09071i2496L4880p6399A01641e6894I0729a1037
17745b01143I8926j6212J52265C0470a1144r9218B72551B9722j2505c9109E5391
$$ plain form
17733 158574 395004 191899 -63421 -252227 -207560 -74364 -27077 -146997 238730 -88400
17722 59948 -58135 -17885 16553 104311 -50191 88210 326784 -135909 -388839 -151122 293554
17710 -97484 109881 -261087 227149 -24718 120757 -104765 22300 -70619 -184948 -23985
17699 27530 -311012 209775 10679 216442 347442 56053 -56006 -38227 -133723 -120295 150505
17687 -316134 94889 -54036 -41761 56240 -53328 -163222 230719 2866 138839 -82732 -101562
17676 -101562 24966 -90887 -53903 42244 146468 97059 -73421 -52835 -7686 133282 -51256
17664 -59450 63207 -61868 -211357 170927 91353 -139158 -401443 -156751 -151345 -375949 214421
17652 78741 163424 -101716 -3036 -202603 -36104 -394114 -154302 244960 67890 151611 256505
$$ packed form
17733A58574K36430A91899f3421j88806M4667g4364b7077j19920B38730h8400
17722E9948e8135a7885A6553Q7758e0191H8210K38574a35909k52930a51122B93554
17710i7484A09881b61087B27149b4718A20757a04765B2300g0619j14329b3985
17699B7530c11012B09775A0679K05763J31000E6053e6006J7779r5496J3428A50505
17687c16134I4889e4036J2275E6240e3328j09894B30719B866J35973h2732j8830
17676a01562B4966i0887L6984D2244J04224m9409g3421K0586g686A33282e1256
17664e9450F3207f1868j49489A70927p9574a39158k62285a56751N406k24604B14421
17652G8741Q4683a01716c036j99567c6104l58010a54302B44960F7890Q3721J04894
$$ plain form
17641 256505 346677 -155421 -171039 -29455 232661 150284 231568 -144238 282761 -45261 -85379
17630 -85379 -159419 196172 164410 61047 -103410 203721 11545 318491 -42367 133456 75726
17619 75726 -67233 -28131 -100159 -107385 384348 -80444 145663 188044 15864 4307 83362 1411
17606 -7154 -85863 -74772 89518 177977 -93420 43160 120798 199776 -233734 76774 -170301
17594 -89108 -274374 -38601 128992 -250574 263480 48913 75818 41316 281032 155550
17584 155550 256350 -267378 200283 -232907 209859 -34062 -11705 33564 170385 167338
17574 167338 -13578 120294 -80606 -45196 -394333 -517268 33180 114743 24905 9995 -148751
17562 87873 275371 -149682 24454 -179852 265765 111895 128743 -245729 22951 -117592
$$ packed form
17641B56505R0172a55421j5618b9455B32661q2377Q1284a44238B82761d5261m0118
17630h5379p4040A96172l1762F1047a03410B03721A1545L06946d2367A33456n7730
17619G5726f7233b8131p2028p226C84348h0444A45663M2381A5864D307P9055A411
17606g154p8709J1091H9518Q8459i3420D3160P7638P8978b33734G6774a70301
17594h9108j85266c8601A28992b50574B63480D8913K6905l4502K39716j25482
17584A55550J00800b67378B00283b32907B09859c4062a1705C3564J36821l047
17574A67338a3578A20294h0606L5410l49137j22935C3180Q1563B4905I995a48751
17562H7873J87498a49682B4454a79852B65765A11895J6848b45729B2951a17592
$$ plain form
17551 -11269 99962 -59872 339225 24900 -8763 345635 -68243 46715 66321 450241 -164291
17539 340300 -13491 -181184 -225487 -38585 192910 26956 -89923 226318 577222 215202
17528 301372 336880 156245 122047 230405 58776 75343 101201 19101 309263 85639 268876
17517 268876 199167 174852 327 195318 325921 154493 26642 2493 15938 -12772 -2132 136258
17504 -14707 34143 201104 365445 -118617 42194 278949 -337552 229767 83820 192993
17494 192993 78257 15175 89386 -9317 262877 90078 -29315 59630 402112 -44773 -36149
17483 -36149 482358 203975 21941 136436 385643 -54802 151343 318637 -215895 146002
17472 163954 401940 498441 67244 292837 179953 174986 295109 254313 143279 55161 166916
$$ packed form
17551a1269I9962e9872C39225B4900h763C45635f8243D6715J9606L83920a64291
17539C40300a3491j67693m4303c8585A92910B6956h9923B26318L50904B15202
17528C01372L5508A56245l4198J08358E8776J6567K5858A9101K90162H5639J83237
17517B68876o9709k4315C27J94991J30603A54493B6642B493J3445a2772b132A36258
17504a4707C4143J66961J64341a18617D2194K36755c37552B29767H3820J09173
17494A92993G8257A5175P4211i317B62877I0078b9315E9630L42482d4773Q624
17483c6149D82358B03975B1941J14495K49207e4802A51343J67294b15895A46002
17472A63954K37986R6501F7244K25593j12884m967J20123m0796j11034E5161J11755
$$ plain form
17461 166916 307286 231894 101443 31109 274398 17949 308429 -27287 297166 426902
17451 426902 300021 272527 35676 289591 305156 145596 120626 355613 205015 8184 323052
17440 323052 313077 608061 358290 464498 302744 122439 236002 207735 255140 240110
17430 240110 243354 545844 333812 -121768 184187 457069 371767 176241 531479 -54328
17419 405299 372918 217095 256243 394168 303235 144526 193032 356940 -34987 315975
17408 138765 135781 25083 273502 63504 -485826 7207 156287 -67394 165819 -27595 101349
17396 588191 236277 213963 143896 440784 150299 -26804 -71992 121340 208017 421767
17386 421767 64296 239182 166349 92465 358837 171712 172127 38669 201791 194446 228692
$$ packed form
17461A66916J40370p5392A01443C1109K43289A7949K90480b7287B97166J29736
17451D26902j26881k7494C5676K53915J5565A45596k4970K34987j50598H184L14868
17440C23052r975K94984k49771J06208j61754A22439J13563k8267M7405j5030
17430B40110L244L02490k12032a21768A84187K72882q5302A76241L55238e4328
17419D05299l2381j55823L9148J37925r0933A44526M8506J63908c4987C15975
17408A38765k984B5083K48419F3504d85826G207J49080f7394A65819b7595A01349
17396E88191B36277k2314p0067K96888A50299b6804m5188A21340Q6677K13750
17386D21767F4296J74886p2833p3884K66372A71712M15C8669J63122p345L4246
$$ plain form
17375 228692 46176 218444 -151824 117022 160252 283115 10604 60505 30407 283574
17365 283574 330598 44106 190798 74258 646113 -20679 151730 99369 398905 359043 130435
17353 95827 411434 152603 -106442 102997 46233 283818 191287 95458 96533 211044 80847
17341 110687 182297 229018 290393 34681 268289 -46296 42025 214685 -64565 261258 207061
17330 207061 11396 186343 233174 150509 190658 94959 252710 363101 327389 119199 49766
17318 358360 178683 298499 -60536 95100 -193873 552709 205655 116871 -35669 306644
17307 84078 -241581 67493 425820 283592 388758 -44561 216895 364151 -104925 145720
17296 177603 284580 169294 -53056 -66530 177554 -174108 469595 174295 201622 84298
$$ packed form
17375B28692D6176J72268a51824A17022M3230J22863A0604M9901l0098K53167
17365B83574M7024D4106J46692G4258N71855b0679A51730n2361K99536l9862A30435
17353I5827L15607A52603a06442A02997D6233K37585r2531I5458J075J14511H0847
17341A10687P1610M6721O1375C4681K33608d6296D2025J72660f4565B61258n4197
17330B07061A1396J74947M6831q2665M0149I4959J57751J10391l5712A19199D9766
17318C58360A78683J19816f0536I5100a93873E52709B05655q8784c5669C06644
17307H4078b41581F7493L58327j42228J05166d4561B16895J47256a04925A45720
17296A77603J06977j15286e3056j3474A77554a74108D69595A74295K7327H4298
$$ plain form
17285 308987 233608 -256419 359070 -110101 327678 475016 271790 139664 85744 246962
17275 246962 404788 610120 18493 144332 8042 152108 -140263 568694 185924 25617
17264 255141 327058 152228 394337 -112668 416043 498258 44635 266466 210617 -145659
17253 161961 148970 161907 219401 -92843 54625 295946 423978 204 312201 -53314 88605
17241 384569 270214 151956 314984 182147 188870 -63318 497 357840 357858 151665 300663
17230 300663 1156 392495 107784 289985 413535 278174 307265 396831 273616 374156
17220 374156 507851 84386 211665 213930 -28231 308661 214545 261999 459872 565569 174591
17208 189012 346406 75625 109450 -27483 414733 269790 397578 264159 401220 412972
$$ packed form
17285C08987p5379b56419C59070a10101C27678J47338k03226j32126n3920J61218
17275B46962J57826K05332A8493J25839H042J44066a40263E68694A85924B5617
17264B55141P1917A52228K42109a12668D16043Q2215D4635K21831n5849a45659
17253A61961j2991J2937N7494i2843E4625K41321J28032B04L11997e3314H8605
17241C84569j14355j18258J63028j32837O723f3318D97L57343J8A51665J48998
17230C00663A156L91339A07784J82201J23550j35361K9091Q9566j23215J00540
17220C74156J33695H4386J27279K265b8231C08661r4116M7454J97873J05697A74591
17208A89012J57394G5625L3825b7483D14733j44943J27788j33419J37061J1752
$$ plain form
17198 412972 128698 163744 137030 146428 115701 236702 236640 395515 310526 281688 151567
17187 151567 442143 545156 205538 424151 169195 12843 393366 -67969 187474 140973
17177 140973 2077 263977 123617 519931 294910 172300 577787 92936 140907 7560 14745
17166 14745 292746 481463 88669 87861 599810 304718 404828 196562 405909 257671
17156 257671 401135 -53527 175873 533604 173521 196039 524070 212930 404265 426183
17146 426183 725640 -39401 216940 492448 476114 374877 445397 432053 288472 373321
17136 373321 224787 263752 115594 135996 358345 30374 390824 184233 343194 711720
17126 711720 385212 745134 273280 451941 735583 873872 511799 495949 478788 579826
$$ packed form
17198D12972A28698L5046k6714R398l0727J21001o2J58875q4989k8838j30121
17187A51567K90576J03013B05538K18613A69195A2843L80523f7969A87474m6501
17177A40973B077K61900A23617L96314k25021j22610M05487I2936M7971G560P185
17166A4745K78001J88717H8669q08N11949k95092J00110A96562K09347j48238
17156B57671J43464e3527A75873L57731A73521K2518L28031B12930J91335K1918
17146D26183K99457c9401B16940K75508j6334j01237P0520j3344j43581Q4849
17136C73321j48534L8965A15594K0402K22349C0374L60450A84233J58961L68526
17126G11720l26508L59922B73280J78661K83642J38289l62073j5850j7161J01038
$$ plain form
17116 579826 473980 281827 79796 657508 406521 399348 265589 359880 294674 191760
17106 191760 -16366 510372 712234 452016 364233 658867 505012 152948 433493 309309
17096 309309 639651 417164 591790 291370 264867 561571 240068 214188 257365 514065
17086 514065 287744 682703 435885 390436 741516 374787 353970 645499 335392 545638
17076 545638 503487 394273 597992 637935 513093 794200 726337 671587 628369 451287
17066 451287 454821 380341 680705 743730 466146 476489 720513 827444 473952 635615
17056 635615 529403 550488 531806 841201 673131 419288 768970 772553 419151 662949
17046 662949 545214 953215 610478 543347 496235 678516 666915 255517 419022 610417
$$ packed form
17116E79826j05846j92153G9796N77712k50987p173j33759R4291o5206j02914
17106A91760a6366E10372K01862k60218q7783K94634j53855A52948K80545j24184
17096C09309L30342k22487J74626B91370k6503K96704B40068k5880M3177K56700
17086E14065k26321L94959k46818m5449L51080l66729k0817K91529l10107K10246
17076E45638m2151j09214K03719L9943j24842K81107o7863n4750m3218j77082
17066D51287L534p4480L00364O3025k77584J0343K44024J06931l53492J61663
17056F35615j06212K1085j8682L09395j68070k53843L49682L583l53402K43798
17046F62949j17735M08001l42737o7131m7112J82281j1601B55517J63505J91395
$$ plain form
17036 610417 541394 543256 708417 952904 803855 714881 945906 889427 930872 517914 610537
17025 610537 720995 973411 751001 495619 1014670 734054 703444 679982 685306 445734
17015 445734 840996 1018085 570081 623603 924501 720341 740675 744289 881288 768569
17005 768569 972543 743257 746882 946722 667178 759107 777075 688482 996239 1102508
16995 1102508 1090838 975205 956180 648265 924167 745061 1292853 840444 684144 1051135
16985 1051135 840007 955980 863473 834958 989201 1331332 735823 884660 1125794 926809
16975 926809 972527 886168 1224788 1124388 1181853 1017573 1052853 944501 941221 1159468 1134896
16964 1134896 1080561 1254842 1014199 833710 1114118 1238247 1108116 1110471 1393773 1364020
$$ packed form
17036F10417o9023J862J65161K44487j49049q8974K31025n6479M1445m12958R2623
17025F10537J10458K52416k22410k55382N19051k80616l0610k3462N324k39572
17015D45734L95262J77089m48004N3522L00898k04160K0334L614J36999j12719
17005G68569K03974k29286L625J99840k79544R1929J7968q8593L07757J06269
16995A102508j1670j15633j9025l07915K75902j79106N47792m52409j56300L66991
16985A051135k11128J15973r2507k8515J54243L42131n95509J48837K41134j98985
16975I26809M5718q6359L38620j00400N7465j64280L5280j08352l280K18247k4572
16964A134896n4335J74281k40643j80489K80408J24129j30131K355K83302k9753
$$ plain form
16954 1364020 1269144 1199813 1041400 1082220 1122440 1527246 1300590 937282 1300230 1120988
16944 1120988 1320630 1605839 1360571 1307385 1478037 1493041 1119163 1653845 1672623 1000613
16934 1000613 1749551 1391594 1118034 1331240 1368566 1472697 1243750 1491063 1781855 1469663
16924 1469663 1461890 1690199 1802966 1594433 1871718 1676405 1941681 1599133 1868979 1710933
16914 1710933 1555717 1838675 1618106 1830085 1681815 1536985 1936628 1824123 1913000 1896330
16904 1896330 1830013 2086600 1953737 2110216 2280509 1690504 2168773 2090360 1907965 2172042
16894 2172042 2291637 2129694 2044416 2151590 1974263 2344203 2115376 2332924 2187062 2327866
16884 2327866 2502176 2221011 2190629 2472835 2405317 2729990 2242152 2470997 2786486 3257104
$$ packed form
16954A364020r4876o9331j58413M0820M0220M04806k26656l63308L62948j79242
16944A120988J99642K85209k45268n3186J70652J5004l73878N34682J8778o72010
16934A000613P48938l57957k73560K13206L7326J04131k28947K47313K90792l12192
16924A469663p773K28309J12767k08533K77285j95313K65276l42548K69846j58046
16914A710933j55216K82958k20569K11979j48270j44830L99643j12505Q8877j6670
16904A896330o6317K56587j32863J56479J70293n90005M78269p8413j82395K64077
16894B172042J19595j61943q5278J07174j77327L69940k28827K17548j45862J40804
16884B327866J74310k81165l0382K82206o7518L24673m87838K28845L15489M70618
$$ plain form
16874 3257104 2493481 2934384 2691003 2748894 2541751 2814172 2892224 2841728 2720921 2950195
16864 2950195 3033913 3283451 3161499 3126736 3259493 3281108 3504967 3463699 3295316 3849247
16854 3849247 3543423 3537756 3645641 3659351 4132015 3769711 3998234 3846020 4010738 3971385
16844 3971385 4292641 4288225 4232450 4723999 4463211 4457741 4747406 4559919 4588726 4782731
16834 4782731 4972525 4791420 4735197 5118945 5027463 5075207 5389211 5371550 5770176 5692401
16824 5692401 5700034 5919528 5951090 5913452 6061583 6185955 6390328 6698089 6565684 6766275
16814 6766275 6804146 6925735 6950312 7216601 7415080 7856244 7961478 8015616 8430609 8141381
16804 8141381 8410519 8335276 8932930 9159709 9340254 9315312 9849065 10057126 10546919 10334233
$$ packed form
16874C257104p63623M40903k43381N7891k07143K72421P8052n0496j20807K29274
16864B950195Q3718K49538j21952l4763J32757K1615K23859m1268j68383N53931
16854C849247l05824n667J07885J3710M72664l62304K28523j52214J64718l9353
16844C971385L21256m416n5775M91549k60788n470K89665j87487K8807J94005
16834D782731J89794j81105n6223L83748r1482M7744L14004j7661L98626p7775
16824E692401P633K19494L1562l7638J48131J24372K04373L07761j32405K00591
16814F766275L7871J21589K4577K66289J98479M41164J05234N4138M14993k89228
16804H141381K69138p5243N97654K26779J80545k4942N33753K08061M89793k12686
$$ plain form
16794 10334233 10642360 10960127 11159273 11368766 11624230 11740631 12399623 12395444 12787445 13337358
16784 13337358 13494771 14017176 14090413 14772190 15360123 15942223 16238915 16918552 17079090
16775 17079090 17701445 18361716 19001969 19398197 20390672 20775131 21903821 22239001 23390291
16766 23390291 24175717 25122252 25814311 26830052 27842631 28670722 30221024 30981408 32240806
16757 32240806 33639474 34898009 36531815 37830521 39689679 41605159 43343757 44962190
16749 44962190 47231931 49346450 51630837 54236965 57021481 59452895 62417399 65208958
16741 65208958 68479419 71721741 75514636 79230953 83328361 87526923 91306048 96055089
16733 96055089 100707203 105437390 110068752 115306621 120258784 124967616 129840934 134551061
$$ packed form
16794A0334233L08127L17767J99146K09493K55464J16401O58992m179L92001N49913
16784A3337358J57413N22405P3237O81777N87933N82100K96692O79637J60538
16775A7079090O22355O60271O40253L96228R92475L84459J128690L35180J151290
16766B3390291P85426R46535O92059J015741J012579Q28091J550302P60384J259398
16757C2240806J398668J258535J633806J298706J859158J915480J738598J618433
16749D4962190K269741K114519K284387K606128K784516K431414K964504K791559
16741F5208958L270461L242322L792895L716317M097408M198562L779125M749041
16733I6055089M652114M730187M631362N237869M952163M708832M873318M710127
$$ plain form
16725 134551061 138639546 142595518 146153488 149027458 151454530 153257165 154385928 154756304
16717 154756304 154555612 153472869 151723158 149871416 146416291 143117818 139253427 134792025
16709 134792025 130134096 125492592 120280355 115027417 109881859 104804964 99855434 95014559
16701 95014559 89974379 85707819 81435167 77119583 73290275 69471495 66119554 62684945
16693 62684945 59651076 56750423 54125610 51393749 49022537 46527656 44385008 42218337
16685 42218337 40340685 38351558 36749609 35180282 34068927 32160447 30635021 29621808
16677 29621808 28360041 27379391 26177368 25374712 24068065 22953865 22263798 21896579 20736480
16668 20736480 20152677 19569865 18504213 17758841 17542680 16725900 16021969 15446303 15361548
$$ packed form
16725A34551061M088485L955972L557970K873970K427072J802635J128763L70376
16717A54756304k00692j082743j749711j851742l455125l298473l864391m461402
16709A34792025m657929m641504n212237n252938n145558n076895m949530m840875
16701I5014559n040180m266560m272652m315584l829308l818780l351941l434609
16693F2684945l033869k900653k624813k731861k371212k494881k142648k166671
16685D2218337j877652j989127j601949j569327j111355j908480j525426j013213
16677B9621808j261767r80650j202023q02656j306647j114200o90067l67219j160099
16668B0736480n83803n82812j065652p45372k16161q16780p03931n75666q4755
$$ plain form
16659 15361548 14922843 14005907 13845981 13370678 13033278 12492353 12591640 11946259 11874504 10816578
16649 10816578 10954495 10399410 10440018 9930016 9865430 9500410 9296665 8950719 8746527 8537603
16639 8537603 8178027 8045956 8056177 7998492 7600157 7170628 7136769 6792535 7097636 6947711
16629 6947711 6501795 6573994 6388562 6250031 5825296 5647469 5729569 5650736 5752253 5320149
16619 5320149 5442959 5044012 5249590 4956150 5010487 4688330 4347323 4842765 4651019 4226492
16609 4226492 4361942 4193446 3993780 4450024 3783302 3933597 4028852 3435640 3955689 3904829
16599 3904829 3679694 3371668 3409726 3457884 3346204 3244610 3304431 2894464 3296846 3031063
16589 3031063 2941898 2835224 2678030 2444921 2716006 2759426 2744485 2329846 2524124 2912583
$$ packed form
16659A5361548m38705r16936j59926m75303l37400n40925R9287o45381p1755j057926
16649A0816578J37917n55085M0608n10002o4586l65020k03745l45946k04192k08924
16639H537603l59576j32071J0221n7685l98335m29529l3859l44234L05101j49925
16629F947711m45916P2199j85432j38531m24735j77827Q2100p8833J01517m32104
16619E320149J22810l98947K05578k93440N4337l22157l41007M95442j91746m24527
16609D226492J35450j68496j99666M56244o66722J50295R5255n93212N20049n0860
16599C904829k25135l08026L8058M8158j11680j01594N9821m09967M02382k65783
16589C031063q9165j06674j57194k33109K71085M3420j4941m14639J94278L88459
$$ plain form
16579 2912583 2430942 2361955 2567393 2110401 2235797 2778802 2264037 2022235 2298491 2313710
16569 2313710 2386136 2249548 1981422 2238741 1832605 2412471 1931345 2275802 1953159 1684934
16559 1684934 2143530 2043779 1741380 1643362 1691160 1709512 1801792 1726114 1668765 1857088 1737938
16548 1737938 1343097 1806769 1951487 1662274 1540513 1871360 1417670 1440815 1481467 1626361
16538 1626361 1564375 1351321 1271452 1390771 1360784 1449792 1623413 1543539 1401394 1359777
16528 1359777 1129783 1170734 1680539 1245388 1126663 1134799 905266 1254798 1122284 1018374
16518 1018374 1108262 1012627 1393321 1035124 945991 930312 1078935 994344 1027524 1091060 645060
16507 645060 1360566 1050767 862046 1118821 1258708 470725 809373 859105 1430425 1137265
$$ packed form
16579B912583m81641o8987K05438m56992J25396N43005n14765k41802K76256J5219
16569B313710P2426j36588k68126K57319m06136N79866m81126L44457l22643k68225
16559A684934M58596r9751l02399r8018M7798J8352R2280p5678n7349J88323j19150
16548A737938l94841M63672J44718k89213j21761L30847m53690K3145M0652J44894
16538A626361o1986k13054p9869J19319k9987Q9008J73621p9874j42145m1617
16528A359777k29994M0951N09805m35151j18725Q136k29533L49532j32514j03910
16518A018374Q9888r5635L80694l58197q9133j5679J48623q4591L3180O3536m46000
16507F45060P15506l09799j88721K56775J39887D70725L38648M9732N71320k93160
$$ plain form
16497 1137265 975740 699776 663043 1261903 770406 989428 683827 726073 1058426 957400
16487 957400 704787 742162 624113 842949 661413 947189 1020160 820403 944498 798722
16477 798722 879070 1050625 764692 771566 825415 534925 577475 449974 635044 779796
16467 779796 469879 1073608 687281 609365 358694 511779 568570 493291 440538 909248
16457 909248 550708 550551 709294 837662 1023733 781359 719889 431146 596620 563991
16447 563991 652741 617617 455036 600935 573410 519777 483383 599283 641566 724898 720123
16436 720123 665613 705456 475937 777128 540072 585283 548588 361456 699804 512864
16426 512864 549341 555183 460552 601102 268475 528366 336113 155383 539119 244450
$$ packed form
16497A137265j61525k75964l6733N98860m91497K19022l05601M2246L32353j01026
16487I57400k52613L7375j18049K18836j81536K85776P2971j99757J24095j45776
16477G98722Q0348J71555k85933O874N3849k90490M2550j27501J85070J44752
16467G79796l09917O03729l86327p7916k50671J53085N6791p5279n2753M68710
16457I09248l58540j57J58743J28368J86071k42374o1470k88743J65474l2629
16447E63991Q8750l5124j62581J45899k7525n3633l6394J15900M2283Q3332m775
16436G20123n4510L9843k29519L01191k37056M5211l6695j87132L38348j86940
16426E12864L6477N842r4631J40550B68475K59891j92253A55383L83736B44450
$$ plain form
16415 347680 191293 365967 418033 661913 584275 362710 448051 315189 591009 460540
16405 460540 290853 574317 240415 622277 162038 525047 374991 214441 124218 414895
16395 414895 299495 104921 479758 483402 203164 340280 616592 298634 712482 446733
16385 446733 372956 55462 561515 169833 241190 399836 337732 93459 362809 143962
16374 272493 504638 91271 281626 282130 186952 442844 289353 295612 158654 398586 121675
16362 332889 358602 111310 393880 363672 335768 369993 374752 34294 214437 222900 10837
16350 484620 394759 332617 188092 243590 121964 443587 -134784 189284 -82021 -5843 287229
16338 232830 32267 145791 -35812 66151 423520 174789 404912 -43665 254211 49384
$$ packed form
16415C47680j56387J74674N2066K43880p7638k21565Q5341j32862K75820j30469
16405D60540j69687K83464B40415L81862A62038L63009j50056j60550r0223K90677
16395D14895j15400A04921L74837L644B03164J37116K76312B98634M13848k65749
16385D46733p3777E5462N06053A69833P1357J58646o2104I3459K69350A43962
16374B72493K32145I1271J90355N04r5178K55892j53491O259j36958K39932A21675
16362C32889K5713A11310K82570l0208k7904L4225M759C4294J80143Q463A0837
16350D84620q9861o2142j44525N5498j21626L21623a34784A89284h2021e843B87229
16338B32830C2267J13524c5812F6151L57369A74789K30123d3665B54211D9384
$$ plain form
16327 474125 -21548 104985 2684 136222 -186026 464151 286177 -16096 473257 125543
16316 50923 134122 138219 248511 364460 520054 107219 295610 262163 316291 215691 158278
16305 158278 267911 116671 19498 18000 183656 71005 -4440 -49625 349725 332039 143120
16293 -88213 285531 -56268 496257 269069 319386 312213 -68114 59628 368771 326318 -77339
16281 269426 321441 175991 -34429 -166085 244030 30337 284769 188246 412477 351307
16271 351307 24874 17457 26645 56523 94215 120597 254476 -84329 253104 15992 267593
16260 267593 163040 -145984 189383 -124672 271146 -125204 -223068 282454 247090 99725
16249 288816 -147954 120408 -137892 -28310 55816 148741 223173 42498 -199668 -51089 122368
$$ packed form
16327D74125b1548A04985B684J33538a86026D64151j77974a6096D73257A25543
16316E0923Q3199M097J10292J15949J55594A07219J88391l3447N4128j00600n7413
16305A58278J09633A16671A9498j498J65656G1005d440m5185C49725j7686A43120
16293h8213B85531e6268D96257k27188N0317p173f8114E9628L09143m2453g7339
16281B69426N2015j45450c4429j31656B44030C0337K54432r6523K24231o1170
16271C51307B4874p417R188K9878L7692K6382J33879h4329B53104A5992K51601
16260B67593j04553a45984A89383a24672B71146a25204r7864B82454l5364I9725
16249B88816a47954A20408a37892b8310E5816R2925P4432D2498a99668e1089A22368
$$ plain form
16237 108190 -100549 266809 334020 -121232 408872 -10836 -18729 158887 -51543 -67070 -20338
16225 31069 -93154 502231 -263851 302615 -47238 -244360 -267505 142098 -143416 56204
16214 304720 -203797 -11653 208509 75518 321303 -64996 21442 94314 -22413 309475 -76342
16202 -186956 198803 276069 -140969 86760 126247 3085 469612 -170212 -270279 182105
16191 -332304 -82317 436673 48523 -200225 29391 -143412 -92450 -95349 -3934 -201255 -117510
16180 -117510 140597 90069 -46723 64008 194609 102305 136184 -87185 133044 97390 204099
16169 204099 -236185 530503 121980 46480 156073 189967 148388 702 -64352 365994 325541
16158 325541 57180 -285792 76371 -84097 137450 97319 106172 276981 29424 233009 -137299
$$ packed form
16237A08190a00549B66809O7211a21232D08872a0836p893A58887e1543j5527b0338
16225C1069i3154E02231b63851C02615d7238j97122k3145A42098a43416E6204
16214C04720b03797a1653B08509G5518K45785f4996B1442P2872b2413C09475g6342
16202a86956A98803P7266a40969H6760L9487C085M66527a70212j00067A82105
16191c32304h2317D36673D8523b00225B9391a43412N0962k899c934j97321Q3745
16180a17510A40597n0528d6723F4008J30601r2304L3879h7185A33044l5654J06709
16169B04099b36185E30503A21980D6480J09593L3894m1579G02f4352C65994m0453
16158C25541E7180b85792G6371h4097A37450m0131Q853J70809B9424K03585a37299
$$ plain form
16146 12754 155805 -2985 22463 253436 -63831 -160090 18646 182040 -135080 74007 -41535
16134 40131 -288806 33968 -90573 20535 -215100 -38060 197779 -78310 41593 51988 -6574
16122 -100252 97053 -108370 -14564 29589 32588 137386 -125491 -47924 82326 194764 12712
16110 -15721 62908 249178 309220 -9599 -18739 37837 -11816 357817 197140 -61822 202342
16098 101835 132332 -75999 -51826 180579 -183309 -61652 115230 -45079 -260965 -149775
16088 -149775 156854 -184981 145104 180919 -15227 -385632 10463 103562 -27687 221532
16077 -278512 119529 -185561 3043 -52178 -106108 -136478 137186 51148 -32393 232114 -232366
16065 34081 197955 11592 -287541 40023 368540 -27511 78993 143421 -59022 87460 241968
$$ packed form
16146A2754J43051b985B2463K30973f3831r6259A8646J63394a35080G4007d1535
16134D0131b88806C3968i0573B0535b15100c8060A97779g8310D1593J0395f574
16122a00252I7053a08370a4564B9589K999J04798a25491d7924H2326J12438A2712
16110a5721F2908J86270O0042i599r140C7837a1816C57817j60677f1822B02342
16098A01835L0497g5999K4173A80579a83309f1652A15230d5079k15886J11190
16088a49775A56854a84981A45104L5815a5227l70405A0463R3099b7687B21532
16077b78512A19529a85561C043e2178n3930l0370A37186E1148c2393B32114b32366
16065C4081J63874A1592b87541D0023L28517b7511G8993O4428e9022H7460J54508
$$ plain form
16054 241968 70804 -134223 38884 -168844 118545 -29625 -58027 34557 -313079 -11072 -300030
16043 -300030 115605 -167250 185275 -64884 -155881 32621 -98370 525171 -106775 39506
16032 -53679 306377 70496 96227 41929 -54663 198992 8366 -349210 -15204 -103712 -7360
16020 -178821 -165602 -50869 30450 -405288 40287 41586 -303771 54015 -254704 30406 101149
16009 101149 126906 -69447 161121 -89249 -75737 106202 -177521 65290 -79902 52491 -210497
15997 98488 80448 57236 -154841 -26291 -162774 -297687 -63698 -44874 -180269 82558 185484
15986 185484 183828 301121 30457 49987 13997 300920 157105 131385 151084 119007 111224
15975 111224 243299 154070 144142 -125303 -95789 156453 -84103 -195314 -181112 330510 166381
$$ packed form
16054B41968G0804a34223C8884a68844A18545b9625k8402C4557c13079a1072k88958
16043c00030A15605a67250A85275f4884r0997C2621i8370E25171a06775C9506
16032e3679C06377G0496K5731D1929e4663A98992H366c49210a5204q8508g360
16020a78821J3219e0869C0450d05288D0287J299c03771E4015b54704C0406P0743
16009A01149K5757f9447A61121h9249J3512A06202a77521F5290g9902E2491b10497
15997I8488j8040k3212a54841b6291j36483j34913f3698J8824j35395H2558J02926
15986A85484j656J17293C0457J9530A3997K86923j43815k5720J9699l2077p783
15975A11224J32075q9229r928a25303K9514A56453h4103j11211J4202C30510j64129
$$ plain form
15964 166381 121710 74604 -55457 3371 425458 23235 154263 5372 48400 94654 -244664
15952 57223 230067 73524 113322 8577 -398143 -73803 -51159 -169479 -56981 -16950 129409
15940 -72848 4268 -105808 176144 -143825 261325 154141 179553 -102433 -213874 -142275
15930 -142275 -121071 -98490 -117483 365927 -106573 -440764 114912 -85356 166838 -36622
15919 -50505 -33861 139243 72583 177022 -148960 -329487 73882 43318 -282760 -182996 138673
15907 -571496 -111078 33166 -240059 81011 129215 -12996 68363 -40356 -36282 98749 73065
15896 73065 -235361 -53946 -134944 238773 -43092 24753 -94192 109947 101854 120165 -144740
15884 175174 -196086 -256156 -301115 -32404 -86902 64302 -68846 195660 106466 -172041 24021
$$ packed form
15964A66381m4671m7106e5457C371M22087B3235J31028E372M3028M6254b44664
15952E7223J72844G3524L9798H577c98143g3803K2644j18320e6981a6950A29409
15940g2848D268a05808A76144a43825B61325j07184K5412a02433j11441P1599
15930a42275K1204K2581j8993C65927a06573l34191A14912h5356A66838c6622
15919e0505J6644A39243o6660J04439a48960j80527G3882l0564b82760R9764A38673
15907e71496a11078C3166b40059H1011M8204a2996F8363d0356M074I8749k5684
15896G3065b35361e3946q0998B38773d3092B4753i4192A09947q093J8311a44740
15884A75174a96086o0070m4959c2404n4498F4302f8846A95660q9194a72041B4021
$$ plain form
15872 -190919 -201555 222899 72175 -31403 -154980 211143 -168535 24754 168067 -183711
15861 -299059 -50359 164259 148410 16587 -18250 133561 -234602 -24500 191682 -146058
15850 -753 -181657 109972 37933 141445 108330 -205052 285776 -79355 203828 21311 -273727
15838 151227 39654 126406 87327 -120251 151203 -193913 -10256 82689 28609 -41865 -239342
15827 -239342 -23653 -163324 -216000 91550 147997 -424390 -159826 -120480 -15734 -146377 -351010
15816 -351010 19837 -71353 -89719 -330218 188658 -176951 -234937 -7951 20574 141106 -185304
15804 174425 155335 383994 16550 -52962 120031 -287773 -183067 172445 5555 -106566
15793 44548 33674 154584 -121110 -118451 -62268 25642 17187 8224 -119262 -235747 21916
$$ packed form
15872a90919j0636B22899G2175c1403j23577B11143a68535B4754J43313a83711
15861b99059e0359A64259j5849A6587a8250A33561b34602b4500A91682a46058
15850g53j80904A09972C7933J03512l3115b05052B85776g9355B03828B1311b73727
15838A51227C9654Q6752l9079a20251A51203a93913a0256H2689B8609d1865j97477
15827b39342b3653j39671n2676I1550N6447d24390a59826L9346a5734j30643k04633
15816c51010A9837g1353j8366k40499A88658a76951n7986g951B0574J20532a85304
15804A74425j9090K28659A6550e2962A20031b87773J04706A72445E555a06566
15793D4548j0874J20910a21110K659N6183B5642q455H224a19262j16485B1916
$$ plain form
15781 43126 59511 -34162 -356697 229791 -68588 173477 13040 -283858 330811 24061 181535
15770 181535 -133956 402981 -43148 -163900 -215657 -188157 -36297 -52005 -395976 -20715 32629
15758 193130 244784 214616 -80498 73196 -12005 -200407 106286 222223 -193079 -220213 173001
15746 69097 91600 63853 -212734 -37089 -49821 261922 -25490 81928 120755 44604 219122
15735 219122 281236 -196517 -154879 -88958 -10301 -188372 126889 -128151 223158 -241990
15724 -252010 -95160 -96847 -149451 -188953 43391 -252175 -44006 -106371 -66862 -90772 -83002 -160791
15712 -160791 -15888 -181620 -392978 -77032 246692 80647 74112 -41500 -141124 271307 25321
15700 -16370 -66005 -163683 88951 -62064 242312 21401 189230 258189 184110 -92735 -27116
$$ packed form
15781D3126J6385c4162l22535B29791f8588A73477A3040b83858C30811B4061J57474
15770A81535a33956D02981d3148j20752n1757K7500c6297j5708l43971b0715C2629
15758A93130N1654l0168h0498G3196a2005j88402A06286J15937a93079k7134A73001
15746F9097K2503k7747b12734c7089j2732B61922b5490H1928L8827D4604J74518
15735B19122O2114a96517M1638O5921a0301j78071A26889a28151B23158b41990
15724b52010i5160j687n2604l9502D3391b52175d4006o2365L9509k3910P770p7789
15712a60791a5888j65732k11358g7032B46692H0647o535d1500r9624B71307B5321
15700a6370m9635r7678H8951f2064B42312B1401J67829O8959p4079i2735b7116
$$ plain form
15688 169711 -4877 -288325 -286615 123871 -80690 117640 -127798 -240750 -151985 -6246 311463
15676 -246040 129422 48197 151093 -143214 172425 41661 97 -15817 67214 -248891 16514
15664 -49612 329523 184169 -47416 2933 157488 -167897 -99431 214323 -124137 69688 -189014
15652 3315 273787 93590 96343 -130506 -283405 -468 344702 -264645 -95153 -253398 -45794
15640 361144 -170806 142854 -294091 60173 -193618 -113465 355866 52143 -45660 -108691
15630 -108691 189989 6057 76071 709 -13783 -173972 115190 291120 240699 78600 150224
15619 150224 -369511 68121 145742 121201 -212292 144535 -292775 166383 -281546 -30442
15608 -47602 -143293 29741 13469 239628 30187 65398 13888 -18597 -90224 110070 88725
$$ packed form
15688A69711d877k83448J710A23871h0690A17640a27798j12952Q8765f246C11463
15676b46040A29422D8197J02896a43214A72425D1661I7a5817F7214b48891A6514
15664d9612C29523j45354d7416B933J54555a67897O8466B14323a24137F9688a89014
15652C315K70472I3590K753a30506j52899d68C44702b64645i5153j58245d5794
15640C61144a70806A42854b94091F0173a93618Q0153C55866E2143d5660o3031
15630a08691A89989F057P0014G09a3783j60189A15190J75930n0421G8600P1624
15619A50224c69511F8121P7621k4541b12292A44535b92775A66383b81546c0442
15608d7602r5691B9741A3469K26159C0187L5211A3888a8597p1627A10070k1345
$$ plain form
15597 88725 120015 -61984 -77909 108108 146340 -4889 154343 -264397 -11947 -34666 154750
15585 -150171 -186345 250974 -215696 274325 -270901 -196180 165169 -304438 -74899 67917
15574 -16951 82607 -46020 -69075 -53636 -43774 231361 -115257 -67802 -217039 75162 -110220
15562 -79615 75838 -7928 -21350 129134 -25920 -6050 -328528 195992 -97483 143340 -216559
15550 37975 178598 -132438 27015 175762 -323347 -2920 93520 -403205 -45216 207997 -155428
15538 30182 -87533 -49287 -79813 283196 248140 -224622 -82906 -241498 158272 -8442 -200334
15527 -200334 -52419 -314499 289810 208216 -23925 -69352 32780 29602 -29247 217446 96068
15515 272710 -43266 192546 -189911 184990 72400 -208242 392138 -48970 254502 -272496
$$ packed form
15597H8725L1290f1984j5925A08108L8232d889A54343b64397a1947k2719A54750
15585a50171l6174B50974b15696B74325b70901P4721A65169c04438g4899F7917
15574a6951H2607d6020k3055J5439R862B31361a15257M7455j49237G5162a10220
15562g9615G5838g928j3422A29134b5920f050l22478A95992i7483A43340b16559
15550C7975J40623a32438B7015J48747c23347b920I3520d03205d5216B07997a55428
15538C0182h7533L8246l0526B83196l5056b24622h2906j58592A58272h442j91892
15527b00334e2419k62080B89810q1594b3925m5427C2780l178b9247B17446I6068
15515B72710d3266A92546a89911A84990G2400b08242C92138d8970B54502b72496
$$ plain form
15504 21163 204083 -8110 91641 -23096 -29226 -46190 -14560 260537 1221 -171525 145098
15492 -72203 107776 -15111 336093 108512 -4876 -346027 -230173 -8505 64593 -31049 118167
15480 -260331 -128748 316842 -5621 21686 182378 37195 68942 -83283 83821 191482 190525
15469 190525 115049 -112579 -163426 -1534 -213772 -48267 -116381 -67914 241189 48086 341535
15458 341535 -89103 337169 -171633 -134153 20618 55545 131106 -163574 250385 108954
15447 -170546 1212 -146981 -126661 325055 52388 -120213 -130543 236393 -111662 34577 -75676
15435 -257977 -113437 -368624 -190274 -298350 -189606 -101994 187266 -50644 -32284 74709
15424 -8487 -41318 -37710 112676 -66849 147931 -316364 -36819 -305470 38805 105036 -46626
$$ packed form
15504B1163J82920h110I1641b3096o130j6964a4560B60537A221a71525A45098
15492g2203A07776a5111C36093A08512d876l41151J15854h505F4593c1049A18167
15480b60331a28748C16842e621B1686J60692C7195L1747h3283H3821J07661r57
15469A90525p5476a12579n0847a534k12238d8267o8114M8467B41189D8086K93449
15458C41535h9103C37169a71633L7480B0618L4927P5561a63574B50385A08954
15447a70546A212a46981K0320C25055E2388a20213j0330B36393a11662C4577g5676
15435b57977a13437k55187J78350j08076J08744Q7612A87266e0644J8360G4709
15424h487l2831L608A12676f6849A47931c16364c6819k68651C8805O6231d6626
$$ plain form
15412 -24190 11010 347313 -27150 -165063 -22845 163535 261717 66503 238416 508992 -179955
15400 -94176 -1400 233317 27915 242279 83590 -14045 -139274 -148335 -207321 -109838 -196802
15389 -196802 261518 -110169 86279 -99652 257633 -146995 -175565 -205563 32554 50490 -163964
15377 261612 -149357 -260974 28667 7622 -198397 -177408 131666 159937 -160456 221790
15366 42738 151509 -137582 199331 129330 124821 63647 131160 -56885 -288891 79434 -62635
15354 -231148 45841 391220 -96613 36522 -126182 -179408 -162523 409928 -63931 63532 61364
15343 61364 -33431 -94238 -115696 -44244 79350 239691 104217 250263 413726 249626 -142875
15331 68590 -26903 192100 179577 218424 234004 215368 217388 128369 339750 20849 -40457
$$ packed form
15412b4190A1010L36303b7150j37913b2845A63535R8182F6503J71913K70576a79955
15400i4176a400B33317B7915K14364H3590a4045j25229r061n8986R7483q6964
15389a96802B61518a10169H6279i9652B57633a46995k8570k9998C2554J7936a63964
15377B61612a49357j11617B8667G622a98397K0989A31666K8271a60456B21790
15366D2738J08771a37582A99331p0001m509o1174O7513e6885k32006G9434f2635
15354b31148D5841L45379i6613C6522a26182n3226J6885D09928f3931F3532k168
15343F1364c3431o0807k1458d4244G9350J60341A04217J46046J63463j64100a42875
15331F8590b6903A92100j2523L8847J5580j8636K020q9019K11381B0849d0457
$$ plain form
15319 124462 -313311 294840 227137 66493 1058 2879 139315 -85393 111267 -118453 181298
15307 -279183 411302 -189430 16642 -141387 66563 -91526 166447 152315 32834 93842 -63639
15295 268801 72343 134066 24654 445596 -88696 199509 109891 -100117 177834 147956 -282987
15283 354786 354605 358487 77548 16156 8681 39017 92774 405301 4718 -209078 -132270 169737
15270 4072 303906 -14329 147584 57489 256344 149616 85218 -114302 221396 -101306
15259 -171799 -42680 -3877 224866 60957 241661 38719 183440 -24240 15196 311805 20833
15247 310450 916236 684022 1524581 1098844 1427284 1046168 955591 433802 230231 -145497
15236 129922 252303 3334 128102 -278167 -124741 17807 90058 150566 170888 -119050 178711
$$ packed form
15319A24462c13311B94840o7703F6493A058J821J36436h5393A11267a18453A81298
15307b79183D11302a89430A6642a41387F6563i1526A66447j4132C2834O1008f3639
15295B68801G2343O1723B4654M20942h8696A99509q9618a00117A77834k9878b82987
15283C54786j81L882G7548A6156p475L0336N3757L12527D718b09078P6808A69737
15270D072K99834a4329A47584E7489J98855j06728o4398a14302B21396a01306
15259a71799d2680c877B24866F0957J80704C8719J44721b4240A5196K96609B0833
15247C10450O05786k32214Q40559m25737L28440l81116r0577D33802k03571a45497
15236A29922J22381C334J24768b78167a24741A7807P2251O0508K0322a19050A78711
$$ plain form
15224 -35901 269315 164033 270318 124056 -100998 -76461 131815 -50590 57976 -84760
15213 -88276 39666 -149554 -143719 62218 234604 -46762 70504 68612 -34694 37671 -92245 -111613
15201 -111613 -56092 162533 154156 29317 -112021 76992 32310 -137644 12240 141973 63199
15189 159123 -231565 58680 100963 16442 464961 -56358 147418 46246 126021 345067 175378
15178 175378 72210 106573 110356 115472 164808 -41471 -73511 272612 168095 139114 -215160
15166 150223 36846 15624 -286647 400148 -240467 72160 169796 98280 64701 149289 -13963
15154 -189134 80273 77177 450618 -44132 -74815 -234190 201277 297553 74646 229824 184758
15143 184758 88586 -262874 175524 -235961 7481 98382 52793 -7862 9385 -17784 226463
$$ packed form
15224c5901B69315j05282J06285A24056a00998K4537A31815e0590E7976h4760
15213h8276C9666a49554N835F2218J72386d6762G0504j892c4694C7671i2245j9368
15201a11613N5521A62533q377B9317a12021G6992C2310a37644A2240J29733F3199
15189A59123b31565E8680M2283A6442M48519e6358A47418D6246P9775K19046j69689
15178A75378G2210L4363L783N116M9336d1471l2040B72612j04517k8981b15160
15166A50223C6846A5624b86647D00148b40467G2160R7636p1516l3579Q4588a3963
15154a89134H0273l096L73441d4132l0683j59375B01277R6276G4646J55178m5066
15143A84758H8586b62874A75524b35961G481R0901m5589g862I385a7784B26463
$$ plain form
15131 308328 142627 355849 191506 437243 305133 115486 -196384 73600 348718 272178
15121 272178 42165 285857 205837 105144 16516 -185449 291683 17526 192549 -167182
15110 -267829 198244 326287 -188077 1112 -136253 120036 171935 -71459 375071 236673
15100 236673 165672 462397 370172 98214 210944 248973 -7938 -51880 282181 320364 45548
15088 259521 84213 111522 -95116 254395 225439 244094 126502 103263 537149 -188089 112403
15076 86641 21958 52524 -174995 29085 114083 47262 351389 296295 53012 121343 -173998
15064 140329 186539 218500 -52744 -131194 -238156 -131181 416925 267867 231800 422225
15054 422225 -5407 254089 105359 170008 238173 3497 219786 303602 64808 408174 197113
$$ packed form
15131C08328A42627K13222j64343K45737j32110A15486a96384G3600K75118p6540
15121B72178D2165K43692q0020j00693A6516a85449B91683A7526J75023a67182
15110b67829A98244J28043a88077A112a36253A20036N1899g1459C75071j38398
15100B36673p1001K96725r2225I8214J12730L8029g938m3942B82181L8183D5548
15088B59521H4213K7309i5116B54395k8956J8655j17592k3239M33886a88089A12403
15076H6641B1958L0566a74995B9085Q4998D7262L04127n5094E3012O8331a73998
15064A40329M6210L1961e2744p8450j06962J06975D16925j49058l6067J90425
15054D22225e407B54089A05359O4649O8165C497K16289Q3816F4808L43366A97113
$$ plain form
15042 -125757 64683 -115842 -35960 70415 366445 -71574 233921 114589 264663 188070
15032 188070 270850 443627 424065 166817 232869 -85827 378818 199218 62944 259738
15022 259738 134785 261259 361259 387574 79462 -94410 87102 275506 247191 169669 446963
15011 446963 292876 -229732 322294 -8333 102645 220820 246809 268652 151412 53935
15000 187334 319837 15697 83191 508673 84162 310606 -98737 473407 136281 311592
14990 311592 170111 508 614075 156933 1089 251782 339552 -71842 183612 -183488 -42935
14978 83498 -33365 158134 359269 231209 150293 60021 192701 248808 30468 371117 428929
14967 428929 74183 242552 674134 253639 566043 267228 184726 332637 366837 167843
$$ packed form
15042a25757F4683a15842c5960G0415K96030g1574B33921A14589J50074p6593
15032A88070Q2780J72777j9562A66817O6052h5827C78818j79600F2944J96794
15022B59738j24953J26474J00000K6315G9462i4410H7102J88404k8315p7522K77294
15011D46963j54087b29732C22294h333A02645J18175K5989K1843j17240E3935
15000A87334J32503A5697O7494M25482H4162K26444i8737D73407A36281J75311
14990C11592j41481E08O13567A56933A089K50693Q7770g1842A83612a83488d2935
14978H3498c3365A58134K01135j28060q0916F0021J32680N6107C0468L40649N7812
14967D28929G4183J68369M31582B53639L12404B67228q2502J47911L4200A67843
$$ plain form
14956 413130 113000 373924 633418 139056 312443 179994 316350 371031 365238 177523
14945 158855 20978 301810 297146 341322 93344 482432 196622 268557 288063 458268 56748
14933 408971 349867 -114473 198643 142653 157699 243014 414239 32173 105353 535932 -12702
14921 570188 348284 253443 122618 306381 412618 378891 503125 388432 -12572 32301
14910 152262 267450 302481 95631 513885 280708 430237 172949 237095 253622 458682
14900 458682 377056 496996 266251 408660 286334 154099 210078 337567 347468 384918
14890 384918 289137 258383 212786 246759 113838 386794 452060 239644 385947 685221
14880 685221 427776 294091 297048 281396 280241 479517 150637 67623 173703 463520 664511
$$ packed form
14956D13130A13000K60924K59494A39056J73387j32449J36356N4681n793A77523
14945A58855B0978K80832m664M4176I3344L89088A96622P1935J9506J70205E6748
14933D08971n9104a14473A98643n5990J5046Q5315J71225C2173P3180M30579a2702
14921E70188k21904r4841A22618J83763J06237l3727J24234j14693a2572C2301
14910A52262J15188L5031I5631M18254k33177J49529A72949O4146J6527K05060
14900D58682q1626J19940k30745J42409j22326j32235N5979J27489R901L7450
14890C84918r5781l0754m5597L3973A13838K72956O5266k12416J46303K99274
14880F85221k57445j33685K957j5652j155J99276A50637F7623J06080K89817K00991
$$ plain form
14869 664511 414376 486639 416260 655172 540428 258786 215546 508722 563655 297069
14859 297069 43293 519999 421174 645684 472312 442802 611501 483032 198411 447316
14849 447316 781018 345715 319069 508313 337861 653199 355922 286681 307776 551425
14839 551425 460771 129990 327297 477059 638399 459236 178410 540116 421338 386252
14829 386252 452301 223667 634673 512919 437797 336304 320790 282790 463629 210425
14818 208945 200106 507571 401620 422049 539813 658733 388463 752819 311005 378445
14808 378445 302409 417061 419568 339801 504260 172862 656559 542131 331580 309244
14798 309244 124045 555998 435931 522212 436236 734236 865320 301526 566936 304946
$$ packed form
14869F64511k50135P2263p0379K38912j14744B58786m3240K93176N4933k66586
14859B97069D3293M76706r8825K24510j73372k9510J68699j28469A98411K48905
14849D47316L33702C45715k6646J89244j70452L15338k97277o9241K1095K43649
14839E51425r0654A29990J97307J49762J61340j79163A78410L61706j18778l5086
14829C86252O6049B23667M11006j21754p5122j01493j5514l8000J80839B10425
14818B08945q839L07465j05951K0429J17764J18920k70270L64356C11005O7440
14808C78445p6036J14652K507p9767J64459A72862M83697j14428k10551k2336
14798C09244A24045M31953j20067Q6281q5976K98000J31084C01526K65410k61990
$$ plain form
14788 304946 510370 313774 254925 441422 478400 480557 736303 741701 577233 522712 289631
14777 289631 223488 671867 424477 475100 425719 690569 603682 770226 525863 357407
14767 357407 512511 94603 211762 947138 390024 715096 555962 963708 667609 484460
14757 484460 697120 730632 789515 385996 430525 616091 750244 655026 939416 643501
14747 643501 690329 562769 487785 667122 887850 467132 772555 724918 926085 849282
14737 849282 595011 675081 726532 702578 822533 294443 612716 622562 646488 823743 806412
14726 806412 775352 710823 872932 693048 754764 797343 888612 873903 1046415 847370 842004
14715 842004 721363 464848 684231 723358 622224 804357 992837 654570 715355 797346
$$ packed form
14788C04946K05424j96596n8849J86497L6978K157K55746N398j64468n4521k33081
14777B89631o6143M48379k47390N0623m9381K64850q6887J66544k44363j68456
14767C57407J55104I4603J17159P35376C90024L25072j59134M07746k96099j83149
14757D84460K12660L3512N8883C85996M4529J85566J34153r5218K84390k95915
14747F43501M6828j27560p4984J79337K20728m20718L05423m7637K01167p6803
14737H49282k54271Q0070N1451k3954J19955B94443L18273R846K3926J77255j7331
14726H06412l1060o4529J62109j79884O1716M2579R1269j4709J72512j99045n366
14715H42004j20641k56515K19383L9127j01134J82133J88480l38267O0785Q1991
$$ plain form
14705 797346 657097 433648 723884 875239 857266 801317 694574 857191 902936 1015838
14695 1015838 916307 971528 844742 822934 738637 972210 776326 548887 936439 798626
14685 798626 890807 1209672 375957 1027902 950560 610134 928173 743423 836551 841970
14675 841970 1109002 863374 608885 669381 1013628 950899 646384 697085 983738 982574
14665 982574 1076155 973615 1031435 865345 701780 1384418 1111214 671876 1016881 1142046
14655 1142046 1105151 1154595 1037318 1219401 1075008 994795 926801 1212072 985470 1467133
14645 1467133 1217095 1291308 1128063 1075722 1308076 1031527 958350 1370103 1094169 1286254
14635 1286254 1118628 1052333 1362406 1266322 967350 1375499 1531390 1288844 1145808 1345218
$$ packed form
14705G97346j40249k23449K90236J51355j7973n5949j06743J62617M5745J12902
14695A015838r9531N5221j26786k1808q4297K33573j95884k27439L87552j37813
14685G98626R2181L18865C75957O51945p7342l40426L18039j84750R3128N419
14675H41970K67032k45628k54489O0496L44247o2729l04515N0701K86653j164
14665I82574R3581j02540N7820j66090j63565O82638k73204m39338L45005J25165
14655A142046l6895M9444j17277J82083j44393q0213o7994K85271k26602M81663
14645A467133k50038P4213j63245n2341K32354k76549p3177M11753k75934J92085
14635A286254j67626o6295L10073r6084k98972M08149J55891k42546j43036J99410
$$ plain form
14625 1345218 1436583 948381 1222715 1747741 1178601 1325733 1362288 1158705 1257345 1390854
14615 1390854 1291044 1375921 1167260 1660514 973283 1262989 1645814 1472919 1422658 1134406
14605 1134406 1362312 1232813 1462254 1650644 1362293 1939515 1410253 1482361 1621265 1522452
14595 1522452 1817903 1642692 1659199 1662196 2060634 1771996 1536316 1837503 1607242 1778462
14585 1778462 1352136 1722126 1606098 1697513 1554584 1875169 1953362 1928407 1980239 1823507
14575 1823507 1776590 1906083 1977683 1807809 2210677 1956433 2063922 2240637 1965820 2593682
14565 2593682 2171342 2178456 2306160 2580573 2474078 2385111 2581564 2372485 2773634 2625725
14555 2625725 3403640 3432684 3929680 3913187 4995358 7276511 13556653 18147194 20411245
$$ packed form
14625A345218R1365m88202K74334N25026n69140J47132L6555k03583R8640J33509
14615A390854r9810Q4877k08661M93254o87231K89706L82825j72895n0261k88252
14605A134406K27906j29499K29441J88390k88351N77222n29262P2108J38904r8813
14595A522452K95451j75211J6507K997L98438k88638k35680L01187k30261J71220
14585A778462m26326L69990j16028R1415j42929L20585P8193k4955N1832j56732
14575A823507m6917J29493P1600j69874M02868k54244J07489J76715k74817O27862
14565B593682m22340P114J27704K74413j06495q8967J96453k09079M01149j47909
14555B625725P77915K9044M96996j6493J082171K281153O280142M590541K264051
$$ plain form
14546 20411245 23602131 24321240 21098141 14409984 7206697 4293136 3718824 3306932
14538 3306932 2734663 2065044 1641721 1934529 2057765 1490194 1593630 1884305 1947442 1857502
14528 1857502 2158483 2261508 2082638 2411095 2055426 2011983 2046231 2289451 2614071 2209063
14518 2209063 2455786 2353943 2709740 2539445 2167130 2578609 2355618 2568632 2516508 2549281
14508 2549281 2483278 2548062 2703760 2528367 2790857 3010996 3134909 2980579 2815368 3012952
14498 3012952 2955364 3361839 2823377 3471684 3311297 3260142 3318619 3505487 3351792 3335679
14488 3335679 3746963 3057064 3301339 3321842 3491309 3452011 3556737 3495984 3605953 3489558
14478 3489558 3794862 3706637 3804938 4048803 3844711 3917349 3986511 3870304 4235097 3992045
$$ packed form
14546B0411245L190886P19109l223099o688157p203287k913561n74312m11892
14538C306932n72269o69619m23323K92808J23236n67571J03436K90675O3137q9940
14528A857502L00981J03025j78870L28457l55669m3443L4248K43220L24620m05008
14518B209063K46723j01843L55797j70295l72315M11479k22991K13014n2124L2773
14508B549281o6003O4784J55698j75393K62490K20139J23913j54330j65211J97584
14498C012952n7588M06475n38462O48307j60387n1155N8477J86868j53695j6113
14488C335679M11284o89899K44275K0503J69467l9298J04726o0753J09969j16395
14478C489558L05304q8225R8301K43865k04092P2638O9162j16207L64793k43052
$$ plain form
14468 3992045 3871153 3881665 3900098 4366590 4397439 4061802 4342256 4269822 4592352 4382150
14458 4382150 4673119 4615967 4905663 4803562 4728367 4736355 4778510 4932955 4970142 5000177 5072050
14447 5072050 5123242 5271297 5399732 5146814 5346625 5477705 5782009 5532910 5921365 5631478
14437 5631478 5622103 5540846 5949128 6331719 6100131 6368307 6436161 6538033 6293498 6398932
14427 6398932 6362515 6565289 6740531 6841583 6856646 7153633 7318032 7207760 7406417 7630588
14417 7630588 7502052 7877024 8087452 7747416 8199185 8046207 8395887 8268563 8441209
14408 8441209 8789868 8709322 9023035 9355849 9347647 9283254 9458630 9737028 9966566 10157567
14398 10157567 10455837 10421536 10751515 10608016 11026092 11213443 11227107 11289995 11826891 11812941
$$ packed form
14468C992045j20892J0512J8433M66492L0849l35637K80454p2434L22530k10202
14458D382150K90969n7152K89696j02101p5195P988M2155J54445L7187L0035P1873
14447E072050N1192J48055J28435k52918J99811J31080L04304k49099L88455k89887
14437E631478r375q1257M08282L82591k31588K68176O7854J01872k44535J05434
14427F398932l6417K02774J75242J01052J5063K96987J64399j10272J98657K24171
14417G630588j28536L74972K10428l40036M51769j52978L49680j27324J72646
14408H441209L48659q0546L13713L32814q202o4393J75376K78398K29538J91001
14398A0157567K98270l4301L29979j43499M18076J87351J3664O2888N36896j3950
$$ plain form
14388 11812941 11804612 12407458 12533959 12593981 12752599 13118087 13351193 13528689 14044865 13949284
14378 13949284 14211103 14814421 14983768 15151003 15400668 15826050 15918067 16061332 16779022
14369 16779022 17001276 17156943 17662309 18300892 18012528 18804042 19372560 19750465 20131761
14360 20131761 20535820 20644048 21182892 21834043 22491430 23131771 23905887 24073437 24423367
14351 24423367 25337631 25778371 26540493 27178434 27816447 28195133 28985305 29904985 31016160
14342 31016160 31556187 32449854 33339823 34008645 34958882 36219590 37417469 38575822 39334739
14333 39334739 40842774 41884815 43444867 44250182 45813631 47484180 48611686 50658776
14325 50658776 51989629 54002813 55857665 57935176 59969926 62198308 64229068 66805554
$$ packed form
14388A1812941q329O02846J26501O0022J58618L65488K33106J77496N16176r5581
14378A3949284K61819O03318J69347J67235K49665M25382R2017J43265P17690
14369A6779022K22254J55667N05366O38583k88364P91514N68518L77905L81296
14360B0131761M04059J08228N38844O51151O57387O40341P74116J67550L49930
14351B4423367R14264M40740P62122O37941O38013L78686P90172R19680J111175
14342C1016160N40027Q93667Q89969O68822R50237J260708J197879J158353P58917
14333C9334739J508035J042041J560052Q05315J563449J670549J127506K047090
14325E0658776J330853K013184J854852K077511K034750K228382K030760K576486
$$ plain form
14317 66805554 69429773 72316863 75206981 78048440 81000659 84270992 87943506 91579850
14309 91579850 95186252 99039014 103522424 107799530 112594078 117605346 123114585 128550890
14301 128550890 134363767 140790788 147440586 154545787 162102824 170100037 178615207 187376892
14293 187376892 196711682 206842713 217030969 227955197 239623190 251459251 264192022
14286 264192022 277526674 291162442 305179059 319635381 335127834 350144735 365071610
14279 365071610 379959866 394981818 408901892 421847845 432733570 437769755 433560024
14272 433560024 422076113 419242451 420377917 421967092 425959782 427057060 431624678 425535719
14264 425535719 414167863 401229803 386675768 370880987 354737285 338283050 321614207
$$ packed form
14317F6805554K624219K887090K890118K841459K952219L270333L672514L636344
14309I1579850L606402L852762M483410M277106M794548N011268N509239N436305
14301A28550890N812877O427021O649798P105201P557037P997213Q515170Q761685
14293A87376892R334790J0131031J0188256J0924228J1667993J1836061J2732771
14286B64192022J3334652J3635768J4016617J4456322J5492453J5016901J4926875
14279C65071610J4888256J5021952J3920074J2945953J0885725N036185m209731
14272D33560024j1483911k833662J135466J589175L992690J097278M567618o088959
14264D25535719j1367856j2938060j4554035j5794781j6143702j6454235j6668843
$$ plain form
14257 321614207 305266704 290090198 274841078 260468070 246748874 233976095 222026054
14250 222026054 210602705 199862658 189378633 179648673 170454367 161971674 154080007
14243 154080007 146483179 139268629 132554971 126497686 120884638 115219269 110225646 105168876
14235 105168876 100743046 96298260 92308101 88322582 84855071 81397950 78269824 75178130
14227 75178130 72017889 68959215 66300872 64033504 61745000 60037747 57452363 55359050
14219 55359050 53706477 51865501 49966686 48528983 46975649 45633514 44466015 42852942
14211 42852942 41542951 40268120 39272754 38152972 37270933 36287190 35220737 34110325
14203 34110325 32964766 32301877 31570511 30903960 29781958 28770151 28241694 27695943 26631069
$$ packed form
14257C21614207j6347503j5176506j5249120j4373008j3719196j2772779j1950041
14250B22026054j1423349j0740047j0484025r729960r194306q482693p891667
14243A54080007p596828p214550o713658o057285n613048n665369m993623n056770
14235A05168876m425830m444786l990159l985519l467511l457121l128126l091694
14227G5178130l160241l058674k658343k267368k288504j707253k585384k093313
14219E5359050j652573j840976j898815j437703j553334j342135j167499j613073
14211D2852942j309991j274831r95366j119782q82039r83743j066453j110412
14203C4110325j145559o62889p31366o66551j122002j011807n28457n45751j064874
$$ plain form
14194 26631069 26257114 25532183 24873276 24310318 23542412 23026323 22463256 21972970 21573823
14185 21573823 20922840 20622995 20043631 19412963 19028151 18687187 18299290 17872324 17328986
14176 17328986 16966631 16890574 16569127 16090147 15986206 15451656 15265061 14623876 14711082 14492807
14166 14492807 14165650 13759654 13476164 13691271 12945381 12746295 12750860 12428805 12128341 11943731
14156 11943731 11538445 11411816 11377408 11183437 11019753 10551144 10757088 10461093 10580902
14147 10580902 10332068 10106272 9862877 9156502 9503312 9231284 9292049 8919735 9103724
14138 9103724 8944058 8730976 8499504 8344619 8232064 7888014 7870824 8066440 7983521 7992872
14128 7992872 7656592 7204841 7492439 7353677 7351122 7093385 7151753 7026932 7007300 6707963
$$ packed form
14194B6631069l73955p24931o58907n62958p67906n16089n63067m90286l99147
14185B1573823o50983k99845n79364o30668l84812l40964l87897m26966n43338
14176A7328986l62355p6057l21447m78980j03941n34550j86595o41185Q7206k18275
14166A4492807l27157m05996k83490K15107p45890j99086M565l22055l00464j84610
14156A1943731m05286j26629l4408j93971j63684m68609K05944k95995J19809
14147A0580902k48834k25796k43395p06375L46810k72028O0765l72314J83989
14138I103724j59666k13082k31472j54885j12555l44050j7190J95616q2919R351
14128G992872l36280m51751K87598j38762k555k57737N8368j24821j9632k99337
$$ plain form
14118 6707963 6534563 6459989 6831392 6234781 6064578 6126177 6353468 6204158 5804489 6039993
14108 6039993 5899100 6127526 6033236 5803302 5584325 5524352 5686368 5374206 5330968 5468499
14098 5468499 5289761 5204646 5327420 5410568 4563650 4927505 4962160 4771805 4805621 4722107
14088 4722107 4687342 4564485 4259159 4303458 4623826 4147592 4388807 4182369 4518110 4024884
14078 4024884 3990195 4087157 3860947 3780976 4137284 3752375 3573633 3663283 3924406 3709816
14068 3709816 3993379 3570421 3547785 3462047 3647150 3435641 3136794 3396876 3635631 3447881
14058 3447881 3457356 3308507 3125246 3478058 3162320 3289296 2982694 3254392 3023666 2907885
14048 2907885 2772581 2665071 3234723 2346482 3076514 3158116 2592499 2732510 2891358 2812969
$$ packed form
14118F707963j73400p4574L71403n96611j70203O1599K27291j49310l99669K35504
14108F039993j40893K28426r4290k29934k18977n9973J62016l12162m3238J37531
14098E468499j78738q5115J22774Q3148q46918L63855L4655j90355L3816q3514
14088D722107l4765j22857l05326M4299L20368m76234K41215k06438L35741m93226
14078D024884l4689R6962k26210p9971L56308l84909j78742Q9650K61123k14590
14068C709816K83563m22958k2636q5738J85103k11509k98847K60082K38755j87750
14058C447881R475j48849j83261L52812l15738J26976l06602K71698k30726j15781
14048B907885j35304j07510N69652q88241P30032Q1602n65617J40011J58848p8389
$$ plain form
14038 2812969 2803766 2893417 2526115 2760690 2812277 2437315 2724541 2745597 2750843 2838554 2818635
14027 2818635 2676480 2567062 2503266 2333190 2478281 2918765 2362213 1999059 2607996 2357194
14017 2357194 2522400 2225393 2153537 2202980 2203297 2224829 2299219 2182014 2139016 2172562 2075709
14006 2075709 2128525 1826129 1897568 2385040 1970615 1913417 1891652 2159822 1726862 1795484
13996 1795484 1906179 2056489 1742479 1862374 2028440 2463269 3683129 8866635 14951581
13987 14951581 17393398 21076570 24993580 23003823 17216748 10697841 5669933 4346148
13979 4346148 3619379 3144628 2567622 2744528 2269720 2703180 2812337 2365539 2240894
13970 2240894 2184263 2091924 2056912 1828604 2308696 2280112 1792636 2031092 1780413 1642217
$$ packed form
14038B812969r203Q9651l67302K34575N1587l74962K87226K1056N246Q7711j9919
14027B818635j42155j09418o3796j70076J45091M40484n56552l63154O08937k50802
14017B357194J65206k97007p1856M9443L17K1532P4390j17205m2998L3546r6853
14006B075709N2816l02396P1439M87472m14425n7198k1765K68170m32960O8622
13996A795484J10695J50310l14010J19895J66066M34829J219860N183506O084946
13987A4951581K441817L683172L917010j989757n787075o518907n027908j323785
13979D346148p26769m74751n77006J76906m74808M33460J09157m46798j24645
13970B240894n6631r2339l5012k28308M80092k8584m87476K38456k50679j38196
$$ plain form
13960 1642217 1933888 1808201 1824239 1758766 1713066 1643178 1756811 2112139 1888675 1811321
13950 1811321 1598769 1795773 1602956 1322456 1819880 1669611 1775190 1584688 1495412 1701371
13940 1701371 1813358 1682494 1413685 1320543 1577077 1206545 1445956 1509708 1617961 1373795
13930 1373795 1669750 1601838 1314656 1302390 1485455 1404151 1276595 1959061 1236499 1202233
13920 1202233 1263784 999676 1248476 1196901 1187514 1287656 1279274 1413712 1260960 1321710 1250000
13909 1250000 1270647 1434465 1254914 907349 1139328 997720 1243058 928602 1120423 1192680
13899 1192680 1234237 1016064 1105061 1142265 970745 1578982 928614 948777 1130629 1051431
13889 1051431 1310788 1461062 1036788 1283121 886785 1420216 1046881 849334 1125465
$$ packed form
13960A642217K91671j25687J6038o5473m5700o9888J13633L55328k23464p7354
13950A811321k12552J97004j92817k80500M97424j50269J05579j90502q9276K05959
13940A701371J11987j30864k68809r3142K56534l70532K39411O3752J08253k44166
13930A373795K95955o7912k87182j2266J83065q1304j27556O82466p22562l4266
13920A202233O1551k64108K48800n1575r387J00142q382J34438j52752O0750p1710
13909A250000K0647J63818j79551l47565K31979j41608K45338l14456J91821P2257
13899A192680M1557k18173Q8997L7204j71520O08237o50368K0163J81852p9198
13889A051431K59357J50274m24274K46333l96336N33431l73335j97547K76131
$$ plain form
13880 1125465 1249134 898164 1190112 846196 994722 1099090 1008964 882891 900461 1124687
13870 1124687 1078401 1028617 954890 942301 1181493 964388 877420 889883 958109 1241027 669998
13859 669998 1179807 561962 938712 769923 751231 1102882 1013908 887729 995752 680488
13849 680488 750322 1118185 712720 1184556 629640 980274 984888 703919 700226 1132610
13839 1132610 908877 775881 1076644 828290 937740 496365 963225 932649 698616 941484
13829 941484 787280 628858 735996 848358 896857 786950 612612 643447 910801 635914
13819 635914 612520 460104 684477 750315 837743 1127430 747489 600231 673072 871648
13809 871648 560998 667049 908064 864722 1045657 974382 643591 813426 913408 518100
$$ packed form
13880A125465J23669l50970K91948l43916J48526J04368r0126j26073J7570K24226
13870A124687m6286m9784p3727j2589K39192k17105q6968J2463O8226K82918n71029
13859F69998N09809E61962L76750j68789j8692L51651q8974j26179J08023l15264
13849F80488O9834L67863m05465M71836n54916L50634M614k80969l693M32384
13839A132610k23733j32996L00763k48354J09450m41375M66860l0576k34033K42868
13829I41484j54204j58422J07138J12362M8499j09907j74338L0835K67354k74887
13819F35914k3394j52416K24373O5838Q7428K89687l79941j47258P2841J98576
13809H71648l10650J06051K41015m3342J80935p1275l30791J69835R9982l95308
$$ plain form
13799 518100 1168492 710147 638122 785854 919968 656043 751540 476296 765793 520113
13789 520113 1001795 563064 682473 567705 708578 656786 459282 447821 552299 581613
13779 581613 606764 572784 629139 755214 348540 134622 666446 1099711 715631 638162
13769 638162 595795 305824 705633 548255 409204 782449 795190 546034 281319 549684
13759 549684 995287 583621 520529 533048 597467 460450 656886 440616 663180 792820
13749 792820 368452 530489 577521 658371 489153 624460 397101 608334 911762 279429
13738 746379 321164 627331 462867 529220 317000 263124 647188 432574 627910 571491
13728 571491 258636 239405 751604 636963 664404 512346 201732 428239 912378 566232
$$ packed form
13799E18100O50392m58345p2025J47732J34114k63925R5497k75244K89497k45680
13789E20113M81682m38731J19409j14768J40873n1792j97504j1461J04478K9314
13779E81613K5151l3980N6355J26075C48540A34622N31824M33265l84080p7469
13769F38162m2367k89971L99809j57378j39051L73245J2741k49156k64715K68365
13759E49684M45603m11666o3092J2519O4419j37017J96436k16270K22564J29640
13749G92820C68452J62037M7032Q0850j69218J35307k27359K11233L03428B79429
13738G46379C21164L06167j64464O6353k12220n3876L84064k14614J95336n6419
13728E71491B58636j9231N12199j14641K7441j52058B01732K26507M84139l46146
$$ plain form
13718 566232 230260 343702 552784 504914 724669 319598 700800 475180 432547 559309
13708 559309 424040 659915 707186 365079 436831 508755 390786 464107 550373 138602
13697 486482 435835 592765 519790 498422 612560 687450 587595 696496 303927 171475
13687 171475 487620 470603 751640 241830 636629 579382 350195 259410 103252 222664
13677 222664 432067 225091 721031 202882 364018 291257 421249 272945 412630 535168
13667 535168 416487 261585 393823 492825 459753 310636 402387 200456 403520 342886
13657 342886 265025 74589 344818 370797 166572 271322 170216 222749 93951 878642
13647 878642 328381 395114 390737 575182 506848 565917 252591 458070 417771 522720 173422
$$ packed form
13718E66232B30260J13442K09082m7870K19755C19598L81202k25620m2633J26762
13708E59309j35269K35875M7271l42107P1752P1924j17969P3321Q6266A38602
13697D86482n0647J56930p2975k1368J14138P4890r9855J08901C03927j32452
13687A71475L16145j7017K81037B41830L94799n7247k29187r0785A03252J19412
13677B22664K09403k06976M95940B02882J61136p2761J29992j48304J39685J22538
13667E35168j18681j54902J32238R9002l3072j49117R1751B00456K03064o0634
13657C42886p7861G4589K70229K5979A66572J04750j01106N2533I3951P84691
13647H78642C28381O6733m377J84445o8334N9069B52591K05479m0299J04949A73422
$$ plain form
13635 221914 412743 114201 540945 -88650 103510 247176 279440 136247 362204 160140
13624 465657 351439 432201 104330 259147 59367 210379 638837 212267 245456 243869
13614 243869 131771 257783 365848 309143 30518 430087 354819 32695 -5111 311912 461716
13603 461716 99617 463078 42244 157921 250810 223649 627842 270953 487532 335589
13593 335589 472128 188528 194422 204561 -4031 365757 184265 162812 330574 296733 363313
13582 363313 147191 431538 362740 632422 444913 516124 203231 183654 -33882 404851
13571 -99309 347190 422239 241757 270183 158236 119205 179872 143287 172996 434286 238958
13560 238958 325264 14105 -60938 259248 420970 320422 -90352 201583 -13896 422238
$$ packed form
13635B21914J90829A14201M26744h8650A03510J43666L2264A36247K25957A60140
13624D65657j14218Q0762A04330J54817E9367J51012M28458B12267L3189j587
13614B43869j12098J26012J08065n6705C0518L99569p5268C2695e111C11912J49804
13603D61716I9617L63461D2244J15677R2889k7161M04193B70953K16579j51943
13593C35589J36539A88528N894J0139d031C65757j81492k1453J67762l3841O6580
13582C63313A47191K84347o8798K69682j87509P1211B03231j9577c3882D04851
13571i9309C47190P5049j80482K8426j11947l9031O0667l6585K9709K61290j95328
13560B38958Q6306A4105f0938B59248J61722j00548i0352B01583a3896D22238
$$ plain form
13549 406886 88263 63628 343724 425701 372528 216030 74071 45380 56522 127395 73424
13538 73424 155253 382594 601905 183295 -35777 285830 185465 313311 337715 165273
13527 292166 368222 203170 -95245 111485 42111 146302 -61595 508410 214821 867368
13517 867368 441113 368473 645932 178684 171024 -98731 551281 183707 -99952 553823
13506 -40568 170555 138711 270779 113893 264027 294881 198867 32073 529824 180200
13495 157159 28824 -155254 243642 98834 256576 19720 306029 293214 75746 468784
13485 468784 518677 209785 223112 150339 428002 436298 18210 245341 203864 270472 23393
13473 -86956 605012 172798 51113 84259 201282 426554 208096 208822 65972 547037 232945
$$ packed form
13549D06886H8263k4635K80096Q1977n3173j56498G4071k8691J1142P0873n3971
13538G3424Q1829K27341K19311A83295c5777B85830j00365J27846K4404A65273
13527B92166P6056j65052i5245A11485D2111J04191f1595E08410B14821O52547
13517H67368m26255p2640K77459A78684p660i8731E51281A83707i9952E53823
13506d0568A70555l1844J32068A13893J50134L0854r6014C2073M97751A80200
13495A57159B8824a55254B43642I8834J57742A9720K86309j2815G5746L93038
13485D68784M9893B09785J3327p2773K77663Q296A8210K27131m1477O6608B3393
13473h6956F05012A72798E1113L3146J17023K25272B08096P26F5972M81065B32945
$$ plain form
13461 190391 37337 316133 81693 255904 156513 198154 397536 436685 237511 239741 175303
13450 175303 -43959 31278 376599 198408 566056 38532 109535 215589 259245 -32522 29485
13438 -94559 174587 248161 -58053 191158 176625 180122 166902 336484 -29831 180431 82628
13426 279905 521929 403392 129671 469423 324601 -44506 294441 303176 161188 -93012
13415 70709 97501 -84359 232634 -59610 413525 244452 271759 -65210 62455 477247 424897
13404 424897 21636 120115 100450 12801 140628 141545 331360 499927 237352 171353 -137810
13392 207472 124955 239505 392415 170734 -62298 90182 236678 316487 303185 181309
13382 181309 73934 252623 -47829 60540 273033 -41429 64395 37922 303753 56399 -53327
$$ packed form
13461A90391C7337K78796H1693J74211r9391M1641J99382L9149j99174K230o4438
13450A75303d3959C1278L45321j78191L67648C8532P1003J06054M3656c2522B9485
13438i4559A74587P3574e8053A91158j4533L497j3220J69582b9831A80431H2628
13426B79905K42024j18537A29671L39752j44822d4506B94441Q735j41988i3012
13415G0709K6792h4359B32634e9610D13525j69073K7307f5210F2455M14792n2350
13404D24897B1636R8479j9665A2801J27827R17J89815J68567B37352o5999a37810
13392B07472q2517J14550J52910A70734f2298I0182J46496P9809j3302j21876
13382A81309G3934J78689d7829F0540K12493d1429F4395k6473K65831E6399e3327
$$ plain form
13370 47902 -58142 7494 182856 649819 213790 -123721 296412 -5426 304098 130641 423951
13359 423951 324840 371794 -149749 51789 93133 597124 -108196 63528 265219 -71423 312214
13347 235054 68046 81334 545249 463953 144239 321491 273235 390793 296587 258920 -4809
13335 -2735 94647 640183 40152 -54202 404318 51783 276298 290240 407171 444601 118015
13323 -58311 253883 279655 279590 598279 105175 344985 197946 279804 -25290 127493 90547
13312 90547 340230 119976 175218 -557 131286 244212 78156 238642 -12087 165730 405503
13301 405503 -47618 -26349 -77245 -49357 -25469 -45334 -240001 -232063 82100 -21557 -60056
13290 -60056 -159904 -279721 179517 195819 163668 164747 90203 149038 183384 252051 -42328
$$ packed form
13370D7902e8142G494J75362M66963B13790a23721B96412e426C04098A30641K93310
13359D23951r9111M6954a49749E1789M1344N03991a08196F3528K01691g1423C12214
13347B35054F8046J3288M63915q1296A44239J77252m8256J17558r4206l7667d809
13335b735I4647N45536D0152e4202D04318E1783K24515J3942J16931L7430A18015
13323e8311B53883K5772o5L18689A05175K39810j47039Q1858b5290A27493l6946
13312I0547K49683A19976N5242e57A31286J12926G8156J60486a2087A65730K39773
13301D05503d7618K1269n0896K7888K3888j9865j94667P938H2100b1557l8499
13290f0056r9848j19817A79517J6302l2151J079p4544N8835L4346O8667d2328
$$ plain form
13278 251690 -158878 447023 -142710 182582 -78600 161798 -99109 172267 177604 165167
13268 165167 -25842 265071 -126393 276878 -194909 242206 -97030 -335718 394256 -253082
13257 -174928 243205 53044 260017 243755 91891 229111 176724 62272 -119870 -168393 136208
13245 -73746 369219 -26018 307180 -116095 327870 295620 -52677 57616 154459 107249 144264
13234 144264 80821 185594 215654 247015 250950 46937 238015 213975 240309 157768 326014
13223 326014 98563 154079 396604 135336 235365 181081 -127065 235995 160864 130675
13213 130675 315420 109044 -28210 325484 -35927 -19795 97525 196095 183973 255743 191405
13202 191405 -48063 157636 378661 263240 -3241 98061 -257634 115504 -147614 106753
$$ packed form
13278B51690a58878D47023a42710A82582g8600A61798i9109A72267N337j2437
13268A65167b5842B65071a26393B76878a94909B42206i7030k38688C94256b53082
13257a74928B43205E3044K06973j6262I1891J37220n2387F2272a19870m8523A36208
13245g3746C69219b6018C07180a16095C27870l2250e2677E7616R6843m7210L7015
13234A44264o3443J04773L0060L1361L935D6937J91078k4040K6334q2541J68246
13223C26014I8563N5516K42525A35336J00029n4284a27065B35995p5131l0189
13213A30675J84745A09044b8210C25484c5927J6132I7525R8570j2122P1770o4338
13202A91405d8063A57636K21025j15421c241I8061b57634A15504a47614A06753
$$ plain form
13191 118794 -242038 95966 226443 266060 -52613 -69620 69627 53626 29910 37398 193463
13180 193463 -322421 -206774 -234107 -120005 132791 108210 305688 -275244 -25114 267590
13169 -92488 81670 -113675 -109107 124167 10755 316436 224220 248830 -358765 57786 -28210
13157 26908 356455 137762 -256338 90715 309631 -120033 -171798 -19990 -82979 -249433
13147 -249433 134615 -10344 -391394 -389307 201849 42885 151651 157729 -175518 164956 3471
13135 -45931 203977 227618 137431 -18677 87437 55507 -161181 104029 66565 24698 2295
13123 -38154 102123 271129 114299 -173010 -63678 -41062 85583 232414 157656 183753 163403
13112 163403 13037 317050 27411 92914 77300 244609 59189 217294 398456 156792
$$ packed form
13191A18794b42038I5966J30477L9617e2613j7007F9627j6001k3716P488J56065
13180A93463c22421J15647k7333J14102A32791k4581J97478b75244b5114B67590
13169i2488H1670a13675M568A24167A0755L05681r2216K4610c58765E7786b8210
13157B6908L29547A37762b56338I0715K18916a20033n1765a9990o2989j66454
13147b49433A34615a0344l81050K087B01849D2885J08766O078a75518A64956C471
13135d5931B03977K3641r0187a8677H7437l1930a61181A04029l7464B4698B295
13123c8154A02123J69006A14299a73010f3678K2616H5583J46831p4758K6097k0350
13112A63403A3037L04013B7411O5503j5614J67309E9189J58105J81162A56792
$$ plain form
13101 93040 -88087 -69961 40699 -36767 151897 -164099 -65795 -52674 182025 158768 124824
13090 124824 -104617 89046 4662 208251 211190 -128864 196068 143015 -86874 -93716 -157024
13079 -157024 -188918 203199 47339 -120839 90125 -45195 -142976 -62919 208202 36103 -212366
13067 394331 33101 142211 135641 55408 182264 66290 -68525 222693 -121792 205311 154180
13056 154180 -226221 161284 353236 55162 -30437 -121550 144090 -52629 252355 157520
13046 157520 -22842 252533 76941 159557 -113334 138452 54285 107836 -10987 129969 -49149
13034 98156 -84861 113652 140366 -30636 -74546 76218 125440 72363 -70076 326208 310471
13023 310471 118557 376712 337095 510486 42503 145807 276052 23702 56294 264119
$$ packed form
13101I3040h8087J8126D0699c6767A51897a64099f5795J3121A82025k3257l3944
13090A24824a04617H9046D662K03589K939a28864A96068n3053h6874o842o3308
13079a57024l1894B03199D7339a20839I0125d5195r7781f2919B08202C6103b12366
13067C94331C3101J09110o570E5408J26856F6290f8525B22693a21792B05311n1131
13056A54180b26221A61284J91952E5162c0437r1113A44090e2629B52355r4835
13046A57520b2842B52533G6941Q2616a13334A38452E4285N3551a0987A29969d9149
13034I8156h4861A13652K6714c0636m3910G6218M9222n3077g0076C26208j5737
13023C10471A18557K58155l9617J73391D2503J03304J30245B3702L2592K07825
$$ plain form
13013 264119 -56033 155693 98585 122516 -31101 -134131 199235 137735 58528 145288 110096
13002 110096 172660 176756 -31115 187872 75473 50364 187104 83177 320780 139370 -2257
12990 -276755 54227 207094 40871 -199813 -359288 21237 95492 -1599 82037 396363 137967
12978 -38775 319572 29875 108899 -107191 319881 -176394 201288 181796 -79339 -291411
12968 -291411 98074 -222815 196509 83260 114923 29115 -64720 170001 -11601 266570 25244
12956 -70162 -133559 38482 211086 -258727 -150828 228115 -32352 -76595 81400 180444 94061
12945 94061 -79812 -242532 -90566 203143 -119551 -213914 -249217 -116540 57155 -263814 69242
12933 126575 -119696 26188 143858 -171402 -85742 35508 451006 -182948 173799 -7848
$$ packed form
13013B64119e6033A55693n7108K3931c1101j03030A99235o1500E8528Q6760l5192
13002A10096O2564M096c1115A87872G5473k5109J36740H3177K37603A39370b257
12990b76755E4227J52867D0871a99813j59475B1237P4255a599H2037L14326A37967
12978c8775C19572B9875P9024a07191C19881a76394B01288j9492g9339k12072
12968b91411I8074b22815A96509H3260L1663B9115f4720A70001a1601B66570B5244
12956g0162o3397C8482J72604b58727J07899B28115c2352m4243H1400R9044q6383
12945I4061g9812j62720i0566B03143a19551r4363l5303a16540E7155b63814F9242
12933A26575a19696B6188J17670a71402Q5660C5508M15498a82948A73799g848
$$ plain form
12922 324868 -67327 80220 335052 81440 -94844 7071 227297 149070 -174404 -145693 266194
12910 -113857 -28191 -247785 270684 92497 -7866 -138044 72447 -279479 -272699 146344 240328
12899 240328 93905 301869 -70582 234647 -2097 252027 131463 -46776 -42869 -131788 132769
12887 121162 -88860 -328264 -96206 93485 108046 311632 -39961 -174935 315045 380567 -236397
12875 54331 179439 130747 12854 225282 307470 -141270 -7328 -230020 -390200 -82356 87568
12863 181514 -87314 -20910 224086 261703 -7671 -101864 -221467 239332 26616 19436 -181868
12851 171272 28529 -85626 -96031 -17576 126450 72256 -284017 125273 136310 -297211 294079
12839 314731 36348 149194 -20492 189038 -61885 306256 -60525 41093 -65999 -180499 19705
$$ packed form
12922C24868f7327H0220K54832H1440i4844G071K20226p8227a74404K8711B66194
12910a13857b8191k19594B70684I2497g866j30178G2447b79479O780A46344R3984
12899B40328I3905K07964g0582B34647b097B52027j20564d6776L907q8919A32769
12887A21162h8860k39404i6206I3485J4561K03586c9961j34974C15045O5522b36397
12875E4331J25108m8692A2854K12428Q2188a41270g328k22692j60180h2356H7568
12863A81514h7314b0910B24086L7617g671r4193j19603B39332B6616p180a81868
12851A71272B8529h5626j0405a7576A26450n4194b84017A25273J1037b97211B94079
12839C14731C6348J12846b0492A89038f1885C06256f0525D1093f5999j14500A9705
$$ plain form
12827 -229209 95439 107915 365742 17559 443479 34112 -57988 -67217 292604 -91413 82018
12815 30229 -9721 -264712 172700 120292 210602 -52761 -119808 -95006 56379 -89051 -278964
12804 -278964 -200441 -36664 -71781 137858 115546 86473 -20377 -37212 229691 77034 -65937
12792 -35410 70798 385536 72172 -236911 200299 210621 -493684 -112187 128126 226031
12782 226031 40896 -231024 -157254 128768 -184287 -42495 15296 222974 190841 362 49551
12771 49551 43797 -165532 -87455 -350647 -172102 -93956 6194 -314133 -266177 316451 355125
12760 355125 159215 -24373 171098 -21188 52040 -140881 218718 -207911 -85897 216018
12749 170212 41102 87313 -59803 120272 276759 -25970 457952 134206 260544 132394
$$ packed form
12827b29209I5439J2476K57827A7559M25920C4112e7988r229B92604i1413H2018
12815C0229i721k54991A72700n2408R0310e2761o7047K4802E6379h9051j89913
12804b78964P8523c6664l5117A37858k2312k9073b0377j6835B29691G7034f5937
12792c5410G0798L14738G2172b36911B00299J0322d93684a12187A28126R7905
12782B26031D0896b31024P3770A28768a84287d2495A5296K07678l2133C62M9189
12771D9551n754a65532P8077k63192a72102P8146F194c14133M7956C16451L8674
12760C55125A59215b4373A71098b1188E2040a40881B18718b07911h5897B16018
12749A70212D1102M6211e9803A20272J56487b5970D57952A34206J26338j28150
$$ plain form
12739 132394 139750 259999 113221 208032 438701 150520 132102 140411 191967 41921 288011
12728 288011 105616 -244712 158959 -502576 -151776 -17287 389417 -176660 -306617 -54904
12717 43633 79339 54486 327953 393015 -197174 368363 161795 367116 189692 356269
12707 356269 237506 -126127 126892 389329 248405 111055 93758 -78150 -139843 153209
12696 36107 173321 -18039 -143881 63782 -131764 90282 -291635 375407 -78551 28982 -67469
12684 -112484 70782 -145896 149707 156495 26457 -81744 87627 185824 56477 315702 215083
12673 215083 291493 185452 -8273 68400 134351 18465 -178288 -15301 38332 -5020 25377
12661 -144577 290591 46045 28688 204921 178267 103498 -74013 68445 -81221 124165 -317719
$$ packed form
12739A32394P356J20249A13221R4811K30669A50520j8418Q309N1556D1921K46090
12728B88011A05616b44712A58959e02576a51776a7287C89417a76660j29957e4904
12717D3633L5706k4853K73467O5062a97174C68363A61795K05321j77424J66577
12707C56269j18763a26127A26892K62437j40924A11055j7297g8150o1693A53209
12696C6107J37214a8039j25842F3782a31764I0282b91635C75407g8551B8982f7469
12684a12484G0782a45896A49707O788B6457h1744H7627R8197E6477K59225j00619
12673B15083P6410j06041h273F8400O5951A8465a78288a5301C8332e020B5377
12661a44577B90591D6045j7357J76233k6654p4769g4013F8445h1221A24165c17719
$$ plain form
12649 52780 168461 230046 71613 13388 59370 195799 -22978 85599 41887 70924 179684
12638 179684 -96426 -245917 144196 149356 251561 589013 -10137 262776 176958 130043 209919
12627 209919 379698 -85837 594804 384364 -244344 64236 4360 -10191 123398 260820
12617 260820 327722 166755 193431 -89819 -54678 175671 264328 151664 -98574 -124087 -400519
12606 -400519 -27514 -10378 40968 195851 189775 -166045 165658 164101 -55509 10571 403770
12595 403770 187304 333238 -105921 210666 -151468 11398 -111892 -30098 -30949 55374 -155384
12583 47178 133224 124252 -59906 113472 -98502 -7322 -75 -32713 22735 78625 -174336 -234670
12571 -234670 -141167 9527 106178 329386 -90885 -102201 -334377 140265 -9308 -441684 194723
$$ packed form
12649E2780J15681O1585G1613A3388M5982J36429b2978H5599D1887K9037J08760
12638A79684i6426j49491A44196N160J02205L37452a0137B62776q5818m6915P9876
12627B09919J69779h5837E94804k10440b44344F4236D360a0191A23398J37422
12617B60820O6902j60967K6676h9819L5141A75671Q8657j12664i8574k5513k76432
12606d00519b7514a0378D0968J54883o076a66045A65658j557e5509A0571L93199
12595D03770A87304J45934a05921B10666a51468A1398a11892c0098q51E5374a55384
12583D7178Q6046q972e9906A13472i8502g322g5l2638B2735N5890a74336o0334
12571b34670R3503I527R6651K23208i0885j1316k32176A40265i308m32376A94723
$$ plain form
12559 115485 -19977 -222350 48863 -176503 110239 17222 286810 115448 -5421 -33164 -70235
12548 -70235 -156940 141637 -60127 -87680 341693 97303 -284338 121036 -101662 175880
12537 100160 84083 -8159 103702 -15896 -141777 189808 -252776 120275 -53575 139042
12526 110864 -198425 -437814 110740 5351 237722 -86284 -136623 137057 -57324 -135874 -212005
12515 -212005 -1558 -65244 372948 -151440 -229449 114295 -15595 394670 291906 416654
12505 416654 57233 263283 249291 -158312 -65743 -83438 309343 -108284 184362 -361478
12494 174595 154055 78710 100464 -129025 13543 -112759 69270 99508 264638 -182598 -58742
12482 305408 190364 -66463 172910 71101 189987 28683 542997 -63579 -213409 335090
$$ packed form
12559A15485a9977k02373D8863a76503A10239A7222K69588A15448e421k7743l7071
12548g0235q6705A41637f0127k7553C41693I7303b84338A21036a01662A75880
12537A00160j6077h159A03702a5896j25881A89808b52776A20275e3575A39042
12526A10864a98425k39389A10740E351K32371h6284n0339A37057e7324p8550p6131
12515b12005a558o3686C72948a51440p8009A14295a5595C94670j02764J24748
12505D16654E7233K06050j3992a58312f5743j7695C09343a08284A84362c61478
12494A74595k0540p5345K1754a29025A3543a12759F9270L0238J65130a82598e8742
12482C05408j15044f6463A72910G1101J18886B8683N14314f3579j49830C35090
$$ plain form
12471 46990 -250951 -165921 94473 -18322 -108279 -140155 82541 112644 37340 85165 -79230
12459 -221057 58772 66068 -56354 81887 -47960 -105752 -86820 135665 -175689 71307 -337959
12447 163977 164877 54716 314239 -2242 185449 -213217 -282930 -73963 -100351 -31868 34981
12435 42674 244766 228533 -325410 66649 -48784 -79523 22638 -177908 -187224 -151120 -343177
12424 -343177 49047 282487 52252 -56766 137105 -164551 -79771 52647 -110179 -257834
12414 -257834 51668 -115022 -252968 154092 16386 276576 83326 -16781 -145693 -147399 -38247
12402 -25716 66345 63805 87929 40837 153096 391081 -19759 139919 -84153 -104778 49970
12390 255599 -33266 85659 -226384 189496 -485861 -63597 82934 -56659 149072 -230712
$$ packed form
12471D6990b50951Q5030I4473a8322q9957l1876H2541L0103C7340M7825g9230
12459b21057E8772P296e6354H1887d7960n7792J8932A35665a75689G1307c37959
12447A63977R00E4716K59523b242A85449b13217o9713g3963k6388c1868C4981
12435D2674K02092j6233c25410F6649d8784l0739B2638a77908r316L6104j92057
12424c43177D9047K33440E2252e6766A37105a64551g9771E2647a10179j47655
12414b57834E1668a15022j37946A54092A6386K60190H3326a6781j28912j706c8247
12402b5716F6345k540K4124D0837J12259K37985a9759A39919h4153k0625D9970
12390B55599c3266H5659b26384A89496d85861f3597H2934e6659A49072b30712
$$ plain form
12379 -224147 -10797 92737 -48054 106313 321839 27280 -58402 76581 234540 16949 274925
12368 274925 284322 26263 -281789 38103 127478 267649 414867 111359 -189666 -48045 -151729
12357 -151729 -131891 212006 -242502 -159481 173691 131846 -79414 148218 -252032 -114647
12346 16130 -134795 -160662 -219749 -69655 204204 -123032 -177437 -296248 -184548 -11013 92143
12334 -94634 236525 -221656 4994 -87928 248791 -26096 94711 246048 107961 12498 -114941
12322 -185512 502430 27873 20795 -118003 1877 -53893 231901 -148726 241235 200051 123522
12311 123522 -99751 151216 89044 291804 -3430 -248464 37539 122325 -147581 -216861 -20011
12299 -57435 303589 271458 285253 -157819 184588 -285419 -194427 19612 -166566 30614 43069
$$ packed form
12379b24147a0797I2737d8054A06313K15526B7280e8402G6581J57959A6949K57976
12368B74925R397B6263b81789C8103Q9375J40171J47218A11359a89666d8045j03684
12357a51729J9838B12006b42502Q3021A73691m1845g9414A48218b52032a14647
12346A6130a34795k5867n9087f9655B04204a23032n4405j18811J11700a1013I2143
12334i4634B36525b21656D994h7928B48791b6096I4711J51337A07961A2498a14941
12322a85512E02430B7873p078a18003A877e3893B31901a48726B41235m1184p6529
12311A23522i9751A51216o2172K02760c430k45034C7539Q4786a47581o9280b0011
12299e7435C03589l2131J3795a57819A84588b85419R0992A9612a66566C0614J2455
$$ plain form
12288 43069 -161859 198412 -125908 -63359 356748 -157457 170193 -227123 65374 110155
12278 110155 -82065 9942 117221 166868 188985 290959 233034 52846 44317 -191392 3587
12266 11662 114306 -71346 -207142 166748 477841 205155 77748 54361 46436 306307 -93559
12254 -666994 153357 193690 38153 162128 125600 -152049 103726 147674 2170 165716 392093
12243 392093 345572 206662 6148 210875 198124 202845 -160963 117542 47427 -166012 -243031
12232 -243031 164792 -199102 191886 166786 242069 344737 4952 275508 144004 156601
12222 156601 557043 228530 89921 -66884 455856 136912 184905 625302 158329 240386
12212 240386 230853 303936 69104 282820 -71351 18154 47612 15454 259537 228324 -202369
$$ packed form
12288D3069a61859A98412a25908O2549C56748a57457A70193b27123F5374M4781
12278A10155h2065I942J07279M9647K2117J01974n7925E2846q529a91392C587
12266A1662J02644g1346j35796A66748L11093B05155G7748k3387p925K59871i3559
12254f66994A53357M0333C8153J23975l6528a52049A03726M3948B170J63546K26377
12243C92093m6521j38910F148K04727j2751M721a60963A17542D7427a66012p7019
12232b43031A64792a99102A91886k5100P5283J02668D952K70556j31504J2597
12222A56601M00442B28530H9921f6884D55856A36912M7993M40397A58329Q2057
12212B40386r533P3083F9104K13716g1351A8154K9458A5454K44083l1213b02369
$$ plain form
12200 265417 259447 290218 249318 228298 122009 312348 49378 161992 462387 253339 71279
12188 9674 259340 384550 51243 219516 111870 -180955 385035 -10001 451020 -28216
12177 76010 254724 -163635 25906 84325 422542 -35050 164748 80527 -49980 87075 -180396
12165 408969 339436 69481 249225 456487 -59972 8354 -42472 -58161 125900 -143828 91376
12153 192018 500192 54771 -10260 42939 -416340 192490 284991 246460 185825 24135 99204
12142 99204 43598 -71172 -17610 62398 116650 -131951 -102263 326499 93091 -148734 248488
12130 -412140 59991 277745 22850 16856 434496 155695 12606 -17518 271894 177765 -24179
12118 254874 235477 9724 -127481 -80962 14538 -216008 36014 157934 -50943 -1766 59456
$$ packed form
12200B65417n970L0771m0900k1020j06289J90339D9378J12614L00395k09048G1279
12188I674K49666J25210E1243J68273j07646a80955C85035a0001D51020b8216
12177G6010J78714a63635B5906N8419L38217c5050A64748H0527d9980H7075a80396
12165D08969o9533F9481J79744K07262e9972H354d2472j5689A25900a43828I1376
12153A92018L08174E4771a0260D2939d16340A92490R2501l8531o0635B4135P5069
12142I9204D3598g1172a7610F2398N4252a31951K9688C26499I3091a48734B48488
12130d12140E9991K17754B2850n994M17640A55695A2606a7518B71894r4129b4179
12118B54874j9397I724a27481M6519A4538b16008C6014J21920e0943a766E9456
$$ plain form
12106 49331 242011 336412 97558 82949 338858 294222 -58224 255061 -93658 169744 -128723
12094 -50197 304160 51600 -57293 -193416 25075 45348 121680 -266223 -250566 234275 -180160
12082 28634 110535 186082 -42673 150850 -394875 -69219 -149773 75602 86964 174615 -75373
12070 -125666 -26794 41206 -204779 180367 31729 -43284 293818 -28582 267952 -239133
12059 178023 -343462 -150921 -84843 -335178 149832 89042 308012 247502 658823 651395
12049 651395 674112 1042650 850762 357022 -135641 148052 -44711 285290 157976 -335678
12038 275202 -271025 264852 -111914 -249053 -479 -167242 -387851 14989 -91572 -361389
12028 -361389 -114015 142694 -230217 -439398 168210 146288 -33289 -107465 21715 -83104
$$ packed form
12106D9331J92680R4401I7558j4609K55909m4636e8224B55061i3658A69744a28723
12094e0197C04160E1600e7293j36123B5075K0273P6332b66223J5657B34275a80160
12082B8634Q1901P5547d2673A50850c94875f9219q0554G5602J1362Q7651g5373
12070a25666b6794D1206b04779A80367C1729d3284B93818b8582B67952b39133
12059A78023c43462a50921O6078k50335A49832o0790K18970o0510M11321p428
12049F51395K2717L68538j91888C57022a35641A48052d4711B85290j27314c35678
12038B75202b71025B64852a11914j37139d79j66763k20609A4989i1572k69817
12028c61389a14015A42694b30217k09181A68210k1922c3289p4176B1715h3104
$$ plain form
12017 256343 40200 -84494 202333 203653 -115369 96784 7200 220051 258279 -146113 -182699
12006 -182699 6482 46488 3129 -391591 21322 278783 -45919 28517 -111678 54150 -14208
11994 142953 -163138 211001 -91801 2105 -253488 -155055 -149274 -24578 -19364 233800 -214834
11982 -4526 91215 -19013 139139 -200679 -175424 32752 362836 90767 -246728 -143994 29037
11970 -160954 58847 -66746 470875 -250872 -106337 71173 -45539 -129770 190581 134339 23265
11958 146044 90472 167092 98644 -13500 83874 271226 -173693 -88817 -115461 329017 -375384
11946 34153 -13442 55371 175231 261593 124159 194966 -72749 151720 -185871 -62395 -31589
11935 -31589 -79844 -213819 38651 -118034 -299329 -163374 -88463 70189 248751 390629
$$ packed form
12017B56343D0200h4494B02333J320a15369I6784G200K12851L8228a46113l6586
12006a82699F482M0006C129c91591B1322K57461d5919B8517a11678E4150a4208
11994A42953a63138B11001i1801B105b53488R8433N781b4578N214B33800b14834
11982d526I1215a9013A39139b00679K5255C2752L30084I0767b46728J02734B9037
11970a60954E8847f6746D70875b50872a06337G1173d5539q4231A90581n6242B3265
11958A46044n5572P6620o8448a3500H3874J87352a73693Q4876k6644C29017c75384
11946C4153a3442E5371J19860Q6362A24159P0807g2749A51720a85871f2395L0806
11935c1589m8255j33975C8651a18034j81295J35955P4911G0189J78562J41878
$$ plain form
11925 390629 15076 -376795 73166 -146876 9872 168631 50367 -90750 -76642 113309 223194
11914 223194 -19144 -117995 -41233 -88646 33525 -248562 178470 120552 112685 -131957 429781
11902 251882 97708 -309257 -51449 -307190 -6284 -33801 -24670 102510 40851 234534 85909
11890 -85894 102103 -2540 134897 -119997 -342907 106224 7417 52419 -113058 -40733 23180
11878 -177801 53023 273332 -20160 102094 -15932 -70786 -198484 274642 -263347 -113109
11867 34977 231058 -162102 -115493 -181109 -185621 -71625 29921 418392 86650 9441 72017
11856 72017 84585 54309 227788 128889 67239 71252 -125546 -85644 -90336 67423 17331 14777
11844 14777 87794 -40825 -12100 -71764 62307 53107 -83101 -138104 -78106 -36284 -200552 -13685
$$ packed form
11925C90629A5076c76795G3166a46876I872J58759E0367i0750J4108A13309J09885
11914B23194a9144r8851d1233m7413C3525b48562A78470n7918p867a31957D29781
11902B51882I7708c09257e1449k55741f284k7517R131A02510D0851J93683H5909
11890h5894A02103b540A34897a19997k22910A06224G417M5002a13058d0733B3180
11878a77801E3023K20309b0160A02094a5932n4854j27698B74642b63347a13109
11867C4977J96081a62102M6609o5616m512g1625B9921L88471H6650I441O2576
11856G2017J2568l0276J73479r8899o1650M013a25546L9902m692F7423A7331k554
11844A4777P3017d0825a2100n9664F2307r200h3101n5003N9998c6284j64268a3685
$$ plain form
11831 -98605 -92152 -325911 -432493 21553 209757 -188004 -198825 154933 344890 -96497 225272
11819 84030 47361 -350519 -351361 211062 94714 -103069 -29454 -34586 -167131 160918 78035
11807 -126179 -271915 -39265 108384 244212 -114231 74413 5218 7602 123187 121951 259200
11796 259200 61557 215083 78682 -199860 -151440 -418005 169602 8131 311887 140288
11785 -117419 -285945 71306 -19312 -56165 20950 -169820 14232 153396 -133030 -89107 261156
11773 -69860 -92482 -31062 7198 15435 -172618 -31275 -135225 236098 -128381 -281072 217474
11761 -39923 10852 19836 -536 -99620 -76124 184257 -92650 -112573 -16510 185096 140327 -199725
11748 -148401 38117 100727 82038 -303027 -125456 28940 -81110 -35577 245294 -159543 317309
$$ packed form
11831i8605O453k33759j06582B1553J88204a88004j0821A54933J89957i6497B25272
11819H4030l6669c50519q42B11062I4714a03069b9454n132j32545A60918G8035
11807a26179j45736c9265A08384J35828a14231G4413E218K384J15585j236J37249
11796B59200F1557J53526G8682a99860M8420k66565A69602H131L03756A40288
11785a17419j68526G1306a9312l6853B0950a69820A4232J39164a33030M3923B61156
11773f9860k2622c1062G198Q237a72618c1275j03950B36098a28381j52691B17474
11761c9923A0852Q984e36r9084K3496A84257i2650j9923a6510A85096m4769a99725
11748a48401C8117O2610j8689c03027a25456B8940h1110c5577B45294a59543C17309
$$ plain form
11736 -128733 -260742 74899 125147 60837 273111 -190023 -165599 69054 116061 -51264 -172804
11725 -172804 -15907 40419 -357994 -219738 125026 -267084 379583 -289330 -15510 -160654
11715 -160654 -50906 -184685 159866 -144831 -68387 -67738 -31219 -200108 94074 134935 -101048
11703 11060 -95609 58926 113362 169457 134398 258005 81772 205174 90796 8843 116962
11692 116962 75880 115998 -33189 31792 138299 -157050 17352 294272 -33513 57893 306264
11681 306264 -243357 31857 118606 105376 201049 -145520 -71517 95904 260734 92879 -105639
11669 -74383 41818 -151837 -80705 292225 86656 -139637 -67321 -22493 -67787 96663 53662
11658 53662 144555 1319 -64843 -162765 -108919 111251 -91513 132710 165366 -133832 7786
$$ packed form
11736a28733j32009G4899N0248F0837K12274a90023K4424F9054M7007e1264j21540
11725a72804a5907D0419c57994J38256A25026b67084C79583b89330a5510j45144
11715a60654e0906j33779A59866a44831f8387O49c1219j68889I4074M0861a01048
11703A1060i5609E8926N4436N6095l5059J23607H1772J23402I0796H843J08119
11692A16962m1082M0118c3189C1792J06507a57050A7352K76920c3513E7893K48371
11681C06264b43357C1857Q6749j3230R5673a45520g1517I5904J64830I2879a05639
11669g4383D1818a51837P1132B92225H6656a39637f7321b2493m5294I6663m3001
11658E3662R0893A319f4843r7922N3846A11251i1513A32710L2656a33832G786
$$ plain form
11646 31185 -188111 -209457 -176242 -144517 84499 158533 8447 114519 153921 70241 -60369
11634 -37920 172032 217283 40016 -283791 -5308 298216 343245 25101 -94631 301309 -13128
11622 13611 142935 165785 54483 -289745 106498 72321 301951 1845 -20167 -53528 132118
11610 318762 24289 35799 -176870 66829 98841 41847 6555 -143231 159133 -44315 -122861
11599 -122861 86951 136811 -14409 77739 233597 157489 264882 -66760 -68561 364067 112733
11587 39843 -78389 95496 152458 97880 181594 205242 40753 96918 179945 66217 72118 21032
11574 91878 -212515 90146 -4470 -213014 -14870 377252 133369 -57474 262536 287587 114593
11562 303719 -104478 378662 -24586 195796 317751 467886 -137175 82629 162569 99643
$$ packed form
11646C1185a88111k1346L3215L1725H4499P4034H447J06072L9402G0241f0369
11634c7920A72032M5251D0016b83791e308B98216M5029B5101i4631C01309a3128
11622A3611J29324K2850E4483b89745A06498l4177K29630A845b0167l3361A32118
11610C18762B4289J1510a76870F6829L2012D1847F555a43231A59133d4315p8546
11599a22861H6951M9860a4409G7739J55858p6108J07393f6760j801C64067A12733
11587C9843g8389I5496N6962n4578Q3714K3648D0753N6165Q3027F6217N901B1032
11574I1878b12515I0146d470k08544a4870C77252A33369e7474B62536K5051A14593
11562C03719a04478C78662b4586A95796J21955J50135a37175H2629P9940o2926
$$ plain form
11552 99643 -16450 88600 198491 -109213 -100736 187185 260721 326632 -68954 122891 45511
11540 344794 345718 278549 118743 153173 -62676 295521 -35801 -193693 -53661 -139713 242034
11528 -54210 92986 426978 268859 104245 6923 555878 105290 -46497 122020 -260727
11517 -103272 262050 31089 83476 416271 188720 243461 270815 -37210 8526 20831 203918
11506 203918 110988 171080 -163386 -21152 -65235 -57745 256210 288522 -88611 285902 -21419
11494 210909 280707 41902 555711 303007 66051 107621 24109 25174 303293 175936 429806
11483 429806 7004 18944 -111052 138097 288122 151288 461934 49909 89397 -113825
11472 117864 32447 35632 254310 216452 88659 109034 394321 159871 318550 328236 275356
$$ packed form
11552I9643a6450H8600J09891a09213Q477A87185P3536O5911f8954A22891D5511
11540C44794R24o7169A18743L4430f2676B95521c5801j57892e3661q6052B42034
11528e4210I2986L33992j58119A04245F923N48955A05290d6497A22020b60727
11517a03272B62050C1089N2387L32795A88720N4741K7354c7210H526J2305J83087
11506B03918r2930O0092a63386b1152m4083P490B56210L2312h8611B85902b1419
11494B10909O9798D1902N13809k52704F6051M1570B4109J065K78119j27357K53870
11483D29806G004J1940a11052A38097J50025j36834L10646D9909L9488a13825
11472A17864C2447L185K18678l7858H8659K0375K85287A59871J58679R686n2880
$$ plain form
11461 275356 208508 5247 -16472 454535 260719 24203 345788 478235 299963 62207 279965
11450 279965 206914 191408 220431 293869 354281 213642 157565 -204113 194537 222346 377973
11439 377973 358615 52750 69760 67851 95159 205662 144731 179965 -141932 674 570689
11428 570689 18458 -533567 50929 210873 8127 253584 -180173 343661 25983 119694 -49941
11416 45650 -21422 -72735 -165406 135517 138914 -122388 77105 52381 -42685 264469 -49740
11404 33862 -197461 77762 332215 204791 113663 -32996 -123175 357760 222798 113038
11394 113038 258329 -29014 -389670 31115 86042 -84463 94382 -103578 -173910 101702 -142642
11382 93657 -60750 48227 -189350 177301 41521 94709 11946 202986 -33498 -156874 -25617
$$ packed form
11461B75356o6848E247a6472D54535j93816B4203L21585J32447j78272F2207K17758
11450B79965p3051j5506K9023P3438O0412j40639n6077b04113A94537K7809J55627
11439C77973j9358E2750J7010j909K7308J10503o0931L5234a41932F74N70015
11428E70689A8458e33567E0929J59944H127K45457a80173C43661B5983R3711d9941
11416D5650b1422n1313r2671A35517L397a22388G7105k4724d2685B64469d9740
11404C3862a97461G7762K54453j27424r1128c2996r0179C57760j34962j09760
11394A13038J45291b9014l60656C1115N4927h4463I4382a03578p0332A01702a42642
11382I3657f0750D8227a89350A77301D1521N3188A1946J91040c3498j23376b5617
$$ plain form
11370 -72123 -118147 -81191 -166289 -12568 -76849 60244 14027 150784 -227874 -109149 -248931
11359 -248931 -58551 -299045 2787 152513 -140654 -384487 -155498 29381 -349749 89244
11348 -121815 41902 -30512 -76811 -314879 3881 -36505 -130244 77072 -44531 -83472 -197646
11337 -197646 -209895 11460 60893 -246839 -150068 75590 174531 -145906 -186091 -35624 142711
11325 107971 -190054 274709 -24761 -60608 -184747 -225535 186789 92591 420323 -143760
11314 16028 30863 -48405 10580 -35569 -26324 -83569 -21082 268103 33115 284722 -233451
11302 -109917 -53213 56523 -125590 320033 -84476 129762 -236614 -252999 64333 -267730
11291 54540 51103 96988 -107804 -285489 -199495 251932 104584 104837 -86786 198014 106303
$$ packed form
11370g2123m6024L6956q5098a2568o4281F0244A4027J36757b27874a09149j39782
11359b48931e8551k40494B787J49726a40654k43833a55498B9381c49749H9244
11348a21815D1902c0512m6299k38068C881c6505r3739G7072d4531l8941j14174
11337a97646j2249A1460M9433b46839R6771G5590R8941a45906m0185c5624A42711
11325A07971a90054B74709b4761l5847j24139m0788A86789I2591L27732a43760
11314A6028J4835d8405A0580c5569R245n7245b1082B68103C3115K51607b33451
11302a09917e3213E6523a25590C20033h4476A29762b36614j6385F4333b67730
11291E4540l437M5885a07804j77685Q5994B51932A04584K53h6786A98014r1711
$$ plain form
11280 106303 -238335 -2285 -14170 -70135 15004 -2160 -326220 -246278 201458 25272 -1344
11268 250284 -17936 98074 315343 122170 226147 -287232 -113405 -239879 342038 -49230
11257 212676 -155995 -39773 -162712 25611 257720 204 -240492 90889 -119381 176728 -91226
11245 -139362 109938 49544 -113219 111336 89387 6248 262262 -245918 -76156 149508
11234 172003 373696 -50269 -131763 -174130 112087 29157 197807 112368 -52268 -50609 -36510
11223 -36510 145727 44376 -310595 -91137 -76192 89064 -39545 -295373 20845 -61908 -67849
11212 -67849 58480 37141 354048 145987 -133649 101092 -101682 -206425 -253428 109275
11201 54069 85532 204842 34303 87613 -393154 -174033 -93859 -299437 -28399 -321040 167256
$$ packed form
11280A06303b38335b285j1885n5965A5004b160l24060P9942B01458B5272a344
11268B50284a7936I8074K17269A22170J03977b87232a13405j26474C42038d9230
11257B12676a55995c9773j22939B5611K32109B04b40492I0889a19381A76728i1226
11245a39362A09938D9544a13219A11336k1949F248K56014b45918g6156A49508
11234A72003K01693e0269q1494m2367A12087B9157J68650q5439e2268J659J4099
11223c6510A45727D4376c10595i1137J4945H9064c9545k55828B0845f1908n941
11212f7849E8480k1339L16907A45987a33649A01092a01682j04743m7003A09275
11201E4069L1463J19310C4303N3310c93154a74033Q0174k05578b8399k92641A67256
$$ plain form
11189 72327 -100159 280159 -16275 -256578 -237999 235309 -151886 228570 238260 13885 155635
11178 155635 125929 -98434 -15956 47948 -152803 -604 20352 -94408 -37728 2103 -208241 -54603
11165 4477 -39492 36413 -52980 222370 -21619 -210619 -260217 34092 -5720 25044 -290987
11153 -40668 -113459 135982 141588 -38730 -143330 -133294 224845 205651 -81713 -100311 200849
11141 251395 96884 5111 -193914 159151 38346 -103604 164309 -150375 189048 40032
11130 -405475 52492 -34734 181115 144437 -115111 150535 -38652 273037 -83833 70953 75044
11119 75044 61896 147758 34219 -130476 301601 -138265 -307137 146520 111782 -51603 336467
11107 303795 -16423 -14043 173630 29083 248607 377860 213676 357182 227970 395495
$$ packed form
11189G2327a00159B80159a6275k40303J8579B35309a51886B28570R690A3885J41750
11178A55635k9706i8434a5956D7948a52803f04B0352i4408c7728B103b08241e4603
11165D477c9492C6413e2980B22370b1619j89000m9598C4092e720B5044b90987
11153d0668p2791A35982N606c8730j04600J0036B24845j9194h1713j8598B00849
11141B51395I6884E111a93914A59151C8346a03604A64309a50375A89048D0032
11130d05475E2492c4734A81115l6678a15111A50535c8652B73037h3833G0953M091
11119G5044j3148Q5862C4219a30476C01601a38265j68872A46520l4738e1603C36467
11107C03795a6423K380A73630B9083K19524J29253j64184J43506j29212J67525
$$ plain form
11097 395495 175410 344903 -106286 245484 -254705 256262 -49172 221050 123393 298253
11087 298253 38679 438433 424555 -112169 438326 268790 431410 436794 90411 489635
11077 489635 288796 340253 641361 91059 323819 483172 139154 401038 475991 210475
11066 288274 585221 473331 378534 393360 465741 533563 590184 758532 688759 650249 756350
11055 756350 930465 746275 828540 1121941 1012736 996905 692195 756220 693791 846395
11045 846395 618692 924854 758990 369206 803711 725932 960464 861126 1275335 1398537
11035 1398537 1381283 900783 783399 682236 703937 771178 844267 1243829 910595 820069
11025 820069 1065520 1096732 871341 640723 1084643 1005591 443821 919134 417993 855195
$$ packed form
11097C95495A75410J69493a06286B45484b54705B56262d9172B21050r7657J74860
11087B98253C8679L99754j3878a12169D38326j69536J62620N384I0411L99224
11077D89635k00839N1457L01108I1059K32760J59353A39154K61884P4953B10475
11066B88274K96947j11890r4797J4826P2381O7822N6621J68348o9773l8510J06101
11055G56350J74115j84190Q2265K93401j09205j5831l04710O4025o2429J52604
11045H46395k27703L06162j65864C69206M34505p7779K34532r9338M14209J23202
11035A398537j7254m80500j17384j01163K1701O7241P3089L99562l33234r0526
11025H20069K45451L1212k25391k30618M43920p9052D43821M75313D17993M37202
$$ plain form
11015 855195 905538 982686 661337 757718 680324 706991 1047982 817383 584859 550536 758252
11004 758252 1099863 966619 941236 739125 785488 939199 907618 832672 1090613 1031229
10994 1031229 857969 566954 795033 674853 680162 1046944 1177493 1073379 1179235 1066775
10984 1066775 762068 942184 1377922 1164217 1448322 1401379 1665298 1559417 2070682 1913271
10974 1913271 2690317 2649355 2888700 3305088 3501770 3694140 4026806 4061674 3778120 3531960
10964 3531960 3124832 2804842 2504377 2632669 2348413 2230080 1998085 2391205 2078687
10955 2078687 1642152 1907586 1765926 1203728 1326665 1110592 984512 1254927 963673
10946 963673 832402 472672 409538 449240 216799 125586 473303 399861 252093 5965 226974
$$ packed form
11015H55195N0343P7148l21349R6381p7394K6667L40991k30599k32524l4323K07716
11004G58252L41611j33244k5383k02111M6363J53711l1581p4946K57941n9384
10994A031229j73260k91015K28079j20180N309L66782J30549j04114J05856j12460
10984A066775l04707J80116M35738k13705K84105m6943K63919j05881N11265j57411
10974A913271P77046m0962K39345M16388J96682J92370L32666L4868k83554k46160
10964C531960m07128l19990l00465J28292k84256j18333k31995L93120l12518
10955B078687m36535K65434j41660n62198J22937k16073j26080K70415k91254
10946I63673j31271l59730o3134L9702B16799r1213L47717p3442j47768E965K21009
$$ plain form
10935 226974 139207 275294 199713 207841 187992 161533 69787 297942 -98036 326727 189351
10924 189351 -20108 171062 -63418 245872 -25287 82433 -94393 257546 -71708 -73108 -106226
10913 -106226 -82256 51363 -46841 127095 -302716 -158497 56535 73861 -164577 -233340 259455
10901 189410 -157175 14860 -40316 -151401 25527 333664 -63974 -103357 273670 93803 -38425
10889 -221673 8284 281912 -305734 96376 -195976 -78315 177553 -117482 -38698 189018
10878 73112 151536 -85852 -8278 53612 -215901 -247954 11773 -18032 -25771 60384 85297 -41099
10865 -48390 -110288 54088 -74960 79855 -88907 85107 17186 125494 273311 -154998 -13154
10853 -161363 33332 81359 79052 161873 239492 102743 -148651 -269256 -99806 -2523 -149168
$$ packed form
10935B26974q7767J36087p5581Q128j9849k6459F9787K28155i8036C26727j37376
10924A89351b0108A71062f3418B45872b5287H2433i4393B57546g1708j400l3118
10913a06226K3970E1363d6841A27095c02716J44219E6535J7326a64577o8763B59455
10901A89410a57175A4860d0316j11085B5527L08137f3974l9383B73670I3803c8425
10889b21673H284K73628c05734I6376a95976g8315A77553a17482c8698A89018
10878G3112P8424h5852h278E3612b15901l2053A1773a8032p739F0384K4913d1099
10865d8390o1898E4088g4960G9855h8907H5107A7186J08308J47817a54998a3154
10853a61363C3332M8027k307Q2821P7619A02743a48651j20605i9806b523j46645
$$ plain form
10842 -149168 -122029 365993 -69398 90953 187531 271063 92556 149340 -23897 91919 370620
10831 370620 27731 515 -4410 -80343 -15458 7554 249142 210555 93889 84377 -182741 -83918
10818 -199257 -174796 -565660 63571 -17342 -150816 -32011 -34325 152154 -248542 163752 17057
10806 -272921 32118 -10876 -134588 -49201 -134627 152137 -54672 -145672 32867 -98671 -265363
10795 -265363 -82259 -139173 -119502 -103697 -97845 118938 -205634 -373704 -75789 -286576 -29821
10783 -267937 -158607 208636 -158151 -276250 354634 215409 128774 -206746 -234587 -134708
10773 -134708 -216887 -13019 53039 246746 -219009 204414 -102737 -71729 168187 175035 -66948
10761 -201305 -15794 52763 -476234 23066 -91014 -155538 22092 89904 -85903 -523031 2952
$$ packed form
10842a49168K7139C65993f9398I0953R6578Q3532I2556N6784b3897I1919K78701
10831C70620B7731E15d410p5933a5458G554K41588l8587I3889r512a82741h3918
10818a99257K4461l90864F3571a7342j33474c2011k314A52154b48542A63752A7057
10806b72921C2118a0876j23712d9201q5426A52137e4672r1000C2867i8671j66692
10795b65363h2259n6914J9671J5805N852A18938b05634j68070g5789k10787b9821
10783b67937J09330B08636a58151j18099C54634j39225q6635b06746k7841R9879
10773a34708q2179a3019E3039J93707b19009B04414a02737L1008A68187O848f6948
10761b01305a5794E2763d76234B3066i1014o4524B2092O7812h5903m37128B952
$$ plain form
10749 149288 152857 -244847 180951 516118 -23928 163345 12447 56149 -95478 84694 -220313
10737 -10637 -95677 235733 85910 -241379 52674 70441 73639 -7511 -57154 -210445 -23911
10725 -92780 -11956 -27218 5231 -370993 99427 48860 -121427 134351 29365 96339 -167451
10713 -175375 114438 -183638 -273395 40948 -21444 313753 -81464 -39346 76205 -18804 -129124
10702 -129124 188023 194087 -241654 -39677 75854 -75680 -180625 221163 131462 -113606 -14587
10690 -214133 103551 -181171 -46715 -180626 -111976 122739 -110297 -253281 -197003 -65111
10679 -304582 -127249 -70605 -391442 -147319 -114591 264212 -280950 218238 -132810 -38955
10668 -233102 -215089 -203502 -172544 -18517 -136341 93865 -72740 -112374 186671 116773 -325016
$$ packed form
10749A49288L569b44847A80951L35167b3928A63345A2447M3702i5478H4694b20313
10737a0637q5040B35733H5910b41379E2674J7767L198g511m9643j53291b3911
10725i2780a1956j5262E231c70993I9427D8860a21427A34351B9365O6974a67451
10713a75375A14438a83638q9757D0948b1444C13753h1464c9346G6205a8804j10320
10702a29124A88023O064b41654c9677G5854g5680j04945B21163q9701a13606a4587
10690b14133A03551a81171d6715j33911O8650A22739a10297j42984N6278f5111
10679c04582a27249N6644l20837a47319L2728B64212b80950B18238a32810c8955
10668b33102J8013J1587L0958a8517j17824I3865g2740l9634A86671o9898c25016
$$ plain form
10656 -219860 -406102 -248223 -198858 109410 -60205 -116679 -65866 83602 -22099 -16879 -257074
10645 -257074 -397124 -142179 -182233 13126 -75514 -287065 -232934 -183367 62036 -176187 54911
10633 -352491 -26641 -370114 55491 -306706 -106098 201895 123610 -230783 -371950 215554
10622 -23400 -117975 -466711 255370 22156 -224756 -276684 135985 94634 -248600 4169 -180952
10610 343254 191353 -71015 -30450 -38465 -42343 59408 89717 -31088 144464 86900 -56896
10598 165944 -149602 -276737 -189453 135689 116286 12228 -108861 -99348 -485984 -443433 -333596
10587 -333596 40425 -169534 -127591 -249280 -26815 38917 318790 206753 -252531 -106857
10576 168139 -333881 122665 -96163 201544 -6753 111815 -385989 -206892 67686 223874
$$ packed form
10656b19860j86242J57879M9365A09410f0205n6474N0813H3602b2099N220k40195
10645b57074j40050a42179m0054A3126g5514k11551N4131M9567F2036a76187E4911
10633c52491b6641l43473E5491c06706a06098B01895p8285b30783j41167B15554
10622b3400r4575l48736B55370B2156b24756n1928A35985m1351b48600D169a80952
10610C43254j51901g1015c0450q015l878E9408L0309c1088A44464n7564e6896
10598A65944a49602j27135Q7284A35689j9403A2228a08861R513l86636M2551J09837
10587c33596D0425a69534M1943j21689b6815C8917K79873j12037b52531a06857
10576A68139c33881A22665i6163B01544f753A11815c85989J79097F7686J56188
$$ plain form
10566 223874 -153832 -45852 -324441 -19046 -295263 67402 -74203 142496 142677 -126203 -195892
10555 -195892 -97547 87825 -395181 219928 149538 -6760 335626 125842 -200145 187050
10544 16250 110396 -116894 -48380 -187238 54688 363049 122936 -210709 -186987 -207092 399102
10532 -76145 -43617 -187000 -41489 201433 218753 -112664 -128868 59770 -46984 -81001 183694
10520 26480 -120194 -214723 10589 -207622 215226 -55673 -212665 140084 30166 -26147 -254239
10509 -254239 21235 -142421 19330 -75573 -62720 172352 -121852 -364864 178662 28891
10498 -334454 -12038 319486 -21541 71450 -136573 -74202 -111 -32667 204363 143518 -141084
10486 62245 275372 122211 -26500 328592 316538 216303 30127 106506 409945 -155801
$$ packed form
10566B23874a53832d5852k78589a9046k76217F7402g4203A42496J81a26203o9689
10555a95892i7547H7825c95181B19928p0390f760C35626A25842b00145A87050
10544A6250R4146a16894d8380j38858E4688L08361A22936b10709K3722k0105C99102
10532g6145L2528j43383d1489B01433J7320a12664j6204E9770d6984l4017A83694
10520B6480a20194r4529A0589b07622B15226e5673j56992A40084C0166b6147k28092
10509b54239B1235a42421A9330g5573J2853A72352a21852k43012A78662B8891
10498c34454a2038C19486b1541G1450a36573O2371a11l2556B04363o0845a41084
10486F2245K13127A22211b6500C28592j2054j00235C0127P6379L03439a55801
$$ plain form
10475 785950 181652 216083 411016 89065 260523 10368 -97727 443611 -24247 214935
10464 183366 -226254 -70338 126086 -122231 -33190 101265 48134 191328 -170344 -190483
10454 -190483 -115719 -266206 15576 313286 114297 -141831 303149 -59212 -255589 -29546
10443 -129277 -30452 45550 -38834 -99490 -57869 147718 -120512 -63665 34675 68867 106173
10432 106173 79277 53159 75889 30811 153861 24922 -94828 -161584 78740 191289 -72149
10420 -474987 113752 321038 -242712 -73693 211987 18509 50043 -21356 -290462 -87157
10409 -2378 -54648 -371885 -159256 -61420 -110639 299932 84764 -323902 46429 207913 151800
10398 151800 -39703 -236363 135865 -21392 -290119 113002 90565 280279 168351 412572
$$ packed form
10475G85950A81652L4431J94933H9065J71458A0368i7727D43611b4247B14935
10464A83366b26254g0338A26086a22231c3190A01265D8134J43194a70344k0139
10454a90483P4764j50487A5576K97710A14297a41831C03149e9212j96377b9546
10443a29277c0452D5550c8834o0656M1621A47718a20512N6847C4675L4192L7306
10432A06173k6896k6118K2730C0811J23050B4922i4828o6756G8740J12549g2149
10420d74987A13752K07286b42712g3693B11987A8509L1534b1356k69106h7157
10409b378n2270l17237a59256f1420m9219B99932H4764c23902D6429J61484n6113
10398A51800c9703j96660A35865b1392k68727A13002k2437J89714j11928K44221
$$ plain form
10388 412572 -52098 256020 -181799 140320 206883 61540 68636 216563 276711 279028 92111
10376 295637 212938 323756 144370 499556 293914 269518 486452 597004 675559 420782
10366 420782 102040 524410 492979 211220 446011 516279 343170 196002 101249 194278
10356 194278 165207 300375 550301 345894 514672 299821 388218 747956 768258 768565 546641
10345 546641 423025 332203 320393 231674 200637 384031 284205 -16494 552321 364536 419732
10334 419732 502782 316466 7975 -179208 355132 374239 170268 46208 29399 171949 -264094
10322 235442 -10382 399101 -47437 187794 105373 335398 223252 192292 199317 120503 176164
10311 176164 174380 102161 -167737 201329 84803 118407 23508 252441 -85939 31169 46344
$$ packed form
10388D12572e2098B56020a81799A40320O6563F1540P096J47927O0148K317I2111
10376B95637q2699J10818A44370L55186k05642k4396K16934J10552P8555k54777
10366D20782A02040M22370l1431B11220K34791P0268j73109j47168r4753R3029
10356A94278k9071J35168K49926k04407J68778k14851Q8397L59738K0302L07k21924
10345E46641j23616r0822j1810q8719l1037J83394r9826a6494E52321j87785N5196
10334D19732Q3050j86316G975a79208C55132J9107A70268D6208j6809J42550b64094
10322B35442a0382C99101d7437A87794q2421K30025j12146l0960P025p8814N5661
10311A76164j784p2219a67737B01329H4803L3604B3508K28933h5939C1169J5175
$$ plain form
10300 46344 -214790 49029 357837 142957 208504 -148250 -57156 422770 66732 74332 -52247
10288 395766 -92456 -49482 -45098 -169762 -139778 -32315 23292 -31671 -134775 -281462 -13314
10276 -183759 65616 3200 211315 81230 -82958 241859 -128195 -25739 190634 22859 99408
10265 99408 -54048 -120257 195671 -83487 -77320 48453 154720 101020 135985 494824 96770
10253 1329 292534 196224 -143690 84930 91877 -161309 117418 -241197 -225090 -60296 178348
10241 -27149 -15795 -255637 137643 6882 213510 -151806 -109923 -15537 351991 -305 125961
10229 -12613 -62218 -86722 -297144 239007 123276 -336012 64549 28474 143343 228330 -206844
10217 -108443 133946 -151220 119516 -48464 118436 14791 130043 -187304 20714 -96605
$$ packed form
10300D6344b14790D9029L08808A42957O5547a48250e7156D22770F6732P600e2247
10288C95766i2456M2974M384j24664K9984c2315B3292c1671j03104j46687a3314
10276a83759F5616C200K08115H1230h2958B41859a28195b5739A90634B2859P6549
10265I9408e4048o6209A95671h3487O167D8453J06267n3700L4965L58839I6770
10253A329K91205r6310a43690H4930O947a61309A17418b41197J6107f0296A78348
10241b7149J1354k39842A37643F882K06628a51806M1883a5537C51991c05A25961
10229a2613m9605k4504k10422B39007j15731c36012F4549B8474J14869Q4987b06844
10217a08443A33946a51220A19516d8464A18436A4791J15252a87304B0714i6605
$$ plain form
10206 -228666 184639 -335206 -238084 -358518 -230097 -30388 -958 -184777 -102876 71337 74884
10195 74884 -118785 142154 -184318 153630 304781 57270 -28861 -423285 -185235 90462
10184 -101397 95174 -141707 -71974 -204361 -131904 -28484 41791 -166802 11066 -175606 93151
10172 -134610 -36411 -309683 50263 212244 -107252 -190793 -211062 -55298 -258035 -243131 82302
10160 -112181 -130985 -132131 54172 -80921 -10033 -542979 -311952 -191321 116194 169662 -201683
10148 -149460 -229957 333114 -315521 -331628 9901 215699 -255369 -313878 -223289 -186104 -100655
10137 -100655 63823 -276506 229221 347371 108087 -26035 -87758 -24059 -30876 -430 -248941
10126 -248941 128508 226205 45168 -174842 -329384 -60655 -38248 105909 -2941 50374 -294545
$$ packed form
10206b28666A84639c35206R7122j20434J28421c0388i58j83819Q1901G1337L547
10195G4884a18785A42154a84318A53630J51151E7270b8861l94424a85235I0462
10184a01397I5174a41707O9733j32387P2457b8484D1791a66802A1066a75606I3151
10172a34610c6411k73272E0263J61981a07252q3541k0269e5298k02737J4904H2302
10160a12181j8804j146E4172h0921a0033n32946K31027J20631A16194N3468b01683
10148a49460q0497C33114c15521j6107I901K05798b55369n8509R0589L7185Q5449
10137a00655F3823b76506B29221J18150A08087b6035o1723b4059o817d30k48511
10126b48941A28508R7697D5168a74842j54542f0655K2407A05909b941E0374b94545
$$ plain form
10114 -117108 107242 -1872 40193 -374160 76801 45596 -157377 -1658 -333762 -180901 -219509
10103 -219509 -170698 -74749 85274 -9289 -203410 195456 239932 -209586 -224152 193803 -63442
10091 141129 -118698 -6289 -23548 -393552 -29490 -41963 170581 -29762 90998 -203989 -286233
10080 -286233 112963 -26541 -296909 -136689 -95340 34977 -193015 16052 -74098 17925 330407
10069 330407 -149811 128158 91230 -306483 -273619 -169256 -91687 138669 -144639 -51367
10058 -341921 -199555 -155182 -154510 -43346 27872 61016 -569653 -91601 223723 69035 -170528
10046 -249520 -131887 -210263 131321 -193914 -284251 -84827 -152005 -278744 94308 56344 -264334
10034 -6944 -36327 104369 -230569 -122868 -149615 15309 -99676 -180743 -70971 -14704 4136
$$ packed form
10114a17108A07242a872D0193c74160G6801l1205a57377a658l32104J52861l8608
10103b19509M8811g4749H5274i289j94121A95456M4476b09586j4566A93803f3442
10091A41129a18698f289j7259l70004b9490j2473A70581b9762I0998b03989q2244
10080b86233A12963b6541k70368a36689M1349C4977a93015A6052g4098A7925L12482
10069C30407a49811A28158l6928c06483L2864J04363P7569A38669a44639e1367
10058c41921J42366M4373O72d3346B7872L3144e69653i1601B23723F9035a70528
10046b49520J17633p8376A31321a93914r0337h4827o7178j26739I4308l7964b64334
10034f944k9383A04369b30569J07701k6747A5309i9676q1067g0971a4704D136
$$ plain form
10022 -236822 167617 79026 11639 -215093 43332 -311201 84148 -143286 86457 -121923
10011 -299408 -20122 268185 -235561 -178372 -308978 -184946 -237603 -255369 119485 -112206
10000 -23974 -287155 102655 71680 -147435 -293361 -179559 -33307 -144175 -52288 26198
9989 -201064 -352156 7589 -257634 -79309 230309 62666 -449258 50388 -16461 152692 36196
9977 -343874 -241506 -142262 -111144 -66793 -137975 -37210 87134 26070 -399940 9562 -67359
9965 -372915 -265305 -125229 -265894 148448 -227866 -153062 163059 110015 -254410 130622
9954 -156847 97843 -35720 -107229 -258259 238628 -111433 -55157 -94953 -105384 -309518 -80136
9942 -100481 -14489 118969 -361976 207189 70446 -234623 58351 -284161 -243854 -132237
$$ packed form
10022b36822A67617G9026A1639b15093D3332c11201H4148a43286H6457a21923
10011b99408b0122B68185b35561N7189j30606J24032n2657j7766A19485a12206
10000b3974k63181A02655l0975a47435j45926J13802c3307j10868e2288B6198
9989b01064j51092G589b57634g9309B30309F2666d49258E0388a6461A52692C6196
9977c43874J02368R9244L1118M4351p1182c7210H7134B6070c99940I562f7359
9965c72915J07610a25229j40665A48448b27866P4804A63059n3044b54410A30622
9954a56847I7843c5720p1509j51030B38628a11433e5157l9796j0431k04134h0136
9942a00481a4489A18969c61976B07189G0446b34623E8351b84161M0307J11617
$$ plain form
9932 -132237 98231 79379 22395 -12116 4614 104097 37199 -84430 -96517 -24025 61145 -8231
9919 -171552 -12868 -239003 206518 53232 75419 -134710 -127014 -72045 -170988 -26167 -188106
9908 -188106 73185 -77888 64099 -181014 -257568 -320608 -27309 -299173 27752 31286 -295510
9896 -100514 22006 -72349 93589 -54359 113829 31835 78387 -147599 -17864 -193307 105176
9884 -366455 39660 194511 148337 332583 -195540 25720 -129016 71549 -360290 155792
9873 -8263 -15990 -24646 -165505 35983 -36878 59896 68481 -92861 -74016 -182156 -49826 -316639
9861 -316639 -474536 103943 321678 179227 -202862 -352228 -161344 46994 -316294 423055
9850 -152378 -44903 236807 -358735 -245061 50486 -163082 167973 -509776 -82033 226562
$$ packed form
9932a32237I8231j8852B2395a2116D614R9483C7199h4430j2087b4025F1145h231
9919a71552a2868k26135B06518E3232K2187a34710P696N4969r8943b6167j61939
9908a88106G3185g7888F4099a81014p6554o3040b7309k71864B7752L534b95510
9896a00514B2006g2349I3589e4359A13829C1835M6552a47599a7864j75443A05176
9884c66455C9660J54851m6174J84246a95540B5720a29016G1549c60290A55792
9873h263p727q656j40859C5983c6878E9896Q585i2861J8845j08140d9826k66813
9861c16639j57897A03943K17735j42451b02862j49366a61344D6994c16294D23055
9850a52378d4903B36807c58735J13674E0486a63082A67973e09776h2033B26562
$$ plain form
9839 102209 -97579 2510 72852 85395 -253677 -119962 -40267 -219230 -239071 -90454 67295
9827 -289467 -61372 -196088 131673 -84257 -317024 -360027 -637966 -236841 -52977 -248520
9817 -248520 -191255 50689 120617 198338 -72910 159249 -116912 -140030 -199460 -388525 280231
9805 -390416 -236097 24544 -149671 -96210 -118947 630 219522 -89054 -219370 164013 -144390
9793 117443 -285535 -383359 125379 -10420 -116894 -85451 46635 -449602 -68419 63213 -213746
9781 -180191 -50979 -124454 -357326 124967 350833 -228749 -141758 -265037 -14823 152710
9770 151808 181223 -283197 -48245 -225074 355009 -126144 135400 -89214 -310305 -48164
9759 -691 296257 -15918 361498 -215189 -144291 261371 -186441 -45979 -41480 106122 -58068
$$ packed form
9839A02209i7579B510P0342J2543b53677a19962d0267j78963j9841i0454F7295
9827b89467f1372j34716A31673h4257k32767m3003k77939b36841e2977j95543
9817b48520N7265E0689O9928P7721g2910A59249a16912k3118n9430j89065B80231
9805c90416J54319B4544a49671N3461k2737F30K18892h9054j30316A64013a44390
9793A17443b85535r7824A25379a0420j06474L1443D6635d49602f8419F3213b13746
9781a80191e0979p3475k32872A24967K25866b28749Q6991j23279a4823A52710
9770A51808K9415b83197d8245j76829C55009a26144A35400h9214k21091d8164
9759f91B96257a5918C61498b15189P0898B61371a86441d5979M499A06122e8068
$$ plain form
9747 87015 137037 -177466 156277 -181176 -168273 -51002 -271834 -39439 -216955 -12082 -160120
9736 -160120 28449 -18950 351292 112579 -49167 150782 -26527 -218454 25274 447010 -151985
9724 3676 -108225 -378314 -265412 22499 -184623 -22074 1951 -128083 -444413 38392 -122442
9712 -189300 -49172 -394154 65836 -69579 249356 -218108 145663 8689 -486672 -90837 -28803
9700 -181642 -31597 -215286 -26666 225229 -104904 -196769 -221125 131659 -363661 -254319
9690 -254319 51800 2153 209577 -67624 -106819 -31830 -187970 -228531 65020 105998 5144 -11373
9677 111706 -174374 48232 223964 38916 -60132 273978 -140916 -289110 128948 41825
9666 -348040 -160501 -260345 -115057 212454 -124085 23992 145705 -4636 -313618 -344205 -160812
$$ packed form
9747H7015N0022a77466A56277a81176J2903e1002k20832c9439j77516a2082j48038
9736a60120B8449a8950C51292A12579d9167A50782b6527j91927B5274M21736a51985
9724C676a08225k70089J12902B2499a84623b2074A951a28083l16330C8392a22442
9712a89300d9172l44982F5836f9579B49356b18108A45663H689d86672i0837b8803
9700a81642c1597j83689b6666B25229a04904r1865k4356A31659c63661J09342
9690b54319E1800B153K07424f7624l9195c1830j56140m0561F5020M0978E144a1373
9677A11706a74374D8232J75732C8916f0132B73978a40916j48194A28948D1825
9666c48040a60501r9844a15057B12454a24085B3992J21713d636l08982l0587a60812
$$ plain form
9654 -491823 19082 -244322 -52575 147612 -236287 -124146 -89346 -186143 12520 -152291 57934
9642 156773 -216961 -160526 -7597 55761 -317389 -68367 -67693 -47285 71330 -312000 -201029
9631 -201029 66741 46326 -248357 -129725 -248017 -269521 13850 -20363 66671 89212 -259811
9619 -70991 -362443 23934 87900 20599 -96113 3872 109374 -169132 -195190 -319887 67178
9607 -84643 -110928 42372 -392359 -7709 -224940 -201041 -197464 189071 244668 -181634 -139524
9596 -139524 51420 335526 40304 26730 -244384 -223201 115265 206224 -185324 -170081 14262
9584 -416067 -260762 26832 -28879 -163190 -428874 -316641 -50511 -247980 -65414 92055 -61790
9572 -241497 -345777 69903 354682 80912 -72049 148798 -105540 -99319 272035 -79640 -37725
$$ packed form
9654d91823A9082b44322e2575A47612b36287J12141L4800r6797A2520a52291E7934
9642A56773b16961N6435g597E5761c17389f8367O74K0408G1330c12000J10971
9631b01029F6741k0415b48357J18632j18292k1504A3850b0363F6671K2541b59811
9619g0991k91452B3934O3966B0599i6113C872J05502a69132k6058j24697F7178
9607h4643k6285D2372c92359g709k17231K3899L577A89071N5597a81634M2110
9596a39524E1420K84106D0304j3574b44384K1183A15265R0959a85324J5243A4262
9584d16067J55305B6832b8879j34311k65684J12233e0511j97469f5414I2055f1790
9572b41497j04280F9903K84779H0912g2049A48798a05540O221B72035g9640c7725
$$ plain form
9560 -144083 -151466 -292427 -29776 -17399 207536 251396 -30888 -212177 -140401 -384390 -15080
9548 -95521 211846 -336408 -184811 -146795 -112102 -131756 -35346 -279448 -257032 -53399 43556
9536 71097 31828 99077 -215676 239237 -162329 210326 110003 56665 -43735 -110265 50402
9524 122991 -184468 20728 64499 87430 -112716 -202041 -132264 -10950 -298805 9052 -51214
9512 89858 167512 -160909 -65291 -122531 -228906 -81937 -278972 -36498 -287325 -105006 -89471
9501 -89471 48661 -137886 -193940 -120710 -131297 110372 -391313 206835 -335170 -147039 -216450
9490 -216450 -264450 -318448 -118279 152950 24710 -128579 161730 32025 133119 -99108 161579
9478 133675 -65765 15007 21069 -159654 -132059 -135681 -175854 51545 -314036 -203273 -105806
$$ packed form
9560a44083p383j40961b9776J2377B07536M3860c0888j81289P1776k43989a5080
9548i5521B11846c36408J51597L8016L4693j9654c5346k44102K2416e3399D3556
9536G1097C1828O7249b15676B39237a62329B10326j00323n3338d3735o6530E0402
9524A22991a84468B0728M3771K2931a12716q9325O9777a0950k87855I052e1214
9512H9858P7654a60909f5291n7240j06375h1937j97035c6498k50827a05006J5535
9501h9471D8661a37886n6054P3230j0587A10372c91313B06835c35170a47039o9411
9490b16450m8000n3998a18279A52950B4710a28579A61730C2025J01094i9108A61579
9478A33675f5765A5007O062a59654K7595l622m0173E1545c14036J10763R7467
$$ plain form
9467 -105806 423865 -81622 49649 -253229 -217220 -61060 -104996 -202052 -151160 -180971 18127
9455 -143630 -367201 133660 276082 14172 -114200 -285424 -19434 -50098 181202 -259603
9444 142032 -226433 -183925 -318408 287283 -118082 -160100 -105269 -316433 57136 -251212
9433 -10157 170041 95827 -334268 -363343 103491 -205508 -136366 -55788 200379 -279557 -210888
9422 -210888 -245690 -230600 137408 -265530 169558 -213347 117794 -4462 5003 -353423 -108175
9410 -79689 -93427 108575 -59044 -118240 215455 -185640 -61044 -229201 -5274 -552231 -133069
9398 -106282 81076 309952 -34668 -106488 131625 -67727 -246623 -93850 142576 2692 -189519
9386 -57151 -93124 -272024 179704 275212 174413 49537 -148159 -104973 70095 -15267 -149376
$$ packed form
9467a05806D23865h1622D9649b53229L6009f1060m3936r7056N0892k9811A8127
9455a43630k23571A33660J42422A4172a14200j71224a9434l0664A81202b59603
9444A42032b26433M2508j34483B87283a18082m2018N4831k11164E7136b51212
9433a0157A70041p4214c34268k9075A03491b05508O9142e5788B00379b79557O8669
9422b10888l4802J5090A37408b65530A69558b13347A17794d462E003c53423a08175
9410g9689j3738A08575e9044n9196B15455a85640f1044j68157e274n46957a33069
9398a06282H1076K28876c4668p1820A31625f7727j78896i3850A42576B692a89519
9386e7151l5973j78900A79704R5508j00799D9537a48159M3186G0095a5267j34109
$$ plain form
9375 -149376 86158 88148 -91746 151308 282461 -12410 -391316 16737 -339589 -50683 321798
9363 -360148 69882 -421086 111250 114900 122093 -123593 -217985 69882 193085 -84325 26996
9351 315300 -85516 -2976 -30368 -7545 243064 63111 43756 -32740 -131980 -289959 -212710 -193646
9339 -193646 88821 -115811 -279120 62703 -16385 -18938 242203 55423 20613 -38404 -237495
9328 -237495 131929 -46145 -155114 28596 88467 -284211 -504384 -66424 -472813 -158332
9317 -129562 100438 146469 -519719 -68802 58180 -371927 -155019 -51943 -330699 297202
9306 169016 -146112 -311125 32648 -180545 221651 210310 -265946 138511 -196863 101360
9295 -70843 14620 -66669 -217842 -59338 -146861 243256 -20697 -27688 -201811 -40691 -198159
$$ packed form
9375a49376H6158J990i1746A51308J31153a2410l78906A6737c39589e0683C21798
9363c60148F9882d21086A11250L650P193a23593r4392F9882J23203h4325B6996
9351C15300h5516b976k7392g545B43064F3111j9355c2740r9240j57979P7249J9064
9339a93646H8821a15811j63309F2703a6385k553B42203E5423B0613c8404j99091
9328b37495A31929d6145j08969B8596N9871b84211k20173f6424m06389a58332
9317a29562A00438M6031e19719f8802E8180c71927a55019e1943k78756B97202
9306A69016a46112j65013C2648a80545B21651j1341b65946A38511a96863A01360
9295g0843A4620f6669j51173e9338q7523B43256b0697o991j74123d0691j57468
$$ plain form
9284 -198159 -56265 196264 -6176 -108826 101120 -107977 169484 -105179 -381813 -174007
9273 206733 -104015 -320158 -253897 -111883 -234583 -33239 39389 157946 44079 -54218 189330
9261 4531 -198819 -221321 -159182 -134815 3034 -71052 -310828 -28701 303991 -256484 243829
9249 19025 -39476 14100 79370 -445425 117284 -24009 -59682 8398 10419 18962 116168 -109395
9236 -288238 -299205 26325 -312204 -281820 -157424 182616 76970 -46579 -421314 -206228 406942
9224 -172421 197177 116291 -164070 120716 -293042 18417 -153409 -242424 168309 95490
9214 95490 -40627 -245378 211475 -295741 -59415 31715 -147211 4657 140741 -51136 -89685
9203 -89685 -119678 74569 -141925 -157188 -51013 -164826 -274031 193402 -298383 -185582 91700
$$ packed form
9284a98159e6265A96264f176j02650A01120a07977A69484a05179k76634a74007
9273B06733a04015k16143O6261a11883j22700c3239C9389J18557D4079e4218A89330
9261D531a98819k2502O2139K4367C034g1052k39776b8701C03991b56484B43829
9249A9025c9476A4100O5270d45425A17284b4009l5673H398K021Q543R7206a09395
9236b88238j0967B6325c12204L0384J24396A82616G6970d6579l74735b06228D06942
9224a72421A97177q0886a64070A20716b93042A8417a53409q9015A68309p2819
9214I5490d0627k04751B11475b95741e9415C1715a47211D657J36084e1136l8549
9203h9685k9993G4569a41925j5263e1013j13813j09205A93402b98383J12801I1700
$$ plain form
9191 -249168 -122828 -165629 -29567 -249571 -100271 -20274 -173584 -55690 -100762 102005 -18387
9179 67067 -20849 -20162 21616 -123635 198625 77594 -148635 292009 -97170 36353 91892
9168 91892 158077 65844 229072 -70017 -26117 33985 -55829 48241 -434104 382010 263250
9157 263250 -85327 -74763 -241164 -25096 -20374 -364082 -176983 276729 79600 -299287 -80321
9145 100328 -175926 -274743 -198866 -249769 -338017 -27079 -360013 -243647 -182574 -179112 -227865
9134 -227865 93283 87709 -34439 -343287 -206933 -358321 -118691 -359997 -70911 70166 -64600
9122 -68386 -181444 -53763 49677 -130701 -127950 -256660 38470 -215137 141959 -243817 63699
9110 -160319 297598 -89208 -75040 49022 -251844 57508 -74386 -56972 -44748 -28825 -201106
$$ packed form
9191b49168a22828m2801b9567k20004a00271b0274j53310e5690m5072A02005a8387
9179F7067b0849O87B1616a23635A98625G7594a48635B92009i7170C6353N5539
9168I1892O6185F5844J63228g0017b6117C3985e5829D8241d34104C82010j18760
9157B63250h5327J0564j66401b5096M722l43708a76983B76729G9600b99287h0321
9145A00328a75926r8817P5877n0903q8248b7079l32934J16366O1073L462m8753
9134b27865I3283n574c4439l08848J36354j51388a18691k41306g0911G0166f4600
9122f8386j13058e3763D9677a30701K751j28710C8470b15137A41959b43817F3699
9110a60319B97598h9208J4168D9022b51844E7508g4386J7414J2224J5923j72281
$$ plain form
9099 -201106 -168666 -68410 -75722 -141961 901 -17856 -62301 -103353 -94275 81766 -129514 -144883
9087 -144883 -36462 36060 -75281 -158856 -7624 -177143 219092 -338434 -215021 -138944 49479
9075 -198581 -77803 92129 -152820 14442 32705 -196192 -251232 -358416 162843 58955 -255922
9063 39914 257445 -289178 -75235 79083 -42130 -104244 310724 -196786 71149 -9071 -141521
9052 -141521 -310762 -229605 152432 458403 6946 -64599 -18000 -262562 -325158 54128 237972
9041 237972 139712 72398 48160 321791 -165392 85556 -75869 270091 204224 -90840 -207169
9030 -207169 -170812 -5720 39618 -118340 -288118 -70196 -113295 134857 251238 -95575 -363381
9019 -363381 -192795 -298171 -303450 -231059 -267967 169256 -231776 -302576 74092 -40261 -303672
$$ packed form
9099b01106L2440f8410p312o6239I01a7856m4445m1052R078H1766a29514j5369
9087a44883c6462C6060g5281q3575g624j69519B19092c38434J23413P6077D9479
9075a98581g7803I2129a52820A4442J8263a96192n5040j07184A62843E8955b55922
9063C9914K17531b89178g5235G9083d2130o2114C10724a96786G1149i071j32450
9052a41521j69241Q1157A52432L05971F946f4599a8000k44562o2596E4128J83844
9041B37972r8260o7314k4238K73631a65392H5556g5869B70091o5867i0840j16329
9030b07169L6357e720C9618a18340j69778g0196m3099A34857J16381i5575k67806
9019c63381J70586j05376n279P2391l6908A69256b31776p0800G4092d0261k63411
$$ plain form
9008 -303672 -106524 -310130 -187283 -240703 6475 -23961 167199 9033 166565 -121564 4723
8996 -239134 -95321 130576 -275487 -98264 32041 21236 50779 228995 -120889 943 -350399
8984 -32342 59847 464498 13850 -82553 -322871 -144971 30087 157327 108221 -345376 -108551
8972 -183587 33414 49457 -11347 -128633 -199734 108569 -57833 -102222 35068 -16409 154217
8960 8481 -129095 -136391 -99238 -289575 -38750 -136291 -183586 132697 234615 -21970 83450
8948 139538 -183981 37192 -173876 -221254 -105584 441081 -47299 -247975 -66551 -40958 -208246
8937 -208246 -84569 -72746 220194 205833 107045 37685 112908 -22718 -230460 130286 191844
8926 191844 133467 740951 1413354 1895040 2674974 2831894 2603915 2058313 997627 -42702
$$ packed form
9008c03672a06524k03606J22847n3420F475b3961A67199I033J57532a21564D723
8996b39134i5321A30576b75487i8264C2041j0805K9543J78216a20889I43c50399
8984c2342E9847M04651A3850h2553k40318a44971C0087J27240m9106c45376a08551
8972a83587C3414J6043a1347j17286p1101A08569e7833m4389C5068a6409A54217
8960H481a29095p296L7153j90337c8750r7541m7295A32697J01918b1970H3450
8948A39538a83981C7192a73876m7378a05584D41081d7299k00676f6551K5593j67288
8937b08246h4569J1823B20194j4361r8788C7685P5223b2718k07742A30286O1558
8926A91844n8377O07484O72403M81686P79934J56920k27979n45602I97627d2702
$$ plain form
8915 171164 -14609 -108438 -12841 -76876 -8280 -70410 43001 61915 123257 -39072 105525 109230
8903 109230 205218 -245551 104240 -422365 -429818 -84195 18736 -12341 274925 -208697 106117
8891 207869 193151 10278 82983 -124886 14775 -170492 -14756 -54301 185149 -91879 -308236
8880 -308236 -64974 -261500 138601 -123633 -13266 -197827 -359086 103939 -143270 -161709
8870 -161709 -90999 -101862 -288390 -333676 -63874 -1950 -110192 156579 59964 -59271 5239
$$ packed form
8915A71164a4609r3829a2841o4035h280o2130D3001J8914O1342c9072A05525L705
8903A09230R5988b45551A04240d22365p453h4195A8736a2341B74925b08697A06117
8891B07869j4718A0278P2705a24886A4775a70492a4756l9545A85149i1879k16357
8880c08236f4974j96526A38601a23633a3266j84561j61259A03939a43270j8439
8870a61709P0710j0863j86528m5286f3874a950j08242A56579E9964e9271E239
$$ [...]
##END NTUPLES=NMR SPECTRUM
##END=
