##TITLE=AC1685_PANAH14366_8637465_tnnQyLi04W
##JCAMPDX= 6.0         $$ Bruker NMR JCAMP-DX V2.0
##DATA TYPE= NMR SPECTRUM
##DATA CLASS= NTUPLES
##ORIGIN= BRUKER
##OWNER= Administrator
$$ 1.72 TOPSPIN		Version 2.1
$$ 2014-05-31 00:51:57.235 -0700  Administrator@X
$$ Compression mode = diff/dup
##.OBSERVE FREQUENCY= 400.02188249412
##.OBSERVE NUCLEUS= ^1H
##.ACQUISITION MODE= SIMULTANEOUS (DQD)
##.ACQUISITION SCHEME= undefined
##.AVERAGES= 64
##.DIGITISER RES= 22
##SPECTROMETER/DATA SYSTEM= spect
##.PULSE SEQUENCE= noesygpps1d.comp
##.SOLVENT NAME= COFFEE_meoh
##.SHIFT REFERENCE= INTERNAL, COFFEE_meoh, 1, 14.96101
##AUDIT TRAIL= $$ (NUMBER, WHEN, WHO, WHERE, PROCESS, VERSION, WHAT)
$$ ##TITLE= Audit trail, TOPSPIN		Version 2.1
$$ ##JCAMPDX= 5.01
$$ ##ORIGIN= Bruker BioSpin GmbH
$$ ##OWNER= Administrator
$$ $$ E:\/data/COFFEE/nmr/AC1685_PANAH14366_8637465_tnnQyLi04W/12/pdata/1/auditp.txt
$$ ##AUDIT TRAIL=  $$ (NUMBER, WHEN, WHO, WHERE, PROCESS, VERSION, WHAT)
(   1,<2014-05-31 00:51:51.907 -0700>,<Administrator>,<X>,<go>,<TOPSPIN 2.1>,
      <created by zg
	started at 2014-05-31 00:40:20.762 -0700,
	POWCHK enabled, PULCHK disabled,
       configuration hash MD5:
       C8 4E 4E 5D D3 5C D8 9E 9F 52 82 E0 59 8A DE 15
       data hash MD5: 64K
       EC 26 BB 4D 5F 9C 21 4B 75 44 29 90 4F 80 2E 52>)
(   2,<2014-05-31 00:51:55.079 -0700>,<Administrator>,<X>,<proc1d>,<TOPSPIN 2.1>,
      <Start of raw data processing
       efp LB = 0.3 FT_mod = 6 PKNL = 1 PHC0 = 0 PHC1 = 0 SI = 128K 
       data hash MD5: 128K
       80 C3 08 7F 97 AA 9D 31 A6 D7 6C 32 C3 94 3C 2B>)
(   3,<2014-05-31 00:51:56.094 -0700>,<Administrator>,<X>,<proc1d>,<TOPSPIN 2.1>,
      <pk PHC0 = -87.03918 PHC1 = 0 
       data hash MD5: 128K
       EA A6 CE 6A DB 45 32 7F 17 06 30 AC 63 BC F7 E2>)
(   4,<2014-05-31 00:51:56.579 -0700>,<Administrator>,<X>,<proc1d>,<TOPSPIN 2.1>,
      <abs ABSG = 1 
       data hash MD5: 128K
       62 4D F1 BC B4 F6 E0 AA D0 05 52 87 0C EB 5D 06>)
(   5,<2014-05-31 00:51:56.704 -0700>,<Administrator>,<X>,<proc1d>,<TOPSPIN 2.1>,
      <abs ABSG = 2 
       data hash MD5: 128K
       7B 63 9B F7 A9 A0 08 B5 36 78 1B C0 D8 03 77 97>)
(   6,<2014-05-31 00:51:56.813 -0700>,<Administrator>,<X>,<proc1d>,<TOPSPIN 2.1>,
      <abs ABSG = 3 
       data hash MD5: 128K
       BD 5C F2 88 C6 9A 12 BB 8E C8 25 81 4B A6 34 EE>)
(   7,<2014-05-31 00:51:56.922 -0700>,<Administrator>,<X>,<proc1d>,<TOPSPIN 2.1>,
      <abs ABSG = 4 
       data hash MD5: 128K
       DF 25 44 4E 33 FF 64 F4 25 6E 3A 42 CE 9A C3 21>)
(   8,<2014-05-31 00:51:57.016 -0700>,<Administrator>,<X>,<proc1d>,<TOPSPIN 2.1>,
      <abs ABSG = 5 
       data hash MD5: 128K
       E7 38 27 6E 48 42 D5 00 ED 4C 7D 71 5C C5 25 6C>)
$$ ##END=
$$ 
$$ $$ hash MD5
$$ $$ 0B E4 3D 18 F3 4C 2F 2A 20 AF 32 07 64 D7 C4 54
##$RELAX= 
##$RELAX= 
##$RELAX= 
##$RELAX= 
##$RELAX= 
##$RELAX= 
##$RELAX= 
##$RELAX= 
$$ Bruker specific parameters
$$ --------------------------
##$DU= <E:\>
##$EXPNO= 12
$$ [...]
##$TP07= 0
##$TPNAME0= <>
##$TPNAME1= <>
##$TPNAME2= <>
##$TPNAME3= <>
##$TPNAME4= <>
##$TPNAME5= <>
##$TPNAME6= <>
##$TPNAME7= <>
##$TPOAL= (0..7)
0.5 0.5 0.5 0.5 0.5 0.5 0.5 0.5
##$TPOFFS= (0..7)
0 0 0 0 0 0 0 0
##$TUNHIN= 0
##$TUNHOUT= 0
##$TUNXOUT= 0
##$USERA1= <user>
##$USERA2= <user>
##$USERA3= <user>
##$USERA4= <user>
##$USERA5= <user>
##$V9= 5
##$VALIST= <valist>
##$VCLIST= <CCCCCCCCCCCCCCC>
##$VD= 0
##$VDLIST= <DDDDDDDDDDDDDDD>
##$VPLIST= <PPPPPPPPPPPPPPP>
##$VTLIST= <TTTTTTTTTTTTTTT>
##$WBST= 2048
##$WBSW= 25
##$XGAIN= (0..3)
0 0 0 0
##$XL= 0
##$YL= 0
##$YMAX_a= 6103923
##$YMIN_a= -12714688
##$ZGOPTNS= <>
##$ZL1= 120
##$ZL2= 120
##$ZL3= 120
##$ZL4= 120
##$ABSF1= 14.96101
##$ABSF2= -5.597172
##$ABSG= 5
##$ABSL= 3
##$ALPHA= 0
##$AQORDER= 0
##$ASSFAC= 0
##$ASSFACI= 0
##$ASSFACX= 0
##$ASSWID= 0
##$AUNMP= <proc_prof1d_extract.lims>
##$AXLEFT= 0
##$AXNAME= <>
##$AXNUC= <1H>
##$AXRIGHT= 0
##$AXTYPE= 0
##$AXUNIT= <>
##$AZFE= 0.1
##$AZFW= 0.1
##$BCFW= 0
##$BC_mod= 0
##$BYTORDP= 0
##$COROFFS= 0
##$CY= 15
##$DATMOD= 1
##$DC= 0
##$DFILT= <>
##$DTYPP= 0
##$F1P= 0
##$F2P= 0
##$FCOR= 0.5
##$FTSIZE= 131072
##$FT_mod= 6
##$GAMMA= 0
##$GB= 0
##$INTBC= 1
##$INTSCL= 1
##$ISEN= 128
##$LB= 0.3
##$LEV0= 0
##$LPBIN= 0
##$MAXI= 10000
##$MC2= 0
##$MEAN= 0
##$ME_mod= 0
##$MI= 0
##$NCOEF= 0
##$NC_proc= -2
##$NLEV= 6
##$NOISF1= 0
##$NOISF2= 0
##$NSP= 0
##$NTH_PI= 0
##$NZP= 0
##$OFFSET= 14.96101
##$PC= 1
##$PHC0= -87.03918
##$PHC1= 0
##$PH_mod= 1
##$PKNL= yes
##$PPARMOD= 0
##$PPDIAG= 0
##$PPIPTYP= 0
##$PPMPNUM= 2147483647
##$PPRESOL= 1
##$PSCAL= 4
##$PSIGN= 0
##$PYNMP= <proc.py>
##$REVERSE= no
##$SF= 400.020009632813
##$SI= 131072
##$SIGF1= 0
##$SIGF2= 0
##$SINO= 400
##$SIOLD= 131072
##$SPECTYP= <>
##$SREGLST= <1H.CDCl3>
##$SSB= 0
##$STSI= 131072
##$STSR= 0
##$SW_p= 8223.68421052631
##$SYMM= 0
##$S_DEV= 0
##$TDeff= 65536
##$TDoff= 0
##$TI= <>
##$TILT= no
##$TM1= 0
##$TM2= 0
##$TOPLEV= 0
##$USERP1= <user>
##$USERP2= <user>
##$USERP3= <user>
##$USERP4= <user>
##$USERP5= <user>
##$WDW= 1
##$XDIM= 131072
##$YMAX_p= 433021879
##$YMIN_p= -12088
##$CURPLOT= <Network HP LaserJet P1505>
##$CURPRIN= <$Network HP LaserJet P1505>
##$DFORMAT= <normdp>
##$LAYOUT= <+/1D_H.xwp>
##$LFORMAT= <normlp>
##$PFORMAT= <normpl>
##$SURQMSG= 1
$$ End of Bruker specific parameters
$$ ---------------------------------
##NTUPLES= NMR SPECTRUM
##VAR_NAME=  FREQUENCY,     SPECTRUM/REAL,   SPECTRUM/IMAG
##SYMBOL=    X,             R,               I
##VAR_TYPE=  INDEPENDENT,   DEPENDENT,       DEPENDENT
##VAR_FORM=  AFFN,          ASDF,            ASDF
##VAR_DIM=   131072,        131072,          131072
##UNITS=     HZ,            ARBITRARY UNITS, ARBITRARY UNITS
##FACTOR=    0.0627417313425164, 1,          1
##FIRST=     8223.62146879497, -272,         -60213
##LAST=      0,             1484,            -60889
##MIN=       0,             -12088,          0
##MAX=       8223.62146879497, 433021879,    0
$$ Real data points
##PAGE= N=1
##DATA TABLE= (X++(R..R)), XYDATA
$$ [...]
61600C89393l327k527k120j761j303j280k031k907k988k273j530j254j277j312
$$ 389393 386066 383539 381419 379658 378355 377075 375044 372137 369149 366876 365346 364092 362815 361503
61586C61503j385j627j936j983j616j155j174j792k415k417j884j320p89M4J118
$$ 361503 360118 358491 356555 354572 352956 351801 350627 348835 346420 344003 342119 340799 340010 340054 341172
61571C41172J821J814J455J208J055P72L53k8k58k21K11J037K074L089L812L909
$$ 341172 342993 344807 346262 347470 348525 349297 349650 349622 349364 349143 349354 350391 352465 355554 359366 363275
61555C63275L391K843K896L408L616L104K118J022qo74n61K72J172J532J238M64
$$ 363275 366666 369509 372405 375813 379429 382533 384651 385673 385665 384991 384430 384702 385874 387406 388644 389108
61539C89108m82j062q50j31L43M11P34J735K883L278K525P93j378l111l590k938
$$ 389108 388626 387564 386714 386583 386926 387337 388071 389806 392689 395967 398492 399285 397907 394796 391206 388268
61523C88268k196k026j971j437q51j053j901k332j786q66l74k70M6P62J417J594
$$ 388268 386072 384046 382075 380638 379787 378734 376833 374501 372715 371849 371475 371205 371251 372013 373430 375024
61507C75024J531J736K155K127J298K53j20L24R93J442J811K431L365M404N131
$$ 375024 376555 378291 380446 382573 383871 384124 384004 384328 385321 386763 388574 391005 394370 398774 403905
61492D03905N119M391L557L118K812K138J334J150J711K363K598K519K339K232
$$ 403905 409024 413415 416972 420090 422902 425040 426374 427524 429235 431598 434196 436715 439054 441286
61478D41286K619L807N109N278M118K753K013J442M31o11r65p22m52k75p6j62
$$ 441286 443905 447712 452821 458099 462217 464970 466983 468425 468856 468245 467280 466558 466106 465831 465755 465593
61462D65593r49k279l607m566m932m499l559k940k973k897k034r79p47j175j205
$$ 465593 464644 462365 458758 454192 449260 444761 441202 438262 435289 432392 430358 429379 428632 427457 426252
61447D26252n14J21J55n0k8Q0pj13K36J216K445L081K402O33r90j403q12k14o0
$$ 426252 425738 425859 426014 425964 425936 426016 426009 425896 426132 427348 429793 432874 435276 435909 434919 433516 432704 432490 432430
61428D32430l9J9j66n84o50K9J057J777K020K079K238K604L164L712L818L121
$$ 432430 432391 432410 432244 431660 431010 431039 432096 433873 435893 437972 440210 442814 445978 449690 453508 456629
61412D56629J724K36p05r92j103j442j746j396l34P25J101P79J06o85j340j463
$$ 456629 458353 458589 457884 456892 455789 454347 452601 451205 450871 451596 452697 453476 453582 452897 451557 450094
61396D50094r45k81L0J03K95N35N18L23L31O12R11J067J140J142J066J043J216
$$ 450094 449149 448868 448898 449001 449296 449831 450349 450672 451003 451615 452526 453593 454733 455875 456941 457984 459200
61379D59200J583K214L237M399N037M929M631M538M210L359K829L538M818N035
$$ 459200 460783 462997 466234 470633 475670 480599 485230 489768 493978 497337 500166 503704 508522 513557
61365E13557L780K266J492J228J031J116J536J549N28j027k090k286j900j161
$$ 513557 517337 519603 521095 522323 523354 524470 526006 527555 528083 527056 524966 522680 520780 519619
61351E19619j06J070K073K801L280L412L067K262J141m3q96j122q51m58r7K45
$$ 519619 519513 520583 522656 525457 528737 532149 535216 537478 538619 538576 537680 536558 535707 535249 535152 535397
61335E35397L34p2n63m37J76L26l37r71q59m42l92m39J6O81Q15N78Q99K072L396
$$ 535397 535731 535659 535096 534659 534835 535161 534824 533853 532994 532552 532160 531721 531737 532418 533233 533811 534710 536782 540178
61316E40178M287M904N547O213P047Q487J0585J2632J3955J4717J5591J6857J8216
$$ 540178 544465 549369 554916 561129 568176 576663 587248 599880 613835 628552 644143 661000 679216
61303F79216J9267J9916K0265K0264J9422J6998J2818P840L594P95j182l372o067
$$ 679216 698483 718399 738664 758928 778350 795348 808166 816006 819600 820395 819213 815841 809774
61290H09774q782j0957j2350j2945j2965j2869j2993j3185j3045j2505j1823j1034
$$ 809774 800992 790035 777685 764740 751775 738906 725913 712728 699683 687178 675355 664321
61278F64321r836q160o511n428m797m030k833j537o15j44J89O59J232J618J600
$$ 664321 654485 646325 639814 634386 629589 625559 622726 621189 620574 620430 620619 621278 622510 624128 625728
61263F25728J247Q90P86R79J435K204L247M226M693M494L791K765J533L83l19
$$ 625728 626975 627865 628651 629630 631065 633269 636516 640742 645435 649929 653720 656485 658018 658401 658082
61248F58082n70p94j218j464j092l38R4o9l89l52lK73L40M12O49Q66P68M23L73
$$ 658082 657512 656718 655500 654036 652944 652606 652700 652631 652242 651890 651887 652160 652500 652912 653561 654427 655195 655618 655991
61229F55991J137K684M444N933P122Q225R342J0468J1615J2609J3025J2638J1848
$$ 655991 657128 659812 664256 670189 677311 685536 694878 705346 716961 729570 742595 755233 767081
61216G67081J1301J1064J0590R543Q300P521P419P601P395O303M430K641J974
$$ 767081 778382 789446 800036 809579 817879 825400 832819 840420 847815 854118 858548 861189 863163
61203H63163K647L826M567M815N159N909O857P893R328J1335J3368J4529J4415
$$ 863163 865810 869636 874203 879018 884177 890086 896943 904836 914164 925499 938867 953396 967811
61190I67811J3354J1785R756P131M105J193j283l423n404p176q610r750j0699
$$ 967811 981165 992950 1002706 1009837 1013942 1015135 1013852 1010429 1005025 997849 989239 979489 968790
61177I68790j1461j2168j3265j4994j6782j7596j7161j6312j5959j6018j5843
$$ 968790 957329 945161 931896 916902 900120 882524 865363 849051 833092 817074 801231
61166H01231j5320j4915j4751j4306j3316j2329j1985j2056j1723j0649r260p962
$$ 801231 785911 770996 756245 741939 728623 716294 704309 692253 680530 669881 660621 652659
61154F52659o611m940l187j847r77l4J458L268M599M792L861K307N70j269l187
$$ 652659 646048 641108 637921 636074 635097 635063 636521 639789 644388 649180 653041 655348 655918 654649 651462
61139F51462m832n669n455m402k928j421j64Q08J863L383N169O586P444Q284R509
$$ 651462 646630 640961 635506 631104 628176 626755 626591 627399 629262 632645 637814 644400 651844 660128 669637
61124F69637J0724J1446J2056J3407J5655J8165K0416K2345K3838K4670K5042
$$ 669637 680361 691807 703863 717270 732925 751090 771506 793851 817689 842359 867401
61113H67401K5509K6046K5910K4750K3237K2173K1491K0594J9197J7338J5024
$$ 867401 892910 918956 944866 969616 992853 1015026 1036517 1057111 1076308 1093646 1108670
61102A108670J2423J0003P900N464K015k161o127r351j1906j3914j5513j7196
$$ 1108670 1121093 1131096 1138996 1144460 1146475 1144314 1138187 1128836 1116930 1103016 1087503 1070307
61090A070307j9369k1575k2842k2907k2428k1907k1061j9499j7362j5011j2616
$$ 1070307 1050938 1029363 1006521 983614 961186 939279 918218 898719 881357 866346 853730
61079H53730j0264q066n895l453q60J299K717L757M872O126P582R529J1888J3843
$$ 853730 843466 835400 829505 826052 825192 826491 829208 832965 837837 843963 851545 861074 872962 886805
61065H86805J4719J4947J5526J6756J8083J9191K0508K2388K4380K5715K6370
$$ 886805 901524 916471 931997 948753 966836 986027 1006535 1028923 1053303 1079018 1105388
61054A105388K7161K8711L0646L2089L2837L3639L5121L6839L7797L7643L6876
$$ 1105388 1132549 1161260 1191906 1223995 1256832 1290471 1325592 1362431 1400228 1437871 1474747
61043A474747L5990L5043L4098L3285L2315L0533K7821K4805K1897J8863J5750
$$ 1474747 1510737 1545780 1579878 1613163 1645478 1676011 1703832 1728637 1750534 1769397 1785147
61032A785147J3393J2270J1601J0472R255Q943R572J0373J1114J2016J2689J2648
$$ 1785147 1798540 1810810 1822411 1832883 1842138 1851081 1860653 1871026 1882140 1894156 1906845 1919493
61020A919493J2902J5478K0904K7672L4675M2761N2984O4745P6759Q8922J02233
$$ 1919493 1932395 1947873 1968777 1996449 2031124 2073885 2126869 2191614 2268373 2357295 2459528
61009B459528J18037J38495J66564K03912K49544L01742L60256M25506M97836
$$ 2459528 2577565 2716060 2882624 3086536 3336080 3637822 3998078 4423584 4921420
61000D921420N80393O80966Q07441R62996J149207J366352J591907J750001J722026
$$ 4921420 5501813 6182779 6990220 7953216 9102423 10468775 12060682 13810683 15532709
60991A5532709J423780Q93540K97380j69704l98397l94181k22539M0430K99274
$$ 15532709 16956489 17850029 18147409 17977705 17579308 17185127 16962588 17003018 17302292
60982A7302292M22048K86962j25570o93665j223040j566095j687066j637132j491002
$$ 17302292 17724340 18011302 17885732 17192067 15969027 14402932 12715866 11078734 9587732
60973I587732j306825j120461r50981q04150o77590n68100m74532l95450l28140
$$ 9587732 8280907 7160446 6209465 5405315 4727725 4159625 3685093 3289643 2961503
60964B961503k70983k24359j88280j60830j39503j22466j08156r5336q4055p5091
$$ 2961503 2690520 2466161 2277881 2117051 1977548 1855082 1746926 1651590 1567535 1492444
60954A492444o7936o0822n2998m5442l8869l2816k7402k4164k3973k5454k6639
$$ 1492444 1424508 1363686 1310688 1265246 1226377 1193561 1166159 1141995 1118022 1092568 1065929
60943A065929k7066k7199k6953k6055k4917k3877k2432k0355j8690j8364j8611
$$ 1065929 1038863 1011664 984711 958656 933739 909862 887430 867075 848385 830021 811410
60932H11410j8089j6839j5813j5063j3946j2633j1841j1299j0035q120o692o142
$$ 811410 793321 776482 760669 745606 731660 719027 707186 695887 685852 677732 671040 664898
60920F64898n660m777m109m193m696n113n277m904l645j908p82o91q85n85J13
$$ 664898 659238 654461 650352 646159 641463 636350 631073 626169 622524 620616 619834 619143 618258 617673 617786
60905F17786P99J364J697J501Q20J91j37n58j409k491l533m566n552o262o746
$$ 617786 618585 619949 621646 623147 623967 624158 624021 623463 622054 619563 616030 611464 605912 599650 592904
60890E92904p331p905p838o982o058n720n843o112o563p118p233o668n994n779
$$ 592904 585573 577668 569830 562848 556790 551070 545227 539115 532552 525434 518201 511533 505539 499760
60876D99760n694n151m333l880l858l700l053k099j087j00P73J422J877K195K311
$$ 499760 494066 488915 484582 480702 476844 473144 470091 467992 466905 466805 467578 469000 470877 473072 475383
60861D75383K290K559L497M888N969O107N222L775K499J913J940K161K490L223
$$ 475383 477673 480232 483729 488617 494586 500693 505915 509690 512189 514102 516042 518203 520693 523916
60847E23916M270M829M242K790J283J68n37q27q73j281k529m164n194n289n028
$$ 523916 528186 533015 537257 540047 541330 541498 540961 540134 539261 537980 535451 531287 526093 520804 515776
60832E15776m941m919m758m664m822m917m551l916l615l857m233m277l936l395
$$ 515776 510835 505916 501158 496494 491672 486755 482204 478288 474673 470816 466583 462306 458370 454975
60818D54975k808k372k480l388m708n518n163l959k959k991l866m575m317l323
$$ 454975 452167 449795 447315 443927 439219 433701 428538 424579 421620 418629 414763 410188 405871 402548
60804D02548k606k739l159k863j684m34J55J66J3j88m70n67j35P57J739K518K875
$$ 402548 399942 397203 394044 391181 389497 389063 389218 389384 389397 389209 388739 388172 388037 388794 390533 393051 395926
60787C95926K592J815J214J267J582J495J111J128J662J962J464N51K6K18Q46
$$ 395926 398518 400333 401547 402814 404396 405891 407002 408130 409792 411754 413218 413769 413795 414013 414859
60772D14859J420J601J398J082P52J50q17j551j336l67L54J91n63j275j602j492
$$ 414859 416279 417880 419278 420360 421112 421262 420445 418894 417558 417191 417545 417736 417173 415898 414296 412804
60756D12804j142r92j235j328o81K41K92p20j580j256o1J080J806K177K106J598
$$ 412804 411662 410670 409435 408107 407426 407667 407959 407239 405659 404403 404342 405422 407228 409405 411511 413109
60740D13109R94L87p26k551m267m923m693m458m431m031l059k127j770j717j353
$$ 413109 414103 414490 413764 411213 406946 402023 397330 392872 388441 384410 381351 379224 377454 375737 374384
60725C74384n00M73J062J045N89Q0j94j61J67P49J342J628J619J695K039K376
$$ 374384 373884 374357 375419 376464 377053 377133 376939 376778 376945 377694 379036 380664 382283 383978 386017 388393
60709C88393K456K426K504K601K571K531K619K717K693K562K213J381K67l58r7
$$ 388393 390849 393275 395779 398380 400951 403482 406101 408818 411511 414073 416286 417667 417934 417576 417479
60694D17479L86K27m80r81j003q94q27o15l33l49o25o11r7M17M48K41L32P44J052
$$ 417479 417865 418092 417612 416631 415628 414734 413907 413292 412959 412610 411985 411374 411277 411694 412142 412383 412715 413459 414511
60675D14511J137J411K155K937L070K578K273K596K760J598q03l006l837l555
$$ 414511 415648 417059 419214 422151 425221 427799 430072 432668 435428 437026 436223 433217 429380 425825
60661D25825l150l033k957k714k408k137j840j342l35J350L220M133L416J706
$$ 425825 422675 419642 416685 413971 411563 409426 407586 406244 405909 407259 410479 414612 418028 419734
60647D19734L85K89J260K588L485L324K015J02j773l293m212m145l115k003j711
$$ 419734 420119 420408 421668 424256 427741 431065 433080 433182 431409 428116 423904 419759 416644 414641 412930
60632D12930k059k085j390n47j83k32k29J12P10J189J171P37N33J059J912K174
$$ 412930 410871 408786 407396 406849 406666 406434 406205 406317 407027 408216 409387 410124 410657 411716 413628 415802
60616D15802J537N81k8j48P3N09R84J208J048O44K50Q4L21Q95J404J498J312J172
$$ 415802 417339 417920 417892 417744 417817 418326 419310 420518 421566 422210 422460 422544 422865 423760 425164 426662 427974 429146
60598D29146R72L42n39q73k41P44J223J192J388K118K748K550J699J034R38R32
$$ 429146 430118 430460 429921 429048 428807 429551 430774 431966 433354 435472 438220 440770 442469 443503 444441 445373
60582D45373N44P7J25O59J147J350J432J400J212J361K497M275N495N749O009
$$ 445373 445917 445994 446119 446778 447925 449275 450707 452107 453319 454680 457177 461452 466947 472696 478705
60567D78705P068Q328Q899R045R537J0138R887Q522O612M477K094j61j673k604
$$ 478705 485773 494101 503000 512045 521582 531720 541607 550129 556741 561218 563312 563151 561478 558874
60553E58874l673m848n204m282k701j153L33J832L051L924M931O367P792Q706
$$ 558874 555201 550353 545149 540867 538166 537013 537346 539178 542229 546153 551084 557451 565243 573949
60539E73949R270R927J0746J1616J2757J4470J6583J8457J9444J9138J7412J4484
$$ 573949 583219 593146 603892 615508 628265 642735 659318 677775 697219 716357 733769 748253
60527G48253J0818O774K575j402m637o932q551r728j0355j0327r860r190q281
$$ 748253 759071 765845 768420 767018 762381 755449 746898 737170 726815 716488 706628 697438 689157
60514F89157p086n847m864m107l253k054m88J254K895M267N497O817Q225R609
$$ 689157 682071 676224 671360 667253 664000 661946 661458 662712 665607 669874 675371 682188 690413 700022
60500G00022J1265J3926J7957K2694K6900K9801L1537L2671L3400L3395L2274
$$ 700022 711287 725213 743170 765864 792764 822565 854102 886773 920173 953568 985842
60489I85842L0085K7202K3903K0298J6650J3375J0518P555M003p0m387r072j4584
$$ 985842 1015927 1043129 1067032 1087330 1103980 1117355 1127873 1135428 1139431 1139361 1134974 1125902 1111318
60476A111318k1104k8275l5288m0972m4199m4655m3138m0722l7851l4574l1234
$$ 1111318 1090214 1061939 1026651 985679 941480 896825 853687 812965 775114 740540 709306
60465G09306k8275k5594k2736j9664j6807j4437j2498j0919r645q489p500p152
$$ 709306 681031 655437 632701 613037 596230 581793 569295 558376 548731 540242 532742 525590
60453E25590p541p725o725m981l802l508l265k757k747l459l781k826j361o70
$$ 525590 518049 510324 503599 498618 494816 491308 488043 485286 482539 479080 475299 472473 471112 470442
60439D70442o80k69R74K192K382J342m32k165l135l111k563k154k040j896j457
$$ 470442 469762 469493 470467 472659 475041 476383 475951 473786 470651 467540 464977 462823 460783 458887 457430
60424D57430p75n7M79O72O34P84J465K544L505L926L793L403K985K324J062m94
$$ 457430 456655 456598 457077 457749 458383 459167 460632 463176 466681 470607 474400 477803 480788 483112 484174 483680
60408D83680j191k54J538K640K619K380K520K515J988J638K097K707K509J889
$$ 483680 482489 482235 483773 486413 489032 491412 493932 496447 498435 500073 502170 504877 507386 509275
60394E09275K004K926L536L313L004L256L598L423L096L306L814L732K832J896
$$ 509275 511279 514205 517741 521054 524058 527314 530912 534335 537431 540737 544551 548283 551115 553011
60380E53011J672K110K696L020K853K139J295J046J606K202J936R55K46L95J032
$$ 553011 554683 556793 559489 562509 565362 567501 568796 569842 571448 573650 575586 576541 576787 577182 578214
60365E78214J630K095K493K721K927L637M995O275O777O799P202Q170R132R732
$$ 578214 579844 581939 584432 587153 590080 593717 598712 604987 611764 618563 625765 633935 643067 652799
60351F52799J0251J1014J1882J2409J2079J0528P964N248L033R45j787m989p521
$$ 652799 663050 674064 685946 698355 710434 720962 728926 734174 737207 738152 736365 731376 723855
60338G23855q640q744q605q504q314p912p254o407n638n142m734m194l806l980
$$ 723855 715215 706471 697866 689362 681048 673136 665882 659475 653837 648695 643961 639767 635961 631981
60324F31981m404m300l573k935k764k616k086j297k90J255L200M695N330N946
$$ 631981 627577 623277 619704 616769 614005 611389 609303 608006 607716 608971 612171 616866 622196 628142
60310F28142P567J0106J2622J4433J5260J4848J3272J1403J0211R630Q645O528
$$ 628142 635709 645815 658437 672870 688130 702978 716250 727653 737864 747494 756139 762667
60298G62667L479R9l243o484r661j2748j5439j7089j7173j5805j3651j1296q924
$$ 762667 766146 766245 763002 756518 746857 734109 718670 701581 684408 668603 654952 643656 634732
60285F34732o532m259k450j399j103j265j649k306l321m462n344n867o158o138
$$ 634732 628200 623941 621491 620092 618989 617724 616075 613769 610448 605986 600642 594775 588617 582479
60271E82479n618m856m521m856n297n163m478l848l724l948l970l370k295j342
$$ 582479 576861 572005 567484 562628 557331 552168 547690 543842 540118 536170 532200 528830 526535 525193
60257E25193q88o47j71M49P42N89L74M36P84J300J760J792J233N04J50R5j08m84
$$ 525193 524305 523658 523487 523936 524678 525267 525641 526077 526861 528161 529921 531713 532946 533450 533600 533695 533587 533103
60239E33103o92p27q90j123j117q94o20mJ170K174K117J541J878L223M139M011
$$ 533103 532411 531684 530794 529671 528554 527660 527040 527036 528206 530380 532497 534038 535916 539139 543278 547289
60223E47289M025N062O162O214N873O393P503P966P635P553Q269R352J0459J1588
$$ 547289 551314 556376 562538 568752 574625 581018 588521 596487 604122 611675 619944 629296 639755 651343
60209F51343J2297J1802J0186Q641Q151Q498Q808Q636Q231Q028Q085P947P095
$$ 651343 663640 675442 685628 694269 702420 710918 719726 728362 736593 744621 752706 760653 767748
60196G67748N656M420L975L994L551K018l78k694m009m333m726o042p700q446
$$ 767748 773404 777824 781799 785793 789344 791362 790984 788290 784281 779948 775222 769180 761480 753034
60182G53034q202q167q936r646r390q444p447o376n099m099l806l810l534l093
$$ 753034 744832 736665 727729 718083 708693 700249 692802 686426 681327 677228 673422 669612 666078 662985
60168F62985k766k345j788j781k727l820m099l854l952m285m045l189k451k044
$$ 662985 660219 657874 656086 654305 651578 647758 643659 639805 635853 631568 627523 624334 621883 619839
60154F19839j506p25j24K80J005K131L002L082K586K085J913K042K167J977J601
$$ 619839 618333 617608 617484 617764 618769 620900 623902 626984 629570 631655 633568 635610 637777 639754 641355
60139F41355J670K610M124N556O451O537N757M670M259M875N860O559O952O926
$$ 641355 643025 645635 649759 655315 661766 668303 674060 678730 682989 687864 693724 700283 707235 714161
60125G14161N980M296L141L242L697L572L557M765O625P561P287O867O760O342
$$ 714161 720141 724437 727578 730820 734517 738089 741646 746411 753036 760597 767884 774751 781511 787853
60111G87853N388M592M366M227L619K474R15p40j842k108k255l053m026m153l557
$$ 787853 793241 797833 802199 806426 810045 812519 813434 812694 810852 808744 806489 803436 799410 795257 791700
60096G91700l251l380l062k007r55m10j20n9o75j874k855l309l763m466m944n035
$$ 791700 788449 785069 782007 780000 779045 778635 778515 778456 777781 775907 773052 769743 765980 761514 756570 751535
60080G51535n361o334p416p845p485o706o086o209p099p831p449o288n517n490
$$ 751535 746174 739840 732424 724579 717094 710388 704302 698093 690994 683163 675714 669426 663909 658419
60066F58419n560n486n764o392o498n692m741m369m284l959l521l249k885k033
$$ 658419 652859 647373 641609 635217 628719 623027 618286 613917 609633 605674 602153 598904 596019 593986
60052E93986q88l7K34K13N88J930M026N834O537O382O074N769N397N393O079O729
$$ 593986 593098 593061 593295 593508 594096 596026 600052 605886 612423 618805 624879 630648 636045 641438 647517 654246
60036F54246O361N205M189L320J877Q3r87j189j540k490l377l837m311m875n054
$$ 654246 660607 665812 670001 673321 675198 675281 674294 673105 671565 669075 665698 661861 657550 652675 647621
60021F47621n156o248q264r632r443q614q218q034p546p014o609n725m161k932
$$ 647621 642465 636217 627953 618321 608878 600264 592046 584012 576466 569452 562843 557118 552957 550025
60007E50025k891l454l607l275k813k085j009j76pK8M74R55R57Q35J126J667K154
$$ 550025 547134 543680 540073 536798 533985 531900 530891 530715 530708 530736 531210 532165 533122 533957 535083 536750 538904
59990E38904K890M043M940M961M529M325M209L766L277L186L118K338Q44p79k178
$$ 538904 541794 545837 550777 555738 560267 564592 568801 572567 575844 579030 582148 584486 585330 584551 582373
59975E82373l354m274n038n814o266n727m391l543l892m544m343l359k267j156
$$ 582373 579019 574745 569707 563893 557627 551900 547509 543966 540074 535530 531187 527828 525561 524405
59961E24405P4R81J219J260J498J416O75K38J099K544L000K216J376J282J662
$$ 524405 524479 525460 526679 527939 529437 530853 531528 531766 532865 535409 538409 540625 542001 543283 544945
59946E44945K051K293K218J851J725K196K665K371J616J205J016L04p59j062j82
$$ 544945 546996 549289 551507 553358 555083 557279 559944 562315 563931 565136 566152 566456 565697 564635 564453
59931E64453J018J697K041K715L976N612P209Q337Q859R067R163Q698O966L956
$$ 564453 565471 567168 569209 571924 575900 581512 588721 597058 605917 614984 624147 632845 639811 643767
59917F43767N76k008l034k506j233j95L54Q40J354J379P94L14L78M09p1n42m74
$$ 643767 644343 642335 639301 636795 635562 635367 635721 636561 637915 639294 640088 640402 640780 641189 641118 640576 640102
59900F40102m57j294k527l015k520j681p88L63J730L107M647O401P687P894P548
$$ 640102 639645 638351 635824 632809 630289 628608 627820 628183 629913 633020 637667 644068 651755 659649 667197
59885F67197P585P914P792P273P116P436P653P678Q010Q657R001Q782Q219P204
$$ 667197 674782 682696 690488 697761 704877 712313 719966 727644 735654 744311 753312 762094 770313 777517
59871G77517N421L262J579M40q73k592m207n508o777p788p818o889o004n730n509
$$ 777517 782938 786200 787779 788219 787346 784754 780547 775039 768262 760474 752656 745767 739763 734033 728524
59856G28524m746l616k458j276k49J29n9N1R55K137L066L975N049N534M504K144
$$ 728524 723778 720162 717704 716428 716179 716308 716249 716300 717255 719392 722458 726433 731482 737016 741520 743664
59840G43664l42j858k010j035L72J416J927K412L051L050J629n91j940j518p3
$$ 743664 743322 741464 739454 738419 738791 740207 742134 744546 747597 750647 752276 751685 749745 748227 748154
59825G48154J026J247J029R56J209J592J641P44j252l358m033k836j099m39r44
$$ 748154 749180 750427 751456 752412 753621 755213 756854 757598 756346 752988 748955 746119 745020 744581 743637
59810G43637j511j551j518j831k439l390m879o374o758n751m351l502l211l324
$$ 743637 742126 740575 739057 737226 734787 731397 726518 720144 713386 707635 703284 699782 696571 693247
59796F93247m013m961n206m606m304m889n237m310k918k422k585k269j531j305
$$ 693247 689234 684273 679067 674461 670157 665268 660031 655721 652803 650381 647796 645527 643996 642691
59782F42691j555j393q11p14j252j575j280p26L6J328K733L315L070K908L125
$$ 642691 641136 639743 638932 638218 636966 635391 634111 633385 633421 634749 637482 640797 643867 646775 649900
59767F49900L130K849K975L610L986L893M043M613M733M057L553L995M783N082
$$ 649900 653030 655879 658854 662464 666450 670343 674386 678999 683732 687789 691342 695337 700120 705202
59753G05202N142N605O314O659O556O257N688M769L920L597L558L179K305J317
$$ 705202 710344 715949 722263 728922 735478 741735 747423 752192 756112 759709 763267 766446 768751 770068
59739G70068N83J70p2l57o79o68kR72J449J129N22K52N05J218K262L300L913M011
$$ 770068 770651 770821 770749 770392 769713 769045 769043 770015 771464 772593 773115 773367 773872 775090 777352 780652 784565 788576
59721G88576L761L127K004P59J12L69J143J808J799P52r87k103j513K22J478J643
$$ 788576 792337 795464 797468 798227 798339 798708 799851 801659 803458 804210 803223 801120 799607 799829 801307 802950
59705H02950J774K952M903O649P735Q311Q509Q298P761P228P168P845Q849R286
$$ 802950 804724 807676 812579 819228 826963 835274 843783 852081 859842 867070 874238 882083 890932 900218
59691I00218Q813Q065P484O276L540J09k082k388k071k364l143l831m421n018
$$ 900218 909031 917096 924580 930856 934396 934505 932423 930035 927964 925600 922457 918626 914205 909187
59677I09187n368n458n803o610p300p425p321p413p423o859n732m394l128k161
$$ 909187 903819 898361 892558 885948 878648 871223 863902 856489 849066 842207 836475 832081 828953 826792
59663H26792j621j136k3J833L849N637P355Q910R603R100Q153P768P992Q052P325
$$ 826792 825171 824035 824012 825845 829694 835331 842686 851596 861199 870299 878452 886220 894212 902264 909589
59648I09589N836L986K178N09j345l752o657r620j2241j4237j5334j5508j5104
$$ 909589 915425 919411 921589 922098 920753 917001 910344 900724 888483 874246 858912 843404 828300
59635H28300j4280j2678j0215p763o270n590n066m829n377o255o469o161o475
$$ 828300 814020 801342 791127 783364 777094 771504 766438 761609 756232 749977 743508 737347 730872
59622G30872p677q714q857q497q073p492o959p021p334o724m996l503l219l460
$$ 730872 723195 714481 705624 697127 689054 681562 674603 667582 660248 653524 648528 645025 641806 638346
59608F38346l163k292j300k22Q89J588J784J949K071J438R2p01j76P87J126J074
$$ 638346 635183 632891 631591 631369 632258 633846 635630 637579 639650 641088 641180 640479 640303 641090 642216 643290
59592F43290J299J612J574J437J415R16l91j574j705j373j737k646k967k397j771
$$ 643290 644589 646201 647775 649212 650627 651543 651152 649578 647873 646500 644763 642117 639150 636753 634982
59577F34982j800k429l295l982m077l640l306l356l234k549j848j655j481q03
$$ 634982 633182 630753 627458 623476 619399 615759 612453 609097 605863 603314 601466 599811 598330 597527
59563E97527k79q05j870k101j253m44m76r14r47k98P56J590J584Q45M48J333L044
$$ 597527 597248 596443 594573 592472 591219 590775 590299 589385 588438 588140 588896 590486 592070 592915 593363 594696 597740
59546E97740M312M657M724N132N800O536P587R250J1348J3461J5628J8387K1691
$$ 597740 602052 606709 611433 616565 622365 628901 636488 645738 657086 670547 686175 704562 726253
59533G26253K3632K1126J2885J714p275j1052j0639q797p013n262l363j500LO71
$$ 726253 749885 771011 783896 785610 778335 767283 756644 747847 740834 735572 732209 730709 730712 731383
59519G31383J81r26j587j788k767n022p164p692o933o210n960n808n716n800n567
$$ 731383 731564 730638 729051 727263 724496 719474 712310 704618 697685 691475 685515 679707 673991 668191 662624
59504F62624m580l482l198l542l630l315l093k911k199q74O25K069L340L983L788
$$ 662624 658044 654562 651364 647822 644192 640877 637784 634873 632674 631800 632425 634494 637834 641817 645605
59489F45605L492L916M736N095N072N434O238O783O810O688O511O045N443N153
$$ 645605 649097 653013 657749 662844 667916 673350 679588 686371 693181 699869 706380 712425 717868 723021
59475G23021N157N179N461O266O868O105L979J709J29j021k160l158l725l776
$$ 723021 728178 733357 738818 745084 751952 758057 762036 763745 763874 762853 760693 757535 753810 750034
59461G50034l312k509j855j458m92J777M572O220O251N874O166O768O718N823
$$ 750034 746722 744213 742358 740900 740408 742185 746757 752977 759228 765102 771268 778036 784754 790577
59447G90577M726M064L892L661K610M69k295n024p448r399j0366r944q511o856
$$ 790577 795303 799367 803259 806920 809530 809999 807704 802680 795232 785833 775467 765523 757012 750156
59433G50156n372m066l087k625k489k348k187k024j472r8K024M562P329J0026
$$ 750156 744784 740718 737631 735006 732517 730169 727982 725958 724486 724388 726412 730974 738303 748329
59419G48329J2119J3456J4627J6106J7609J8741J9732K1047K3003K6059L0091
$$ 748329 760448 773904 788531 804637 822246 840987 860719 881766 904769 930828 960919
59408I60919L2564K9033J7423J236j2979k0940k2396j8967j2459m834K530R877
$$ 960919 993483 1022516 1039939 1041175 1028196 1007256 984860 965893 953434 948600 951130 961007
59396I61007J7503K2956K1816J2302k128j5412k3350k5332k3240j9642j6318j3630
$$ 961007 978510 1001466 1023282 1035584 1033456 1018044 994694 969362 946122 926480 910162 896532
59384H96532j1254r248p880o771n271l593k552k252j968j340o94k68q3m06j287
$$ 896532 885278 876030 868150 861379 856108 852515 849963 847711 845743 844403 843709 843441 843358 842952 841665
59369H41665j862j314l43k49q19o26N68J529J833K551M077N111M764M145M791
$$ 841665 839803 838489 838146 837897 837078 836452 837020 838549 840382 842933 847010 852121 856885 861030 865821
59354H65821O683Q860J0859J2577J3620J3992J4627J6245J8161J9203J9275J9157
$$ 865821 872504 881364 892223 904800 918420 932412 947039 963284 981445 1000648 1019923 1039080
59342A039080J9194J8969J8039J6327J3900J0876P439L715j14l557o156q124j0107
$$ 1039080 1058274 1077243 1095282 1111609 1125509 1136385 1143824 1147539 1147425 1143868 1137712 1129588 1119481
59329A119481j2236j3978j5004j5500j5592j5285j5043j5527j6524j7083j6914
$$ 1119481 1107245 1093267 1078263 1062763 1047171 1031886 1016843 1001316 984792 967709 950795
59318I50795j6683j6641j6104j4774j3512j3066j2969j2437j1515j0641r785q873
$$ 950795 934112 917471 901367 886593 873081 860015 847046 834609 823094 812453 802668 793795
59306G93795q256q024p349n567l355j903j041P27M210Q116R955Q183L414k257
$$ 793795 785539 777515 770166 764599 761244 759341 758300 759027 763237 771353 781308 789491 792905 790648
59292G90648p058j0560j2983j4055j3289j1130q876p256n803l891j693K40J765
$$ 790648 783590 773030 760047 745992 732703 721573 712697 705441 699638 695747 694054 694294 696059
59279F96059L118M517O032P502Q531R056R835J1625J3863J5027J4627J3868J3966
$$ 696059 699177 703694 709726 717228 725759 734815 744650 756275 770138 785165 799792 813660 827626
59266H27626J4564J4402J2949J0732Q435O225L815R65k000m211n132n234n300
$$ 827626 842190 856592 869541 880273 888708 894933 898748 899713 897713 893502 888370 883136 877836
59253H77836n328m877m258m289m871m922l943k552j245K66J961K997L033L064
$$ 877836 872508 867631 863373 859084 854213 849291 845348 842796 841551 841817 843778 846775 849808 852872
59239H52872M045N405N860N172M199L529K850J600l14k467m269n451o326p313
$$ 852872 856917 862322 868182 873354 877553 881082 883932 885532 885218 882751 878482 873031 866705 859392
59225H59392q297q928r424j0363j1623j2359j2172j1561j0938j0038q737p523
$$ 859392 851095 842167 832743 822380 810757 798398 786226 774665 763727 753689 744952 737429
59213G37429o682n686m093k441j617j711k001j783q65M39J533K048K310K921L832
$$ 737429 730747 725061 720968 718527 716910 715199 713198 711415 710550 710989 712522 714570 716880 719801 723633
59198G23633M411M466M512M867N248N557O248P455Q445Q473P739P025O758O798
$$ 723633 728044 732510 737022 741889 747137 752694 758942 766397 774842 783315 791054 798079 804837 811635
59184H11635O801O505N934N429N162M626L129Q01j446k946l758m125m174m150
$$ 811635 818436 824941 830875 836304 841466 846092 849221 850022 848576 845630 841872 837747 833573 829423
59170H29423m347m706n013n360n778n720m734l473l031l467l963m274m816n484
$$ 829423 825076 820370 815357 809997 804219 798499 793765 790292 787261 783794 779831 775557 770741 765257
59156G65257n693n677o391p893r110r450r353r089q324p274o824p063o968o060
$$ 765257 759564 753887 747496 739603 730493 721043 711690 702601 694277 687003 680179 673116 666148 660088
59142F60088n140m884m975n127n558o018n607m294l241l001k738j815p95j33O33
$$ 660088 654948 650064 645089 639962 634404 628386 622779 618485 615244 612243 609505 607690 606895 606762 607395
59127F07395J614J971J652K154M347O843P903P832Q160R398J0885J2084J2785
$$ 607395 609009 610980 612632 614786 619133 625976 633879 641711 649871 659269 670154 682238 695023
59114F95023J2753J2255J2235J2982J3398J2437J0459Q339O167L840J879O07n87
$$ 695023 707776 720031 732266 745248 758646 771083 781542 789881 796048 799888 801767 802374 801787
59101H01787k089l125l017k431k330k597k785l244m275n127n102m738m661m225
$$ 801787 799698 796573 793556 791125 788795 786198 783413 780169 775894 770767 765665 760927 756266 752041
59087G52041k677q13Nk83r44j976l598m944m949m097l750m117m351m236m250m240
$$ 752041 749364 748551 748556 748273 747329 745353 741755 736811 731862 727765 724015 719898 715547 711311 707061 702821
59071G02821l586k520j944k014k139k211k557k864k448j619j508k435l464l706
$$ 702821 699235 696715 694771 692757 690618 688407 685850 682986 680538 678919 677411 674976 671512 667806
59057F67806l180k379j747j593j850j995j742j440j368j099k71O56J076J089R56
$$ 667806 664626 662247 660500 658907 657057 655062 653320 651880 650512 649413 649142 649798 650874 651963 652919
59042F52919M30n58j328j423j382j687j814j343r73j229j145K42J963K340J531
$$ 652919 653349 652791 651463 650040 648658 646971 645157 643814 642841 641612 640467 640709 642672 645012 646543
59027F46543J201K080L485M904O451P826Q425Q520R050J0142J0974J0944J0020
$$ 646543 647744 649824 653309 658213 664664 672490 680915 689435 698485 708627 719601 730545 740565
59014G40565Q157N502K942J296J47j458l385m621m786m338l490k077l18J332K814
$$ 740565 748722 754224 757166 758462 758609 757151 753766 749145 744359 740021 736531 734454 734136 735468 738282
58999G38282M101M659M294L987M668N728N919N209M466L891L197K811L297L905
$$ 738282 742383 747042 751336 755323 759991 765719 771638 776847 781313 785204 788401 791212 794509 798414
58985G98414L340J821Q80J226K229L386M832O412P623Q539R679J1033J2302J3826
$$ 798414 801754 803575 804455 805681 807910 811296 816128 822540 830163 838702 848381 859414 871716 885542
58971H85542J6001J8085J8944J8707J8316J7810J6526J4810J3826J3653J3047
$$ 885542 901543 919628 938572 957279 975595 993405 1009931 1024741 1038567 1052220 1065267
58960A065267J1244Q721O105L515R38j806n295r571j3414j5737j7225j9079k0828
$$ 1065267 1076511 1085232 1091337 1094852 1095790 1093984 1088689 1079118 1065704 1049967 1032742 1013663 992835
58947I92835k1056j9888j8809j8299j7565j6480j5727j5030j3217j0343p817o172
$$ 992835 971779 951891 933082 914783 897218 880738 865011 849981 836764 826421 818604 812432
58935H12432m533k633j447j364j476j241j167j315q46K93Q76K71o04q84q89r70
$$ 812432 807899 805266 803819 802455 800979 799738 798571 797256 796410 796703 797579 797850 797246 796362 795473 794503
58919G94503o79J79Q07O40J80P7K62N78J289K432L568M522N532O472O957P337
$$ 794503 793824 794003 794810 795450 795630 795707 795969 796547 797836 800268 803836 808358 813890 820362 827319 834656
58903H34656Q527J0709J3235J5829J8546K0551K0502J8546J6512J5646J5370J4770
$$ 834656 843183 853892 867127 882956 901502 922053 942555 961101 977613 993259 1008629 1023399
58891A023399J4061J3948J4612J5856J7496J9172K0485K1471K2190K2001K0141
$$ 1023399 1037460 1051408 1066020 1081876 1099372 1118544 1139029 1160500 1182690 1204691 1224832
58880A224832J6875J3149R359N573K433M92j057l461o498q910j0460j1813j2763
$$ 1224832 1241707 1254856 1264215 1269788 1272221 1272713 1271656 1268195 1261697 1252787 1242327 1230514 1217751
58867A217751j2502j1530j1297j1855j1855j0986j0478j0950j1655j2197j3019
$$ 1217751 1205249 1193719 1182422 1170567 1158712 1147726 1137248 1126298 1114643 1102446 1089427
58856A089427j3960j4214j4020j4521j5617j5974j5368j4962j4998j4449j3401
$$ 1089427 1075467 1061253 1047233 1032712 1017095 1001121 985753 970791 955793 941344 927943
58845I27943j3288j4214j4398j3173j2107j2226j2451j1907j1424j1527j1160
$$ 927943 914655 900441 886043 872870 860763 848537 836086 824179 812755 801228 790068
58834G90068r790q677q558q070o083l706k419j896j234o39l25O26K680M590N268
$$ 790068 780278 771601 763043 754973 748890 745184 742765 740869 739635 738996 738671 739297 741977 746567 751835
58819G51835N474O223O983O961O710O844O621N474M484M623M833L711J930J027
$$ 751835 757309 763532 770515 777476 784186 791030 797651 803125 807609 812232 817065 820776 822706 823733
58805H23733Q54Q4j510l107m483n920p036p269p040p088p228o983o777p169p536
$$ 823733 824587 824671 823161 820054 815571 809651 802615 795346 788306 781218 773990 767007 760230 753061 745525
58790G45525o880n487m443l956l304k042k51K027M578O566P176O575N730N588
$$ 745525 738645 733158 728715 724759 721455 719413 719162 721189 725767 732333 739509 746084 751814 757402
58776G57402O606Q332R244Q030N254K627M64k571o721j0082j1191j0993j0999
$$ 757402 764008 772340 781584 789614 794868 797495 797959 795388 788667 778585 767394 756401 745402
58763G45402j1074j0554j0081j0574j1296j0645q401n862m175l491l323k977k035
$$ 745402 734328 723774 713693 703119 691823 681178 672777 666915 662740 659249 655926 652949 650914
58750F50914r40m53l63K48J324J853J866K695M620O123O367O557P698Q733Q368
$$ 650914 649974 649521 649158 649406 650730 652583 654449 657144 661764 667887 674254 680811 688509 697242 705610
58735G05610P215O617O583O357N854N323M590L790L697M368M704M279M166M913
$$ 705610 712825 719442 726025 732382 738236 743559 748149 751939 755636 760004 764708 768987 773153 778066
58721G78066N312M438L366L493M573N760P199R141J0739J1122J0536R308P039
$$ 778066 783378 787816 791182 794675 799248 805008 812207 821348 832087 843209 853745 863053 870092
58708H70092L882J076r52l429o934j0079j1803j3165j5331j7559j8816j9602k0462
$$ 870092 873974 875050 874098 870669 863735 853656 841853 828688 813357 795798 776982 757380 736918
58695G36918k0486j9129j7783j7559j7159j5035j2102j0231r476q816q182p750
$$ 736918 716432 697303 679520 661961 644802 629767 617665 607434 597958 589142 580960 573210
58683E73210o698m726l326l517l863k859j613j750k362j654k13J73k41J20J242
$$ 573210 566512 561786 558460 554943 551080 548221 546608 544858 542496 540842 540629 540802 540561 540681 541923
58668E41923K022K718M242N860O329O585Q488J1415J2744J1397Q539N122J202
$$ 541923 543945 546663 550905 556765 563094 569679 578167 589582 602326 613723 622262 627384 628586
58655F28586k649n510p567r482j0734j0407r033p836o818n495m538m710n050m293
$$ 628586 625937 620427 612860 603378 592644 582237 573204 565368 558550 553055 548517 543807 538757 534464
58641E34464l087k687k451j047Q79J695J659K202L167L253K570K251K164J465
$$ 534464 531377 528690 526239 525192 526071 527766 529425 531627 534794 538047 540617 542868 545032 546497
58627E46497O47O26N75p47k326k242q92p7K74J496L027L032J906K013L941N927
$$ 546497 547144 547770 548345 547598 545272 543030 542138 542061 542335 543831 546858 549890 551796 553809 557750 563677
58611E63677O904P333P123N610L658K999L423L180K115J730K194K098J247R46
$$ 563677 570581 577914 585037 590647 594305 597304 600727 603907 606022 607752 609946 612044 613291 614237
58597F14237J348J184L48J38P44R58O00P36J452J849K300M212P387J0082J1740
$$ 614237 615585 616769 617117 617255 617999 618957 619557 620293 621745 623594 625894 630106 637493 647575 659315
58582F59315J3243J4540J4640J3858J3477J3201J1594R064P567P356O852N879
$$ 659315 672558 687098 701738 715596 729073 742274 753868 762932 770499 777855 784707 790586
58570G90586O132Q105J0369J2287J4766J7941K0763K3264K6575L0375L2859L3509
$$ 790586 796718 804823 815192 827479 842245 860186 880949 904213 930788 961163 994022 1027531
58558A027531L3333L2222K8837K3315J7299J1093L660m264j0091j2872j4011j4171
$$ 1027531 1060864 1093086 1121923 1145238 1162537 1173630 1177290 1173026 1162935 1150063 1136052 1121881
58546A121881j2454r185o486n397n160n871q793j3482j7610k0450k3505k7033
$$ 1121881 1109427 1100242 1093756 1088359 1083199 1077328 1068535 1055053 1037443 1016993 993488 966455
58534I66455k8974k8384k6900k5730k3953k0945j7778j5133j2372r660q412q643
$$ 966455 937481 909097 882197 856467 832514 811569 793791 778658 766286 756626 748214 739571
58522G39571q438o977n623n164m655l790l693m403m283k945k119k540k661j512
$$ 739571 731133 724156 718533 713369 708714 704924 701231 696828 692545 689600 687481 684941 682280 680768
58508F80768k71J33M09Q65N22o25r22J71R73L55o25q63p44o44p5Q47J188J106
$$ 680768 680497 680630 681039 681904 682426 681801 680879 681050 682023 682378 681753 680890 680146 679502 679427 680274 681462 682568
58490F82568J900L681N233O354P935R610J0096R989J1287J3828J5406J5729J6925
$$ 682568 684468 688149 693382 699736 707671 717281 727377 737366 748653 762481 777887 793616 810541
58477H10541J9604K1726K2078K1549K0183J6412J0135L468k407p977j2616j4529
$$ 810541 830145 851871 873949 895498 915681 932093 942228 945696 943289 935312 922696 908167
58465I08167j4106j3712j3490j1219o991l834k638p45L161O952R324J1869J5220
$$ 908167 894061 880349 866859 855640 848649 844815 842177 841432 844593 851545 860869 872738 887958
58452H87958J7292J7154J6617J6127J3234P210R70l688q607j4640j8859j9150
$$ 887958 905250 922404 939021 955148 968382 975592 976562 972874 964267 949627 930768 911618
58440I11618j7729j7154j6467j4159j1462r758p929n111k899k220j179J371L415
$$ 911618 893889 876735 860268 846109 834647 824889 816960 811849 808950 806730 805551 806922 810337
58427H10337L513L666N727Q201R294R970J1164J1156Q539M844J598k119o604r388
$$ 810337 813850 817516 823243 831444 840738 850708 861872 873028 881567 886411 888009 885890 879286 869898
58413H69898r071q095q863j0122j0021r536r943r978q501p006o706o041l902k170
$$ 869898 860827 852732 843869 833747 823726 814190 804247 794269 785768 778762 772056 766015 762113 759943
58399G59943k239k230n52R82O49J91J622L633M331M481N151N098L481K220K707
$$ 759943 757704 755474 754922 755904 756553 756744 758366 761999 766330 770811 775962 781060 784541 786761 789468
58384G89468L248K536K326L903N227M645L952M806N600N009N070P363R612R466
$$ 789468 792716 795252 797578 801481 806708 811353 815305 820111 825711 830720 835790 843153 852765 862231
58370H62231Q379Q513R077Q948R406J1224J2500J2381J3132J5605J6841J5318
$$ 862231 870610 879123 888200 897148 906554 917778 930278 942659 955791 971396 988237 1003555
58358A003555J4114J5342J6058J3520R901P770N509J571j345r85j9j159k140k82
$$ 1003555 1017669 1033011 1049069 1062589 1072490 1080260 1085769 1087340 1085995 1085010 1084991 1083832 1081692 1081410
58344A081410K247K645K664M596O417O030O021Q966J2188J2607J2506J4957J7761
$$ 1081410 1083657 1086302 1088966 1093562 1099979 1106009 1112030 1120996 1133184 1145791 1158297 1173254 1191015
58331A191015J7800J7226J9247K1600K0355J6662J3846J1342P367L912L249L027
$$ 1191015 1208815 1226041 1245288 1266888 1287243 1303905 1317751 1329093 1336460 1340372 1343621 1346648
58319A346648O08j475j07K390K673K657N325Q420Q685Q173J0022J2163J1725J1256
$$ 1346648 1347256 1345781 1345674 1348064 1350737 1353394 1358719 1367139 1375824 1383997 1394019 1406182 1417907 1429163
58305A429163J3896J6785J6258J5019J6974J9547J8659J6775J8137K0454J9435
$$ 1429163 1443059 1459844 1476102 1491121 1508095 1527642 1546301 1563076 1581213 1601667 1621102
58294A621102J7340J8717K1662K1717K0498K2108K4802K4651K3637K5754K8975
$$ 1621102 1638442 1657159 1678821 1700538 1721036 1743144 1767946 1792597 1816234 1841988 1870963
58283A870963K9398K9205L2052L5102L4358L3220L6639M1567M2627M2277M5523
$$ 1870963 1900361 1929566 1961618 1996720 2031078 2064298 2100937 2142504 2185131 2227408 2272931
58272B272931M9518M8897M6565M8398N2070N2005N0768N4063N9210O0207N9629
$$ 2272931 2322449 2371346 2417911 2466309 2518379 2570384 2621152 2675215 2734425 2794632 2854261
58261B854261O3530O9162P0097O8905P2114P7048P6748P3446P4026P6635P5405
$$ 2854261 2917791 2986953 3057050 3125955 3198069 3275117 3351865 3425311 3499337 3575972 3651377
58250C651377P3736P8740Q7099R0902R2865J00863J12186J18714J22889J32459
$$ 3651377 3725113 3803853 3890952 3981854 4074719 4175582 4287768 4406482 4529371 4661830
58240D661830J44235J49788J52529J61925J75532J84374J91219K05095K22720
$$ 4661830 4806065 4955853 5108382 5270307 5445839 5630213 5821432 6026527 6249247
58231F249247K34586K44361K62378K85148L01970L16472L39972L69221L93357
$$ 6249247 6483833 6728194 6990572 7275720 7577690 7894162 8234134 8603355 8996712
58222H996712M16928M52099M94353N31176N68162O19705O80760P36700P94044
$$ 8996712 9413640 9865739 10360092 10891268 11459430 12079135 12759895 13496595 14290639
58213A4290639Q70639R62674J054556J154307J283749J441036J610980J805170
$$ 14290639 15161278 16123952 17178508 18332815 19616564 21057600 22668580 24473750
58205B4473750K051188K350071K688755L086771L583878M192408M914448N791767
$$ 24473750 26524938 28875009 31563764 34650535 38234413 42426821 47341269 53133036
58197E3133036O874403Q149891R573441J1160440J2980646J5087161J7544951
$$ 53133036 60007439 68157330 77730771 88891211 101871857 116959018 134503969
58190A34503969K0499092K4091685K8327360L3100746L8119874M2305284M3208887
$$ 134503969 155003061 179094746 207422106 240522852 278642726 320948010 364156897
58183C64156897L7796984K4759640O308358j2683332k7657108l6690619m0396798
$$ 364156897 401953881 426713521 433021879 420338547 392681439 355990820 315594022
58176C15594022m0348336l7932984l4195363k9960031k5776025k1893822j8416677
$$ 315594022 275245686 237312702 203117339 173157308 147381283 125487461 107070784
58169A07070784j5413079j2885432j0760780q973378p500108o304016n314816
$$ 107070784 91657705 78772273 68011493 59038115 51538007 45233991 39919175
58162C9919175m484818l806417l260713k802029k405295k079619j822760j605578
$$ 39919175 35434357 31627940 28367227 25565198 23159903 21080284 19257524 17651946
58154A7651946j411484j250384j123426j010994r04653q16340p47354o80238o09220
$$ 17651946 16240462 14990078 13866652 12855658 11951005 11134665 10387311 9707073 9097853
58145I097853n48544n03236m60014m13745l75641l48673l20929k89861k68152
$$ 9097853 8549309 8046073 7586059 7172314 6796673 6448000 6127071 5837210 5569058
58136E569058k58955k48865k31843k17494k09580j98364j80786j67242j61550
$$ 5569058 5310103 5061238 4829395 4611901 4402321 4203957 4023171 3855929 3694379
58127C694379j53870j40020j28985j24838j19310j08649j00627r8551r4764q6096
$$ 3694379 3540509 3400489 3271504 3146666 3027356 2918707 2818080 2719529 2624765 2538669
58117B538669p9968p9295p6555o8586o2591o1902n9985n4052n0705n2640n3115
$$ 2538669 2458701 2379406 2302851 2234265 2171674 2109772 2049787 1995735 1945030 1892390 1839275
58106A839275m8980m6282m7727m7309m2607l9957m2156m2975l9178l6333l7413
$$ 1839275 1790295 1744013 1696286 1648977 1606370 1566413 1524257 1481282 1442104 1405771 1368358
58095A368358l6994l2141k8158k8195k7484k3115j9586j9580j8899j5335j3283
$$ 1368358 1331364 1299223 1271065 1242870 1215386 1192271 1172685 1153105 1134206 1118871 1105588
58084A105588j4850j5567j3355j2649j5388j6884j4952j4157j6777j8402j6674
$$ 1105588 1090738 1075171 1061816 1049167 1033779 1016895 1001943 987786 971009 952607 935933
58073I35933j5726j7571j7834j4403j1883j3009j3803j1658j0148j1430j1804
$$ 935933 920207 902636 884802 870399 858516 845507 831704 820046 809898 798468 786664
58062G86664r310p908r719j0691q353o473p674q766p732p928j0959j2637j0539
$$ 786664 777354 769446 759727 749036 740683 734210 726536 717770 710038 702110 691151 678514 667975
58049F67975q520r269r397o566m482n929p454n914m040m647n432m262l742n779
$$ 667975 659455 650186 640789 634223 629741 623812 616358 610444 606404 601757 596325 592063 588321 582542
58035E82542p273n867m389n219n899m643m508p502j0150r607q706j0218j1471
$$ 582542 575269 569402 565013 559794 553895 549252 544744 537242 527092 517485 508779 498561 487090
58022D87090r585o966o672p021n582m057m502n087l973l189m391n153l586k196
$$ 487090 477505 470539 463867 456846 451264 447207 442705 437618 433645 430456 426065 420912 417326 415130
58008D15130k960l226q12J415O42p03M41K194J637K83P77J817J242O36K055L442
$$ 415130 412170 408944 408132 409547 410189 409486 409927 412121 413758 414041 414818 416635 417877 418513 420568 424010
57992D24010K001p18j645j257j613k129j486j050k306l501k621j140j164j591
$$ 424010 426011 425293 423648 422391 420778 418649 417163 416113 413807 410306 407685 406545 405381 403790
57978D03790o88K99k30p97L20J591J139M03J406K966L121K646K797K366L46j270
$$ 403790 403102 403401 403171 402374 402694 404285 405424 405827 407233 410199 413320 415966 418763 421129 421475 420205
57962D20205p78p1j301l087l438l441m560n293m229l448m965o645n691l515l082
$$ 420205 419427 419356 418055 414968 411530 408089 403529 398236 394007 390559 385594 378949 373258 369743 366661
57947C66661l865l587k632k606k566p76J592K376K261L093M231M198M045N441
$$ 366661 362796 359209 356577 353971 351405 350629 352221 354597 356858 359951 364182 368380 372425 377866
57933C77866P172P191O392O826P757P075N014L129J149j828m537n281n005n558
$$ 377866 385038 392229 398621 405447 413204 420279 425293 428422 429571 427743 423206 417925 412920 407362
57919D07362o511o547o335o946p263o067m760n007n511m339k430j610j130M97
$$ 407362 400851 394304 387969 381023 373760 367693 362933 357926 352415 348076 345646 344036 342906 343403
57905C43403K179K174J440J581J446o26l028l131j638r96j086k18J063J056M69
$$ 343403 345582 347756 349196 350777 352223 351597 348569 345438 343800 342804 341718 341500 342563 343619 344088
57890C44088J144K433K453J777K244L309L155K374K810L833L399J881J259J423
$$ 344088 345232 347665 350118 351895 354139 357448 360603 362977 365787 369620 373019 374900 376159 377582
57876C77582P83l26m36k02j316l027l294k534k671l334k678j274j358k717l044
$$ 377582 378365 378039 377603 377401 376085 373058 369764 367230 364559 361225 358547 357273 355915 353198 350154
57861C50154k080j686k086j625j55P87J125K247L878M233L311K947L551L803L461
$$ 350154 348074 346388 344302 342677 342522 343309 344434 346681 350559 354792 358103 361050 364601 368404 371865
57846C71865L514L672K706J187Q58J420R23o89j478r82p43j271j302l35O85J345
$$ 371865 375379 379051 381757 382944 383802 385222 386145 385456 383978 382996 382253 380982 379680 379345 380030 381375
57830C81375J974K062R44j92L54J779J841N15k68k14q46k200k584j748j295j648
$$ 381375 383349 385411 386355 386163 386517 388296 390137 390652 390384 390170 389324 387124 384540 382792 381497 379849
57814C79849j565j029j649l666n327n832o341p479q278q183p910p820p435o804
$$ 379849 378284 377255 375606 371940 366613 360781 354440 346961 338683 330500 322590 314770 307335 300531
57800C00531o408n730l939j819q64p31K7J129J052N4o2Q92J350J007J154J908
$$ 300531 294123 288393 284454 282635 281771 281040 281067 282196 283248 283302 283240 284132 285482 286489 287643 289551
57784B89551J978J393J637K725K960K044J744K905M326N139N762O058N062L158
$$ 289551 291529 292922 294559 297284 300244 302288 304032 306937 311263 316402 322164 328222 333284 336442
57770C36442K086K163J836N22m93n64o98j467k126k445l175m080l764k049n08
$$ 336442 338528 340691 342527 343049 342556 341992 341294 339827 337701 335256 332081 328001 324237 322188 321680
57755C21680l2J30N37P71R02J612K515K427J599J542K394K747K311K276K722K202
$$ 321680 321648 321778 322315 323086 323988 325600 328115 330542 332141 333683 336077 338824 341135 343411 346133 348335
57739C48335M79p56o67m69j117j995k563l181l661l072j675r24j062p19O06J729
$$ 348335 348814 348058 347391 346922 345805 343810 341247 338066 334405 331333 329658 328734 327672 326953 327559 329288
57723C29288J933J767J350J41j190j070L11R29J07o14l08J02N0L09R55Q31j36
$$ 329288 331221 332988 334338 334479 333289 332219 332530 333459 333566 332952 332644 332746 332796 333105 334060 334891 334755
57706C34755m64K22M53l51q05j62M59M20O94J598J789P04k93l48m42j221j778
$$ 334755 334291 334513 334966 334615 333810 333648 334107 334527 335221 336819 338608 339312 339019 338671 338229 337008 335230
57689C35230j805k460l901m291k752r78m17r0J202K732L680M990P600J0599J3017
$$ 335230 333425 330965 327064 322773 320021 319043 318626 318536 319738 322470 326150 331140 338740 349339 362356
57674C62356J5721J9817K4769K9776L5482M2629N0585N8897O8651P9897Q8406
$$ 362356 378077 397894 422663 452439 487921 530550 581135 640032 708683 788580 876986
57663H76986Q6880O9808L7307m024m3390p1145q4121q5748q0923p2312o1566n1087
$$ 876986 963866 1033674 1070981 1066957 1023567 952422 868301 782553 701630 629318 567752 516665
57651E16665m2610l5715k9422k3926j9542j5581j1729q994p869p027n301l490
$$ 516665 474055 438340 408918 384992 365450 349869 338140 329146 321277 314250 308949 305459
57639C05459k723k443j643q43j174k413l376l499k892j738n97m15j326k328k751
$$ 305459 302736 300293 298650 297807 296633 294220 290844 287345 284453 282715 282118 281703 280377 278049 275298
57624B75298k894k797j943p16m26j233j768j577j910l183l803k700j076l04j10
$$ 275298 272404 269607 267664 266948 266522 265289 263521 261944 260034 256851 253048 250348 249272 248968 248858
57609B48858m7p41k143k636j558o00j011j409l40R68O44p17j267q94p37q65o25
$$ 248858 248811 248070 245927 243291 241733 241133 240122 238713 238373 239341 239985 239268 238001 237107 236370 235505 234880
57592B34880l43o91j184j120j088j823k533k101j015m59l58L3N41O03M32K91l56
$$ 234880 234537 233846 232662 231542 230454 228631 226098 223997 222982 222523 222165 222198 222739 223342 223774 224065 223709
57575B23709j598k228j623j094j818k793k621j939k104k804k958k807l046l012
$$ 223709 222111 219883 218260 217166 215348 212555 209934 207995 205891 203087 200129 197322 194276 191264
57561A91264j903p40q60j464q77N30J016M44K49Q67J369J462J817K523K944K954
$$ 191264 189361 188621 187761 186297 185420 185950 186966 187410 187659 188526 189895 191357 193174 195697 198641 201595
57545B01595K807K156O93p52j246j227j474j383j6J892K841K798K685K288P66
$$ 201595 204402 206558 207251 206499 205253 204026 202552 201169 201153 203045 205886 208684 211369 213657 214423
57530B14423j207j992j517j270j821k205j790j126p42n40m15k92L10J614K856
$$ 214423 213216 211224 209707 208437 206616 204411 202621 201495 200753 200213 199798 199506 199816 201430 204286
57515B04286L296L376L690L628K484J122Q34J228R97K24L8M54L82l57q35o34k02
$$ 204286 207582 210958 214648 218276 220760 221882 222716 223944 224941 225165 225203 225657 226039 225682 224847 224213 224011
57498B24011K47P22P22p6q59q24o74j366k137j558oQ90Q00P44R00M38n86j163
$$ 224011 224258 224980 225702 225626 224767 223943 223269 221903 219766 218208 218202 219092 219892 220636 221536 221974 221388 220225
57480B20225j095j108j221q13j68k34q28r00n07p43j669k153j851j610j741j594
$$ 220225 219130 218022 216801 215988 215820 215586 214758 213858 213351 212608 210939 208786 206935 205325 203584 201990
57464B01990j040p85j008j073p78m88q6P38J342Q84LN7Q02P48j77l76P40J797
$$ 201990 200950 200165 199157 198084 197306 196818 196732 197470 198812 199696 199699 199756 200558 201306 201129 200753 201493 203290
57446B03290J700J033O35M04J92L90R90J323J230J368J895K102J713J412J592
$$ 203290 204990 206023 206658 207062 207254 207644 208634 209957 211187 212555 214450 216552 218265 219677 221269
57431B21269J753J518J288J481J998K631L200L227K380J209N55L91J28j94j59
$$ 221269 223022 224540 225828 227309 229307 231938 235138 238365 240745 241954 242509 242900 243028 242834 242675
57416B42675J8j13j79M18J193J252Q95J106J819K240K510L314M101L553J747J35
$$ 242675 242693 242580 242401 242819 244012 245264 246159 247265 249084 251324 253834 257148 261249 264802 266549 266684
57400B66684o86j403k204k333j617p67J8J148K232K366J878K150L431M470M560
$$ 266684 265998 264595 262391 260058 258441 257674 257692 258840 261072 263438 265316 267466 270897 275367 279927
57385B79927M289M046L532K984L240M138M483L917L370L296L053K351J799J658
$$ 279927 284216 288262 291794 294778 298018 302156 306639 310556 313926 317222 320275 322626 324425 326083
57371C26083J474J140R57N76n84j878j997j002j34K55P81J227P96J36P28K202
$$ 326083 327557 328697 329654 330230 329646 327768 325771 324769 324635 324890 325671 326898 327694 327830 328558 330760
57355C30760K664J991K134L660M717M326L925M520M937M392M263N499O443N337
$$ 330760 333424 335415 337549 341209 345926 350252 354177 358697 363634 368026 372289 377788 384231 389568
57341C89568L172K078K304K659K716K744K547K081K258L593M928M953M119L700
$$ 389568 392740 394818 397122 399781 402497 405241 407788 409869 412127 415720 420648 425601 429720 433420
57327D33420L767L502K893K667L035L533L799L714L233K702K735L287L607L500
$$ 433420 437187 440689 443582 446249 449284 452817 456616 460330 463563 466265 469000 472287 475894 479394
57313D79394L679M431N071N193N318N734N911N699N801O374O522N922N593O202
$$ 479394 483073 487504 492575 497768 503086 508820 514731 520430 526231 532605 539127 545049 550642 556844
57299E56844O955P141P414Q448R576R964R946J0155J0310R998R677R842J0149
$$ 556844 563799 570940 578354 586802 596378 606342 616288 626443 636753 646751 656428 666270 676419
57286F76419J0293J0792J1895J2745J2611J2041J1838J1856J1737J1819J2372
$$ 676419 686712 697504 709399 722144 734755 746796 758634 770490 782227 794046 806418
57275H06418J2828J2729J2541J2716J2896J2820J3008J3711J4273J4327J4535
$$ 806418 819246 831975 844516 857232 870128 882948 895956 909667 923940 938267 952802
57264I52802J5307J5984J6157J6563J7677J8730J9122J9600K0860K2165K2587
$$ 952802 968109 984093 1000250 1016813 1034490 1053220 1072342 1091942 1112802 1134967 1157554
57253A157554K2517K2801K3372K3914K4760K5999K6742K6489K6238K7029K8402
$$ 1157554 1180071 1202872 1226244 1250158 1274918 1300917 1327659 1354148 1380386 1407415 1435817
57242A435817K9419L0124L0817L1089L0943L1727L4435L7950M0459M1816M3096
$$ 1435817 1465236 1495360 1526177 1557266 1588209 1619936 1654371 1692321 1732780 1774596 1817692
57231A817692M4722M6442M8405N0748N2728N3710N4424N5927N7922N9397O0343
$$ 1817692 1862414 1908856 1957261 2008009 2060737 2114447 2168871 2224798 2282720 2342117 2402460
57220B402460O1487O2831O3782O4335O4961O5609O5932O6187O7013O8631P0922
$$ 2402460 2463947 2526778 2590560 2654895 2719856 2785465 2851397 2917584 2984597 3053228 3124150
57209C124150P3759P6745P9366Q1964Q5598R0309R4827R8789J03894J11756J21878
$$ 3124150 3197909 3274654 3354020 3435984 3521582 3611891 3706718 3805507 3909401 4021157 4143035
57198D143035J32852J43892J53470J57761J52843J38392J18059R6665P7924O3630
$$ 4143035 4275887 4419779 4573249 4731010 4883853 5022245 5140304 5236969 5314893 5378523
57188E378523N3259M4777L7134L1539K9355K9783L0894L2030L3678L5794L7766
$$ 5378523 5431782 5476559 5513693 5545232 5574587 5604370 5635264 5667294 5700972 5736766 5774532
57177E774532L9527M1336M2967M4251M5738M7717M9403N0171N0639N1347N1415
$$ 5774532 5814059 5855395 5898362 5942613 5988351 6036068 6085471 6135642 6186281 6237628 6289043
57166F289043M9930M7637M5760M4160M2198M0447L9763L9489L8403L6913L6561
$$ 6289043 6338973 6386610 6432370 6476530 6518728 6559175 6598938 6638427 6676830 6713743 6750304
57155F750304L7751L9401M0400M0198L8544L6011L4083L3460L2970L1255K8551
$$ 6750304 6788055 6827456 6867856 6908054 6946598 6982609 7016692 7050152 7083122 7114377 7142928
57144G142928K5512K1499J5677Q845K485l122q234j2128j3900j3921j2825j0049
$$ 7142928 7168440 7189939 7205616 7214461 7216946 7213824 7205590 7193462 7179562 7165641 7152816 7142767
57132G142767m978J396P684J3868K0078K4823K6395K5055K2042J7736J2688Q949
$$ 7142767 7137789 7139185 7146869 7160737 7180815 7205638 7232033 7257088 7279130 7296866 7309554 7318503
57120G318503P840P631O045M044M605Q672J4838K2033K9791L6968M3276N1579
$$ 7318503 7326343 7333974 7340019 7344063 7348668 7357340 7372178 7394211 7424002 7460970 7504246 7555825
57108G555825O5767Q6799J13318J45303J84234K30574K84533L49007M28718N26766
$$ 7555825 7621592 7708391 7821709 7967012 8151246 8381820 8666353 9015360 9444078 9970844
57098I970844O44907P86559R56377J157125J389502J653715J947396K262828K589687
$$ 9970844 10615751 11402310 12358687 13515812 14905314 16559029 18506425 20769253 23358940
57089B3358940K919506L243760L549562L822074M048498M211549M278013M199793
$$ 23358940 26278446 29522206 33071768 36893842 40942340 45153889 49431902 53631695
57081E3631695L927384L420371K656988J659417N22741n97705j555420k284078
$$ 53631695 57559079 60979450 63636438 65295855 65818596 65220891 63665471 61381393
57073F1381393k805861l179677l449823l635013l742514l777690l744288l645656
$$ 61381393 58575532 55395855 51946032 48311019 44568505 40790815 37046527 33400871
57065C3400871l488096l281214l036179k765616k483801k204374j937530j689719
$$ 33400871 29912775 26631561 23595382 20829766 18345965 16141591 14204061 12514342
57057A2514342j464863j264836j089575r37782q07606o96729o02556n22710m55073
$$ 12514342 11049479 9784643 8695068 7757286 6949680 6252951 5650395 5127685 4672612
57048D672612l97592l48622l07207k72392k42631k16509j93578j73746j56254
$$ 4672612 4275020 3926398 3619191 3346799 3104168 2887659 2694081 2520335 2364081
57039B364081j40171j25474j12673j01564r1203q0964p0925o1416n2658m4660
$$ 2364081 2223910 2098436 1985763 1884199 1792996 1712032 1641107 1579691 1527033 1482373
57029A482373l6973k8861k0057j1101l004K432K006p371k5079m5545o1849p0479
$$ 1482373 1445400 1416539 1396482 1385381 1382377 1384809 1386815 1379444 1354365 1308820 1246971 1176492
57017A176492p2185o9412o4246n8226n2419m7234m2668l8774l5492l2413k9194
$$ 1176492 1104307 1034895 970649 912423 860004 812770 770102 731328 695836 663423 634229
57006F34229k5963k2950k0185j7804j6118j5074j4222j3456j3043j2729j1709
$$ 634229 608266 585316 565131 547327 531209 516135 501913 488457 475414 462685 450976
56995D50976r911q339p611p063n855m073k171k01J822L647N454P869J0738J2770
$$ 450976 441065 432726 425115 418052 412197 408124 405953 405752 407574 411221 416675 424544 435282 448052
56981D48052J2933J1224P639J736n919j2969j7153j8217j7270j5222j2721j0627
$$ 448052 460985 472209 479848 481584 475665 462696 445543 427326 410056 394834 382113 371486
56969C71486r312q096o206l750j169J513M214O434Q084R902J2324J4875J7218
$$ 371486 362174 354078 347872 344122 342953 344466 348680 355114 363198 373100 385424 400299 417517
56956D17517J9616K1446K0516J5086N845m879j4903k2374k5784k5296k3202k1478
$$ 417517 437133 458579 479095 494181 500026 495147 480244 457870 432086 406790 383588 362110
56944C62110j9657j6380j2113q590o126l364M20M383P704J0708J4025J7601K1099
$$ 362110 342453 326073 313960 305370 299244 295880 296300 300683 308387 319095 333120 350721 371820
56931C71820K4598K8266L1361L1745K6887J6011J338j3266k4938l2624l5947l4959
$$ 371820 396418 424684 456045 487790 514677 530688 532026 518760 493822 461198 425251 390292
56919C90292l1219k7369k4660k2030j8363j4368j1351r391p891o854o411n973
$$ 390292 359073 331704 307044 285014 266651 252283 240932 231541 223650 216796 210385 204412
56907B04412m977l772k870k105j326r78j102q06L72J579K120K562L388L849L505
$$ 204412 199435 195663 192793 190688 189362 188384 187282 186476 186848 188427 190547 193109 196497 200346 203851
56892B03851L617N413Q043R950J1360J3629J6841J9745K1512K1777J9437J3363
$$ 203851 207468 212881 220924 230874 242234 255863 272704 292449 313961 335738 355175 368538
56880C68538M477m374j0773j4025j4502j3010j0735q575o384l615m75K413N047
$$ 368538 373015 368641 357868 343843 329341 316331 305596 297021 290637 287022 286547 288960 294007
56867B94007P899J1084J4478J8254K2490K6771L0959L5750M1477M6753M8903M5312
$$ 294007 301906 312990 327468 345722 368212 394983 425942 461692 503169 549922 598825 644137
56855F44137L4314J6359m657k2670l3622l7868l7813l4721k9115k2562j6756j1591
$$ 644137 678451 694810 690153 667483 633861 595993 558180 523459 494344 471782 455026 443435
56843D43435o042k42N061J0345J6666K3748L0636L7774M6466N6601O6560P4783
$$ 443435 437393 437151 442212 452557 469223 492971 523607 561381 607847 664448 731008 805791
56831H05791P9218P5710N9844L1629k912l5327n9316p2504p5950p2751o5968n7219
$$ 805791 885009 960719 1020563 1052192 1049280 1013953 954637 882133 806183 733432 667464 610245
56819F10245m7296l7338k8280j9902j1747m439J347O651J3256K1282K9414L7186
$$ 610245 562949 525611 497331 477429 465682 461243 462590 469241 482497 503779 533193 570379
56807E70379M5220N3061N8215N7390M7817K8380J517k6204m7534n9239o2600o0165
$$ 570379 615599 668660 726875 784265 832082 860462 861979 835775 788241 729002 666402 606237
56795F06237n3903m5904l8224l1355k4518j7775j2265q206m448l36L694P546J1849
$$ 606237 552334 506430 468206 436851 412333 394558 382293 374087 369639 369303 372997 380543 392392
56782C92392J6592K1005K4977K8699L0498K7025J6658J612j3936k6633l4721l7836
$$ 392392 408984 429989 454966 483665 514163 541188 557846 559458 545522 518889 484168 446332
56770D46332l7137l4571l1376k7828k4340k1516j9066j6130j2902j0574r413q418
$$ 446332 409195 374624 343248 315420 291080 269564 250498 234368 221466 210892 201479 193061
56758A93061p107o142n758n154l980k950k494k103j592j594k148k213j257j81
$$ 193061 185954 179812 174054 168900 164920 161970 159476 157373 155781 154187 152039 149826 148569 148388
56744A48388Q6k86q12j485k132k120j372o48l20R3P16Q58L50J60R23J818J737
$$ 148388 148474 148188 147376 145891 143759 141639 140267 139619 139299 139392 140108 140966 141316 141476 142399 144217 145954
56727A45954P87n9j96K93R93J435J443J378J590J755J448J024J083J306R95M59
$$ 145954 146741 146682 146486 146779 147772 149207 150650 152028 153618 155373 156821 157845 158928 160234 161229 161688
56711A61688N74J157J184N50J73L18L91L74Q72J602J485N54O3M38P34N47O56J268
$$ 161688 162262 163419 164603 165153 165326 165644 166035 166409 167281 168883 170368 170922 170985 171423 172157 172704 173360 174628
56693A74628J419Q19N81J307K007J796J229J025R42P75J120K108K698K211J496
$$ 174628 176047 176866 177447 178754 180761 182557 183786 184811 185753 186528 187648 189756 192454 194665 196161
56678A96161J633K436L089L252K760J306p48k273k821l176l867m197l485k222
$$ 196161 197794 200230 203319 206571 209331 210637 209889 207616 204795 201619 197752 193555 190070 187848
56664A87848j133j57Q65J482J426J191J152Q76M8p73r88p19k91K62P56Q02N52
$$ 187848 186715 186558 187423 188905 190331 191522 192674 193550 193598 192825 191837 191118 190827 191089 191845 192647 193199
56647A93199N85P51K07j092k151k429k352k052j026M81J226P44k3m04q91j699
$$ 193199 193784 194535 194742 193650 191499 189070 186718 184666 183640 184121 185347 186091 186068 185664 184773 183074
56631A83074j905j016J7K23j04l98q00j368j448p99k32l92q48j066j170j137m72
$$ 183074 181169 180153 180170 180393 180289 179891 179091 177723 176275 175476 175244 174852 174004 172938 171768 170631 170159
56614A70159O88J362J196R09P48L3j137j394k64P45L30p44j051m91K21Q62J369
$$ 170159 170847 172209 173405 174314 175062 175095 173958 172564 172300 173045 173375 172631 171580 171089 171310 172172 173541
56597A73541J339P78M58O87Q50P22R15J405J129r0r13o23k59n57n43N76J801K090
$$ 173541 174880 175658 176116 176803 177653 178375 179290 180695 181824 181734 180821 180198 179939 179382 178839 179415 181216 183306
56579A83306K054K475K597J637O34J008K277K932K675K346K361K601L179M092
$$ 183306 185360 187835 190432 192069 192703 193711 195988 198920 201595 203941 206302 208903 212082 216174
56565B16174M850N348O222P573Q606R348J1191J4606J7723J8470J6762J3423Q594
$$ 216174 221024 226372 232594 240167 248773 258121 269312 283918 301641 320111 336873 350296 358890
56552C58890K714k438n431o681o966n887l400j264j078k067k607k695l148l614
$$ 358890 361604 359166 353735 347054 340088 334201 330801 329537 328459 326392 323785 321090 317942 314328
56538C14328l373l008l380l858l448k715k826l555l983m209m650m710l908l259
$$ 314328 310955 307947 304567 300709 297261 294546 291720 288165 284182 279973 275323 270613 266705 263446
56524B63446l734m389l937k998k822k929k180j164j205j887j869j437j866k876
$$ 263446 259712 255323 251386 248388 245566 242637 240457 239293 238088 236201 234332 232895 231029 228153
56510B28153l039k253j682j533j112o25q96j590j721j483j674j850j134l01q23
$$ 228153 225114 222861 221179 219646 218534 217909 217013 215423 213702 212219 210545 208695 207561 207260 206437
56495B06437k222k631j730q84o02j15O20O97R6k69l80r45j531r14O33J462J092
$$ 206437 204215 201584 199854 198970 198368 198253 198873 199570 199666 199397 199017 198072 196541 195627 196260 197722 198814
56478A98814P53J179J714J810J696J340M68l53k33L95L01m39n73J21N52K88O4
$$ 198814 199567 200746 202460 204270 205966 207306 207774 207421 207188 207583 207884 207445 206872 206993 207545 207833 207897
56461B07897J37j13p44r35l68M47J269K162K620K081J204J067J388J059K16N4
$$ 207897 208034 207921 207177 206242 205874 206321 207590 209752 212372 214453 215657 216724 218112 219171 219387 219441
56445B19441P57J411J759K315K835K473J413O51J46r71k445k952k184j197o75
$$ 219441 220198 221609 223368 225683 228518 230991 232404 233055 233201 232230 229785 226833 224649 223452 222777
56430B22777m21m56r19j054p1J172J201M00M98J669K332J852J267J154Q05k7m63
$$ 222777 222356 221900 220981 219927 219856 221028 222229 222629 223127 224796 227128 228980 230247 231401 232206 232179 231716
56413B31716p3N38J031J587J788R02n49j203q67n09l40J65N85k3r85m92J460K820
$$ 231716 231643 232181 233212 234799 236587 237489 236940 235737 234870 234361 234021 234186 234771 234748 233763 233271 234731 237551
56395B37551K504J577J095P99M82O13J014Q33L12P43K131K791J924P08K51K07
$$ 237551 240055 241632 242727 243526 244008 244621 245635 246468 246780 247523 249654 252445 254369 255077 255328 255535
56379B55535J18L50R33R91J76o26o46j12N13J009R99L91J78J321K940L267K220
$$ 255535 255653 256003 256936 257927 258103 257477 256831 256719 257232 258241 259240 259631 259809 261130 264070 267337 269557
56362B69557J320J167J012P24J051J715J491M26J9P87J641J962K237K400J652
$$ 269557 270877 272044 273056 273780 274831 276546 278037 278463 278482 279269 280910 282872 285109 287509 289161
56347B89161L84J33J124J833J432P15J92n70j293p84R25K251K445K455K943L388
$$ 289161 289545 289678 290802 292635 294067 294782 294974 294404 293111 292327 293252 295503 297948 300403 303346 306734
56331C06734L598M151M806M536L562L387M362N237N425N559N427L837J089p23
$$ 306734 310332 314483 319289 323825 327387 330774 335136 340373 345798 351357 356784 360621 361710 360987
56317C60987o85j49j99k47J71M28M32J099K405L015K590K402L107L883M353N232
$$ 360987 360302 360153 359954 359707 359878 360306 360738 361837 364242 367257 369847 372249 375356 379239 383592 388824
56301C88824O561P456Q018R169J0346R767P490N575M827M098L285L877N797O777
$$ 388824 395385 402841 410859 420028 430374 440141 447631 453206 458033 462131 465416 469293 475090 481867
56287D81867O038N620O839Q364R077R936J1544J2665J2703J2986J4132J4794J4470
$$ 481867 487905 493525 500364 508728 517805 527741 539285 551950 564653 577639 591771 606565 621035
56274F21035J4856J6821J8728J9345J9830K1184K2437K3090K4638K7833L0971
$$ 621035 635891 652712 671440 690785 710615 731799 754236 777326 801964 829797 860768
56263H60768L2894L5146L9192M3991M8357N3306N9956O7309P4340Q2148R1955
$$ 860768 893662 928808 968000 1011991 1060348 1113654 1173610 1240919 1315259 1397407 1489362
56252A489362J02983J14275J26657J40846J55576J69428J82626J95328K06159
$$ 1489362 1592345 1706620 1833277 1974123 2129699 2299127 2481753 2677081 2883240
56243B883240K14185K20172K24124K23817K17656K06750J92270J72829J46625
$$ 2883240 3097425 3317597 3541721 3765538 3983194 4189944 4382214 4555043 4701668
56234D701668J14170P7169L6801n018m4881q0503j12244j40498j63822j81289
$$ 4701668 4815838 4893007 4929808 4924790 4879909 4799406 4687162 4546664 4382842 4201553
56224D201553j94233k03701k08646k08591k05534k01114j94319j84296j72913
$$ 4201553 4007320 3803619 3594973 3386382 3180848 2979734 2785415 2601119 2428206
56215B428206j62131j51209j38952j26595j15860j06338r7085q8727q1699p4570
$$ 2428206 2266075 2114866 1975914 1849319 1733459 1627121 1530036 1441309 1359610 1285040
56205A285040o6534n9381n4616n0768m6006m1153l7573l4330l0110k5944k3327
$$ 1285040 1218506 1159125 1104509 1053741 1007735 966582 929009 894679 864569 838625 815298
56194H15298k1487j9096j6794j5525j4283j2016r936r457r613q874p670o984o232
$$ 815298 793811 774715 757921 742396 728113 716097 706161 696704 687091 678217 670547 663563 657331
56181F57331m774l557l245k750j509r37j729k243j533j225k254k670j010J005
$$ 657331 652557 649000 645755 643005 641496 640559 638830 636587 635054 633829 631575 628905 627895 628900
56167F28900J587J719K445K589J703K038M659O972P055P047Q978J0857J0547J0010
$$ 628900 630487 632206 634651 637240 638943 640981 645640 652612 659667 666714 675692 686549 697096 707106
56153G07106J1806J4504J5713J6610J9355K2880K5373K8105L2660L7262M0121
$$ 707106 718912 733416 749129 765739 785094 807974 833347 861452 894112 931374 971495
56142I71495M3551N0245N8247O4206O9019P5439Q2551Q7331Q9338Q9141Q4571
$$ 971495 1015046 1065291 1123538 1187744 1256763 1332202 1414753 1502084 1591422 1680563 1765134
56131A765134P3723N9787M8045L9864L3940L0958L1812L3094K9721K0950R596
$$ 1765134 1838857 1898644 1946689 1986553 2020493 2051451 2083263 2116357 2146078 2167028 2176624
56120B176624k740j5185k4680k8661k9315l0823l4277l9308m7882o1202p5161
$$ 2176624 2173884 2158699 2134019 2105358 2076043 2045220 2010943 1971635 1923753 1862551 1787390
56109A787390q4216q7926q8868q6676p9627o9863o1160n3275m3934l4512k8083
$$ 1787390 1703174 1615248 1526380 1439704 1360077 1290214 1229054 1175779 1131845 1097333 1069250
56098A069250k3695j8345j2864j0129r101o474k706o90r6J438L151K851J935L083
$$ 1069250 1045555 1027210 1014346 1004217 995116 988642 985936 985246 985150 986588 989739 992590 994525 997608
56084I97608M966M911M609P096J0433J0795R540J0563J2839J2627J0956J1743
$$ 997608 1002574 1007485 1012094 1019190 1029623 1040418 1049958 1060521 1073360 1085987 1096943 1108686
56072A108686J4270J4853J4223J5856J8588J8498J6619J7181J9623J9959J8706
$$ 1108686 1122956 1137809 1152032 1167888 1186476 1204974 1221593 1238774 1258397 1278356 1297062
56061A297062J9575K1674K1044J8732J9111K1272K0380J6744J5153J5998J5494
$$ 1297062 1316637 1338311 1359355 1378087 1397198 1418470 1438850 1455594 1470747 1486745 1502239
56050A502239J3918J5090J8262J9028J7795J8885K1974K3019K2856K5943L1285
$$ 1502239 1516157 1531247 1549509 1568537 1586332 1605217 1627191 1650210 1673066 1699009 1730294
56039A730294L3638L3170L4696L8091L8863L7536L8835M2181M2871M1942M4669
$$ 1730294 1763932 1797102 1831798 1869889 1908752 1946288 1985123 2027304 2070175 2112117 2156786
56028B156786M9917N1511M9668N0290N3363N3232N0124M9960N2788N3124N1783
$$ 2156786 2206703 2258214 2307882 2358172 2411535 2464767 2514891 2564851 2617639 2670763 2722546
56017B722546N5255O3030O7727O8425P1546P7975Q1894Q3076Q7445R4727R8485
$$ 2722546 2777801 2840831 2908558 2976983 3048529 3126504 3208398 3291474 3378919 3473646 3572131
56006C572131R9188J03940J12638J18077J20345J26890J37728J45367J49964J59217
$$ 3572131 3671319 3775259 3887897 4005974 4126319 4253209 4390937 4536304 4686268 4845485
55996D845485J72644J81897J87377J97926K13440K25185K33997K49653K71310
$$ 4845485 5018129 5200026 5387403 5585329 5798769 6023954 6257951 6507604 6778914
55987F778914K88110L00501L20497L49050L74576L96145M25740M64901N02275
$$ 6778914 7067024 7367525 7688022 8037072 8411648 8807793 9233533 9698434 10200709
55978A0200709N37370N82572O38555O93055P47289Q16796R02784R91334J084601
$$ 10200709 10738079 11320651 11959206 12652261 13399550 14216346 15119130 16110464 17195065
55969A7195065J202216J348046J508677J689073J914146K190853K508051K879289
$$ 17195065 18397281 19745327 21254004 22943077 24857223 27048076 29556127 32435416
55961C2435416L343709L920500M609894N442023O466225P682552R046725J0556367
$$ 32435416 35779125 39699625 44309519 49751542 56217767 63900319 72947044 83503411
55953H3503411J2270433J4244865J6538271J9285138K2649418K6685594L1334166
$$ 83503411 95773844 110018709 126556980 145842118 168491536 195177130 226511296
55946B26511296L6400223M1046158M3072909L9289448K7615412R353442j0832026
$$ 226511296 262911519 303957677 347030586 386320034 413935446 423288888 412456862
55939D12456862k7600407l7898412m1767999m1039914l7726568l3316173k8748256
$$ 412456862 384856455 346958043 305190044 264150130 226423562 193107389 164359133
55932A64359133k4505297k0728342j7418017j4576035j2188146j0187196q504132
$$ 164359133 139853836 119125494 101707477 87131442 74943296 64756100 56251968
55925E6251968p110634n978713n048681m269370l627545l111197k682970k313349
$$ 56251968 49141334 43162621 38113940 33844570 30217025 27105828 24422858 22109509
55917B2109509k003824j755217j545437j357424j198126j071458r60718q54537
$$ 22109509 20105685 18350468 16805031 15447607 14249481 13178023 12217305 11362768
55909A1362768p63395o94285o33876n71894n17549m78162m43475m05241l71587
$$ 11362768 10599373 9905088 9271212 8699318 8181769 7703607 7260132 6854891 6483304
55900F483304l48446l26172k97619k71241k53954k38231k17930k00263j90579
$$ 6483304 6134858 5808686 5511067 5239826 4985872 4747641 4529711 4329448 4138869
55891D138869j81054j65732j51766j45068j38964j27485j16270j10183j03388
$$ 4138869 3957815 3792083 3640317 3495249 3356285 3228800 3112530 3002347 2898959
55882B898959r1609q1846q0172q1457q0139p9630q2360q1996p4579o6838o4817
$$ 2898959 2807350 2725504 2645332 2563875 2483736 2404106 2321746 2239750 2165171 2098333 2033516
55871B033516o4396o1047n8708o0814o2347n9117n5558n5557n4611m8841m2937
$$ 2033516 1969120 1908073 1849365 1788551 1726204 1667087 1611529 1555972 1501361 1452520 1409583
55860A409583m1407m0459l6086l1975l1806l1703k7691k3204k2107k1557j8645
$$ 1409583 1368176 1327717 1291631 1259656 1227850 1196147 1168456 1145252 1123145 1101588 1082943
55849A082943j6882j9220k1709k0769j9845k2272k4393k2435j9576j9595j9902
$$ 1082943 1066061 1046841 1025132 1004363 984518 962246 937853 915418 895842 876247 856345
55838H56345j7437j5220j6413j7823j5832j3141j3270j3887j1866r567r901j0335
$$ 856345 838908 823688 807275 789452 773620 760479 747209 733322 721456 711889 701988 691653
55826F91653p926n318n749o999o096n291p445j0138j0160r396j0577j1668j0042
$$ 691653 683727 678409 672660 665661 659565 654274 646829 636691 626531 617135 606558 594890 584848
55813E84848p929q138q535o274l457l056l215j110J360J313O41K544N630O778
$$ 584848 576919 568781 560246 553972 550515 547459 544244 543134 544494 545807 546448 548992 554622 561400
55799E61400O766P938R140P910N012K352p71n190q817j0095j1225j3911j5490
$$ 561400 568166 576104 585244 593154 598166 600518 599747 594557 585740 575645 564420 550509 535019
55786E35019j3522j0523r600r126o475l679m235p272r711j1425j3630j4839j3166
$$ 535019 521497 510974 501374 492248 485773 482094 477859 470587 460876 449451 435821 420982 407816
55773D07816j0223q394o695l460m37k5r76r91q24j905k678j540n78k073m140m152
$$ 407816 397593 389199 382504 379044 378607 378582 377606 376615 375791 373886 371208 369668 369090 367017 362877 358725
55757C58725l589n007o901o414m641m454n302m927m125m979o333n682l920l691
$$ 358725 355136 350129 343228 336814 332173 327719 322417 317490 313365 308386 302053 296371 292451 288760
55743B88760m644m699m300n056n788m396k184j931l028k834j537j361k095j701
$$ 288760 284116 279417 275117 270061 264273 259877 257693 255762 252734 249900 248363 247002 244907 243206
55729B43206m08j59q53r57r49k367m370m864m161m039m252l446k385k681l407
$$ 243206 242798 242639 241786 240829 239880 237513 233143 228279 224118 220079 215827 212381 209996 207315 203908
55714B03908k551p77k06n68j13P86N46j27O28K103K090Q64N28J087P55m28q45
$$ 203908 201357 200580 200374 199806 199693 200479 201025 200898 201526 203629 205719 206583 207111 208198 208953 208525 207680
55697B07680o46j482l190l983l572l195k966k079j105j205j716j154M4M42L92
$$ 207680 207034 205552 202362 198379 194807 191612 188646 186567 185462 184257 182541 181387 181431 181873 182265
55682A82265J151K182K121J554J983K959L003K373K189J851K18j792k581k642
$$ 182265 183416 185598 187719 189273 191256 194215 197218 199591 201780 203631 203849 202057 199476 196834
55668A96834l133l104j248J012J493R60J477K424J844M89O86K104K577K261L019
$$ 196834 193701 190597 189349 190361 191854 192814 194291 196715 198559 199048 199734 201838 204415 206676 209695
55653B09695M310L811J776Q20J538K030J638J361Q39j312m146n213m804n536p562
$$ 209695 214005 217816 219592 220412 221950 223980 225618 226979 227818 226506 222360 217147 212343 206807 199245
55638A99245q132o355m598m355m357l654l190l287k714j303o59j263j563p62Q5
$$ 199245 191113 184758 180160 175805 171448 167794 164604 161317 158603 157300 156641 155378 153815 153053 153138
55623A53138M01R56J759J616M48m24p41j566k761k868j926j696k481k552j407
$$ 153138 153539 154495 156254 157870 158318 157894 157153 155587 152826 149958 148032 146336 143855 141303 139896
55608A39896q35j755k607k039q48j49L10R20J165Q42O62Q59P15n5q40j391k051
$$ 139896 139061 137306 134699 132660 131812 131663 131973 132893 134058 134900 135562 136421 137136 137081 136241 134850 132799
55591A32799k648k622k239k126j929j128n67j145j693n30J483K110J411J375K227
$$ 132799 130151 127529 125290 123164 121235 120107 119540 118395 116702 116172 117655 119765 121176 122551 124778
55576A24778K270J339J118J771J566M42O20K761M639M772M441M847M939L569J468
$$ 124778 127048 128387 129505 131276 132842 133284 133904 136665 141304 146076 150517 155364 160303 163872 165340
55561A65340l22j929l363l759l093k728l261l592l022k417k476k683k709l003
$$ 165340 165018 163089 159726 155967 152874 150146 146885 143293 140271 137854 135378 132695 129986 126983
55547A26983l323k656j142k05j68J17P77M69r18j517m80N87L21m17m51j19k4J59
$$ 126983 123660 121004 119862 119657 119489 119606 120383 120852 119934 118417 117937 118524 118845 118428 117977 117858 117834 117993
55529A17993M36o5j340j975j446j096j761k331j786r38p93r31o88m62o03m76K78
$$ 117993 118429 118364 117024 115049 113603 112507 110746 108415 106629 105691 104898 103967 103279 102817 102214 101738 102016
55512A02016R07Q80O82M84l61j742k343j717j098j272j321n04L52M61M52R43J292
$$ 102016 102923 103803 104485 104969 104608 102866 100523 98806 97708 96436 95115 94611 94963 95424 95876 96819 98111
55495I8111R42N81Q04R16K51o51j150j557k103k150j336l05M86J400K372K563
$$ 98111 99053 99634 100438 101354 101605 100954 99804 98247 96144 93994 92658 92353 92839 94239 96611 99174
55479I9174J917J619K111K296J564Q94J010J045K42o01o10l47o36j141j315j546
$$ 99174 101091 102710 104821 107117 108681 109575 110585 111630 111872 111271 110661 110314 109678 108537 107222 105676
55463A05676k261k964l100k828k204r05N32P28m11j105k94Q14Q43L16L40P02P04
$$ 105676 103415 100451 97351 94523 92319 91414 91946 92674 92263 91158 90864 91678 92521 92837 93177 93879 94583
55446I4583O43J030J396J145O88N39K59n96j329j067n2Q58J245J053L60k31L2
$$ 94583 95226 96256 97652 98797 99485 100024 100283 99687 98358 97291 97239 98097 99342 100395 100755 100524 100556
55429A00556P67Q01J32pN49L19j259k584k342j467j276j262l12J182J964J756
$$ 100556 101323 102124 102256 102249 102798 103117 101858 99274 96932 95465 94189 92927 92615 93797 95761 97517
55413I7517J118L85j94q4O79J176R32N88N35J47q32j485j183o13m95n31m56p10
$$ 97517 98635 99020 98826 98742 99421 100597 101529 102117 102652 102799 101967 100482 99299 98686 98191 97660 97204 96494
55395I6494j249j184m57k44q30q97J0L24q39j811r13Q60J549J171R50R77N99J07
$$ 96494 95245 94061 93604 93360 92530 91633 91643 91967 91128 89317 88404 89264 90813 91984 92934 93911 94510 94617
55377I4617J54L58Q5k17J2J35m76r81m64K26k54j494k027j545q48l01J84L14k0
$$ 94617 94771 95129 95214 94997 95009 95144 94668 93687 93223 93449 93195 91701 89674 88129 87281 86980 87164 87478 87458
55358H7458n0P37J534J476J033R21P35no10m42k84r10j467q71K96Q93J076J311
$$ 87458 87408 88145 89679 91155 92188 93109 93844 93839 93229 92787 92503 91593 90126 89255 89551 90444 91520 92831
55340I2831R15n35j534o59Q51Q37l34n52L90O53l91j253r49l40m03r47j461j755
$$ 92831 93746 93211 91677 91018 91869 92706 92372 91820 92210 92863 92472 91219 90270 89930 89527 88580 87119 85364
55322H5364j529n49O27J215J361J678J965J657J084R36R33L97k99l93k75p95j480
$$ 85364 83835 83286 83913 85128 86489 88167 90132 91789 92873 93809 94742 95139 94840 94447 94172 93377 91897
55305I1897j102K03J105J093Q16N58M8m37l43q0n25j298j138J04J288J710J623
$$ 91897 90795 90998 92103 93196 94012 94570 94618 94181 93838 93758 93233 91935 90797 90901 92189 93899 95522
55288I5522J175L17l40m0P58R05K82k73n43r20j158o37J94K58l54n78k68l38r27
$$ 95522 96697 97014 96674 96634 97392 98297 98579 98306 97763 96843 95685 95048 95242 95500 95146 94568 94300 93962 93035
55269I3035j088m21M29J031J513J648R84Ok46K22M86L81N63R54P08j13m59p8J00
$$ 93035 91947 91526 91955 92986 94499 96147 97131 97137 96891 97113 97599 97980 98543 99497 100205 100092 99633 99555 99655
55250I9655l43p58q28j026j354j033k6N59L1r67j556j567j103k62M40M29L5O5
$$ 99655 99312 98554 97726 96700 95346 94313 94287 94846 94877 93910 92354 90787 89684 89422 89862 90291 90326 90391
55232I0391L99K18l66l60L25N85jm45rP21R20N95N7n94j045p96kN26M11m7o41
$$ 90391 90790 91008 90642 90282 90607 91192 91191 90746 90737 91458 92378 92973 93030 92436 91391 90595 90593 91119 91530 91483 90842
55211I0842j255j178J71J858K188J026k8m1K12k7k79QM87O96P76P54L49j82j22
$$ 90842 89587 88409 88580 90438 92626 93652 93624 93583 93795 93768 93489 93497 93984 94680 95456 96210 96559 96377 96255
55192I6255L22P3r61j488r00l12o96j380j319o81q4O01J650K555K766K546K231
$$ 96255 96577 96650 95689 94201 93301 92989 92293 90913 89594 88913 88829 89430 91080 93635 96401 98947 101178
55175A01178J435%j121r79m1N03L63J53K17L49M36N14M26M0l13k03K86O97P32
$$ 101178 102613 102613 101492 100513 100472 100975 101338 101491 101708 102057 102493 103007 103433 103473 103160 102957 103243 103940 104672
55156A04672L88j81o56p25m71k26j9L39N83J33r06j598j399q08m99m41l11j65
$$ 104672 105060 104879 104223 103498 103027 102801 102782 103121 103704 103837 102931 101333 99934 99126 98627 98186 97875 97710
55138I7710j97k58j07K54P44J343J846J898J465Q54J86o10j270j335r08o34p26
$$ 97710 97513 97255 97148 97402 98146 99489 101335 103233 104698 105552 105738 105128 103858 102523 101615 100981 100255
55121A00255p02k84J64L35M39O68P77N85L05J21r7l80m61j84L12R36J625J968
$$ 100255 99553 99269 99433 99768 100207 100875 101652 102237 102542 102663 102566 102186 101725 101541 101853 102789 104414 106382
55103A06382J527O49K65O80J175J034L91j22q9M96J243J493R33J15j69K3o3o66
$$ 106382 107909 108558 108823 109503 110678 111712 112103 111981 111892 112388 113631 115124 116057 116172 116003 116026 115963 115297
55085A15297j171r67r7R84J710J607Q09J65K91P38Q39Q13J131J291M95p56j148
$$ 115297 114126 113159 113062 114046 115756 117363 118172 118337 118628 119366 120205 121018 122149 123440 123935 123179 122031
55068A22031n33k4j63l48k48l20o88q21o88r20j510j611j015n34n35l76K43O61
$$ 122031 121498 121474 121311 120963 120715 120395 119707 118886 118198 117278 115768 114157 113142 112608 112073 111697 111940 112601
55050A12601M48O2j72n53j036j010n25m25q10o71L06R98O22p7k48k16m93o90l90
$$ 112601 113049 113111 112939 112386 111350 110340 109815 109390 108580 107909 108215 109213 109835 109758 109510 109294 108801 108111 107721
55031A07721k9jN6L01J60m07m22M10P92j30j119o38P47J279N27m29p35l62N71
$$ 107721 107692 107691 107747 108048 108208 107801 107379 107789 108581 108451 107332 106694 107441 108720 109247 108818 108083 107721 108292
55012A08292J782K487K149J270N47j34j014j470q83O3J99m51q78n76J90J219K279
$$ 108292 110074 112561 114710 115980 116527 116393 115379 113909 113026 113089 113288 112837 111959 111383 111573 112792 115071
54995A15071K569J439m08j516j316m00N92J386J615J010L1n43n84n93p70q69p85
$$ 115071 117640 119079 118671 117155 115839 115439 116031 117417 119032 120042 120073 119530 118946 118353 117583 116714 115929
54978A15929n94j76N35J101J076P26O34Q05P86M29p0o18j056q55K54J526J813
$$ 115929 115335 115159 115694 116795 117871 118597 119231 120036 120822 121251 121181 120563 119507 118652 118906 120432 122245
54961A22245R00l26r10n95K11P53M48m41r20n14N0o8n82n96mM43K55k88o50n19
$$ 122245 123145 122819 121909 121314 121525 122278 122726 122285 121365 120851 120901 120833 120251 119655 119651 120094 120349 120061 119411 118892
54941A18892P7O51N88j1k31M21J161R96K21N6J015K423L423L747L537L033K597
$$ 118892 118969 119620 120208 120197 119966 120387 121548 122544 122765 122821 123836 126259 129682 133429 136966 139999 142596
54924A42596K615L269M507O046P327P859P846P955Q266P944O336L798J105j365
$$ 142596 145211 148480 152987 159033 166360 174219 182065 190020 198286 206230 212566 216364 217469 216104
54910B16104l446m918n958p147q407q699p455n586m334l771l356l158l409l420
$$ 216104 212658 207740 201782 194635 186228 177529 170074 164488 160154 156383 153027 149869 146460 143040
54896A43040k291m52O31L54m34p05k46N82J278J349P79L84J055K545L683L754
$$ 143040 140749 140297 140928 141282 140848 140143 139897 140479 141757 143106 143885 144269 145324 147869 151552 155306
54880A55306L134K626K766L769N506P327Q428Q532P918O823N105K620l70l232
$$ 155306 158440 161066 163832 167601 173107 180434 188862 197394 205312 212135 217240 219860 219490 216258
54866B16258n359o646p489q198q470p883o719n746n199m675m059l658l286k272
$$ 216258 210899 204253 196764 188566 180096 172213 165494 159748 154549 149874 145815 142157 138871 136599
54852A36599p67l5p89k094k591k073j246o51n26j011j762j966j381p48o75q14
$$ 136599 135832 135797 135008 132914 130323 128250 127004 126353 125827 124816 123054 121088 119707 118959 118284 117470
54836A17470p03n32m67j29N58R00O07M07P65J005O25L53P36R26J34p50n05L52
$$ 117470 116767 116235 115768 115639 116197 117097 117704 118111 118876 119881 120506 120859 121595 122521 122655 121905 121400 121752
54818A21752M52k13n90m40k97r2N57J093P62K00N95J572J691Q57L95P29Q25J74
$$ 121752 122204 121991 121401 120961 120664 120572 121129 122222 122984 123184 123779 125351 127042 127899 128294 129023 129848 130022
54800A30022m14l83k22k51oO23R39N53j0k99m34m19l6L67J30m80l76O26J385J116
$$ 130022 129608 129225 129003 128752 128746 129369 130308 130861 130851 130552 130118 129699 129663 130030 130160 129680 129304 129930 131315 132431
54780A32431L75k4l7J61P28J611K281K542K873L583M296M703N082N724O408O870
$$ 132431 132806 132782 132745 132906 133634 135245 137526 140068 142941 146524 150820 155523 160605 166329 172737 179607
54764A79607P272P885Q693R339R172P490M348Q54j917m071o194q038q880q847
$$ 179607 186879 194764 203457 212796 221968 229458 233806 234660 232743 228672 222478 214440 205560 196713
54750A96713q684q413p449n945m688l739k517j241q50j292j375p34m66j293k345
$$ 196713 188029 179616 172167 166222 161534 157795 155278 154037 153187 151895 150520 149786 149320 148027 145682
54735A45682k440j549l57O65J204J109R19J507K844L998M612N257O016O089N365
$$ 145682 143242 141693 141336 142001 143205 144314 145233 146740 149584 153582 158194 163451 169467 175556 180921
54720A80921N116O171P537P690O387M319J823r83l533n197o066o600o933o980
$$ 180921 186037 192208 199745 207435 213822 218141 219964 218981 215448 210251 204185 197585 190652 183672
54706A83672o813o397n473m173l168k828k766k583k399k242j702p39r3k49o79
$$ 183672 176859 170462 164989 160816 157648 154820 152054 149471 147072 144830 143128 142389 142296 142047 141368
54691A41368p22n99q28j217j224r52r82j405j680j366o18j4r1q81j752j927j305
$$ 141368 140646 140047 139219 138002 136778 135826 134844 133439 131759 130393 129775 129761 129670 128789 127037 125110 123805
54674A23805m85jN3k57p69j002n40L26Q91R68Q60N51k01r38p69K45R57P32K51
$$ 123805 123320 123319 123372 123115 122346 121344 120804 121130 122021 122989 123849 124400 124199 123261 122492 122737 123694 124426 124677
54655A24677L18P91J080R63M38l97j029q25j9M40K63J79N51P30K56k91k75M6K04
$$ 124677 124995 125786 126866 127829 128267 127870 126841 126016 125997 126437 126700 126879 127430 128160 128416 128125 127850 127896 128100
54636A28100L17N58O21L28K6j02m11r55j150p98n73q15q09k3Q14P54N5l39j64
$$ 128100 128417 128975 129596 129924 129950 129848 129437 128482 127332 126534 125961 125146 124337 124314 125128 125882 125937 125598 125434
54617A25434J67L93M51J44m89q68n39K44R93J519J575P35q11j969j912j000p1
$$ 125434 125601 125994 126445 126589 126100 125232 124693 124937 125930 127449 129024 129759 128948 126979 125067 124067 123996
54600A23996N68R74J173J435K097K668K031J62j409j601j136j040j000l54L33
$$ 123996 124564 125538 126711 128146 130243 132911 134942 135104 133695 132094 130958 129918 128918 128564 128897
54585A28897K16j47L88J454J544K83r81j053j89O05O97J46m98o38l18j91m91n95
$$ 128897 129113 128966 129354 130808 132352 132635 131654 130601 130412 131017 131714 131860 131362 130724 130406 130215 129724 129129
54567A29129q7M13L29J97O94J219P25m38q53m4R74J198O55j47q24j170j237j437
$$ 129129 129042 129455 129784 129981 130675 131894 132619 132181 131328 131284 132258 133456 134111 133964 133140 131970 130733 129296
54549A29296j897j939r48N29J370J379J263J323J155O87N23R97J640J845J480
$$ 129296 127399 125460 124512 125041 126411 127790 129053 130376 131531 132218 132741 133738 135378 137223 138703
54534A38703P70N3k81j37R0M6J3L94Q15N15m64j147q40J17R08J126R38O60L53
$$ 138703 139473 139526 139245 139108 139198 139244 139257 139651 140466 140981 140517 139370 138530 138647 139555 140681 141619 142279 142632
54515A42632j69q94j294q80o4K13j94m54j81o8n61r17m05M18O10K94K05L11M4
$$ 142632 142463 141569 140275 139395 139331 139544 139350 138896 138715 138647 138086 137169 136764 137182 137792 138086 138291 138602 138646
54496A38646n71j002j089r55m46M80J194J201R64J058J076M68k00o7M62L86q8
$$ 138646 138075 137073 135984 135029 134583 135063 136257 137458 138422 139480 140556 141024 140824 140757 141219 141605 141517
54479A41517K4O31O68L1k94k6K8l25k12P17J633J928J982K025J607P26L09Q11
$$ 141517 141541 142172 142840 142871 142577 142551 142579 142254 142042 142759 144392 146320 148302 150327 151934 152660 152969 153780
54461A53780J424J330P77L28o3n06o65m56n01j107j602j354p61m98m77l28k84
$$ 153780 155204 156534 157311 157639 157576 157070 156405 155949 155448 154341 152739 151385 150624 150126 149649 149321 149037
54444A49037o62r59m28O51J156N80l83p86n01j16q8k28r7K26J37n27r48l31P84
$$ 149037 148375 147416 146988 147639 148795 149375 148992 148206 147705 147589 147501 147273 147176 147402 147539 147012 146064 145733 146517
54425A46517J080K77m69k06O55J218J385J587J800J523N62p14j813k441k450j805
$$ 146517 147597 147874 147405 147199 147854 149072 150457 152044 153844 155367 155929 155215 153402 150961 148511 146706
54409A46706o05Q33J958K124J061o57j918j917o65J163K638L069K507J688J225
$$ 146706 146101 146934 148892 151016 152077 151420 149502 147585 146920 148083 150721 153790 156297 157985 159210
54394A59210J009P12N34Q49J357J312N56k86o73n99k58J62K76j84q52j065p83
$$ 159210 160219 160931 161465 162314 163671 164983 165539 165253 164580 163981 163723 163885 164161 163977 163125 162060 161277
54377A61277m95l08J63R13J355J276J261J819K646L081K852K192J630J782K860
$$ 161277 160782 160474 160637 161550 162905 164181 165442 167261 169907 172988 175840 178032 179662 181444 184304
54362A84304M250N006M851M237L427K226O23r46k140k968l395l312k973k857l013
$$ 184304 188554 193560 198411 202648 206075 208301 208924 207978 205838 202870 199475 196163 193190 190333 187320
54347A87320l126l154l197k854j677l29j67j413k676k789k103j495j102p27n72
$$ 187320 184194 181040 177843 174989 173312 172983 172816 171403 168727 165938 163835 162340 161238 160511 159939
54332A59939p26o02K39J208J427Q95K65j54m31m69k00n8m56j007r14j59M26K36
$$ 159939 159213 158611 158850 160058 161485 162380 162645 162491 162060 161591 161391 161333 160877 159870 158956 158797 159223 159459
54314A59459m19q78r21q49r80j197j014k29O10O94j1o55o22k27m4QL51Q86J043
$$ 159459 159040 158162 157241 156392 155412 154215 153201 152972 153582 154276 154265 153610 152988 152761 152717 152725 153076 153962 155005
54295A55005O40J75J54M45M97O0m34l39L85J027R24K79j54J6N71J201J765K092
$$ 155005 155645 155820 155974 156419 156916 156976 156542 156203 156588 157615 158539 158818 158664 158680 159251 160452 162217 164309
54277A64309J958J409P28J01l57m09k9K01l02j157j337n95J97L31J87M92J276
$$ 164309 166267 167676 168404 168505 168148 167739 167710 167911 167609 166452 165115 164520 164717 165048 165235 165727 167003
54260A67003J971K107J579O38n7J43J082J760J392K72o69q18k71L86M98j65j197
$$ 167003 168974 171081 172660 173298 173241 173384 174466 176226 177618 177890 177221 176403 176132 176518 177016 176851 175654
54243A75654k016k467k625k328j467n64k39j99L82J430J869J175Q3m96m38M3Q72
$$ 175654 173638 171171 168546 166218 164751 164187 163948 163749 164131 165561 167430 168605 168688 168192 167754 167797 168669
54226A68669J708J945J583J296J267Q57j13p97o70m62r50j717j999j900j761j176
$$ 168669 170377 172322 173905 175201 176468 177325 177212 176415 175745 175283 174333 172616 170617 168717 166956 165780
54210A65780J72J377J280K03n37n31n14q31r56o24k95k50j46K01M16K85J97N02
$$ 165780 165952 167329 168609 168812 168275 167744 167230 166399 165443 164819 164524 164274 164128 164329 164745 165030 165227 165729
54192A65729R27R60M76k80r83j334j224q85o41m50j1P26J507K181K755K994K439
$$ 165729 166656 167616 168092 167812 166829 165495 164271 163386 162745 162295 162284 163010 164517 166698 169453 172447 174886
54175A74886J094k54p31k69M40P87P84O92M42k37j138j547j160o45p84j326j367
$$ 174886 175980 175726 174995 174726 175166 175953 176737 177429 177871 177634 176496 174949 173789 173144 172360 171034 169667
54158A69667p20j38j27l20l57n30j091j534j230l66L05M42L20L35O07R84J098
$$ 169667 168947 168809 168682 168362 168005 167475 166384 164850 163620 163254 163559 164001 164321 164656 165263 166247 167345
54141A67345O98P9j50J28M01L72L66N82O24K17j81n4L47M35J27k37n09o31l65
$$ 167345 168043 168122 167972 168100 168501 168873 169239 169821 170445 170662 170481 170427 170774 171209 171336 171099 170590 169959 169594
54122A69594L57J052J235J015P84O37N65P86J308J613J345R64J027J261J077O68
$$ 169594 169951 171003 172238 173253 174037 174674 175239 176025 177333 178946 180291 181255 182282 183543 184620 185288
54106A85288O97J173J506J558J769K253K600K688K826K914K286P63q10j561j711
$$ 185288 185985 187158 188664 190222 191991 194244 196844 199532 202358 205272 207558 208321 207511 205950 204239
54091B04239k118k942l377k743j441m69j47J88J054J921K014J660J918K758K717
$$ 204239 202121 199179 195802 193059 191618 191149 191002 191190 192244 194165 196179 197839 199757 202515 205232
54076B05232R04j458k387j526k54L19N34J215K292K812K110N91o90j176j281j543
$$ 205232 206136 204678 202291 200765 200511 200830 201364 202579 204871 207683 209793 210384 209694 208518 207237 205694
54060B05694j681j122k19L1m20m35M91J280Q88m5j84N91J369J817K293K649K216
$$ 205694 204013 202891 202672 202703 202283 201848 202339 203619 204507 204462 204278 204869 206238 208055 210348 212997 215213
54043B15213J193Q55J930L586M526M600M764N645O685O920O359O091O756P372
$$ 215213 216406 217261 219191 222777 227303 231903 236667 242312 248997 255917 262276 268367 275123 282495
54029B82495O501M318K506J966J847J325R56J384J805J060n08j596j851j936k095
$$ 282495 288996 293314 295820 297786 299633 300958 301914 303298 305103 306163 305655 304059 302208 300272 298177
54014B98177j995j816k195l068l693l896m202m683m745m192l521l007k443j937
$$ 298177 296182 294366 292171 289103 285410 281514 277312 272629 267884 263692 260171 257164 254721 252784
54000B52784k004k585k933k752k592k772k738j957q25j73m00j319k432l064k780
$$ 252784 250780 248195 245262 242510 239918 237146 234408 232451 231626 231453 231053 229734 227302 224238 221458
53985B21458j874j122q88q60p20n33l98j78K02N74P72P90P04O78R64J557K060
$$ 221458 219584 218462 217574 216714 215994 215461 215063 214885 215087 215661 216433 217223 217927 218605 219569 221126 223186
53968B23186K266K536L195L897M227M541N466O839P897Q290Q069P005M793J830
$$ 223186 225452 227988 231183 235080 239307 243848 249314 256153 264050 272340 280409 287414 292207 294037
53954B94037j052l489n435o395n924m615l531k733j537p7P63R96J713L265M595
$$ 294037 292985 289496 284061 277666 271742 267127 263596 260863 259326 259249 260012 261008 262721 265986 270581
53939B70581M854M532M450M666M917N176N225M673L791L392L417K738J002n13
$$ 270581 275435 279967 284417 289083 294000 299176 304401 309074 312865 316257 319674 322412 323414 322901
53925C22901n71N17J835L248M797N720N342M362M086M736N544O108O624O998O826
$$ 322901 322330 322847 324682 327930 332727 338447 343789 348151 352237 356973 362517 368625 375249 382247 389073
53910C89073O215N768N618N191M049K453R75o0o82j146j727k460l131l618l995
$$ 389073 395288 401056 406674 411865 415914 418367 419342 419282 418600 417454 415727 413267 410136 406518 402523
53895D02523m250m222m049m281n271o714q050q970r327q958p948o816o077n767
$$ 402523 398273 394051 390002 385721 380450 373736 365686 356716 347389 338431 330483 323667 317590 311823
53881C11823n597n333m905m383l975l817l737l505l251l280l506l553l389l269
$$ 311823 306226 300893 295988 291605 287630 283813 280076 276571 273320 270040 266534 262981 259592 256323
53867B56323l150k784k355k323k574k543k235k268k727k894k374j590q87q0O53
$$ 256323 253173 250389 248034 245711 243137 240594 238359 236091 233364 230470 228096 226506 225619 225539 226192
53852B26192N50m83j351j257q73j115j558j115K33J304J155q4j550k291j871q67
$$ 226192 226742 226259 224908 223651 222778 221663 220105 218990 219223 220527 221682 221598 220048 217757 215886 215019
53836B15019m53j003j612j334l89M23Q10Q55M30m30j032p17K39J112J723K288
$$ 215019 214566 213563 211951 210617 210228 210651 211461 212316 212746 212316 211284 210567 210806 211918 213641 215929
53820B15929K690K628K249J876J475J031J081J992L069L249K506J806J769K176
$$ 215929 218619 221247 223496 225372 226847 227878 228959 230951 234020 237269 239775 241581 243350 245526
53806B45526K720L391M065M379M214L858L698M032N017O282O831N929M021K339
$$ 245526 248246 251637 255702 260081 264295 268153 271851 275883 280900 287182 294013 299942 303963 306302
53792C06302J664J812K150K160J722J225J248J766K018J494O10j22j024k629m579
$$ 306302 307966 309778 311928 314088 315810 317035 318283 320049 322067 323561 324171 324049 323025 320396 315817
53777C15817n934o354o153n469m201k732j879k008k774l692m422m653m237l455
$$ 315817 309883 303529 297376 291907 287706 284974 283095 281087 278313 274621 270199 265546 261309 257854
53763B57854k694k027j523j570k271k905k755k176j968k044j661q49m35o28p36
$$ 257854 255160 253133 251610 250040 247769 244864 242109 239933 237965 235921 234260 233411 232976 232348 231612
53748B31612m99n81j272j674r19M74J171O05n45j209r00k4N54L84p6o5M98J050
$$ 231612 231113 230532 229260 227586 226667 227141 228312 228917 228372 227163 226263 226239 226793 227177 227101 227036 227534 228584
53730B28584J327J604J915J741Q44j92o40m50k7M55J063J745K395L091L881M384
$$ 228584 229911 231515 233430 235171 236015 235823 235183 234733 234706 235161 236224 237969 240364 243455 247336 251720
53714B51720M069K870J296j50j296k037k068j236K9J006J526K167L302M409M736
$$ 251720 255789 258659 259955 259805 258509 256472 254404 253168 253197 254203 255729 257896 261198 265607 270343
53699B70343M437M394M900N257M853M002L389L156K968K561J872R97L02K37O94
$$ 270343 274780 279174 284074 289331 294184 298186 301575 304731 307699 310260 312132 313129 313431 313668 314362
53684C14362J000P66K75k19q83j649j878j291n86n04q32j015j133j466j709j463
$$ 314362 315362 316128 316403 316184 315301 313652 311774 310483 309897 309393 308561 307546 306413 304947 303238 301775
53668C01775j095j168j458j353q50k64N18J504J854Q52p09j365q94j81M86J460
$$ 301775 300680 299512 298054 296701 295851 295587 296105 297609 299463 300315 299606 298241 297347 297166 297652 299112
53652B99112K257J789L42l83L19J194J058L97J69L26M74Q86J794K549K538K246
$$ 299112 301369 303158 303500 303117 303436 304630 305688 306085 306254 306580 307054 307940 309734 312283 314821 317067
53636C17067K413K753K451J502O25K94O37J791L482M629M356L269K816L472M309
$$ 317067 319480 322233 324684 326186 326811 327105 327742 329533 333015 337644 342000 345269 348085 351557 355866
53621C55866M362L662K848K382K369K647K852K746K525K587K969L271L209K920
$$ 355866 360228 363890 366738 369120 371489 374136 376988 379734 382259 384846 387815 391086 394295 397215
53607C97215K743K888L361L958M224L674K297Q26K89J038K247K636J840P83N08
$$ 397215 399958 402846 406207 410165 414389 418063 420360 421186 421475 422513 424760 427396 429236 430019 430527
53592D30527R43J199P59j45j065j698j839j605j595k170k693k291j266q47j391
$$ 430527 431470 432669 433428 433283 432218 430520 428681 427076 425481 423311 420618 418327 417061 416214 414823
53577D14823j915j754j570k110k864k908k325j885j724j326n20K87Q19J126J176
$$ 414823 412908 411154 409584 407474 404610 401702 399377 397492 395768 394442 393922 394209 395028 396154 397330
53562C97330Q57L81J29J12L7j27j05J68M42N25M35J69l03p65q19k94N97J422J815
$$ 397330 398187 398568 398697 398809 398846 398719 398614 398782 399224 399749 400184 400353 400050 399285 398466 398172 398769 400191 402006
53543D02006J785J855K628L940M841M703M058L859M241M631M825N252O142P113
$$ 402006 403791 405646 408274 412214 417055 421758 425816 429675 433916 438547 443372 448624 454766 461879
53529D61879P784Q264Q804R383R868J0298J0749J1219J1798J2702J3842J4640
$$ 461879 469663 477927 486731 496114 505982 516280 527029 538248 550046 562748 576590 591230
53517E91230J4612J4095J4014J4952J6633J8387J9873K1150K2257K3051K3558
$$ 591230 605842 619937 633951 648903 665536 683923 703796 724946 747203 770254 793812
53506G93812K4184K5312K6709K7592K7387K6222K4657K3066K1446J9765J8266
$$ 793812 817996 843308 870017 897609 924996 951218 975875 998941 1020387 1040152 1058418
53495A058418J7310J7016J7056J7009J6815J6846J7396J8228J8727J8486J7655
$$ 1058418 1075728 1092744 1109800 1126809 1143624 1160470 1177866 1196094 1214821 1233307 1250962
53484A250962J6800J6450J6747J7405J8001J8325J8360J8011J7097J5633J3759
$$ 1250962 1267762 1284212 1300959 1318364 1336365 1354690 1373050 1391061 1408158 1423791 1437550
53473A437550J1378Q330N158L085K613K567J241j665m917p421r252j0925j2446
$$ 1437550 1448928 1457258 1462416 1465501 1468114 1470681 1471922 1470257 1465340 1457919 1448667 1437742 1425296
53460A425296j3470j3885j3828j3494j3205j3380j4101j4962j5627j6267j7238
$$ 1425296 1411826 1397941 1384113 1370619 1357414 1344034 1329933 1314971 1299344 1283077 1265839
53449A265839j8464j9525k0153k0416k0389j9882j8626j6730j4792j3347j2180
$$ 1265839 1247375 1227850 1207697 1187281 1166892 1147010 1128384 1111654 1096862 1083515 1071335
53438A071335j0512q008n259l048j517m13K32K94J31L14Q87J563K493M096O157
$$ 1071335 1060823 1052815 1047556 1044508 1042991 1042578 1042810 1043104 1043235 1043549 1044436 1045999 1048492 1052588 1058745
53423A058745P836Q752R328R970J0592J1261J2529J4699J7243J9415K1040K2411
$$ 1058745 1066581 1075333 1084661 1094631 1105223 1116484 1129013 1143712 1160955 1180370 1201410 1223821
53411A223821K3712K4929K6068K7236K8615L0338L2188L3565L4186L4690L5896
$$ 1223821 1247533 1272462 1298530 1325766 1354381 1384719 1416907 1450472 1484658 1519348 1555244
53400A555244L7686L9346M0946M3405M6878N0108N1818N2100N1910N1893N2167
$$ 1555244 1592930 1632276 1673222 1716627 1763505 1813613 1865431 1917531 1969441 2021334 2073501
53389B073501N2702N3311N3654N3589N3244N2540N1128M8968M6416M3675M0718
$$ 2073501 2126203 2179514 2233168 2286757 2340001 2392541 2443669 2492637 2539053 2582728 2623446
53378B623446L7797L5193L2397K8517K3683J8989J4731R980M430p43m734q587
$$ 2623446 2661243 2696436 2728833 2757350 2781033 2800022 2814753 2824733 2829163 2828420 2823686 2815099
53366B815099j3675j9761k5825l1779l7847m3110m6269m7557m8313m8926m8759
$$ 2815099 2801424 2781663 2755838 2724059 2686212 2643102 2596833 2549276 2500963 2452037 2403278
53355B403278m7930m7522m7755m7438m5697m3134m0729l8603l6505l4715l3862
$$ 2403278 2355348 2307826 2260071 2212633 2166936 2123802 2083073 2044470 2007965 1973250 1939388
53344A939388l4167l5271l6431l6792l5882l4099l2278l0770k9282k7575k5774
$$ 1939388 1905221 1869950 1833519 1796727 1760845 1726746 1694468 1663698 1634416 1606841 1581067
53333A581067k3999k2239k0526j8809j6768j4319j2164j1261j1778j3178j5062
$$ 1581067 1557068 1534829 1514303 1495494 1478726 1464407 1452243 1440982 1429204 1416026 1400964
53322A400964j7237j9059j9626j8766j7185j5571j4216j3344j2983j2429j0829
$$ 1400964 1383727 1364668 1345042 1326276 1309091 1293520 1279304 1265960 1252977 1240548 1229719
53311A229719q457o563n691n021l687j906l37Q63J891K857M023N881Q428J0867
$$ 1229719 1221262 1214699 1209008 1203987 1200300 1198394 1198057 1198920 1200811 1203668 1207691 1213572 1222000 1232867
53297A232867J2556J3813J5324J7173J8995K0649K2139K3223K3624K3522K3310
$$ 1232867 1245423 1259236 1274560 1291733 1310728 1331377 1353516 1376739 1400363 1423885 1447195
53286A447195K3063K2600K1902K1002J9678J7705J5365J3250J1467R460O766L640
$$ 1447195 1470258 1492858 1514760 1535762 1555440 1573145 1588510 1601760 1613227 1622687 1629453 1633093
53274A633093P02j852m384p157r857j2037j3842j5916j8507k1084k3037k4336
$$ 1633093 1633795 1631943 1627559 1620402 1610545 1598508 1584666 1568750 1550243 1529159 1506122 1481786
53262A481786k5222k5646k5476k4970k4540k4194k3759k3449k3639k4184k4561
$$ 1481786 1456564 1430918 1405442 1380472 1355932 1331738 1307979 1284530 1260891 1236707 1212146
53251A212146k4620k4651k4651k4224k3317k2459k2121k2277k2698k3140k3182
$$ 1212146 1187526 1162875 1138224 1114000 1090683 1068224 1046103 1023826 1001128 977988 954806
53240I54806k2439k1089j9724j8556j7330j6096j5375j5292j5193j4438j3103
$$ 954806 932367 911278 891554 872998 855668 839572 824197 808905 793712 779274 766171
53229G66171j1548r901q311p213o912p185p722q552r721j0945j2012j3165j4673
$$ 766171 754623 744722 736411 729198 722286 715101 707379 698827 689106 678161 666149 652984 638311
53216F38311j6253j7363j7770j7529j6644j5210j3649j2386j1385j0320r136q079
$$ 638311 622058 604695 586925 569396 552752 537542 523893 511507 500122 489802 480666 472587
53204D72587p327o885o739o851p085p355p802q577r500j0093j0027r446q856q595
$$ 472587 465260 458375 451636 444785 437700 430345 422543 413966 404466 394373 384346 374900 366044 357449
53190C57449q441p804o474m938l817l207k876k836l165l495l354k928k858l157
$$ 357449 349008 341204 334730 329792 325975 322768 319892 317056 313891 310396 307042 304114 301256 298099
53176B98099l094k320j413r74q93q39q57j005j007p55o53r40j157q47l56l63q71
$$ 298099 295005 292685 291272 290298 289405 288566 287709 286704 285697 284942 284289 283349 282192 281345 280989 280626 279755
53159B79755j339j412j090m31K76M46q2n22n7R32J279N94l61q44q83p88o52o30
$$ 279755 278416 277004 275914 275483 275759 276205 276123 275601 275544 276476 277755 278349 277988 277144 276261 275473 274821 274191
53141B74191j026j703j951j350m02J21J52K75Q67J655K042J623N73l59l72N64
$$ 274191 273165 271462 269511 268161 267759 267880 268032 268307 269174 270829 272871 274494 275067 274708 274336 274900
53125B74900J517J546P51J19L61J267K240L064L766M133L879L271K938K958K632
$$ 274900 276417 277963 278714 278833 279194 280461 282701 285765 289531 293664 297543 300814 303752 306710 309342
53110C09342J509J21p86j356k252l369l774l115k271k203k723k935k496j785j133
$$ 309342 310851 310972 310186 308830 306578 303209 299435 296320 294049 291846 289123 286188 283692 281907 280774
53095B80774m87J12K72k62j206j945k080j679j179j036j366j816j867j308m33
$$ 280774 280287 280399 280671 280409 279203 277258 275178 273499 272320 271284 269918 268102 266235 264927 264494
53080B64494K45M30K34JpJ84K89o2j020k205k803k376j545j401k086k457j581
$$ 264494 264739 265169 265403 265404 265397 265581 265870 265808 264788 262583 259780 257404 255859 254458 252372 249915 248334
53063B48334j2R56R16M43o1o86j213j085l54J98K21K87Q03J235J024N80O85J363
$$ 248334 248322 249278 250194 250637 250576 249890 248677 247592 247238 247436 247657 247944 248747 249982 251006 251586 252271 253634
53045B53634J995K134J668N68q68j832j774j123p67r60j282j385j157m45P18J678
$$ 253634 255629 257763 259431 259999 259131 257299 255525 254402 253635 252675 251393 250008 248851 248406 249124 250802
53029B50802J706R45K56J8k21q20j332j098j15R32J383J152O94N19O66P37M95
$$ 250802 252508 253453 253709 253727 253506 252686 251354 250256 250141 251073 252456 253608 254302 254821 255487 256224 256719
53012B56719J98J85L69M67M96O10P22P37Q85J314J481O71r01k125k348k020j783
$$ 256719 256917 257102 257471 257938 258434 259044 259766 260503 261388 262702 264183 264854 263953 261828 259480 257460 255677
52995B55677j540q66J18Q60J189J503K121K780K930K337J303M36K25P54J678K471
$$ 255677 254137 253271 253389 254249 255438 256941 259062 261842 264772 267109 268412 268848 269073 269827 271505 273976
52979B73976K781K653K347J945J301M76l9N4K57j78j082j414p07K43N29L85N58
$$ 273976 276757 279410 281757 283702 285003 285479 285440 285494 285751 285573 284491 283077 282370 282613 283142 283527 284085
52962B84085J019J036M14k40m68m85o43r10j085j042o87j00J79m24j660k488k251
$$ 284085 285104 286140 286554 286314 285846 285361 284718 283808 282723 281681 280994 280894 281073 280649 278989 276501 274250
52945B74250j420r07r73j145j005o30l76l78l96j07M50Q45Q16N92M99M12L2m87
$$ 274250 272830 271923 270950 269805 268800 268170 267794 267416 267020 266913 267363 268208 269024 269616 270115 270527 270559 270072
52927B70072o44l35J4J24J41J17k14q48j196p37K11Q54Q33M88K80K70J71k27p29
$$ 270072 269428 269093 269107 269231 269372 269489 269275 268427 267231 266494 266705 267559 268392 268880 269160 269430 269601 269374 268645
52908B68645q83n64l12p31j534j646m78J234K209J929R53J16j58J00O11J031J179
$$ 268645 267762 267198 266886 266155 264621 262975 262497 263731 265940 267869 268822 268938 268780 268880 269491 270522 271701
52891B71701J075P52J16p25j215q15K19R29P23L6k58P9N02N24K90K36N03R19J343
$$ 271701 272776 273528 273644 272919 271704 270889 271108 272037 272760 272796 272538 272617 273119 273643 273933 274169 274672 275591 276934
52872B76934J737J996K014J919J982K281K680L128L600L731K984J448J6n77o06
$$ 276934 278671 280667 282681 284600 286582 288863 291543 294671 298271 302002 304986 306434 306450 305873 305267
52857C05267q31j480k170k667l121l574l814l804l783l804l544k843k047j657
$$ 305267 304436 302956 300786 298119 294998 291424 287610 283806 280023 276219 272675 269832 267785 266128
52843B66128j723j907j935j866j847j782j325l63N57O49j66j034j179p79m92m52
$$ 266128 264405 262498 260563 258697 256850 255068 253743 253380 253937 254586 254420 253386 252207 251428 250936 250484
52827B50484l08MK11K77L71K94l14j137j343q07l44m50n64m3Q03J283J298J108
$$ 250484 250176 250180 250391 250668 251039 251333 251019 249882 248539 247732 247388 246938 246374 246331 247134 248417 249715 250823
52809B50823O40j36n72oJ064J298J37j577k700k893k471j743r28l80m25j044j760
$$ 250823 251463 251327 250755 250749 251813 253111 253248 251671 248971 246078 243607 241864 240936 240556 240131 239087 237327
52792B37327j966j400m52J56J58N4L62Q82J099J041J129J270R02N8l93L3O68O03
$$ 237327 235361 233961 233509 233665 233823 233877 234239 235121 236220 237261 238390 239660 240562 240620 240227 240260 240928 241531
52774B41531o6n81o37n31l71N4O36Q20K99n74j293j681j730j360n78L62J163J679
$$ 241531 241465 240884 240247 239716 239345 239399 240035 240855 241154 240580 239287 237606 235876 234516 233938 234300 235463 237142
52756B37142J772J327N49p5k86k56p8M78J423K177K257K040K208K682K723K069
$$ 237142 238914 240241 240790 240715 240429 240173 240095 240573 241996 244173 246430 248470 250678 253360 256083 258152
52740B58152J245O93K72j52k63J51O29N26j87r61j287r89j71Q27J536J693J388
$$ 258152 259397 260090 260362 260210 259947 260098 260727 261253 261066 260105 258818 257829 257658 258485 260021 261714 263102
52723B63102Q19J19n50j045j491k060k422j948p30K79M91M21O62Q34L53l54m77
$$ 263102 263921 264040 263490 262445 260954 258894 256472 254524 253794 254073 254564 254985 255647 256481 256834 256480 256003
52706B56003k77o98j686k058j263j27N17Q38J211J398J186J042J330J559J182
$$ 256003 255726 255028 253342 251284 250021 249894 250411 251249 252460 253858 255044 256086 257416 258975 260157
52691B60157N93N05P41N84O6j17J85L37M4j64R1L05j67j077j555j212n36j91k65
$$ 260157 260750 261255 261996 262580 262646 262529 262714 263051 263095 262931 263022 263327 263160 262083 260528 259316 258780 258589 258324
52672B58324k78K04J087J833J955J367L31p36j327j036j6R51J169Q47Q15J465
$$ 258324 258046 258250 259337 261170 263125 264492 264823 264087 262760 261724 261708 262659 263828 264675 265490 266955
52656B66955K256K493K222K104K493K970K783J629o0j438j923j568r14m82l94
$$ 266955 269211 271704 273926 276030 278523 281493 284276 285905 285845 284407 282484 280916 280002 279520 279126
52641B79126m62m74l83k40q3J12L53N00K88l34q94o93M24J705K217J911J621J956
$$ 279126 278664 278190 277807 277567 277484 277596 277949 278449 278737 278403 277509 276816 277240 278945 281162 283073 284694 286650
52623B86650K513K453J516J47j140k089k473k135j334o01r8M55J083J295Q92M84
$$ 286650 289163 291616 293132 293279 292139 290050 287577 285442 284108 283507 283409 283864 284947 286242 287134 287618
52607B87618O85J193J269Q57N81O65P09N33N41R10J120O84l1k63J43O13O59L54
$$ 287618 288303 289496 290765 291622 292203 292868 293577 294110 294651 295561 296681 297365 297334 297071 297214 297827 298486 298840
52589B98840L3j88m07n98m03N57K081L282L367K554J824J691J617Q92l01j099
$$ 298840 298873 298685 298278 297680 297277 297834 299915 303197 306564 309118 310942 312633 314250 315142 314841 313742
52573C13742j080o52m33o18j047j491j697j475r94q60j452k206k026o14R15J148
$$ 313742 312662 312010 311577 310959 309912 308421 306724 305249 304255 303395 301943 299737 297711 297097 298012 299160
52557B99160pj308j693j288p34k22L25N80J44o46r15l92K45L37J3k23j66J14N59
$$ 299160 299153 297845 296152 294864 294130 293908 294233 294813 294957 294311 293396 293004 293249 293586 293599 293376 293210 293324 293883
52538B93883J073J386J321J035P50M64J37m8J55O41J027J018N88p8o57p55k03
$$ 293883 294956 296342 297663 298698 299448 299912 300049 300001 300156 300797 301824 302842 303430 303352 302695 301940 301737
52521C01737O82J281J262R85J156K017K944L061K326J628J692K281K750L036L539
$$ 301737 302419 303700 304962 305947 307103 309120 312064 315125 317451 319079 320771 323052 325802 328838 332377
52506C32377M187M286L386J786Pj750l454m898n738n745n012m084l665l872l910
$$ 332377 336564 340850 344236 346022 346029 344279 340825 335927 330189 324444 319432 315348 311683 307811 303901
52491C03901l053j667p05l29O0N18L61m74r99o57k27m75q38l98N14P96L66K43
$$ 303901 300848 299181 298476 298147 298207 298725 299086 298612 297613 296956 296729 296254 295416 295018 295532 296328 296694 296937
52473B96937R39J804K116K005J958K078K208K362K704L257L773L922L585L079
$$ 296937 297876 299680 301796 303801 305759 307837 310045 312407 315111 318368 322141 326063 329648 332727
52459C32727K829K738K121N64j478l173m123m326l866l084k674l016l584l610
$$ 332727 335556 338294 340415 340979 339501 336328 332205 327879 324013 320929 318255 315239 311655 308045
52445C08045l073k495k000j287l78L40P68J098J171N62o02j517j613j138p04o30
$$ 308045 304972 302477 300477 299190 298812 299152 299920 301018 302189 302751 302149 300632 299019 297881 297177 296547
52429B96547p98p99k57O12R95N16ON01J749K612K780K983L453L397K509J729J847
$$ 296547 295749 294950 294693 295305 296300 296816 296822 297323 299072 301684 304464 307447 310900 314297 316806 318535 320382
52412C20382K278K168J836K166L157M142N091O585Q609J0382J1313J1272R888
$$ 320382 322660 324828 326664 328830 331987 336129 341220 347805 356414 366796 378109 389381 399269
52399C99269O660K046k334n162o518p199p488p153o228n112m055l034k158j710
$$ 399269 405929 407975 405641 400479 393961 386762 379274 372121 365893 360781 356726 353692 351534 349824
52385C49824j687j614j069k02M66O35N35O73J396K623L875M613M685M488M595
$$ 349824 348137 346523 345454 345252 345718 346353 346888 347561 348957 351580 355455 360068 364753 369241 373836
52370C73836N214O062O666O628N707L982K054O80O8k78q00j276j241p43k74j19
$$ 373836 379050 385112 391778 398406 404113 408095 410149 410829 410897 410619 409819 408543 407302 406559 406285 406166
52354D06166j92l30m31k54L82J264J916K156K167K140K249K845M134N579O247
$$ 406166 405974 405644 405213 404959 405341 406605 408521 410677 412844 414984 417233 420078 424212 429791 436038
52339D36038N934N497N801O815P988R006R832J0466J1084J2082J3481J4656J5138
$$ 436038 441972 447469 453270 460085 468073 477079 486911 497377 508461 520543 534024 548680 563818
52326E63818J5413J6374J8225K0442K2631K4712K6292K6656K5692K4232K3137
$$ 563818 579231 595605 613830 634272 656903 681615 707907 734563 760255 784487 807624
52315H07624K2439K1791K1319K1431K2000K2374K2304K2247K2524K2614K1773
$$ 807624 830063 851854 873173 894604 916604 938978 961282 983529 1006053 1028667 1050440
52304A050440K0135J8637J7827J7256J6283J4957J3686J2413J0665Q337N809L244
$$ 1050440 1070575 1089212 1107039 1124295 1140578 1155535 1169221 1181634 1192299 1200636 1206445 1209689
52292A209689L55k915o066q665j0909j2993j4367j4236j2750j1063j0072r584
$$ 1209689 1210044 1207129 1201063 1192398 1181489 1168496 1154129 1139893 1127143 1116080 1106008 1096424
52280A096424q883p660o027m019j541J222L811N977P899R842J1769J3463J4888
$$ 1096424 1087541 1079881 1073854 1069835 1068294 1069516 1073327 1079304 1087203 1097045 1108814 1122277 1137165
52267A137165J6216J7521J8582J9000J8494J7229J5903J5353J5825J6670J7005
$$ 1137165 1153381 1170902 1189484 1208484 1226978 1244207 1260110 1275463 1291288 1307958 1324963
52256A324963J6644J6110J5736J5127J3769J1816R950Q523P168N232K336j390
$$ 1324963 1341607 1357717 1373453 1388580 1402349 1414165 1424115 1432638 1439806 1445038 1447374 1445984
52244A445984n396q934j1521j3279j4779j6485j8331j9791k0312j9770j8589j7334
$$ 1445984 1440588 1431654 1420133 1406854 1392075 1375590 1357259 1337468 1317156 1297386 1278797 1261463
52232A261463j6184j5037j4040j3612j3673j3367j2027j0082q510p548o626n426
$$ 1261463 1245279 1230242 1216202 1202590 1188917 1175550 1163523 1153441 1144931 1137383 1130757 1125331
52220A125331m307l584l029k301j353k00J203K654L703M244M680N256N718N849
$$ 1125331 1121024 1117440 1114411 1112110 1110757 1110557 1111760 1114414 1118117 1122361 1127041 1132297 1138015 1143864
52206A143864N842N820N540M978M665M937N257N041M650M892N745O421O562O547
$$ 1143864 1149706 1155526 1161066 1166044 1170709 1175646 1180903 1185944 1190594 1195486 1201231 1207652 1214214 1220761
52192A220761O623O593O531O897P533P345N624L064Q52q71k875n422p801r427
$$ 1220761 1227384 1233977 1240508 1247405 1254938 1262283 1267907 1270971 1271823 1270952 1268077 1262655 1254854 1245427
52178A245427j0543j1529j2092j1640j0267q786p819p192o339n031l572k426j769
$$ 1245427 1234884 1223355 1211263 1199623 1189356 1180570 1172751 1165559 1159220 1154189 1150617 1148191 1146422
52165A146422j375q23J97J662L242M510N175N239N000M800M603L897K221j35k165
$$ 1146422 1145047 1144224 1144421 1146083 1149325 1153835 1159010 1164249 1169249 1174049 1178652 1182549 1184770 1184635 1182470
52150A182470k954k402j142M3P55J167J840L065M320M708M147L636L963M560M319
$$ 1182470 1179516 1177114 1175972 1176015 1176770 1177937 1179777 1182842 1187162 1191870 1196017 1199653 1203616 1208176 1212495
52135A212495L384L270N039Q029J0747J2489J3714J5226J7512K0565K3867K6586
$$ 1212495 1215879 1219149 1224188 1232217 1242964 1255453 1269167 1284393 1301905 1322470 1346337 1372923
52123A372923K8331K9639L1389L3629L5413L5864L5080L3807L2544L1220K9601
$$ 1372923 1401254 1430893 1462282 1495911 1531324 1567188 1602268 1636075 1668619 1699839 1729440
52112A729440K7635K5374K2800J9867J6623J3159R647O504M297L252K873K402
$$ 1729440 1757075 1782449 1805249 1825116 1841739 1854898 1864545 1871049 1875346 1878598 1881471 1883873
52100A883873J574O21m32k006m321p054r826j2703j5743j8496k0512k2045k3670
$$ 1883873 1885447 1886068 1885636 1883630 1879309 1872255 1862429 1849726 1833983 1815487 1794975 1772930 1749260
52087A749260k5328k6299k6067k4660k2256j9060j5614j2549r895p177m304j758
$$ 1749260 1723932 1697633 1671566 1646906 1624650 1605590 1589976 1577427 1567532 1560355 1556051 1554293
52075A554293K65K266M706P399R958J2356J4695J6843J8651K0126K1107K1248
$$ 1554293 1554558 1556824 1561530 1568929 1578887 1591243 1605938 1622781 1641432 1661558 1682665 1703913
52063A703913K0654K0031J9780J9453J8541J7297J6241J5287J3975J2212J0143
$$ 1703913 1724567 1744598 1764378 1783831 1802372 1819669 1835910 1851197 1865172 1877384 1887527
52052A887527P573M288P25k432n250q422j2126j5731j8800k1697k4880k8019l0203
$$ 1887527 1895100 1899388 1900113 1897681 1892431 1884009 1871883 1856152 1837352 1815655 1790775 1762756 1732553
52039A732553l0859l0292k9453k9189k9522k9638k8749k6777k4162k1284j8528
$$ 1732553 1701694 1671402 1641949 1612760 1583238 1553600 1524851 1498074 1473912 1452628 1434100
52028A434100j6516j5622j5333j4757j3757j3030j2933j2990j2774j2590j2836
$$ 1434100 1417584 1401962 1386629 1371872 1358115 1345085 1332152 1319162 1306388 1293798 1280962
52017A280962j3178j2906j1918j0815j0154r991j0105j0372j0802j1455j2328
$$ 1280962 1267784 1254878 1242960 1232145 1221991 1212000 1201895 1191523 1180721 1169266 1156938
52006A156938j3379j4597j6023j7609j9051j9996k0416k0590k0650k0373j9475
$$ 1156938 1143559 1128962 1112939 1095330 1076279 1056283 1035867 1015277 994627 974254 954779
51995I54779j7949j5990j3809j1731j0317j0079j1024j2523j3767j4435j4879
$$ 954779 936830 920840 907031 895300 884983 874904 863880 851357 837590 823155 808276
51984H08276j5597j6499j6941j6575j5869j5531j5612j5557j5054j4331j3588
$$ 808276 792679 776180 759239 742664 726795 711264 695652 680095 665041 650710 637122
51973F37122j2630j1226r457p465n199k721m31J366K860M391N874O980P739Q419
$$ 637122 624492 613266 603809 596344 591145 588424 587993 589359 592219 596610 602484 609464 617203 625622
51959F25622Q748P806N104J410j839l918n204o298p178p420o790n344l149l76
$$ 625622 634370 642176 647280 648690 646851 642933 637729 631431 624253 616833 610043 604699 601550 601174
51945F01174K449M767O626Q650J1249J4099J6638J8699K0429K1881K3002K3879
$$ 601174 603623 608390 615016 623666 634915 649014 665652 684351 704780 726661 749663 773542
51933G73542K4669K5348K5628K4927K2163J5995N990o378j8271k7331l2917l5683
$$ 773542 798211 823559 849187 874114 896277 912272 918262 911884 893613 866282 833365 797682
51921G97682l6425l5551l3325l0207k6864k3863k1381j9158j6783j4073j1194
$$ 797682 761257 725706 692381 662174 635310 611447 590066 570908 554125 540052 528858
51910E28858q499o297m620l141j435O01K620M220N240N656N410M639L737K922
$$ 528858 520359 514062 509442 506301 504866 505467 508087 512307 517547 523203 528613 533252 536989 539911
51896E39911J827p8k795n814q708j1219j2894j3163j2000j0159q476p154n881
$$ 539911 541738 541660 538865 533051 524343 513124 500230 487067 475067 464908 456432 449278 443397
51883D43397m363k567o32J220K704L635M181M855O122P893R422R879R092P598
$$ 443397 439034 436467 435835 437055 439759 443394 447575 452430 458552 466445 475867 485746 494838 502436
51869E02436N968M346K652R53o12j997l109l725l731l279k498j378j28Q50J601
$$ 502436 508404 512750 515402 516355 515743 513746 510637 506912 503181 499902 497404 496026 495898 496748 498349
51854D98349K695M155M906M044K210P47j93j649m063o561q215q943q878p939o504
$$ 498349 501044 505199 510105 514149 516359 517106 516913 515264 511201 504640 496425 487482 478604 470665 464161
51839D64161n647n856o260n863m841l901k945j442K84J257J351J534K323K892
$$ 464161 458514 452658 446398 440535 435694 431793 428848 427406 427690 428947 430298 431832 434155 437047
51825D37047K169K98j621k853l545m022m185l772k927k097j481r01k33L27O56
$$ 437047 439216 439514 437893 435040 431495 427473 423288 419516 416589 414492 413011 412110 411877 412204 412860
51810D12860J020J624K063J696N27p03j359j406j037l50M09P98P48Q09J436K305
$$ 412860 413880 415504 417567 419263 419790 419087 417728 416322 415285 414935 415344 416142 416890 417699 419135 421440
51794D21440K647K087Q57o60k224l609m405m181k860j090M9P2k99N7J211K156
$$ 421440 424087 426174 427031 426371 424147 420538 416133 411952 409092 408002 408051 408123 407824 407881 409092 411248
51778D11248K252K009K076K248K041J797K368L864N422O244O457O795P739Q970
$$ 411248 413500 415509 417585 419833 421874 423671 426039 429903 435325 441569 448026 454821 462560 471530
51764D71530R579Q885P135N180L431J517r02l504n773p633r165j0188j0578j0626
$$ 471530 481109 489994 497129 502309 505740 507257 506355 502851 497078 489445 480280 470092 459514 448888
51750D48888j0555j0024q721p034n518m056k298o24K09K61L65R01J468J843K384
$$ 448888 438333 428309 419588 412554 407036 402980 400682 400058 400267 400528 400893 401794 403262 405105 407489
51735D07489L285M231N107O184P252P323N806L362J094o06j815k161j072J160
$$ 407489 410774 415005 420112 426296 433548 440871 446677 450039 451133 450527 448712 446551 445479 446639
51721D46639L266M045L196J174j322l609n186n864n703m811l354j742n84l22r13
$$ 446639 449905 453950 457146 458320 456998 453389 448203 442339 436636 431825 428471 426729 426145 425823 424910
51706D24910j849k506k483j726m20J126K494L213L059K174Q71n59j736k193j845
$$ 424910 423061 420555 418072 416346 415926 417052 419546 422759 425818 427992 428863 428304 426568 424375 422530
51691D22530j217q08m58J92Q08N88n86j930k776l193l353l071k349j690j367r44
$$ 422530 421313 420505 420047 420239 421047 421635 421049 419119 416343 413150 409797 406726 404377 402687 401320 400376
51675D00376j08O07O86O97J564L043L932L782L549M290N996Q000R768J0858J0696
$$ 400376 400268 400875 401561 402258 403822 406865 410797 414579 418128 422418 428414 436414 446182 457040 467736
51660D67736R034O315L173j58l582o558q291q402p077m604j271K339N264O619
$$ 467736 476770 483085 486258 486100 482518 475960 467669 459267 452190 447586 446315 448654 453918 460537
51646D60537O062L911R31k074m645o729q241q762p912n950l710j849m00Q59J772
$$ 460537 466599 470510 471441 469367 464722 457993 449752 440990 433078 427128 423418 421569 421169 422028 423800
51631D23800J805O44j286l009l702l255k199j209p55j058j968k881l120k690k340
$$ 423800 425605 426249 424963 421954 418252 414997 412798 411589 410834 409776 407808 404927 401807 399117 396777
51616C96777k614l208l551l695l969m088l403k133j400j717k152j564j09J137
$$ 396777 394163 390955 387404 383709 379740 375652 372249 370116 368716 366999 364847 363283 363174 364311
51602C64311J647J839K210K831L636M650N805P032Q565J0622J2687J3550J2222
$$ 364311 365958 367797 370007 372838 376474 381124 386929 393961 402526 413148 425835 439385 451607
51589D51607Q660L634j685o033q577r374r033p843n683k812j57J545K476L381
$$ 451607 460267 463901 462216 456183 447606 438232 429199 421356 415673 412861 412704 414249 416725 420106
51575D20106M835P058R893J2567J3955J3665J2620J2174J2866J4297J5817J6829
$$ 420106 424941 431999 441892 454459 468414 482079 494699 506873 519739 534036 549853 566682
51563E66682J6865J6095J5585J6398J8424K0719K2798K4893K6894K7846K6823
$$ 566682 583547 599642 615227 631625 650049 670768 693566 718459 745353 773199 800022
51552H00022K3644J8498J1567L507m286j0624j5535j9749k3419k5967k7079k7189
$$ 800022 823666 842164 853731 857238 852952 842328 826793 807044 783625 757658 730579 703390
51540G03390k6718k5461k3075j9829j6413j3202j0110p247n177m369m593n204
$$ 703390 676672 651211 628136 608307 591894 578692 568582 561335 556158 551789 547196 541992
51528E41992n851o607p486q222q574q576q352p947p500p323p529p767p625p099
$$ 541992 536141 529534 522048 513826 505252 496676 488324 480377 472877 465554 458025 450258 442633 435534
51514D35534o455n710m693l564k816k605k447j920j372j564k582l545l564k721
$$ 435534 429079 423369 418676 415112 412296 409691 407244 405324 403952 402388 399806 396261 392697 389976
51500C89976j776j058j13J354K696K983K259J547J516J699J354O05K58P32J673
$$ 389976 388200 387142 387029 388383 391079 394062 396321 397868 399384 401083 402437 403042 403300 404032 405705
51485D05705K521K982K880K035N10j196k441k924k863k769k979l332l369k920
$$ 405705 408226 411208 414088 416123 416633 415437 412996 410072 407209 404440 401461 398129 394760 391840
51471C91840k402k370k879l464l619l194k457j891j777j843j572j008q43j404
$$ 391840 389438 387068 384189 380725 377106 373912 371455 369564 367787 365944 364372 363364 362521 361117
51457C61117j973j718r18m76m38J47J712L405M189M039L626L464L812M951O892
$$ 361117 359144 357426 356508 356032 355594 355741 357453 360858 365047 369086 372712 376176 379988 384939 391831
51442C91831R153J1269J3222J4774J4873J2529Q233L757M83j414k131j574OJ415
$$ 391831 400984 412253 425475 440249 455122 467651 475884 479641 480124 478710 476579 475005 475011 476426
51428D76426J352l35k736m981o755p887q148p691p148o966o908o489n620m531
$$ 476426 477778 477443 474707 469726 462971 455084 446936 439245 432097 425131 418223 411734 406114 401583
51414D01583l348k107j062m92k57R7O77J127J232J242J392J494J287R53R12J292
$$ 401583 398235 396128 395066 394574 394317 394414 395091 396218 397450 398692 400084 401578 402865 403818 404730 406022
51398D06022J891K555L188L543L401K997K937L611M906O522Q325J0237J2084J3776
$$ 406022 407913 410468 413656 417199 420600 423597 426534 430145 435051 441573 449898 460135 472219 485995
51384D85995J5529J7708K0456K3537K6688K9934L3405L6754L9184M0406M1280
$$ 485995 501524 519232 539688 563225 589913 619847 653252 690006 729190 769596 810876
51373H10876M2653M3488M1048L3622K2529J0762J26r492j8497k6478l2876l7745
$$ 810876 853529 897017 938065 971687 994216 1004978 1005104 995612 977115 950637 917761 880016
51361H80016m1310m3477m4117m3375m1388l8231l4423l0878k7898k4828k1186
$$ 880016 838706 795229 751112 707737 666349 628118 593695 562817 534919 510091 488905
51350D88905j7595j4961j3159j1312r112p115n754m759l749k782k153j977k179
$$ 488905 471310 456349 443190 431878 422766 415651 409897 405138 401389 398607 396454 394477 392298
51337C92298k553k746k410j550n13L55Q84R80O83L76N04R64J047K30j168k330
$$ 392298 389745 386999 384589 383039 382526 382881 383765 384745 385428 385804 386308 387272 388319 388549 387381 385051
51321C85051k825k875k854k778k433j841j351j165r73l40O25J289J324J141J240
$$ 385051 382226 379351 376497 373719 371286 369445 368094 366929 365956 365616 366241 367530 368854 369995 371235
51306C71235J435J128J71r00j492j372n93N46J377J223J26j119j834k050k092
$$ 371235 372670 373798 373969 373069 371577 370205 369612 370158 371535 372758 372884 371765 369931 367881 365789
51291C65789j973j562r92m21L06J340K314K731K728K985L741M547N075N586O241
$$ 365789 363816 362254 361262 360841 361147 362487 364801 367532 370260 373245 376986 381533 386608 392194 398435
51276C98435O472N605L867K230J356J075Q72M96N2j87l2M52R80J456K095K871
$$ 398435 404907 410512 414379 416609 417965 419040 419912 420408 420460 420273 420241 420693 421673 423129 425224 428095
51260D28095L080K005j38k366m058n259n924n616m299k793j937j748j803k007
$$ 428095 431175 433180 433042 430676 426618 421359 415435 409819 405520 402727 400790 399042 397239 395232
51246C95232k455k891k956k750k651k675k531k166j772j346p14O1P43J332J959
$$ 395232 392777 389886 386930 384180 381529 378854 376323 374157 372385 371039 370325 370386 371129 372461 374420
51231C74420K425K321J667R75O30N86O94Q90R79O54j00r06j438j673j693j485
$$ 374420 376845 379166 380833 381808 382438 383024 383718 384608 385587 386241 386141 385235 383797 382124 380431 378946
51215C78946j043m14L01Q69R61O93Q33K012L707M646M264L277K693K807L295L764
$$ 378946 377903 377489 377790 378659 379620 380313 381146 383158 386865 391511 395775 399052 401745 404552 407847 411611
51199D11611L894L511K729J812Q17k62j046r70j03P11P17j57j534k872l496l055
$$ 411611 415505 419016 421745 423557 424374 424112 423066 422096 421993 422704 423421 423264 421730 418858 415362 412307
51183D12307k093j600j716j635q98J7P41J645K846L509K997K033J678J795J474
$$ 412307 410214 408614 406898 405263 404365 404382 405123 406768 409614 413123 416120 418153 419831 421626 423100
51168D23100O81K24K52p7j159k183k177j133K24J285J779J617R19N4o26r78j028
$$ 423100 423781 424005 424257 424180 423021 420838 418661 417528 417752 419037 420816 422433 423352 423406 422780 421802 420774
51151D20774q98q27r81j232j290j060o84l33j22j49m12p63j068j291j205l99J083
$$ 420774 419876 419049 418068 416836 415546 414486 413802 413469 413347 413198 412786 412023 410955 409664 408459 408060 409143
51134D09143K370K498J491L05j52L16J319K224K452J971J507J848K905L753L680
$$ 409143 411513 414011 415502 415807 415655 415971 417290 419514 421966 423937 425444 427292 430197 433950 437630
51119D37630K849J899J163N02k78r32q12M75K358L591L418K244R91J45k72k43
$$ 437630 440479 442378 443541 444043 443765 442833 442021 442496 444854 448445 451863 454107 455098 455243 454971 454728
51103D54728K60J038J837K541K976K868K395K264K747L057K371J035J8m39q14
$$ 454728 454988 456026 457863 460404 463380 466248 468643 470907 473654 476711 479082 480117 480135 479696 478882
51088D78882j246j448j478j570j348k83J019J209J38p81n57J29K92J62M74J046
$$ 478882 477636 476188 474710 473140 471792 471509 472528 473737 473875 473094 472537 472666 472958 473120 473594 474640
51072D74640J059L76l10l78L19J651L214M384N040N902P612R712J1300J2458J4211
$$ 474640 475699 476075 475765 475387 475706 477357 480571 484955 489995 495897 503509 513221 524521 536979 551190
51057E51190J6979J9710K0786J9347J5672J0838O298L381K672L761N613P103P349
$$ 551190 568169 587879 608665 628012 643684 654522 660820 664201 666873 670634 676247 683350 690699
51044F90699O024L623J221l66j306k491m564p162r132r368p553m382j328k7j348
$$ 690699 696723 700346 701567 701201 699895 697404 692840 685678 676546 667178 659625 655243 653915 653888 652540
51029F52540m796q898j2271j4217j4437j2852j0007p047m705k670m62J511K633
$$ 652540 647744 638846 626575 612358 597921 585069 575062 568015 563310 560640 560178 561689 564322
51016E64322L445N217Q013J0354J1153J1101J1462J2272J2559J1855J0609R311
$$ 564322 567767 572984 580997 591351 602504 613605 625067 637339 649898 661753 672362 681673
51004F81673P960O456M918L587K615K049J705J218M11m72j146j629j945j706m77
$$ 681673 689633 696089 701007 704594 707209 709258 710963 712181 712592 712120 710974 709345 707400 705694 705217
50989G05217J500L403M664N466O402P941J0252J3260J6689K0159K3336K5879K7363
$$ 705217 706717 710120 714784 720250 726652 734593 744845 758105 774794 794953 818289 844168 871531
50976H71531K7401K6023K3925K2217K1827K3067K5740K9631L4681M0652M6909
$$ 871531 898932 924955 948880 971097 992924 1015991 1041731 1071362 1106043 1146695 1193604
50965A193604N2815N8238O3379O8249P2632P6445P9804Q2715Q5011Q6495Q6729
$$ 1193604 1246419 1304657 1368036 1436285 1508917 1585362 1665166 1747881 1832892 1919387 2006116
50954B006116Q4861Q0236P3199O4862N5984M6659L7072K7887J9579J2058N208
$$ 2006116 2090977 2171213 2244412 2309274 2365258 2411917 2448989 2476876 2496455 2508513 2513721
50943B513721o34n046p925r301r387r093r820j2122j4990j6987j7792j8234j9235
$$ 2513721 2513087 2508041 2500116 2490815 2481428 2472335 2462515 2450393 2435403 2418416 2400624 2382390 2363155
50930B363155k1223k4211k7888l1765l5715m0055m4886m9685n4024n8181o2462
$$ 2363155 2341932 2317721 2289833 2258068 2222353 2182298 2137412 2087727 2033703 1975522 1913060
50919A913060o6243o8393o8526o7233o5241o2824n9892n6166n1392m5903m0785
$$ 1913060 1846817 1778424 1709898 1642665 1577424 1514600 1454708 1398542 1347150 1301247 1260462
50908A260462l6973l4228l1462k8076k4546k1810k0392k0057j9863j8763j6471
$$ 1260462 1223489 1189261 1157799 1129723 1105177 1083367 1062975 1042918 1023055 1004292 987821
50897I87821j3700j1328r603q330p401o626n529l891k247j220p50m73l93m95j53
$$ 987821 974121 962793 953190 944860 937459 930833 925304 921413 919166 917946 917196 916723 916330 915835 915682
50882I15682J148K807L818M290N251P043Q936J0418J1746J3124J4301J5315J6612
$$ 915682 916830 919637 923455 927745 932996 940039 948975 959393 971139 984263 998564 1013879 1030491
50869A030491J8202J9516K0458K1703K3599K5701K7782L0363L3713L7214M0426
$$ 1030491 1048693 1068209 1088667 1110370 1133969 1159670 1187452 1217815 1251528 1288742 1329168
50858A329168M3943M8422N3523N8718O4522P1966Q1112R1066J01275J11918J23133
$$ 1329168 1373111 1421533 1475056 1533774 1598296 1670262 1751374 1842440 1943715 2055633 2178766
50847B178766J34573J45807J56494J66200J74503J81421J87237J91817J94352
$$ 2178766 2313339 2459146 2615640 2781840 2956343 3137764 3325001 3516818 3711170
50838C711170J93704J88772J78703J63247J42976J19015R2708O5603L9270J4683
$$ 3711170 3904874 4093646 4272349 4435596 4578572 4697587 4790295 4855898 4895168 4909851
50828D909851p930k8187m4917n6952o4229o7330o6268o0638n1043l9483k8116
$$ 4909851 4901921 4873734 4828817 4771865 4707636 4640306 4574038 4513400 4462357 4422874 4394758
50817D394758j8366j1449q902j1841k0064l2400m7588o4471q1811r8703j15076
$$ 4394758 4376392 4364943 4356041 4344200 4324136 4291736 4244148 4179677 4097866 3999163 3884087
50806C884087j31115j46120j58436j66680j70687j71068j68306j62641j54527
$$ 3884087 3752972 3606852 3448416 3281736 3111049 2939981 2771675 2609034 2454507
50797B454507j44680j33693j21953j09945r8250q7078p6188o5517n5593m7041
$$ 2454507 2309827 2176134 2054181 1944236 1845986 1758908 1682720 1617203 1561610 1514569
50787A514569l9855l3576k7992k3263j9395j6104j3253j0969r208p682o473o177
$$ 1514569 1474714 1441138 1413146 1389883 1370488 1354384 1341131 1330162 1320954 1313272 1306799 1300622
50775A300622p035q286q907q767q612q967r606j0105j0406j0685j0993j1294j1602
$$ 1300622 1293587 1285301 1276394 1267627 1259015 1250048 1240442 1230337 1219931 1209246 1198253 1186959 1175357
50762A175357j1832j1717j1068j0068r025p918o418m480k735j920j833j144J380
$$ 1175357 1163525 1151808 1140740 1130672 1121647 1113729 1107311 1102831 1100096 1098176 1096343 1095199 1096579
50749A096579N478R565J2486J4774J7891K2485K7737L2490L6449M0216M4443M9314
$$ 1096579 1102057 1111622 1124108 1138882 1156773 1179258 1206995 1239485 1275934 1316150 1360593 1409907
50737A409907N4635O0093O5351P0203P4734P9160Q3464Q7347R0618R3394R5643
$$ 1409907 1464542 1524635 1589986 1660189 1734923 1814083 1897547 1984894 2075512 2168906 2264549
50726B264549R6783R6241R4371R2253R0317Q7689Q3224P6738O8600N8432M5092
$$ 2264549 2361332 2457573 2551944 2644197 2734514 2822203 2905427 2982165 3050765 3109197 3154289
50715C154289K8117Q674j1115k9353m4748n6398o3660o6203o4128n8220m9961
$$ 3154289 3182406 3191080 3179965 3150612 3105864 3049466 2985806 2919603 2855475 2797255 2747294
50704B747294m0831l1465k1955j2967n822j305Q96J082j471p695j7417k9558m3149
$$ 2747294 2706463 2674998 2653043 2640076 2634254 2632949 2633845 2634927 2633456 2625761 2608344 2578786 2535637
50691B535637n7350p0778q1890r0077r5578r8365r8015r4758q9666q3396p5650
$$ 2535637 2478287 2407509 2325619 2235542 2139964 2041599 1943584 1848826 1759160 1675764 1600114
50680A600114o6440n7090m9189m2976l7398l1537k5286j8947j2875p496l102N36
$$ 1600114 1533674 1476584 1427395 1384419 1347021 1315484 1290198 1271251 1258376 1250880 1247778 1248314
50668A248314L836O725Q717R707J0266J0886J1325J1002R930Q992R218J0859J3219
$$ 1248314 1252150 1258875 1267592 1277299 1287565 1298451 1309776 1320778 1330708 1339700 1348918 1359777 1372996
50655A372996J5421J7230J8899K0426K1492K2354K4031K7029L0383L2793L4458
$$ 1372996 1388417 1405647 1424546 1444972 1466464 1488818 1512849 1539878 1570261 1603054 1637512
50644A637512L6802M0391M4184M7135M9497N1892N4060N5398N6117N6753N6907
$$ 1637512 1674314 1714705 1758889 1806024 1855521 1907413 1961473 2016871 2072988 2129741 2186648
50633B186648N5486N2255M8227M4401M0898L7452L4113L1352K9907L0326L1612
$$ 2186648 2242134 2294389 2342616 2387017 2427915 2465367 2499480 2530832 2560739 2591065 2622677
50622B622677L0318K2566P986q999k2608l0007l1834k9760k4990j8814j2802p813
$$ 2622677 2652995 2675561 2683547 2674548 2651940 2621933 2590099 2560339 2535349 2516535 2503733 2495920
50610B495920l671k03K088K807K361J167j411o611j4770k4731l4860m4374n3487
$$ 2495920 2492249 2492046 2494134 2496941 2499302 2500469 2499058 2492447 2477677 2452946 2418086 2373712 2320225
50597B320225o2358p0127p5332p7221p6501p4578p2349o9933o7202o4049o0335
$$ 2320225 2257867 2187740 2112408 2035187 1958686 1884108 1811759 1741826 1674624 1610575 1550240
50586A550240n6108n1876m8132m4690m0977l6973l3226k9839k6166k1839j7398
$$ 1550240 1494132 1442256 1394124 1349434 1308457 1271484 1238258 1208419 1182253 1160414 1143016
50575A143016j3499j0062o698l482o30K199N474Q816J1219J2316J2888J3885J5448
$$ 1143016 1129517 1119455 1112757 1109275 1108645 1110844 1116318 1125134 1136353 1148669 1161557 1175442 1190890
50562A190890J7105J8533J9767K0886K1793K2354K2515K2297K1826K1387K1345
$$ 1190890 1207995 1226528 1246295 1267181 1288974 1311328 1333843 1356140 1377966 1399353 1420698
50551A420698K1828K2469K2599K1845K0526J9401J8994J9302K0045K1142K2918
$$ 1420698 1442526 1464995 1487594 1509439 1529965 1549366 1568360 1587662 1607707 1628849 1651767
50540A651767K5936L0464L6023M1590M6646N1807N8085O5522P2978P9236Q3892
$$ 1651767 1677703 1708167 1744190 1785780 1832426 1884233 1942318 2007840 2080818 2160054 2243946
50529B243946Q7178Q9629R2250R6383J02688J10355J17610J22918J25602J25697
$$ 2243946 2331124 2420753 2513003 2609386 2712074 2822429 2940039 3062957 3188559 3314256
50519C314256J23603J19624J13540J04731R3047P9174O3879M7175K8765R066j0788
$$ 3314256 3437859 3557483 3671023 3775754 3868801 3947975 4011854 4059029 4087794 4096860 4086072
50508D086072k9858m7817o4422p9048r0866r9105j03158j02767r8219r0152p9108
$$ 4086072 4056214 4008397 3943975 3864927 3774061 3674956 3571798 3469031 3370812 3280660 3201552
50497C201552o5541n0117l3720j7101q19J4435K7759L8322M5466M8506M6648L9219
$$ 3201552 3136011 3085894 3052174 3035073 3034254 3048689 3076448 3114770 3160236 3208742 3255390 3294609
50485C294609K5856O702j7188m3535o9303r1860j09785j22751j30899j34459j33791
$$ 3294609 3320465 3327167 3309979 3266444 3197141 3105281 2995496 2872745 2741846 2607387 2473596
50474B473596j29623j23082j15215j06426r6643q6252p6531o8704o2819n7949
$$ 2473596 2343973 2220891 2105676 1999250 1902607 1816355 1739824 1671120 1608301 1550352
50464A550352n3361m8904m4419l9431l3678k7519k1551j6113j1270o900k677J739
$$ 1550352 1496991 1448087 1403668 1364237 1330559 1303040 1281489 1265376 1254106 1247206 1244529 1246268
50452A246268O240J0345J3757J6635J9177K1369K3346K5591K8438L1647L4761
$$ 1246268 1252508 1262853 1276610 1293245 1312422 1333791 1357137 1382728 1411166 1442813 1477574
50441A477574L7684M0409M2284M1895L7913L0128J9773R017n4o335r861j1375
$$ 1477574 1515258 1555667 1597951 1639846 1677759 1707887 1727660 1736677 1736623 1730288 1720427 1709052
50429A709052j1787j1913j2211j2571j2459j1444r538p049m352j800M39K702N742
$$ 1709052 1697265 1685352 1673141 1660570 1648111 1636667 1627129 1620080 1615728 1613928 1614367 1617069 1622811
50416A622811J0064J5487K1435K7537L3704L9737M5212M9832N3735N7282O0438
$$ 1622811 1632875 1648362 1669797 1697334 1731038 1770775 1815987 1865819 1919554 1976836 2037274
50405B037274O2430O2335O0067N6582N2799M8592M3216L6554K9313K1905J3816
$$ 2037274 2099704 2162039 2222106 2278688 2331487 2380079 2423295 2459849 2489162 2511067 2524883
50394B524883M357o475j8243l0643m3292n5221o5127p2113p5908p6570p4398o9928
$$ 2524883 2529240 2522765 2504522 2473879 2430587 2375366 2310239 2238126 2162218 2085648 2011250 1941322
50382A941322o3601n5554m6062l5960k6141j6785p658R55Q292J4068J8669K2075
$$ 1941322 1877721 1822167 1776105 1740145 1714004 1697219 1689561 1690516 1698808 1712876 1731545 1753620
50370A753620K3280K1229J5860P851k170j3491k4792l4514m1903m7114n0383n1579
$$ 1753620 1776900 1798129 1813989 1821840 1819670 1806179 1781387 1746873 1704970 1657856 1607473 1555894
50358A555894n0686m8186m4697m0601l6255l2148k8490k4930k1126j7518j5248
$$ 1555894 1505208 1457022 1412325 1371724 1335469 1303321 1274831 1249901 1228775 1211257 1196009
50347A196009j5317j7942k2357k6939k9730k9541k6677k2427j7867j3447r431
$$ 1196009 1180692 1162750 1140393 1113454 1083724 1054183 1027506 1005079 987212 973765 964334
50336I64334o029k975K78L633O207P522Q287R377J0543J0949J0644J0583J1166
$$ 964334 958305 955330 955608 959241 965448 972970 981257 990634 1001177 1012126 1022770 1033353 1044519
50323A044519J1731J1711J1549J1906J2565J2758J2172J1123R910Q541O994N296
$$ 1044519 1056250 1067961 1079510 1091416 1103981 1116739 1128911 1140034 1149944 1158485 1165479 1170775
50311A170775L402J354m27j409j575j369r56Q4K125M804P330R331J1123J3094
$$ 1170775 1174177 1175531 1175104 1173695 1172120 1170751 1169795 1169879 1172004 1176808 1184138 1193469 1204592 1217686
50297A217686J5190J7252J9697K3358K8464L4147L9549M5191N2114N8912O0208
$$ 1217686 1232876 1250128 1269825 1293183 1321647 1355794 1395343 1440534 1492648 1551560 1611768
50286A611768M9756K6131m688l2909n1279n8398n7192n1548m4432l7577l1528
$$ 1611768 1661524 1687655 1682967 1650058 1598779 1540381 1483189 1431641 1387209 1349632 1318104
50275A318104k5915k0472j5835j2903j1543j0559r089p378n943m680l300k097
$$ 1318104 1292189 1271717 1255882 1242979 1231436 1220877 1211788 1204410 1198467 1193787 1190487 1188390
50263A188390j529j279m01J528M006O343Q303R930J1313J2638J4045J5228J5562
$$ 1188390 1186861 1185582 1185181 1186709 1190715 1197058 1205361 1215291 1226604 1239242 1253287 1268515 1284077
50250A284077J4934J4036J3605J3613J3473J2747J1336R229O498L390O0l581p440
$$ 1284077 1299011 1313047 1326652 1340265 1353738 1366485 1377821 1387050 1393548 1396938 1396998 1393417 1385977
50237A385977j0702j2363j2312j1435j0444r046o670l686j397r50k805p180j4131
$$ 1385977 1375275 1362912 1350600 1339165 1328721 1319675 1313005 1309319 1307922 1306972 1304167 1296987 1282856
50224A282856k2718l0595l5322l6194l4397l1525k8472k5666k3462k1855k0306
$$ 1282856 1260138 1229543 1194221 1158027 1123630 1092105 1063633 1037967 1014505 992650 972344
50213I72344j8382j6197j3986j1652r262p403o402n607m206k492j509j548j900
$$ 972344 953962 937765 923779 912127 902865 895462 889060 883453 879247 876755 875246 873698 871798
50200H71798k163k758l938n144n839o291o915p439p367o894o669o886p137p088
$$ 871798 869635 866877 862939 857795 851956 845665 838750 831311 823944 817050 810381 803495 796358 789270
50186G89270o867o774o906p034o796o093n352n114n310n326m932m575m493m199
$$ 789270 782403 775629 768723 761689 754893 748800 743448 738334 733024 727698 722766 718191 713698 709499
50172G09499l308k363k044j996j336j38N32J83l34rJ017J876K218K456K880L164
$$ 709499 706191 703828 701784 699788 698452 698314 698846 699029 698695 698686 699703 701579 703797 706253 709133 712297
50156G12297K953K538K641L595N119O877Q925J1361J3809J5657J6751J7405J7873
$$ 712297 715250 717788 720429 724024 729143 736020 744945 756306 770115 785772 802523 819928 837801
50143H37801J8240J8829K0062K1717K2980K3529K4005K4926K5787K5902K5687
$$ 837801 856041 874870 894932 916649 939629 963158 987163 1012089 1037876 1063778 1089465
50132A089465K6236K7769K9345L0089K9918K8776K5924K0581J3044M739k842r104
$$ 1089465 1115701 1143470 1172815 1202904 1232822 1261598 1287522 1308103 1321147 1325886 1323044 1313940
50120A313940j4308j8813k2508k4987k6099k6087k5226k3642k1489j8963j6051
$$ 1313940 1299632 1280819 1258311 1233324 1207225 1181138 1155912 1132270 1110781 1091818 1075767
50109A075767j2765r695p791p282p401p510p867q727r408r144q341q005q190q025
$$ 1075767 1063002 1053307 1045516 1038234 1030833 1023323 1015456 1006729 997321 988177 979836 971831 963641 955616
50095I55616p094n865m657l272j748n29L60J478K893L881L987L770L968M630N422
$$ 955616 948522 942657 938000 934728 932980 932451 932811 934289 937182 941063 945050 948820 952788 957418 962840
50080I62840O171O624O324N268M194L727L713L762L896M134M048L304K228J215
$$ 962840 969011 975635 981959 987227 991421 995148 998861 1002623 1006519 1010653 1014701 1018005 1020233 1021448
50066A021448O8j429k768l329l418l865m784n522n788n939o161o026n232m124
$$ 1021448 1021516 1020087 1017319 1013990 1010572 1006707 1001923 996401 990613 984674 978513 972487 967255 963131
50052I63131l293k935k830k613j921n52J403L592N620P112P859Q149Q681R778
$$ 963131 959838 956903 954073 951460 949539 948987 950390 953982 959602 966714 974573 982722 991403 1001181
50038A001181J0960J1646J2041J2713J3568J3912J3523J2900J2393J1827J1164
$$ 1001181 1012141 1023787 1035828 1048541 1062109 1076021 1089544 1102444 1114837 1126664 1137828
50027A137828J0823J0945J0987J0482R734R250Q905Q313P735P960R194J0552J0780
$$ 1137828 1148651 1159596 1170583 1181065 1190799 1200049 1208954 1217267 1225002 1232962 1242156 1252708 1263488
50014A263488R232O111K099j950n093o472n848m142l238m794q997j4610k0062
$$ 1263488 1272720 1278831 1280930 1278980 1273887 1267415 1261567 1257425 1254187 1249393 1240396 1225786 1205724
50001A205724k4356k7044k7979k7306k5353k2309j8404j4515j2055j1652j2280
$$ 1205724 1181368 1154324 1126345 1099039 1073686 1051377 1032973 1018458 1006403 994751 982471
49990I82471j2291j1177r800r080r174r902j1266j3168j5108j6500j7090j6883
$$ 982471 970180 959003 949203 940123 930949 921047 909781 896613 881505 865005 847915 831032
49978H31032j5971j4685j3568j2913j2486j1852j0770r120o886m460k617j797
$$ 831032 815061 800376 786808 773895 761409 749557 738787 729667 722781 718321 715704 713907
49966G13907j695j837k222k919l447l225k470j929j765j403m69P52J970L291M735
$$ 713907 712212 710375 708153 705234 701787 698562 696092 694163 692398 690995 690526 691278 693248 696539 701274
49951G01274O011P107Q376R613R751Q095N442L226K054J615J626J917J884Q88
$$ 701274 707285 714392 722768 732381 742132 750227 755669 758895 760949 762564 764190 766107 767991 768879
49937G68879p03j748j803j755k743m999p925j0700j2587j3205j2841j2131j1218
$$ 768879 768176 766428 764625 762870 760127 755128 747203 736503 723916 710711 697870 685739 674521
49924F74521r753p843o319n665n188l898j784K91J692K465K849K855K479J928
$$ 674521 664768 656925 650606 644941 639753 635855 634071 634362 636054 638519 641368 644223 646702 648630
49910F48630J591J793K524L410M182N160O852Q965J0421J0674J0416J0500J0728
$$ 648630 650221 652014 654538 657948 662130 667290 674142 683107 693528 704202 714618 725118 735846
49897G35846J0344R297Q112O752M616J715j007k836m109n528p172q599r531j0031
$$ 735846 746190 755487 763599 770351 774967 776682 775675 772839 768730 763202 756030 747431 737900 727869
49883G27869j0193j0074r783r397q840q040p142o475o291o502o654o178m924l273
$$ 727869 717676 707602 697819 688422 679582 671542 664400 657925 651634 645132 638478 632300 627376 624103
$$ [...]
##END NTUPLES=NMR SPECTRUM
##END=
