##TITLE=AC1686_PANAM14367_8637597_SyNThsx66L
##JCAMPDX= 6.0         $$ Bruker NMR JCAMP-DX V2.0
##DATA TYPE= NMR SPECTRUM
##DATA CLASS= NTUPLES
##ORIGIN= BRUKER
##OWNER= Administrator
$$ 1.72 TOPSPIN		Version 2.1
$$ 2014-05-30 17:09:38.345 -0700  Administrator@X
$$ Compression mode = diff/dup
##.OBSERVE FREQUENCY= 400.02188249412
##.OBSERVE NUCLEUS= ^1H
##.ACQUISITION MODE= SIMULTANEOUS (DQD)
##.ACQUISITION SCHEME= undefined
##.AVERAGES= 64
##.DIGITISER RES= 22
##SPECTROMETER/DATA SYSTEM= spect
##.PULSE SEQUENCE= noesygpps1d.comp
##.SOLVENT NAME= COFFEE_meoh
##.SHIFT REFERENCE= INTERNAL, COFFEE_meoh, 1, 14.96103
##AUDIT TRAIL= $$ (NUMBER, WHEN, WHO, WHERE, PROCESS, VERSION, WHAT)
$$ ##TITLE= Audit trail, TOPSPIN		Version 2.1
$$ ##JCAMPDX= 5.01
$$ ##ORIGIN= Bruker BioSpin GmbH
$$ ##OWNER= Administrator
$$ $$ E:\/data/COFFEE/nmr/AC1686_PANAM14367_8637597_SyNThsx66L/22/pdata/1/auditp.txt
$$ ##AUDIT TRAIL=  $$ (NUMBER, WHEN, WHO, WHERE, PROCESS, VERSION, WHAT)
(   1,<2014-05-30 17:09:33.455 -0700>,<Administrator>,<X>,<go>,<TOPSPIN 2.1>,
      <created by zg
	started at 2014-05-30 16:58:03.422 -0700,
	POWCHK enabled, PULCHK disabled,
       configuration hash MD5:
       C8 4E 4E 5D D3 5C D8 9E 9F 52 82 E0 59 8A DE 15
       data hash MD5: 64K
       38 11 CA AB 2E D3 A2 69 9E 0A B5 32 F1 BC E8 C3>)
(   2,<2014-05-30 17:09:36.345 -0700>,<Administrator>,<X>,<proc1d>,<TOPSPIN 2.1>,
      <Start of raw data processing
       efp LB = 0.3 FT_mod = 6 PKNL = 1 PHC0 = 0 PHC1 = 0 SI = 128K 
       data hash MD5: 128K
       37 4D 98 22 8E 69 A9 5E 00 8D 84 AF 8A 40 FD E1>)
(   3,<2014-05-30 17:09:37.267 -0700>,<Administrator>,<X>,<proc1d>,<TOPSPIN 2.1>,
      <pk PHC0 = -85.63843 PHC1 = 0 
       data hash MD5: 128K
       26 39 FC 8A 17 A1 9B 25 D1 95 C4 F5 30 4D A6 1C>)
(   4,<2014-05-30 17:09:37.736 -0700>,<Administrator>,<X>,<proc1d>,<TOPSPIN 2.1>,
      <abs ABSG = 1 
       data hash MD5: 128K
       26 7F 9D 56 31 DE 06 CA 6E 61 A6 37 BE 0B 44 7B>)
(   5,<2014-05-30 17:09:37.845 -0700>,<Administrator>,<X>,<proc1d>,<TOPSPIN 2.1>,
      <abs ABSG = 2 
       data hash MD5: 128K
       9F D7 FB CA 91 3D 18 34 31 6F 44 F8 ED B2 73 B6>)
(   6,<2014-05-30 17:09:37.924 -0700>,<Administrator>,<X>,<proc1d>,<TOPSPIN 2.1>,
      <abs ABSG = 3 
       data hash MD5: 128K
       5E 8E 24 61 C9 CE 34 D4 74 F4 82 9E 8F 70 34 C8>)
(   7,<2014-05-30 17:09:38.033 -0700>,<Administrator>,<X>,<proc1d>,<TOPSPIN 2.1>,
      <abs ABSG = 4 
       data hash MD5: 128K
       34 32 26 01 B4 08 A7 9B E7 8A 9D 01 80 DC AF DA>)
(   8,<2014-05-30 17:09:38.127 -0700>,<Administrator>,<X>,<proc1d>,<TOPSPIN 2.1>,
      <abs ABSG = 5 
       data hash MD5: 128K
       C8 36 26 8E F8 8A BA 0C 5E AC 06 2D 50 9C 24 AB>)
$$ ##END=
$$ 
$$ $$ hash MD5
$$ $$ 71 E3 C1 9A DE 45 F6 66 A8 64 59 40 A7 2C 7F 38
##$RELAX= 
##$RELAX= 
##$RELAX= 
##$RELAX= 
##$RELAX= 
##$RELAX= 
##$RELAX= 
##$RELAX= 
$$ Bruker specific parameters
$$ --------------------------
##$DU= <E:\>
##$EXPNO= 22
$$ [...]
##$TP07= 0
##$TPNAME0= <>
##$TPNAME1= <>
##$TPNAME2= <>
##$TPNAME3= <>
##$TPNAME4= <>
##$TPNAME5= <>
##$TPNAME6= <>
##$TPNAME7= <>
##$TPOAL= (0..7)
0.5 0.5 0.5 0.5 0.5 0.5 0.5 0.5
##$TPOFFS= (0..7)
0 0 0 0 0 0 0 0
##$TUNHIN= 0
##$TUNHOUT= 0
##$TUNXOUT= 0
##$USERA1= <user>
##$USERA2= <user>
##$USERA3= <user>
##$USERA4= <user>
##$USERA5= <user>
##$V9= 5
##$VALIST= <valist>
##$VCLIST= <CCCCCCCCCCCCCCC>
##$VD= 0
##$VDLIST= <DDDDDDDDDDDDDDD>
##$VPLIST= <PPPPPPPPPPPPPPP>
##$VTLIST= <TTTTTTTTTTTTTTT>
##$WBST= 2048
##$WBSW= 25
##$XGAIN= (0..3)
0 0 0 0
##$XL= 0
##$YL= 0
##$YMAX_a= 6076587
##$YMIN_a= -12990714
##$ZGOPTNS= <>
##$ZL1= 120
##$ZL2= 120
##$ZL3= 120
##$ZL4= 120
##$ABSF1= 14.96103
##$ABSF2= -5.597152
##$ABSG= 5
##$ABSL= 3
##$ALPHA= 0
##$AQORDER= 0
##$ASSFAC= 0
##$ASSFACI= 0
##$ASSFACX= 0
##$ASSWID= 0
##$AUNMP= <proc_prof1d_extract.lims>
##$AXLEFT= 0
##$AXNAME= <>
##$AXNUC= <1H>
##$AXRIGHT= 0
##$AXTYPE= 0
##$AXUNIT= <>
##$AZFE= 0.1
##$AZFW= 0.1
##$BCFW= 0
##$BC_mod= 0
##$BYTORDP= 0
##$COROFFS= 0
##$CY= 15
##$DATMOD= 1
##$DC= 0
##$DFILT= <>
##$DTYPP= 0
##$F1P= 0
##$F2P= 0
##$FCOR= 0.5
##$FTSIZE= 131072
##$FT_mod= 6
##$GAMMA= 0
##$GB= 0
##$INTBC= 1
##$INTSCL= 1
##$ISEN= 128
##$LB= 0.3
##$LEV0= 0
##$LPBIN= 0
##$MAXI= 10000
##$MC2= 0
##$MEAN= 0
##$ME_mod= 0
##$MI= 0
##$NCOEF= 0
##$NC_proc= -2
##$NLEV= 6
##$NOISF1= 0
##$NOISF2= 0
##$NSP= 0
##$NTH_PI= 0
##$NZP= 0
##$OFFSET= 14.96103
##$PC= 1
##$PHC0= -85.63843
##$PHC1= 0
##$PH_mod= 1
##$PKNL= yes
##$PPARMOD= 0
##$PPDIAG= 0
##$PPIPTYP= 0
##$PPMPNUM= 2147483647
##$PPRESOL= 1
##$PSCAL= 4
##$PSIGN= 0
##$PYNMP= <proc.py>
##$REVERSE= no
##$SF= 400.02000962644
##$SI= 131072
##$SIGF1= 0
##$SIGF2= 0
##$SINO= 400
##$SIOLD= 131072
##$SPECTYP= <>
##$SREGLST= <1H.CDCl3>
##$SSB= 0
##$STSI= 131072
##$STSR= 0
##$SW_p= 8223.68421052631
##$SYMM= 0
##$S_DEV= 0
##$TDeff= 65536
##$TDoff= 0
##$TI= <>
##$TILT= no
##$TM1= 0
##$TM2= 0
##$TOPLEV= 0
##$USERP1= <user>
##$USERP2= <user>
##$USERP3= <user>
##$USERP4= <user>
##$USERP5= <user>
##$WDW= 1
##$XDIM= 131072
##$YMAX_p= 456484252
##$YMIN_p= -167785
##$CURPLOT= <Network HP LaserJet P1505>
##$CURPRIN= <$Network HP LaserJet P1505>
##$DFORMAT= <normdp>
##$LAYOUT= <+/1D_H.xwp>
##$LFORMAT= <normlp>
##$PFORMAT= <normpl>
##$SURQMSG= 1
$$ End of Bruker specific parameters
$$ ---------------------------------
##NTUPLES= NMR SPECTRUM
##VAR_NAME=  FREQUENCY,     SPECTRUM/REAL,   SPECTRUM/IMAG
##SYMBOL=    X,             R,               I
##VAR_TYPE=  INDEPENDENT,   DEPENDENT,       DEPENDENT
##VAR_FORM=  AFFN,          ASDF,            ASDF
##VAR_DIM=   131072,        131072,          131072
##UNITS=     HZ,            ARBITRARY UNITS, ARBITRARY UNITS
##FACTOR=    0.0627417313425164, 1,          1
##FIRST=     8223.62146879497, 3140,         -61505
##LAST=      0,             5582,            -60775
##MIN=       0,             -167785,         0
##MAX=       8223.62146879497, 456484252,    0
$$ Real data points
##PAGE= N=1
##DATA TABLE= (X++(R..R)), XYDATA
$$ [...]
61572C78740L01Q78R58N50K46M79R87J198J038J113K014L605N132N874N622M684
61556D13419L588K753K260J908J507J131R98J116J096M50p77j854k042j406o40
61541D23507j42K50N51L60l03n59L14J821K863L086K895K489J629K90j125k169
61525D35757k469j849r13r60k373l651l155j456m94p68r53k99L74M72O30J210
61509D19103J402Q04M92J428K921L777L957L984L759L188L086M150N710O731P376
61494D71868Q317R121Q847P777P151P235P017N829M126K568J356N91M67R19J690
61479E44879K697L810M511M449M025L681K950J150j256k942l289k828k199j607
61465E58031j302j686k797m273n845p304q180q135p579p153o737n710m046k342
$$ y = [378740, 379041, 379919, 380877, 381427, 381673, 382152, 383139, 384337, 385375, 386488, 388502, 392107, 397239, 403113, 408735, 413419, 417007, 419760, 422020, 423928, 425435, 426566, 427564, 428680, 429776, 430226, 429449, 427595, 425553, 424147, 423507, 423365, 423615, 424166, 424526, 424223, 423664, 423978, 425799, 428662, 431748, 434643, 437132, 438761, 439051, 437926, 435757, 433288, 431439, 430526, 429566, 427193, 423542, 420387, 418931, 418437, 417669, 416716, 416417, 416791, 417263, 417893, 419103, 420505, 421309, 421801, 423229, 426150, 429927, 433884, 437868, 441627, 444815, 447901, 452051, 457761, 464492, 471868, 480185, 489306, 498153, 505930, 513081, 520316, 527333, 533162, 537288, 539856, 541212, 541803, 542270, 543189, 544879, 547576, 551386, 555897, 560346, 564371, 568052, 571002, 572152, 570896, 567954, 564665, 561837, 559638, 558031, 556729, 555043, 552246, 547973, 542128, 534824, 526644, 518509, 510930, 503777, 497040, 491330, 487284, 484942]
61451D84942r26L19J273J589J350J025Q46Q63J356K350L043K724K036K173K948
61436E07911K937J715N02K05J08p11j758j883r46J67P68Q22N00K1o2Q53K652M379
61418E18180N121M933M658M736M504L074P82r57j449j533k145k884k875k349k270
61403E29526k695k767k220j720j593j315n73R3J53j54k53O4O78J352J716J511
61387E21803R78O80Q94J641L008M824O228O427N816N543O013O647P066P454P634
61372E92656O917N276L658K643J673P3j859l365m208m635m869n112n543n987n951
61357E71367n349m661m165l526k476j280k78N64J306J786J959J974J731R61J4
61342E59927k13M98J202J115P32J009J890K415J965Q40l00r97j114p65k11L51
$$ y = [484942, 484016, 484335, 485608, 487197, 488547, 489572, 490418, 491281, 492637, 494987, 498030, 500754, 502790, 504963, 507911, 510848, 512563, 513065, 513270, 513378, 512667, 510909, 509026, 508080, 508247, 509015, 509837, 510337, 510358, 510296, 511149, 513801, 518180, 523301, 528234, 532892, 537628, 542132, 545206, 545988, 545031, 543582, 542049, 539904, 537020, 534145, 531796, 529526, 526831, 524064, 521844, 520124, 518531, 517216, 516643, 516736, 516889, 516735, 516482, 516546, 517224, 518576, 520292, 521803, 522781, 523461, 524355, 525996, 529004, 533828, 540056, 546483, 552299, 557842, 563855, 570502, 577568, 585022, 592656, 599573, 604849, 608507, 611150, 612823, 612896, 611037, 607672, 603464, 598829, 593960, 588848, 583305, 577318, 571367, 566018, 561357, 557192, 553666, 551190, 549910, 549632, 550196, 551502, 553288, 555247, 557221, 558952, 559913, 559927, 559714, 560212, 561414, 562529, 563261, 564270, 566160, 568575, 570540, 571380, 571080, 570083, 568969, 568204, 567993, 568344]
61326E68344Q22J121J272J558K255L157L728L755L483L258L403M343O160Q117
61312F14776R347J0026J1095J2767J4224J5003J5701J6927J8340J9273J9506J8857
61300G95842J6825J3334R245N425J858j701m755o665p813r243j1209j2822j3244
61287G75077j2731j2286j2631j3531j4029j3331j1564r483p595n884m432l553
61275F54027l103k272o07J221K183K100J588J057L90n40j462j860j339P4J804
61260F53261L098L723M106M599M918M561L507K200J015J01m44n76l70R0Q44J878
61244F86511K960L765M109L953L262K022L85j211k165k199j784j749k186k145
61230F93528p65J612L909N640P084Q502R883J1276J2628J3354J2928J1801J0908
$$ y = [568344, 569166, 570287, 571559, 573117, 575372, 578529, 582257, 586012, 589495, 592753, 596156, 600499, 606659, 614776, 624123, 634149, 645244, 658011, 672235, 687238, 702939, 719866, 738206, 757479, 776985, 795842, 812667, 826001, 835246, 840671, 842529, 840828, 836073, 829408, 821595, 812352, 801143, 788321, 775077, 762346, 750060, 737429, 723898, 709869, 696538, 684974, 675491, 667896, 662012, 657580, 654027, 650924, 648652, 648045, 649266, 651449, 653549, 655137, 656194, 656584, 656044, 654582, 652722, 651383, 651457, 653261, 656359, 660082, 664188, 668787, 673705, 678266, 681773, 683973, 684988, 685089, 684645, 684069, 683699, 683789, 684633, 686511, 689471, 693236, 697345, 701298, 704560, 706582, 706967, 705756, 703591, 701392, 699608, 697859, 695673, 693528, 692763, 694375, 698284, 703924, 711008, 719510, 729393, 740669, 753297, 766651, 779579, 791380, 802288]
61217H02288J0287R189P596O544O582O906O520N433M229L252K731K916L490L547
61203H81510K816K248K734L842M559M800N385O808Q853J1137J3348J4920J5137
61190I78097J3615J0541O491K265j305l751n103n591n497n358n924p580r986j2458
61176I48456j4402j5427j5482j5049j4723j4516j4015j3325j3138j3694j4316
61165G90369j4326j3837j3261j2658j2004j1538j1307j0766r352p239n181l736
61153F65164k846j940l95J813L908N117N544N648N075L012k17k903l831l536l241
61138F76372l319l351k969k002l60J650L367M563N725P166Q509R485J0552J2165
61124G27553J3969J5362J6355J7383J8630K0075K1778K3691K5515K7056K8298
$$ y = [802288, 812575, 821764, 829360, 835904, 842486, 849392, 855912, 861345, 865574, 868826, 871557, 874473, 877963, 881510, 884326, 886574, 889308, 893150, 897709, 902509, 907894, 914702, 923555, 934692, 948040, 962960, 978097, 991712, 1002253, 1008744, 1011009, 1009704, 1005953, 1000850, 995259, 989762, 984404, 978480, 970900, 960914, 948456, 934054, 918627, 903145, 888096, 873373, 858857, 844842, 831517, 818379, 804685, 790369, 776043, 762206, 748945, 736287, 724283, 712745, 701438, 690672, 681320, 674081, 668900, 665164, 662318, 660378, 659983, 661796, 665704, 670821, 676365, 682013, 687088, 690100, 689883, 686980, 683149, 679613, 676372, 673053, 669702, 666733, 664731, 664371, 666021, 669388, 673951, 679676, 686842, 695351, 704836, 715388, 727553, 741522, 756884, 773239, 790622, 809252, 829327, 851105, 874796, 900311, 927367, 955665]
61113I55665K8968K8632K7439K6064K4742K3139K1444K0524K0491K0175J8702
61102A215985J6663J4898J3017J0128O370K715l41k943n151o856q198r308r928
61089A237051r768q975p766o071l892j547Q70L685O863R758J2099J4498J7311
61076A264116J9833K1300K1992K2625K3236K3370K2759K1199J8428J4815J1439
61065A485112Q773O078K817l34k735n056q134j1375j3583j4790j5971j7312j8049
61052A395441j7725j6603j4985j3067j1307j0089r216q302p323o266m806l019
61040A272733j645r19J33K311M881O578P382Q203R395J0603J1672J2783J4056
61027A358166J5759J8351K1619K4431K6009K6726K7111K7192K7523K9498L3721
$$ y = [955665, 984633, 1013265, 1040704, 1066768, 1091510, 1114649, 1136093, 1156617, 1177108, 1197283, 1215985, 1232648, 1247546, 1260563, 1270691, 1277061, 1279776, 1279435, 1276492, 1271341, 1264485, 1256287, 1246979, 1237051, 1227283, 1218308, 1210542, 1204471, 1200579, 1199032, 1199902, 1203587, 1210450, 1220208, 1232307, 1246805, 1264116, 1283949, 1305249, 1327241, 1349866, 1373102, 1396472, 1419231, 1440430, 1458858, 1473673, 1485112, 1493885, 1499963, 1502780, 1502446, 1499711, 1494655, 1486521, 1475146, 1461563, 1446773, 1430802, 1413490, 1395441, 1377716, 1361113, 1346128, 1333061, 1321754, 1311665, 1302449, 1294147, 1286824, 1280558, 1275752, 1272733, 1271088, 1270169, 1270302, 1272613, 1277494, 1284072, 1291454, 1299657, 1309052, 1319655, 1331327, 1344110, 1358166, 1373925, 1392276, 1413895, 1438326, 1464335, 1491061, 1518172, 1545364, 1572887, 1602385, 1636106]
61016A636106L9413M6355N5681O7403P9057Q8638R7338J07635J20634J37572J61816
61005B637648J96257K40068K91128L50246M20199N02970O02542P28942Q94895
60996F864895J109786J379027J696774K015586K218349K151856J733351J044493
60988B0214117L08902k41524m90332m49904j95637J74315N20914O63176M59113
60979B0963140q5061p95500j436547j848111k001015j955113j791001j573865
60971I476927j348018j138363r53138p92139o54669n40033m45097l66060l01373
60962B938037k50236k09901j77165j50993j31158j15654j02014r0080q0839p3389
60952A556608o5528n6813m8686m1906l6027l1276k8797k8812l0087l1419l2329
$$ y = [1636106, 1675519, 1721874, 1777555, 1844958, 1924015, 2012653, 2109991, 2217626, 2338260, 2475832, 2637648, 2833905, 3073973, 3365101, 3715347, 4135546, 4638516, 5241058, 5970000, 6864895, 7974681, 9353708, 11050482, 13066068, 15284417, 17436273, 19169624, 20214117, 20523019, 20281495, 19791163, 19341259, 19145622, 19319937, 19840851, 20504027, 20963140, 20878079, 20082579, 18646032, 16797921, 14796906, 12841793, 11050792, 9476927, 8128909, 6990546, 6037408, 5245269, 4590600, 4050567, 3605470, 3239410, 2938037, 2687801, 2477900, 2300735, 2149742, 2018584, 1902930, 1800916, 1710836, 1629997, 1556608, 1491080, 1434267, 1385581, 1343675, 1307648, 1276372, 1247575, 1218763, 1188676, 1157257, 1124928]
60941A124928l2329l0954k8744k7016k6385k6258k5836k4818k3185k1089j8936
60930H39378j7028j5255j3552j2292j1614j0938r726q321p348o790o331o086o178
60917G07919o154n563m764m333m092l453k400j340m40K50L99j79j134k123l270
60902F69323m455m935m390l766m130n257o201o755p353q035q557r059r597r413
60888E77420p814n616m441m621m868m213l219k948l505m161m388m331m411m727
60874E14157m838m257l036j701m89Q14K179L059L155K956L089L560M078M597N082
60859E32405N239M959M673M761M946M721M010K993J805P24K09L08N05N13N96Q51
60843E74218Q15K51m04r42j895l591n412o705p639q469q756q182p429p267p300
$$ y = [1124928, 1092599, 1061645, 1032901, 1005885, 979500, 953242, 927406, 902588, 879403, 858314, 839378, 822350, 807095, 793543, 781251, 769637, 758699, 748973, 740652, 733304, 726514, 720183, 714097, 707919, 701765, 696202, 691438, 687105, 683013, 679560, 677160, 675820, 675380, 675630, 676029, 675850, 674716, 672593, 669323, 664868, 659933, 655543, 651777, 647647, 642390, 636189, 629434, 622081, 614046, 605489, 596430, 586833, 577420, 569606, 563990, 559549, 554928, 550060, 545847, 542628, 539680, 536175, 532014, 527626, 523295, 518884, 514157, 509319, 505062, 502026, 500325, 499836, 500650, 502829, 505888, 509043, 511999, 515088, 518648, 522726, 527323, 532405, 537644, 542603, 547276, 552037, 556983, 561704, 565714, 568707, 570512, 571236, 571445, 571753, 572258, 572771, 573367, 574218, 575033, 575284, 574880, 573938, 572043, 568452, 563040, 556335, 548696, 540227, 531471, 523289, 515860, 508593, 501293]
60828E01293o698n620m952m952n056m794m104l144k387k446l144l368k672k208
60814D45748l086m523m875l980l058k666k135j067pN23N67K43l65p23k17Q02J265
60797D22446P89R3r1K36Q24J523K079K245K264K580L025K964K289J590J222R19
60781D46997M16k14r57j924k835l057k438j609j270j467j799j939j858j756j856
60766D22434k051j877j045R6R29J170R92O98N73P50R17N97j00n02m05m79j153
60749D21544j765j505n68L68J228K261L074K964J881L51j301k808l481k854j619
60734D17770r88j231j594j502r75j28Q90J522J327P41N93J004J486J910K453K850
60718D26128K658K188K098K171J627O48L91J175J822J296J04m83m9P63J134Q18
$$ y = [501293, 494595, 488975, 484023, 479071, 474015, 469221, 465117, 461973, 459586, 457140, 453996, 450628, 447956, 445748, 442662, 438139, 433264, 429284, 426226, 423560, 421425, 420358, 420351, 420874, 421441, 421684, 421319, 420596, 420379, 421181, 422446, 423235, 423328, 423237, 423473, 424297, 425820, 427899, 430144, 432408, 434988, 438013, 440977, 443266, 444856, 446078, 446997, 447413, 447199, 446242, 444318, 441483, 438426, 435988, 434379, 433109, 431642, 429843, 427904, 426046, 424290, 422434, 420383, 418506, 417461, 417557, 418486, 419656, 420648, 421346, 421919, 422669, 423586, 424183, 424083, 423581, 423176, 422697, 421544, 419779, 418274, 417706, 418074, 419302, 421563, 424637, 427601, 429482, 429833, 428532, 425724, 422243, 419389, 417770, 416782, 415551, 413957, 412455, 411480, 411352, 412242, 413764, 415091, 415832, 416425, 417429, 418915, 420825, 423278, 426128, 428786, 430974, 433072, 435243, 436870, 437518, 437909, 439084, 440906, 442202, 442306, 441823, 441774, 442537, 443671, 444489]
60702D44489J32m71r45j638k614l325l355l097l103l226k995k531k286k197j899
60687D10939j435r54j22J143J820R55n20n69J321L547M561M351L605K751K304
60672D33697K855M098M847M531L718K770J121j419l717m580m250l798l610l302
60658D32961k614j677o52K71P46O66M38N45J111J989K902L324K844J938J671K292
60642D48755K696J785j64j929k707k561k021j710k082k943l476l042j764k14J122
60627D29745J821J577O86RK1L27M82P50J465K082J738N65l55l62M1J10r1K6N28
60608D41165P47K55l82k03Q65J778J565M79l67k84M60J139J236O65j97o37j16
60591D48168J195K539L264L249K791K263J878J571J148N94J15j92l74k83L53J345
$$ y = [444489, 444621, 444150, 443205, 441567, 438953, 435628, 432273, 429176, 426073, 422847, 419852, 417321, 415035, 412838, 410939, 409504, 408550, 408428, 409571, 411391, 412346, 411826, 411257, 412578, 416125, 420686, 425037, 428642, 431393, 433697, 436552, 440650, 445497, 450028, 453746, 456516, 457637, 456218, 452501, 447921, 443671, 439873, 436263, 432961, 430347, 428670, 428018, 428289, 429035, 429701, 430139, 430684, 431795, 433784, 436686, 440010, 442854, 444792, 446463, 448755, 451451, 453236, 453072, 451143, 448436, 445875, 443854, 442144, 440062, 437119, 433643, 430601, 428837, 428623, 429745, 431566, 433143, 433829, 433838, 433859, 434186, 434668, 435418, 436883, 438965, 440703, 441268, 440913, 440551, 440592, 440702, 440611, 440637, 441165, 441912, 442167, 441785, 441582, 442447, 444225, 445790, 446269, 445902, 445618, 446078, 447217, 448453, 449118, 448921, 448284, 448168, 449363, 451902, 455166, 458415, 461206, 463469, 465347, 466918, 468066, 468660, 468775, 468583, 468209, 467926, 468279, 469624]
60575D69624K052K306K799M012N356N963N911N982O511P200P828Q417Q851Q984
60561E51796Q958Q834Q110O230L440N52j918l803m874m993m428l480k075l09J160
60546E63200K016K965M598O159O611O402O832Q038R043R671J0827J2788J4759
60533F63909J6387J8304K0670K2423K2550K1114J8450J4487R344L781j512o317
60521H23590j0257j2750j3870j4400j4622j4002j2396j0578r077p536n715m131
60509F94256l064j944m35Q59J572K587M900Q134J1166J3717J6374J9399K2446
60496G89967K5314K8201L1142L3718L5386L5820L4913L2637K8969K4099J8824
60485A118990J4455J1860J0779J0507J0748J1041R836N479j899j0605j9515k8687
$$ y = [469624, 471676, 473982, 476781, 480793, 486149, 492112, 498023, 504005, 510516, 517716, 525544, 533961, 542812, 551796, 560754, 569588, 577698, 583928, 587368, 587920, 586002, 582199, 577325, 572332, 567904, 564424, 562349, 562040, 563200, 565216, 568181, 572779, 578938, 585549, 591951, 598783, 606821, 615864, 625535, 636362, 649150, 663909, 680296, 698600, 719270, 741693, 764243, 785357, 803807, 818294, 827638, 831419, 829907, 823590, 813333, 800583, 786713, 772313, 757691, 743689, 731293, 720715, 711638, 704102, 698387, 694256, 691192, 689248, 688813, 689672, 691244, 693831, 698731, 706865, 718031, 731748, 748122, 767521, 789967, 815281, 843482, 874624, 908342, 943728, 979548, 1014461, 1047098, 1076067, 1100166, 1118990, 1133445, 1145305, 1156084, 1166591, 1177339, 1188380, 1198216, 1203695, 1201796, 1191191, 1171676, 1142989]
60473A142989l7660m4688m8412m9198m8112m5581m1831l7626l3634k9762k5893
60462G00592k2609k0464j9021j7369j5173j2704j0313q395p331p037o938o675
60450E46563o315n764m761l633l127l178k828j835j226j694k464k501j887j230
60436E04120n88J37N79M89K41K6o18j736k322j764r89j136j776j642n16Q08J912
60419D95225K923L626L584K989K430J953J224M05Q2M17J107J925K610K620J780
60404E24900R15J001J855K487K550K633L186L923M351M354M128L946L994M171
60390E68394M210M123M158M220L896L268K955L047K773J738O86M03O81J049J664
60375F07265K581K954K142R94Q74J765K440K270J793J660J924K373K769K844K683
$$ y = [1142989, 1105329, 1060641, 1012229, 963031, 914919, 869338, 827507, 789881, 756247, 726485, 700592, 677983, 657519, 638498, 621129, 605956, 593252, 582939, 574544, 567213, 560176, 553238, 546563, 540248, 534484, 529723, 526090, 522963, 519785, 516957, 515122, 513896, 512202, 509738, 507237, 505350, 504120, 503532, 503669, 504248, 504737, 504978, 505004, 504386, 502650, 500328, 498564, 497575, 496439, 494663, 493021, 492505, 493313, 495225, 498148, 501774, 505358, 508347, 510777, 512730, 513954, 514359, 514441, 514858, 515965, 517890, 520500, 523120, 524900, 525815, 526816, 528671, 531158, 533708, 536341, 539527, 543450, 547801, 552155, 556283, 560229, 564223, 568394, 572604, 576727, 580885, 585105, 589001, 592269, 595224, 598271, 601044, 602782, 603468, 603871, 604552, 605601, 607265, 609846, 612800, 614942, 615936, 616810, 618575, 621015, 623285, 625078, 626738, 628662, 631035, 633804, 636648, 639331]
60360F39331K954M123N722O915P482P645P451P095P391Q980J1263J2924J3301
60347G42577J2551J0842Q183M883J438j931n025p295q364q647q801q885q570p878
60333G15078p053o158n366n093n244n001m103l580m301n464n644m692l520k482
60319F47377j348l29J87P39K218M262N574N886O414Q127J0579J2646J3568J3124
60305G29024J1669J0064Q921P898O404M691L418K455J075q35k858n115q109j1528
60291G57174j4263j5659j5820j4738j2285r136o570n146m410l928l680l481l030
60278F45028k628k840l470l859m090m748n570n693n301n526o429o582n280l714
60264E79298l169l344l299l040l026k997k398j434p62m35K0P62J481J903J965
$$ y = [639331, 642285, 646408, 652130, 659045, 666527, 674172, 681623, 688718, 696109, 705089, 716352, 729276, 742577, 755128, 765970, 774153, 779036, 780474, 778543, 773518, 766223, 757859, 749212, 740411, 731526, 722956, 715078, 708025, 701867, 696501, 691408, 686164, 681163, 677060, 673480, 669179, 663715, 658071, 653379, 649859, 647377, 646029, 645700, 645887, 646626, 648844, 653106, 658680, 664566, 670980, 679107, 689686, 702332, 715900, 729024, 740693, 750757, 759678, 767576, 773980, 778671, 782089, 784544, 785619, 784784, 781926, 776811, 768702, 757174, 742911, 727252, 711432, 696694, 684409, 675273, 668703, 663557, 659147, 655219, 651539, 648058, 645028, 642400, 639560, 636090, 632231, 628141, 623393, 617823, 612130, 606829, 601303, 594874, 588292, 583012, 579298, 576129, 572785, 569486, 566446, 563420, 560423, 558025, 556591, 555829, 555394, 555414, 556176, 557657, 559560, 561525]
60249E61525J775J690K086K740K860K062R09J05l06n95o99n14m03p99j368j223
60233E69845jJ563K433K441K454L270M499M965M362L845M555O065P060P246P640
60218F32242Q971J0698J1905J2438J2731J2983J3005J2665J2166J1847J1743J1427
60206G74821J0518R353Q741Q895R135Q935Q604Q396P718O097M318L456L183K169
60192H74339N1k103l375l981m572n495o849q480r681r727q869q117p962p955p588
60177G79636o844n788m415l028k057j458r11o03j041k130l213m033m858n625n893
60162G27739n681n474n309m739l817l215l147l063k564j795p91O58K255L211L306
60147F97574L132L064K846K428K301K697L219L644M293N243N976O133O061O214
$$ y = [561525, 563300, 564990, 567076, 569816, 572676, 574738, 575647, 575752, 575446, 574851, 574152, 573638, 573235, 572436, 571068, 569845, 569844, 571407, 573840, 576281, 578735, 582005, 586504, 591469, 595831, 599676, 604231, 610296, 617356, 624602, 632242, 641213, 651911, 663816, 676254, 688985, 701968, 714973, 727638, 739804, 751651, 763394, 774821, 785339, 794692, 803433, 812328, 821463, 830398, 839002, 847398, 855116, 861213, 865531, 868987, 872170, 874339, 874390, 872287, 868912, 864931, 860359, 854864, 848015, 839535, 829854, 820127, 811258, 803141, 795179, 787224, 779636, 772792, 767004, 762589, 759561, 757504, 756046, 755135, 754532, 753491, 751361, 748148, 744115, 739257, 733632, 727739, 722058, 716584, 711275, 706536, 702719, 699504, 696357, 693294, 690730, 688935, 688144, 688802, 691057, 694268, 697574, 700706, 703770, 706616, 709044, 711345, 714042, 717261, 720905, 725198, 730441, 736417, 742550, 748611, 754825]
60133G54825O618P140P656P896P628P104O660O010M739L329K709K856K930K797
60119H30897L167M132M915N337O125P299P653O628N397N189N564N253L930K233
60105I03719P27l31p86q88j296k226l034l082k452j532n59P2r3p97j203j232j813
60088H83194l317m770n360n674o574p693q098p815p634p786p777p307o612o014
60074G90763n747o022o784p513p658p145o326n709n776o614p597p898p434o720
60060F95820n960m995m091l754l715l126j998j291j307j125j33J068J848K531
60046F69772L496M352M725N002N572O185O640P205P750P487O241M973M265L355
60032G47020J513o06j961k543k885l004k828k931l849n314o882q581j0198j0915
$$ y = [754825, 761443, 768583, 776239, 784135, 791763, 798867, 805527, 811537, 816276, 819605, 822314, 825170, 828100, 830897, 834064, 838196, 843111, 848448, 854573, 861872, 869525, 876153, 881550, 886739, 892303, 897556, 901486, 903719, 904446, 904115, 903329, 902441, 901145, 898919, 895885, 892803, 890351, 888819, 888260, 888332, 888239, 887442, 886239, 885007, 883194, 879877, 875107, 869747, 864073, 857499, 849806, 841708, 833893, 826259, 818473, 810696, 803389, 796777, 790763, 785016, 778994, 772210, 764697, 757039, 749894, 743568, 737859, 732083, 725469, 717872, 709974, 702540, 695820, 689860, 684865, 680774, 677020, 673305, 670179, 668181, 666890, 665583, 664458, 664325, 665393, 667241, 669772, 673268, 677620, 682345, 687347, 692919, 699104, 705744, 712949, 720699, 728186, 734427, 739400, 743665, 747020, 748533, 747927, 745966, 743423, 740538, 737534, 734706, 731775, 727926, 722612, 715730, 707149, 696951, 686036]
60018F86036j0500r887r681r150p672o053n108m124k216k66J83p38j650k113k678
60003F14383l187k808j652q04o08l82K15P34J016J434K005K356K610L299M308
59988F22919M991N309N816O508O694O154N347M436L073J311k62j418k541l712
59974F64625m470m623m593m722m852m741m321l534k476j608j264j016j68J244
59960F23481K601L694M763N644N742M928L690K440J262L97J97M52N07J47p8L54
59944F60221J287K060K055J104l25j484k138k697l316l376k367o84J051K859M892
59929F59142O641P583Q212R371J0842J1502J0720Q740O045L231J207N00M73K29
59915G44438kO79K270L899N262O733Q031Q086O509M134J762n83k887m561n283
$$ y = [686036, 675536, 665649, 655968, 646818, 639146, 633093, 627985, 623861, 621645, 621379, 621562, 620824, 619174, 617061, 614383, 611196, 608388, 606736, 605932, 605324, 604942, 605157, 605891, 606907, 608341, 610346, 612702, 615312, 618611, 622919, 627910, 633219, 639035, 645543, 652237, 658391, 663738, 668174, 671247, 672558, 672296, 670878, 668337, 664625, 660155, 655532, 650939, 646217, 641365, 636624, 632303, 628769, 626293, 624685, 623421, 622405, 622237, 623481, 626082, 629776, 634539, 640183, 645925, 650853, 654543, 656983, 658245, 658642, 658839, 659291, 659798, 659945, 659867, 660221, 661508, 663568, 665623, 666727, 666402, 664918, 662780, 660083, 656767, 653391, 651024, 650340, 651391, 654250, 659142, 665783, 673366, 681578, 690949, 701791, 713293, 724013, 732753, 738798, 742029, 743236, 743736, 744209, 744438, 744436, 745115, 747385, 751284, 756546, 763279, 771310, 779396, 785905, 790039, 791801, 791218, 788331, 783770, 778487]
59900G78487n584o108o796p116o665n363l507j723l79Q90K580M325N277N390N493
59885G59201O034O589O788O881P135P383P503P757Q339R050R553R597Q949P650
59871H68409O249N224M235K607M60j306k192k453k320j767j186j348k291k975
59857H69346k522j200J46J114J760J967J309n17l158n454o023m400j497J318L365
59842H55554M416L965J655j658m316n482n589n087l686j209J560L443L886L138
59828H50590J851O95P9q1o6J06N74J196J672K123L035M558O290P752Q707R055
59812H98136Q745P777O004L230j98l205m946n615n797n518m678l981m419n916
59798H79619p402q206q569q924r415j0071j0663j0532r350p965p515p853p842
$$ y = [778487, 772903, 766795, 759999, 752883, 746218, 740855, 737348, 735625, 735246, 736136, 738716, 743041, 748318, 753708, 759201, 765235, 771824, 778612, 785493, 792628, 800011, 807514, 815271, 823610, 832660, 842213, 851810, 860759, 868409, 874658, 879882, 884117, 886724, 887184, 885878, 883686, 881233, 878913, 877146, 875960, 874612, 872321, 869346, 866824, 865624, 865770, 866884, 868644, 870611, 871920, 871403, 868245, 862791, 856768, 852368, 850871, 852189, 855554, 859970, 863935, 865590, 863932, 859616, 854134, 848545, 843458, 839772, 838563, 840123, 843566, 847452, 850590, 852441, 853136, 853215, 853134, 853068, 853174, 853748, 854944, 856616, 858739, 861774, 866332, 872622, 880374, 889081, 898136, 906881, 914658, 920662, 923892, 923694, 920489, 915543, 909928, 904131, 898613, 893935, 889954, 885535, 879619, 872217, 864011, 855442, 846518, 837103, 827032, 816369, 805837, 796487, 788522, 781007, 773154, 765312]
59785G65312p109o411o187n968n423m895m502l761k525j354m87O20K221L649M424
59770G27604N134O430P789Q188P675P376P990Q973R420R314R460J0305J1150J0979
59756H47787R959R492J0464J2068J2834J2345J1205R859Q300O666N174L611J737
59743I61501N4p80j136k062l724n246o077o568o994p047o549n836n133m357l693
59728H96353l530l600l058j749n62j73k24j32J2j97p46j238j261n33Q63K310L217
59711H85752L862N042O911Q769J0028J0767J1290J1827J2662J3848J4769J4755
59699A010282J4099J3645J3453J2803J1583J0617J0395J0351R773Q568O877M705
59687A137151K309K31j241k157k464k229k177l133m884o562p974r514j0807j0803
$$ y = [765312, 758203, 751792, 745605, 739637, 734214, 729319, 724817, 721056, 718531, 717177, 716690, 717310, 719531, 723180, 727604, 732738, 739168, 746957, 755145, 762820, 770196, 778186, 787159, 796579, 805893, 815353, 825658, 836808, 847787, 857746, 867238, 877702, 889770, 902604, 914949, 926154, 936013, 944313, 950979, 956153, 959764, 961501, 961555, 960775, 959639, 957577, 953853, 948607, 942530, 935962, 928968, 921921, 915372, 909536, 904403, 900046, 896353, 892823, 889223, 886165, 884416, 883854, 883681, 883457, 883325, 883337, 883140, 882394, 881156, 879895, 879362, 880225, 882535, 885752, 889614, 894656, 901567, 910336, 920364, 931131, 942421, 954248, 966910, 980758, 995527, 1010282, 1024381, 1038026, 1051479, 1064282, 1075865, 1086482, 1096877, 1107228, 1117001, 1125569, 1132446, 1137151, 1139460, 1139691, 1138450, 1136293, 1133829, 1131600, 1129423, 1126290, 1121406, 1114844, 1106870, 1097356, 1086549, 1075746]
59673A075746r495q262q026q239q117p657o908n334k732Q7K245L785N185O631
59659A028909Q183J0006J1884J3233J3935J4568J5468J6229J6300J5435J3373
59648A177523R910N457O98m311r815j5211j9375k2194k4432k6024k5980k4276
59636A021970k2258k0679j8883j6475j4226j2507j0506q048o683p624r906j1833
59624H62342j3104j4185j4739j4224j3232j2709j2430j1546j0201r270q902q431
59612G19369p438n932l909j695k53j91p75p91p8O20Q64Q01O21N20Q12J459J908
59595G05912J987K201K650K471J261P5J1O03P53M91N27O32q8j665l260m472n408
59578G04681n708m826l286k454k897l887m583m788m517l777k971k727l026l136
$$ y = [1075746, 1066251, 1057989, 1049963, 1041724, 1033607, 1025950, 1019042, 1013708, 1010976, 1011063, 1013308, 1017093, 1022278, 1028909, 1037092, 1047098, 1058982, 1072215, 1086150, 1100718, 1116186, 1132415, 1148715, 1164150, 1177523, 1187433, 1192890, 1193588, 1189277, 1179462, 1164251, 1144876, 1122682, 1098250, 1072226, 1046246, 1021970, 999712, 979033, 960150, 943675, 929449, 916942, 906436, 898388, 891705, 884081, 874175, 862342, 849238, 835053, 820314, 806090, 792858, 780149, 767719, 756173, 745972, 736702, 727800, 719369, 711931, 705999, 702090, 700395, 700142, 699951, 699176, 698385, 698307, 698927, 699791, 700592, 701213, 701733, 702545, 704004, 705912, 707899, 710100, 712750, 715221, 716482, 716557, 716568, 717171, 717924, 718415, 718942, 719574, 719486, 717821, 714561, 710089, 704681, 698973, 694147, 690861, 688407, 685510, 681623, 677040, 672252, 667735, 663958, 660987, 658260, 655234, 652098]
59564F52098k597j702r20l67oJ27M4j32l04l87k20K72R45J598K182K682L094L607
59546F60014M459N447O057O315O986Q595J0676J2472J4126J6666K0794K5573K8226
59533H26406K5711J7436O433k826p964r582r214p699n569l502j750j29R57N75
59519H29283j291l430m985o228p351p858p805q233r456j0241r640q444p739p219
59505G29363o130m831m137l934l630l167k623j595j07Q47P89Q18J993L648M589
59490G11893M996N707O489O594O409O898P836Q093P352O268N232M190L355K991
59476G94303K745K245J846J910J909J274M12k09j069k562l768l680k842k343k011
59461G88160j161l12l62o76J88K222M206N739P289Q490Q322O897N422M399L323
$$ y = [652098, 649501, 647799, 646879, 646512, 646506, 646633, 646677, 646545, 646241, 645854, 645634, 645906, 646851, 648449, 650631, 653313, 656407, 660014, 664473, 669920, 675977, 682292, 689278, 697873, 708549, 721021, 735147, 751813, 772607, 798180, 826406, 852117, 869553, 875986, 873160, 865196, 855614, 846400, 838701, 833132, 829630, 827880, 827751, 828708, 829283, 827992, 824562, 819577, 813349, 805998, 798140, 790335, 782102, 772646, 762405, 752765, 744321, 736582, 729363, 723233, 718402, 714265, 710331, 706701, 703534, 700911, 699316, 699209, 700056, 700845, 701663, 703656, 707304, 711893, 716889, 722596, 729085, 735679, 742088, 748986, 756822, 764915, 772267, 778535, 783767, 787957, 791312, 794303, 797048, 799293, 801139, 803049, 804958, 806232, 806644, 806435, 805366, 802804, 799036, 795356, 792514, 790171, 788160, 786999, 786687, 786325, 785649, 785837, 788059, 792265, 798004, 805293, 813783, 822105, 829002, 834424, 838823, 842146]
59446H42146K102J169K94j265l434n516p388r162j0092r433p973o985o144m374
59432G73945k320j668k133j590N04K260K515K622M133O688R237J1711J4318J6527
59418H36749J7844J8603J9186J9418J9387J9971K2059K5781L0311L3254L0811
59407A093374K0755N775p849j5653j7688j5956j1451m649L359J1667J9798K5656
59395A107138K5059J5603L52j4160k3385k7202k7697k6389k3834k0519j7276j4862
59383I52828j3302j1767r482o777m751l806l210k217q62M86J630K271K051J257
59369I04349Q02J190J997K563K659K393K209K861M614O514P375P458Q099R727
59355I64810J1512J3012J4730J6704J8017J8358J8763K0069K1660K2543K2701
$$ y = [842146, 844248, 845417, 845711, 844446, 841012, 835496, 828108, 818946, 808854, 799421, 791448, 784463, 778319, 773945, 771625, 769957, 767824, 766234, 766738, 768998, 771513, 774135, 778268, 784956, 794193, 805904, 820222, 836749, 854593, 873196, 892382, 911800, 931187, 951158, 973217, 998998, 1029309, 1062563, 1093374, 1114129, 1119904, 1112055, 1096402, 1078714, 1062758, 1051307, 1046658, 1050017, 1061684, 1081482, 1107138, 1132197, 1147800, 1148152, 1133992, 1110607, 1083405, 1055708, 1029319, 1005485, 984966, 967690, 952828, 939526, 927759, 918277, 911500, 906749, 902943, 899733, 897516, 896654, 897140, 898770, 901041, 903092, 904349, 905151, 906341, 908338, 910901, 913560, 915953, 918162, 921023, 925637, 932151, 939526, 946984, 955083, 964810, 976322, 989334, 1004064, 1020768, 1038785, 1057143, 1075906, 1095975, 1117635, 1140178, 1162879]
59344A162879K2615K2253K1305J9760J7561J4366J0240O003K404n47l156n566
59332A290117q015j0845j3881j6477j8315j9591k0360k0583k0739k1401k2132
59321A097778k1945k0946k0217j9924j9004j7106j5285j4239j3354j2222j1567
59310I11969j1783j1941j1335j0678j0614j0261q606o238m329k712n31J999M051
59297H28991N959Q783J1997J3155J0286L874l793j0435j4691j6097j4903j2033
59285H11093q817o368m897l688k030N1K247M742P766J0665J2440J3246J4279J5998
59271H66727J7419J7547J6641J5632J5080J5016J5070J4409J2330R265O442M408
59259A025986K640P82p70j737k385k754k475j788j658k389l124l196k944k749
$$ y = [1162879, 1185494, 1207747, 1229052, 1248812, 1266373, 1280739, 1290979, 1296982, 1299386, 1298839, 1295683, 1290117, 1282102, 1271257, 1257376, 1240899, 1222584, 1202993, 1182633, 1162050, 1141311, 1119910, 1097778, 1075833, 1054887, 1034670, 1014746, 995742, 978636, 963351, 949112, 935758, 923536, 911969, 900186, 888245, 876910, 866232, 855618, 845357, 836751, 830513, 826184, 823472, 822941, 824940, 828991, 834950, 843733, 855730, 868885, 879171, 883045, 879252, 868817, 854126, 838029, 823126, 811093, 802276, 795908, 791011, 787323, 785293, 785344, 787591, 792333, 800099, 810764, 823204, 836450, 850729, 866727, 884146, 901693, 918334, 933966, 949046, 964062, 979132, 993541, 1005871, 1015136, 1021578, 1025986, 1028626, 1029408, 1028638, 1026901, 1024516, 1021762, 1019287, 1017499, 1015841, 1013452, 1010328, 1007132, 1004188, 1001439]
59245A001439k316j534j003j019r72m47nl11j269k560m206o016p426q370r389
59230I54596j0431j0632r877r400j0133j1510j2544j3015j2884j1775r945q573
59218H23877q148p640o206m626l863l399k253o79M45J192K169L208L722L850M081
59203H05730M250M081M181N284O914P980Q331Q624Q987Q918Q340P725P262O805
59189I03412O474O518O638O244N303M229L060J355r83l327m877n470n848o963
59175I15765q800j0108r866q716q021p878p272o076n357n391n076l917k970k983
59161H23334l068k339j507j637k490l248l873m542m752m182l546l433l230k355
59147G79132j564j796k727l702n093p206q817q543p030o127o290o431n944n337
$$ y = [1001439, 999123, 997589, 996586, 995567, 994595, 994148, 994143, 993832, 992563, 990003, 985797, 979781, 972355, 963985, 954596, 944165, 933533, 923656, 914256, 904123, 892613, 880069, 867054, 854170, 842395, 832450, 823877, 815729, 808089, 801883, 797257, 793394, 789995, 787742, 787063, 787508, 788700, 790869, 794077, 797799, 801649, 805730, 809980, 814061, 818242, 823526, 830440, 838420, 846751, 855375, 864362, 873280, 881620, 889345, 896607, 903412, 909886, 916404, 923042, 929286, 934589, 938818, 941878, 943233, 942250, 938923, 934046, 928576, 922728, 915765, 906965, 896857, 886991, 878275, 870254, 862376, 855104, 849028, 843671, 838280, 833204, 829287, 826317, 823334, 820266, 817927, 816420, 814783, 812293, 809045, 805172, 800630, 795878, 791696, 788150, 784717, 781487, 779132, 777568, 775772, 773045, 769343, 764250, 757044, 748227, 739684, 732654, 726527, 720237, 713806, 707862, 702525]
59133G02525m941m381l417k196p72Q08K172L205M462O213P622P963P980Q882J0537
59118G46662J1899J2672J3377J4078J4304J3937J3161J1901J0248Q910Q217P314
59106H86680N469L519K666K478J554k91k004l114m080n033n626o066o898p862
59092H61392q148p638o789n511l504j473n77p41q64o41q44j750k727l477m375
59077H12333n327n583m966m204l689k958j739o00j45l07p22j200j675k080k420
59062G74718k595k435k277k949m561n891n844m979m599m843m810m181l394k504
59048G18856j122M94J546J889K071K172J659M79o69j281j474j389r91m84j93n8
59032G21505K08N57Q12J183J932K905M032N792Q452J1350J3697J5503J6835J6948
$$ y = [702525, 697584, 693203, 689786, 687590, 686818, 687626, 689798, 693003, 697465, 703678, 711300, 719263, 727243, 736125, 746662, 758561, 771233, 784610, 798688, 812992, 826929, 840090, 851991, 862239, 871149, 879366, 886680, 892149, 895668, 898334, 900812, 902366, 902075, 900071, 896957, 892877, 887844, 882218, 876152, 869254, 861392, 853244, 845606, 838817, 833306, 829802, 828329, 827752, 827011, 826147, 825506, 824662, 822912, 820185, 816708, 812333, 807006, 801423, 796457, 792253, 788564, 785606, 783867, 783267, 783122, 782815, 782093, 780893, 779218, 777138, 774718, 772123, 769688, 767411, 764462, 759901, 754010, 748166, 743187, 738588, 733745, 728935, 724754, 721360, 718856, 717734, 718228, 719774, 721663, 723734, 725906, 727565, 728044, 727375, 726094, 724620, 723231, 722240, 721756, 721563, 721505, 721713, 722270, 723082, 724265, 726197, 729102, 733134, 738926, 747378, 758728, 772425, 787928, 804763, 821711]
59018H21711J5271J2620J0146P609M081o6l364n256o461p476q035q014p614o578
59004H18574m474j787L32J516K401L450M500N420O207O444N605L929K237J043
58990H55397M57N88J207J471R26L49O79J631K421L252M816O889Q718J0394J2508
58975I11703J4775J6394J7408J8442J9349J9460J8892J8299J7634J6417J4917
58964A103690J3706J2455J0481Q178O439M973K660p02m351p922j1444j4388j6254
58951A107521j7701j9569k1193k1313k0187j9070j8073j6460j4627j3605j2821
58940I12902j0602o965l775j902l53J441K611K625K273K212K108J712J264N33
58926I06084j047l013m197m550n028n598n257m152l718m226m209k868j235l10
$$ y = [821711, 836982, 849602, 859748, 867357, 871438, 871372, 868008, 862752, 856291, 848815, 840780, 832766, 825152, 818574, 814100, 812313, 812645, 814161, 816562, 820012, 824512, 829932, 836139, 842583, 848188, 852117, 854354, 855397, 855854, 856442, 857649, 859120, 860046, 860395, 861074, 862705, 865126, 868378, 873194, 880083, 888801, 899195, 911703, 926478, 942872, 960280, 978722, 998071, 1017531, 1036423, 1054722, 1072356, 1088773, 1103690, 1117396, 1129851, 1140332, 1148510, 1154949, 1159922, 1162582, 1161880, 1157529, 1149607, 1138163, 1123775, 1107521, 1089820, 1070251, 1049058, 1027745, 1007558, 988488, 970415, 953955, 939328, 925723, 912902, 902300, 895335, 891560, 889658, 889305, 890746, 893357, 895982, 898255, 900467, 902575, 904287, 905551, 906084, 905037, 902024, 897827, 893277, 888249, 882651, 877394, 873242, 869524, 865298, 861089, 858221, 856986, 856676]
58912H56676K42R44J692K652M357O401P681Q325R717J2119J4110J4981J5751J7058
58898I72706J7889J7425J6479J6122J6247J6401J6704J7185J7500J7950J9430
58887A162038K1806K3730K4553K4875K4746K3086J9756J6414J4364J2921J0846
58876A379135Q055M996J635k048n603q764j1567j3473j3727j2826j2229j2318
58864A301266j2236j1954j2582j4162j5258j5397j5878j7297j8252j7630j6298
58853A134322j5428j4827j4121j3875j4332j4557j3961j3331j3373j3719j4178
58842I78620j5320j6872j7376j6492j5779j6053j5873j4048j1817j0814j0419
58831H17757r001o566m456l323k805k472j857m10J637L261M158N083O150O397
$$ y = [856676, 856918, 857862, 859554, 862206, 866563, 872964, 880645, 888970, 898687, 910806, 924916, 939897, 955648, 972706, 990595, 1008020, 1024499, 1040621, 1056868, 1073269, 1089973, 1107158, 1124658, 1142608, 1162038, 1183844, 1207574, 1232127, 1257002, 1281748, 1304834, 1324590, 1341004, 1355368, 1368289, 1379135, 1387190, 1392186, 1393821, 1391773, 1386170, 1377406, 1365839, 1352366, 1338639, 1325813, 1313584, 1301266, 1289030, 1277076, 1264494, 1250332, 1235074, 1219677, 1203799, 1186502, 1168250, 1150620, 1134322, 1118894, 1104067, 1089946, 1076071, 1061739, 1047182, 1033221, 1019890, 1006517, 992798, 978620, 963300, 946428, 929052, 912560, 896781, 880728, 864855, 850807, 838990, 828176, 817757, 808756, 802190, 797734, 794411, 791606, 789134, 787277, 786867, 788504, 791765, 795923, 801006, 807156, 813553]
58817H13553N797N818O949P528O383M867M681N241M901L451J816L81r19j922k853
58802H65672m458o457p276o468n815o689p929p814o632n607m807l787l037k951
58788G85945k574r50J350L498N872Q699J0771J1247J1430J2823J4681J5344J4862
58775H92998J4313J3511J1373P779L292k032p821j2367j4303j4573j5001j5762
58763H61407j5923j5543j5275j4713j3044j0787r082p852o311m698l879l757l596
58750G36947l361l349l199k540j804j119M77L304N786O553O613P551Q837Q992
58736G69688Q350Q360Q965Q979Q443Q416Q744Q258O891N710M959L873K300Q68
58722H62804j31o45j34J625L593M853O164Q475J0799J1442J0590R645Q609O319
$$ y = [813553, 819350, 825168, 832117, 839645, 846028, 850895, 855576, 860817, 865718, 869169, 870985, 871366, 870447, 868525, 865672, 861214, 854757, 847481, 841013, 835198, 828509, 820580, 812766, 806134, 800527, 795720, 791933, 788896, 785945, 783371, 782421, 783771, 787269, 793141, 801840, 812611, 823858, 835288, 848111, 862792, 878136, 892998, 907311, 920822, 932195, 939974, 943266, 941234, 933413, 921046, 906743, 892170, 877169, 861407, 845484, 829941, 814666, 799953, 786909, 776122, 767040, 759188, 752877, 748179, 744300, 740543, 736947, 733586, 730237, 727038, 724498, 722694, 721575, 722052, 725356, 731142, 737695, 744308, 751859, 760696, 769688, 778038, 786398, 795363, 804342, 812785, 821201, 829945, 838203, 845094, 850804, 855763, 859636, 861936, 862804, 862673, 862028, 861894, 863519, 867112, 871965, 878129, 886604, 897403, 908845, 919435, 929080, 937689, 944008]
58708I44008K914j60k489n043q243j1498j4630j8014k1327k3680k4920k5462k5121
58695G66335k3557k1463j9770j8120j5676j2955j1128r955q282o261n215n428
58683F08525n779n579n168m736l963k811j490J03J769K411J423P4J3J018J782
58668E87592K215L263M989O676Q434J0823J3192J4069J3039J0667P028J985l439
58655F80533p644j0204j1636j1934j0964r655r084q809p851o674o367o445n541
58642E67725l874k935k956k737j878j143o41M09J942K812K550J822J138L88l77
58627E62245r23j463k128k311j627q96q71q42R1J329J935K460L833N406O028O088
58611E78354O498O596N323L600L159L783L985L724L986M362L665K382J956K056
$$ y = [944008, 946922, 946762, 944273, 939230, 930987, 919489, 904859, 886845, 865518, 841838, 816918, 791456, 766335, 742778, 721315, 701545, 683425, 667749, 654794, 643666, 633711, 625429, 619168, 613953, 608525, 602746, 597167, 591999, 587263, 583300, 580489, 578999, 579102, 580871, 583282, 584705, 584779, 584792, 585810, 587592, 589807, 593070, 598059, 604735, 613169, 623992, 637184, 651253, 664292, 674959, 681987, 683972, 680533, 672889, 662685, 651049, 639115, 628151, 618496, 609412, 600603, 592752, 586078, 579711, 573266, 567725, 563851, 560916, 557960, 555223, 553345, 552202, 551561, 551970, 553912, 556724, 559274, 561096, 562234, 562622, 562245, 561322, 559859, 557731, 555420, 553793, 552897, 552026, 551184, 551275, 552604, 554539, 556999, 560832, 566238, 572266, 578354, 584852, 591448, 596771, 600371, 603530, 607313, 611298, 615022, 619008, 623370, 627035, 629417, 631373, 633429]
58597F33429J179l73p98J36Q95R54J254K019K579L354N554Q873J1762J3835J5782
58582G00434J7182J6933J5600J4821J4502J3145J0796Q990P894O304M430L936
58570H34967N058O459Q058J1208J5877K0419K4425K9002L3933L7357L8717L9191
58558A104671L8705L5409K8853K0954J3124N087k698q228j0630j1267j1284j0264
58546A192432q253o793o948q239j0263j3465j7721k2008k5982k9945l3097l3941
58534I75777l2717l1161k9629k6782k2475j8485j5873j3901j2035j0793j0131
58523G51795r218q186p957q140p320n587m426m067l393k438k353k850k421j224
58509F82215q34j143n26P98Q19n32j055j65K63l78k93J131J958J164M41J201K568
$$ y = [633429, 634608, 634235, 633437, 633573, 634468, 635422, 636676, 638695, 641274, 644628, 650182, 659055, 670817, 684652, 700434, 717616, 734549, 750149, 764970, 779472, 792617, 803413, 812403, 820297, 826601, 831031, 834967, 840025, 846484, 854542, 865750, 881627, 902046, 926471, 955473, 989406, 1026763, 1065480, 1104671, 1143376, 1178785, 1207638, 1228592, 1241716, 1246803, 1244105, 1235877, 1225247, 1213980, 1202696, 1192432, 1184179, 1177386, 1170438, 1162199, 1151936, 1138471, 1120750, 1098742, 1072760, 1042815, 1009718, 975777, 943060, 911899, 882270, 855488, 833013, 814528, 798655, 784754, 772719, 761926, 751795, 742577, 734391, 726434, 718294, 710974, 705387, 700961, 696894, 693501, 691063, 688710, 685860, 683439, 682215, 681381, 680238, 679712, 680510, 681329, 680797, 679742, 679577, 679840, 679462, 679169, 680300, 682258, 683422, 683863, 685064, 687632]
58492F87632L492M308N174N513N864P697J0707J2878J3805J5144J7314J8916J9925
58479H28369K2098K5459K7578K7310K5887K3568J8705J1235L647k715q948j5135
58467I87058j9186k0357k0449k0154j7754j2887q085m920k043J476M350O299R409
58454H82757J4309J8355J9594J9297J8651J6185J0644L458l614j0471j6699k0572
58442I51894k1759k2125k2422k1162j8054j5091j2909r712n347k581k443k228
58430G96061n6K287L262M429P058R563J0688J1740J3301J3207J0172N970J974
58417H89656k829q256j1395j1168j0557j1719j2729j1731j0378j0284r957q194
58405G70459o690o506n660l189j644k503l121j356P14R49J014K635L977L329K536
$$ y = [687632, 691124, 695432, 700606, 706119, 711983, 719680, 730387, 743265, 757070, 772214, 789528, 808444, 828369, 850467, 875926, 903504, 930814, 956701, 980269, 998974, 1010209, 1013856, 1011141, 1002193, 987058, 967872, 947515, 927066, 906912, 889158, 876271, 868186, 863266, 861223, 862699, 867049, 873348, 882757, 897066, 915421, 935015, 954312, 972963, 989148, 999792, 1003250, 999636, 989165, 972466, 951894, 930135, 908010, 885588, 864426, 846372, 831281, 818372, 808660, 803313, 800732, 798289, 796061, 796005, 798292, 801554, 805983, 813041, 822604, 833292, 845032, 858333, 871540, 881712, 887682, 889656, 886827, 878571, 867176, 856008, 845451, 833732, 821003, 809272, 798894, 788610, 778653, 770459, 763769, 757263, 751603, 748414, 746770, 744267, 741146, 739790, 740504, 741453, 742467, 745102, 749079, 752408, 754944]
58390G54944L268L696K418J720L213M291K860J546L019N039M559L021L154M071
58376H00819M020M438O778Q678P859O559P593R374R371R151J1200J3972J4883
58363I14695J5169J7066J9118J8981J7967J8141J7904J5044J1147Q540N988J926
58351A081686j409j800j531l163m423k388P62J551J390L399O288P091P027Q964
58337A103444J1839J3116J4000J6771J9685J9994J9172J9817K0303J7968J4520
58326A290629J2738J0955O534J588m90j012k711l927k048O93J110J220M233P893
58312A327405Q461P828R782J2665J2756J1672J3165J5684J5470J3975J4929J7018
58300A480810J6801J5885J7700K0329K0016J8607J9824K1528J9734J6949J8184
$$ y = [754944, 758212, 761908, 764326, 766046, 769259, 773550, 776410, 777956, 780975, 786014, 790573, 793594, 796748, 800819, 804839, 809277, 816055, 824733, 832592, 839151, 846744, 856118, 865489, 874640, 885840, 899812, 914695, 929864, 946930, 966048, 985029, 1002996, 1021137, 1039041, 1054085, 1065232, 1073772, 1079760, 1081686, 1080277, 1078477, 1076946, 1073783, 1069360, 1066972, 1067734, 1069285, 1070675, 1074074, 1080362, 1087453, 1094480, 1103444, 1115283, 1128399, 1142399, 1159170, 1178855, 1198849, 1218021, 1237838, 1258141, 1276109, 1290629, 1303367, 1314322, 1320856, 1322444, 1321954, 1320942, 1318231, 1314304, 1312256, 1312949, 1314059, 1315279, 1319512, 1327405, 1335866, 1343694, 1353476, 1366141, 1378897, 1390569, 1403734, 1419418, 1434888, 1448863, 1463792, 1480810, 1497611, 1513496, 1531196, 1551525, 1571541, 1590148, 1609972, 1631500, 1651234, 1668183, 1686367]
58289A686367K1784K2658K1491K2266K3699K2009J9196J9686K1700K0805J8939
58278A920600K0834K4745K6132K7129L2586L9944M3184M3648M6752N1120N1658
58267B328332N0251N2535N7030N8424N8528O2630O8219O9087O7366O9361P2718
58256C014481P0416O4508O2755O4523O3346O0713O3408O9813P2946P4547Q1641
58245C763097R1812R6901R8864J06418J18309J25856J29858J38606J51186J59582
58235D980489J65167J75942J89752J98048K03805K17064K35480K48823K59795
58226F874365K79614L05817L26458L43752L70387M04825M34541M61540M99050
58217A0300349N45200N87077O28795O86891P59837Q32416R08312J005961J124549
$$ y = [1686367, 1708151, 1730809, 1752300, 1774566, 1798265, 1820274, 1839470, 1859156, 1880856, 1901661, 1920600, 1941434, 1966179, 1992311, 2019440, 2052026, 2091970, 2135154, 2178802, 2225554, 2276674, 2328332, 2378583, 2431118, 2488148, 2546572, 2605100, 2667730, 2735949, 2805036, 2872402, 2941763, 3014481, 3084897, 3149405, 3212160, 3276683, 3340029, 3400742, 3464150, 3533963, 3606909, 3681456, 3763097, 3854909, 3951810, 4050674, 4157092, 4275401, 4401257, 4531115, 4669721, 4820907, 4980489, 5145656, 5321598, 5511350, 5709398, 5913203, 6130267, 6365747, 6614570, 6874365, 7153979, 7459796, 7786254, 8130006, 8500393, 8905218, 9339759, 9801299, 10300349, 10845549, 11432626, 12061421, 12748312, 13508149, 14340565, 15248877, 16254838, 17379387]
58208A7379387J249393J388836J567971J788261K035259K324172K692313L149627
58200C3575219L688478M339452N157932O156953P322095Q695974J0376352J2438514
58192I1750969J4960815J8135913K2243480K7484293L3891567M1190575M8218092
58185B97875704N2266987M9649900L8007675J8683986l323987k2194270l4473730
58178C96492265m0088233m1021934l9442084l6725998l3468414k9869531k6075749
58171A49800322k2319611j8850627j5803251j3183666j0962858r121526p615914
58164E1942869o373522n342750m504836l831380l273752k801691k412825k097079
58156B1305034j827543j592306j400448j249393j117748r96587q97463q22508
$$ y = [17379387, 18628780, 20017616, 21585587, 23373848, 25409107, 27733279, 30425592, 33575219, 37263697, 41603149, 46761081, 52918034, 60240129, 68936103, 79312455, 91750969, 106711784, 124847697, 147091177, 174575470, 208467037, 249657612, 297875704, 350142691, 399792591, 437800266, 456484252, 453160265, 430965995, 396492265, 356404032, 315382098, 275940014, 239214016, 205745602, 175876071, 149800322, 127480711, 108630084, 92826833, 79643167, 68680309, 59558783, 51942869, 45569347, 40226597, 35721761, 31890381, 28616629, 25814938, 23402113, 21305034, 19477491, 17885185, 16484737, 15235344, 14117596, 13121009, 12223546, 11401038]
58148A1401038p54786o85309o23237n72310n21817m68031m21609l86640l53381
58139F613918l18024k89494k70915k53633k35011k23272k19268k11733j96289
58130D396279j81895j73131j62906j48152j36236j30154j22927j12214j05453
58121C123211j04943j02435r4157q7268q5704q3193p6078p0127o8764o6700o1049
58110B222793n7098n7487n6777n2160m8815m9419m8905m4758m2369m4930m7665
58099A672410m7047m6325m7177m5102l8035l0830k6671k2466j6788j3762j4899
58088A323308j5546j3511j2876j5308j6170j3424j1956j4644j7280j6782j6522
58077A159289j8989k0829j9799j9269k1276k2225j9842j7492j7394j6451j2998
$$ y = [11401038, 10646252, 9960943, 9337706, 8765396, 8243579, 7775548, 7353939, 6967299, 6613918, 6295894, 6006400, 5735485, 5481852, 5246841, 5023569, 4804301, 4592568, 4396279, 4214384, 4041253, 3878347, 3730195, 3593959, 3463805, 3340878, 3228664, 3123211, 3018268, 2915833, 2821676, 2734408, 2648704, 2565511, 2489433, 2419306, 2350542, 2283842, 2222793, 2165695, 2108208, 2051431, 1999271, 1950456, 1901037, 1852132, 1807374, 1765005, 1720075, 1672410, 1625363, 1579038, 1531861, 1486759, 1448724, 1417894, 1391223, 1368757, 1351969, 1338207, 1323308, 1307762, 1294251, 1281375, 1266067, 1249897, 1236473, 1224517, 1209873, 1192593, 1175811, 1159289, 1140300, 1119471, 1099672, 1080403, 1059127, 1036902, 1017060, 999568, 982174, 965723, 952725]
58066I52725j0720j1649j2082r738q152r609j0499q210o134p196q711q325q750
58053H32950j1846j4001j2398j0142j0339j0614q338n924n970o317m817m020o174
58040G22050q363p580o122p037q510p677n969n900o350n592n379p513r852r951
58026F20255r321j0017j0537r101p498p659p818o065m294m625n241l809j872j764
58012E30634k286j387k65q36j865j387l38k33J5J483K303R35m35O67K804L379
57996E33188K990L451M081L439K450K368J987J47j419r66k4n49j326n33N48r5
57980E49737j405j265l09l38q84n03L67P98J609L454M745M316L915N136O218M854
57964E80445J956m08k511n261p363p517p302q578r990r416p911p837q807q845
$$ y = [952725, 942005, 930356, 918274, 908536, 900384, 890775, 880276, 872066, 865932, 858736, 850025, 841700, 832950, 821104, 807103, 794705, 784563, 774224, 763610, 755272, 749348, 743378, 737061, 732244, 728224, 722050, 713687, 706107, 699985, 692948, 684438, 676761, 670792, 664892, 658542, 652950, 647571, 640058, 630206, 620255, 610934, 600917, 590380, 581279, 573781, 566122, 558304, 552239, 547945, 543320, 538079, 534270, 532398, 530634, 528348, 526961, 526696, 525860, 523995, 522608, 522270, 522037, 522052, 523535, 525838, 526773, 526338, 527005, 529809, 533188, 536178, 539629, 543710, 547149, 549599, 551967, 553954, 554101, 552682, 551716, 551692, 551143, 549817, 549284, 549832, 549737, 548332, 547067, 546758, 546420, 545536, 545033, 545400, 546198, 547807, 551261, 556006, 560322, 564237, 569373, 575591, 580445, 582401, 581993, 579482, 574221, 566858, 559341, 552039, 543461, 533471, 524055, 516144, 508307, 499500, 490655]
57950D90655p934p215o252m286k644k784l440k638r85l8P75K600M298M358M021
57935D68491N241P120P585P103P378P811O667M460K908J572j057m250o042o642
57921E08345p671q940r126q703q983r085p159m008k244k260k101j025j60J67R35
57906D37982K191K738K133R53o67k849m781n595n784o095n910m550l017k396j819
57891D02534j28J670K066J819K515L539L210J931J472J943K101J901K099K149
57877D30821J144Q9N85J955K286J672J701K442K696K642L476M739M736L332J900
57862D66216Q11n46j668j449m16n7k28L30J384J640J343J834K759K400O80p00
57846D74333j068j322j776j890j983k874l895l647k536k167k373j477N18J722
$$ y = [490655, 482721, 475506, 469254, 464968, 462324, 459540, 456100, 453462, 452477, 452439, 453214, 455814, 460112, 464470, 468491, 473732, 480852, 488437, 495540, 502918, 510729, 517396, 521856, 524764, 526336, 525279, 521029, 514987, 508345, 500674, 491734, 482608, 473905, 464922, 455837, 448678, 444670, 442426, 440166, 438065, 437040, 436880, 437047, 437982, 440173, 442911, 445044, 445997, 445330, 442481, 437700, 432105, 426321, 420226, 414316, 409766, 406749, 404353, 402534, 402406, 404076, 406142, 407961, 410476, 414015, 417225, 419156, 420628, 422571, 424672, 426573, 428672, 430821, 431965, 432054, 432639, 434594, 436880, 438552, 440253, 442695, 445391, 448033, 451509, 456248, 460984, 464316, 466216, 467027, 466481, 464813, 463364, 462948, 462891, 462663, 462993, 464377, 466017, 467360, 469194, 471953, 474353, 475033, 474333, 473265, 471943, 470167, 468277, 466294, 463420, 459525, 455878, 453342, 451175, 448802, 447325, 447843, 449565]
57832D49565J499J299J927K473K476K790L657M056L628L346L654L715L033K193
57818D89311J547O67n00j387j878k360k659k396k295l603o187q623j0056j0628
57804D38953j0383r293q057p367o745n515m285l863l436j819K11R96Q05J287K574
57789C84063L304L190L168L154K099L20o47o07p82j224n64J388L084L670L814
57774D07430L834L134J896J162Q40k84k119l019k485k003k520l110k948k708l101
57759C93999l603l521k951k149j077o9L83O82J682L077L757L740M178N280N934
57744D09342N590M963M555M111L709L804M000L304J782N18j49p87j413j464j192
57729D40673j408j852j587q38o99j157j252j051j420k026j658n20k7l18k62J31
$$ y = [449565, 451064, 452363, 454290, 456763, 459239, 462029, 465686, 469742, 473370, 476716, 480370, 484085, 487118, 489311, 490858, 491525, 491025, 489638, 487760, 485400, 482741, 480345, 478050, 474447, 468260, 459637, 449581, 438953, 428570, 419277, 411220, 403853, 397108, 391593, 387308, 383445, 380009, 378190, 378401, 379397, 380202, 381489, 384063, 387367, 390557, 393725, 396879, 398978, 399298, 398651, 398044, 397262, 396038, 395474, 396862, 399946, 403616, 407430, 411264, 414398, 416294, 417456, 418296, 418012, 415893, 412874, 410389, 408386, 405866, 402756, 399808, 397100, 393999, 390396, 386875, 383924, 381775, 380698, 380629, 381012, 381694, 383376, 386453, 390210, 393950, 398128, 403408, 409342, 414932, 419895, 424450, 428561, 432270, 436074, 440074, 443378, 445160, 445678, 445529, 444742, 443329, 441865, 440673, 439265, 437413, 435826, 434988, 434289, 433132, 431880, 430829, 429409, 427383, 425725, 425205, 425178, 424860, 424598, 424729]
57713D24729l38j510j811r77m06m86n4R92J165P7p91p27p35j105n69J177K534
57696D21165K645K639L218L335K394J484J195M24j341k682k628k239k477k428
57682D24704j225K80J244K477M729P023Q448J0042J3239J7743K2568K8045L5275
57669E74592M4617N6031O9799Q5250R8988J05218R7818P3120L3190j2789n2655
57658A173179p8651r0474r1644q5450p4968o3737n3858m4873l6095k8571k3333
57647E01525j9387j5265j1183q113n980m282l244k949k583j953k329m258n942
57634D14057n548l869l014l419l875l623k840j811j010j266k524l335k724j701
57620C73498j703k514l006k921k657k188j475j142j537j968j786j395j236r23
$$ y = [424729, 424391, 422881, 421070, 420093, 419687, 419201, 419147, 420139, 421304, 421381, 420590, 419863, 419128, 418023, 417454, 418631, 421165, 423810, 426449, 429667, 433002, 435396, 436880, 438075, 438499, 437158, 434476, 431848, 429609, 427132, 424704, 423479, 423759, 425003, 427480, 432209, 439232, 447680, 457722, 470961, 488704, 511272, 539317, 574592, 619209, 675240, 745039, 830289, 929277, 1034495, 1132313, 1205433, 1238623, 1225834, 1173179, 1094528, 1004054, 912410, 826960, 751992, 688255, 634397, 589524, 553429, 524858, 501525, 482138, 466873, 455690, 447577, 441597, 437315, 434071, 431122, 428539, 426586, 424257, 419999, 414057, 408509, 404640, 401626, 398207, 394332, 390709, 387869, 386058, 385048, 383782, 381258, 377923, 375199, 373498, 371795, 369281, 366275, 363354, 360697, 358509, 357034, 355892, 354355, 352387, 350601, 349206, 347970, 347047]
57606C47047l12j33n67n41M23J064L40q50j307j460k139k744k339j409r22n95
57590C33556K49J148J303J047J067J141R80J178J921J982O23q03q05k05p37k281
57574C41364l415l877m462n132n115m406l580k634j425n83n76p48n88q80k077
57559C01866k822j940o56p14j452j041L69J164J270J955L175L684L611M304N501
57544C18274N165K623l14j957k569k906k721j585m6Q68O72l01j100r07j14o3r94
57527C12025j340r9J296J125J48K23J138J240N72P92K155L052K705K058J737J279
57511C30106P62J069K083K551K182K081K583K558J495M41J51j5n50q17m42k48
57495C45990q27j442j279o88l00L2N72Q70N10m5j31J66L47L36L82N24O42P86J150
$$ y = [347047, 346735, 346602, 346035, 345494, 345917, 346981, 347321, 346471, 345164, 343704, 341565, 338821, 336482, 335073, 334151, 333556, 333805, 334953, 336256, 337303, 338370, 339511, 340491, 341669, 343590, 345572, 346195, 345392, 344587, 344382, 343645, 341364, 337949, 334072, 329610, 324478, 319363, 314957, 311377, 308743, 307318, 306735, 306159, 305411, 304823, 303943, 301866, 299044, 297104, 296448, 295734, 294282, 293241, 293610, 294774, 296044, 297999, 301174, 304858, 308469, 312773, 318274, 323439, 326062, 325748, 323791, 321222, 318316, 315595, 314010, 313964, 314832, 315504, 315203, 314103, 313196, 313082, 313019, 312025, 310685, 310586, 311882, 313007, 313155, 313378, 314516, 315756, 316328, 317120, 319275, 322327, 325032, 327090, 328827, 330106, 330868, 331937, 334020, 336571, 338753, 340834, 343417, 345975, 347470, 347911, 348062, 348047, 347497, 346680, 346238, 345990, 345163, 343721, 342442, 341754, 341454, 341486, 342058, 342928, 343438, 343393, 343262, 343428, 343775, 344111, 344493, 345017, 345659, 346445, 347595]
57476C47595J762K237J882M25j269j889j394j160j892k497j960j118j204j654
57462C37864j058M35J439J520J341J030K35m80j73O63O75p2k08N26R17N25L82
57445C45561J058J795K031K209K542K503K040J903K272K451K257K434L199L736
57431C77991L595L333L333L236K854K558K375J901J252R52P80M9q92r36r1M20
57415D02710J79R8O43J158J360J918L040L968M330M563M566L483J337n85j534
57400D31234k054k478k250j259l42J80J025K452L678M286M753N056M455L172K647
57385D54555L389M294M735N478O738P235O263M943M315L885L214L101L801L875
57371E19821K402P74N38Q46n5j933l094k971k384j893j391q96l96O08K220L484
$$ y = [347595, 349357, 351594, 353476, 353901, 352632, 350743, 349349, 348189, 346297, 343800, 341840, 340722, 339518, 337864, 336806, 337241, 338680, 340200, 341541, 342571, 342806, 342326, 342153, 342816, 343491, 343419, 343211, 343737, 344654, 345179, 345561, 346619, 348414, 350445, 352654, 355196, 357699, 359739, 361642, 363914, 366365, 368622, 371056, 374255, 377991, 381586, 384919, 388252, 391488, 394342, 396900, 399275, 401176, 402428, 403380, 404160, 404209, 403317, 402381, 402290, 402710, 402889, 402987, 403630, 404788, 406148, 408066, 411106, 415074, 419404, 423967, 428533, 432016, 433353, 432768, 431234, 429180, 426702, 424452, 423193, 422851, 423031, 424056, 426508, 430186, 434472, 439225, 444281, 448736, 451908, 454555, 457944, 462238, 466973, 472451, 479189, 486424, 492687, 497630, 501945, 505830, 509044, 512145, 515946, 519821, 522223, 522997, 523535, 524381, 524326, 522393, 519299, 516328, 513944, 512051, 510660, 509764, 509368, 509976, 512196, 515680]
57355E15680L715L687M325N115N119M781N228O352P118P191O914O158M679L332
57341E89394L388M739N958O212N952N769N550M968M066L307L375M667O532P475
57327F61352O731N177M202M183M651N276N924O282O245O278O753P350P688P925
57313G46017Q221Q236P833P528P651P757P663Q194R987J2156J3225J2875J1960
57300H69303J1178J0658J0476J0779J1555J2738J4250J5635J6246J6212J6385
57289A015415J7031J7395J7104J6990J7790J9057K0119K1195K2618K3902K4547
57278A233163K5019K5987K7237K8263K9174L0122L0696L0742L1093L2450L4320
57267A558266L5908L7275L8621L9382L9104L8534L8614L9156L9563M0147M1547
$$ y = [515680, 519395, 523082, 527407, 532522, 537641, 542422, 547650, 554002, 561120, 568311, 575225, 581383, 586062, 589394, 592782, 597521, 603479, 609691, 615643, 621412, 626962, 631930, 635996, 639303, 642678, 647345, 653877, 661352, 668083, 673260, 677462, 681645, 686296, 691572, 697496, 703778, 710023, 716301, 723054, 730404, 738092, 746017, 754238, 762474, 770307, 777835, 785486, 793243, 800906, 809100, 819087, 831243, 844468, 857343, 869303, 880481, 891139, 901615, 912394, 923949, 936687, 950937, 966572, 982818, 999030, 1015415, 1032446, 1049841, 1066945, 1083935, 1101725, 1120782, 1140901, 1162096, 1184714, 1208616, 1233163, 1258182, 1284169, 1311406, 1339669, 1368843, 1398965, 1429661, 1460403, 1491496, 1523946, 1558266, 1594174, 1631449, 1670070, 1709452, 1748556, 1787090, 1825704, 1864860, 1904423, 1944570, 1986117]
57256A986117M3523M5437M7253M9045N0252N0597N0877N1702N2272N1776N1065
57245B529916N1425N2467N2866N2554N2352N1930N0029M6643M3187M0436L7862
57234C061667L5122L2776L1214L0128K9329K9042K9228K9611L0424L2193L4752
57223C405486L7453M0259M3671M7498N0769N2939N4288N5081N5127N4300N2841
57212C949712N1094M9548M8837M9128M9766N0138N0573N1752N3650N5833N8221
57201D518252O0787O3001O4511O5793O7273O8299O7999O6648O5129O3623O1898
57190E233213O0368N9674N9555N9267N8732N8249N7604N6528N5598N5535N6033
57179E870356N6340N6377N6298N5672N4379N3484N3794N4373N4032N3419N3874
$$ y = [1986117, 2029640, 2075077, 2122330, 2171375, 2221627, 2272224, 2323101, 2374803, 2427075, 2478851, 2529916, 2581341, 2633808, 2686674, 2739228, 2791580, 2843510, 2893539, 2940182, 2983369, 3023805, 3061667, 3096789, 3129565, 3160779, 3190907, 3220236, 3249278, 3278506, 3308117, 3338541, 3370734, 3405486, 3442939, 3483198, 3526869, 3574367, 3625136, 3678075, 3732363, 3787444, 3842571, 3896871, 3949712, 4000806, 4050354, 4099191, 4148319, 4198085, 4248223, 4298796, 4350548, 4404198, 4460031, 4518252, 4579039, 4642040, 4706551, 4772344, 4839617, 4907916, 4975915, 5042563, 5107692, 5171315, 5233213, 5293581, 5353255, 5412810, 5472077, 5530809, 5589058, 5646662, 5703190, 5758788, 5814323, 5870356, 5926696, 5983073, 6039371, 6095043, 6149422, 6202906, 6256700, 6311073, 6365105, 6418524, 6472398]
57168F472398N4930N5010N3998N2937N1512M8245M3194L8145L3867K9306K3840
57157F957382J8191J2513N707k349r663j4206j5920j5932j5130j4281j4221j5092
57145F876999j6296j7661j9610k1914k3486k3886k3815k3750k3339k2624k2481
57134F638137k3238k4087k4470k4888k5760k6507k6500k5916k5127k4077k2716
57123F364851k1135j8910j5321j0494n203O65Q127J7042K5398L1344L4950L7533
57111F448847M0550M5833N5605P1157R2125J17758J48111J83733K25401K75071
57101G704191L36200M12445N06895O23314P67151R44086J157700J408692J695145
57092A5555819K012491K353754K710759L074658L434262L773554M070627M297688
$$ y = [6472398, 6527328, 6582338, 6636336, 6689273, 6740785, 6789030, 6832224, 6870369, 6904236, 6933542, 6957382, 6975573, 6988086, 6993793, 6991444, 6981781, 6967575, 6951655, 6935723, 6920593, 6906312, 6892091, 6876999, 6860703, 6843042, 6823432, 6801518, 6778032, 6754146, 6730331, 6706581, 6683242, 6660618, 6638137, 6614899, 6590812, 6566342, 6541454, 6515694, 6489187, 6462687, 6436771, 6411644, 6387567, 6364851, 6343716, 6324806, 6309485, 6298991, 6293788, 6294453, 6302580, 6319622, 6345020, 6376364, 6411314, 6448847, 6489397, 6535230, 6590835, 6661992, 6754117, 6871875, 7019986, 7203719, 7429120, 7704191, 8040391, 8452836, 8959731, 9583045, 10350196, 11294282, 12451982, 13860674, 15555819, 17568310, 19922064, 22632823, 25707481, 29141743, 32915297, 36985924, 41283612]
57084D1283612M420204M396023M179561L735991L062481K202700J239718K67532
57076F4787822o40067j443627k132959k714459l199173l592369l887298m069197
57068D3108673m127966m068094l907802l671643l384582l069158k743613k421473
57060A5714342k113195j827349j569392j340759j140733r68678q23713p03252
57052E227271o03386n20312m50765l91919l41868k99663k64143k33462k06328
57043A915425j82725j62631j45044j29058j14906j02869r2111q1660p1697o2817
57033G69907n4760m6937l9513l2748k5825j7624q184J823J2929K6482M1442N2019
57021F79011M9886L0335k651l7733o3778p6695p9238p5707o8750o0329n2620m6564
$$ y = [41283612, 45703816, 50099839, 54279400, 58015391, 61077872, 63280572, 64520290, 64787822, 64147755, 62704128, 60571169, 57856710, 54657537, 51065168, 47177870, 43108673, 38980707, 34912613, 31004811, 27333168, 23948586, 20879428, 18135815, 15714342, 13601147, 11773798, 10204406, 8863647, 7722914, 6754236, 5930523, 5227271, 4623885, 4103573, 3652808, 3260889, 2919021, 2619358, 2355215, 2121753, 1915425, 1732700, 1570069, 1425025, 1295967, 1181061, 1078192, 986081, 904421, 832724, 769907, 715147, 668210, 628697, 595949, 570124, 552500, 544316, 546139, 559068, 585550, 626992, 679011, 728897, 759232, 756581, 718848, 655070, 578375, 499137, 423430, 354680, 294351, 241731, 195167]
57009A95167m1269l6010l1464k8221k5584I690a1162j9836j9032j7649j6245j5513
56997i9437j4899j3680j2234j0972r105n805j653K384O497J1296J6510K1690K7280
56984h2128L3578i166C3800M3604M0984L4393K4115J2849L848j948n583p685q151
56971A70226p602p252p327p087o263n084l209j54L377O049P813R989J3498J8169
56957A85143K3490K8496L0910K7998J8968N799q296k0393k8302l1126k9966k7082
56945A75639k3883k0294j6062j1702p873m623j595J504M867Q607J2643J6864K1473
56932A55565K6914L3324L9792M3817M1869L1791J5176l216j8826k9602l5351l6541
56920B64712l4541l1522k8742k5706k1808j7737j4336j1292q275o188n832o227
$$ y = [195167, 153898, 117888, 86424, 58203, 32619, 9690, -11162, -30998, -50030, -67679, -83924, -99437, -114336, -128016, -140250, -151222, -160327, -166132, -167785, -165401, -158904, -147608, -131098, -109408, -82128, -48550, -9166, 33800, 77404, 118388, 152781, 176896, 189745, 193593, 191645, 186062, 178377, 170226, 162624, 155372, 148045, 140958, 134695, 129611, 126402, 126248, 129625, 135674, 143487, 153476, 166974, 185143, 208633, 237129, 268039, 296037, 315005, 320804, 312508, 292115, 263813, 232687, 202721, 175639, 151756, 131462, 115400, 103698, 95825, 91202, 89607, 91111, 95978, 104585, 117228, 134092, 155565, 182479, 215803, 255595, 299412, 341281, 373072, 388248, 385032, 366206, 336604, 301253, 264712, 230171, 198649, 169907, 144201, 122393, 104656, 90320, 79028, 70753, 64565, 58733, 52506]
56908E2506n898m939m224l459j819O4P69L84L95J371K441L057L598M245M735N335
56892E8561O675Q560J0272J2014J4680J8239K1680K4477K6536K6641K2799J4697
56880B65831M570m864j2204j6883j8477j7344j4966j2629j0268p168l323M37L450
56867A56162N999R052J3248J8219K3310K8944L6394M5785N5012O0988O1028N2870
56855E67011L5491J1560j2269k9765l9473m3603m3851m0440l4372k7712k1382
56844C21195j4782p878j691L652R475J6635K4720L3573M4108N6964P1689Q7103
56832F44763J00421J05562R5113O6354K4992j8018n3019p5352q5115q5371q0113
56821F40217p2238o2822n2212m1208l0842k1657j3644o403R07R120J8310K7920
$$ y = [52506, 46608, 41669, 37445, 33986, 32167, 32231, 33000, 33384, 33779, 35150, 37591, 40648, 44246, 48491, 53226, 58561, 65236, 73796, 84068, 96082, 110762, 129001, 150681, 175158, 201694, 228335, 251134, 265831, 270401, 265537, 253333, 236450, 217973, 200629, 185663, 173034, 162766, 155598, 152275, 152712, 156162, 162161, 171213, 184461, 202680, 225990, 254934, 291328, 337113, 392125, 453113, 514141, 567011, 602502, 614062, 601793, 572028, 532555, 488952, 445101, 404661, 370289, 342577, 321195, 306413, 298535, 296844, 300496, 309971, 326606, 351326, 384899, 429007, 485971, 557660, 644763, 745184, 850746, 945859, 1012213, 1037205, 1019187, 966168, 890816, 805701, 720330, 640217, 567979, 505157, 452945, 411737, 380895, 359238, 345594, 339191, 340098, 349218, 367528, 395448]
56809C95448L7852M8797O0921P2292P8543P4281N6155K6126q270l8136n8364o8786
56797F76859p1444o8349o1514n3104m4513l6045k7852k0437j4056q502l577R04
56785B68370N556J1015J7165K3611L0513L7587M2364M1061L1714J5811l031k0860
56773E00876l4253m1352m2941m1494l8751l5020l0659k6659k3316j9833j5922
56762A50676j2608j0754r749q508o915n608m929m663m358l644k662k151k505k870
56748F8752k121n88K45k46j195j705j760j505q26P4O17O86O70O00K25j33J26O68
56730F2584N76m7o6R18K070K753L122L134K356J188Q47J635K390K243J658J324
56714H8685J075N88J11o0j5K18P38J222J246J187J747K557K549J781J450J871
$$ y = [395448, 433300, 482097, 543018, 615310, 693853, 768134, 824289, 850415, 842145, 804009, 745645, 676859, 605415, 537066, 475552, 422448, 377935, 341890, 314038, 293601, 279545, 271043, 267466, 268370, 273926, 284941, 302106, 325717, 356230, 393817, 436181, 477242, 508956, 524767, 521736, 500876, 466623, 425271, 382330, 340836, 302085, 267065, 236406, 209747, 186431, 166598, 150676, 138068, 127314, 117565, 109057, 102142, 96534, 91605, 86942, 82584, 78940, 76278, 74127, 71622, 68752, 66631, 66043, 66288, 66042, 64847, 63142, 61382, 59877, 59051, 59125, 59742, 60428, 61098, 61698, 61923, 61790, 61916, 62584, 63160, 63113, 63047, 63965, 66035, 68788, 71910, 75044, 77400, 78588, 79435, 81070, 83460, 85703, 87361, 88685, 89760, 90348, 90459, 90399, 90384, 90602, 91340, 92562, 93808, 94995, 96742, 99299, 101848, 103629, 105079, 106950]
56698A06950J977J206L75J40N3j98m3P53J306R51L46M58J264K034K244J886J518
56681A23220K072L706N071M873L796L465L722K883P04j024j253j036j423j922
56667A46854j894j718j668j197k95L2n58j030p96o48j033r70K12J495J646Q65
56651A39297J9n92r30q52p12j048j243j06J719J921o3j854j531j89K74M9L49J042
56633A35550J181P89M16r8r90j675j727j771k239k353j595r61j462k401k523j800
56617A16341r18K4R49J076N5j061j149n05N4M89R06Q17K06J18J020J696J033j90
56599A20961o01j64M18J128K053K448J797R35Q06J017Q10M92O54Q81N03j62m14
56582A33562k37J08O78J268J341J165J698K758K897J833J147J582J825J146J062
$$ y = [106950, 108927, 110133, 110508, 110648, 110701, 110503, 110460, 111213, 112519, 113470, 113816, 114274, 115538, 117572, 119816, 121702, 123220, 125292, 128998, 134069, 138942, 142738, 146203, 149925, 152808, 153512, 152488, 151235, 150199, 148776, 146854, 144960, 143242, 141574, 140377, 140082, 140114, 139556, 138526, 137730, 137082, 136049, 135079, 135291, 136786, 138432, 139297, 139316, 138724, 137794, 136942, 136230, 135182, 133939, 133833, 135552, 137473, 137410, 135556, 134025, 133836, 134110, 134159, 134508, 135550, 136731, 137520, 137936, 137838, 136848, 135173, 133446, 131675, 129436, 127083, 125488, 124527, 123065, 120664, 118141, 116341, 115423, 115447, 116396, 117472, 117527, 116466, 115317, 114812, 114866, 115355, 116261, 117078, 117284, 117402, 118422, 120118, 121151, 120961, 120360, 120196, 120614, 121742, 123795, 126243, 128040, 128975, 129781, 130798, 131608, 132100, 132754, 133635, 134138, 133976, 133562, 133325, 133433, 134111, 135379, 136720, 137885, 139583, 142341, 145238, 147071, 148218, 149800, 151625, 152771, 153833]
56567A53833K674M441M601L981M336N579O856Q733J2027J5629J7681J7734J5929
56554B74034J1584M817j834n818p531q737r323q132n867m500m403m448m333m545
56540B20964m646l809k486j646j012PN59l52j703j798r34o33r86j094j206k028
56524A97197k609j512M42R97k58j666k236k367k289j850j526j758j805j038n69
56509A77153j495k652k371j403j479k041j382j98p14k620l242j786l11j43k48
56494A55068K59P22O50M84J53r19k056j772k85O10L44J29M90N88K57M29J117J100
56476A57368J25n96m56j44J6M84J040Q67K66L73J047J049L94L92J189J382M25
56459A65221o23j053j228j164l47P94J148Q78J195K089K248J402P82J042J676
$$ y = [153833, 156507, 160948, 165549, 169530, 173866, 179445, 186301, 195034, 207061, 222690, 240371, 258105, 274034, 285618, 290435, 288601, 282783, 275252, 266515, 257192, 249060, 243193, 238693, 234290, 229842, 225509, 220964, 216318, 212509, 210023, 208377, 207365, 207372, 207931, 207579, 205876, 204078, 203144, 202511, 201525, 200431, 199225, 197197, 194588, 193076, 193518, 194515, 194257, 192591, 190355, 187988, 185699, 183849, 182323, 180565, 178760, 177722, 177153, 175658, 173006, 170635, 169232, 167753, 165712, 164330, 164132, 163418, 160798, 157556, 155770, 155459, 155316, 155068, 155327, 156049, 156699, 157183, 157336, 156417, 154361, 152589, 152304, 152914, 153258, 153387, 153877, 154465, 154722, 155151, 156268, 157368, 157493, 156897, 156441, 156297, 156313, 156797, 157837, 158704, 158970, 159343, 160390, 161439, 161833, 162225, 163414, 164796, 165221, 164598, 163545, 162317, 161153, 160806, 161600, 162748, 163626, 164821, 166910, 169158, 170560, 171342, 172384, 174060]
56444A74060K502L747M633L889J876K62m17r87j612j658j384j607j817q83N38
56429A81142P10k69o76k12j58n99k47P82Q11l75j050m81K06M98J153K003J750
56412A84988M77j68J80J46n57n38M64R69N08M23J104J159J19n78j23N46Q50J353
56394A91322J876J390L79O16J962K215Q61Q0J006J915J325K61R0N10Q77J320J562
56377B09567Q38k12Q2J522K060J202O25Q70N44m51j88J657K725J852Q42R60Q87
56360B25382j67n07R28K384K256J603J795K195K047K178L007L234K293J629J949
56345B52206J692O2j082k63J213J788K108L005L497K842K292K836L443L361L711
56330B82711M955N302L837K675L713N564N993N248M539L412J144j073j766j469
$$ y = [174060, 176562, 180309, 184942, 188831, 190707, 190969, 190552, 189565, 187953, 186295, 184911, 183304, 181487, 180604, 181142, 181852, 181583, 180907, 180695, 180537, 179938, 179691, 180473, 181284, 180909, 179859, 179378, 179584, 180082, 181235, 183238, 184988, 185465, 185297, 185477, 185623, 185066, 184528, 184992, 185961, 186469, 186892, 187996, 189155, 189274, 188696, 188573, 189119, 189969, 191322, 193198, 194588, 194967, 195583, 197545, 199760, 200621, 200701, 201707, 203622, 204947, 205208, 205298, 205808, 206685, 208005, 209567, 210405, 210193, 210275, 211797, 213857, 215059, 215684, 216554, 217098, 216647, 216459, 218116, 220841, 222693, 223535, 224495, 225382, 225215, 224708, 225636, 228020, 230276, 231879, 233674, 235869, 237916, 240094, 243101, 246335, 248628, 250257, 252206, 253898, 253960, 252878, 252615, 253828, 255616, 257724, 260729, 264226, 267068, 269360, 272196, 275639, 279000, 282711, 287666, 292968, 296805, 299480, 303193, 308757, 314750, 319998, 324537, 327949, 329093, 328020, 326254, 324785]
56316C24785j362j232o47l98r22j051p4Q09P18P37J740K672K710K922M083N133
56300C40623N517O573Q722R825Q502O597O190O530O168N675N958O223N989O723
56286D35815R033J0711J0086Q961R548J0851J0933J0547J1443J2916J3128J2326
56274E66298J1978J2175J2398J3404J5789J8254J9556K0669K2781K4959K6120
56263G64381K7504L0775L5307L9710M4319M9907N5742O1237O7853P7043Q7953
56252A341731R9236J11243J24500J37958J50852J64166J78137J90608J99912K07041
56242B905384K12696K14687K10730K01389J87745J68620J42783J11630P7283M0415
56232D473362K286l3923o6361r6323j24266j47136j62713j73343j82023j87767
$$ y = [324785, 323423, 322191, 321544, 321146, 320224, 319173, 319099, 319908, 320626, 321363, 323103, 325775, 328485, 331407, 335490, 340623, 346140, 352713, 361435, 371260, 379762, 386359, 392549, 399079, 405247, 410922, 416880, 423103, 429092, 435815, 444848, 455559, 465645, 474606, 484154, 495005, 505938, 516485, 527928, 540844, 553972, 566298, 578276, 590451, 602849, 616253, 632042, 650296, 669852, 690521, 713302, 738261, 764381, 791885, 822660, 857967, 897677, 941996, 991903, 1047645, 1108882, 1176735, 1253778, 1341731, 1440967, 1552210, 1676710, 1814668, 1965520, 2129686, 2307823, 2498431, 2698343, 2905384, 3118080, 3332767, 3543497, 3744886, 3932631, 4101251, 4244034, 4355664, 4432947, 4473362, 4475648, 4441725, 4375364, 4279041, 4154775, 4007639, 3844926, 3671583, 3489560, 3301793]
56222C301793j88443j85278j80705j74378j65191j54807j45379j36037j25375
56213A846200j14972j06684r8907q9563q0287p3665o8514o2222n5576n0973m7736
56202I97101m3568l8863l5468l2816k9311k5829k3868k2036j8396j4477j2933
56191F99536j3009j2269j0908j0353r610p180m622m134m523l688k860m041n540
56178F06799m690k834k792l525k295j39k9j320j073N62J384J867L804N795N255
56163F06769L480L692N492O355O905R346J2188J2310J0968J2076J5528J7863J8679
56150G41651K0659K3856K5622K5887K7217K9995L2581L5737M1822N0045N7455
56139A112527O3979P1778Q0337Q6932R0795R2158Q8652P8082O3715N1597M3748
$$ y = [3301793, 3113350, 2928072, 2747367, 2572989, 2407798, 2252991, 2107612, 1971575, 1846200, 1731228, 1624544, 1525637, 1436074, 1355787, 1282122, 1213608, 1151386, 1095810, 1044837, 997101, 953533, 914670, 879202, 846386, 817075, 791246, 767378, 745342, 726946, 712469, 699536, 686527, 674258, 663350, 652997, 643387, 636207, 631585, 627451, 622928, 619240, 616380, 612339, 606799, 602109, 599275, 596483, 592958, 590663, 590524, 590495, 589175, 588102, 588664, 590048, 591915, 595719, 601514, 606769, 610249, 613941, 619433, 625788, 632693, 642039, 654227, 666537, 677505, 689581, 705109, 722972, 741651, 762310, 786166, 811788, 837675, 864892, 894887, 927468, 963205, 1005027, 1055072, 1112527, 1176506, 1248284, 1328621, 1415553, 1506348, 1598506, 1687158, 1765240, 1828955, 1880552, 1924300]
56128A924300L8679L6506L7669L8381L3683K4187J4134M423o445j6317k1309k2830
56116B085061k6184l2965m1137n1262o5537q1262r2186r6252r5909r1744q2524
56105A328099p0634o0466n1874m1838l1669k5512k2585j8274j2389q907q066o222
56093I69663l106j772j676N53L870M073J891K049M625N406M447N937R645J0934
56079A016539R436R415J1376J1684J0558J1923J5236J6105J5026J6569J9969J9897
56067A183733J6748J6501J9846K1282J9650J9641K1868K1552J8290J7130J8547
56056A394788J7430J3364J1790J3533J3444J0917J1268J5055J6656J5208J6181
56045A549634K0318K1927K0081K0397K3773K4656K2502K3389K8059L0294K9356
$$ y = [1924300, 1962979, 1999485, 2037154, 2075535, 2109218, 2133405, 2147539, 2151962, 2145517, 2129200, 2107891, 2085061, 2058877, 2025912, 1984775, 1933513, 1867976, 1786714, 1694528, 1598276, 1502367, 1410623, 1328099, 1257465, 1196999, 1145125, 1103287, 1071618, 1046106, 1023521, 1005247, 992858, 983951, 975885, 969663, 966557, 964785, 963109, 963662, 967532, 971605, 973496, 975545, 980170, 985576, 990023, 995960, 1005605, 1016539, 1025975, 1035390, 1046766, 1058450, 1069008, 1080931, 1096167, 1112272, 1127298, 1143867, 1163836, 1183733, 1200481, 1216982, 1236828, 1258110, 1277760, 1297401, 1319269, 1340821, 1359111, 1376241, 1394788, 1412218, 1425582, 1437372, 1450905, 1464349, 1475266, 1486534, 1501589, 1518245, 1533453, 1549634, 1569952, 1591879, 1611960, 1632357, 1656130, 1680786, 1703288, 1726677, 1754736, 1785030, 1814386]
56034A814386L1951L9281M4488M5537M8089N2931N3608M9487M7944N0434M9845
56023B327981M4882M3184M6750M8523M7078M9904N8120O3006O2158O3812P0576
56012B925974P4584P3696P6261Q4506Q9565Q8693R0705R8644J04094J04716J09583
56001C921021J20920J28885J31054J38099J53057J64606J68434J75054J88562
55992E289692J98662K02256K11189K29527K45460K55112K70967K96946L19709
55983G519520L35175L57885L92726M24495M47788M78856N24590N69575O08247
55974A1658857O58514P28025P99942Q68755R55336J068938J191831J320680J482756
55965B0733634J690859J926588K191408K526471K957569L474320M091170M866905
$$ y = [1814386, 1846337, 1885618, 1930106, 1975643, 2023732, 2076663, 2130271, 2179758, 2227702, 2278136, 2327981, 2372863, 2416047, 2462797, 2511320, 2558398, 2608302, 2666422, 2729428, 2791586, 2855398, 2925974, 3000558, 3074254, 3150515, 3235021, 3324586, 3413279, 3503984, 3602628, 3706722, 3811438, 3921021, 4041941, 4170826, 4301880, 4439979, 4593036, 4757642, 4926076, 5101130, 5289692, 5488354, 5690610, 5901799, 6131326, 6376786, 6631898, 6902865, 7199811, 7519520, 7854695, 8212580, 8605306, 9029801, 9477589, 9956445, 10481035, 11050610, 11658857, 12317371, 13045396, 13845338, 14714093, 15669429, 16738367, 17930198, 19250878, 20733634, 22424493, 24351081, 26542489, 29068960, 32026529, 35500849, 39592019, 44458924]
55957D4458924N830515O957725Q262789R840341J1778974J4135206J7056615K0822700
55949A39143789K5682679L1728300L8833054M6200263N1542260N1127039M1763688
55942D26021072K3580563Q45983k0343365l5503488m3424217m5360149m3354063
55935B62462336l9214404l4252804k9273195k4652341k0539837j7017932j4098254
55928H3413569j1695612r705165q073451o759689n688939m793228m053809l461696
55920B9181980k976552k559714k209161j927840j691502j477991j295876j154951
55912A3888393j037546r25389q26875p52391o88600o21355n59897n15211m76803
55903G484326m32705l91398l63194l39587l10694k84255k68612k54788k33447
$$ y = [44458924, 50289439, 57247164, 65509953, 75350294, 87129268, 101264474, 118321089, 139143789, 164826468, 196554768, 235387822, 281588085, 333130345, 384257384, 426021072, 449601635, 450447618, 430104253, 394600765, 351176548, 305816399, 262462336, 223247932, 188995128, 159721933, 135069592, 114529755, 97511823, 83413569, 71717957, 62012792, 53939341, 47179652, 41490713, 36697485, 32643676, 29181980, 26205428, 23645714, 21436553, 19508713, 17817211, 16339220, 15043344, 13888393, 12850847, 11925458, 11098583, 10346192, 9657592, 9036237, 8476340, 7961129, 7484326, 7051621, 6660223, 6297029, 5957442, 5646748, 5362493, 5093881, 4839093, 4605646]
55894D605646k12516k00764j90505j73239j56401j48176j41114j26891j12708
55885C143332j07163j03776r3960q3129p8925p6177o8355o1890o4416o9940o9711
55874B265890o7188o8922p0975o7730o4115o6005o7941o3022n5963n4117n4270
55863A565642n0352m5737m5936m7149m3677l9107l8838l8918l3379k5682k2194
55852A134673k1040j7707j5037j7454k1625k2694k3528k8259l2977l2364k9466
55841H72522k9505l0012k6422k1573k0313k0269j7101j3468j3785j5236j2896
55830F51942q824p553p464n110l009m713o981n374k904m649q438r225q350r905
55816E59443j2056j0531p055o110o642m905k104j666k120j79K418K322J529L720
$$ y = [4605646, 4393130, 4192366, 4001861, 3828622, 3672221, 3524045, 3382931, 3256040, 3143332, 3036169, 2932393, 2838433, 2755304, 2676379, 2600202, 2531847, 2469957, 2405541, 2335601, 2265890, 2198702, 2129780, 2058805, 1991075, 1926960, 1860955, 1793014, 1729992, 1674029, 1619912, 1565642, 1515290, 1469553, 1423617, 1376468, 1332791, 1293684, 1254846, 1215928, 1182549, 1156867, 1134673, 1113633, 1095926, 1080889, 1063435, 1041810, 1019116, 995588, 967329, 934352, 901988, 872522, 843017, 813005, 786583, 765010, 744697, 724428, 707327, 693859, 680074, 664838, 651942, 643118, 635565, 628101, 622991, 619982, 615269, 608288, 602914, 600010, 595361, 586923, 577698, 569348, 559443, 547387, 536856, 529801, 523691, 517049, 512144, 510040, 508374, 506254, 506075, 508493, 510815, 512344, 516064]
55802E16064P052P692P099Q666J0457Q510M222J318j370o836j2718j4576j3688
55789E21892j4393j6114j5087j1681r147p240l830p86j597n025p301q557j0977
55776D10157j2938j1463q376p512p844n659j733J25m7Q08K480K162J53q71j092
55761C58350k582m515m630l951m834o047n006k965k744l288j994l63j561m237
55747C09633m645l292l537n179n321m313m926o639o563n051m888n841n486m384
55733B39568m959o223n146k426j389k029j615l74r93l018l379k149k340m179m913
55718A94436m086l843m078k508L53J304j79j370j193j174j470n11J255J621P55
55703A79312Q96J968J698k1j022j003j629k750k632j819k528m350m601k907j480
$$ y = [516064, 523116, 530808, 537907, 546573, 557030, 565540, 569762, 571080, 569710, 562874, 550156, 535580, 521892, 507499, 491385, 476298, 464617, 455470, 448230, 444400, 443614, 442017, 436992, 429691, 421134, 410157, 397219, 385756, 377380, 369868, 362024, 356365, 354632, 354757, 354710, 355518, 357998, 360160, 360313, 359442, 358350, 355768, 351253, 346623, 342672, 337838, 331791, 326785, 323820, 321076, 317788, 315794, 315431, 313870, 309633, 304988, 301696, 298159, 292980, 287659, 283346, 278420, 271781, 265218, 260167, 255279, 249438, 243952, 239568, 234609, 228386, 223240, 220814, 219425, 217396, 215781, 215407, 214414, 211396, 208017, 205868, 203528, 199349, 194436, 190350, 186507, 182429, 179921, 180274, 181578, 181399, 180029, 178836, 177662, 176192, 175681, 176936, 178557, 179312, 180208, 182176, 183874, 183853, 182831, 181828, 180199, 177449, 174817, 172998, 170470, 166120, 161519, 158612, 157132]
55688A57132j020k97M98Q9n82N72K683K986J630J248K137K140J118J120K131J943
55672A75528L52o24p71j772l310l251j767j191j665j053P32J438P46O83J656K077
55656A67808K044L246N032M860K972K313L412L624K037P73O35l04k710m590n029
55641A86123n573o886p461o694n845n170l496j258n86j567j876o99K33J64L72
55626A39781J169J295Q76J497K822K671R92J13M00l74k580l604k390j343k225
55611A39100l519l370k198j013M0M43n87j940j383P68J721M95r29j300j621k301
55595A22406k201j358j428k534k820j909j500j830j075Q86J714O34l55l31q48
55580A07451k255k393n38R15M97K8J108K448K627K571L319M109M396N145O428
$$ y = [157132, 156112, 155815, 156313, 156402, 155820, 156392, 159075, 162061, 163691, 164939, 167076, 169216, 170334, 171454, 173585, 175528, 175880, 175256, 174485, 172713, 169403, 166152, 164385, 163194, 161529, 160476, 161208, 162646, 163392, 164075, 165731, 167808, 169852, 173098, 178130, 182990, 185962, 188275, 191687, 195311, 197348, 198121, 198756, 198452, 195742, 191152, 186123, 180550, 173664, 166203, 159509, 153664, 148494, 144998, 143740, 143154, 141587, 139711, 139012, 139245, 139409, 139781, 140950, 142245, 143121, 144618, 147440, 150111, 151103, 151216, 151616, 151242, 148662, 145058, 142668, 141325, 139100, 135581, 132211, 130013, 129000, 129040, 129483, 128896, 126956, 125573, 126341, 128062, 128557, 127628, 126328, 124707, 122406, 120205, 118847, 117419, 114885, 112065, 110156, 108656, 106826, 105751, 106637, 108351, 108985, 108630, 108299, 107451, 105196, 102803, 102265, 103180, 103677, 103705, 104813, 107261, 109888, 112459, 115778, 119887, 124283, 129428, 135856]
55565A35856O378M207J755M88m59j908k934l065l489m618m991m036l284l472l158
55550A13270j672o76j186j763j236o28p61o02L98R17K92j31L02K55p07p79P38
55533A06031J682N29j039j195q69j414j979j483r29j386j812j142m43q16j211
55518I2524n17J44n48j652j739j371j637j901j154j69j22m94k40K32N0m24n02
55501H0480n13q49r35m46p4m8M19J302J334M66M25J598J927M80n72M99J985J644
55483H9122L75L34J310J623J182J137J596J849J894J851J015q64k555l138l417
55468I3314m057m006k471p91m63q52p18m27p28r30k74L10j08m96L72J567J502
55451H0744N71K09M17L10J3O4o8r79j805j512o92m31m32RL51p9m75J37J002Q70
$$ y = [135856, 142234, 146441, 148196, 148684, 148225, 146317, 143383, 140318, 136829, 132211, 127220, 123184, 119900, 116428, 113270, 111598, 110922, 109736, 107973, 106737, 106109, 105348, 104746, 105144, 106061, 106353, 106222, 106524, 106779, 106072, 105293, 106031, 107713, 108242, 107203, 106008, 105139, 103725, 101746, 100263, 99334, 97948, 96136, 94994, 94551, 93735, 92524, 92007, 92151, 91603, 89951, 88212, 86841, 85204, 83303, 82149, 81980, 81858, 81364, 81124, 81356, 81406, 80982, 80480, 79967, 79118, 78183, 77737, 77663, 77615, 78034, 79336, 80670, 81136, 81561, 83159, 85086, 85566, 84994, 85493, 87478, 89122, 89497, 89831, 91141, 92764, 93946, 95083, 96679, 98528, 100422, 102273, 103288, 102424, 99869, 96731, 93314, 89257, 85251, 82780, 81989, 81526, 80674, 79956, 79529, 78801, 77871, 77597, 77907, 77799, 77303, 77675, 79242, 80744, 81315, 81524, 81941, 82251, 82264, 82328, 82260, 81281, 79476, 77964, 77272, 76841, 76409, 76418, 76769, 76690, 76215, 76352, 77354, 78224]
55431G8224J54QJ77l59j447k073k010j664j025q3N64O39P80J230J185M45K01J004
55413G5950J648J351J222K042K464J229n72j385j569k013k040q32N97R60P86R17
55397H0755N90q18j818j008L42L90j08N08J393N97j225j612k29R54J025Q36O30
55380H1202k64j411j454m70K1m46q40o42l74j54M78J264J393Q73L14l14j282j945
55362G5949j559p00k92O6J178K364K348J373O35K64l17p19k37M54K80k05K24J067
55344H2173Q14m44j287j504k084k961k933j794n70L32J316K063J774Q73O06R63
55328G7337Q15Om89m67o56j040p67J52P63Q37J075J588J656J012R7q59j713j810
55310G7537q50J57J99r4L17Q15J90r07q31K64O65pm48j23J23RK42P92P11Lj64
$$ y = [78224, 78378, 78386, 78563, 78204, 76757, 74684, 72674, 71010, 69985, 69902, 70466, 71105, 71885, 73115, 74300, 74745, 74946, 75950, 77598, 78949, 80171, 82213, 84677, 85906, 85334, 83949, 82380, 80367, 78327, 77495, 78092, 79052, 79838, 80755, 81345, 80527, 78709, 77701, 78043, 78433, 78325, 78833, 80226, 80823, 79598, 77986, 77757, 78711, 79736, 80572, 81202, 80938, 79527, 78073, 77603, 77624, 77178, 76338, 75696, 75322, 75168, 75646, 76910, 78303, 79176, 79490, 79176, 77894, 75949, 74390, 73690, 73398, 73464, 74642, 77006, 79354, 80727, 81362, 81626, 81309, 80590, 80353, 80807, 81087, 80882, 81106, 82173, 82987, 82543, 81256, 79752, 77668, 74707, 71774, 69980, 69410, 69742, 71058, 73121, 74895, 75768, 76374, 77337, 78152, 78158, 77669, 77202, 76546, 75506, 74739, 74891, 75654, 76491, 77566, 79154, 80810, 81822, 81919, 81060, 79347, 77537, 76687, 76844, 77043, 76949, 77266, 78081, 78271, 77364, 76533, 76797, 77462, 77455, 77007, 76884, 77007, 77016, 77258, 78050, 78761, 78764, 78600]
55289G8600N43J106R31N82N27O18Q89J475J707Q32m97r44n88o23j201j272n67
55272H2118P4L21O56J010Q04K73J27N6p30j699j628q19o69j141q38L19P81N7n03
55253G8569o5N18M96L09L05J42p2L09J025J023L43J44N52L59p15j425j190r45
55235G9682j172j030k17J62m62j034o33J78P31J326K017J835L46j203j488p97
55219G8241k05k1R4K67M97R17J382J439J038N85J79m01r61j101j082j377j517
55202G7974p03N40Q47J87o5O47J391J530J506J537J178N74N30R22P00r6j45P97
55184H9851J175J32j060j029k24K40K88L51L40J40J77O16R42Q92Q90J045Q54L05
55166I5925L2j7o72j786j943o53O68P48O9m47r36j734k237j809q94k50R5L30K82
$$ y = [78600, 79143, 80249, 81180, 81762, 82289, 82907, 83796, 85271, 86978, 87810, 87313, 86369, 85781, 85158, 83957, 82685, 82118, 82192, 82513, 83169, 84179, 84983, 85256, 85383, 85439, 84709, 83010, 81382, 80563, 79894, 78753, 77915, 78234, 79015, 79072, 78569, 78504, 79022, 79518, 79827, 80132, 80274, 80202, 80511, 81536, 82559, 82902, 83046, 83598, 83957, 83242, 81817, 80627, 79682, 78510, 77480, 77263, 77425, 76963, 75929, 75296, 75474, 76205, 77531, 79548, 81383, 81729, 80526, 79038, 78241, 78036, 78015, 78109, 78376, 78873, 79790, 81172, 82611, 83649, 84234, 84413, 84012, 83051, 81950, 80868, 79491, 77974, 77271, 77811, 78658, 78845, 78780, 79427, 80818, 82348, 83854, 85391, 86569, 87143, 87673, 88595, 89295, 89199, 89054, 89851, 91026, 91158, 90098, 89069, 88845, 89085, 89373, 89724, 90064, 90204, 90381, 90997, 91939, 92831, 93721, 94766, 95620, 95925, 95957, 95940, 95268, 93482, 91539, 90886, 91554, 92302, 92371, 91924, 90988, 89254, 87017, 85208, 84314, 84064, 84159, 84489, 84771]
55147H4771O3L64J331K016J674P21j68r61j597j526o22L32P03P69Q66P70L45j17
55129H9734o47j555k340j888k67R89R38L16M4K6J02O54J452J317l9j152p93L51
55111H7242R53Q29M65l5n35m36L33Q91Q50J015J765K035J060j25k53K42K68L7
55093I6601M20J107J017J23n08k81M25J041J178N56n51j115m61P70J420J228P86
55076A03756N85P44J196J578J346N30j42k90l45o30o74j08N78P45M68J67pk3M2
55057A09516l37j579k857k750j390n92j200j768q57P69J449R97M45K72K01K14
55041A00533M48N69J60n18q99q50n44j84k19j028j990j850n11O65Q58Q26J221
55024I6687J381Q02L63P78J145M80m30l71J20k86j334j528n61L62M57J67K3L5
$$ y = [84771, 84834, 85198, 86529, 88545, 90219, 90940, 90772, 89811, 88214, 86688, 86066, 86398, 87101, 87870, 88736, 89506, 89851, 89734, 89087, 87532, 85192, 83304, 83037, 84026, 84964, 85280, 85324, 85350, 85452, 86106, 87558, 88875, 88836, 87684, 86891, 87242, 88195, 89024, 89489, 89454, 88919, 88483, 88816, 89707, 90557, 91572, 93337, 95372, 96432, 96307, 96054, 96296, 96564, 96601, 97021, 98128, 99145, 99268, 98760, 98479, 98904, 99945, 101123, 101679, 101128, 100013, 99552, 100322, 101742, 102970, 103756, 104341, 105085, 106281, 107859, 109205, 109735, 109593, 109303, 108958, 108328, 107654, 107546, 108124, 108869, 109337, 109504, 109497, 109474, 109516, 109179, 107600, 104743, 101993, 100603, 100011, 98811, 97043, 96186, 96955, 98404, 99401, 99846, 100118, 100319, 100533, 100981, 101550, 101710, 101192, 100293, 99443, 98899, 98715, 98496, 97468, 95478, 93628, 93117, 93782, 94640, 95466, 96687, 98068, 98870, 99233, 100011, 101156, 101636, 101206, 100835, 100955, 100669, 99335, 97807, 97246, 97608, 98065, 98232, 98255, 98290]
55006I8290K37P90J381J440R18K69k09l76k9O99J097P17O5j71o7k3M4L10M93M18
54986A06293N18J007J210N61l77p30n34k42K43J037J430P44m03p45k8Q86J272
54969A12142J049M06l23o70n35l09j01N55J679K355J946R93K14m91j233j333m43
54952A15901M83M54m5m6J42n01j887k856k711j734m68O08J063R94J000J153Q01
54935A12351L1R0J383K383J870R75J334K424K698K498L542N881P675P999P841
54920A60975Q123Q522Q583Q370P591N502K211j164l903o147p822q371p871p253
54906A67346p007o706o052n392m830l937k698j856j805j905j379l20N75Q45N88
54891A25467L45O54J501K225K341K152K231K616L021L462M048M632N247O394Q129
$$ y = [98290, 98527, 99317, 100698, 102138, 103056, 103325, 103116, 102740, 102711, 103410, 104507, 105224, 105289, 105118, 105051, 105028, 105072, 105382, 105875, 106293, 106811, 107818, 109028, 109589, 109212, 108482, 107948, 107706, 107949, 108986, 110416, 111160, 110757, 110012, 109984, 110870, 112142, 113191, 113597, 113274, 112604, 112069, 111760, 111659, 112214, 113893, 116248, 118194, 119187, 119401, 118910, 117677, 116344, 115901, 116384, 116838, 116793, 116747, 116889, 116388, 114501, 111645, 108934, 107200, 106732, 107340, 108403, 109397, 110397, 111550, 112351, 112382, 112472, 113855, 116238, 118108, 119083, 120417, 122841, 125539, 128037, 131579, 137460, 145135, 153134, 160975, 169098, 177620, 186203, 194573, 202164, 207666, 209877, 208713, 204810, 198663, 190841, 182470, 174599, 167346, 160339, 153633, 147581, 142189, 137359, 133422, 130724, 128868, 127063, 125158, 123779, 123459, 124034, 124879, 125467, 125812, 126466, 127967, 130192, 132533, 134685, 136916, 139532, 142553, 146015, 150063, 154695, 159942, 166336, 174465]
54876A74465R399R181P890O678N783M422K057j116m585p556q995q621p551p094
54862A74357p220p108o671o442o349n781m672l503k433j379o73o56r35j017j241
54847A18277k008k615k129j032o10j016j280j039q28p26k20N47P73M26L88R66
54831A07874J424J277R01O43L38o4l26n39j009j447j223m60K3n8k06j06N3K31
54813A07326N88R16Q64O11M87J86o21j219o08P77J448R59L32L69P48J015J217
54796A15395J265P62k11r92j220r98l09Q14J652J437O00L13Q49J424J543J322
54780A23646P04l16q28J15J767K402J864J802L066M583N301N761O839Q340R614
54765A74660J0484J0779J0017Q234O303M713K878K24k808n398p289q555r140r072
$$ y = [174465, 183864, 193045, 200935, 207613, 213396, 217818, 219875, 218759, 214174, 206618, 197623, 189002, 181451, 174357, 167137, 160029, 153358, 146916, 140567, 134786, 130114, 126611, 124178, 122799, 122126, 121470, 120535, 119518, 118277, 116269, 113654, 111525, 110493, 109883, 108867, 107587, 106548, 105720, 104994, 104774, 105321, 106094, 106520, 106908, 107874, 109298, 110575, 111476, 112119, 112457, 112393, 112067, 111528, 110519, 109072, 107849, 107389, 107412, 107354, 107148, 107042, 107095, 107326, 107914, 108830, 109694, 110305, 110792, 110978, 110357, 109138, 108530, 109307, 110755, 111714, 112046, 112415, 113163, 114178, 115395, 116660, 117422, 117211, 116219, 114999, 114001, 113692, 114506, 116158, 117595, 118195, 118508, 119357, 120781, 122324, 123646, 124350, 124034, 123206, 123321, 125088, 127490, 129354, 131156, 134222, 138805, 144106, 149867, 156706, 165046, 174660, 185144, 195923, 205940, 214174, 220477, 225190, 228068, 228292, 225484, 220086, 212797, 204242, 195102, 186030]
54751A86030q599p766o494n151m386m189l905l261k606k021j159p9N88N01n2o62
54735A36789q55K1J987L663L596K219J284J487K139K964M487O402P421P262P140
54720A88006P635P657O250L985J689p79l551n858p097p764q404q631p980o859
54706A58299n769m551l121k095j902k051j954j684j371p51L1J49o72j541j669
54691A29348j361j133q20k34J76J31Q0K88K03n10j165j060n29l00m65p45j016
54674A20888j073n99O0k3r89j789j742j456j599j713j117q9O69J022J176J155
54658A12781J075J167J070Q7j375j828q44R3k31r80p48K84R51R62Q29O03J5n94
54640A13317o61l47j33J03P05J311J301Q12M86M55K90k18q24j161r31j62N17L95
$$ y = [186030, 177431, 169665, 163171, 158020, 153634, 149445, 145540, 142279, 139673, 137652, 136493, 136414, 137002, 137503, 137451, 136789, 135934, 135955, 137942, 141605, 145201, 147420, 148704, 150191, 152330, 155294, 159781, 166183, 173604, 180866, 188006, 195641, 203298, 209548, 213533, 215222, 214443, 210892, 205034, 197937, 190173, 181769, 173138, 165158, 158299, 152530, 147979, 144858, 142763, 140861, 138810, 136856, 135172, 133801, 133050, 133081, 133230, 132558, 131017, 129348, 127987, 126854, 126034, 125800, 125976, 126107, 126187, 126475, 126678, 126168, 125003, 123943, 123414, 123114, 122649, 121904, 120888, 119815, 119216, 119276, 119253, 118264, 116475, 114733, 113277, 111678, 109965, 108848, 108759, 109428, 110450, 111626, 112781, 113856, 115023, 116093, 116180, 114805, 112977, 112133, 112226, 111995, 111015, 110267, 110551, 111502, 112464, 113293, 113896, 113911, 113317, 112656, 112309, 112176, 112279, 112984, 114295, 115596, 116408, 116894, 117349, 117639, 117421, 116597, 115436, 114505, 114343, 114860, 115255]
54622A15255l08o58l88j72l23l01J10L77M00Q31J662J842J106O50J104J320L77
54605A22884o87n99L0l0m33q8O64O47j9j65L77O80M35K33K42K6l94m83k18n8o3
54584A22981k4j32n35o31Q7Q69N98m44r21l55M56P26L38n66j573j773o77Q31J459
54565A20714J180R64J076Q85J81m60o56n54l03km4n53p50R1J294J493N34l60k79
54546A24451N66J593K349K376J563O54N26R73J095O59J93o4k89l67j52j46q79
54529A35101j729j639q19n27j065j338n91N88J305J376J000L03m65r91j333j612
54513A27564j356q1J554K176J430K95m13q19j133j061m97J08M48P35J073J153
54497A31176Q28L92P1j84k66N7N95Q50P71P11O84L55j74l67j15J06Q2J41M87R52
$$ y = [115255, 114947, 114289, 113901, 113729, 113406, 113105, 113215, 113592, 113992, 114823, 116485, 118327, 119433, 120083, 121187, 122507, 122884, 122197, 121598, 121628, 121598, 121165, 121077, 121741, 122388, 122369, 122204, 122581, 123261, 123696, 123929, 124171, 124197, 123803, 123320, 123102, 123044, 122981, 122957, 122825, 122290, 121659, 121746, 122615, 123213, 122769, 121848, 121493, 121949, 122675, 123013, 122447, 120874, 119101, 118424, 119255, 120714, 121894, 122858, 123934, 124819, 125000, 124540, 123884, 123330, 123027, 123025, 122981, 122428, 121678, 121769, 123063, 124556, 125090, 124730, 124451, 125017, 126610, 128959, 131335, 132898, 133552, 134078, 135051, 136146, 136805, 136998, 136934, 136645, 136278, 136126, 135980, 135101, 133372, 131733, 130914, 130387, 129322, 127984, 127393, 127981, 129286, 130662, 131662, 131965, 131500, 130509, 129176, 127564, 126208, 126127, 127681, 129857, 131287, 131582, 131169, 130350, 129217, 128156, 127659, 127767, 128215, 128950, 130023, 131176, 132004, 132396, 132467, 132283, 132017, 132074, 132669, 133519, 134290, 135001, 135685, 136040, 135866, 135499, 135384, 135490, 135572, 135713, 136200, 137152]
54477A37152J427J928K151J681P58J54K40P49J411K094K432K108J547J550K117
54462A59499K408J841O40o90j726k102j880j805k357k787k135q91m41r28j099
54447A45547m63p3o55j372j214n31k14l07k74n0P7J42L32M59K71l3j59k66o74
54428A40543j227j385q91n7N49N76K07N1N12J305J840J934J807J529R83K65l91
54411A48150r91j526j509m80J024J742J144M6l54L60J604K306J748L70m36R2J041
54394A54331J049K03k56J04M91M00L19N84O49M8q21j406j762k074k052j349r9
54377A48359J279K408K887K461J568J153J647K499L017L092K996K913K928L005
54363A82212K860K293J634J352J220N87n21j317j413j248j156q70l54k85j165
$$ y = [137152, 138579, 140507, 142658, 144339, 145097, 145251, 145491, 146240, 147651, 149745, 152177, 154285, 155832, 157382, 159499, 161907, 163748, 164388, 163698, 161972, 159870, 157990, 156185, 153828, 151041, 148906, 148015, 147574, 146646, 145547, 145084, 145011, 144356, 142984, 141770, 141239, 141025, 140718, 140444, 140394, 140471, 140613, 140945, 141404, 141675, 141642, 141483, 141217, 140543, 139316, 137931, 137040, 136983, 137532, 138108, 138315, 138366, 138878, 140183, 142023, 143957, 145764, 147293, 148276, 148541, 148150, 147159, 145633, 144124, 143644, 144668, 146410, 147554, 147600, 147246, 147606, 149210, 151516, 153264, 153634, 153198, 153290, 154331, 155380, 155583, 155327, 155431, 155922, 156322, 156641, 157225, 157874, 157922, 157101, 155695, 153933, 151859, 149807, 148458, 148359, 149638, 152046, 154933, 157394, 158962, 160115, 161762, 164261, 167278, 170370, 173366, 176279, 179207, 182212, 185072, 187365, 188999, 190351, 191571, 192158, 191637, 190320, 188907, 187659, 186503, 185633, 185279, 184994, 183829]
54348A83829k483l317l329k878k477k476k874l156k698j550n01j72m33q05j015
54333A53665r62o26j43K57N28P27O97L16j22j94J5N9j55l12k27J7L27N10J78p01
54313A53854j453j484j088p74l04O40J339Q10n84j491j392q60k07O96J355R82
54297A50039Ok47L42M06n88j361q93K1K25KK92J132J858K250K430K227J480N88
54279A60209J15J32L24L82Q3n15q35m51P8j56r34j198q25p50j180j090m9R85J290
54260A55615J423J901K219K033J947K176J844O41j84K63Q95L73p39j136r58j182
54244A67131j657j600j384j937k743k333o99N02L60k80m67l57l23j10N15J128
54228A55746J297J174J092J006P26L34J41L15O61O18j47j098j221l93K75j8o13
$$ y = [183829, 181346, 178029, 174700, 171822, 169345, 166869, 163995, 160839, 158141, 156591, 156090, 155918, 155485, 154680, 153665, 152703, 152077, 151934, 152191, 152719, 153446, 154143, 154459, 154337, 154143, 154158, 154217, 154062, 153750, 153523, 153540, 153867, 154377, 154555, 153854, 152401, 150917, 149829, 149055, 148751, 149391, 150730, 151540, 150956, 149465, 148073, 147213, 147006, 147702, 149057, 150039, 150045, 149798, 150140, 150546, 149958, 148597, 147704, 147725, 147950, 147952, 148244, 149376, 151234, 153484, 155914, 158141, 159621, 160209, 160324, 160456, 160780, 161162, 161245, 160730, 159895, 159444, 159522, 159366, 158432, 157234, 156409, 155659, 154479, 153389, 153340, 154325, 155615, 157038, 158939, 161158, 163191, 165138, 167314, 169158, 169799, 169615, 169878, 170773, 171146, 170407, 169271, 168313, 167131, 165474, 163874, 162490, 160553, 157810, 155477, 154778, 155280, 155640, 155360, 154893, 154536, 154213, 154103, 154618, 155746, 157043, 158217, 159309, 160315, 161041, 161375, 161516, 161831, 162492, 163110, 162963, 161865, 160644, 160251, 160526, 160508, 159895]
54211A59895m75K17N14K11j65m88j060j670j687j149p89q26o50P0P74Q34L94L0
54193A53980nQ1k0l62o22l37N39J511K054K131J998J888K041K597L157K965J878
54176A75474P48L44M26L08j91q24j428j770j440n65r0o28j514j708j184o80n40
54159A64738n85p35r46q72m42l47j115k060k091j233l79R8M83P13M39m7pN08P06
54140A56826M05K79N96P46L11k24k54J74P04J150J337J070N57L42N11M90q9p77
54122A64154q81l27L35N74L82K83Q29J960K985L403L488L724M021L988L725L704
54106A96347L927L793K839J170p55k361l136l033k624k474k497k360k140k047
54092A84649j858j284p07p19j107j089n53k22m67p27m00L25Q14P39K63k14k81
$$ y = [159895, 159420, 159637, 160151, 160362, 160197, 159709, 158649, 156979, 155292, 154143, 153354, 152528, 151878, 151948, 152722, 153556, 153950, 153980, 153975, 154056, 154036, 153674, 153052, 152715, 153254, 154765, 156819, 158950, 160948, 162836, 164877, 167474, 170631, 173596, 175474, 176222, 176566, 176992, 177300, 177109, 176285, 174857, 173087, 171647, 171082, 170992, 170364, 168850, 167142, 165958, 165278, 164738, 164153, 163418, 162472, 161600, 161158, 160811, 159696, 157636, 155545, 154312, 153933, 154031, 154514, 155227, 155666, 155619, 155612, 156120, 156826, 157231, 157510, 158106, 158852, 159163, 158939, 158685, 158859, 159563, 160713, 162050, 163120, 163677, 164019, 164530, 165020, 164931, 164154, 163273, 162946, 163281, 163855, 164237, 164520, 165349, 167309, 170294, 173697, 177185, 180909, 184930, 188918, 192643, 196347, 200274, 204067, 206906, 208076, 207321, 204960, 201824, 198791, 196167, 193693, 191196, 188836, 186696, 184649, 182791, 181507, 180800, 180081, 178974, 177885, 177332, 177110, 176643, 175916, 175516, 175841, 176655, 177394, 177657, 177443, 177162]
54075A77162J90R11J520J976K400K673K599K272J902J411O85Nj91L9J94n4o34
54058A95060j309j816j868j474j023p51l94K84R67J262J326J539J875K107K349
54043A98134K801L366L972M863N955O457N832M778M365M721N278N857O553O917
54029B69849O400N332M463L782K836J932J806K168J844N39p11j037o60j83O4k91
54013B98133j557l265m410m692m756n030n244n278n491n867n787m960l880k999
53999B34917k307j865j904k092j719r66r55k017k915k453j058l6P1l58q75j229
53983B12239j145o11p8J18K79Q71J822K641L015K993K836L026M023N710P277P816
53967B52832O890M528J152k356n001o288o291n298l815k740k726l269l190k036
$$ y = [177162, 177352, 178263, 179783, 181759, 184159, 186832, 189431, 191703, 193605, 195016, 195701, 195706, 195515, 195554, 195748, 195694, 195060, 193751, 191935, 190067, 188593, 187570, 186819, 186425, 186709, 187676, 188938, 190264, 191803, 193678, 195785, 198134, 200935, 204301, 208273, 213136, 219091, 225548, 231380, 236158, 240523, 245244, 250522, 256379, 262932, 269849, 276249, 281581, 286044, 289826, 292662, 294594, 296400, 298568, 300412, 300951, 300240, 299203, 298543, 298360, 298424, 298133, 296576, 293311, 288901, 284209, 279453, 274423, 269179, 263901, 258410, 252543, 246756, 241796, 237916, 234917, 232610, 230745, 228841, 226749, 225030, 224064, 223109, 221092, 218177, 215724, 214666, 214630, 214701, 214343, 213468, 212239, 211094, 210483, 210405, 210523, 210802, 211673, 213495, 216136, 219151, 222144, 224980, 228006, 232029, 237739, 245016, 252832, 259722, 264250, 265402, 263046, 258045, 251757, 245466, 240168, 236353, 233613, 230887, 227618, 224428, 222392]
53953B22392m22J037K249K999K765J664P45R01J989L336M365M577L750K618K469
53938B57434L571M754N073N007N291N449M510K680J270J121J879K720L082K799
53924C06640K152J825K372L565M552M675M040L443L777N260P122Q268Q370P992
53910C74053P658P321O832O324N789M753K831L88j678k727k867k783l043l483
53896C99368l452k937k979m310o115o997o953p201q173q926q767q207p825p444
53882C09082o925o717o836o365m789k999k094k004k063k174k527k798k628k371
53868B55792k461k618k495k521l124l606k935j374k45l04j239k499l615l864k754
53853B20138j007p7m83j336j655j397j019p20n09m30l84p4N31R46O02m73j567
$$ y = [222392, 221970, 223007, 225256, 228255, 231020, 232684, 233429, 234330, 236319, 239655, 244020, 248597, 252347, 254965, 257434, 261005, 265759, 270832, 275839, 281130, 286579, 291089, 293769, 295039, 296160, 298039, 300759, 303841, 306640, 308792, 310617, 312989, 316554, 321106, 325781, 329821, 333264, 337041, 342301, 349423, 357691, 366061, 374053, 381711, 389032, 395864, 402188, 407977, 412730, 415561, 415949, 414271, 411544, 408677, 405894, 402851, 399368, 395916, 392979, 390000, 385690, 379575, 372578, 365625, 358424, 350251, 341325, 332558, 324351, 316526, 309082, 302157, 295440, 288604, 282239, 277450, 274451, 272357, 270353, 268290, 266116, 263589, 260791, 258163, 255792, 253331, 250713, 248218, 245697, 242573, 238967, 236032, 234658, 234413, 234109, 232870, 230371, 226756, 222892, 220138, 219131, 219054, 218571, 217235, 215580, 214183, 213164, 212444, 211935, 211505, 211121, 211047, 211578, 212524, 213126, 212653, 211086]
53836B11086j816r62L45J168J209R37P64N37J11j71O1O16J123J628K272K649K137
53819B23694Q21m37q99n50J25O63R24J135J601K284K819L067L321L775M158M196
53803B50697M090M209M561M893N092N218N362N639O034O123N439M237L364L130
53789C18088K969K466K013J894J552M80q54j735k378l377m450m806m496m434n014
53774B97918n596n496m760l878l311l376l984m449m108l209k721l135l920m203
53760B41772l646k571j590j155j245j486j656j878k168k175j677r78m40l7K46
53745B19316N9o36j016l87O05O22n37j594j414k65O84O23k63j074r66N3J165J729
53727B16704J912K065J956J266M35K25O81J223J580J853J891J502J181J651K632
$$ y = [211086, 209270, 208308, 208653, 209821, 211030, 211967, 212731, 213268, 213379, 213208, 213269, 213885, 215008, 216636, 218908, 221557, 223694, 224515, 224078, 223179, 222629, 222754, 223417, 224341, 225476, 227077, 229361, 232180, 235247, 238568, 242343, 246501, 250697, 254787, 258996, 263557, 268450, 273542, 278760, 284122, 289761, 295795, 301918, 307357, 311594, 314958, 318088, 321057, 323523, 325536, 327430, 328982, 329462, 328608, 326873, 324495, 321118, 316668, 311862, 307366, 302932, 297918, 292322, 286826, 282066, 278188, 274877, 271501, 267517, 263068, 258960, 255751, 253030, 249895, 245975, 241772, 238126, 235555, 233965, 232810, 231565, 230079, 228423, 226545, 224377, 222202, 220525, 219547, 219107, 219070, 219316, 219375, 218739, 217723, 217336, 217941, 218563, 218026, 216432, 215018, 214753, 215437, 216060, 215797, 214723, 213757, 213810, 214975, 216704, 218616, 220681, 222637, 223903, 224338, 224563, 225244, 226467, 228047, 229900, 231791, 233293, 234474, 236125, 238757]
53712B38757L023K444J684J323R37J15n94m28M82J425K105K776L666M773O076
53697B68564P423Q329Q196O810M527K155O18L49Q14R55L20n12p97n89m57n73n65
53680C05567k60j5j89n70p14o98j046j792k082j152M57J283O22p07j423j133l11
53663B95837M81R02P44J14m17l17K80P71P45K78k68m64j51L05L25m3l2Q13J986
53644C01889K745K973K864K358J525R95J229J739J774J436J323J501J622J793
53630C27766K299K772K624K200K367L060L320K879K513K610K570K048J682K003
53616C62713K497K473K163K228K771L421M008M439M322L314J732M10n1M09J435
53601C98284K517L273L663L790L532K756J709Q10R8n79r34o26k11p40k118k856
$$ y = [238757, 241780, 244224, 245908, 247231, 248168, 248283, 247689, 247261, 247743, 249168, 251273, 254049, 257715, 262488, 268564, 275987, 284316, 292512, 299322, 303849, 306004, 306622, 306971, 307785, 308740, 309060, 308548, 307751, 307162, 306705, 306132, 305567, 305307, 305292, 305103, 304533, 303819, 303121, 302075, 300283, 298201, 297049, 297506, 298789, 299411, 298704, 297281, 296148, 295837, 296318, 297220, 297964, 298078, 297661, 297344, 297624, 298395, 299140, 299418, 299150, 298686, 298535, 298840, 299165, 299122, 299090, 299903, 301889, 304634, 307607, 310471, 312829, 314354, 315349, 316578, 318317, 320091, 321527, 322850, 324351, 325973, 327766, 330065, 332837, 335461, 337661, 340028, 343088, 346408, 349287, 351800, 354410, 356980, 359028, 360710, 362713, 365210, 367683, 369846, 372074, 374845, 378266, 382274, 386713, 391035, 394349, 396081, 396491, 396440, 396849, 398284, 400801, 404074, 407737, 411527, 415059, 417815, 419524, 420334, 420432, 419853, 418919, 418293, 418082, 417342, 415224, 412368]
53585D12368k012n38Jo49j529j940k002k029k124k280k291j736n84M08L99n30
53569C92932j559k060j991j578j164j191j748k190j760n22P38J454J641J378O06
53554C82986m13j002p31Q7Q44J274J434J345J037P92R96J645K228K260J842J570
53538C98194J895K646L301L595L771M219N026N931O638P064P364P789Q500R466
53524D75399J0463J1260J1773J2093J2362J2620J2822J2989J3285J3867J4697
53513F13630J5656J6734J7985J9290K0437K1484K2770K4463K6213K7389K7541
53502H53592K6628K5072K3563K2549K1837K0938J9796J8814J8144J7547J7040
53491A085520J7029J7508J7739J7208J6359J5911J5982J6372J7186J8461J9583
$$ y = [412368, 410356, 409818, 409819, 409170, 407641, 405701, 403699, 401670, 399546, 397266, 394975, 393239, 392655, 393063, 393462, 392932, 391373, 389313, 387322, 385744, 384580, 383389, 381641, 379451, 377691, 377169, 377907, 379361, 381002, 382380, 382986, 382573, 381571, 380840, 380927, 381771, 383045, 384479, 385824, 386861, 387653, 388649, 390294, 392522, 394782, 396624, 398194, 400089, 402735, 406036, 409631, 413402, 417621, 422647, 428578, 435216, 442280, 449644, 457433, 465933, 475399, 485862, 497122, 508895, 520988, 533350, 545970, 558792, 571781, 585066, 598933, 613630, 629286, 646020, 664005, 683295, 703732, 725216, 747986, 772449, 798662, 826051, 853592, 880220, 905292, 928855, 951404, 973241, 994179, 1013975, 1032789, 1050933, 1068480, 1085520, 1102549, 1120057, 1137796, 1155004, 1171363, 1187274, 1203256, 1219628, 1236814, 1255275, 1274858]
53480A274858J9804J9124J8091J7122J6558J6784J7437J7029J4431J0505P188
53469A448931N077L073L33k641n142p300r486j1550j3179j4312j4818j4381j3213
53456A351392j2219j2121j2818j3872j5087j6292j7190j7723j8122j8354j8078
53445A179516j7390j6952j7047j7103j6523j5374j3901j1932r325o463l882j774
53433A031850l18J07m39j010n42J047K975M500N392N780N970O360P188Q452J0060
53418A087372J1890J3671J5173J6548J8117J9765K1024K1856K2746K3960K5239
53407A297361K6388K7499K8469K8986K9264L0064L1624L3380L5091L7479M1040
53396A646645M4969M7938M9569N0431N1078N1708N2434N3257N3928N4285N4436
$$ y = [1274858, 1294662, 1313786, 1331877, 1348999, 1365557, 1382341, 1399778, 1416807, 1431238, 1441743, 1448931, 1454008, 1457081, 1457414, 1454773, 1449631, 1442331, 1432845, 1421295, 1408116, 1393804, 1378986, 1364605, 1351392, 1339173, 1327052, 1314234, 1300362, 1285275, 1268983, 1251793, 1234070, 1215948, 1197594, 1179516, 1162126, 1145174, 1128127, 1111024, 1094501, 1079127, 1065226, 1053294, 1043969, 1037506, 1033624, 1031850, 1031532, 1031639, 1031200, 1030190, 1029648, 1030695, 1033670, 1038170, 1043562, 1049342, 1055312, 1061672, 1068860, 1077312, 1087372, 1099262, 1112933, 1128106, 1144654, 1162771, 1182536, 1203560, 1225416, 1248162, 1272122, 1297361, 1323749, 1351248, 1379717, 1408703, 1437967, 1468031, 1499655, 1533035, 1568126, 1605605, 1646645, 1691614, 1739552, 1789121, 1839552, 1890630, 1942338, 1994772, 2048029, 2101957, 2156242, 2210678]
53385B210678N4323N3541N1980N0165M8461M6521M3984M1163L8432L5463L1764
53374B706475K7513K3153J8622J3763R104N290J966j975p178j3534k0749k8294
53362B734156l5006l9791m2847m5356m7861m9735n0299m9691m8389m6685m4908
53351B233588m3554m2662m1576l9711l7343l5292l4093l3782l4223l5244l6396
53340A819712l6877l5974l3730l1081k9048k7703k6192k3873k1106j8672j6808
53329A518648j5191j3627j2265j1340j1058j1709j3382j5639j7681j8878j9059
53318A358819j8481j7666j7012j6375j5348j4036j3051j2459j1404r299o837n043
53306A201808l871k580j128k15L6L97J488L243N520Q356J1327J3541J4736J5705
$$ y = [2210678, 2265001, 2318542, 2370522, 2420687, 2469148, 2515669, 2559653, 2600816, 2639248, 2674711, 2706475, 2733988, 2757141, 2775763, 2789526, 2798630, 2803920, 2805886, 2803911, 2796733, 2783199, 2762450, 2734156, 2699150, 2659359, 2616512, 2571156, 2523295, 2473560, 2423261, 2373570, 2325181, 2278496, 2233588, 2190034, 2147372, 2105796, 2066085, 2028742, 1993450, 1959357, 1925575, 1891352, 1856108, 1819712, 1782835, 1746861, 1713131, 1682050, 1653002, 1625299, 1599107, 1575234, 1554128, 1535456, 1518648, 1503457, 1489830, 1477565, 1466225, 1455167, 1443458, 1430076, 1414437, 1396756, 1377878, 1358819, 1340338, 1322672, 1305660, 1289285, 1273937, 1259901, 1246850, 1234391, 1222987, 1213688, 1206851, 1201808, 1197937, 1195357, 1194229, 1194014, 1194050, 1194447, 1195935, 1199178, 1204698, 1213054, 1224381, 1237922, 1252658, 1268363]
53292A268363J7196J9037K0815K2738K5022K6905K7212K5810K3841K2348K1357
53281A520644K0381J9211J7773J5738J2796R196N514K005j398m476o725q172r608
53268A592879j1742j4405j6994j9264k1204k2595k3292k3708k4284k4771k4682
53257A365938k4271k4206k4439k4395k4258k4834k5954k6190k4791k2789k1549
53246A098262k1150k1017k1201k2033k3109k3592k3169k2014k0310j8479j7286
53235H64902j6898j6452j5365j4305j3891j3240j1212q548p132p330p622p002
53223G25905o274o587q006r985j2113j3875j4639j4546j4596j5350j6204j6403
53211E77327j6005j5401j4545j3302j1954j0815r807q836q215q159q307q217q036
$$ y = [1268363, 1285559, 1304596, 1325411, 1348149, 1373171, 1400076, 1427288, 1453098, 1476939, 1499287, 1520644, 1541025, 1560236, 1578009, 1593747, 1606543, 1615739, 1621253, 1623258, 1621860, 1617384, 1610659, 1602487, 1592879, 1581137, 1566732, 1549738, 1530474, 1509270, 1486675, 1463383, 1439675, 1415391, 1390620, 1365938, 1341667, 1317461, 1293022, 1268627, 1244369, 1219535, 1193581, 1167391, 1142600, 1119811, 1098262, 1077112, 1056095, 1034894, 1012861, 989752, 966160, 942991, 920977, 900667, 882188, 864902, 848004, 831552, 816187, 801882, 787991, 774751, 763539, 754991, 747859, 740529, 732907, 725905, 719631, 713044, 705038, 695053, 682940, 669065, 654426, 639880, 625284, 609934, 593730, 577327, 561322, 545921, 531376, 518074, 506120, 495305, 485498, 476662, 468447, 460288, 451981, 443764, 435728]
53198D35728q263r027r991j0668j0697r982q880p940p352o866o364o055o014n953
53184C21676n689n400n188m821m147l377k667j807p50l4k53j248k180k359j750
53169B80006q23j13J42Pm40j275k351k975k428q61P03J350R82J15n95o31m5L43
53151B71111l04j667k435j907q48m12p43j127j075p28m07l09n09q45q51k23P29
53134B57450J304J127M59j16j67K89Q09R31P03O62J162J886K241K126K064K515
53118B75445L263L638L364L003L306M158M524L651J967M57n50j408k237k668k587
53103B97326k461k684l005k935k385j670j122r88j377k093k656k698k282j781
53089B67189j559j759k244k634k628k270j813j364q74m10j59j41j33O1M13O11
$$ y = [435728, 427465, 418438, 408447, 397779, 387082, 377100, 368220, 360280, 352928, 346062, 339698, 333643, 327629, 321676, 315987, 310587, 305399, 300578, 296431, 293054, 290387, 288580, 287830, 287796, 287543, 286295, 284115, 281756, 280006, 279183, 279070, 279212, 279219, 278779, 277504, 275153, 272178, 269750, 268889, 269592, 270942, 271924, 272039, 271444, 270813, 270768, 271111, 270807, 269140, 266705, 264798, 263950, 263538, 262795, 261668, 260593, 259865, 259458, 259149, 258640, 257795, 256944, 256721, 257450, 258754, 259881, 260340, 260224, 260057, 260346, 261155, 262086, 262789, 263451, 264613, 266499, 268740, 270866, 272930, 275445, 278708, 282346, 285710, 288713, 292019, 296177, 300701, 304352, 306319, 306776, 306226, 304818, 302581, 299913, 297326, 294865, 292181, 289176, 286241, 283856, 282186, 281064, 280076, 278699, 276606, 273950, 271252, 268970, 267189, 265630, 263871, 261627, 258993, 256365, 254095, 252282, 250918, 250044, 249634, 249475, 249334, 249201, 249262, 249675, 250286]
53073B50286J77j066k479k885j839k97M40J65l29n06n16n09l37r3j79o87j189
53056B38157j308j051m75M21J372J912J909J652J334R30N35L03L5n18r99p91p6
53039B43342K22k54p92p34l11r3j73l34m63m43j16L79O56O55O32N47J67j92J37
53020B42832R78J267N98j42j71N5j70n24k92M00Q68R18P67L57m23j089r94k16
53002B45019O08J136J420J412J012M90K30J65k5k40MQ93K015K697K502J621Q45
52985B61804Q35J348J665J799K451L578M007K994J249k29j399k413k617j455L00
52970B73917J408J719J733J294J14r29o47M66P41j29o63K9J025J224P59Q2r66
52953B81177k266k772j891o53m02r81j285j138j347k147k682k241j125o8N29N55
$$ y = [250286, 250463, 249397, 246918, 244033, 242194, 241897, 242337, 242502, 242173, 241667, 241151, 240642, 240305, 240212, 240033, 239346, 238157, 236849, 235798, 235323, 235744, 237116, 239028, 240937, 242589, 243923, 244853, 245388, 245691, 245726, 245208, 244209, 243418, 243342, 243564, 243310, 242518, 241784, 241473, 241380, 241207, 240873, 240410, 239967, 239851, 240230, 240886, 241541, 242173, 242720, 242887, 242695, 242832, 243810, 245077, 245675, 245533, 245362, 245417, 245247, 244723, 244431, 244831, 245699, 246617, 247384, 247741, 247318, 246229, 245235, 245019, 245627, 246763, 248183, 249595, 250607, 251097, 251327, 251492, 251467, 251227, 251231, 252124, 254139, 256836, 259338, 260959, 261804, 262639, 263987, 265652, 267451, 269902, 273480, 277487, 280481, 281730, 281501, 280102, 277689, 275072, 273617, 273917, 275325, 277044, 278777, 280071, 280185, 279256, 278609, 279075, 279816, 279687, 279024, 279053, 280078, 281302, 282061, 282143, 281177, 278911, 276139, 274248, 273595, 273193, 272212, 270927, 269789, 268442, 266295, 263613, 261372, 260247, 260179, 260708, 261263]
52937B61263J1p77j138o58L11J019J075O67J46k92m75j30P77J689J807R85p2o02
52919B65606n69l98k86j67r3j57j30K93Q96J098P64L44J12k38r33j515j357n30
52901B62740L20P82R64J003P72K64j28J5N37Q50O41J85j14j67n3K40N99O33J44
52882B70227l60j59P08J508J765J657J441J201J224J856K737K974K458K237L063
52867B94537M296M903M813M477L708K018k81k251l481m233m644m631m443m471
52853B90317m517m127l485l227l372l362l054k798k498j695o77m77j323k123j918
52838B51664j093n93o97j072j432j605j412r64o34m36M6Q46J364J262R62P94L80
52821B47380n21j333j471j258j255j198n21M76R79R15R83J428J694J387P72J71
$$ y = [261263, 261274, 260497, 259359, 258701, 259012, 260031, 261106, 261773, 261919, 261627, 261152, 261022, 261799, 263488, 265295, 266280, 266208, 265606, 265037, 264639, 264353, 264186, 264093, 263936, 263806, 264099, 264995, 266093, 266857, 267201, 267313, 267075, 266142, 264627, 263270, 262740, 263060, 263842, 264806, 265809, 266581, 266845, 266717, 266732, 267269, 268119, 268760, 268945, 268831, 268664, 268611, 268851, 269450, 270083, 270227, 269867, 269708, 270416, 271924, 273689, 275346, 276787, 277988, 279212, 281068, 283805, 286779, 289237, 291474, 294537, 298833, 303736, 308549, 313026, 316734, 318752, 318471, 316220, 312739, 308506, 303862, 299231, 294788, 290317, 285800, 281673, 278188, 274961, 271589, 268227, 265173, 262375, 259877, 258182, 257505, 257028, 255705, 253582, 251664, 250571, 249978, 249281, 248209, 246777, 245172, 243760, 242796, 242162, 241726, 241772, 242618, 243982, 245244, 246206, 247000, 247380, 246859, 245526, 244055, 242797, 241542, 240344, 239823, 240299, 241278, 242193, 243176, 244604, 246298, 247685, 248457, 248628]
52805B48628m75j201j781k126k468k841k821k067q83J9J30n75j642k338k122j204
52789B24233m45m56r51j101m22Q23J965K435K114J382Q76R76J468J726J323M47
52773B36393k94m90k78j32l33p40r96q86n38l30n68j097j327p99K32J037J284
52756B30138J353J663J996J848J291R88J346J990K278K027J480Q29J69j84J87
52741B49399J143J859J712J053P35Q92P77j52j398j970j463l15P76J393J505J376
52725B57322J263J035K49j170k536l023k537j604o50K20P97P38P5o61j001r27
52709B47590p01n35n72p97r18o10j2L59K82R9J34K57K02O6J44M72Q34J084J224
52690B48602J235J080Q25N72L22N6j16n7J17Q0l63r65j139n25N58J262J016J26
$$ y = [248628, 248153, 246952, 245171, 243045, 240577, 237736, 234915, 232848, 231965, 231984, 232114, 231539, 229897, 227559, 225437, 224233, 223788, 223332, 222381, 221280, 220858, 221681, 223646, 226081, 228195, 229577, 230453, 231429, 232897, 234623, 235946, 236393, 236099, 235609, 235331, 235199, 234866, 234126, 233130, 232244, 231706, 231376, 230808, 229711, 228384, 227585, 227817, 228854, 230138, 231491, 233154, 235150, 236998, 238289, 239277, 240623, 242613, 244891, 246918, 248398, 249227, 249396, 249212, 249399, 250542, 252401, 254113, 255166, 255901, 256793, 257570, 257418, 256020, 254050, 252587, 252272, 253048, 254441, 255946, 257322, 258585, 259620, 259869, 258699, 256163, 253140, 250603, 248999, 248349, 248569, 249366, 250104, 250179, 249518, 248517, 247590, 246889, 246354, 245782, 244985, 244067, 243457, 243445, 243804, 244086, 244185, 244319, 244576, 244778, 244844, 244988, 245460, 246294, 247378, 248602, 249837, 250917, 251742, 252314, 252636, 252692, 252576, 252519, 252636, 252716, 252353, 251388, 250249, 249724, 250282, 251544, 252560, 252686]
52672B52686n09l03N68J530K139K281K052J660J292R39M49j45m13J11J318K441
52656B68096K742K254J701J673K085K498K633K302J197o79k567l531l508l142
52642B73754k622j487K01J444J590J177Q81M64m14j128r24k27P1K23J185K793
52626B76981L811L794L451K960J497r96k946l021j816q12n10m75m73n36m40p4
52610B80395N3m73j100r70j84M05M82N46J027J742K288K409K023J286N66O0l68
52593B90187p98r60p09k47M01J546K925L367K241O40J32P48J289J314J485J989
52577C05550K058J363O29L21j66j303k335k291j426p43o31p53r14j189j325r60
52561B95885l84l44r73j557j520j102q78r95j208j290j153q58o63q03j038p85
$$ y = [252686, 252177, 251874, 252442, 253972, 256111, 258392, 260444, 262104, 263396, 264335, 264784, 264639, 264226, 264337, 265655, 268096, 270838, 273092, 274793, 276466, 278551, 281049, 283682, 285984, 287181, 286502, 283935, 280404, 276896, 273754, 271132, 269645, 269846, 271290, 272880, 274057, 274938, 275402, 274988, 273860, 272936, 272709, 272780, 273003, 274188, 276981, 280792, 284586, 288037, 290997, 292494, 291498, 288552, 285531, 283715, 282903, 282393, 281918, 281445, 280909, 280469, 280395, 280448, 279975, 278875, 277905, 277721, 278126, 278608, 279154, 280181, 281923, 284211, 286620, 288643, 289929, 290495, 290555, 290187, 289389, 288429, 287720, 287473, 287874, 289420, 292345, 295712, 297953, 298593, 298725, 299473, 300762, 302076, 303561, 305550, 307608, 308971, 309600, 309921, 309755, 308452, 306117, 303826, 302400, 301657, 301026, 300273, 299359, 298170, 296845, 295885, 295501, 295157, 294184, 292627, 291107, 290005, 289127, 288132, 286924, 285634, 284481, 283623, 282960, 282157, 281119, 280334]
52545B80334J01R95J323J323J543J837J551O34r7m6M17N82L33J20L07R27J786
52528B93970K484K565K009J338R60P37M72L68N37N29N0k57M31J814K800K977K880
52511C16664K847K689K552K998L841L967K829J186j68j494l168m608m964m366
52497C20805l587k957k435k242k516k716k266j508j158j156r71p30j023j738k139
52482B91663k054j928j660n95J080K080J689P52M23O75P30L82J10K66Q12J643
52466B96068K562L093K949K641L040M195N080M775L534K296J310j38k416m582
52452C24407n334m719m027l954l781k799j603j162j280j052m44k49o57j008j031
52437B91307j229j704j684p38M38J011J062J079J007N78R2J48Q10J595K078K096
$$ y = [280334, 280435, 281430, 282753, 284076, 285619, 287456, 289007, 289641, 289544, 289498, 289915, 290497, 290830, 290950, 291257, 292184, 293970, 296454, 299019, 301028, 302366, 303326, 304063, 304535, 304903, 305440, 305969, 306019, 305762, 306193, 308007, 310807, 313784, 316664, 319511, 322200, 324752, 327750, 331591, 335558, 338387, 339573, 339405, 337911, 334743, 330135, 325171, 320805, 317218, 314261, 311826, 309584, 307068, 304352, 302086, 300578, 299420, 298264, 297293, 296563, 295540, 293802, 291663, 289609, 287681, 286021, 285426, 286506, 288586, 290275, 291027, 291450, 292125, 292855, 293237, 293347, 293613, 294425, 296068, 298630, 301723, 304672, 307313, 310353, 314548, 319628, 324403, 327937, 330233, 331543, 331405, 328989, 324407, 319073, 314354, 310327, 306373, 302592, 299793, 298190, 297028, 295748, 294696, 294252, 294003, 293346, 292338, 291307, 290078, 288374, 286690, 285952, 286390, 287401, 288463, 289542, 290549, 291127, 291219, 291367, 292177, 293772, 295850, 297946]
52421B97946J601Q08K63L13O68R29J199J780K436K665K506K526K966L494L929
52406C26029M697O294Q560J0718J1931J1650R643O006J310l363o761q136p740
52393C70838o607n730n451n488n333m597l290j908j014o41l24J85N69N71N22R20
52377C33222J716K462K955L318L575L710M049M979O157O607N833M423L146J978
52363C88130N20r44j588j225p03p92j249j336q66k55K08N61Q18R91J382K274L281
52346C89207L685L526L653M361M772M098K834K022J952K452L773N981P905Q164
52332D48385P297P427R408J1717J2861J3570J5367J8006J9762J9986J9936K0923
52320F24645K2626K3593K2895K0984J9348J9342K1021K3085K4255K4560K4898
$$ y = [297946, 299547, 300355, 300618, 300931, 301599, 302528, 303727, 305507, 307943, 310608, 313114, 315640, 318606, 322100, 326029, 330726, 337020, 345580, 356298, 368229, 379879, 389522, 395528, 396838, 393475, 386714, 378578, 370838, 364231, 358501, 353050, 347562, 342229, 337632, 334342, 332434, 331420, 330779, 330455, 330640, 331209, 331780, 332302, 333222, 334938, 337400, 340355, 343673, 347248, 350958, 355007, 359986, 366143, 372750, 378583, 383006, 386152, 388130, 388650, 387706, 386118, 384893, 384190, 383398, 382149, 380813, 379947, 379692, 379900, 380461, 381279, 382270, 383652, 385926, 389207, 392892, 396418, 400071, 404432, 409204, 413302, 416136, 418158, 420110, 422562, 426335, 432316, 440221, 448385, 455682, 463109, 472517, 484234, 497095, 510665, 526032, 544038, 563800, 583786, 603722, 624645, 647271, 670864, 693759, 714743, 734091, 753433, 774454, 797539, 821794, 846354, 871252]
52309H71252K5587K6002K5589K4624K3817K3613K3950K4238K3625K1788J9531
52298A133616J8089J7654J7067J5102J1611P244K643j738n473q292j0161j1078
52286A186284j1085j0699j0818j1717j2506j2074j0397q465p003n807m308k394
52274A079011m89R97K212L819O348R420J1927J3130J3395J3628J4233J5037J5980
52261A198648J7243J8687J9694J9874J9522J9234J9314J9677K0109K0357K0072
52250A412431J8873J6505J3040R024N256K138p10l858p232j0249j2723j4973j6950
52237A410572j7995j7899j7585j8068j9117j9662j9291j8665j8403j8247j7570
52226A208070j6237j4670j3335j2364j1550j0564r275p889o726n857n083m158
$$ y = [871252, 896839, 922841, 948430, 973054, 996871, 1020484, 1044434, 1068672, 1092297, 1114085, 1133616, 1151705, 1169359, 1186426, 1201528, 1213139, 1220383, 1223026, 1221288, 1215815, 1207523, 1197362, 1186284, 1175199, 1164500, 1153682, 1141965, 1129459, 1117385, 1106988, 1098523, 1091520, 1085713, 1081405, 1079011, 1078522, 1079519, 1081731, 1085550, 1091898, 1101318, 1113245, 1126375, 1139770, 1153398, 1167631, 1182668, 1198648, 1215891, 1234578, 1254272, 1274146, 1293668, 1312902, 1332216, 1351893, 1372002, 1392359, 1412431, 1431304, 1447809, 1460849, 1469873, 1475129, 1477267, 1476557, 1472699, 1465467, 1455218, 1442495, 1427522, 1410572, 1392577, 1374678, 1357093, 1339025, 1319908, 1300246, 1280955, 1262290, 1243887, 1225640, 1208070, 1191833, 1177163, 1163828, 1151464, 1139914, 1129350, 1120075, 1112186, 1105460, 1099603, 1094520, 1090362]
52214A090362k926j377K08J425K199K911L783M467M610M477M486M410L801K998
52200A125834K921L823N025O011O917P823Q389Q637R137R953J0159R030P101N272
52186A226032L536J435q31k705m361o438q768j0361j0805j0805j1078j1455j1330
52173A142066j0509r210p664o006m299k559r20K65P56Q91J352K431L768M819N255
52158A120436M937L946K651J430L39o41j230j215j022j272j684j192O12K744L937
52143A132776M064L972M235M526M160K963J512O32O63J307K243L645N818Q528
52129A181044J1168J3559J6108J9109K2303K5289K7961L0344L2330L3713L4378
52118A447306L4375L3936L3374L2700L1513K9622K7572K6075K5021K3587K1338
$$ y = [1090362, 1087436, 1086059, 1086267, 1087692, 1089891, 1092802, 1096585, 1101052, 1105662, 1110139, 1114625, 1119035, 1122836, 1125834, 1128755, 1132578, 1137603, 1143614, 1150531, 1158354, 1166743, 1175380, 1184517, 1194470, 1204629, 1213659, 1220760, 1226032, 1229568, 1231003, 1230172, 1227467, 1223106, 1216668, 1207900, 1197539, 1186734, 1175929, 1164851, 1153396, 1142066, 1131557, 1122347, 1114683, 1108677, 1104378, 1101819, 1100899, 1101164, 1101920, 1102811, 1104163, 1106594, 1110362, 1115181, 1120436, 1125373, 1129319, 1131970, 1133400, 1133739, 1133098, 1131868, 1130653, 1129631, 1128359, 1126675, 1125483, 1126095, 1128839, 1132776, 1136840, 1140812, 1145047, 1149573, 1153733, 1156696, 1158208, 1158840, 1159503, 1160810, 1163053, 1166698, 1172516, 1181044, 1192212, 1205771, 1221879, 1240988, 1263291, 1288580, 1316541, 1346885, 1379215, 1412928, 1447306, 1481681, 1515617, 1548991, 1581691, 1613204, 1642826, 1670398, 1696473, 1721494, 1745081, 1766419]
52107A766419J8614J5904J3438J1490J0431J0163J0025R408Q099N978L032k67
52095A882734l346o425j0323j5034j9355k2334k4352k6158k7579k7859k6804k4857
52083A648308k2469k0027j8036j6688j5477j3858j1941j0002p674m401m84L105
52071A510356N900Q258J0486J2341J3603J4545J5605J6878J8163J9345K0546K1911
52059A687937K3230K3866K3338K2008K0768J9847J8457J5844J2223Q315M473P59
52047A881065k693o053j0072j5123k0143k3480k4814k5419k6460k7698k8159k7489
52035A643462k6213k5091k4438k4011k3343k2223k0898j9748j8980j8729j9031
52024A400757j9486j9278j8047j6398j5126j4240j3330j2489j2085j1875j1230
$$ y = [1766419, 1785033, 1800937, 1814375, 1825865, 1836296, 1846459, 1856484, 1865892, 1873991, 1879969, 1883001, 1882734, 1879388, 1872963, 1862640, 1847606, 1828251, 1805917, 1781565, 1755407, 1727828, 1699969, 1673165, 1648308, 1625839, 1605812, 1587776, 1571088, 1555611, 1541753, 1529812, 1519810, 1512136, 1507735, 1507251, 1510356, 1516256, 1524514, 1535000, 1547341, 1560944, 1575489, 1591094, 1607972, 1626135, 1645480, 1666026, 1687937, 1711167, 1735033, 1758371, 1780379, 1801147, 1820994, 1839451, 1855295, 1867518, 1875833, 1880306, 1881065, 1878372, 1872319, 1862247, 1847124, 1826981, 1803501, 1778687, 1753268, 1726808, 1699110, 1670951, 1643462, 1617249, 1592158, 1567720, 1543709, 1520366, 1498143, 1477245, 1457497, 1438517, 1419788, 1400757, 1381271, 1361993, 1343946, 1327548, 1312422, 1298182, 1284852, 1272363, 1260278, 1248403, 1237173]
52013A237173j0229r700j0009j0575j0818j0901j1271j2078j3375j5285j7567
52002A105365j9470k0419k0576k0394j9898j8739j6831j4642j2938j2266j2584
51991I16608j3337j4069j4897j6103j7499j8524j8977j9142j9158j8759j7836
51980G28307j6851j6443j6763j7275j7088j5580j3022j0457q665p333n644l459
51968E79727j313O10K772N372P828R339R500Q314O139L768J885K25k080n108p686
51953F19292q650p979o374m380k323m84J227L352O157R257J2321J5645J9518K3526
51939F80105K7151L0600L4237L7324L8035L4861K7626J7383N822n226j4400k1189
51927H92329k5807k8729l0489l1520l1841l1088k9249k7004k5017k3116k0722
$$ y = [1237173, 1226944, 1217244, 1207235, 1196660, 1185842, 1174941, 1163670, 1151592, 1138217, 1122932, 1105365, 1085895, 1065476, 1044900, 1024506, 1004608, 985869, 969038, 954396, 941458, 929192, 916608, 903271, 889202, 874305, 858202, 840703, 822179, 803202, 784060, 764902, 746143, 728307, 711456, 695013, 678250, 660975, 643887, 628307, 615285, 604828, 596163, 588830, 583186, 579727, 578414, 579024, 581796, 587168, 594996, 604335, 613835, 622149, 628288, 632056, 633941, 634166, 632086, 626978, 619292, 610642, 602663, 596289, 591909, 589586, 589102, 590329, 593681, 599838, 609095, 621416, 637061, 656579, 680105, 707256, 737856, 772093, 809417, 847452, 882313, 909939, 927322, 933144, 927918, 913518, 892329, 866522, 837793, 807304, 775784, 743943, 712855, 683606, 656602, 631585, 608469, 587747]
51916E87747j7879j5242j3133j1241r363p805o731n501l183K73L644N475N497
51903E12558M824M630M857M531L171J241q35l328o442r454j1275j1645j1224j0751
51889D70858j0483j0250r551p749m783j587O68J767K443L307M319N253O163P147
51875D57522Q112Q892R418R528Q924P438N224K707L52j487k663l163l020k417
51861E05367j815j570j331l60J365K834L228K876K509K091J067o24k504m304n995
51846E02834p317q012q405q932r309q942q069p466p151o379n032l834k963j638
51832D09385L86K068K571K499K778L107K507Q94q80k167k875k962k447j797j528
51817D11539j497j219p12m15l52o4O49J437J783J375K57r77j426q67j27L1LN86
$$ y = [587747, 569868, 554626, 541493, 530252, 520889, 513084, 506353, 500852, 497669, 497942, 501586, 507061, 512558, 517382, 522012, 526869, 531400, 534571, 535812, 534977, 531649, 525207, 515753, 504478, 492833, 481609, 470858, 460375, 450125, 440574, 432825, 428042, 426455, 427123, 428890, 431333, 434640, 438959, 444212, 450375, 457522, 465634, 474526, 483944, 493472, 502396, 509834, 515058, 517765, 518117, 516630, 513967, 510804, 507784, 505367, 503552, 501982, 500651, 500291, 501656, 504490, 507718, 510594, 513103, 515194, 516261, 515637, 513133, 508829, 502834, 495517, 487505, 479100, 470168, 460859, 451917, 443848, 436382, 429231, 422852, 417820, 413986, 411023, 409385, 409771, 411839, 414410, 416909, 419687, 422794, 425301, 426195, 425315, 423148, 420273, 417311, 414864, 413067, 411539, 410042, 408823, 408111, 407696, 407344, 407280, 407929, 409366, 411149, 412524, 412781, 411804, 410378, 409511, 409384, 409415, 409418, 410004]
51799D10004J528J907J685J769K391K585J603j17j814l299m442m651l618k048
51785D03483r10l61Q3N94Q77O69K2o73p34L27K033L245L582L941N092O514P315
51768D35099P677Q348R131R060P929O495N078L136M28k347m573o494q423r868
51754D60676j0125r303q173p274o703o436o334o012n162l952k814j978j428j091
51740C83891p85j30J139K870M693O312P429P718P141O050M710L035J156j83l56
51725D34690L41J199K225L921N851O379M324M89l028m816n019m501l736k734j653
51710D33932j022j220k015k839l396l690l461k109N15L502N460N600M067J538
51696D34862j147l106l832l502k590j261M40J890K149J050n34j824l001m430n604
$$ y = [410004, 411532, 413439, 415124, 416893, 419284, 421869, 423472, 423355, 421541, 418242, 413800, 409149, 405531, 403483, 402573, 402212, 402295, 402889, 403766, 404435, 404457, 403784, 403050, 403377, 405410, 408655, 412237, 416178, 421270, 427784, 435099, 442776, 451124, 460255, 469315, 477244, 483739, 488817, 491953, 492381, 490034, 485461, 478967, 470544, 460676, 450551, 441248, 433075, 425801, 419098, 412662, 406328, 400316, 395154, 391202, 388388, 386410, 384982, 383891, 383106, 382976, 384115, 386985, 391678, 397990, 405419, 413137, 420278, 426328, 431038, 434073, 435229, 435046, 434690, 435031, 436230, 438455, 442376, 448227, 454606, 458930, 459419, 456391, 451575, 446556, 442055, 438319, 435585, 433932, 432910, 431690, 429675, 426836, 423440, 419750, 416289, 414180, 414695, 418197, 423657, 429257, 433324, 434862, 433715, 430609, 426777, 423275, 420685, 419424, 419864, 421754, 423903, 424953, 424419, 422595, 419594, 415164, 409560]
51681D09560n530m073k282j222r24o39J81J379K431K965K947K522J903J448J662
51666D12328K932N192P899J0299J1683J1572R904P002L302p78m566p137q017p693
51652D53922o881n421k612J264M587N939N403L861J720r35l413m652m393l395
51638D44994k439j776j595k258l645m962n587n821o201o492n923m376k771k072
51624C89076k267k556k359j822j431j378j529j806k329l022l384k983k121j623
51610C58466j825k091j651o92j60m73r69p80J01J037J735K477L471M563N798P734
51594C76741J0684J3777J5283J3964J0010M758k44m028o472p928q546q030o213
51581D03756l627j165P49K309L783N297P036R069J0874J1708J1721J2054J3405
$$ y = [409560, 404030, 399957, 397675, 396453, 395529, 394890, 395071, 396450, 398881, 401846, 404793, 407315, 409218, 410666, 412328, 415260, 420452, 428351, 438650, 450333, 461905, 471809, 478811, 482113, 481335, 476769, 469632, 461615, 453922, 447041, 441620, 439008, 440272, 444859, 450798, 456201, 460062, 461782, 460847, 457434, 452782, 448389, 444994, 442555, 440779, 439184, 436926, 433281, 428319, 422732, 416911, 410710, 404218, 398295, 393919, 391148, 389076, 386809, 384253, 381894, 380072, 378641, 377263, 375734, 373928, 371599, 368577, 365193, 362210, 360089, 358466, 356641, 354550, 352899, 352207, 352047, 351574, 350605, 349825, 349926, 350963, 352698, 355175, 358646, 363209, 369007, 376741, 387425, 401202, 416485, 430449, 440459, 445217, 444973, 440945, 434473, 426545, 417999, 409969, 403756, 400129, 398964, 399713, 402022, 405805, 411102, 418138, 427207, 438081, 449789, 461510, 473564, 486969]
51568D86969J5006J5638J5185J4386J3458J1990J0333J0050J2338J6552K0933
51557F42838K4430K7165K9199K9698K7661K3018J6612R339J783n409j1459j5981
51545G98894j9277k1786k3467k4001k3334k1636j8952j5447j1990r870r683j0821
51533E88630j2215j3249j3789j3784j3224j2263j1111r944r073q837r041q872
51521D53228p774o228n212n068n306n438n454n448n244m599l598k613j968j686
51507C87592j544j356j189j210j301j092m52L29R60J541K247K922L241L107K621
51492C96416J887J135P56Q85J167J313J594K273K802K246N82j127j965k122k335
51477D05507k833l167k978k559k624l501m645n134m746m204m209m531m435l703
$$ y = [486969, 501975, 517613, 532798, 547184, 560642, 572632, 582965, 593015, 605353, 621905, 642838, 667268, 694433, 723632, 753330, 780991, 804009, 820621, 829960, 831743, 826334, 814875, 798894, 779617, 757831, 734364, 710363, 687029, 665393, 646441, 630994, 619004, 609134, 599451, 588630, 576415, 563166, 549377, 535593, 522369, 510106, 498995, 489051, 479978, 471141, 462100, 453228, 445454, 439226, 434014, 428946, 423640, 418202, 412748, 407300, 402056, 397457, 393859, 391246, 389278, 387592, 386048, 384692, 383503, 382293, 380992, 379900, 379448, 379777, 380737, 382278, 384525, 387447, 390688, 393795, 396416, 398303, 399438, 400194, 401079, 402246, 403559, 405153, 407426, 410228, 412474, 413056, 411929, 409964, 407842, 405507, 402674, 399507, 396529, 393970, 391346, 387845, 383200, 378066, 373320, 369116, 364907, 360376, 355941, 352238]
51463C52238k718j785r54l81k77m41m46k99l36m40J9J235K589L426L777M030M342
51446C63579M743N475O816Q792J1257J4044J6743J8567J8600J6286J1756O048
51434E02706Q62k360l384l121k797l409n524q770j1669j2754j2142j1239j0766
51421D15633r938p991n543l772k922k418j941j585j274q10l28q1Q9N25J133J584
51405C80361J937K482L067L189K788K450K671L338L972M202L946L440L109L242
51391D24194L861M940O436P990Q984R323R797J1265J3789J6954K0624K4812K9102
51378E92071L2832L5806L8308M0585M2679M4278M4073L9887L0565J7778M947n772
51366I58037j4616k2486k9267l4416l8021m0459m1562m1000l9166l6974l4849
$$ y = [352238, 349520, 347735, 346781, 346400, 346123, 345682, 345236, 344937, 344601, 344161, 344180, 345415, 348004, 351430, 355207, 359237, 363579, 368322, 373797, 380613, 389405, 400662, 414706, 431449, 450016, 468616, 484902, 496658, 502706, 503568, 501208, 497824, 494703, 491906, 488497, 482973, 474203, 462534, 449780, 437638, 426399, 415633, 405695, 397704, 392161, 388389, 385467, 383049, 381108, 379523, 378249, 377439, 377111, 377030, 377119, 377644, 378777, 380361, 382298, 384780, 387847, 391036, 393824, 396274, 398945, 402283, 406255, 410457, 414403, 417843, 420952, 424194, 428055, 432995, 439431, 447421, 456405, 465728, 475525, 486790, 500579, 517533, 538157, 562969, 592071, 624903, 660709, 699017, 739602, 782281, 826559, 870632, 910519, 941084, 958862, 963809, 958037, 943421, 920935, 891668, 857252, 819231, 778772, 737210, 696210, 657044, 620070, 585221]
51355E85221l2474k9452k5809k1837j7826j4028j0758q362p027o507o142n396
51343C99603m314l235k177r54J80N70N2p13r69o60k84k71p50j600k521l199l547
51326C75211l581l187k362j559j298j425j347j042j098j602j784j133r5Q03J727
51311C56228K814L437L042K189J796J774J345M99O9L56P09N38po21j239j680j605
51294C69644j201j190j734j967j143K68J198J286J017Q03O53O77J286K676M488
51279C76761O128P208P555P019N572L531J529J46m45m88l64l37n60j093j731j916
51263D08515j117N17K007K219Q62j224k763l134k801k572k608k428j907j703k352
51248C89511l312l537k842k020j564j044j9J026J242N84j17j54M34J167J637J686
$$ y = [585221, 552747, 523295, 497486, 475649, 457823, 443795, 433037, 424675, 417648, 411141, 404999, 399603, 395289, 392054, 389877, 388923, 389103, 389673, 389725, 389012, 388043, 387383, 387099, 386828, 386078, 384478, 381957, 378758, 375211, 371630, 368443, 366081, 364522, 363224, 361799, 360452, 359410, 358312, 356710, 354926, 353793, 353698, 354501, 356228, 359042, 362479, 365521, 367710, 369506, 371280, 372625, 373124, 373193, 373549, 374258, 374796, 374789, 374168, 372929, 371249, 369644, 368443, 367253, 365519, 363552, 362409, 362677, 363875, 365161, 366178, 366981, 367634, 368311, 369597, 372273, 376761, 382889, 390097, 397652, 404671, 410243, 413774, 415303, 415449, 415004, 414516, 414152, 413815, 413255, 412162, 410431, 408515, 407398, 407915, 409922, 412141, 413003, 411779, 409016, 405882, 403081, 400509, 397901, 395473, 393566, 391863, 389511, 386199, 382662, 379820, 377800, 376236, 375192, 375173, 376199, 377441, 378025, 377908, 377754, 378188, 379355, 380992, 382678]
51232C82678J352P34j97j515k872l418k607j059r4l02r46r86k67N67R87J044J035
51215C74134J116J268J409J515J701K139K732L050K838K440K435K867L274L468
51201D06386L808M483M952M523L225J782P50J12m91j390k731m250n258n196m252
51186D06453l043j790k70J353K291K102J418J213J667K182K318K069J393J33j472
51171D18017k738l188k983k524k053j750j811k030j672k94J474K471K375K040
51157D05334K312K902K866J913P84K20P3k89r78j478j427j096q62o49k04L13M55
51140D10189J82N7N78J532K179K007J227M59R6Nj20k78j83K65Q46J404K088K957
51122D25490L616L541K705J590P39M76Q58J506J656R17o0j31R84K325K768K092
$$ y = [382678, 384030, 384764, 384567, 383052, 380180, 376762, 374155, 373096, 373002, 372700, 371754, 370768, 370501, 371068, 372055, 373099, 374134, 375250, 376518, 377927, 379442, 381143, 383282, 386014, 389064, 391902, 394342, 396777, 399644, 402918, 406386, 410194, 414677, 419629, 424152, 427377, 429159, 429909, 430021, 429530, 428140, 425409, 421159, 415901, 410705, 406453, 403410, 401620, 401350, 402703, 404994, 407096, 408514, 409727, 411394, 413576, 415894, 417963, 419356, 419489, 418017, 415279, 412091, 409108, 406584, 404531, 402781, 400970, 398940, 397268, 396974, 398448, 400919, 403294, 405334, 407646, 410548, 413414, 415327, 416111, 416331, 416404, 416115, 415137, 413659, 412232, 411136, 410274, 409625, 409421, 409734, 410189, 410371, 410428, 411006, 412538, 414717, 416724, 417951, 418410, 418506, 418511, 418391, 418113, 417930, 418195, 419041, 420445, 422533, 425490, 429106, 432647, 435352, 436942, 437681, 438157, 439015, 440521, 442177, 443094, 443034, 442903, 443887, 446212, 448980, 451072]
51106D51072Q80r0k09O88K024K817K711K305K163J983J275M15K13O27P50J44o05
51089D69163q63q08q62r18o73l42l59n56k74N94J295J143L76k49m27m54n31k99
51071D64956O74K233L681M464M614M531M529M723N221O276Q139J0769J3755J6531
51057E55096J8692J9978J9936J7861J3465P732K746L60R55L401O005P392O985
51044F80604N173L093J744J062lk427o119r890j2151j1748q630m184p11r7k575
51029F33141o686j0393j2349j2384j1141r393p562n650l482j007J555L867N788
51016E64304P513R294J1015J2149J2251J1395J0122R006Q333Q032P748P057N812
51003F84031M246K662J128l71j716k748l474l875l666k649j196O8J111K489M360
$$ y = [451072, 451952, 451862, 451653, 452341, 454365, 457182, 459893, 462198, 464361, 466344, 467619, 468034, 468247, 468874, 469624, 469768, 469163, 468300, 467492, 466630, 465712, 465039, 464697, 464338, 463782, 463508, 464102, 465397, 466540, 466916, 466667, 466240, 465786, 465255, 464956, 465630, 467863, 471544, 476008, 480622, 485153, 489682, 494405, 499626, 505902, 514041, 524810, 538565, 555096, 573788, 593766, 613702, 631563, 645028, 652760, 655506, 655866, 656821, 660222, 666227, 673619, 680604, 685777, 688870, 690614, 691676, 691673, 689246, 683127, 673237, 661086, 649338, 640708, 636524, 635813, 635716, 633141, 626455, 616062, 603713, 591329, 580188, 570795, 563233, 557583, 554101, 553094, 554649, 558516, 564304, 571817, 581111, 592126, 604275, 616526, 627921, 638043, 647049, 655382, 663414, 671162, 678219, 684031, 688277, 690939, 692067, 691696, 689980, 687232, 683758, 679883, 676217, 673568, 672372, 672440, 673551, 676040, 680400]
50988F80400O064P041P778R267J1793J4765J7667K0623K3856K6941K8880K8866
50976H83941K6967K4202K1930K1087K1885K4233K8158L3640M0175M6892N3119
50965A226229N8711O3911O9115P4630Q0317Q5465Q9361R1911R3350R3379R1098
50954B117477Q6030P8733P0124O0642N0416L9857K9593J9977J1104L226l378q716
50942B555085j2864j5536j6513j6524j7036j8783k1051k2710k3520k3983k4442
50931B342123k4921k5716k7371l0073l3573l7725m2557m7732n2585n6952o1304
50920A901614o5608o8688o9407o8152o6277o4144o0720n5369m9211m4034m0367
50909A249637l7303l3981l0499k7408k4962k3136k1869k0958k0016j8774j7244
$$ y = [680400, 686464, 693505, 701283, 710550, 722343, 737108, 754775, 775398, 799254, 826195, 855075, 883941, 910908, 935110, 957040, 978127, 1000012, 1024245, 1052403, 1086043, 1126218, 1173110, 1226229, 1284940, 1348851, 1417966, 1492596, 1572913, 1658378, 1747739, 1839650, 1933000, 2026379, 2117477, 2203507, 2282240, 2352364, 2413006, 2463422, 2503279, 2532872, 2552849, 2563953, 2567179, 2563801, 2555085, 2542221, 2526685, 2510172, 2493648, 2476612, 2457829, 2436778, 2414068, 2390548, 2366565, 2342123, 2317202, 2291486, 2264115, 2234042, 2200469, 2162744, 2120187, 2072455, 2019870, 1962918, 1901614, 1836006, 1767318, 1697911, 1629759, 1563482, 1499338, 1438618, 1383249, 1334038, 1290004, 1249637, 1212334, 1178353, 1147854, 1120446, 1095484, 1072348, 1050479, 1029521, 1009505, 990731, 973487]
50898I73487j5458j3318j0947q830p300o117m891l737l011k598j957r49o1M02
50884H94715Q52J843L268M545N411O192P299Q736J0135J1143J1810J2637J4085
50871I92671J5948J7466J8288J8973K0303K2283K4334K6223K8278L0706L3326
50860A248799L6156L9672M4207M9514N5293O1850O9762P9085Q9282R9893J10989
50849A984502J22934J35836J49211J62074J73554J83536J92510K00682K07435
50840C512274K11742K12698K09325K00332J84762J62938J36340J06636P5183M3387
50830E055617J2910j4805l8890n8855p4270q4709q9792q9265q3372p3235o0586
50819D400748m7061l4101k3427j6995j6105k0810l0404m4021o0447p7880r4618
$$ y = [973487, 958029, 944711, 933764, 924934, 917634, 911517, 906626, 902889, 899878, 897280, 895323, 894374, 894313, 894715, 895567, 897410, 900678, 905223, 910634, 916826, 924125, 932861, 942996, 954139, 965949, 978586, 992671, 1008619, 1026085, 1044373, 1063346, 1083649, 1105932, 1130266, 1156489, 1184767, 1215473, 1248799, 1284955, 1324627, 1368834, 1418348, 1473641, 1535491, 1605253, 1684338, 1773620, 1873513, 1984502, 2107436, 2243272, 2392483, 2554557, 2728111, 2911647, 3104157, 3304839, 3512274, 3724016, 3936714, 4146039, 4346371, 4531133, 4694071, 4830411, 4937047, 5012230, 5055617, 5068527, 5053722, 5014832, 4955977, 4881707, 4796998, 4707206, 4617941, 4534569, 4461334, 4400748, 4353687, 4319586, 4296159, 4279164, 4263059, 4242249, 4211845, 4167824, 4107377, 4029497, 3934879]
50808C934879j10078j24742j39007j52172j62583j68651j69940j67383j62358
50799B577965j55462j46445j35317j23014j10622r8435q6328p4788o4692n6124
50789A526738m8126l9915l1926k5225k0316j6792j3985j1580r636q267p403o800
50777A286767o289n953n986o420p111p903q647r134r302r480j0095j1099j1974
50764A177374j2389j2496j2488j2216j1549j0776j0241r780q864p279n242k980
50752A061074m79K201M821P360J0275J3971J8183K2180K5677K9214L3394L7935
50740A265806M1914M4978M7994N2160N7732O3992P0304P6699Q3314Q9755R5360
50729A990008R9744J02820J04561J05154J05125J04776J03612J00872R6542R1119
$$ y = [3934879, 3824801, 3700059, 3561052, 3408880, 3246297, 3077646, 2907706, 2740323, 2577965, 2422503, 2276058, 2140741, 2017727, 1907105, 1808670, 1722342, 1647554, 1582862, 1526738, 1478612, 1438697, 1406771, 1381546, 1361230, 1344438, 1330453, 1318873, 1309237, 1300970, 1293567, 1286767, 1280478, 1274525, 1268539, 1262119, 1255008, 1247105, 1238458, 1229324, 1220022, 1210542, 1200447, 1189348, 1177374, 1164985, 1152489, 1140001, 1127785, 1116236, 1105460, 1095219, 1085439, 1076575, 1069296, 1064054, 1061074, 1060595, 1062796, 1067617, 1074977, 1085252, 1099223, 1117406, 1139586, 1165263, 1194477, 1227871, 1265806, 1307720, 1352698, 1400692, 1452852, 1510584, 1574576, 1644880, 1721579, 1804893, 1894648, 1990008, 2089752, 2192572, 2297133, 2402287, 2507412, 2612188, 2715800, 2816672, 2913214, 3004333]
50719C004333Q4225P4173N9437M0170J7908n629k8742m9262o4977p4944p9654
50708B977038p9801p5535o7310n6656m5434l4609k4336j4950p183j658J145M82
50696B571193m334j3034k4416l7440n1633o6171p9361q9625r6554j00400j00946
50685A907279r7718r1248q3285p5494o8303o1191n3649m5689l7752l0354k3720
50674A238876j7632j1787o298j588K196N387Q286J0786J2626J3797J4402J4364
50662A283415J3554J2258J1215J1076J1831J2877J3681J4295J5184J6519J7974
50651A433879J9264K0611K2340K4343K6397K8800L2090L5986L9377M1614M3327
50640A768028M5537M8387N1117N3002N3809N3595N2560N0986M8917M6004M2111
$$ y = [3004333, 3088558, 3162731, 3222168, 3262338, 3280246, 3274617, 3245875, 3196613, 3131636, 3056692, 2977038, 2897237, 2821702, 2754392, 2697736, 2652302, 2617693, 2593357, 2578407, 2571224, 2569566, 2570711, 2571193, 2566859, 2553825, 2529409, 2491969, 2440336, 2374165, 2294804, 2205179, 2108625, 2008225, 1907279, 1809561, 1718313, 1635028, 1559534, 1491231, 1430040, 1376391, 1330702, 1292950, 1262596, 1238876, 1221244, 1209457, 1203159, 1201571, 1203767, 1209154, 1217440, 1228226, 1240852, 1254649, 1269051, 1283415, 1296969, 1309227, 1320442, 1331518, 1343349, 1356226, 1369907, 1384202, 1399386, 1415905, 1433879, 1453143, 1473754, 1496094, 1520437, 1546834, 1575634, 1607724, 1643710, 1683087, 1724701, 1768028, 1813565, 1861952, 1913069, 1966071, 2019880, 2073475, 2126035, 2177021, 2225938, 2271942, 2314053]
50629B314053L7833L4024L1026K9007K8724L0577L2501K9947J9514K727j4507
50618B575426k6464l1355l0965k7727k2901j6983j0677m883j47L467O019P544
50606B420354Q075P466N045j58q513j9300l1137m2732n3120o1587o7794p2021
50594B084578p4844p6561p7078p6300p4300p1184o7085o2411n7728n3335m9178
50583A344574m5157m1209l7093l2631k8232k4657k1956j9142j5383j1064p165
50572A060885l953r47K139N086P763J0242J2398J3990J5247J6709J8359J9632
50560A177550K0371K1056K1730K1572K0173J8608J8416J9868K1922K3659K4939
50549A409864K5798K6003K5464K4548K3818K3617K4025K4926K6215K8107L1054
$$ y = [2314053, 2351886, 2385910, 2416936, 2445943, 2474667, 2505244, 2537745, 2567692, 2587206, 2589933, 2575426, 2548962, 2517607, 2486642, 2458915, 2436014, 2419031, 2408354, 2403471, 2403324, 2406791, 2412810, 2420354, 2428429, 2435895, 2440940, 2440782, 2432269, 2412969, 2381832, 2339100, 2285980, 2224393, 2156599, 2084578, 2009734, 1933173, 1856095, 1779795, 1705495, 1634311, 1567226, 1504815, 1447087, 1393752, 1344574, 1299417, 1258208, 1221115, 1188484, 1160252, 1135595, 1113639, 1094497, 1079114, 1068050, 1060885, 1056932, 1055985, 1058124, 1063210, 1070973, 1081215, 1093613, 1107603, 1122850, 1139559, 1157918, 1177550, 1197921, 1218977, 1240707, 1262279, 1282452, 1301060, 1319476, 1339344, 1361266, 1384925, 1409864, 1435662, 1461665, 1487129, 1511677, 1535495, 1559112, 1583137, 1608063, 1634278, 1662385, 1693439]
50538A693439L5183M0095M5617N2240O0180O8268P4650P8550Q0726Q2382Q4524
50527B395854Q8226R4265J02057J09822J16262J21342J25046J26435J24655J20061
50517C524025J13453J04705R3081P8489O1622M3089K3290K943j7069l6345n4799
50506C936484p1889q6536r7809j05224j08530j07672j02828r4059q1289o5126
50496C015522m7253k9278j1517O256K3213L7648M8513N5642N8423N5407M5617
50485C258193K9328P506j8467m6126p2223r4437j12177j25320j33196j35519j33490
50474B424072j28951j22878j15440j07097r8731r0887q3518p6309o8885o1049
50464A470327n3297m6620m1301l6372l0857k5080j9904j5256j0377n308r43K478
$$ y = [1693439, 1728622, 1768717, 1814334, 1866574, 1926754, 1995022, 2069672, 2148222, 2228948, 2311330, 2395854, 2484080, 2578345, 2680402, 2790224, 2906486, 3027828, 3152874, 3279309, 3403964, 3524025, 3637478, 3742183, 3835264, 3913753, 3975375, 4018464, 4041754, 4044697, 4027628, 3991283, 3936484, 3864595, 3778059, 3680250, 3575026, 3466496, 3358824, 3255996, 3161937, 3080648, 3015522, 2968269, 2938991, 2927474, 2933730, 2956943, 2994591, 3043104, 3098746, 3157169, 3212576, 3258193, 3287521, 3295027, 3276560, 3230434, 3158211, 3063774, 2951597, 2826277, 2693081, 2557562, 2424072, 2295121, 2172243, 2056803, 1949706, 1850975, 1760088, 1676570, 1600261, 1531376, 1470327, 1417030, 1370410, 1329109, 1292737, 1261880, 1236800, 1216896, 1201640, 1191263, 1185955, 1185012, 1187490]
50452A187490N912J0184J4861J8808K1430K3067K4676K7288L1398L6565M1826
50441A443505M6453M9839N0622M6796L7404K3998R962j688r790j4672j7027j7386
50429A648016j6405j4955j3561j1953r644o851m374k474n42J940M692P331J0260
50416A591480J4268J9539K5651L2181L8746M4668M9387N3143N6636O0050O2895
50405B048644O4637O4902O3214N9428N4354M9160M3954L7726K9809K0618J0655
50394B547101l26j2644k5779l8671n0512o0758o8883p4573p7878p8671p6449p1125
50382A910832o3691n5453m6891l7756k8054j8260q665P57R731J7405K2920K5857
50370A728732K6004K3049J6839P820k955j4221k4847l3961m0948m5449m7450m7311
$$ y = [1187490, 1193402, 1203586, 1218447, 1237255, 1258685, 1281752, 1306428, 1333716, 1365114, 1401679, 1443505, 1489958, 1539797, 1590419, 1637215, 1674619, 1698617, 1708579, 1706891, 1697101, 1682429, 1665402, 1648016, 1631611, 1616656, 1603095, 1591142, 1581498, 1574647, 1570273, 1567799, 1567257, 1569197, 1573889, 1581220, 1591480, 1605748, 1625287, 1650938, 1683119, 1721865, 1766533, 1815920, 1869063, 1925699, 1985749, 2048644, 2113281, 2178183, 2241397, 2300825, 2355179, 2404339, 2448293, 2486019, 2515828, 2536446, 2547101, 2546775, 2534131, 2508352, 2469681, 2419169, 2358411, 2289528, 2214955, 2137077, 2058406, 1981957, 1910832, 1847141, 1791688, 1744797, 1707041, 1678987, 1660727, 1652062, 1652819, 1662550, 1679955, 1702875, 1728732, 1754736, 1777785, 1794624, 1802444, 1799489, 1785268, 1760421, 1726460, 1685512, 1640063, 1592613, 1545302]
50358A545302m5578m2645l8679l3977k9289k5737k4414k5964l0143l5585m0166
50347A173125m2117m0986l7538l2831k7518k1956j6669j2315r187o886m751k544
50335I17827n39J078K624M535O767Q839J0322J1025J0852R848Q515P661P820Q865
50321A016039J0218J1336J2039J2545J3165J3787J3778J2605J0492Q192O343N206
50309A145745M793M857M922M919N579P720J1202J5205J9291K3566K8018L2658
50297A308475L8257M5957N6125O8752Q4410J02087J14757J10020P9326K7564k8299
50286B007431p1116r3898r9806r5433q5872p4231o2530n1770m2067l3358k5846
50275A271504j9704j4839j1129q503o627m843k720n34J105K013K650L556M795
$$ y = [1545302, 1499724, 1457079, 1418400, 1384423, 1355134, 1329397, 1304983, 1279019, 1248876, 1213291, 1173125, 1131008, 1090022, 1052484, 1019653, 992135, 970179, 953510, 941195, 932008, 925122, 920371, 917827, 917288, 918366, 920990, 925525, 932292, 941131, 951453, 962478, 973330, 983178, 991693, 999354, 1007174, 1016039, 1026257, 1037593, 1049632, 1062177, 1075342, 1089129, 1102907, 1115512, 1126004, 1134196, 1140539, 1145745, 1150538, 1155395, 1160317, 1165236, 1170815, 1178535, 1189737, 1204942, 1224233, 1247799, 1275817, 1308475, 1346732, 1392689, 1448814, 1517566, 1601976, 1704063, 1818820, 1928840, 2008166, 2035730, 2007431, 1936315, 1842417, 1742611, 1647178, 1561306, 1487075, 1424545, 1372775, 1330708, 1297350, 1271504, 1251800, 1236961, 1225832, 1217329, 1210702, 1205859, 1203139, 1202605, 1203710, 1205723, 1208373, 1211929, 1216724]
50262A216724O065P135Q055R002J0142J1517J2850J3569J3346J2560J1891J1478
50250A344334J0968J0297R817R316P695M189n35n175r279j3192j6679j8557j7888
50237A315311j4929j0671n978j501K014L759L092l03o174j3383k0176k5071k7519
50224A198471k7816k6683k5031k3681k2906k2317k1370j9940j8291j6643j4978
50213I58815j3166j1250r552q502q113p727o617m868l345k633k399k113k043k948
50199H73539m844o637p280o927o562o712o952o782o430o421o637o446n717n138
50185G84054n257n683n660n084m509m349m541m866n149n172m846m412m097l595
50171G16834k494j137m44p03j127r46l85r8j20N2N75J121J521J972K581L197L903
$$ y = [1216724, 1222789, 1229924, 1237979, 1246981, 1257123, 1268640, 1281490, 1295059, 1308405, 1320965, 1332856, 1344334, 1355302, 1365599, 1375416, 1384732, 1392427, 1396616, 1396081, 1390906, 1381627, 1368435, 1351756, 1333199, 1315311, 1300382, 1289711, 1283733, 1282232, 1284246, 1288005, 1291097, 1290794, 1284620, 1271237, 1251061, 1225990, 1198471, 1170655, 1143972, 1118941, 1095260, 1072354, 1050037, 1028667, 1008727, 990436, 973793, 958815, 945649, 934399, 924847, 916345, 908232, 900505, 893888, 889020, 885675, 883042, 880643, 878530, 876487, 873539, 868695, 862058, 854778, 847851, 841289, 834577, 827625, 820843, 814413, 807992, 801355, 794909, 789192, 784054, 778797, 773114, 767454, 762370, 757861, 753512, 748971, 744105, 738956, 733784, 728938, 724526, 720429, 716834, 714340, 713203, 712759, 712056, 710929, 709983, 709598, 709500, 709380, 709432, 710007, 711128, 712649, 714621, 717202, 720399, 724302]
50154G24302N221P516J0462J3307J5635J7617J9656K1928K4254K6215K7402K7739
50142I41254K7597K7358K6946K6005K4664K3682K3679K4504K5739K7432K9511
50131A228371L0755K9285K4416J7269R124J29r632j8685k5077k8524l0461l1919
50119A195051l2437l1305k8798k5569k1777j7504j3506j0704r176q334p816p670
50107I80455p735p470o547n244m128l472l077k618k235k558l945n751o829o706
50093I12140n856m734l265j490M9R80J643K346K740K436J860J737K176K879L872
50078I19513N174O148O145N619N683O539P265P206O677O122N442M449L283K083
50064I97348Q66j28o60j227k642m639n852n651n043n145n648n665n276n143n131
$$ y = [724302, 729523, 737039, 747501, 760808, 776443, 794060, 813716, 835644, 859898, 886113, 913515, 941254, 968851, 996209, 1023155, 1049160, 1073824, 1097506, 1121185, 1145689, 1171428, 1198860, 1228371, 1259126, 1288411, 1312827, 1330096, 1339220, 1339349, 1329717, 1311032, 1285955, 1257431, 1226970, 1195051, 1162614, 1131309, 1102511, 1076942, 1055165, 1037661, 1024155, 1013451, 1004275, 995941, 988125, 980455, 972720, 965250, 958703, 953459, 949331, 945859, 942782, 940164, 937929, 935371, 931426, 925675, 918846, 912140, 906284, 901550, 898285, 896795, 896844, 897824, 899467, 901813, 904553, 906989, 908849, 910586, 912762, 915641, 919513, 924687, 930835, 936980, 942599, 948282, 954821, 962086, 969292, 975969, 982091, 987533, 991982, 995265, 997348, 998214, 998086, 997426, 996199, 993557, 988918, 983066, 977415, 972372, 967227, 961579, 955914, 950638, 945495, 940364]
50049I40364m463l042j533k66J031K459L817N272P239R434J0929J1460J1907J3124
50035A007732J4805J5990J6192J5767J5507J6120J7745J9749K1246K1885K1847
50024A204585K1177J9737J7888J6380J5321J3963J1984J0245R551R161P383L556
50012A360931j184n104p521r268j1896j6297k1949k7489l2062l5629l7966l8172
50000A116394l5718l1414k6594k1840j7218j3308j0907r805q850p386n822m752
49988I22780m373m915o731r527j2243j4168j5543j6672j7104j6297j4581j2842
49976G77784j1542j0599r842r095q014o413m603l058j926j226j207k025l269m287
49962G00678m835m981m572l344j522K19J499K519L638M968O352P494Q094Q088
$$ y = [940364, 935901, 932859, 931326, 931060, 932091, 934550, 938367, 943639, 950878, 960312, 971241, 982701, 994608, 1007732, 1022537, 1038527, 1054719, 1070486, 1085993, 1102113, 1119858, 1139607, 1160853, 1182738, 1204585, 1225762, 1245499, 1263387, 1279767, 1295088, 1309051, 1321035, 1331280, 1340831, 1349992, 1357375, 1360931, 1359747, 1354643, 1347122, 1337854, 1325958, 1309661, 1287712, 1260223, 1228161, 1192532, 1154566, 1116394, 1080676, 1049262, 1022668, 1000828, 983610, 970302, 959395, 949590, 940740, 933354, 927532, 922780, 918407, 913492, 906761, 897234, 884991, 870823, 855280, 838608, 821504, 805207, 790626, 777784, 766242, 755643, 745801, 736706, 728692, 722279, 717676, 714618, 712692, 711466, 710259, 708234, 704965, 700678, 695843, 690862, 686290, 682946, 681424, 681643, 683142, 685661, 689299, 694267, 700619, 708113, 716207, 724295]
49948G24295P696P020N856M184K573J599J041J94j139k501l464l937l875l328
49934G36214k853l273m821o959r048j0678j1383j0776r248p800o855n847m327
49921F42346k851k168k072j687o05Q47K182L112L502L507L616M111M623M614M187
49906F67264L999M569N985Q064J0266J1655J1641J0679R663Q732P314N336L512
49893G68679K195P81j343l901o221q056r340r752r302q864r241r928r710q437
49879F77560p219o742o429n702n069n153n390m678l047j630j014n97L01J494K472
$$ y = [724295, 731991, 739011, 744867, 749051, 751624, 753223, 754264, 754458, 753319, 750818, 747354, 743417, 739542, 736214, 733361, 730088, 725267, 718308, 709260, 698582, 687199, 676423, 667175, 659375, 652520, 646673, 642346, 639495, 637327, 635255, 633568, 632963, 633810, 635992, 639104, 642606, 646113, 649729, 653840, 658463, 663077, 667264, 671263, 675832, 681817, 689881, 700147, 711802, 723443, 734122, 743785, 752517, 759831, 765167, 768679, 770874, 771655, 770312, 766411, 760190, 752134, 742794, 733042, 723740, 714876, 705635, 695707, 685997, 677560, 670341, 663599, 657170, 651468, 646399, 641246, 635856, 631178, 628131, 626501, 625487, 624890, 625191, 626685, 629157]
$$ [...]
##END NTUPLES=NMR SPECTRUM
##END=
