##TITLE=AC1693_COLAH14373_8650558_MZPfZwUmKT
##JCAMPDX= 6.0         $$ Bruker NMR JCAMP-DX V2.0
##DATA TYPE= NMR SPECTRUM
##DATA CLASS= NTUPLES
##ORIGIN= BRUKER
##OWNER= Administrator
$$ 1.72 TOPSPIN		Version 2.1
$$ 2014-05-31 00:00:57.481 -0700  Administrator@X
$$ Compression mode = diff/dup
##.OBSERVE FREQUENCY= 400.02188249412
##.OBSERVE NUCLEUS= ^1H
##.ACQUISITION MODE= SIMULTANEOUS (DQD)
##.ACQUISITION SCHEME= undefined
##.AVERAGES= 8
##.DIGITISER RES= 22
##SPECTROMETER/DATA SYSTEM= spect
##.PULSE SEQUENCE= zg30
##.SOLVENT NAME= COFFEE_meoh
##.SHIFT REFERENCE= INTERNAL, COFFEE_meoh, 1, 14.98509
##AUDIT TRAIL= $$ (NUMBER, WHEN, WHO, WHERE, PROCESS, VERSION, WHAT)
$$ ##TITLE= Audit trail, TOPSPIN		Version 2.1
$$ ##JCAMPDX= 5.01
$$ ##ORIGIN= Bruker BioSpin GmbH
$$ ##OWNER= Administrator
$$ $$ E:\/data/COFFEE/nmr/AC1693_COLAH14373_8650558_MZPfZwUmKT/10/pdata/1/auditp.txt
$$ ##AUDIT TRAIL=  $$ (NUMBER, WHEN, WHO, WHERE, PROCESS, VERSION, WHAT)
(   1,<2014-05-31 00:00:49.129 -0700>,<Administrator>,<X>,<go>,<TOPSPIN 2.1>,
      <created by zg
	started at 2014-05-30 23:59:43.423 -0700,
	POWCHK enabled, PULCHK disabled,
       configuration hash MD5:
       C8 4E 4E 5D D3 5C D8 9E 9F 52 82 E0 59 8A DE 15
       data hash MD5: 64K
       E8 B1 79 59 70 AC F5 BA 33 5F A9 48 A8 0B 2C F9>)
(   2,<2014-05-31 00:00:52.663 -0700>,<Administrator>,<X>,<proc1d>,<TOPSPIN 2.1>,
      <Start of raw data processing
       efp LB = 0 FT_mod = 6 PKNL = 1 PHC0 = 0 PHC1 = 0 SI = 32K 
       data hash MD5: 32K
       6A FC 8E 85 11 2E E0 8A 83 39 FB 69 50 4F F8 C6>)
(   3,<2014-05-31 00:00:53.052 -0700>,<Administrator>,<X>,<proc1d>,<TOPSPIN 2.1>,
      <pk PHC0 = 91.56555 PHC1 = 0 
       data hash MD5: 32K
       95 FD E6 DB 97 06 53 FC 99 4F 0E 2E 0D 0F D4 39>)
(   4,<2014-05-31 00:00:53.293 -0700>,<Administrator>,<X>,<proc1d>,<TOPSPIN 2.1>,
      <abs ABSG = 1 
       data hash MD5: 32K
       FF 97 9A BF 09 EA 38 C9 42 18 EE 15 15 51 B6 31>)
(   5,<2014-05-31 00:00:53.386 -0700>,<Administrator>,<X>,<proc1d>,<TOPSPIN 2.1>,
      <abs ABSG = 2 
       data hash MD5: 32K
       BD 22 0E 67 28 87 06 62 26 A7 20 E2 90 F3 7E 00>)
(   6,<2014-05-31 00:00:53.441 -0700>,<Administrator>,<X>,<proc1d>,<TOPSPIN 2.1>,
      <abs ABSG = 3 
       data hash MD5: 32K
       E3 3B 82 57 A2 14 57 DF 0D D2 06 6C 9B 3F 2F 65>)
(   7,<2014-05-31 00:00:53.515 -0700>,<Administrator>,<X>,<proc1d>,<TOPSPIN 2.1>,
      <abs ABSG = 4 
       data hash MD5: 32K
       49 80 B9 8F 0A 60 8E 01 9E 24 6D 45 A5 16 8C 3E>)
(   8,<2014-05-31 00:00:53.590 -0700>,<Administrator>,<X>,<proc1d>,<TOPSPIN 2.1>,
      <abs ABSG = 5 
       data hash MD5: 32K
       34 9A F5 FA D3 00 BE B2 7D 24 4F BC 8F FB 70 11>)
$$ ##END=
$$ 
$$ $$ hash MD5
$$ $$ C8 B9 3F 11 80 5D 98 B8 AF 64 7A CB EC 91 9A AE
##$RELAX= 
##$RELAX= 
##$RELAX= 
##$RELAX= 
##$RELAX= 
##$RELAX= 
##$RELAX= 
$$ Bruker specific parameters
$$ --------------------------
##$DU= <E:\>
##$EXPNO= 10
##$NAME= <AC1693_COLAH14373_8650558_MZPfZwUmKT>
$$ [...]
150 150 150 150 150 150 150 150
##$TP07= 0
##$TPNAME0= <>
##$TPNAME1= <>
##$TPNAME2= <>
##$TPNAME3= <>
##$TPNAME4= <>
##$TPNAME5= <>
##$TPNAME6= <>
##$TPNAME7= <>
##$TPOAL= (0..7)
0.5 0.5 0.5 0.5 0.5 0.5 0.5 0.5
##$TPOFFS= (0..7)
0 0 0 0 0 0 0 0
##$TUNHIN= 0
##$TUNHOUT= 0
##$TUNXOUT= 0
##$USERA1= <user>
##$USERA2= <user>
##$USERA3= <user>
##$USERA4= <user>
##$USERA5= <user>
##$V9= 5
##$VALIST= <valist>
##$VCLIST= <CCCCCCCCCCCCCCC>
##$VD= 0
##$VDLIST= <DDDDDDDDDDDDDDD>
##$VPLIST= <PPPPPPPPPPPPPPP>
##$VTLIST= <TTTTTTTTTTTTTTT>
##$WBST= 2048
##$WBSW= 25
##$XGAIN= (0..3)
0 0 0 0
##$XL= 0
##$YL= 0
##$YMAX_a= 641355
##$YMIN_a= -548018
##$ZGOPTNS= <>
##$ZL1= 120
##$ZL2= 120
##$ZL3= 120
##$ZL4= 120
##$ABSF1= 14.98509
##$ABSF2= -5.573092
##$ABSG= 5
##$ABSL= 3
##$ALPHA= 0
##$AQORDER= 0
##$ASSFAC= 0
##$ASSFACI= 0
##$ASSFACX= 0
##$ASSWID= 0
##$AUNMP= <proc_prof1d_extract_pilot.lims>
##$AXLEFT= 0
##$AXNAME= <>
##$AXNUC= <1H>
##$AXRIGHT= 0
##$AXTYPE= 0
##$AXUNIT= <>
##$AZFE= 0.1
##$AZFW= 0.1
##$BCFW= 0
##$BC_mod= 0
##$BYTORDP= 0
##$COROFFS= 0
##$CY= 15
##$DATMOD= 1
##$DC= 0
##$DFILT= <>
##$DTYPP= 0
##$F1P= 0
##$F2P= 0
##$FCOR= 0.5
##$FTSIZE= 32768
##$FT_mod= 6
##$GAMMA= 0
##$GB= 0
##$INTBC= 1
##$INTSCL= 1
##$ISEN= 128
##$LB= 0
##$LEV0= 0
##$LPBIN= 0
##$MAXI= 10000
##$MC2= 0
##$MEAN= 0
##$ME_mod= 0
##$MI= 0
##$NCOEF= 0
##$NC_proc= -8
##$NLEV= 6
##$NOISF1= 0
##$NOISF2= 0
##$NSP= 0
##$NTH_PI= 0
##$NZP= 0
##$OFFSET= 14.98509
##$PC= 1
##$PHC0= 91.56555
##$PHC1= 0
##$PH_mod= 1
##$PKNL= yes
##$PPARMOD= 0
##$PPDIAG= 0
##$PPIPTYP= 0
##$PPMPNUM= 2147483647
##$PPRESOL= 1
##$PSCAL= 4
##$PSIGN= 0
##$PYNMP= <proc.py>
##$REVERSE= no
##$SF= 400.02
##$SI= 32768
##$SIGF1= 0
##$SIGF2= 0
##$SINO= 400
##$SIOLD= 32768
##$SPECTYP= <>
##$SREGLST= <1H.CDCl3>
##$SSB= 0
##$STSI= 32768
##$STSR= 0
##$SW_p= 8223.68421052631
##$SYMM= 0
##$S_DEV= 0
##$TDeff= 65536
##$TDoff= 0
##$TI= <>
##$TILT= no
##$TM1= 0
##$TM2= 0
##$TOPLEV= 0
##$USERP1= <user>
##$USERP2= <user>
##$USERP3= <user>
##$USERP4= <user>
##$USERP5= <user>
##$WDW= 1
##$XDIM= 32768
##$YMAX_p= 463327377
##$YMIN_p= -758583
##$CURPLOT= <Network HP LaserJet P1505>
##$CURPRIN= <$Network HP LaserJet P1505>
##$DFORMAT= <normdp>
##$LAYOUT= <+/1D_H.xwp>
##$LFORMAT= <normlp>
##$PFORMAT= <normpl>
##$SURQMSG= 1
$$ End of Bruker specific parameters
$$ ---------------------------------
##NTUPLES= NMR SPECTRUM
##VAR_NAME=  FREQUENCY,     SPECTRUM/REAL,   SPECTRUM/IMAG
##SYMBOL=    X,             R,               I
##VAR_TYPE=  INDEPENDENT,   DEPENDENT,       DEPENDENT
##VAR_FORM=  AFFN,          ASDF,            ASDF
##VAR_DIM=   32768,         32768,           32768
##UNITS=     HZ,            ARBITRARY UNITS, ARBITRARY UNITS
##FACTOR=    0.250966925370066, 1,           1
##FIRST=     8223.43324360094, -137789,      19154
##LAST=      0,             210395,          -113570
##MIN=       0,             -758583,         0
##MAX=       8223.43324360094, 463327377,    0
$$ Real data points
##PAGE= N=1
##DATA TABLE= (X++(R..R)), XYDATA
$$ [...]
19554A86437c816r4473m4959N0756h151r2531o4459g1692j28075d9126j1307a0555
19541d5761j57528a0469B2157J49039b50149g6416q0204I4446b71768j01806B13705
19529d5331k800k09819A64250e73j02687d4050r5125I6806b18324A58496E7291
19517a48636A4043Q5219b64163A626b07230D7284a30557A06782a36686H0427j516
19506G8911b34774B49827f375j49788O7815E376a70961a5293l5375k70842a9871
19494a86075d6794j79558l0169l6093j5747C4993h1312o8004q6188e5069j86491
19483b41560j42656M1901g3691A081a20590A43377g21673f8462A40886E1886a59398
19471h9486b1870j59542c2728j35075j09020A8732P4128a06230M1603l11390g9773
$$ plain form
19554 186437 -3816 -98289 -143248 -92492 -8151 -100682 -165141 -71692 -199767 -49126 -60433 -10555
19541 -45761 -203289 -10469 22157 171196 -250149 -76416 -156620 94446 -271768 -373574 213705
19529 -45331 -48131 -257950 164250 -573 -103260 -44050 -139175 96806 -218324 158496 57291
19517 -148636 14043 99262 -264163 1626 -207230 47284 -130557 106782 -136686 80427 78911
19506 78911 -234774 249827 -6375 -156163 -88348 5376 -170961 -15293 -50668 -321510 -19871
19494 -186075 -46794 -226352 -256521 -292614 -308361 34993 -81312 -149316 -235504 -55069 -241560
19483 -241560 -384216 -342315 -73691 1081 -120590 143377 -721673 -68462 140886 51886 -159398
19471 -89486 -21870 -181412 -32728 -167803 -276823 18732 92860 -106230 -64627 -376017 -79773
19459A3678a20465d2462k7853K7101j59455C14884Q531A22219A4105a48859K3980
19448a24879H3542a51814A30670N9b7712F5713K3325a18925I9713i0939j87649
19437b78588J28344A71378d34478j95446b04369A14762g7751j69463B18136j2673
19427B05463j01206i688n9834C20497b64504N3111i6696j56949b2637M111A33957
19415C08301I9267L84267a40673n8365i1396B45370b68357a06475C53041a29850
19404d27275B32371i7449M1050A23218L1308J7403c95561a81427K6251a5625p8207
19393i3832B6041f56569a9383B6534A263J12746l205l5022i7341q187J6753A97706
19380b8828j15047o0830P6151A26612l1106b42646A09993A118a09338E9313b73973
$$ plain form
19459 13678 -120465 -42462 -70315 -43214 -202669 314884 323415 122219 14105 -148859 -124879
19448 -124879 83542 -151814 130670 130729 -27712 65713 89038 -118925 99713 -90939 -278588
19437 -278588 -150244 171378 -434478 -629924 -204369 114762 -77751 -247214 218136 205463
19427 205463 104257 -9688 -69522 320497 -264504 -211393 -96696 -253645 -22637 -18526 133957
19415 308301 99267 483534 -140673 -199038 -91396 245370 -268357 -106475 353041 -129850
19404 -427275 232371 -97449 -56399 123218 154526 171929 -395561 -181427 -155176 -15625 -93832
19393 -93832 26041 -656569 -19383 26534 1263 114009 110804 75782 -97341 -105528 -88775 197706
19380 -28828 -143875 -204705 -128554 126612 95506 -242646 109993 1118 -109338 59313 -273973
19368A48354c62415A46045m3533C6785b36699E5028i8905C6690f3236F0980a8739
19356e3566l5657l0893m7827A02850j7606a74822j05020J28734c1650C89053c06559
19344f2285b416k5701j8943D06363j79726h7058B46269g0778j76903N0306A2935
19332c22723a00653o2785L4736a2728j6104j0829G5169A2383k111J7084J19871
19321A47227L7905d7504H2571j291b05756R7708k71157K0825A68228D7439a41152
19309c12920R0336N5058j11564j14792B06959a86535e5210K1704k14616i4092
19298c10208a52480H6041b45933E1038b1165N245F7331b5320N054B60521h7888
19286b11726A01855b47776m3282N900o2312f1201a4224F7080g4371l06676A83239
$$ plain form
19368 148354 -362415 146045 102512 36785 -236699 55028 -98905 36690 -63236 60980 -18739
19356 -53566 -89223 -120116 -167943 102850 85244 -174822 -279842 -151108 -31650 389053 -306559
19344 -62285 -2416 -28117 -47060 406363 226637 -87058 246269 -70778 -247681 -197375 12935
19332 -322723 -100653 -163438 -128702 -12728 -28832 -39661 75169 12383 10272 27356 147227
19321 147227 185132 -47504 82571 81280 -205756 -108048 -379205 -358380 168228 47439 -141152
19309 -312920 -222584 -167526 -279090 -393882 206959 -186535 -55210 -33506 -248122 -94092
19298 -310208 -152480 86041 -245933 51038 -21165 -15920 67331 -25320 -20266 260521 -87888
19286 -211726 101855 -247776 -291058 -285158 -347470 -61201 -14224 67080 -74371 -381047 183239
19274B78148G9012J07336K4330I3098h5220E0383J42726b64858Q1592C59d5642
19262b23288O9924q8974h0414F7464c46753a1509j13407k95527g3111p3992k6393
19251a73496A77866R9095a84640H8130M1171d6375l22843J65272k9877f0767m8354
19240a09121k5702B83756j21733b21214J00488A11820p013a51750A95238c10613
19229A9177e9327j55286c3418r7033A78538J1187d3787j67020A62107i4446K5304
19218f9142p8458m3690l3430m2349M2747L556k2838G0178f6394k8508A52539a19492
19205A027J18745K0262d667B452J74098H6168C5822j4132M4669d89109b9457q1293
19193a10750j39413Q5890I930c02631P6801D4459a10350d9384n5848K5320l8148
$$ plain form
19274 278148 79012 186348 210678 93098 -85220 50383 193109 -264858 -183266 359 -45642
19262 -223288 -153364 -242338 -80414 67464 -346753 -11509 -124916 -420443 -73111 -147103 -173496
19251 -173496 177866 276961 -184640 88130 129301 -46375 -369218 -203946 -233823 -60767 -109121
19240 -109121 -134823 283756 162023 -221214 -120726 111820 104807 -151750 195238 -310613
19229 19177 -59327 -214613 -33418 -130451 178538 189725 -43787 -210807 162107 -94446 -69142
19218 -69142 -147600 -191290 -224720 -267069 -224322 -220766 -243604 70178 -66394 -94902 152539 -119492
19205 1027 119772 140034 -4667 2452 176550 86168 35822 21690 66359 -489109 -29457 -110750
19193 -110750 -250163 -164273 9930 -302631 -225830 44459 -110350 -49384 -105232 -79912 -118060
19182a18060B9025F971O9082b71454J01257B08314l757a65970D6597c06030j29295
19171d35325B28713a0064j808k22163E2293J35999C3776a98249L5517C05618c28045
19159a78302f9723C07568q599a03157k3868A13329f8253A3818e7764B00348b30033
19147a44086L0166k0662l62253A51633a65374m0537B04764B5318K81740D2305
19136a61050j4094O5804j17943J6562j38961C26958a86793P212G6620b77106c3309
19124b59082A13968Q5191q5567N1057f7692n3712e0542k0209b9012q300B22974
19112a41432O4802b4023E3132a6961q0029J0830B58466a90414M3184B44333E046
19100B70548C5461a257k7947e781j48110C9945J19838C603N2188k4919a11127
$$ plain form
19182 -118060 29025 6971 76053 -271454 -170197 208314 204557 -165970 46597 -306030 -435325
19171 -435325 228713 -10064 -11872 -234035 52293 188292 33776 -198249 -162732 305618 -328045
19159 -178302 -69723 307568 298969 -103157 -127025 113329 -68253 13818 -57764 200348 -230033
19147 -144086 -113920 -134582 -496835 151633 -165374 -205911 204764 25318 307058 42305
19136 -161050 -175144 -109340 -227283 -210721 -349682 326958 -186793 -179581 76620 -277106 -33309
19124 -259082 113968 199159 113592 164649 -67692 -121404 -50542 -70751 -29012 -37312 222974
19112 -141432 -76630 -24023 53132 -16961 -96990 -86160 258466 -190414 -147230 244333 5046
19100 270548 35461 -1257 -29204 -5781 -153891 39945 159783 3603 55791 30872 -111127
19088a61564j65524a38230o8856P8052k9240L8266A02105c6984k11165P2849L8012
19077a37288k80939H1134Q0410a82377A54307P9730c56777L2679d1673A61964
19066b15897j7474a2863j0757A19925a68791r1320H804N5491b27983k30330E9341
19054A9934a83353m6457A64353F8738k2864C463b05870k24447E8902N4581c4233
19042A91770d4376g055A29580a0960A20556a25163d0993E9202d7912A24287m6700
19031G7587N6950B9719b20252A18197J63170F5884M2652J21129K8224b37884H2699
19019B22392G0842J61148a47737j39124B04037R254F9033a96411C954f056A95296
19007a4264j59729i312m3496j33712n4791A63688c3763D7449J61100c15346a43268
$$ plain form
19088 -161564 -327088 -138230 -207086 -129034 -158274 -120008 102105 -36984 -248149 -175300 -137288
19077 -137288 -418227 81134 161544 -182377 154307 234037 -356777 -324098 -41673 161964
19066 -215897 -233371 -12863 -23620 119925 -168791 -260111 8804 64295 -227983 -458313 59341
19054 19934 -183353 -229810 164353 68738 45874 3463 -205870 -430317 58902 113483 -34233
19042 191770 -44376 -7055 129580 -10960 120556 -125163 -40993 59202 -47912 124287 77587
19031 77587 134537 29719 -220252 118197 281367 65884 108536 229665 257889 -237884 82699
19019 222392 70842 231990 -147737 -286861 204037 213291 69033 -196411 3954 -6056 195296
19007 -14264 -173993 -9312 -52808 -186520 -241311 163688 -33763 47449 208549 -315346 -143268
18995f0634J5069j76016q9655h6348L6731D82a50340A59338c53696N2965A35391
18983a48821E9185a45763P882d0150j73110R0878e1740E1973a76502A53745a47291
18971h4122A60958i6159j05791c5527A13492A4280J8236M3626c91114J66478C95079
18959A24277a54227m2862M7728P807k37789D1275O9921N783B469a577G8780M3579
18947A22359b29163H5778a27251A91652c818F0915a18810e676r517A91426R7153
18936B88579b52317J15890b9366D2957a15821m2533o8326A67808m9783h6967M1742
18925d5225o0887C7161G650L5466b43380a5396A37371a529B9323b50865a17485
18913c45079G3629J75365a81676m4510J6821R5729F4131Q346h5230A4296Q294
$$ plain form
18995 -60634 -45565 -221581 -311236 -86348 -49617 482 -150340 159338 -353696 -300731 135391
18983 -148821 59185 -145763 -137881 -40150 -213260 -122382 -51740 51973 -176502 153745 -147291
18971 -84122 160958 -96159 -201950 -35527 113492 14280 32516 76142 -391114 -224636 395079
18959 124277 -154227 -197089 -149361 -141554 -379343 41275 111196 116979 2469 -1577 78780 122359
18947 122359 -229163 85778 -127251 191652 -3818 60915 -118810 -5676 -15193 191426 288579
18936 288579 -252317 -136427 -29366 42957 -115821 -158354 -226680 167808 118025 -86967 -45225
18925 -45225 -106112 37161 7650 43116 -243380 -15396 137371 -1529 29323 -250865 -117485
18913 -345079 73629 248994 -181676 -226186 -209365 -113636 64131 72477 -85230 14296 22590
18902B2590O1254b1711j87384F3371L7880a96108L9119A18708a04742j81860A5565
18890a93639F9832E85J34768c01195A46445L2255G9970c0985A63265J6476f2289
18878c15464g1399j4634K326C76930b17807A093J50725a6247j59120B1521i359
18866A56272e5700j6316C48780b39185B75047c1420l10743C1615R8963c48394
18855a50382r2923a16845F2310a36032F1399K31678a1395q728C59089o5697a44506
18843C7345f69603a42977A81100g8984k83925A01410a02868c2194j85835h1009
18832B53598a09661M3488j00409E3452h1044k14051F119R9339k5276a02959k34732
18821c37691B26846k5790q4032b00460i302D8361B0507J65780F3068b01377C75884
$$ plain form
18902 22590 83844 -21711 -209095 63371 101251 -196108 -156989 118708 -104742 -286602 15565
18890 -193639 69832 585 135353 -301195 146445 178700 79970 -30985 163265 179741 -62289
18878 -315464 -71399 -86033 -83707 376930 -217807 1093 151818 -16247 -175367 21521 -9359
18866 156272 -55700 -72016 348780 -239185 275047 -31420 -342163 31615 130578 -348394
18855 -150382 -243305 -116845 62310 -136032 61399 293077 -11395 -20123 359089 293392 -144506
18843 37345 -669603 -142977 181100 -78984 -362909 101410 -102868 -32194 -218029 -81009
18832 253598 -109661 -66173 -166582 53452 -81044 -295095 6119 105458 80182 -102959 -337691
18821 -337691 226846 201056 117024 -200460 -9302 48361 20507 186287 63068 -201377 375884
18809A56384P2424m5309c63062B55365f7876k3844L3097a9311E1895i0816D4432
18797H4817c64526H5173c68125A80674d3221g606j53526A59399a87793r3892Q5536
18786a96149O6256b1445R346K170A68771P6526k6658e36703i1664o2603C5209
18774b52938E3716f333C4456a909C2256b42320d9306A62860e0942m919o3490B15486
18761a17985b4440j34626k41265a04681I2695g7126o5852H2865J34211A03329
18750a70203A97516c6495k49736Q5437A46388b39965A27705c7252C77479A04192
18739c00769E206L8269b36022N6607N327k36110F8519d4527L583j66593A47066
18727A42031a2470m08639B8319d5077A12517L4K19061f3403G7095N4097C9832
$$ plain form
18809 156384 228808 183499 -363062 255365 -67876 -91720 -58623 -19311 51895 -90816 44432
18797 84817 -364526 85173 -368125 180674 -43221 -7606 -161132 159399 -187793 -281685 -196149
18786 -196149 -129893 -21445 -12099 -9929 168771 245297 218639 -536703 -91664 -154267 35209
18774 -252938 53716 -6333 34456 -1909 32256 -242320 -49306 162860 -50942 -55861 -119351 215486
18761 -117985 -24440 -159066 -400331 -104681 92695 -77126 -142978 82865 217076 103329
18750 -170203 197516 -36495 -286231 -200794 146388 -239965 127705 -37252 377479 104192
18739 -300769 5206 43475 -236022 -179415 -174088 -410198 68519 -44527 -40944 -207537 147066
18727 142031 -12470 -421109 28319 -45077 112517 112551 331612 -63403 77095 131192 39832
18715C8438b391C1771K05197b5446j73l32323G7639a1574E3867A036c35637i7969
18702c53323c0851j97503Q4547j8676j60491C2722g5106l0994q9764I6055N2501
18691A48556a75046A3419a24580k67400A6450J07582a43145E825P5125f7803D557
18679c4275j6451B40855r8987a82837h250j85833a6243j13967c1457B73559c1814
18667D6209G586c127m56233a91883g4998l329B35026a31274j33756A1343a400
18655G766a89435Q4137l8703m4448h6485b5295p4660k773l3502B22368F6679c27385
18642e1382B7728b27056B25639q8819J12853K38507a35578c1014l8876F7960b92261
18630a3632A89417a62005C8393i3940m2855A32314K25306D9976b39200a07324
$$ plain form
18715 38438 -2391 31771 236968 -25446 -25619 -357942 77639 -11574 53867 1036 -335637 -97969
18702 -353323 -30851 -228354 -143807 -162483 -322974 32722 -75106 -106100 -195864 96055 148556
18691 148556 -175046 13419 -124580 -391980 16450 124032 -143145 5825 80950 -67803 4557
18679 -34275 -50726 240855 141868 -182837 -8250 -194083 -16243 -130210 -31457 273559 -31814
18667 46209 7586 -3127 -459360 -191883 -74998 -78327 235026 -131274 -265030 11343 -1400
18655 7766 -189435 -105298 -144001 -188449 -86485 -25295 -99955 -102728 -136230 222368 66679 -327385
18642 -51382 27728 -227056 225639 136820 249673 488180 -135578 -31014 -69890 67960 -292261
18630 -13632 189417 -162005 38393 -93940 -136795 132314 357620 49976 -239200 -107324
18619b6535C44539E7101J48695a64156a5781k56534a15108e5213A3860c76617
18608h1801K92l58148E6698B0248a9859A937b65231F4320J78969b6496k62770
18597b89266a09775o2264A66695J54c24082B09764a08730a2514j83037B6385d84245
18585a36519J430j72275J04664R1155L9400j193k35467a52517k4855f4784j22940
18574a87724H3303a56140C2822J23967b01935j9476q9800A3744J18807a58101
18563B68798a59458j73788b1082j19038A09524d48480a60716G597a4180j66714
18553a80894B01242b39640G4L6491a60313j54595J34606J1627K1885I2747k5410
18542F7337K55785A00431k6801b46167J2966L3091c2972b404C51591C8925g1985
$$ plain form
18619 -26535 344539 57101 205796 -164156 -15781 -272315 -115108 -55213 13860 -376617
18608 -81801 -81509 -439657 56698 20248 -19859 1937 -265231 64320 243289 -26496 -289266
18597 -289266 -109775 -172039 166695 166849 -324082 209764 -108730 -12514 -195551 26385 -484245
18585 -136519 -135089 -307364 -202700 -111545 -72145 -73338 -308805 -152517 -177372 -64784 -187724
18574 -187724 83303 -156140 32822 156789 -201935 -221411 -311211 13744 132551 -158101
18563 268798 -159458 -333246 -21082 -140120 109524 -448480 -160716 7597 -14180 -180894
18553 -180894 201242 -239640 74 36565 -160313 -314908 -180302 -168675 -146790 92747 67337
18542 67337 323122 100431 73630 -246167 -233201 -200110 -32972 -2404 351591 38925 -71985
18530a20005k6549C94858a35527j79726a02825l62762A01501Q3587m8742k9121
18520A07225J074C4838c15577F2761a64363B9160b83175k14541A80247C8614g8918
18508a14964B38971a53929B4182a52598a3664A39695e5654K4296C0708g0719A24734
18496A84886n8654L77050B23873i1530q9969A40793a40984B81841F1089c77877
18485B09940a15281A70083P887b04392J00563A88687E652J22516a20600r4876
18475b15476j51438a12704j0822l16781g5282A43754a71768K4797k47536a13292
18464c1494p6306D7576J02048c5983k58286A72083a31034c1273r9218E2588N8427
18453A11015a95717B19975F4567a21457I5158k0531g5945j4540A12877B9670i1222
$$ plain form
18530 -120005 -146554 394858 -135527 -315253 -102825 -465587 101501 185088 136346 107225
18520 107225 108299 34838 -315577 62761 -164363 29160 -283175 -497716 180247 38614 -78918
18508 -114964 238971 -153929 24182 -152598 -13664 139695 -55654 -31358 30708 -70719 124734
18496 184886 126232 503282 223873 -91530 -181499 140793 -140984 281841 61089 -377877
18485 209940 -115281 170083 177970 -204392 -103829 188687 5652 128168 -120600 -215476
18475 -215476 -366914 -112704 -123526 -440307 -75282 143754 -171768 -146971 -394507 -113292
18464 -31494 -107800 47576 149624 -35983 -294269 172083 -131034 -31273 -130491 52588 111015
18453 111015 -195717 219975 64567 -121457 95158 74627 -75945 -90485 112877 29670 -91222
18441c7485j50095e9288o2454M2913k66456a00406j43326a15586E1712J50941
18431B02653p1757a3471j26094j32847H4919M7426a21802d9933C30039a8078j48410
18420a66488H3832b11886a2434A13752a04051A14638d0954H0193l0740A5147a96623
18408A61736I650J01448K11981b21154B3566J32336p1079b00164A45909o9715
18398G6194b3217o0585M339q8328e7287l12056J78405R3009q9849j70662J63399
18387a95041b3525j04248M6816L0034j78916N5695K5894j95552J04932C3423f6004
18375D491a53670C82413B4177A1826Q6167a03137B91371e7708q7536m8966A91041
18363b67294h8481C0202H488a35972d5290B42805f3147l9077j40125R5576O4996
$$ plain form
18441 -37485 -187580 -59288 -121742 -78829 -345285 -100406 -243732 -115586 51712 202653
18431 202653 130896 -13471 -139565 -272412 84919 132345 -121802 -49933 330039 -18078 -166488
18420 -166488 83832 -211886 -12434 113752 -104051 114638 -40954 80193 49453 15147 -196623
18408 161736 9650 111098 323079 -221154 23566 155902 84823 -200164 145909 76194
18398 76194 -23217 -83802 -79463 -167791 -57287 -369343 -190938 -97929 -187778 -358440 -195041
18387 -195041 -23525 -127773 -80957 -50923 -229839 -174144 -148250 -343802 -238870 33423 -66004
18375 4491 -153670 382413 24177 11826 97993 -103137 291371 -57708 -145244 -194210 191041
18363 -267294 -88481 30202 8488 -135972 -45290 242805 -63147 -102224 -242349 -146773 -81777
18352h1777l2683A08552C6515P359J57923a14577D23805A00233b58811j3324i6734
18340a74743j49855H8045P5922n7722b48518A13753a65494n0575k19740D1196
18329B51908b8504B60385l054c067k63293F3469b54699a06671B21313b2467F6908
18317A57871b43179F0561a8376j5634A13933M3167i0092c0589B23788J4906a89454
18305a22858n3747O0829A14054c39606H9309b12364a3486r0143B10968g6821A38685
18293B76824i4394D5231L8453a33439p5998J4257d6669j1543A04176J51574f8357
18281D3595f6796F4762M1283b81676K7121A9164J10823D3332c11055A82583p9910
18270A02673N641O2470a3147j88051R5872C71615H109i5290c3063A61286D4770
$$ plain form
18352 -81777 -114460 108552 36515 43874 201797 -114577 423805 100233 -258811 -272135 -96734
18340 -174743 -324598 88045 163967 106245 -248518 113753 -165494 -216069 -435809 41196
18329 251908 -28504 260385 257331 -3067 -266360 63469 -254699 -106671 221313 -22467 66908
18317 157871 -243179 60561 -18376 -34010 113933 157100 -90092 -30589 223788 238694 -189454
18305 -122858 -176605 -115776 114054 -339606 89309 -212364 -13486 -103629 210968 -76821 138685
18293 276824 -94394 45231 83684 -133439 -209437 -195180 -46669 -58212 104176 255750 -68357
18281 43595 -66796 64762 106045 -281676 -254555 19164 129987 43332 -311055 182583 102673
18270 102673 108314 170784 -13147 -201198 -105326 371615 8109 -95290 -33063 161286 44770
18258b27550o4102D2149f9865A98464b14060M7848j36353j1958j9847B52922n9137
18247A93785a16934e557r7229A71375q0145b6248G9262d8841I3793d64704i3333
18235a40414o4138n2356h273k6428j50755F8528b09413p757F0704c56890c9281
18223A40289a74312l2043L1103d2774H8818d4180o518b3196A91896A6920L5873
18212E2793J62140d0615p9723j24719a05788A97563a77154c4442o9709m3079M4739
18201a02491A70247B0102c71980g7399A602i3191B0487a8682B36551D9325c0126
18189a94966B71497f392I7842m5955a03774I2701a13272A57960e758n9479j3038
18178g8275k02659N5866N1229c7952m6786B54998a21943M5293B01929d7822A53429
$$ plain form
18258 -227550 -291652 42149 -69865 198464 -214060 -166212 -302565 -314523 -334370 252922 193785
18247 193785 -116934 -5557 -102786 171375 91230 -26248 79262 -48841 93793 -464704 -93333
18235 -140414 -204552 -256908 -8273 -34701 -185456 68528 -209413 -217170 60704 -356890 -39281
18223 140289 -174312 -206355 -175252 -42774 88818 -44180 -50698 -23196 191896 16920 52793
18212 52793 214933 -40615 -120338 -245057 -105788 197563 -177154 -34442 -104151 -147230 -102491
18201 -102491 170247 20102 -371980 -77399 1602 -93191 20487 -18682 236551 49325 -30126
18189 -194966 271497 -6392 97842 51887 -103774 92701 -113272 157960 -5758 -65237 -78275
18178 -78275 -280934 -225068 -173839 -37952 -84738 254998 -121943 -76650 201929 -47822 153429
18166d5706k6220o0176F0477K74283e3101l9965D1675N4353c66340J24542e0092
18154C80937g8590I7970P0964p2217J3970a63928h791o6978k592P506j72618j2136
18142b55609A21152b46040L7767P5471c4222A57940J97872c18112d0787O458B17068
18130a70912B29458n0926a0660l51216e6398l4284j3776j55960D0103r879O753
18119C6977c2441k87422J25772c4151l18953h0632p7974B2968a13045F1506f7320
18107C4511A1867a37318B24121c187j82542A52639i5768A58431p6353M3384i4447
18095h3975B22724b36064j29810C49830b51400I1208N5961b22344A29975i6111
18084b71374A57435b59269A0253J43721a02928k4628A62122j2099A3652b17216
$$ plain form
18166 -45706 -71926 -132102 60477 334760 -53101 -93066 41675 96028 -366340 -241798 -50092
18154 380937 -78590 97970 168934 96717 110687 -163928 -8791 -75769 -78361 -70855 -243473 -255609
18142 -255609 121152 -246040 -208273 -132802 -34222 157940 355812 -318112 -40787 -34329 217068
18130 -170912 229458 178532 -10660 -361876 -56398 -90682 -104458 -260418 40103 30224 36977
18119 36977 -32441 -319863 -194091 -34151 -353104 -80632 -158606 22968 -113045 61506 -67320
18107 34511 11867 -137318 224121 -3187 -185729 152639 -95768 158431 82078 125462 -94447
18095 -83975 222724 -236064 -365874 349830 -251400 91208 147169 -222344 129975 -96111
18084 -271374 157435 -259269 10253 153974 -102928 -127556 162122 150023 13652 -217216
18073b1725j38875B0888b75420N6677B28907B9940J08159a10587G9131L6796a0890
18061E2742b70815P7107k08388J77305b3971j06333e8256j07798G6269b79281
18050B4390J43292a41191A94508a51840C71651C9556c07184F282J45017k4826
18040A26473n1203k6953c6931C54129j51232p6174N3286B9800P8508b56852O3215
18029a93637I169b90684A2514J86454b52154f367H9720b76363k52873F0227e52586
18017A6882f2450E5810A0650K77081a25j56636q3054f8670l0277A59890J80402
18006C40292B876b77562A82639J0452a76699D78872a78684H9542d4028g046l81796
17995c88842i2435B26159G9306i5032Q080B33573d51977A78356c6882E35818B0363
$$ plain form
18073 -21725 -160600 20888 -275420 -218743 228907 29940 138099 -110587 79131 115927 -10890
18061 52742 -270815 -193708 -402096 -224791 -23971 -130304 -58256 -166054 76269 -279281
18050 24390 167682 -141191 194508 -151840 371651 39556 -307184 6282 151299 126473
18040 126473 75270 48317 -36931 354129 202897 126723 180009 29800 108308 -256852 -193637
18029 -193637 9169 -290684 12514 198968 -252154 -6367 89720 -276363 -529236 60227 -552586
18017 16882 -62450 55810 10650 287731 -125 -156761 -239815 -68670 -98947 159890 340292
18006 340292 2876 -277562 182639 193091 -176699 478872 -178684 89542 -44028 -7046 -388842
17995 -388842 -92435 226159 79306 -95032 -86952 233573 -451977 178356 -36882 535818 20363
17983I1341R7568N344g8304C891K15858f3240j66568Q5287N1689A51627N9584
17972B11211o2035M5096d40579A00743R5553Q4690b68109A02476a07569L7823
17962f9746l2081A09357J0972K55220c6387A08709h9887j08971B96757D1378h8359
17950g0706b8180m23315h0319n9478M5281I014c3273m8339l11030A03612O3200
17939A66812n8470d04960A35640b35371a8407k8151B5705a24631j26378A11869
17928C1553J54180f8866C24209j60061a17117j48457j32453b4535j11287B3821
17917h8519A14653D5902b88650B9852P8532f1374n7445e1996j80317k2075H4302
17905b01547C82819j86767f3957E2894c2983I1854L2834A6833a14348D2480J52054
$$ plain form
17983 91341 188909 194253 -78304 3891 219749 -63240 -229808 -144521 -92832 151627 211211
17972 211211 149176 194272 -440579 100743 196296 280986 -268109 102476 -107569 -69746
17962 -69746 -101827 109357 120329 375549 -36387 108709 -89887 -198858 296757 41378 -88359
17950 -70706 -28180 -451495 -80319 -139797 -94516 9014 -33273 -81612 -392642 103612 166812
17939 166812 108342 -404960 135640 -235371 -18407 -46558 25705 -124631 -251009 111869
17928 31553 185733 -68866 324209 164148 -117117 -265574 -398027 -24535 -135822 23821
17917 -88519 114653 45902 -288650 29852 108384 -61374 -118819 -51996 -232313 -254388 84302
17905 -201547 382819 196052 -63957 52894 -32983 91854 124688 16833 -114348 42480 194534
17894A94534c21667a03350q1064D5063f7316r5049M5512N5225H2378c42963B24020
17882a31304e7561C013h8480j1180L5278j21557f3480k11320A05530J37758b69400
17870I5127c33688F0664k1953b63933D4322k1900a81928M2189j12980e7706k02754
17859b60460d2583j533H1258a10622A44864c7676l20153A61774f1742F2738k2123
17848D0615a4696j03764o0523j7933F5210b41861g6448A54302A2091a70000a3792
17836b38582A25266P2714G722L14562c25597a31413f2085m44013h6390j82994
17826b69384I7135a52707A25034l092a15256A01145l6249P9740b52476B96899
17815a52240H2372h1172E2517e4885q5747A91296B228a56224A14231c3328C5205
$$ plain form
17894 194534 -321667 -103350 -184414 45063 -67316 -162365 -116853 -61628 82378 -342963 224020
17882 -131304 -57561 3013 -88480 -99660 -64382 -185939 -63480 -274800 105530 243288 -269400
17870 95127 -333688 60664 38711 -263933 44322 22422 -181928 -139739 -252719 -57706 -260460
17859 -260460 -42583 -44116 81258 -110622 144864 -37676 -357829 161774 -61742 62738 40615
17848 40615 -14696 -118460 -178983 -196916 65210 -241861 -76448 154302 12091 -170000 -13792
17836 -238582 125266 197980 7722 322284 -325597 -131413 -62085 -506098 -86390 -269384
17826 -269384 97135 -152707 125034 121942 -115256 101145 64896 144636 -252476 296899
17815 -152240 82372 -81172 52517 -54885 -140632 191296 2228 -156224 114231 -33328 35205
17803A11900h3735C73588g5687C98491r0692A03564l3413a07765B17348K2490
17793B39838K7086j30314K4478E8120P5763b02292B39419b334A3368K18969a44032
17781a51488E8266a34499k79183b7018k0201F9689J906c01880A06760J43820b3479
17769b02748A11435a25991o1945C4869a89916f9570b6228l33306D9962A5264P7865
17758I3129h3935B58200N7900b30656C1533J89172n4378b21046A45994J265C857
17746A84820B2653J84338a63002g6367n6786A0390K32187c19805F5884L5893f1506
17734b54449e6207B28441b03006R5519D3533a02132G6837J42977F6121R1805K57359
17723D15285a64260r1894B2251d3627j95037A42818B6432b00333A48438a57865
$$ plain form
17803 111900 -83735 373588 -75687 398491 307799 103564 70151 -107765 217348 239838
17793 239838 266924 136610 161088 58120 133883 -202292 239419 -2334 13368 232337 -144032
17781 -151488 58266 -134499 -413682 -27018 -47219 69689 71595 -301880 106760 250580 -23479
17769 -202748 111435 -125991 -187936 34869 -189916 -69570 -26228 -359534 49962 15264 93129
17758 93129 -83935 258200 316100 -230656 31533 220705 166327 -221046 145994 147259 3857
17746 184820 22653 206991 -163002 -76367 -133153 10390 242577 -319805 65884 101777 -61506
17734 -254449 -56207 228441 -203006 -107487 43533 -102132 76837 219814 66121 157926 415285
17723 415285 -164260 -256154 22251 -43627 -238664 142818 26432 -200333 148438 -157865
17712b60689B67699f1629B28984F1357J0088b76309a8837j25811c1305H0435K51442
17701C31877E1571h2816B72405a55257e7803I5374a79649J3737l06353g0943I7260
17689H7324h3219A56721a42449k28908o0752D2638q523i923j76520A94645f9798
17677b51467G4748K64688j24243i3267j06083E4019d6462k27656h3596k73191
17667c56787C2288a4933o8792A08021K49735d01600A57524A1644J4921a38838
17656g653C18950A07749a57144e3616j2287B1000i6458I6578K9167b8054A11990
17644G5757A1855K41206A03182L13870b12690O5512c9788A21937C8546L01668
17634C40214b29511d8251j4543B52088E3873K50820c1517k07473F7743b06105
$$ plain form
17712 -260689 267699 -61629 228984 61357 71445 -276309 -18837 -144648 -31305 80435 331877
17701 331877 51571 -82816 272405 -155257 -57803 95374 -179649 -165912 -472265 -70943 97260
17689 87324 -83219 156721 -142449 -371357 -432109 42638 34115 -9923 -186443 194645 -69798
17677 -251467 74748 339436 215193 -93267 -199350 54019 -46462 -274118 -83596 -356787
17667 -356787 32288 -14933 -83725 108021 357756 -401600 157524 11644 26565 -138838
17656 -7653 318950 107749 -157144 -53616 -65903 21000 -96458 96578 125745 -28054 111990
17644 75757 11855 253061 103182 417052 -212690 -147178 -39788 121937 38546 340214
17634 340214 -229511 -48251 -62794 252088 53873 304693 -31517 -238990 67743 -206105
17623b05079G8251K11766B7991b85604D10976j16172r7141a50619J5532o7270
17613b02357d501k42958C09095a51715H4450J72643a5579B82754I8738J03511
17603B02249a50108B08229L4440B3830a00554A09646i9088D39137b6851C72225
17592E5599O5966b06107I0042c2779j66682N2491C01661b7441m8533H2766a87117
17580a67808A83744O1843M0257G1131b29579q7560R0533D9470b75183R8256C8001
17568A4703J04972K9042g7259D6375J53655r4551j3778a01624p5495A39260L4607
17557A73867C3286Q1435K20122a27455A77989q5144A3531J57828b23516L9948
17547a83568I571a46646G8371k0765j7405R0939K4107h8965k7957j40092B68862
$$ plain form
17623 -205079 78251 290017 27991 -285604 410976 294804 197663 -150619 -135087 -202357
17613 -202357 -4501 -247459 309095 -151715 84450 257093 -15579 282754 98738 202249
17603 202249 -150108 208229 242669 23830 -100554 109646 -99088 439137 -26851 372225
17592 55599 121565 -206107 90042 -32779 -199461 -146970 301661 -27441 -75974 82766 -187117
17580 -167808 183744 245587 285844 71131 -229579 -317139 -226606 49470 -275183 -176927 38001
17568 14703 119675 148717 -77259 46375 200030 105479 91701 -101624 -177119 139260 173867
17557 173867 33286 114721 334843 -127455 177989 92845 13531 171359 -223516 -183568
17547 -183568 9571 -146646 78371 57606 40201 131140 155247 -88965 -116922 -257014 268862
17535a41578e2012B81865d6182n4378A18356O0755b9666j30342G6002k1048M9395
17524A04349l4012K15175p3490l3864A0525a09891b3347A08430l6099M6186h5719
17512d1079j3123B0609J49726a92750R0602B02856R7420B7548J07568J08310H2419
17500g626A22804K2370K98336j77848j8609E8645K24246j03823a88820h3840A26584
17488c44904A35420a47630A05861L74103B34279o4293b09762h2660A79050E7122
17477B96414a00325d5833k02262B4306M71395E4624a4379A26071J98883A40319
17466A63975L41420A3798m66M55662A76373G0664a18596A08104c001A61223G7784
17454A57741C7583K78286M5057A77786K49534j27211D0976K06493D6189K35898
$$ plain form
17535 -141578 -52012 281865 -46182 -100560 118356 179111 -29666 -160008 76002 54954 104349
17524 104349 70337 285512 212022 178158 10525 -109891 -23347 108430 72331 118517 -85719
17512 -41079 -54202 20609 170335 -192750 -102148 202856 300276 27548 135116 243426 82419
17500 -7626 122804 145174 443510 265662 247053 58645 282891 179068 -188820 -83840 126584
17488 -344904 135420 -147630 105861 479964 234279 169986 -209762 -82660 179050 57122
17477 296414 -100325 -45833 -248095 24306 495701 54624 -14379 126071 324954 140319
17466 163975 505395 13798 13332 468994 176373 70664 -118596 108104 -3001 161223 77784
17454 157741 37583 315869 360926 177786 427320 300109 40976 247469 46189 282087
17444B82087G8743c75963C70302a11538C94477j59172n3677J06315n5300Q4188
17434C16831m4025q9547J53307M6511a10557B09828L3939l8796J73268A0304N1741
17423F2045A8203N23620A45854J62063G2756K53450j7792B2575M77204A92041
17412C25634o2298n1674k3996J44684A60951b8679D31654c4394k03061A77158
17401B44562A06225f1352C05053p5259D8581J62467A1422e3581C54057o4890A30378
17389B08463I1935K94099A10105c05388D34605j24228A49780K20799N657e0094
17378B3206b725j34832B7473J65453j4498E1877K4218J06335k0190p4869K43480
17367C30851i223B73923Q1031D7481a1770q5438B49894B1775J0805K45271q7106
$$ plain form
17444 282087 78743 -375963 370302 -111538 394477 235305 181628 287943 232643 316831
17434 316831 272806 183259 336566 383077 -110557 209828 243767 204971 378239 10304 62045
17423 62045 18203 541823 145854 307917 72756 326206 308414 22575 499779 192041
17412 325634 263336 211662 187666 332350 160951 -28679 431654 -34394 -237455 177158
17401 244562 106225 -61352 305053 229794 48581 211048 11422 -53581 354057 289167 130378
17389 208463 91935 386034 110105 -305388 434605 310377 149780 370579 376236 -50094
17378 23206 -2725 -137557 27473 192926 178428 51877 76095 182430 162240 87371 330851
17367 330851 -9223 273923 354954 47481 -11770 -97208 249894 21775 32580 277851 190745
17356A90745L56433c0757A70003a61646b0346A52463B4754J27141K634f5956C2815
17344A05378m1197P0078e4994A5888J71784P8050I9630m088B3198a5583A46953
17332D85538j46153C5477d2195A9857L73073j36671K8313i5599A46076J7754J31887
17321B95717m8377A6985R7713c8994k80357H7339C6328J50347Q510B2057K02230
17310B24287J474e7118B0304o229J14209O1744M8033O7131M7735a95166E2751
17298B75308r761A08147c0233C60766K2568M5991p9816J32249j24375j26775a38855
17286C2994L49514B0927J46658J71384J6294P9334C2790b7373B57715L1104J6555
17275C05374K4125J83366f4119A01336R4424P7376A7783N67743A51080m9835Q3087
$$ plain form
17356 190745 547178 -30757 170003 -161646 -20346 152463 24754 151895 154529 -65956 32815
17344 105378 64181 134259 -54994 15888 187672 265722 99630 95542 23198 -15583 146953
17332 485538 339385 35477 -42195 19857 392930 256259 284572 -95599 146076 163830 295717
17321 295717 247340 16985 114698 -38994 -319351 87339 36328 186675 195185 22057 224287
17310 224287 225761 -57118 20304 14075 128284 190028 238061 305192 352927 -195166 52751
17298 275308 265547 108147 -30233 360766 383334 429325 349509 481758 357383 230608 -138855
17286 32994 382508 20927 167585 338969 355263 434597 32790 -27373 257715 288819 305374
17275 305374 329499 512865 -64119 101336 195760 273136 17783 585526 151080 101245 184332
17264A84332o2606N1697J72412d0366j59022A27352J9049L1959l1632m8102K0825
17253A19451R4506N807P4220A32789m6514O0172J63055b7551C61800D2796K71466
17242C14262A22225n5392K19818A39285Q0845K19271A10239f559C07086k0980
17232B86106r546O3007n2096P8J08348D7344R2925N8688a68893A22486J81453
17221C03939p4453I1107K5469P7935J80360b21854C87265L0446R7126B31088K42399
17210D73487f476C11527K417a2135B18869J5892b8358K738C53446A65147n6422
17199A08725J93160K01114l3557F8851P4329F778O2117J9621K90393O8913j70343
17188B77479j03418Q1142J33263o6170J54241A07631K92789G1028K41325d7438
$$ plain form
17264 184332 121726 173423 345835 -40366 -199388 127352 146401 178360 146728 98626 119451
17253 119451 213957 219764 293984 132789 86275 146447 309502 -27551 361800 42796 314262
17242 314262 122225 66833 286651 139285 220130 439401 110239 -6559 307086 286106
17232 286106 276560 339567 287471 287549 395897 47344 140269 198957 -168893 122486 303939
17221 303939 229486 91107 116576 194511 374871 -221854 387265 417711 514837 231088 473487
17210 473487 -6476 311527 313944 -12135 218869 234761 -28358 -25620 353446 165147 108725
17199 108725 301885 502999 469442 68851 143180 6778 68895 88516 378909 447822 277479
17188 277479 174061 255203 388466 322296 476537 107631 400420 71028 312353 -47438
17177A80544L0350J50620n0386K9557n5750j25137J3950P8115Q9573Q7204k05334
17166B23306i0661E41224p9988p7456n4536k3505K21276B2737L47586j58552N1916
17155B63687J62779A10568R7619C0771N0598K42185A03960O8064L04968j09280
17145C67712a8063D99909A30132L01188j89024K61827k16605O8387P4777P6791
17135E07473F2182K61735O8961L1123J70338E9769N16348n7230j80417K88585
17125F27055d1421A23497M57521A54722N7497M33866j45717k46990J18842G0422
17114B37502J55265J03680q581M5376B03448d803E43893k50735J98259B18886
17103B37553Q7287k0068P0686p495n2547K41584G3181K20834A10246L97464l0786
$$ plain form
17177 180544 210894 361514 311128 340685 284935 159798 173748 251863 341436 428640 223306
17166 223306 -90661 541224 461236 383780 329244 305739 527015 22737 370323 211771 263687
17155 263687 426466 110568 208187 30771 81369 323554 103960 172024 476992 367712
17145 367712 -18063 499909 130132 431320 242296 504123 287518 355905 430682 507473
17135 507473 62182 323917 392878 424001 594339 59769 576117 518887 338470 627055
17125 627055 -41421 123497 581018 154722 212219 646085 500368 253378 372220 70422
17114 237502 392767 496447 487866 533242 203448 -4803 543893 293158 491417 218886
17103 237553 324840 304772 375458 367963 315416 557000 73181 294015 110246 507710 476924
17092D76924p2511o4154J01590J84733k69710J31918j8500O9631K2154B03556
17081D39242I5897J86155K57489J22379j32209J19410k92767M0410J93280J3912
17071F03956n547k60017L09741k41476j26943A27984J76628L36954k1408K36137
17061H56295C29534K40695L7144k39827o5944M34618l02513l4973q2006J00474
17051D17202l6613K6824d820E69584J5996m7605j95292K45929M4513R8584l00621
17040D31088J61954j2584M9892J97902q7522j75633k2452Q3123r8152O9571R4421
17029F91608B39657L70897M93651E39014K53173k16596J96908l56908N66891l87733
17019E94749k16226M14622j36407L57937k90403m8033J98353j09868j71102O33742
$$ plain form
17092 476924 404413 340259 441849 626582 356872 488790 470290 539921 562075 203556
17081 439242 95897 282052 539541 661920 529711 649121 356354 396764 590044 603956
17071 603956 598409 338392 648133 406657 279714 127984 304612 641566 620158 856295
17061 856295 329534 570229 607373 367546 301602 736220 433707 398734 316728 417202
17051 417202 380589 407413 -4820 569584 585580 537975 342683 588612 633125 731709 431088
17040 431088 593042 580458 630350 828252 740730 565097 542645 625768 527616 597187 691608
17029 691608 239657 610554 1104205 539014 792187 575591 772499 415591 982482 594749
17019 594749 378523 793145 656738 1014675 724272 676239 874592 764724 593622 1227364
17009A227364o09528j35491L13480J07605r6847l8511M7195m1495J3646j333K31351
16998A017436k51449n6282K49516j50432M8006K21279l43623N5544M88076n70457
16988G07614k6504L40434j15361k3289R0222m46622K72355l271P8083p6675J29386
16977I26372J34833J8498l94148O1410j43690N12232r4617q1977J43313k60082
16967H22144j92678M40135m1360j10688M39915m37483R2603q3570K906K4693J83750
16956A140367j86387Q6548L22134m72802J88250R4808R5812K23309l14990j58975
16946A018074k54656K80531J0677K72973l29568M96131m69930K5030K5738N52767
16936A627767l02394k56599J50390j9040Q885M3969M16950m90048l6096J54913
$$ plain form
17009 1227364 617836 482345 795825 903430 806583 768072 815267 773772 787418 786085 1017436
16998 1017436 765987 709705 959221 808789 856795 1078074 734451 789995 1278071 707614
16988 707614 681110 1021544 906183 882894 973116 526494 798849 795578 873661 796986 926372
16977 926372 1061205 1079703 685555 746965 603275 1115507 1020890 938913 1082226 822144
16967 822144 629466 1069601 1028241 917553 1357468 919985 1012588 929018 931924 956617 1140367
16956 1140367 953980 1040528 1362662 889860 1078110 1172918 1268730 1492039 1177049 1018074
16946 1018074 763418 1043949 1054626 1327599 998031 1494162 1024232 1049262 1075000 1627767
16936 1627767 1325373 1068774 1219164 1200124 1209009 1252978 1669928 1179880 1143784 1298697
16926A298697K67819k24168J85058l09229L54537j64674K00031m11053M851L21227
16916A523096j45266J71774l54897L25472j69772L01370J01905j72252J20785
16907A702215k78519O5735K14207L15698l28384R8719K86692j37203p199j05053
16897A826908q3734j95758j51423O06701j23900J2201L8255k3127J94158l21546
16887A778735L28422J26190j68930K55373l18249L02202j73408L46355l55060
16878B121630L4780j9261J58081j55169N7541J37205K73389j92315K7421J42498
16868B585800J03637n81820P83238m3667K07079K43906l82721m46503L19095j3774
16858B774270J02009j5257K5113L57922j06954l08095M94141J77408k05792J25350
$$ plain form
16926 1298697 1566516 1342348 1527406 1218177 1572714 1408040 1608071 1197018 1201869 1523096
16916 1523096 1377830 1549604 1194707 1520179 1350407 1651777 1753682 1581430 1702215
16907 1702215 1423696 1489431 1703638 2019336 1690952 1789671 2076363 1939160 1931961 1826908
16897 1826908 1743174 1547416 1395993 2002694 1878794 1890995 1929250 1906123 2100281 1778735
16887 1778735 2107157 2233347 2064417 2319790 2001541 2303743 2130335 2476690 2121630
16878 2121630 2156410 2137149 2295230 2140061 2197602 2334807 2608196 2415881 2443302 2585800
16868 2585800 2689437 2107617 2890855 2847188 3054267 3298173 2915452 2468949 2788044 2774270
16858 2774270 2876279 2861022 2886135 3244057 3137103 2829008 3323149 3500557 3294765 3420115
16848C420115L6325K51355N0878j657k61913J17507k44608M72820J11839j14173
16838C838488K40875p9781Q6708j54879J43676M9711Q1118K00805o5643j05225
16828D235853M09772o0752L78565p2617M02886n09404N02368N4289j85797N82491
16818E737654j12691J7197M13863p0416J0281q6677l646L99201Q0728M56468n7641
16807F784321m0115M64653Q8159j5395N56714l38273M97038J47366K5990K10332
16797H380790K56609J38881j12M44092M83515j620M18227M41274l88007M56386
16787A0630035J81836O80385J93133K56184O17805k30069O94607J93210P72670
16778A3989796L73615M79129k33946Q66899P30457L32265O46109K40165R86636
$$ plain form
16848 3420115 3456440 3707795 3758673 3757016 3495103 3612610 3368002 3840822 3952661 3838488
16838 3838488 4079363 3999582 4086290 3931411 4075087 4124798 4205916 4406721 4341078 4235853
16828 4235853 4645625 4584873 4963438 4890821 5293707 4784303 5286671 5340960 5155163 5737654
16818 5737654 5624963 5642160 6056023 5985607 5995888 5909211 5905565 6304766 6385494 6841962 6784321
16807 6784321 6744206 7208859 7297018 7281623 7838337 7500064 7997102 8144468 8170458 8380790
16797 8380790 8637399 8776280 8776168 9220260 9703775 9702155 10120382 10561656 10173649 10630035
16787 10630035 10811871 11492256 11685389 11941573 12559378 12329309 13023916 13217126 13989796
16778 13989796 14363411 14842540 14608594 15475493 16205950 16538215 17184324 17424489 18411125
16769A8411125N95364M17707P00021Q85411P38071J146880L18660J054520J037036
16760B5304795Q16442J126222J223355O55380J727995J211641J215449J400097
16752C4681376J795204J572249J656482J773703K195877K189954K533566J877032
16744E0275443K937756K738935L180555L133912K859937L924316L750584M102161
16736G6903599M786703M513188N025202N258965N240284O172094O055850O382831
16728A20338716O733909P197776O636332P530323O732323O607510O408142O041725
16720A74226756M948399M492220L421932K705119J047528l89633j301150k335814
16712A86815357l395238m375485n455267o013847o637818o661370o802522p669122
$$ plain form
16769 18411125 19006489 19424196 20124217 21009628 21747699 22894579 23213239 24267759 25304795
16760 25304795 26121237 27247459 28470814 29126194 30854189 32065830 33281279 34681376
16752 34681376 36476580 38048829 39705311 41479014 43674891 45864845 48398411 50275443
16744 50275443 53213199 55952134 59132689 62266601 65126538 69050854 72801438 76903599
16736 76903599 81690302 86203490 91228692 96487657 101727941 107900035 113955885 120338716
16728 120338716 127072625 134270401 140906733 148437056 155169379 161776889 168185031 174226756
16720 174226756 179175155 183667375 187089307 189794426 190841954 190452321 189151171 186815357
16712 186815357 183420119 179044634 173589367 167575520 160937702 154276332 147473810 139804688
16704A39804688p171250p211448o965732o134649o980399n925956n692813n655705
16696H8066736m878323m849754m203931m402466l565178l862293l425208l155532
16688E5724051k871846k418851k848658k286853k511926k048259j896378j598008
16680C7243272k014299j327276j646217j554567j469707p75713j656866q60122
16672B5938505j257082r02963p92173p96408q29799j023888p33332o73160r69581
16663A7960119k25938m91776r79081m75969l24634q59152r7368r02471k32092
16654A3371638l82517k41810k93652n71170k90810n39204j28007K9842n53167
16645A0401143j21096k95765n58049l88858j55623M4057o53443j49971J34471
$$ plain form
16704 139804688 132633438 125421990 118456258 112321609 105341210 99415254 93722441 88066736
16696 88066736 83188413 78338659 74134728 69732262 66167084 62304791 58879583 55724051
16688 55724051 52852205 50433354 47584696 45297843 42785917 40737658 38841280 37243272
16680 37243272 35228973 33901697 32255480 30700913 29231206 28455493 26798627 25938505
16672 25938505 24681423 23778460 22986287 22189879 21360080 20336192 19602860 18929700 17960119
16663 17960119 17734181 17242405 16263324 15787355 15462721 14603569 14506201 13603730 13371638
16654 13371638 12989121 12747311 12453659 11882489 11591679 11052475 10924468 10954310 10401143
16645 10401143 10280047 9984282 9426233 9037375 8881752 8925809 8272366 8122395 8256866
16636H256866l27991m91386J53624k16441r1864n38427O7381m00229K06886j25309
16626F493110l2946j9139m58327p3413K620m68560N4614k73592q0806K46042l84721
16615E004882j51347O9718k54554j22354P7882k24451j00545P2067n4981k43885
16605D072432l77700L69334j19879p0541k1751j39158r1450P716J16049l71284
16595C373768k78192J94366m0040L3871K76789l82670J76401l93193n1351j15831
16585B793918K70308Q6026j18535K0021k40142k01158m418k2480j56367j40027
16575B287146k06237M06588j38793j2130Q7355j00808l1908j48094k58694N15632
16565B400057k10813j89471N4735J69782j80202J96234k20058j46008K23067o8403
$$ plain form
16636 8256866 7928875 7437489 7591113 7374672 7282808 6744381 6811762 6411533 6618419 6493110
16626 6493110 6460164 6441025 5982698 5909285 5911905 5443345 5497959 5224367 5143561 5389603 5004882
16615 5004882 4853535 4923253 4668699 4546345 4624227 4399776 4299231 4371298 4316317 4072432
16605 4072432 3694732 4064066 3944187 3873646 3851895 3712737 3621287 3629003 3745052 3373768
16595 3373768 3095576 3289942 3249902 3283773 3560562 3177892 3354293 2961100 2909749 2793918
16585 2793918 3064226 3150252 3031717 3051738 2811596 2610438 2606020 2583540 2427173 2287146
16575 2287146 2080909 2487497 2348704 2336574 2423929 2323121 2291213 2143119 1884425 2400057
16565 2400057 2189244 1999773 2054508 2224290 2044088 2240322 2020264 1874256 2097323 2028920
16555B028920j66138r641m49798O78677l98904j70726q2156K00859n940K934N3633
16544A681720J74471j48514j36605k67874j50623O09201p9293r0653j32635j47488
16534A311707N9763K1285O9303l54547K63586j07299L54100j60430l90818K37453
16524A304103k44107K744Q8019q3306j04512L32576l09606L81171k13868j29466
16514A023748Q16m9353j04390L00092l2412p1430l07552L89327l9225l35022L10377
16503A084976J0927m5109k93779R0251r3902J32694l4240l4536J64652j42058
16493H39876j6164O141J4321K61982D19987K26173K57149l40644M5282K19650
16483H27597L72510D84954K64571O840Q9856j9433B91584K83911j07100K51719
$$ plain form
16555 2028920 1862782 1853141 1403343 2082020 1683116 1512390 1430234 1631093 1625153 1628087 1681720
16544 1681720 1856191 1707677 1571072 1303198 1152575 1761776 1682483 1591830 1459195 1311707
16534 1311707 1371470 1392755 1462058 1107511 1371097 1263798 1617898 1457468 1066650 1304103
16524 1304103 1059996 1062740 1150759 1067453 962941 1295517 985911 1367082 1153214 1023748
16514 1023748 1024564 975211 870821 1170913 1138501 1067071 759519 1148846 1109621 774599 1084976
16503 1084976 1095903 1050794 757015 847266 753364 886058 851818 817282 981934 839876
16493 839876 823712 829853 844174 1106156 419987 646160 903309 562665 607947 827597
16483 827597 1200107 484954 749525 756365 846221 826788 291584 575495 468395 720114
16473G20114L41259j39356k76660J02916j20272k0020J94906q3678k19509M23333
16463I23033l32262M670L02575A91453M34768J6226k22070L52580k33027q4195
16453D55735k10332K72819l7388A14800N56536k27010n9057N98614k82555l8749
16443F62579M9913j26573k70279J49538J65224k59500J88534Q2407j53943P1781
16433E59681B74251L0399K35882j72361J9375M5216K20804B84213K60485L0028
16423E74726k53508O87424B28322M1585p901J68249J7938L3731j50992J94545
16413E25477P2749B64683R5712n1474J05180J51226j01999j46061N6149j4554
16403C58862K90809j94108m9194j35197j6934K95121k35735L4424D2831O31310
$$ plain form
16473 720114 1061373 922017 645357 748273 628001 607981 802887 719209 499700 923033
16463 923033 590771 595441 898016 191453 626221 642447 420377 772957 539930 455735
16453 455735 245403 518222 480834 114800 671336 444326 385269 983883 701328 662579
16443 662579 712492 585919 315640 465178 630402 370902 559436 641843 487900 559681
16433 559681 274251 304650 540532 368171 387546 432762 653566 284213 544698 574726
16423 574726 321218 1008642 228322 269907 262006 430255 448193 481924 330932 525477
16413 525477 598226 264683 360395 308921 414101 565327 463328 317267 373416 358862
16403 358862 649671 455563 406369 271172 254238 549359 313624 348048 42831 674141
16393F74141B62527A24846K95920N0837j17178Q3429j21317j55861O21995C71504
16382B10549J81884A46089P0469C5501K73045k0434L8920K40680k46450O2240
16372C83502A26231C4549K87848J05491j08385K7620l8466K54031j23210A39915
16361D06780L8680G1216J25824B4567J57493g4761C84328A72555K41278H5539
16350G9810i5606C23107A05585J00125d815j36358C7910M6877L03376j51236a00619
16338A22976L40179N4594B34155j09175K38462j06695J38190Q8848o4847j85389
16328B33549K21104b38699E61274k23039j20937R079A03629K99785j06720b00074
16317D8257j1664M03488b3716n6501E1406L06219d4937C36251Q3326A31511K59204
$$ plain form
16393 674141 262527 124846 420766 471603 354425 437854 316537 160676 782671 371504
16382 210549 392433 146089 216558 35501 308546 288112 327032 567712 321262 383502
16372 383502 126231 34549 322397 427888 319503 347123 308657 562688 439478 139915
16361 406780 445460 71216 197040 24567 182060 -74761 384328 172555 413833 85539
16350 79810 -95606 323107 105585 205710 -4815 -141173 37910 84787 388163 236927 -100619
16338 122976 463155 517749 234155 124980 363442 256747 394937 483785 418938 233549
16328 233549 454653 -238699 561274 338235 217298 226377 103629 403414 296694 -200074
16317 48257 36593 440081 -23716 -80217 51406 357625 -44937 336251 419577 131511 390715
16306C90715j72130N0937J05597R5736B6930M99685A55242G4282J47928A02717
16295a20946C97691A50257M4223a6713B68351q8228K52450a2882A66495E775K45279
16284B51054N8206A42778C8903a55556D24791A9257M78788A52848m6270I919J67411
16273A77330a19691b6590B82001k3206L7324h0482A21212K2194B636a82270j1005
16262a93275A74886R6568k9912O9129F8460K22801j18688P443a0163j71160B16426
16250C3966b29982A78991P0594b65418C42937A00288L5252J00333a49352E3086
16239A17055J62975a5999C24656g6498a0703j20259C53815H9142c5690B24380
16228e9305l0742A32981k5970g9825C84264G0017a18356d0825j78665a07208D8714
$$ plain form
16306 390715 218585 269522 375119 470855 26930 526615 155242 74282 222210 102717
16295 -120946 397691 150257 194480 -16713 268351 180123 432573 -12882 166495 5775 251054
16284 251054 309260 142778 38903 -155556 424791 19257 498045 152848 106578 9919 177330
16273 177330 -119691 -26590 282001 258795 296119 -80482 121212 143406 2636 -182270 -193275
16262 -193275 174886 271454 241542 310671 68460 291261 172573 180016 -10163 -181323 216426
16250 33966 -229982 178991 249585 -265418 342937 100288 135540 235873 -149352 53086
16239 117055 280030 -15999 324656 -76498 -10703 -130962 353815 89142 -35690 224380
16228 -59305 -90047 132981 107011 -79825 384264 70017 -118356 -40825 -219490 -107208 48714
16216a05582B26662A09302D0213C712h1704A44285m3642L4824a41583B23270b45623
16204F2963c3556l6179j71163i1681G9162J7877R0046B2993a02784B90396F7048
16192e3199C47647a3185j37400j1083A46628g2581j0896j60467D6025K68649i9819
16180d9662B94430j10503p2019a24555k32641E3347K3522a17520j11422G623J1422
16169A9045a81604k15595A37403i7334A43796D7903a67234A91705K29739A80165
16158B20345a92078B44656N746I0667b4351j23995A52516J9949d7363A06365a2920
16146b57574A65790h5503j7953A75381a94747D03918i7907A1677Q7535a2723A04452
16134H2316J11971M6420a13599L902A37569E325a56938d5875r4163j67711A8006
$$ plain form
16216 -105582 226662 109302 40213 3712 -81704 144285 100643 135467 -141583 223270 -245623
16204 62963 -33556 -69735 -240898 -91681 79162 97039 187085 22993 -102784 290396 67048
16192 -53199 347647 -13185 -150585 -161668 146628 -72581 -83477 -243944 46025 314674 -99819
16180 -49662 294430 183927 111908 -124555 -357196 53347 76869 -117520 -228942 7623 19045
16169 19045 -181604 -397199 137403 -97334 143796 47903 -167234 191705 421444 180165
16158 220345 -192078 244656 250402 90667 -24351 -148346 152516 172465 -47363 106365 -12920
16146 -257574 165790 -85503 -103456 175381 -194747 403918 -97907 11677 99212 -12723 104452
16134 82316 194287 240707 -113599 -109697 137569 5325 -156938 -45875 -140038 -307749 18006
16122a45752O6467A28907E8618J98695b06746f0021a8784D3205R7299K54442B9151
16110h7941j26149c4872c556D4606a07066E1422K10413C2407i8786F58192e8420
16098A38991F2796b15327B9306a18743M6825B71137C398i473o3295A00704g7266
16086F436J19648a85456G1932b527j61421A54066l7616c28547A4213K06979a19361
16074b7090A07819c302k9629j92726f6371j82691A32203N447l3758d8899m0013
16063h8912j58958A27493B9995a91295n6124H5987a32375J0764m3974B68639b32560
16051B2758A0128J06711c2478D4217c13343B58419d2666k08035f3757B90320q3840
16040B06480Q5210c155D7428F498K25008a32801B13367b311j25736C4436L3913
$$ plain form
16122 -145752 -79285 128907 58618 257313 -206746 -60021 -18784 43205 140504 394946 29151
16110 -87941 -214090 -34872 -3556 44606 -107066 51422 261835 32407 -98786 658192 -58420
16098 138991 62796 -215327 29306 -118743 -71918 271137 3398 -9473 -72768 100704 -77266
16086 6436 126084 -185456 71932 -2527 -163948 154066 116450 -328547 14213 221192 -119361
16074 -27090 107819 -3302 -32931 -225657 -66371 -249062 132203 137650 103892 -48899 -88912
16063 -88912 -247870 127493 29995 -191295 -247419 85987 -132375 -121611 -165585 268639 -232560
16051 22758 10128 116839 -32478 44217 -313343 258419 -42666 -250701 -63757 290320 206480
16040 206480 291690 -3155 47428 6498 231506 -132801 213367 -2311 -128047 34436 68349
16029F8349f5569k67349A16794a60534j333B08867I4914C0272a5923A90455a48235
16017B58866p3439a58996k84740h9172F3248a58041B59197E5935K14484E3821
16006b15873k6742J03459A92254a27131A15358a83620b3975j0825A2031b2546
15995A74785c5914C39999b09434A61625O0512c60200A30781C2094K04955J85130
15985D22179C9392j6806J50483J19391j09945K51120A97756a72762A33313f9716
15974b7755p2691K9201b973A27717l7566J93793a88278P7880K5452H9067N1248
15963A40315d5437E6169a01131I3760D518O9181b39129i8563d3215B10313p7094
15952A33219P1478o3409C0491E099e9204l6309A9218f5272A09114e5620n9104
$$ plain form
16029 68349 -65569 -332918 116794 -160534 -161867 208867 94914 30272 -15923 190455 -148235
16017 258866 185427 -158996 -443736 -89172 63248 -158041 259197 55935 270419 53821
16006 -215873 -242615 -139156 192254 -127131 115358 -183620 -23975 -34800 12031 -22546
15995 174785 -35914 339999 -209434 161625 222137 -360200 130781 32094 237049 422179
15985 422179 39392 22586 173069 292460 182515 433635 197756 -172762 133313 -69716
15974 -27755 -100446 -71245 -2973 127717 90151 283944 -188278 -110398 -84946 89067 140315
15963 140315 -45437 56169 -101131 93760 4518 73699 -239129 -98563 -43215 210313 133219
15952 133219 204697 141288 30491 5099 -59204 -95513 19218 -65272 109114 -55620 -114724
15941a14724B10009a64770F0079i1355l719j09870o254g9417a6669j22362B92072
15929A46633a62743c3049r1221A10393h7085J1062B69457b86282b3562k04279
15919b27841d2332C37736j59387B8840d10615N6099F8277a3178A31657E7657a705
15907D1868a47796B8554a65741A86260c00236a35904I2756i8829B00263A7222
15896i5657j26874g349l19452G8368a905B91758A1983J68114c23339B13371B9724
15884A52931J9655a80941q3416B37772c77291a79696G5718d79950J84038J43631
15874a52281d8954A93306a65339p6090I1762e9784B22196Q0729g7833j87171N2907
15863b12097J3108A17572J53698a78616m8363B32478A11670b26978C67408d3256
$$ plain form
15941 -114724 210009 -164770 60079 -91355 -95074 -204944 -211198 -79417 -16669 -139031 292072
15929 146633 -162743 -33049 -124270 110393 -87085 -76023 269457 -286282 -23562 -227841
15919 -227841 -42332 337736 178349 28840 -410615 -354516 68277 -13178 131657 57657 -1705
15907 41868 -147796 28554 -165741 186260 -300236 -135904 92756 -98829 200263 17222
15896 -95657 -222531 -7349 -326801 78368 -1905 291758 11983 180097 -323339 213371 29724
15884 152931 172586 -180941 -264357 237772 -377291 -179696 75718 -479950 -295912 -152281
15874 -152281 -48954 193306 -165339 -241429 91762 -59784 222196 302925 -77833 -265004 -212097
15863 -212097 -198989 117572 271270 -178616 -226979 232478 111670 -226978 367408 -43256
15852c4329A00247Q0937p3569b60380b0829k07052j54419I5360a6613k64704J09808
15841a71509P7439a1764A26097j7607J0550f6978j2739A33372l4768i4874C14964
15829c49262a9236o5508j9434L2026j20706c5808G6506b80406g3702k09446H059
15817a9370H6496a88712M7264C2900b47746A72923F7580a45140c5130j25291a8373
15805a13561G3513b64360L1211B64491J83603b43282A2737b34817A84035J5575
15795A99610a64330B35551k571a55348b2405A2135e0017J940b3776r7799n1332
15784a72907d6719n33663B17798c7576A41737C8501K37731d5513k59719J24237
15774a80995r153A62704a3571B61203a3535A69368o8721a35358j17921i735A63327
$$ plain form
15852 -34329 100247 181184 107615 -260380 -20829 -227881 -382300 95360 -16613 -281317 -171509
15841 -171509 -94070 -11764 126097 108490 119040 -66978 -79717 133372 98604 -94874 314964
15829 -349262 -19236 -84744 -104178 -72152 -192858 -35808 76506 -280406 -73702 -283148 8059
15817 -19370 86496 -188712 -141448 32900 -247746 172923 67580 -145140 -35130 -160421 -18373
15805 -113561 73513 -264360 -233149 264491 448094 -243282 12737 -234817 184035 199610
15795 199610 -164330 235551 232980 -155348 -22405 12135 -50017 -48077 -23776 -121575 -172907
15784 -172907 -46719 -580382 217798 -37576 141737 38501 276232 -45513 -305232 -180995
15774 -180995 -190148 162704 -13571 261203 -13535 169368 100647 -135358 -253279 -9735 163327
15762H2487g5646q2752A41598F7377f2210B92811a82921D04482h0501A01057b62773
15750C66996c1701D00074c0444j61248E2779a11718A47917D9672K67522a5675
15739c07450B34403D2243k0432c06272l8728a62207O7956d1037a3512j6939I0395
15727a88733A47744b11926A65783B8313e8634I2026f5453K0954m3553o6139A28834
15715H9811a13993d7825B98086F9710b45376N2742Q7327b9085j81622C6840J07755
15704A44595b74831O6029m2138K0386I6908a0598C05226a36677A03266a31363
15693H1233L04843A50288g5622m01971D166O9351J0069A3777h2143G0525b17168
15681A14039n3177a67346e7136j91944I2450c0255H0250Q969e4364l6832B33167
$$ plain form
15762 82487 -75646 -158398 141598 67377 -62210 292811 -182921 404482 -80501 101057 -262773
15750 366996 -31701 400074 -30444 -191692 52779 -111718 147917 49672 317194 -15675
15739 -307450 234403 42243 21811 -306272 -345000 -162207 -94251 -41037 -13512 -30451 90395
15727 -188733 147744 -211926 165783 28313 -58634 92026 -65453 -44499 -88052 -154191 128834
15715 89811 -113993 -47825 298086 69710 -245376 -192634 -105307 -29085 -210707 36840 144595
15704 144595 -274831 -208802 -250940 -230554 96908 -10598 305226 -136677 103266 -131363
15693 81233 386076 150288 -75622 -477593 4166 73517 83586 13777 -82143 70525 -217168
15681 114039 60862 -167346 -57136 -249080 92450 -30255 80250 89219 -54364 -91196 233167
15669A82410p0231D7397J00411C6270K0717D716e5222A25436a0714D6607A0164
15657B04555a42088A10865a36081C9561K2307c98315A3119M9030J56038K12995
15647D31182b06522N290g8833j6512r9075B90412c42217A80671c13497e6151j27257
15636a83408A75966E6795J74566b57615a2013H5749a15022K4436G5716d1196J0028
15625c1168k09948A05079J59114j22420n4854J8104Q0784p6703a73403O047f9431
15613A25078a73409F5784N2352c77837A35664f0477l32363C97535G231i3761q6852
15602a80613j93007a14170j93984e2005n4557A64312G8371l6886i2039F5491B5753
15590a09162B6197d06990b00556j79467J64221D5239a4363D092M1515N3373O9794
$$ plain form
15669 182410 112179 47397 147808 36270 56987 4716 -55222 125436 -10714 46607 10164
15657 204555 -142088 110865 -136081 39561 61868 -398315 13119 62149 218187 431182
15647 431182 -206522 -201232 -78833 -95345 -194420 290412 -342217 180671 -313497 -56151 -183408
15636 -183408 175966 56795 231361 -257615 -12013 85749 -115022 -90586 75716 -41196 -31168
15625 -31168 -241116 105079 264193 141773 86919 105023 185807 109104 -173403 -167356 -69431
15613 125078 -173409 65784 118136 -377837 135664 -60477 -392840 397535 7231 -93761 -180613
15602 -180613 -373620 -114170 -308154 -52005 -106562 164312 78371 41485 -92039 65491 25753
15590 -109162 26197 -406990 -200556 -380023 -215802 45239 -14363 4092 45607 98980 168774
15579A68774b45614b7056n0826J5155A22297j0740d20713d5550B40710b70736
15568G4320b4752j25896g0325m5527C26382b82022E1127K14213j09947B6783J81571
15557B08354d3391C9571P4667a80096j13429A17470a97895F6059d9741P749p2410
15546a14402K9319k84911a81076f4480B7382g4030j38976l4926e4058A67533e4710
15534A77019H148h1842B71807a79136a5869B75835d7525j43133K0602K4651D6754
15522C48824j74042F629a90421P8481n7248d6571q2657j7605O516L9232i356A54404
15509A11701C3517F81L16861d41812C22171D4907a13414I4270R29b4226F7506
15497b4092A16389p073c61722K6560G185e3844m2002b7963k06140f991l05166
$$ plain form
15579 168774 -245614 -27056 -77882 -62727 122297 111557 -420713 -45550 240710 -270736
15568 74320 -24752 -150648 -70325 -115852 326382 -282022 51127 265340 155393 26783 208354
15557 208354 -43391 39571 114238 -180096 -293525 117470 -197895 66059 -49741 -41992 -114402
15546 -114402 -85083 -369994 -181076 -64480 27382 -74030 -213006 -247932 -54058 167533 -54710
15534 177019 8148 -81842 271807 -179136 -15869 275835 -47525 -190658 -170056 -145405 46754
15522 348824 174782 6629 -190421 -111940 -169188 -46571 -129228 -146833 -140317 -101085 -9356 154404
15509 111701 33517 681 317542 -441812 322171 44907 -113414 94270 95199 -24226 67506
15497 -24092 116389 109316 -361722 -335162 7185 -53844 -95846 -27963 -234103 -6991 -312157
15486c12157E6378a20195D23231A55989C1118g1466q3772N6509L6470o0281A61783
15474b63797F6930c30030a62974g1526B5570Q9666i8407A51155a38340M7423G6768
15462h3678j6405B00562a95770G000a3805E4705R0330J33249d8156B2697J59652
15451A82349c15440b7197C00202b08452A28457k8642j6122e2400R049A18036B5167
15439b15402I9523f0207J3010A03050E764J414a70982C10687a23914L3540B56161
15427c2641k65942A40221o83b47224A38095a5285C0323j393l887P081a21006C43336
15414a4708C26513f5514n0459a4726L231F9156a66480b2878o514B7074a96165
15402C5064N0593a22402A07591B9651M9135A104b75909E9894J12238l8618M6840
$$ plain form
15486 -312157 56378 -120195 423231 155989 31118 -71466 -155238 -98729 -62259 -122540 161783
15474 -263797 66930 -330030 -162974 -71526 25570 115236 -98407 151155 -138340 -90917 76768
15462 -83678 -100083 200562 -195770 7000 -13805 54705 145035 278284 -48156 22697 182349
15451 182349 -315440 -27197 300202 -208452 128457 99815 83693 -52400 -43351 118036 25167
15439 -215402 99523 -60207 -47197 103050 5764 7178 -170982 310687 -123914 -90374 256161
15427 -32641 -298583 140221 139538 -247224 138095 -15285 30323 28930 25043 32124 -121006 343336
15414 -14708 326513 -65514 -115973 -14726 -11495 69156 -166480 -22878 -29392 27074 -196165
15402 35064 85657 -122402 107591 29651 78786 1104 -275909 59894 172132 133514 180354
15391A80354H3274l1743M1145C694h1814q7522f6538B10249b83756a15668B53648
15379c29959K2736A00328c9007j53201A59882D5835J06108c53412J63814A25953
15368B70698a12607G7188k8571M47734j38002o168H1727K74433A14842a33628
15357d6289H7289E549b86762g4398J0134j22873H7406K15177f7714A41723d1356
15345A7297L44336R6681F3242C0063a74304B21158b47251B15625C388c3413B2183
15333h2698B54267g4087B94506j13419l3986n656h9869C82237b07735B1056D365
15321H3554J00395a19611B50577d4940A34698a06227I1085K7979a04434k8336
15311a32770j5096A39906l0539R344a11603I4856a77741f4776B66413J8782C5252
$$ plain form
15391 180354 83274 51531 92676 3694 -81814 -169336 -66538 210249 -283756 -115668 253648
15379 -329959 -307223 100328 -39007 -192208 159882 45835 151943 -353412 -189598 125953
15368 270698 -112607 77188 48617 496351 358349 352181 81727 356160 114842 -133628
15357 -46289 87289 5549 -286762 -74398 -64264 -187137 87406 302583 -67714 141723 -41356
15345 17297 361633 458314 63242 30063 -174304 221158 -247251 215625 3388 -33413 22183
15333 -82698 254267 -74087 294506 181087 147101 141445 -89869 382237 -207735 21056 4365
15321 83554 183949 -119611 250577 -44940 134698 -106227 91085 119064 -104434 -132770
15311 -132770 -147866 139906 109367 118711 -111603 94856 -177741 -64776 266413 285195 35252
15299c3260B26961J664f7719r3186n9868D9618a80641H8980P3703a07313p9532
15288a86845H0961J20430l8193E0832a27333A11795B672b70052A47101L22864
15278D69965A84826b17825F1384M9970b72497B53674B0674J79563C6897c31484
15267B76525D2340J53068a10479j38099C09069C4752D004J29631k8644i8301A67276
15255A89831H1923i7590A24858m3658K76777K37057m4500Q02069R3342n01181
15245I44764N10066m10182E05213B24749J0716A4968a99199H6637a05491A37081
15234A16858E0028a56056A92155a237G66c48363A70389K9238e8767B9096K76835
15223C05931j32687O2459f296j07372K4776q5904d0299D48603k20406H9831Q419
$$ plain form
15299 -33260 226961 228625 -67719 -160905 -220773 49618 -180641 88980 162683 -107313 -186845
15288 -186845 80961 201391 163198 50832 -127333 111795 2672 -270052 147101 469965
15278 469965 184826 -217825 61384 111354 -272497 253674 20674 200237 36897 -331484
15267 276525 42340 195408 -110479 -248578 309069 34752 4004 133635 104991 -98301 167276
15255 189831 81923 -97590 124858 81200 357977 595034 550534 1352603 1445945 944764
15245 944764 1454830 1044648 505213 224749 235465 14968 -199199 86637 -105491 137081
15234 116858 50028 -156056 192155 -1237 766 -348363 170389 199627 -58767 29096 305931
15223 305931 173244 235703 -6296 -113668 -88892 -174796 -40299 448603 228197 89831 98250
15212I8250a07330C5661a81475I4456g9460D9418O452L609K20179A31181F1083
15200A56675N3518e7903B3628P6115J55851c2268A49948a90119F8653f3208l44716
15189d07924B47220H6213h8955m610j06831B16178j05142c6783A68715q1596b17155
15177b55379G93i4084c5948B60150R8207r4638Q5760j21673A08050Q8760J9620
15166B16430e8404l0185A05979J59028E9251K52266A05132M9041d7447K0303B53065
15154A57284b5913l0684A99227J81295j9997A57667f1607A14999K90147J86109
15144E91255H94c05028n028B65825K17966A90827I4519J625K77536D4J4708J11619
15132A26371L23016a32372A22301l3012N3302M07285b03520B68256K545J8065
$$ plain form
15212 98250 -107330 35661 -181475 94456 -79460 49418 55870 59479 279658 131181 61083
15200 156675 210193 -57903 23628 99743 255594 -32268 149948 -190119 68653 -63208 -407924
15189 -407924 247220 86213 -88955 -93565 -200396 216178 111036 -36783 168715 87119 -217155
15177 -255379 793 -94084 -35948 260150 358357 263719 349479 227806 108050 196810 216430
15166 216430 -58404 -88589 105979 265007 59251 311517 105132 154173 -47447 -27144 253065
15154 157284 -25913 -56597 199227 380522 360525 157667 -61607 114999 405146 591255
15144 591255 894 -305028 -310056 265825 483791 190827 94519 96144 373680 44 14752 126371
15132 126371 449387 -132372 122301 89289 142591 549876 -203520 268256 270801 288866
15122B88866J33137A64244a11519C56999A51333n4336C8917K50513a7366A52510
15111B32996j09840M91646A76855i796D7044J95608a73436c0115G7742L85639
15101D63381F5481J77123I3257a07784b943C14047A06815K7600K98896B02438
15090g1479G9658J49986k6091L90150k63281j27083D1192L78083A70592p4398
15080I6194C2480K00029d6312c405k3436F8433a29318D21877q8319H13J16609
15069A17422a71118C90361j78733J83253b7665A6408a40749C09177j36762e9067
15058c6718j81501C92360a91991A7013M0188a63860B23081l6609i3846c0763B66948
15046B76070E6728O6381K39365e5129C00585A10250L20317L823E9437J77201i6104
$$ plain form
15122 288866 422003 164244 -111519 356999 151333 96997 38917 289430 -17366 152510
15111 232996 123156 614802 176855 -9796 47044 242652 -173436 -30115 77742 463381
15101 463381 65481 242604 93257 -107784 -2943 314047 106815 134415 433311 202438
15090 -71479 79658 229644 203553 593703 330422 203339 41192 419275 170592 96194
15080 96194 32480 232509 -46312 -3405 -26841 68433 -129318 421877 333558 813 117422
15069 117422 -171118 390361 211628 394881 -27665 16408 -140749 309177 172415 -59067
15058 -36718 -218219 392360 -191991 17013 57201 -163860 223081 186472 -93846 -30763 266948
15046 276070 56728 123109 362474 -55129 300585 110250 430567 434390 59437 236638 -96104
15034A26497K29239j01731F0403J48025h7301b5995D81948j06057A73235K12354
15024C85589a74593D16976a2486C27376a8232j80783I5636J06437f9124B13794
15013D60043K50495I4545a82303B02170L26212k38093n1692A00283J81040A39458
15002A40627o85J20166A11778K42392q7488K3914r6128L05149A36992J40943j2868
14991B65067n3331J63929k0575m6779J10930B967L20460k9817n7191L2805R0318
14980C59542j12316M01551A29406n3439l250K26318k0976D7667M79336j31213
14970C95790m8974j34282M8663D4838J61657l9557G9110P9600K59859l1831J87384
14959E74122j06600j0286j90576g41A84734J02978j31544E8165N4946f3390D94382
$$ plain form
15034 126497 355736 254005 60403 208428 -87301 -25995 481948 375891 173235 385589
15024 385589 -174593 416976 -12486 327376 -18232 -199015 95636 202073 -69124 213794
15013 460043 710538 94545 -182303 202170 528382 290289 238597 100283 281323 139458
15002 140627 139942 260108 111778 354170 266682 290596 194468 499617 136992 277935 265067
14991 265067 211736 375665 355090 308311 419241 2967 323427 293610 236419 269224 359542
14980 359542 247226 648777 129406 75967 72717 299035 278059 47667 527003 395790
14970 395790 346816 212534 261197 44838 206495 166938 79110 158710 418569 386738 574122
14959 574122 467522 457236 266660 -741 184734 287712 156168 58165 113111 -63390 494382
14947D48339I6117O5489l2722k460a3842D46082c296C23496L4049N94910B11839
14935E54851k28329J01458J0169B13883E5748K58548L7094C4870L75183j77948
14925B32105J98563A87712m4713J57360P5256j4540K70896A43080L2631n4359
14915A21352J09862J68056A8569N08548a6168B64254L15840A88198J60290j50014
14905A98474L39143A70930L02815r0459l1424A57331K60327j65198n5673J46803
14895C43590J7811j28500l1872K19756j89566m5347K86283i1998E45201k37086
14885C08115j1501q0801L76316B15583L72095j22476j77769F9457N59298j30434
14875D98321A63465K83086k6332M07031C74905A12050J49079k6546K45614O5347
$$ plain form
14947 448339 96117 161606 128884 126424 -13842 446082 -3296 323496 357545 952455 211839
14935 554851 326522 427980 438149 213883 55748 314296 351390 34870 410053 232105
14925 232105 430668 187712 142999 300359 375615 361075 631971 143080 175711 121352
14915 121352 231214 399270 18569 527117 -16168 264254 580094 188198 348488 198474
14905 198474 537617 170930 473745 383286 351862 157331 417658 252460 196787 343590
14895 343590 361401 232901 201029 420785 231219 185872 472155 -91998 545201 308115
14885 308115 296614 215813 592129 215583 587678 465202 287433 69457 628755 498321
14875 498321 163465 446551 420219 827250 374905 112050 261129 234583 480197 545544
14865E45544J12842Q3772C58634K28647B62086K04350K24582I3537L01200J64657
14855E59394B56110j828L15686J18387j82970k12237P1969n053m7114R4557R8935
14844E06442j02522m2754j6704J81576k1853J43209k72317K88505J17407k09149
14834E71840j25409q6393J29163J11783J4657k01286K08726j87808k3910j31203
14824B80160o2474J75969J08013J7311M30877k56261R6899l51286l3872M72242
14814H77578j94626M37J9702N4426j84462P5066k05123M0961j13458j00194J28657
14803C98964J17541A51302K22651J59030K71469l30474j61135K45357r1251J81219
14793F48168j87994N1036Q8452M11665C24798q1988L57778J1769j0056A69855
$$ plain form
14865 545544 658386 742158 358634 587281 262086 466436 691018 93537 394737 559394
14855 559394 256110 254282 569968 688355 505385 293148 365117 360064 312950 407507 506442
14844 506442 403920 361166 344462 526038 504185 647394 375077 663582 780989 571840
14834 571840 446431 360038 489201 600984 615641 414355 623081 435273 411363 280160
14824 280160 217686 393655 501668 518979 949856 693595 790494 439208 405336 877578
14814 877578 682952 683389 703091 757517 573055 648121 442998 483959 370501 270307 398964
14803 398964 516505 151302 373953 532983 804452 473978 312843 558200 466949 648168
14793 648168 460174 511210 599662 1011327 324798 242810 600588 612357 602301 169855
14782E32455L814l7599N0929J2954L0450P4459p2775K32843l75228J19682j5154
14771E56830K9303o9657Q5067j87669M85469l17419K65015j81066k6025p6256
14761E63592q7164J27128J6674j00285q5776J73139j0005L18228j56028k40172
14751E19331J70590J00052k88564L36134j18382J23455m9867k0164o8028n5348
14741F49209J47132j85043J69187k49158N41294l84522k88405M05319n0698J16339
14731H70654j37469j35578L19805o4193K6178Q1746k35304B39285O48858J18875
14721A007018l61917J83090m01942K78442l3957R1120L13845k63500J72243o6976
14711I17466J49641j70476j47741Q4956j95057K01543l11681N00226j48999K94145
$$ plain form
14782 532455 536269 498670 549599 562553 593003 667462 594687 827530 452302 571984 556830
14771 556830 586133 516476 601543 413874 899343 581924 846939 665873 639848 563592
14761 563592 476428 603556 620230 519945 434169 607308 597303 915531 759503 519331
14751 519331 689921 789973 501409 837543 719161 842616 792749 772585 704557 649209
14741 649209 796341 611298 780485 531327 1072621 688099 399694 805013 754315 870654
14731 870654 733185 597607 917412 853219 879397 961143 725839 239285 888143 1007018
14721 1007018 645101 828191 426249 704691 670734 761854 1075699 812199 984442 917466
14711 917466 1067107 896631 748890 833846 638789 840332 528651 1028877 879878 1174023
14701A174023l19748Q8726j68709R4305K47654k85598m7155k8047L32766j59207
14691I29010J41391j94834J48086J86372J00268k28070E28711N42194k16586L4118
14681H88437N4105j84897L58299N6543n71793M28390j21909M593M81793m37133
14671I56428J79059j72456q2657J60137l7515j28955L00345k43735j42387R8510
14661H86774L75595k21762N89342l81717m07048L74958m33370L82445K6146m86720
14651G04643K07310N4306K73902j2477M0538m04334L59105l62062J95038K18276
14641A274245O1172K4781l24416N15489m04466j42580L19462J1523l1252k9144
14631A274814J77973q7093j00653J4197K71483n19937J46204K87367k25430Q3980
$$ plain form
14701 1174023 854275 943001 774292 868597 1116251 830653 783498 755451 1088217 929010
14691 929010 1070401 875567 1023653 1210025 1310293 1082223 528711 1070905 854319 888437
14681 888437 942542 757645 1115944 1172487 600694 1029084 907175 911768 1393561 956428
14671 956428 1135487 963031 880374 1040511 1002996 874041 1174386 930651 788264 886774
14661 886774 1262369 1040607 1629949 1248232 841184 1216142 782772 1165217 1191363 704643
14651 704643 911953 966259 1240161 1227684 1268222 863888 1222993 860931 1055969 1274245
14641 1274245 1335417 1360198 1035782 1551271 1146805 1004225 1323687 1335210 1303958 1274814
14631 1274814 1452787 1365694 1265041 1279238 1550721 1030784 1176988 1464355 1238925 1322905
14621A322905L80864l98767L11069l8889j11811L36563l40106o275R9172j74495
14611A380230L41412k40920N0444j864K1744K89458J74456k49505j40579j20923
14601A503953K66009n6934M2815q2393j33714J9722L70491j61477m1974R0911
14591A817409k3475m11825N73918k19981j36919K76183P9465l50731M43364j80037
14581A867371L13426l15007J84351Q4339J81982k51306L7045j1731l31o6483L52512
14570B376168l06409K88428j2643J7599L7258L52143l32714K83661r2267l06176
14560B305048M83003O9632Q8077K7524J90512J24411K00190P16891j59227Q12439
14550D858500J096954K731103L494534P978583J7963095P530211B2494403A0896515
$$ plain form
14621 1322905 1703769 1305002 1616071 1577182 1465371 1801934 1461828 1455553 1554725 1380230
14611 1380230 1721642 1480722 1531166 1529302 1551046 1840504 2014960 1765455 1624876 1503953
14601 1503953 1769962 1713028 1755843 1673450 1539736 1559458 1929949 1768472 1726498 1817409
14591 1817409 1793934 1382109 1956027 1736046 1599127 1875310 1954775 1604044 2047408 1867371
14581 1867371 2180797 1865790 2050141 2134480 2316462 2065156 2102201 2090470 2090139 2023656 2376168
14570 2376168 2069759 2358187 2345544 2363143 2400401 2752544 2419830 2703491 2611224 2305048
14560 2305048 2788051 2857683 2945760 2973284 3163796 3288207 3488397 4205288 4046061 4858500
14550 4858500 5955454 8686557 12181091 20159674 38122769 45652980 22494403 10896515
14541D988932k100231n63344l05508j93096K10497K2017m42746M43268q9474J56126
14531B126441n97624P26775r9850o7505K98218j93489J65579j06584J92242J1862
14521B456065L69580m99425L43123j0445K74536j10995o03767N23507J5548j67637
14511B590090L33848l33665K11300q0713j1214N5788K22136r0935K93198l74606
14501B815227J67381K4971J03156J24067N4477j89917l36870J23139M92749M55658
14491C834038m30969K2732K51154j68327J67169q5221L15505l90638K8052R6170
14481C639665l641J69139J74805j19137L4183m4650J50675J03839m1879K00567
14471D263566K29736l90563R1492J35028K69857j73151j31015K76923l885l53355
$$ plain form
14541 4988932 2888701 2325357 2019849 1826753 2037250 2059267 1616521 2059789 1970315 2126441
14531 2126441 1528817 2255592 2155742 2088237 2386455 2192966 2358545 2251961 2444203 2456065
14521 2456065 2825645 2326220 2669343 2658898 2933434 2822439 2218672 2742179 2757727 2590090
14511 2590090 2923938 2590273 2801573 2720860 2709646 2765434 2987570 2896635 3189833 2815227
14501 2815227 2982608 3007579 3110735 3234802 3289279 3099362 2762492 2885631 3378380 3834038
14491 3834038 3403069 3425801 3676955 3508628 3675797 3590576 3906081 3515443 3543495 3639665
14481 3639665 3636024 3805163 3979968 3860831 3895014 3850364 4001039 4104878 4062999 4263566
14471 4263566 4493302 4102739 4194231 4329259 4599116 4425965 4294950 4571873 4567988 4214633
14461D214633O48132q9267k0611K97574l15211K11563r8317N72229j26518m00885
14451D893322M09550R9780m2060l510J73242L68888j82182K7367L69309j34085
14441E979621J58060K15830j42849j04825M91403p471m78766L08925M30743P202
14431F857873k35801L25576Q16844n56975J29510L0873k06203Q9745L52176K9955
14421G633573K33422k33005K51410M7271K0085L51023K49624K5507J3603L18575
14411H911088O6801J09571J54689M2022K41910K22017j40500N93307j18445K29816
14401A0312276J53635K82740m47976P86420j11664L97522R9199P5858M13585N5431
14391A2017026M9005N30154P5321K92985o2984L06478M77631m6255N28825M77000
$$ plain form
14461 4214633 4862765 4773498 4752887 5050461 4735250 4946813 4848496 5420725 5294207 4893322
14451 4893322 5302872 5402652 5360592 5357082 5530324 5899212 5717030 5744397 6113706 5979621
14441 5979621 6137681 6353511 6210662 6105837 6597240 6589769 6111003 6419928 6850671 6857873
14431 6857873 6622072 6947648 7764492 7207517 7337027 7367900 7161697 7251442 7603618 7633573
14421 7633573 7866995 7633990 7885400 7932671 7952756 8303779 8553403 8578910 8592513 8911088
14411 8911088 8977889 9087460 9242149 9284171 9526081 9748098 9607598 10200905 10082460 10312276
14401 10312276 10465911 10748651 10300675 11087095 10975431 11372953 11472152 11548010 11961595 12017026
14391 12017026 12066031 12596185 12671506 12964491 12901507 13207985 13685616 13639361 14168186 14645186
14381A4645186j50338M34716j1360N32791L70447J04066L08599O56448O4497M24248
14371A7379300j68222O74461K31086Q03756L33360J79149L57358Q91870P093O03253
14361B1292464L70400O30900L31070P09559K73060P62888P37098L44866O86332
14352B6138637M88089N71146M83958J225988L62892Q71957P35204J014307N26625
14343C2418803R86994P85239J020746R01787J007336J179474J070120J505327
14335D0875826Q39158Q79134J658466J524393J045979J575943J411437J533500
14327E1343836K089971J310563K004015J934455K080108J836271K732843J709413
14319F7041475K762368K691838K405607L296068K495993L484359L182128L804786
$$ plain form
14381 14645186 14494848 14929564 14918204 15450995 15821442 15925508 16234107 16890555 16955052 17379300
14371 17379300 17211078 17885539 18116625 18920381 19253741 19432890 19790248 20682118 20689211 21292464
14361 21292464 21662864 22293764 22624834 23334393 23607453 24370341 25107439 25452305 26138637
14352 26138637 26626726 27197872 27681830 28907818 29270710 30142667 30877871 31892178 32418803
14343 32418803 33405797 34191036 35211782 36113569 37120905 38300379 39370499 40875826
14335 40875826 41714984 42594118 44252584 45776977 46822956 48398899 49810336 51343836
14327 51343836 53433807 54744370 56748385 58682840 60762948 62599219 65332062 67041475
14319 67041475 69803843 72495681 74901288 78197356 80693349 84177708 87359836 91164622
14311I1164622L520441M013458M112469M419763M903127M630609N109902N708499
14303A27582890N688501O536536O665807O782424P484687P675834Q182628Q745360
14295A85344667Q910928R706923J0198982J0621362J1099910J2438271J2129902
14288B60450945J3036353J3515281J4099162J4323262J4912155J4996883J4968472
14281C60302513J5200362J4928142J4300265J3687863J3330582J1613163R963405
14274D53326295O783620J742224N08410O88237K78591j83838n688376m158985
14266D53296178n079165r314306j1975688j3112385j4438737j4973004j5454050
14259C68948843j5924355j6233277j5558974j5423304j4998818j3689449j3466200
$$ plain form
14311 91164622 94685063 98698521 102810990 107230753 112133880 116764489 121874391 127582890
14303 127582890 133271391 139807927 146473734 153256158 160740845 168416679 176599307 185344667
14295 185344667 194255595 203962518 214161500 224782862 235882772 248321043 260450945
14288 260450945 273487298 287002579 301101741 315425003 330337158 345334041 360302513
14281 360302513 375502875 390431017 404731282 418419145 431749727 443362890 453326295
14274 453326295 460109915 461852139 462360549 463048786 463327377 463143539 457455163 453296178
14266 453296178 448217013 438902707 426927019 413814634 399375897 384402893 368948843
14259 368948843 353024488 336791211 321232237 305808933 290810115 277120666 263654466
14252B63654466j3302058j2542586j2069915j1327711j0605082j0018061r666198
14245A84122855q668257q086399p983979p623509p053288o770286n975985n605857
14237A26355295n889977m538429n601098m339073m411963l842469l552141l635696
14229I0544449l918882l638036k840956l276559k985202k668330k194980k982152
14221F6039352k361242j775368k100182k209625j888978j602321j751583j369337
14213E0980716j284797j789921j480489j510915j316463j013683p84440j240914
14205D0559094j030933j183501j173375j075526j129702j31974j029353j430640
14197C2374090r82368n34369p61435n20195n97655n58988j397089k39700n76287
$$ plain form
14252 263654466 250352408 237809822 225739907 214412196 203807114 193789053 184122855
14245 184122855 175454598 167368199 159384220 151760711 144707423 137937137 131961152 126355295
14237 126355295 120465318 115926889 110325791 105986718 101574755 97732286 94180145 90544449
14229 90544449 86625567 82987531 80146575 76870016 73884814 71216484 69021504 66039352
14221 66039352 63678110 61902742 59802560 57592935 55703957 54101636 52350053 50980716
14213 50980716 49695919 47905998 46425509 44914594 43598131 42584448 41800008 40559094
14205 40559094 39528161 38344660 37171285 36095759 34966057 34834083 33804730 32374090
14197 32374090 31391722 30857353 30095918 29575723 28978068 28419080 27021991 26782291 26206004
14188B6206004o53872o32087n28762l13647q44497o09620l41188m52081p90000
14179B1040250o287o03383l69447n32527l23414m30389k59631l57696m29613j92448
14169A7535415n74105k58092m43893l65341k85580R7082m87421m628l17788k72268
14159A4623381k17139k94434m21060l76048k42471L31300n28430k7925k92040
14150A2555134k50382L6327l49123l86979m8704j83798J7694l56582l93929K77790
14140A0917448n55242K6077K6341k36800j16392m76107j42804O7024l43747J48703
14130I314501n4300n15181o3877L4073P5806q5094l46854m8941K1089n61162N03457
14119H273517o52972o2434N4738J22666l65719j89226Q5054J31862l22255K00771
$$ plain form
14188 26206004 25552132 24920045 24391283 24077636 23233139 22623519 22282331 21830250 21040250
14179 21040250 21033963 20430580 20061133 19528606 19205192 18774803 18515172 18157476 17727863 17535415
14169 17535415 16961310 16703218 16259325 15893984 15608404 15705486 15218065 15213437 14895649 14623381
14159 14623381 14406242 14111808 13690748 13314700 13072229 13403529 12875099 12847174 12555134
14150 12555134 12304752 12341079 11991956 11604977 11556273 11372475 11390169 11033587 10639658 10917448
14140 10917448 10362206 10388283 10414624 10177824 10061432 9585325 9442521 9509545 9165798 9314501
14130 9314501 9260201 8745020 8681143 8715216 8791022 8705928 8359074 8310133 8331222 7770060 8273517
14119 8273517 7620545 7558111 7612849 7735515 7369796 7180570 7265624 7397486 7075231 7276002
14109G276002j99529j34747k80976k5107k39488j57416J95908K8316l20084q6157
14099F056722J34817M3030N4448m01714R2052K523k57053l7229j87771j08204
14089E391621P9117j67204J53575q131p0788R4631l27066l28582J90133j17514
14079D889792N25805n55019j05800J44501l77379K03275j89044j4537J69493j66707
14069D524380j8123k15698M9771J18297l23968o5557q3847N46039m60224J43072
14059D214142R8134N3957J69953o99485R5126j0127j67154j59658J07732K23968
14049C926588j46659L6163j13938k45515K3165Q4891k42565l0623L76744m40379
14039C227872K12543j16331l07728k02560K49090J94992K51967m03310Q6885L29071
$$ plain form
14109 7276002 7076473 6941726 6660750 6635643 6396155 6238739 6434647 6462963 6142879 6056722
14099 6056722 6191539 6234569 6289017 5887303 5979355 5981878 5724825 5687596 5499825 5391621
14089 5391621 5470738 5303534 5457109 5448978 5378190 5472821 5145755 4817173 5007306 4889792
14079 4889792 5415597 4860578 4754778 4899279 4521900 4725175 4536131 4521594 4691087 4524380
14069 4524380 4506257 4290559 4340330 4458627 4134659 4069102 3985255 4531294 4071070 4214142
14059 4214142 4312276 4366233 4536186 3836701 3931827 3921700 3754546 3594888 3702620 3926588
14049 3926588 3779929 3816092 3702154 3456639 3479804 3564695 3322130 3291507 3668251 3227872
14039 3227872 3440415 3324084 3016356 2813796 3062886 3257878 3509845 3106535 3193420 3522491
14029C522491l82744J07039k94395J37945R1770j29166L7820j83452j29156j2622
14019B765530K46262j71677K26949m12289L09886m04368l9101O7950o9516O02
14009B520228L5033j93518O7850k01099K44134o6600k18656J03713j76554J09835
13999B224366K26187m36542Q1964R3804R0808m69918M92992l32995L62052K41805
13989B574523J833892K956118O166073J7006752J6288611j9931218j2523900n884225
13981H486626k715131r77316o67719m71306j57868m52644K5539k87571q9202p8299
13971B615109j55411j4840J99712m14408j60407J30379j11250M271K13359j69493
13961B137021M29624l53536j86435K15308k2013j23329k54581Q6733O3996M898
$$ plain form
14029 3522491 3139747 3246786 2952391 3090336 3182106 3052940 3090760 2907308 2778152 2765530
14019 2765530 3011792 2840115 3067064 2654775 2964661 2560293 2521192 2589142 2519626 2520228
14009 2520228 2555261 2361743 2429593 2228494 2472628 2406028 2187372 2291085 2114531 2224366
13999 2224366 2450553 2014011 2095975 2189779 2280587 1810669 2303661 1970666 2332718 2574523
13989 2574523 4408415 7364533 13530606 30537358 46825969 26894751 14370851 8486626
13981 8486626 5771495 4794179 4126460 3655154 3497286 3044642 3070181 2782610 2693408 2615109
13971 2615109 2459698 2444858 2644570 2230162 2069755 2200134 2088884 2093155 2306514 2137021
13961 2137021 2566645 2213109 2026674 2241982 2219969 2096640 1842059 1928792 1992788 1997686
13951A997686m7792L89854l89553k86206K09665J23533k48445Q1646r9107j63290
13941A567991M63768J04293j54978j40472j65399Q5913m3761j60246P4585J29898
13931A761592p5656q8935K40385n1241j24613R9983l6185n39424M03236J16887
13921A706029k47887q1630J96819Q9865l7481k05177K09880l42343O0305J44645
13911A493025o4604m7206m9291J9445K01089L7666m0376M3684j95625O3262j59483
13900A301586l93320P35889q4558l69805L04253k73977O9960k0822q2695L7082
13890A223593M7787j96195L56007K7648k53101N7028R6315K6246l5221l61478
13880I88629L68052j73853L65892l35830J58999m36587J30205Q3786j77277L59518
$$ plain form
13951 1997686 1949894 2339748 1950195 1663989 1873654 1997187 1748742 1830388 1731281 1567991
13941 1567991 2031759 2136052 1981074 1840602 1675203 1761116 1717355 1557109 1631694 1761592
13931 1761592 1685936 1597001 1837386 1786145 1661532 1761515 1725330 1185906 1589142 1706029
13921 1706029 1458142 1376512 1573331 1663196 1625715 1420538 1630418 1288075 1348380 1493025
13911 1493025 1428421 1381215 1331924 1351369 1552458 1590124 1549748 1593432 1397807 1461069 1301586
13900 1301586 908266 1644155 1559597 1189792 1494045 1220068 1290028 1269206 1186511 1223593
13890 1223593 1271380 1075185 1431192 1458840 1205739 1262767 1359082 1385328 1350107 988629
13880 988629 1356681 1182828 1548720 1212890 1371889 935302 1065507 1149293 972016 1331534
13870A331534q5081j51236L37784j40575j36553J37627o7935k39424J74714m1872
13860A118983l85786K91758J26054j88281P0544j14946K82087l6535k15490Q9434
13850A037822q2589K3125J31897j00864M1012N7536k83683l7949J67758j09876
13840H44189L3356K11519j56535j59128L72622P7513k34190j10383J28166l0660
13830I76469j54514J13399j4201K39304p1203j31823K67778m60772j33869M79917
13820A110485m18867J52182P7227K99071k88532l85828M29092L09594l11250n9277
13810I13897n2628r020R9953q4553K8758M31020n27328L60422k30222k17550p2428
13799F40321J35439J13582Q3822k16695J066J35478j0231J45034l59646O0307
$$ plain form
13870 1331534 1246453 1095217 1433001 1292426 1155873 1293500 1225565 986141 1160855 1118983
13860 1118983 733197 1024955 1151009 962728 1033272 918326 1200413 1163878 948388 1037822
13850 1037822 955233 978358 1110255 1009391 1050403 1107939 824256 786307 954065 844189
13840 844189 877545 1089064 932529 773401 1146023 1223536 989346 878963 1007129 976469
13830 976469 821955 935354 921153 1160457 1089254 957431 1225209 764437 630568 1110485
13820 1110485 691618 843800 921027 1220098 931566 545738 974830 1284424 973174 913897
13810 913897 861269 852249 952202 867649 896407 1327427 800099 1160521 930299 712749 640321
13799 640321 775760 889342 973164 756469 757535 893013 882782 1027816 668170 728477
13789G28477P699J42717j00195k14532n9222K33986L86919j57304o2858j87750
13779G17937K01141l41796K99436j21140j10322M1182p6932K27992D08344K51884
13769F60228k71216N90345k94102k309q5198N521J3499K9184K53651k60627p0639
13758E68337k4117J10242K18206j22581J71704k92887P0356j03577j08274M38052
13748I25461m52355K56984q0409r0693p6347M3168K03038K4312k65505J36261
13738F23915j02550L60563k20629j21781k07679K91379J09638l21933L64306j38423
13728F36806O0309N4595B67803M44275n5944j7879J03734k69018K73343k49658
13718D96656l5039N3182K02823k51489J93877K4451J53180j37740C17708J92514
$$ plain form
13789 728477 736176 878893 778698 564166 504944 738930 1125849 968545 905687 717937
13779 717937 919078 577282 876718 755578 645256 686438 609506 837498 408344 660228
13769 660228 389012 979357 685255 682946 597748 603269 616768 645952 899603 638976 568337
13758 568337 544220 654462 872668 750087 921791 628904 699260 595683 487409 925461
13748 925461 473106 730090 649681 558988 482641 525809 728847 753159 487654 623915
13738 623915 521365 881928 661299 539518 331839 623218 732856 410923 775229 636806
13728 636806 697115 751710 267803 712078 656134 638255 741989 472971 746314 496656
13718 496656 461617 514799 717622 466133 660010 684461 837641 699901 317708 510222
13708E10222R726l5897J61059o3186p2369L8883p8497K36595r5508J22498j98866
13697E34660K41275C79277N56249C76808r794J16690M52464l16603M1802k34720
13687D26647K74074l36812J00443J15121B38667N67238C39943J73044n744j62083
13677C45160J30212L72876l54558J6262J45229j25921J62204B49465L09266J61649
13667G20380j62960j39522G9976K77957K49962B84849Q2440L79502k34736P1425
13657E83480k32226J11849Q1284I8071N19908j13724k36054K99416j86292M3700
13647D25025q6132L31004k77644l9580K03757j18079n5580L5233j00084P4754
13637C92674H5434K51352L13417m6845P866j99721J28362A98549K68490P5125
$$ plain form
13708 510222 519948 484051 645110 581924 509555 548438 469941 706536 611028 733526 534660
13697 534660 775935 379277 935526 376808 367014 483704 936168 619565 661367 426647
13687 426647 700721 363909 464352 579473 238667 805905 339943 512987 507243 345160
13677 345160 475372 848248 493690 509952 655181 529260 691464 249465 558731 720380
13667 720380 557420 417898 79976 357933 607895 284849 367289 746791 512055 583480
13657 583480 351254 463103 544387 98071 617979 504255 268201 567617 381325 425025
13647 425025 338893 669897 392253 352673 556430 438351 382771 418004 317920 392674
13637 392674 85434 336786 650203 603358 611224 411503 539865 198549 467039 542164
13627E42164B44227M10666j14236r8970j45370J31813j04036o2356J02102K58370
13617F22210Q0397l45277j33105K76397j01993M3309M0513O5344j04018j99701
13607B44076N34475B67300J32054j39028J44949A42689a50736C05505Q8037j35199
13597B58343L64588k00673J13485j57767A65159L82798l0181k15027A04391L04670
13587D09061g1767D79167j12271J50639A41342P9933K48097K3595r2546J42178
13577E42599k49620A04352K40347b14505D15704A03087J67451L05668b78312C12934
13566B86064m0351L83603B69521Q2935J80021k10440R5662K99129j50299k62577
13556C03952Q6787n0176C0120K97990j06990P3713K06879j24566A83344o1748
$$ plain form
13627 542164 244227 654893 540657 441687 296317 428130 324094 261738 363840 622210
13617 622210 702607 357330 224225 500622 398629 441938 482451 547795 443777 244076
13607 244076 778551 267300 399354 260326 405275 142689 -150736 305505 393542 258343
13597 258343 622931 422258 535743 377976 165159 547957 517776 302749 104391 409061
13587 409061 -71767 479167 366896 517535 141342 221275 469372 492967 400421 542599
13577 542599 292979 104352 344699 -214505 415704 103087 270538 576206 -278312 312934
13566 286064 245713 629316 269521 352456 532477 322037 417699 716828 566529 303952
13556 303952 390739 340563 30120 328110 221120 294833 501712 377146 183344 121596
13546A21596J96047l5880J24123J8989j3462H569M43730J39648k10431j52330
13536B29186O878J69083j92674P5209N7260j3054p992O2079L21202l30931K77004
13525F53250C26460A58537J24395k3452J3613L2216r9015K4969n3302J91708J32013
13514E01682a57197D03764q6112j28705r3826M2398J44589L2417A21551M25271
13504E46822B59960K75205k04305j02307M6427J41584A96719R1180J83963Q5065
13494E56927k54189k5797j22230O78094B41423n0456J9572N9640r9646K75077
13484D45610q1768k176l745J55605k54362J58009A22129J87587M69921C3907N9489
13473I3396K51123N4118K41433A17343N498k4393g5105A44181r525J29190o8999
$$ plain form
13546 121596 317643 281763 405886 424875 411413 8569 452299 591947 381516 229186
13536 229186 236064 405147 212473 287682 344942 331888 323896 385975 707177 376246 653250
13525 653250 326460 158537 282932 259480 273093 305309 206294 231263 177961 369669 501682
13514 501682 -157197 403764 317652 188947 95121 137519 282108 314525 121551 546822
13504 546822 259960 535165 330860 228553 274980 416564 196719 287899 471862 556927
13494 556927 302738 276941 154711 832805 241423 190967 210539 270179 170533 445610
13484 445610 363842 361666 357921 513526 259164 417173 122129 309716 779637 33907 93396
13473 93396 344519 398637 640070 117343 122841 98448 -75105 144181 134656 263846 194847
13462A94847K07828e2606G4043J55591J74396m6072A09480J14729j4446I0947
13451E42528A24800m67J74928J84725A51366E8125K00032J18463j30842M1941
13441B87719J77679A23344l3954K13839J7805n5207n309P9474A22217J58798A25009
13429B07114N1523J68115j89254c4804k7513A54165Q1423I8997L34631K7786j51045
13418C10369D1018K76183q299J30553D6491J28021a59248D13376j11798c6214
13407A81096K0718K25124M0387j55659l3930r56o4852q3695L3442O8715I1705
13395C67889k1862J5868j38217J33546i8018H5547P7432b62404A48024J78760
13385C26784c952j19316C60880r2495n9934j02731K3658Q8369J16930M7915r3303
$$ plain form
13462 194847 402675 -52606 74043 229634 404030 357958 109480 224209 209763 90947
13451 542528 124800 124333 299261 483986 151366 58125 258157 376620 245778 287719
13441 287719 465398 123344 89390 303229 321034 265827 260518 339992 122217 281015 125009
13429 207114 258637 426752 237498 -34804 -62317 154165 235588 98997 433628 461414 310369
13418 310369 41018 317201 308902 439455 46491 174512 -159248 413376 301578 -36214
13407 181096 201814 426938 467325 311666 277736 276780 211928 128233 161675 230390 91705
13395 367889 346027 361895 223678 357224 -98018 85547 162979 -262404 148024 326784
13385 326784 -3952 -123268 360880 268385 208451 105720 129378 217747 334677 382592 289289
13374B89289j3866r2214C8753i195C55354Q2364j06893r953m2116K68606B51257
13362B89121j07652a79014D96086A43527h3543C83959m0695J79452k37116b12507
13351B51277E6470e8295D65834j58352A47653J95136E7596J58533n1214K53586
13341D18501A75076m148M3570N1084N0215j29853J89052j9344a63401B44013A06038
13329H9016K75032F9482J75912g458D67197I7833b09400d7579o7574B10833j5676
13318A95157M493h1938E19636A43518n64K52482H3024k6052f8006B44543p2883
13307A71660n9049R2279J26777r3190a9527A45204K07809n3125m6675q4733J4277
13296A82757J20931K0463c21632g2324H5650D2175J59527K3716a01877C54635
$$ plain form
13374 289289 275423 183209 38753 -9195 355354 437718 330825 320872 278756 547362 251257
13362 289121 181469 -179014 496086 143527 -83543 383959 343264 522716 285600 -212507
13351 251277 56470 -58295 465834 307482 147653 342789 57596 216129 164915 418501
13341 418501 175076 170928 214498 265582 315797 185944 374996 355652 -163401 244013 106038
13329 89016 364048 69482 245394 -7458 467197 97833 -209400 -47579 -115153 210833 195157
13318 195157 199650 -81938 519636 143518 142954 395436 83024 56972 -68006 244543 171660
13307 171660 112611 204890 331667 238477 -19527 145204 353013 299888 253213 168480 182757
13296 182757 303688 324151 -321632 -72324 85650 42175 201702 225418 -101877 354635
13285a29350B36000A3663J63954L4500h8575B74933i4000A0069Q0262N5498l1619
13274A14210C2610i5727D0044b74832A53711p5385K46470r3957A9856b39614B57861
13262a8665E49036G2827i9327H9819J44033d5362B38162a51575A12912J77139
13252B90051P5623p7797j20863e1270D52510A93716B0399J08093i1889F10070
13241a23392D22395j49962j26002J27339g0203n4898A48176o3890c26445H7195
13230h7830E14830D7470O0311R4074a35802A48162K7822J73711j53145P5240J29525
13219D01315O351A19624a30990L0417b2694k1926h773o49A07752K4066M7536n6915
13207A22439K03299a26241A43771J20455o9525b35275g7582A80417a31855O2628
$$ plain form
13285 -129350 236000 13663 177617 212117 -88575 274933 -94000 10069 90331 145829 114210
13274 114210 32610 -95727 40044 -274832 153711 78326 324796 230839 19856 -239614 257861
13262 -18665 549036 72827 -99327 89819 233852 -45362 238162 -151575 112912 290051
13252 290051 365674 287877 167014 -51270 452510 193716 20399 128492 -91889 610070
13241 -123392 422395 272433 146431 273770 -70203 -125101 148176 84286 -326445 87195
13230 -87830 514830 47470 107781 201855 -135802 148162 175984 349695 196550 271790 401315
13219 401315 407666 119624 -130990 -100573 -22694 -44620 -8773 -9422 107752 131818 179354 122439
13207 122439 325738 -126241 143771 264226 194701 -235275 -77582 180417 -131855 -69227
13197f9227b7495F2436K29052b06482D68129a34098A17889O1799c06919i4399
13186D16803B01083J63288A38534N1500A2744K8363J80131q7337b84889A47383
13175d0919j17904b0069j63173C97110N9302A92178J94176j12372r1244q1987
13165A00751D1502J94315f9205I0962N7561a1713j48735A8767L00729f1805D4993
13153a30993B62417a69271D07891a7844m368B68611q9722d2703C01336K089I3686
13141a58619E522J4430N2936a42679f1236C64474A33299o0179J23496a96234f8135
13129C14855j46008N2142n9763e1215C8940K09844h8591C01125c37947D02462
13118A27559M1826a06891k88523B00745E5231A6117K61157a72554C32892E2865
$$ plain form
13197 -69227 -27495 62436 291488 -206482 468129 -134098 117889 179688 -306919 -94399
13186 416803 201083 364371 138534 190034 12744 41107 221238 133901 -284889 147383
13175 -40919 -158823 -20069 -183242 397110 456412 192178 386354 273982 182738 100751
13165 100751 41502 235817 -69205 90962 148523 -11713 -160448 18767 319496 -61805 44993
13153 -130993 262417 -169271 407891 -17844 -22212 268611 178889 -42703 301336 303425 93686
13141 -158619 5522 19952 72888 -142679 -61236 364474 133299 73120 196616 -196234 -68135
13129 314855 168847 220989 161226 -51215 38940 248784 -88591 301125 -337947 402462
13118 127559 169385 -106891 -395414 200745 55231 16117 277274 -172554 332892 52865
13107i3877D1683J32930k6263L6293q104m1465K55213A78140m4916a8021A60852
13095f2323B74151c533C22063B4374M01145j44017r1593b3112A5885a14073G4896
13083A22103a00985j83888B03871H2495c29711b9628F7780J28820R2549j19899
13073A69250g2015j2908A00669E0258J98231n987r2650E595a4173j47453G2062
13061b7099C23978I1344c932n1129j50195i6974B40933q2548l8995C2077e7749
13049C79300A55210R876G8291Q8835g0673C43959e4189L719B89908G1305e8783
13037A70018i6137A64904c69492L5036G4421e2900A49821K58362a00818B10248
13026C66779J69451k53764a2772l20815C77724a3909B92088l9021a09515B31332
$$ plain form
13107 -93877 41683 174613 148350 184643 176539 135074 390287 178140 133224 -18021 160852
13095 -62323 274151 -3533 322063 24374 425519 281502 189909 -23112 15885 -114073 74896
13083 122103 -100985 -284873 203871 82495 -329711 -29628 67780 196600 289149 169250
13073 169250 -72015 -84923 100669 50258 248489 242502 149852 5595 -14173 -161626 72062
13061 -27099 323978 91344 -3932 -55061 -205256 -96974 240933 158385 119390 32077 -57749
13049 379300 155210 165086 78291 167126 -70673 343959 -54189 -50470 289908 71305 -58783
13037 170018 -96137 164904 -369492 -334456 74421 -52900 149821 408183 -100818 210248
13026 366779 536230 282466 -12772 -333587 377724 -13909 292088 253067 -109515 231332
13015D54026A60231D0284K60003r3088G64J92130P1632J01698A01040a20374D45874
13003E4282a72436I406h390A30808C1934J97712k6411J27394o5907a20373A13052
12991B42373a66096D8327J38765h5802E5096b6445C358J14453l957b7715C38798
12979I228J52134N46N9566B1170K88031j16645J69307c39048D1206P6071b09357
12967A61612b0047l6970K431B3354J46907d9549j07699j0850M014C88130j46934
12956B41196j11383F3582r422J98441a13479G9449b3825A83797P9903b42505P5735
12945a66770B6018a8092H0802L197d5849E9876j4445b57507D511a14271A20563
12933B68738A20470e074A16466O8176a47330E3392R680B8918e3736C35642A02548
$$ plain form
13015 454026 160231 40284 300287 207199 764 192894 264526 366224 101040 -120374 445874
13003 54282 -172436 9406 -8390 130808 31934 229646 203235 330629 264722 -120373 113052
12991 242373 -166096 48327 187092 -85802 55096 -26445 3358 117811 113854 -27715 338798
12979 9228 161362 161908 221474 21170 309201 192556 361863 -339048 41206 117277 -209357
12967 161612 -20047 -57017 -54586 23354 170261 -49549 -157248 -168098 -164084 388130 241196
12956 241196 129813 63582 54160 252601 -113479 79449 -23825 183797 263700 -242505 -166770
12945 -166770 26018 -18092 80802 83999 -45849 59876 45431 -257507 4511 -114271 120563
12933 268738 120470 -5074 116466 184642 -147330 53392 63072 28918 -53736 335642 102548
12921A69118J04645E5394c3615A31666A6165i2813m9501L4319e764A66172a9579
12909b44446I8282A1399N0839f5685A01307J94417j10959g999C90865j76602h4318
12897I1925M7962J0300D0223K4507K51696E1004O0565N6422K00076a76413G7448
12885a32688B33118H7729i0145H61M7389f815B2061h794m6897K2456A53217A4418
12872C29455h2173j76446C9474K39882j0976m7148a75868H8956e6872F2158e2944
12860a29498F9934i2680k28698M1565E2258a02934A79597l0926J83557M8660j25700
12849B55188j04395j8422h1249j45712a12999j75241o0074F7108b89119d1149
12838a49759A32370l9776a86242C34948j48403L0132a6418k345k95127a52588
$$ plain form
12921 169118 273763 55394 -33615 131666 16165 -92813 -142314 -107995 -5764 166172 -19579
12909 -244446 98282 11399 62238 -65685 101307 295724 184765 -7999 390865 214263 -84318
12897 91925 139887 150187 40223 64730 316426 51004 111569 167991 368067 -176413 77448
12885 -132688 233118 87729 -90145 861 48250 -6815 22061 -8794 -55691 -33235 153217 14418
12872 329455 -82173 -258619 39474 279356 268380 221232 -175868 88956 -56872 62158 -52944
12860 -129498 69934 -92680 -321378 -279813 52258 -102934 179597 148671 332228 380888 255188
12849 255188 150793 132371 -81249 -226961 -112999 -288240 -348314 67108 -289119 -41149
12838 -149759 132370 92594 -186242 334948 186545 216677 -16418 -18763 -313890 -152588
12827D3029K71829j40115D816e8793B55744c3774E2233a87123I1781c7550A53964
12815b52869f8208A02266h811A69234F2052K12443b13781h0005k67084e7615J1665
12804d5950D9642l939d7986m9715j38496H5465J23261r4689J8635f3137l7362
12793a00499C8897f140A58287l696a40079j5362a4248A77138k3864c4485A31464
12781A3808h9419A23320a7229E0329K24499c32737D2329O5790j0693h8239K7333
12770f0906A2464b86989Q4859A08459A5030R0343B6129J33380e2496A05648L3707
12759A39355n508a79968J3963A74977D5061a12445L6444C22933a37966p3666C23389
12747B07966F5972j4024a75341F5203J93435J51977A72884p7975d4428C226M73623
$$ plain form
12827 43029 314858 174743 4816 -58793 255744 -33774 52233 -187123 91781 -37550 153964
12815 -252869 -68208 102266 -8811 169234 62052 274495 -213781 -80005 -347089 -57615 -45950
12804 -45950 49642 45703 -47986 -97701 -236197 85465 208726 114037 132672 -63137 -100499
12793 -100499 38897 -6140 158287 154591 -140079 -155441 -14248 177138 153274 -34485 131464
12781 13808 -89419 123320 -17229 50329 274828 -332737 42329 108119 97426 -88239 -60906
12770 -60906 12464 -286989 -202130 108459 15030 105373 26129 159509 -52496 105648 139355
12759 139355 133847 -179968 -166005 174977 45061 -112445 -76001 322933 -137966 -211632 323389
12747 207966 65972 51948 -175341 65203 258638 410615 172884 94909 -44428 3226 476849
12736D76849n8505A13808A1599N1354h1654B77390A09539m4404a33822A61848
12725A34264Q246B4898b3011k65495D7021c47796J56261g590k3145A88332q0151
12714A08181d70445G4382O6868J77940j12806M661r2070P6979J69474J04944B28994
12702G9846J58392G5547h2987A56237f2130B98011j13373L525K06445B297O2056
12691F4353n45J13843m4086j8520C8052K70755A5503K52571O5233a03044a4251
12679A09947m3888Q8165e4829A91891i2748A7548b9946G8944B3776R698L04947
12668C38421c3507E1299R6389B6792P4092J75122L6130j52236J59539G3961K10669
12657B84630q3646J6223A03639a35924A39780K8332m7266M0207i2622B46302f3568
$$ plain form
12736 476849 418344 113808 11599 62953 -81654 277390 109539 65135 -133822 161848
12725 134264 142510 24898 -23011 -288506 47021 -347796 -191535 -7590 -30735 188332 108181
12714 108181 -470445 74382 141250 319190 206384 211045 118975 195954 365428 470372 228994
12702 79846 238238 75547 -82987 156237 -62130 298011 184638 188163 394608 2297 64353
12691 64353 63808 177651 133565 115045 38052 308807 15503 268074 333307 -103044 -14251
12679 109947 66059 154224 -54829 191891 -92748 17548 -29946 78944 23776 33474 338421
12668 338421 -33507 51299 147688 26792 100884 276006 312136 159900 319439 73961 284630
12657 284630 200984 217207 103639 -135924 139780 168112 120846 161053 -92622 246302 -63568
12645e6889r3232A02965c2629B51069o456a55073e5943G0801f0947J2593j55987
12634b04341j38605R3781A6548K93516P9968a68666C9789h7106I6255a1484A84251
12622B05503b1567B35506K0800p8989j2483j5190c7025A18647a64057E5963g5189
12610A47215m111a3465j3747A61948N2021l3334j0205R1353b63655J18028B76250
12598A70655j3752F101L65686j37904p9802b99314C49040I8472i5920D1503R7106
12587A38609B3415a94654A9413a15578B43629M1086j11089a28262j79865A63941
12576A18352a00914A68005E9757f4842j63431N5706N5705G7165J08139h9649H5039
12564a90997F4172e7310j94193A72940d3563g368j05248j79908a43099A05284
$$ plain form
12645 -56889 -150121 102965 -32629 251069 244613 -155073 -55943 70801 -60947 -48354 -204341
12634 -204341 -342946 -249165 16548 310064 390032 -168666 39789 -87106 96255 -11484 184251
12622 205503 -21567 235506 256306 177317 164834 149644 -37025 118647 -164057 55963 -75189
12610 147215 143104 -13465 -27212 161948 213969 180635 170430 261783 -263655 -145627 276250
12598 170655 156903 6101 371787 233883 154081 -299314 349040 98472 -95920 41503 138609
12587 138609 23415 -194654 19413 -115578 243629 284715 173626 -128262 -308127 163941
12576 118352 -100914 168005 59757 -64842 -228273 -172567 -116862 77165 185304 -89649 85039
12564 -190997 64172 -57310 -251503 172940 -43563 -7368 -112616 -292524 -143099 105284
12553I6094b18846A21191k8745d402C0962a68093j10518B77156M931h8369H5136
12541b61745A22073g9080A6263b29467A41037f5717B01941d01755A01061J44169
12531B45230B466a13158A63405a98979L8839E5573R2379k5139p843e197o7935
12520g3132B97185f2230A02154b20113i4415A7724i4185H3208K84704j55050F4563
12508B804K38274B1584P7066b20752B55367M0060a06603E5888f4807P712J9808
12497c7287A68356e0845A40033n1767a33622g640q8899n7659C2059e6866I4322
12485G5227R6691q0747a05601A6158c85977d4905B9249a67769M1740D57707D1227
12473b39036j2664L173g6220A03575J0878O3229K21922b09822K2381B31067J0772
$$ plain form
12553 96094 -218846 121191 92446 -4402 30962 -168093 -278611 277156 282087 -88369 85136
12541 -261745 122073 -79080 16263 -229467 141037 -65717 201941 -401755 101061 245230
12531 245230 2466 -113158 163405 -198979 -160140 55573 147952 122813 114970 -5197 -73132
12520 -73132 297185 -62230 102154 -220113 -94415 17724 -94185 83208 367912 212862 64563
12508 2804 241078 21584 98650 -220752 255367 295427 -106603 55888 -64807 -57095 -37287
12497 -37287 168356 -50845 140033 88266 -133622 -7640 -96539 -154198 32059 -56866 94322
12485 75227 171918 91171 -105601 16158 -385977 -44905 29249 -167769 -126029 457707 41227
12473 -239036 -251700 -248527 -76220 103575 114453 177682 399604 -209822 -187441 231067 241839
12462B41839j06965P2121h8039G7359a71271f456F4739d4504A15992J44200E6087
12450G554a22038M7149J5221A54281J63605A32820a94327k12364a96843i7084
12439B9262N4921a84933d24j75187C72365h393j1757A72101c19887J47003k86702
12428d59586F734P1614i1858j15620A26579a71863A83298a2748A6605f2165l7937
12417a00102j42660A61947b50817A08946a24581D87864a1044A54628K5464o3254
12407A16838i7140L3270q9350M0190o0154a2167A86712n6768j2459m58a97138
12395e0078A44335a16208C00786D1048M62177I6935J76712E5566K81555a0147
12384A35407l7030L15172i2244j36179h86k88097f292B96081A4580n461a33272
$$ plain form
12462 241839 134874 206995 -88039 77359 -171271 -6456 64739 -44504 115992 260192 56087
12450 7554 -122038 -74889 -59668 154281 317886 132820 -194327 -406691 -196843 -97084
12439 29262 84183 -184933 -424 -175611 372365 -8393 -20150 172101 -319887 -172884 -459586
12428 -459586 6734 78348 -91858 -207478 126579 -171863 183298 -12748 16605 -62165 -100102
12417 -100102 -242762 161947 -250817 108946 -124581 487864 -11044 154628 180092 116838
12407 116838 -97140 -63870 -153220 -113030 -173184 -12167 186712 129944 117485 117027 -197138
12395 -50078 144335 -116208 300786 41048 503225 96935 273647 55566 337121 -10147
12384 135407 98377 413549 -92244 -228423 -886 -288983 -6292 296081 14580 9119 -133272
12372E2717a54634b1964k03608a07533A14714l3344a00793M8482j86696m82M3349
12361a96140b2292D850J88234a62694i272j8729q3717b2196A83279a0825j41894
12350a52719A11971a5729A97006E1742K39600a12599m2295A11488c50246C8901
12339C80931A82945a48985F275N7387h6845b1521B4764R1098b6783C83457A37492
12327F8567Q8936a93444K6222B5003Q1566a73479B46470j06269d4335B15636D3958
12315A56199o7415l4146d3281G0162k6011L2319f8090A80818a90524g369B91772
12303a04869B05183J4287j02040a33275m5554C52761j48182b76194b9152F9943
12292b82652f4234A6258J13546I588a58089G5524b1736F1123K08506m376N9149
$$ plain form
12372 52717 -154634 -21964 -225572 -107533 114714 81370 -100793 -52311 -239007 -239489 -196140
12361 -196140 -22292 4850 193084 -162694 -9272 -28001 -111718 -22196 183279 -10825 -152719
12350 -152719 111971 -15729 197006 51742 291342 -112599 -154894 111488 -350246 38901
12339 380931 182945 -148985 6275 63662 -86845 -21521 24764 115862 -26783 383457 137492
12327 68567 157503 -193444 -167222 25003 106569 -173479 246470 140201 -44335 215636 43958
12315 156199 88784 54638 -43281 70162 44151 76470 -68090 180818 -190524 -7369 291772
12303 -104869 205183 219470 117430 -133275 -178829 352761 204579 -276194 -29152 69943
12292 -282652 -64234 16258 129804 9588 -158089 75524 -21736 61123 269629 265253 324402
12281C24402L0679k7780A52141o961o2630k1315P0551K9864o4110J26134I7613
12269A99342h4716A75482Q5404e5545n9342B04029r1301a12811r0101B29502a4837
12257e0749j71287Q4637G191b083j87142j21980A7852J71592a66396A2970P4859
12246H7829K22943J6380n8363d7567H4879J7707a06955C39913j752F9052b67059
12234C51202n0974m383k2795J373b20610D16437F9741O7398J24179P615B2626
12222A39557K5259K01597p3517g9761A53507l2037L3399o809a79951B12588O3606
12211B76194a42101A5236L57908P4531g3455G5779M28864j70601A04364a140C72392
12199A11504L2416L34419b91375B50385F4089P9317J08824J12172g5774B04791
$$ plain form
12281 324402 355081 327301 152141 145180 82550 61235 131786 161650 97540 223674 97613
12269 199342 -84716 175482 260886 -55545 -114887 204029 112728 -112811 -202912 229502 -14837
12257 -50749 -222036 -137399 7191 -2083 -189225 -311205 17852 189444 -166396 12970 87829
12246 87829 310772 327152 268789 -47567 84879 102586 -106955 339913 338161 69052 -267059
12234 351202 300228 295845 273050 274423 -220610 416437 69741 137139 261318 268933 22626
12222 139557 164816 366413 292896 -79761 153507 121470 154869 148060 -179951 212588 276194
12211 276194 -142101 15236 373144 447675 -73455 75779 504643 334042 104364 -1140 372392
12199 111504 143920 478339 -291375 250385 64089 143406 252230 364402 -75774 204791
12188b23897B98441a92563B65068F1540i1767j00732A3142R2582M1755K77587
12178D25066c50620J50484C413L37734J12843E9530a8399n1774B18221a09728
12167B90226D2539L7063n434k2513J02608o6595a16465E38876A27641j6913d6290
12155B0528L01813j50402h3397j01003D8836K95010D6702a19920A72941o0562
12145A12379b18582H3016a20845B3644I094c0690F0304b01116c7153a2937j03301
12134a16238A34392h8399A41229n7341K6545J09012c3884A23836j4121K48095
12124C57810C3435d9376A25990P8948p3089J59668J38212B7158b08228I4178M132
12113I8310h9026I4961c59521J66034A42226l3709J45299o4817H8143b29529D03443
$$ plain form
12188 -223897 298441 -192563 265068 61540 -91767 -192499 13142 105724 147479 425066
12178 425066 -350620 -200136 3413 341147 453990 59530 -18399 -70173 218221 -109728
12167 290226 42539 79602 74168 51655 154263 87668 -116465 538876 127641 110728 -46290
12155 20528 322341 171939 -83397 -184400 48836 343846 46702 -119920 172941 112379
12145 112379 -218582 83016 -120845 23644 9094 -30690 60304 -201116 -37153 -12937 -116238
12134 -116238 134392 -88399 141229 83888 110433 219445 -33884 123836 109715 357810
12124 357810 33435 -49376 125990 204938 131849 291517 429729 27158 -208228 94178 98310
12113 98310 -89026 94961 -359521 -193487 142226 108517 253816 188999 88143 -229529 403443
12101A34331b73646B92449A6280Q5470R9136a53257B76613H3947J55622B740b47539
12089a06314r8103b3687j50359b4648G9062K5949q758C5025K33767h2204B23524
12077B77006j17964M73864N56364N78948H55507l07347B67303b80578D65411A66040
12066b90710F998c6291B72537A24425b1293k7885n7959K4726o676B36006c2645
12054h7756o2771f0664H1235d1083J2144A68371G8134a93947A00235e5843r4214
12043a50057b1307G9143A8886c7470E5076a0653A45749a83048B93174H5584b18090
12031C2084c0922j9043k4932F7064d7341I196a37854A5149F629j125d8126A85064
12018B0312K23079A09651a24724B8210d9024G4516f3771j75565O0360G4057c979
$$ plain form
12101 134331 -273646 292449 16280 101750 200886 -153257 276613 83947 239569 2740 -247539
12089 -106314 -204417 -23687 -174046 -24648 79062 105011 96253 35025 268792 -82204 223524
12077 277006 159042 632906 1189270 1768218 855507 548160 267303 -280578 465411 166040
12066 -290710 6998 -36291 272537 124425 -21293 -49178 -107137 -82411 -89087 236006 -32645
12054 -87756 -150527 -60664 81235 -41083 -28939 168371 78134 -193947 100235 -55843 -150057
12043 -150057 -21307 79143 18886 -37470 55076 -10653 145749 -183048 293174 85584 -218090
12031 32084 -30922 -49965 -74897 67064 -47341 9196 -137854 15149 6629 5504 -48126 185064
12018 20312 243391 109651 -124724 28210 -49024 74516 -63771 -239336 -178976 74057 -3979
12006a80427C87602G0046b7695B1097b96193a11461A36750o6792i1960A3284c7955
11994a39487A80674b70348a02416H8002a48043c1136J1067A28348f6376m4310
11984a10686B0933J08773Q3162e6055j43500b8874R350m8082K7780r3592B41684
11972a11015e3483m5600j59287A74951i6326j13786R1489n5844j13773j15738
11962d03978C23582h099j54658M7359A24877K25543a90008B51901c09617e4915
11951a78687D047J80254c44958a8900D0454J7060N674P1542n0381l126d3968k0999
11939f4967l8917M589G4797c65041A40494j6001e5984j18470k8193A10476b47871
11927I0297N983K09978c54977G6545k4887R372A3301J65000n3914A9360d3546
$$ plain form
12006 -180427 387602 70046 -27695 21097 -296193 -111461 136750 69958 -91960 13284 -37955
11994 -139487 180674 -270348 -102416 88002 -148043 -31136 -20069 128348 -66376 -110686
11984 -110686 20933 129706 212868 -56055 -199555 -28874 -19524 -67606 -39826 -133418 241684
11972 -111015 -53483 -99083 -258370 174951 -96326 -210112 -118623 -174467 -288240 -403978
11962 -403978 323582 -8099 -162757 -115398 124877 350420 -190008 251901 -309617 -54915
11951 -178687 4047 184301 -344958 -18900 40454 57514 63188 134730 84349 81223 -43968 -64967
11939 -64967 -103884 -99295 74797 -365041 140494 124493 -55984 -174454 -202647 110476 -247871
11927 90297 96280 306258 -354977 76545 51658 61030 13301 178301 124387 19360 -43546
11915d1028j03716A47356b5575D2036c59731a10950k42574e1046k19999E5955
11904C90546A27370d0834j15437b5591j17443A70312k3144A2382J95859c03556
11893a78526g3463A65639A4542J04876M7667a55384A44014E0629c02873k8405
11883c31278l7988B3904b68644L407b0846j04569c1777q7094n6143K2122L1283
11872a21609e4863A555b19236I580L1838b6028D7341a672E101N38131a87357O3672
11860a23685q7578C8022i393l15646a03270d9844m1542A31850b6581C3037J10853
11849A43890r623o3053b2259m3137k5206j33325k5927c3171k91066A6573b8359
11837E517b0483A12993b82542Q0763L7189A56597F0201a63520d6815A03596j0878
$$ plain form
11915 -41028 -144744 147356 -25575 42036 -359731 -110950 -353524 -51046 -271045 55955
11904 390546 127370 -40834 -156271 -25591 -143034 170312 147168 12382 208241 -303556
11893 -178526 -73463 165639 14542 119418 167085 -155384 144014 50629 -302873 -331278
11883 -331278 -369266 23904 -268644 -265237 -20846 -125415 -31777 -118871 -175014 -152892 -121609
11872 -121609 -54863 1555 -219236 9580 41418 -26028 47341 -1672 5101 543232 -187357 -123685
11860 -123685 -211263 38022 -9393 -325039 -103270 -49844 -91386 131850 -26581 33037 143890
11849 143890 134267 71214 -22259 -65396 -90602 -223927 -249854 -33171 -324237 16573 -28359
11837 5517 -20483 112993 -282542 -201779 -164590 156597 60201 -163520 -46815 103596 92718
11826I2718N4032J2670F4025e7916M99A4037b62401A43110J0840m4869E2307b0034
11813a91074d0183B41933E9805B9496O9291b3620k16788G1991j8736C112a75973
11801B09065C2207d98434F6806b53454c9893D9967d5897A00435K40795j47594
11791A93636G3059C0598A627J49321Q8115N9134h8797B6726N0236a59360O3160
11780i6200N213j51716e3479A66482d9135G1511J78234b21325B15685a43371j26682
11769b70053a521A71657M8107g4660A68782b69147B73522a7797l6033k85088J58431
11758a80487A0038J29039d18641f4413j66359a4942q4281A11145A3199a93186
11747b08086L6970E5754a18388M980j89401F330M6321a96132Q7906a6113j77320
$$ plain form
11826 92718 146750 159420 64025 -57916 -57417 14037 -262401 143110 153950 109081 52307 -20034
11813 -191074 -40183 241933 59805 29496 98787 -23620 -240408 71991 53255 3112 -175973
11801 209065 32207 -498434 66806 -253454 -39893 49967 -45897 100435 341230 193636
11791 193636 73059 30598 1627 150948 239063 298197 -88797 26726 76962 -159360 -96200
11780 -96200 -90987 -242703 -53479 166482 -49135 71511 249745 -221325 215685 -143371 -270053
11769 -270053 -1521 171657 219764 -74660 168782 -269147 273522 -17797 -53830 -338918 -180487
11758 -180487 10038 139077 -418641 -64413 -230772 -14942 -99223 111145 13199 -193186
11747 -208086 -171116 55754 -118388 -113408 -302809 6330 52651 -196132 -108226 -16113 -193433
11736a93433C35288a85095e0365B73443j6485C4642j6536J02298J3520a1899A23583
11724D2761b4934H7131K76166A68284C964L9723J36014f5193A04929a02666L819
11713i8847A1858J2162h1144K0376q0445H8964Q0906p7252l1687N0323N6609l9314
11701A28549b3770I9647J26623N3375j10078C8892Q6399q37J4744a13962A3400
11689A87560d367o2509H9558H074J98486I3208Q4592P0277a13242A72057J06225
11678B78282b6865p6815A96035e9960A33674b7741I7712a12007l9055e5319E4477
11666b51938E7450c16333c5886B0037K62002a05533A50639c053j6994j2169I1681
11654h125B13543Q4927a3342A44016L06941j84185A31885d0279D2393J22320n3213
$$ plain form
11736 -193433 335288 -185095 -50365 273443 256958 34642 18106 120404 133924 -11899 123583
11724 42761 -24934 87131 363297 168284 3964 43687 179701 -65193 104929 -102666 -98847
11713 -98847 11858 24020 -81144 -60768 -141213 88964 169870 92618 60931 111254 167863 128549
11701 128549 -23770 99647 226270 279645 169567 38892 125291 124454 139198 -113962 13400
11689 187560 -4367 -66876 89558 8074 206560 93208 177800 248077 -113242 172057 278282
11678 278282 -26865 -103680 196035 -59960 133674 -27741 97712 -112007 -151062 -55319 54477
11666 -251938 57450 -316333 -35886 20037 282039 -105533 150639 -3053 -20047 -32216 91681
11654 -8125 213543 298470 -13342 144016 450957 266772 131885 -40279 42393 164713 111500
11643A11500a56815B34627i2012D1268A0349d12797J63019M4935j20528O3547
11633b61824J09824I640Q8608a74741a2194A10374c10316K450f6206o2642A50234
11621A40744D0661K62671J66250C5556J67191J52384a3374j55562d6968B5425
11610c5381o8965C76156F1954K36912b9431j90075B71361I0000M4077L4606C2552
11598D08388D0586b02142C02801a4396j73967A49520c0478F6120L5064H053L64424
11587C72477o5104j32296J60498d9084m657o4425B1212Q4267P1670e1076o2387
11576a13463F6342P0939a48005A08924J89647f9340A56654O4388M4589F1958a08649
11564A46492g3258j36333I7522K54107A19888K27524e0594B98423b2437j34533
$$ plain form
11643 111500 -156815 234627 -92012 41268 10349 -412797 -249778 -204843 -325371 -261824
11633 -261824 -152000 9640 98248 -174741 -12194 110374 -310316 -307866 -66206 -128848 150234
11621 140744 40661 303332 469582 35556 202747 355131 -13374 -168936 -46968 25425
11610 -35381 -104346 376156 61954 298866 -29431 -219506 271361 90000 134077 168683 32552
11598 408388 40586 -202142 302801 -14396 -188363 149520 -30478 66120 101184 8053 372477
11587 372477 307373 175077 335575 -49084 -53741 -118166 21212 105479 177149 -51076 -113463
11576 -113463 66342 137281 -148005 108924 298571 -69340 156654 221042 265631 61958 -108649
11564 146492 -73258 -209591 97522 351629 119888 347412 -50594 298423 -22437 -156970
11554a56970j05656A5882K94246I8460J35491j13279r055m3241L8407O1777M0238
11543B08798G0299K29559b54735B6910L80670A89696k1784J5640L14620E2756
11532I920L34713J1495F0740L7414m6190b01069B2546J63643h5376A95774B3160
11520A72409o9686J3972j3106R3361q6163L4936R5741c9443A28039B1342J3949
11509C5291R6460b00469A22623R490g2924A46158L48656A02306J34516Q7833c8732
11497B09398M0537j11654L9923L2312b1981B78032j28199c8548j02765n1662D4732
11485C40332j04109M7257p8783K12138g7150A87432K29651H687J80716B2744R8884
11474A21628J55115j03644H1660K62088h1551I8537N9187A3741b51521F1057a90714
$$ plain form
11554 -156970 -262626 15882 310128 98460 233951 120672 111617 68376 106783 168560 208798
11543 208798 70299 299858 -254735 26910 407580 189696 167912 183552 498172 52756
11532 9920 344633 356128 60740 98154 51964 -201069 22546 186189 -85376 195774 23160
11520 172409 102723 116695 103589 196950 110787 145723 241464 -39443 128039 21342 35291
11509 35291 131751 -200469 122623 132113 -72924 146158 494814 102306 236822 324655 -38732
11497 209398 249935 138281 178204 210516 -21981 278032 149833 -38548 -141313 -192975 44732
11485 340332 236223 283480 204697 416835 -77150 187432 417083 8687 189403 22744 121628
11474 121628 276743 173099 81660 343748 -81551 98537 157724 13741 -251521 61057 -190714
11462A37918d1381B44890a45908A66381H696J38602J53278b36351C99105A87939
11451c51702E6087J1431J97993Q8251d6591j0452H20b50169C0578J36084P2440
11440B39102A13871b13082B10230B9152N1088b1755E5952a27691C02039F167a53948
11428a9144D6401b31147C56143C2413J19237a67898B9099d2136k19886b3536k32364
11417b55900k6174H3685c89138e6254r5461c2649A79152b82487B3145P9031j3045
11406H9131k9704g5911A08102J40352i7959A9329J16757f0857B10921i1705H264
11394a08325D1466a26715o2609c0820B6906b3610A86996i7832k29809E2644a12845
11382a31068C0238h7224K3753k8971B30121A14545L41856j76601A12700b03992
$$ plain form
11462 137918 -41381 244890 -145908 166381 8696 147298 300576 -236351 399105 187939
11451 -351702 56087 67518 265511 353762 -46591 -57043 820 -250169 30578 166662 239102
11440 239102 113871 -213082 210230 29152 80240 -21755 55952 -127691 302039 6167 -153948
11428 -19144 46401 -231147 356143 32413 151650 -167898 29099 -42136 -262022 -23536 -255900
11417 -255900 -282074 83685 -389138 -56254 -151715 -32649 179152 -282487 23145 102176 89131
11406 89131 59427 -75911 108102 248454 -97959 19329 136086 -60857 210921 -91705 8264
11394 -108325 41466 -126715 -189324 -30820 26906 -23610 186996 -97832 -327641 52644 -112845
11382 -131068 30238 -87224 -63471 -92442 230121 114545 456401 279800 112700 -203992
11371G4424a4922C6345O5344c4005C75353o0834h1840A9214J74939b38818a1384
11359B28348I3547d1530d007j05321L8362B08040b7237A38654J96131H6805B6752
11347F5343J29769H277P2077i5958D86702B38749a17627D966R9763c27482B71604
11335b05063k6513f7521q397H0492O9236e8397B16021G6704c5886B76551a17857
11323a12915n9941j87808a27702L1947B7965A2239b0397r389C5085a86204A71849
11311a30935r8573a8384G8185J66182c1515j52955n447P4472K6550j03932M4369
11300a48458A88714a19599F2574J6975g4718F0346P2286a10594A65793d2528A7009
11288a46035G9834a09135l43950D855d8444a6452k01969a09160I6785b44430A32026
$$ plain form
11371 74424 -14922 36345 101689 -34005 375353 314519 -81840 19214 194153 -238818 -11384
11359 228348 93547 -41530 -4007 -109328 -70966 208040 -27237 138654 334785 86805 26752
11347 65343 195112 8277 80354 -95958 486702 238749 -117627 4966 104729 -327482 271604
11335 -205063 -231576 -67521 -75918 80492 149728 -58397 216021 76704 -35886 276551 -117857
11323 -112915 -172856 -360664 -127702 -95755 27965 12239 -20397 -29786 35085 -186204 171849
11311 -130935 -229508 -18384 78185 244367 -31515 -184470 -189917 -115445 -88895 -192827 -148458
11300 -148458 188714 -119599 62574 79549 -74718 60346 132632 -110594 165793 -42528 17009
11288 -146035 79834 -109135 -453085 4855 -48444 -16452 -218421 -109160 96785 -244430 132026
11276B27836c04662h5638C91158a49981C54204D6417I094L67948b53397D5792
11265a91683N5956c0356D9976a90736f8858J9125C9083J73858m1338o1883J37928
11254B47648j10177b6209k69705O3645K7381C4864h7706b7623C94762A16521c30594
11242A59030K0354o8051O7904a25771a6174j11828A84616a67680K542a0864A20382
11230G6491b08168C29467a47n4350O463A05818g0039B40699q4918A4562b89870
11218b11335J03459C4397P0098e240m2131G4583h6524B16633a23753j42937j96063
11207d62753K03097A4707K2674L2170f4386A46191M5293a1796A12055J21055b78854
11195b45797D20587d5801C51236a30690n6796A47285b67277B0802a929n5590m2684
$$ plain form
11276 227836 -304662 -85638 391158 -149981 354204 46417 9094 377042 -253397 45792
11265 -191683 -135727 -30356 49976 -190736 -68858 -49733 39083 212941 171603 109720 247648
11254 247648 137471 -26209 -295914 -232269 -204888 34864 -87706 -27623 394762 116521 -330594
11242 159030 179384 111333 179237 -125771 -16174 -128002 184616 -167680 -165138 -10864 120382
11230 76491 -208168 329467 -147 -54497 -48034 105818 -70039 240699 155781 14562 -289870
11218 -211335 -107876 34397 104495 -5240 -47371 74583 -86524 216633 -123753 -266690 -462753
11207 -462753 -259656 14707 37381 69551 -64386 146191 191484 -11796 112055 233110 -278854
11195 -245797 420587 -45801 351236 -130690 -187486 147285 -267277 20802 -1929 -57519 -100203
11184a00203j13836A27541j2056d633A03753a56354j0162f7545H080K35457A1912
11172a74884b9019j07785F7187b24905J0638n01091c5992I4062c3473o4346C640
11160d8932j95187B19933p1987c25715J58336B02925a05771A15010E0595c02763
11149a00457b4905I8913a67486A5237b12062a6933D9325i8724F4029f7831k7792
11138i5623j15327a360D03369d57489C3536d785n7190A39058Q4331B4410h5465
11126a88490A02372K8468b50866B19032q5271A4539J53506G2747A1985M8338J07391
11115A67714a01395H2004A1775a0627B16645j00467a21430O06B34508J08371Q9490
11104D32369J5042J70008A2123K62695k7208K3558J52074a25047A89521o6971
$$ plain form
11184 -100203 -214039 127541 115485 -4633 103753 -156354 -166516 -67545 8080 243537 11912
11172 -174884 -29019 -136804 67187 -224905 -214267 -715358 -35992 94062 -33473 -97819 3640
11160 -48932 -244119 219933 147946 -325715 -167379 202925 -105771 115010 50595 -302763
11149 -100457 -24905 98913 -167486 15237 -212062 -16933 49325 -98724 64029 -67831 -95623
11138 -95623 -210950 -1360 403369 -457489 33536 -4785 -61975 139058 223389 24410 -85465
11126 -188490 102372 130840 -250866 219032 133761 14539 168045 72747 11985 60323 167714
11115 167714 -101395 82004 11775 -10627 216645 116178 -121430 -120824 234508 342879 432369
11104 432369 447411 617419 12123 274818 247610 271168 423242 -125047 189521 122550
11094A22550B2289a52607O9284A56429D8025L66346J32702k43527j04614r5978
11084A02954O0145b3280C03464N645A25177J80664A34902Q5361k4215R7866I7590
11072D52518A04552J55724a5393C83633l5139j09359o087L59176J30154l25028
11062C97350J41878M7025j98777M71926k68183l6354n7309K26660B38652M82999
11052G21651N0035q9572K16696k6511k96820q2154K40991R6844L2600C86772K27718
11041F14490p2379K3860J17661p4469J48510k35935R5819K58386C98444M63076
11031H61520j99522L3304j56551L08930j07697L14617k91201p8454J02471Q550
11021G95967l649k6991o9328J19403K9506k62720l0118Q4886j66167L38010k88597
$$ plain form
11094 122550 22289 -152607 -83323 156429 48025 414371 547073 303546 198932 102954
11084 102954 163099 -23280 303464 309109 125177 305841 134902 220263 196048 293914 97590
11072 452518 104552 260276 -15393 383633 348494 239135 233048 592224 722378 397350
11062 397350 539228 586253 387476 859402 591219 554865 497556 724216 238652 721651
11052 721651 771686 682114 898810 872299 575479 493325 734316 831160 863760 386772 614490
11041 614490 542111 565971 683632 609163 757673 521738 617557 875943 398444 861520
11031 861520 661998 695302 538751 847681 739984 1054601 763400 684946 787417 795967
11021 795967 792318 765327 695999 815402 844908 582188 552070 636956 470789 808799 520202
11010E20202M7493K28290o9880l14611L88008C95924M15217j25778j26998J98691
11000G57056k36561L2355J46377O981J36961j90581R4807k41911K82157C28681
10989I83773M4905k15067M06261j69662j56808L81156l59483n734J04088K76660
10979A290089L16052k0134O0316M86394l27908L72978L77047j23210N67051j38865
10969B859810J05843l35191j73530l32443j24007l29230M23542n32054N19337
10960B082077n13852M44417q9821J27615j5936J18762j48747m09042n77205K25724
10950A243992k11449l2345k16349o6041q8682k68558J41926A98766N4697J50183
10940D03646C9340a18021A35320a07143I7335b90650c7351J5669j05743C41939
$$ plain form
11010 520202 567695 795985 726105 411494 799502 395924 811141 685363 558365 757056
11000 757056 520495 552850 699227 706208 843169 652588 747395 505484 787641 328681
10989 983773 1028678 813611 1219872 1050210 893402 1274558 915075 909341 1013429 1290089
10979 1290089 1606141 1586007 1646323 2132717 1804809 2177787 2554834 2431624 2998675 2859810
10969 2859810 2965653 2630462 2456932 2124489 2000482 1671252 2094794 1562740 2082077
10960 2082077 1568225 2012642 1922821 2050436 2034500 2153262 2004515 1595473 1018268 1243992
10950 1243992 1032543 1000198 783849 717808 629126 360568 502494 198766 253463 403646
10940 403646 39340 -118021 135320 -107143 97335 -290650 -37351 -21682 -127425 341939
10929B78572a03538j21436B44520b6620B7197e5646H9238g2907A68833J76605
10919C45438h9237j65697A92529P2052d8689j04761A21074J5970Q3341c30967
10908a05681H6848B3207b9032B91058b88670f74D0903b58034B20973l1971b1384
10896C9154a79535h2548j71778q4986B98842J53500a48426j85326H6440j7562
10886F8878M1072J7010l5058f2838A08492a30718a6850B27560F894J0700Q3329
10875A00923c1043A18525M59106B22560B0187a63912k24237J56351B16369I9999
10864A52342A1643b659H0802a67910F2808j7294J97853b37413B48329b08746j23172
10853c31918F962f6286C00834C3010b30898D6393K7259i0190A26103P1215E2518
$$ plain form
10929 278572 -103538 -224974 244520 -26620 27197 -55646 89238 -72907 168833 345438
10919 345438 -89237 -254934 192529 264581 -48689 -153450 121074 137044 220385 -330967
10908 -105681 86848 23207 -29032 291058 -288670 -674 40903 -258034 220973 189002 -21384
10896 39154 -179535 -82548 -254326 -339312 298842 452342 -148426 -333752 86440 68878
10886 68878 109950 126960 91902 -62838 108492 -130718 -16850 227560 6894 17594 100923
10875 100923 -31043 118525 577631 222560 20187 -163912 -388149 -231798 216369 99999
10864 152342 11643 -2659 80802 -167910 62808 45514 243367 -237413 248329 -208746 -331918
10853 -331918 6962 -66286 300834 33010 -230898 46393 73652 -90190 126103 197318 52518
10841g5600H336G4h1543A4265b31659J04877F4233j6408N4757c4479p3651q1164
10829a89294D6881R6696N1909E3692b39746H1109b8986a1249j06320A86297q2440
10818A03857h0970D2194a4437B85893e277A78580b19775b0146q8023k8335b8679
10806c6291B26407g6788a0546n45089d6919I5485j7716J63049F6474D686Q6610
10795I1296b12590A33684a05499A58582H428J15577c55054G7750b74840A95762
10784b5392j13953B82508a34997q5005B1442d6479F0677I164a50663J2667E43655
10772A39055A100J65897a42177O942D430K3245b82104C38860d3852C14597C2202
10760a46024Q351q1204J06220q5118A480a80805e8033A27371b93944L6357d4457
$$ plain form
10841 -75600 8336 74 -81543 14265 -231659 -126782 64233 47825 102582 -34479 -108130 -189294
10829 -189294 46881 143577 195486 53692 -239746 81109 -28986 -11249 -117569 186297 103857
10818 103857 -80970 42194 -14437 285893 -5277 178580 -219775 -20146 -108169 -136504 -28679
10806 -36291 226407 -76788 -10546 -555635 -46919 95485 77769 240818 66474 4686 91296
10795 91296 -212590 133684 -105499 158582 8428 124005 -355054 77750 -274840 195762
10784 -25392 -139345 282508 -134997 -220002 21442 -46479 60677 9164 -150663 -137996 543655
10772 139055 1100 166997 -142177 -135235 4430 27675 -282104 338860 -43852 314597 32202
10760 -146024 -137673 -218877 -112657 -197775 1480 -180805 -58033 127371 -293944 -257587 -44457
10748A33469J6269A7147P687Q2396Q2413i7276a0694q0625A42734l9315d446r0340
10736i4786D9507a83219L8442j3176A88672b22006e3853j14109n814A5885N0384
10725F6269j2583j1794h6979j55706m1011p6084I6789f0650G5169k8311e0392
10713a50255l1756o3541R4506o6049l2188D04574e5499B29147b0617I8617l9766
10702E8851K62465B1754b96985J33525E5328b25129j45343h8834l155q2373D5018
10690h3338o3282j70739B39071a8887r4279l42183a46122j9040B88009a79724
10679b49825j95768a39186j3497B34595d9791D4851A7240a88393P5773I9444f9758
10667b26113A5115a32759e0889E952J60841b89409N2757o2485j4540B1986J1919
$$ plain form
10748 133469 149738 17147 24834 107230 189643 -97276 -10694 -91319 142734 103419 -4446 -94786
10736 -94786 49507 -183219 -144777 -157953 188672 -222006 -53853 -167962 -173776 15885 66269
10725 66269 53686 41892 -86979 -242685 -283696 -359780 96789 -60650 75169 46858 -50392
10713 -150255 -182011 -245552 -151046 -217095 -249283 404574 -55499 229147 -20617 98617 58851
10702 58851 321316 21754 -296985 -163460 55328 -225129 -370472 -88834 -91989 -174362 45018
10690 -83338 -146620 -317359 239071 -18887 -113166 -455349 -146122 -165162 288009 -179724
10679 -249825 -445593 -139186 -152683 234595 -49791 44851 17240 -188393 -112620 99444 -69758
10667 -226113 15115 -132759 -50889 5952 166793 -289409 -236652 -299137 -313677 21986 33905
10656C3905L4637g5968k84156F6920f4750a3733A08347b34759j5978H1747g7389
10644c9350n9918K8186B92073b85203A24402R6708b515I9503K212o8m4608a98800
10631f1267o5246E6695K8602k9356a24195j45720E252a68202E2324b098k54491
10620b56589I4008J51549c5615B6177J59709e552m6673A0349K2893c18901J36178
10609a82723e9404r7768A7605O5155A9120b645D8062Q0180A1455K01923d6214
10597F946c46481F3102a8460j26957B41929b52410r0115A67939J32168a21532
10586a92234D2835c62362A19593C0833b28038I8912g2271C42262A45640a61432
10575h1667l8123A03796a90265I6773b4696A66440n0076a1850l55842a1337q6537
$$ plain form
10656 33905 68542 -75968 -360124 66920 -64750 -13733 108347 -234759 -250737 81747 -77389
10644 -39350 -99268 -71082 292073 -285203 124402 221110 -2515 99503 101715 101647 57039 -198800
10631 -61267 -126513 56695 85297 55941 -124195 -269915 5252 -168202 52324 -2098 -256589
10620 -256589 94008 245557 -35615 26177 185886 -5552 -52225 10349 33242 -318901 -182723
10609 -182723 -59404 -157172 17605 82760 19120 -2645 48062 128242 11455 213378 -46214
10597 6946 -346481 63102 -18460 -145417 241929 -252410 -342525 167939 300107 -121532
10586 -192234 42835 -362362 119593 30833 -228038 98912 -72271 342262 145640 -161432
10575 -81667 -119790 103796 -190265 96773 -24696 166440 116364 -11850 -367692 -11337 -97874
10564i7874j13718A11605B6087b43166B45181G9979K62800a1236k1870r6198c9003
10552H1450c63684a51838D5890b3116k61439A85948e73812a2949q5118A29123
10541f6984A20322c25976a59507B19442J20953b35985J01260j58198Q6127a2113
10530I877c9387o4439I788J00337a51126C4291a90368C9586p100b4850D1841a64717
10517B36728i5629A82174f3911B75835E9648d84219a61640B4560a17895b8633
10506A78972n4371b33702J09039A09331a27556l677D567M5310i2160r8947c6875
10494B5091J74540a23225D39458E1012L45785D4075a98812B05175r8478D3619
10483C35895j61924K20484J61307J15082J52199k30546k51286j60477B6497Q6362
$$ plain form
10564 -97874 -211592 111605 26087 -243166 245181 79979 342779 -11236 -33106 -129304 -39003
10552 81450 -363684 -151838 45890 -23116 -284555 185948 -573812 -12949 -98067 129123
10541 -66984 120322 -325976 -159507 219442 340395 -235985 -134725 -292923 -206796 -12113
10530 9877 -39387 -103826 9788 110125 -151126 34291 -190368 39586 32486 -24850 41841 -164717
10517 236728 -95629 182174 -63911 275835 59648 -484219 -161640 24560 -117895 -28633
10506 178972 124601 -233702 -124663 109331 -127556 -131233 4567 49877 -92160 -191107 -36875
10494 25091 199631 -123225 439458 51012 396797 44075 -198812 205175 106697 43619
10483 335895 173971 394455 555762 670844 823043 592497 341211 180734 26497 112859
10473A12859c3640G6310K76569n1664B0193K33382I2576J82619e2476k50730N0387
10462b52819J03943A36935b22473B70052D174b54571D49964c79442A55389a18739
10451b38089J01147O7546B01231k1745o7976c29404a0155G4655A6451a2041l6386
10440d8427j42277A46149a43843c0551o9674C115c38670M3899f6376C69080A75470
10428c50285a06305D6292O8582a41328j89290A8086K63535c50152A79263D1907
10417a93311A94819m6910E4594A7809a29752A30745K1421a73399c5850C2100O2921
10406I5021d04883J59966f2627k25398r8577J38757C21036a4355k39363N4103
10396a99615A0630k671J47875J78019A38228D8272B0701L27734H8201d1423I2484
$$ plain form
10473 112859 -33640 76310 352879 301215 20193 253575 92576 275195 -52476 -303206 -252819
10462 -252819 -148876 136935 -222473 270052 4174 -254571 449964 -379442 155389 -118739
10451 -238089 -136942 -69396 201231 179486 111510 -329404 -10155 74655 16451 -12041 -48427
10440 -48427 -190704 146149 -143843 -30551 -100225 3115 -338670 -294771 -66376 369080 175470
10428 -350285 -106305 46292 114874 -141328 -330618 18086 281621 -350152 179263 41907
10417 -193311 194819 147909 54594 17809 -129752 130745 152166 -173399 -35850 32100 95021
10406 95021 -404883 -244917 -62627 -288025 -386602 -247845 321036 -14355 -253718 -199615
10396 -199615 10630 7959 155834 333853 138228 48272 20701 348435 88201 -41423 92484
10384A62466i8208B05087G3895h1202A54806J84846j31801P0465A22381P6750
10374A99131l3666M3691M491J41575p2597M8970J36885B04602J57950O5892P9232
10363E07676a27264A48715J86250I9851K1715h9643B83495L5905E1432J58462
10353B09894J01757J26704O25237D86612O666B37831H6368g2973F02361J0134
10343F12495k40659M5715J63142B20445D1838a2136C43154l9448A32188K69503
10333D01691c9975k337D17924i6180a8752F4456K95893j66852L73800B49349B9844
10321A72327C5434K8763K16381A38440o8846c6683A60870L30553A07260d6764
10310C06070b3469C66744a43916M6677C3178g8251I0504c5770A36860a17512k69094
$$ plain form
10384 162466 -98208 205087 73895 -81202 154806 339652 207851 278316 122381 199131
10374 199131 165465 209156 213647 355222 282625 331595 468480 204602 362552 428444 507676
10363 507676 -127264 148715 334965 99851 121566 -89643 283495 319400 51432 209894
10353 209894 311651 438355 1063592 486612 493278 237831 86368 -72973 602361 612495
10343 612495 371836 417551 580693 220445 41838 -12136 343154 303706 132188 401691
10333 401691 -39975 -42312 417924 -96180 -18752 64456 360349 193497 567297 249349 29844
10321 172327 35434 64197 280578 138440 69594 -36683 160870 491423 107260 -46764
10310 306070 -23469 366744 -143916 -97239 33178 -78251 90504 -35770 136860 -117512 -386606
10299c86606a16271C81549b13341N6770A08170a37382B3828K4335J06564d070
10288A69858n7158K46840F5993J31606d88363a65496A78320g5933D0073J31159
10278A71232G3083G630L7442c4351D0367c1587g101k16660N0776L6032j511j32321
10266b70785B27926I2782b11655H5759K65J07416F4398M34350B30796r5279K39795
10255C75312I8654J87148a18183r8169j33816A03456b59886p7449g3908E7857
10244C16284a64469n7309A90761c43926B97613h3133a9487j49496P5892B91393
10233g0772D5930K2139g3120j56964C008J12420a217m44801J52453H606a88829
10221a68480h2285c9687p4766k3368q9496D6983a41427b5553m18627a43185e8824
$$ plain form
10299 -386606 -116271 381549 -213341 -156571 108170 -137382 23828 48163 154727 -4070
10288 169858 112700 359540 65993 197599 -488363 -165496 178320 -75933 40073 171232
10278 171232 73083 7630 45072 -34351 40367 -31587 -7101 -223761 -172985 -136953 -138464 -270785
10266 -270785 227926 92782 -211655 85759 86024 193440 64398 498748 230796 135517 375312
10255 375312 98654 285802 -118183 -216352 -350168 103456 -259886 -337335 -73908 57857
10244 316284 -164469 -221778 190761 -343926 297613 -83133 -19487 -168983 -93091 291393
10233 -70772 45930 68069 -73120 -230084 3008 115428 -1217 -446018 -293565 8606 -188829
10221 -168480 -82285 -39687 -114453 -137821 -227317 46983 -141427 -25553 -444180 -143185 -58824
10209a04053j93263i0709E3347b24766A48544i1206A72136p7759c21468Q3339
10199b38129C1007L75774C7081J2206J63479b97758a6156A58174F3380b01021
10188H0534b1973o3162H8632B8782b50789j08387a47903d338l69256a7776E8331
10176A2905a59137B13630E1716i4134m2439q5194a03498l72997A34373E7630b94336
10164b16838g240j21156b5548p472j23500B278b73169J07948k0899J2431F174
10152d74778B35348b75423a25594k09218B76505i1304K2904m11386A24313h9803
10141a89929A10136L9720b22841B03462g1111D20800a37950K9025A03301b57931
10130A0633P1006a33892q2621N8397b2136r6460A0849J86195D2681b73033G1613
$$ plain form
10209 -104053 -297316 -90709 53347 -224766 148544 -91206 172136 94377 -321468 -238129
10199 -238129 31007 406781 37081 49287 212766 -297758 -16156 158174 63380 -201021
10188 80534 -21973 -85135 88632 28782 -250789 -359176 -147903 -4338 -373594 -17776 58331
10176 12905 -159137 213630 51716 -94134 -136573 -221767 -103498 -476495 134373 57630 -294336
10164 -216838 -7240 -128396 -25548 -33020 -156520 2278 -273169 -165221 -186120 -173689 6174
10152 -474778 235348 -275423 -125594 -334812 276505 -91304 -68400 -479786 124313 -89803
10141 -189929 110136 149856 -222841 203462 -71111 420800 -137950 -108925 103301 -257931
10130 10633 81639 -133892 -216513 -158116 -22136 -118596 10849 197044 42681 -273033 71613
10118a35449A62891C6040d9188A42744b39031a18413j93352B8318a3124k82758
10108b95882J12151g6102d789F2599L6771D1562M3626h9241A0664a07378J6172
10097i1206A66404E0968a68400E1670b85775d7081j13689A86488i7334L1343A16086
10085A45139g3180A5339a36371f4022A97021a02859k85568f9936p3127A32943
10074A67049A6875J29522j5627F0216L552c0375H9704a17977M967k70022C860
10062C00313a46816c4715k07539a00509A25202b49071B34021a93908g7355l62466
10052d39821A8321a74676P3490M2478C24918i1906J5291q446q3887E5975b05350
10040a15292j1254e1922j00853M4259I9009a83598Q0524l25146D0711j3818d60803
$$ plain form
10118 -135449 162891 36040 -49188 142744 -239031 -118413 -311765 28318 -13124 -295882
10108 -295882 -183731 -76102 -4789 62599 99370 41562 85188 -89241 10664 -107378 -91206
10097 -91206 166404 50968 -168400 51670 -285775 -47081 -160770 186488 -97334 -65991 116086
10085 145139 -73180 15339 -136371 -64022 197021 -102859 -388427 -69936 -143063 132943
10074 167049 16875 146397 130770 60216 63768 -30375 89704 -117977 -113010 -383032 3860
10062 300313 -146816 -34715 -242254 -100509 125202 -249071 234021 -193908 -77355 -439821
10052 -439821 18321 -174676 -101186 -58708 324918 -91906 -76615 -85061 -168948 55975 -205350
10040 -115292 -126546 -51922 -152775 -108516 99009 -183598 -103074 -428220 40711 26893 -460803
10028a07128A67136a39071f4301J8346l8697H0081b18697h7389J5017G8871K15087
10017B93958c93035a65106P9906p0064H8969J13672d6090a9049j10177A0913j222
10006I691N7665b04774d4489H5723O6193B8584a12129n8426a4358C21282i45B0019
9993h4366j43435f0818k44517i9143L7873o4222K2390F0416L6918c26104h8518
9981h3095A72036K47726j95530d92159J99188g7944n6720A22265b73815J30502
9971a43313B18009c79770F7801k1069J88067b20066e2897a0398A49195a73911
9960c33156d81A77054H1184a99156B11853E459J11970e51281A3477b12673C2142
9948C8044f6973j73824J06242G6291J9145J57070H3812i1119j26510E8165b24975
$$ plain form
10028 -107128 167136 -139071 -64301 -45955 -84652 80081 -218697 -87389 -72372 78871 293958
10017 293958 -393035 -165106 -85200 -155264 88969 202641 -46090 -19049 -129226 10913 9691
10006 9691 67356 -204774 -44489 85723 151916 28584 -112129 -170555 -14358 321282 -945 20019
9993 -84366 -227801 -60818 -305335 -99143 -61270 -125492 -103102 60416 97334 -326104 -88518
9981 -83095 172036 419762 224232 -492159 -292971 -77944 -134664 122265 -273815 -143313
9971 -143313 218009 -379770 67801 46732 234799 -220066 -52897 -10398 149195 -173911
9960 -333156 -481 177054 81184 -199156 211853 5459 117429 -551281 13477 -212673 32142
9948 38044 -66973 -240797 -134555 76291 95436 252506 83812 -91119 -217629 58165 -224975
9936h1384L0114p1469k8376A18437B8240f8948q561A99969b301A18740R845a2260
9923A04403J12272b09346n218m9581F6354a04480B50477a07056C38453D976b65933
9911h9830l1500A49499b62787L7536j540A47146J19551a01258A56775b48889d4668
9899b41656C5565P2458a93842q5894j3066g682k74390P6835l671L9044M9353r7908
9887b18419a7378A25937j229a53602k74474A04802J88189A2882b20846a4939j08258
9876a23197j67619J15970l07637J07387a70573N6458j3807j73792r6367a02229
9865A49711c2273m46030a43594g830A66784b16015D200a10135B42788A1207a91781
9853b6290n7334A55561o0131b35107a0780E6876b06338k4373p6982I7044l1786
$$ plain form
9936 -81384 -51270 -122739 -151115 118437 28240 -68948 -77509 199969 -2301 118740 128585 -12260
9923 104403 216675 -209346 -214564 -264145 66354 -104480 250477 -107056 338453 4976 -265933
9911 -89830 -121330 149499 -262787 -225251 -226791 147146 266697 -101258 156775 -248889 -44668
9899 -241656 35565 108023 -193842 -279736 -292802 -7682 -282072 -205237 -208908 -169864 -120511 -218419
9887 -218419 -17378 125937 124708 -153602 -428076 104802 292991 12882 -220846 -14939 -123197
9876 -123197 -290816 -174846 -482483 -375096 -170573 -114115 -127922 -301714 -398081 -102229
9865 149711 -32273 -478303 -143594 -7830 166784 -216015 4200 -110135 242788 11207 -191781
9853 -26290 -83624 155561 95430 -235107 -10780 56876 -206338 -230711 -307693 97044 65258
9842F5258R9347A0939b58565A46459n8828J42603a51672p3325b5844D4415g0306
9830a6145j28030B2748a4588C9715a03723L5196F9203h9629A35701b14612g423
9818b22929n4659A16413a00005G3915a08505j15744a8161B74912A2831K12956
9808B25787c02894N8987g2090B13178K22402F7876B855b03444L8416k72858a7461
9796a22150j81875l8062b5942A37548a52723J5921k01034R1294d1873j62906E43671
9784a32210n2781h7197B03617g7144l6923E5766N2228Q3884a21778N5858k17872
9773b83792B92563g4657j19457h8842b7647B89702l9367a98258F2600i1583D6442
9761d9707e220n3260k13217a19924d6422J9957B60815A26792m1987g0206n6619
$$ plain form
9842 65258 164605 10939 -258565 146459 87631 230234 -151672 -224997 -25844 44415 -70306
9830 -16145 -144175 22748 -14588 39715 -103723 -68527 69203 -89629 135701 -214612 -7423
9818 -222929 -277588 116413 -100005 73915 -108505 -224249 -18161 274912 12831 225787
9808 225787 -302894 -243907 -72090 213178 435580 67876 2855 -203444 -165028 -437886 -17461
9796 -122150 -304025 -342087 -25942 137548 -152723 -136802 -337836 -246542 -41873 -204779 543671
9784 -132210 -184991 -87197 203617 -77144 -114067 55766 107994 191878 -121778 -65920 -283792
9773 -283792 292563 -74657 -194114 -88842 -27647 289702 250335 -198258 62600 -91583 46442
9761 -49707 -5220 -58480 -271697 -119924 -46422 -26465 260815 126792 84805 -70206 -126825
9750a26825n2226j78209g0267D5319a60930A16197h2522j0743k45963a07307I2759
9738H881a08666A20351h2495j12882A5163a52969B78234b71439O537A05838C9314
9726i8634l31105a60052A59267O9823G8347e92327a27146m9506p9707a01598A22980
9714I5774f648A46970N6128B0639H581K766c90962A04551a16397B211J09629L2555
9702A44395A0503e9129R756k88699E3329g8949o7606A22403L8915c9576k27746
9691b67322a25026k8643C2226a34131O4969A91056a3671p6019j09102A02193g8192
9679C1242d16457i4143A11011P930b39999A38789e48296h078j85370N4213f7154
9667A7977J8842K19836J4870a31695l44604i9740k98610f4718j96600A18620b34439
$$ plain form
9750 -126825 -179051 -357260 -70267 45319 -160930 116197 -82522 -93265 -339228 -107307 92759
9738 8881 -108666 120351 -82495 -195377 15163 -152969 278234 -271439 -264902 105838 39314
9726 -98634 -429739 -160052 159267 229090 78347 -592327 -127146 -176652 -256359 -101598 122980
9714 95774 -6648 146970 203098 20639 8581 11347 -390962 104551 -116397 2211 111840 144395
9702 144395 10503 -59129 -49373 -338072 53329 -78949 -146555 122403 161318 -39576 -267322
9691 -267322 -125026 -153669 32226 -134131 -69162 191056 -13671 -89690 -198792 102193 -78192
9679 31242 -416457 -94143 111011 118941 -239999 138789 -548296 -8078 -193448 -139235 -67154
9667 17977 36819 256655 271525 -131695 -476299 -99740 -398350 -64718 -261318 118620 -234439
9655a0599j79042C753a29713A56237h9691k34455C28609E4103K7524b278j07607
9644a09885M5878j85769A31285E896O2359a02795k43859a51409C2154b87233i2045
9632c05B6304O131a83950B96287e604j37925E1788a66474A31166d1047a633k41418
9620b43051i3884l18216C56429A17101g47574b15225C7837A7410L9472h3225j78143
9609b61368h2777K3009J5654A56468a29319l7438D6475j3248b86762c8696k06821
9598b45517D7874J25369a23141A10556d67442K20499f2321G3203f2739K3752q1870
9587a20857p034C9667d2848A66043a55335B00074c34100m6680h9474q6960C9684
9575B96533a71014j11248A391L13020I3609b87312a09931j2294n2580L9174C27752
$$ plain form
9655 -10599 -189641 3753 -129713 156237 -89691 -324146 328609 54103 81627 -2278 -109885
9644 -109885 -64007 -249776 131285 5896 68255 -102795 -346654 -151409 32154 -287233 -92045
9632 -305 26304 32435 -183950 296287 -5604 -143529 51788 -166474 131166 -41047 -1633 -243051
9620 -243051 -93884 -412100 356429 117101 -747574 -215225 37837 17410 56882 -83225 -261368
9609 -261368 -82777 -59768 -44114 156468 -129319 -166757 46475 33227 -286762 -38696 -245517
9598 -245517 47874 173243 -123141 110556 -467442 -246943 -62321 73203 -62739 -38987 -120857
9587 -120857 -127891 39667 -42848 166043 -155335 200074 -334100 -380780 -89474 -176434 39684
9575 296533 -171014 -282262 1391 314411 93609 -287312 -109931 -122225 -174805 -135631 327752
9563b29829B68478A31800B9199a31252B41638c87557F257Q7768O1832a95928Q9413
9552a06515A16869l2697D1366J43963b24401e2076A26174a139j4158A22913b4033
9540b4000k1142l41343J35712a04670b0281k57475k47343b32609l0540D2601d9057
9528C2743h7858j42254I3462a16293M7459j6428L1922j70326O1956F4985b47639
9516b74464A62194b60778C12457b41148F4677J73852a49976L1622E262J13008
9506A18270a10297N1070I0911K5841g9862L6110j05727j13939G1757a42246J7412
9495a24834B1822c15700P9426A85239o2627c07407G9365c3915E6529a58558b77
9483h2663r8960P6030A24039a36848B33613F3863C0603c9309j38403k19827F5130
$$ plain form
9563 -229829 268478 131800 29199 -131252 241638 -387557 6257 94025 155857 -195928 -106515
9552 -106515 116869 84172 41366 185329 -224401 -52076 126174 -1139 -15297 122913 -24033
9540 -24000 -45142 -386485 -250773 -104670 -20281 -277756 -525099 -232609 -263149 42601 -49057
9528 32743 -87858 -230112 93462 -116293 -68834 -85262 -53340 -223666 -161710 64985 -247639
9516 -274464 162194 -260778 312457 -241148 64677 238529 -149976 -118354 5262 118270
9506 118270 -110297 -59227 90911 116752 -79862 -43752 -149479 -263418 71757 -142246 -124834
9495 -124834 21822 -315700 -236274 185239 122612 -307407 79365 -33915 56529 -158558 -277
9483 -82663 -181623 -105593 124039 -136848 233613 63863 30603 -39309 -177712 -397539 65130
9471a42691n09j42479a00734I3181g4912o1355k37058d3197B4040b74689A18110
9459a71926A88967K07620A05389D0709K2345c29685a24574a0055l28390J28624
9449b09821A8237M6453f6841r6787O3116j66135C5954M10679b33983J03628L4455
9438i5900A39169b7362H6848N5971a06418j38836L2456B65322h8603L7601p9291
9427a30293j14345F560a38024M1297b4384A06415b6716l4518k47018A3741b03770
9415B058c14949B1680g2675k0101J7457r4229p2562H9160m4514b05413L6425A57390
9402A57453b89385B67886C1754J59438b04365G1646b2460D6599M1472a7695r5728
9391a13423q238A17452d31296d2283q8803B20377b14213B09331j01210a2229C606
$$ plain form
9471 -142691 -143200 -285679 -100734 93181 -74912 -136267 -373325 -43197 24040 -274689 118110
9459 -171926 188967 396587 105389 40709 63054 -329685 -124574 -10055 -338445 -209821
9449 -209821 18237 64690 -66841 -163628 -100512 -266647 35954 446633 -233983 -130355 -95900
9438 -95900 139169 -27362 86848 142819 -106418 -245254 -212798 265322 -88603 -51002 -130293
9427 -130293 -244638 6560 -138024 -96727 -24384 106415 -26716 -61234 -308252 13741 -203770
9415 2058 -314949 21680 -72675 -92776 -75319 -169548 -242110 89160 44646 -205413 -168988 157390
9402 157453 -289385 267886 31754 191192 -204365 71646 -22460 46599 88071 -17695 -113423
9391 -113423 -121661 117452 -431296 -42283 -131086 220377 -214213 209331 108121 -12229 3606
9379a36378E4917a50828c0932k37684l35167G3337d00448A3270a46525r0635h4991
9367c19805k1862J04067R3698O9553k69826A84214F6917a91612n4812g2244r4005
9356a66249l70o7390A99897n8066i4310E12646k14325a7730l5687a514A49370
9344B603f8183a0924A15209D3397b11039b25A40300b06709F2907a66311k5645
9333a91956a4295j93300b7082c793A56799c8695l16921O4656J01754G7269c24101
9321b13045i4692F0376c04305J16162A35501a10356B70408a40228A7482J09909
9311A27391A4768P675a17430j47703D1579a6074k99130a26432l13332e1704n5791
9300a07495A34342b67044a27140A83448g5765I338J13023d5985k2220B52727c1200
$$ plain form
9379 -136378 54917 -150828 -30932 -268616 -603783 73337 -400448 13270 -146525 -237160 -84991
9367 -319805 -341667 -237600 -143902 -74349 -344175 184214 66917 -191612 -246424 -72244 -166249
9356 -166249 -166619 -234009 199897 141831 -94310 512646 298321 -17730 -53417 -1514 149370
9344 2603 -68183 -10924 115209 43397 -211039 -225 140300 -206709 62907 -166311 -191956
9333 -191956 -14295 -207595 -27082 -3793 156799 -38695 -355616 -290960 -189206 77269 -324101
9321 -213045 -94692 60376 -304305 -188143 135501 -110356 270408 -140228 17482 127391
9311 127391 14768 22443 -117430 -265133 41579 -16074 -315204 -126432 -439764 -51704 -107495
9300 -107495 134342 -267044 -127140 183448 -75765 9338 122361 -45985 -68205 252727 -31200
9288A14126i5977L4457m48498a61318j26438a21964L9147E4285J23627a44161
9277h2443k44284J48401Q8194j94920J42494E3460c2964j80611P0744M0898j71712
9266b73645g4984E9847j9018d4519C19013F7535b24765H2602K1326b61293b4786
9254A4979J25741b24562q2145C017g0719K5451J4564j77338c1877p7346F9251
9242a63141r3692a15323A2549d81700a68094A8015a67921m5845D1682a82988A57248
9230a99740k30884a28642H4713c3805A17439D678b24682A24813d5222O376B55302
9218b70728l545E8568d9214l09042a53999e5022A89153q7468a87024L1314C26753
9206g5204m7350k52754A70304C1995a27877B6547K50693l5558a36233R568N4070
$$ plain form
9288 114126 -95977 -61520 -510018 -161318 -287756 -121964 -82817 54285 177912 -144161
9277 -82443 -326727 -178326 -90132 -285052 -142558 53460 -32964 -213575 -142831 -101933 -273645
9266 -273645 -74984 59847 40829 -44519 319013 67535 -224765 82602 103928 -261293 -24786
9254 14979 140720 -224562 -306707 3017 -70719 -45268 -30704 -208042 -31877 -109223 69251
9242 -163141 -256833 -115323 12549 -481700 -168094 18015 -167921 -213766 41682 -182988 157248
9230 -199740 -430624 -128642 84713 -33805 117439 4678 -224682 124813 -45222 -38846 255302
9218 -270728 -274273 58568 -49214 -358256 -153999 -55022 189153 101685 -187024 -155710 326753
9206 -75204 -122554 -375308 170304 31995 -127877 26547 277240 241682 -136233 -126665 -72595
9195g2595p736F8400L2920c07705c4775C07240c21514F6178g8657j37322A77533
9183B83384b0087r9381D0582L0135h7707A26053a50584A82291a1292m4405B87
9171G860c14802A08298a72870K3673a7555r5573B29927F7782a41026k09678A24577
9159I2657a02868A53029a69332b8150q5809k59595a60600E7635b97452b8555q1833
9148a10388L7800B21471B7350c868B68563q5104o7044b42784C26582c13404f2710
9136b48319a7003r1040D7792M3839a21384B27601d24863b02430M9433j80006i9006
9124b11147m7578c1694q2844d1010B69651A30936A7887a2388j55102J0199e3419
9112b06416B43340j14017a53125A77515a175r1311B43871a14633B4955a01405
$$ plain form
9195 -72595 -80331 68400 101320 -307705 -34775 307240 -321514 66178 -78657 -215979 177533
9183 283384 -20087 -119468 40582 70717 -87707 126053 -150584 182291 -11292 -55697 287
9171 7860 -314802 108298 -172870 -149197 -17555 -113128 229927 67782 -141026 -350704 124577
9159 92657 -102868 153029 -169332 -28150 -113959 -373554 -160600 57635 -297452 -28555 -110388
9148 -110388 -72588 221471 27350 -3868 268563 183459 116415 -242784 326582 -313404 -62710
9136 -248319 -17003 -108043 47792 91631 -121384 227601 -424863 -202430 -152997 -333003 -99006
9124 -211147 -258725 -31694 -114538 -41010 269651 130936 17887 -12388 -167490 -157291 -53419
9112 -206416 243340 129323 -153125 177515 -1175 -92486 243871 -114633 24955 -101405
9101A52871i471A61585J6907c06046a1292r5131r1162n3931h8395B27021c71758
9089A06517a4065B37233c27683A03611a47132j4836I299i474j88731P0138A96556
9077b76729H190d4113A9436b6985k08923H7587a19725o1059A07266a87305h943
9065C4420K7175b94797A28954a30270j17801a03190D9552b18767E2568d4996n1060
9054i6056A8932b35477e9788K4772m354j72075C79596j12639F6081N8537a91727
9042f2856r6614j23772I4747K7073b6277l753o4434i063p0670o7628m886k6974
9030a79221J0976C00610A9216d9515j74527G6600e2649j07317C44982A3561a00334
9018a45696K4617A5433c79465F537a4508p2156m07662B05587J28283c11691f0366
$$ plain form
9101 152871 -9471 161585 178492 -306046 -11292 -106423 -197585 -251516 -88395 227021 -371758
9089 106517 -14065 237233 -327683 103611 -147132 -161968 9299 -9474 -198205 -128067 196556
9077 -276729 8190 -44113 19436 -26985 -235908 87587 -119725 -180784 107266 -187305 -8943
9065 34420 61595 -294797 128954 -130270 -248071 -103190 49552 -218767 52568 -44996 -96056
9054 -96056 18932 -235477 -59788 -35016 -39370 -211445 379596 266957 66081 124618 -191727
9042 -62856 -159470 -283242 94747 121820 -26277 -30030 -94464 -9063 -79733 -147361 -152247 -179221
9030 -179221 -168245 300610 19216 -49515 -224042 76600 -52649 -159966 344982 13561 -100334
9018 -145696 -121079 15433 -379465 6537 -14508 -86664 -494326 205587 333870 -311691 -60366
9006a25701C933a37106m90105M3499d9930D46370a28576K5674G2443B1099b13854
8994A46762L65b1845I4107a7669j10421D6813J15941p2862L42278C3257M9674
8983H2931a3287o0787k5514D9539a30097o2923A30177a60848b6093k1164k6427
8972g3684j53638c3400l2008j09403A97435f2307o2562E007M2971D68J2802c17002
8959A26023f6796j58628j4190J3796a12326j41971P1298A25585c5841J6853B2432
8947H7513L4169e4875j91635A19153g7622B02796p9849J2136a96396D01408i9081
8935a41470C57877G7860J54742o4514E7185c21690f7705I3760K64466n7005r8696
8924B02525N4285J000251L459300K691496A956472I25230A36490O4449a81949
$$ plain form
9006 -125701 3933 -137106 -627211 -583712 -49930 446370 -128576 -102902 72443 21099 -213854
8994 146762 147127 -21845 94107 -17669 -128090 46813 162754 89892 432170 33257 82931
8983 82931 -13287 -74074 -99588 49539 -130097 -193020 130177 -160848 -26093 -47257 -73684
8972 -73684 -227322 -33400 -65408 -174811 197435 -62307 -124869 5007 47978 468 13270 -317002
8959 126023 -66796 -225424 -239614 -225818 -112326 -254297 -182999 125585 -35841 -18988 22432
8947 87513 121682 -54875 -246510 119153 -77622 202796 122947 135083 -196396 401408 -99081
8935 -141470 357877 77860 232602 168088 57185 -321690 -67705 93760 358226 301221 202525
8924 202525 256810 1257061 4716361 7407857 1956472 925230 136490 200939 -181949
8914G1387J77772f7481A77991D4155d3372B3801L54776n6753C7465b46160R3306
8903a52854k10117B25523b07562k0640H8337a3634r3613q8681B15022L4271a5975
8891a3542q5911A86246b18422a2407r1596N557A52238a59231j290o2556N4293
8880a68784A77235b21701g1182A05461A7423M91J8960B908a89609p1938b2576
$$ plain form
8914 71387 249159 -67481 177991 44155 -43372 23801 378577 321824 37465 -246160 -152854
8903 -152854 -362971 225523 -207562 -228202 88337 -13634 -107247 -195928 215022 249293 -15975
8891 -13542 -99453 186246 -218422 -12407 -104003 -98446 152238 -159231 -160521 -223077 -168784
8880 -168784 177235 -221701 -71182 105461 17423 17914 36874 2908 -189609 -261547 -22576
$$ [...]
##END NTUPLES=NMR SPECTRUM
##END=
