##TITLE=AC1693_COLAH14373_8650558_MZPfZwUmKT
##JCAMPDX= 6.0         $$ Bruker NMR JCAMP-DX V2.0
##DATA TYPE= NMR SPECTRUM
##DATA CLASS= NTUPLES
##ORIGIN= BRUKER
##OWNER= Administrator
$$ 1.72 TOPSPIN		Version 2.1
$$ 2014-05-31 00:13:56.290 -0700  Administrator@X
$$ Compression mode = diff/dup
##.OBSERVE FREQUENCY= 400.02188249412
##.OBSERVE NUCLEUS= ^1H
##.ACQUISITION MODE= SIMULTANEOUS (DQD)
##.ACQUISITION SCHEME= undefined
##.AVERAGES= 64
##.DIGITISER RES= 22
##SPECTROMETER/DATA SYSTEM= spect
##.PULSE SEQUENCE= noesygpps1d.comp
##.SOLVENT NAME= COFFEE_meoh
##.SHIFT REFERENCE= INTERNAL, COFFEE_meoh, 1, 14.96104
##AUDIT TRAIL= $$ (NUMBER, WHEN, WHO, WHERE, PROCESS, VERSION, WHAT)
$$ ##TITLE= Audit trail, TOPSPIN		Version 2.1
$$ ##JCAMPDX= 5.01
$$ ##ORIGIN= Bruker BioSpin GmbH
$$ ##OWNER= Administrator
$$ $$ E:\/data/COFFEE/nmr/AC1693_COLAH14373_8650558_MZPfZwUmKT/12/pdata/1/auditp.txt
$$ ##AUDIT TRAIL=  $$ (NUMBER, WHEN, WHO, WHERE, PROCESS, VERSION, WHAT)
(   1,<2014-05-31 00:13:50.884 -0700>,<Administrator>,<X>,<go>,<TOPSPIN 2.1>,
      <created by zg
	started at 2014-05-31 00:02:19.678 -0700,
	POWCHK enabled, PULCHK disabled,
       configuration hash MD5:
       C8 4E 4E 5D D3 5C D8 9E 9F 52 82 E0 59 8A DE 15
       data hash MD5: 64K
       04 D0 36 39 62 55 9A 22 B3 58 A9 36 28 06 09 AE>)
(   2,<2014-05-31 00:13:54.009 -0700>,<Administrator>,<X>,<proc1d>,<TOPSPIN 2.1>,
      <Start of raw data processing
       efp LB = 0.3 FT_mod = 6 PKNL = 1 PHC0 = 0 PHC1 = 0 SI = 128K 
       data hash MD5: 128K
       8A 84 5A DB DA D0 9C FC C0 DD 12 3C AE AF 98 9D>)
(   3,<2014-05-31 00:13:55.134 -0700>,<Administrator>,<X>,<proc1d>,<TOPSPIN 2.1>,
      <pk PHC0 = -86.33606 PHC1 = 0 
       data hash MD5: 128K
       5A 1B C5 26 30 91 A2 F5 32 67 FC 94 12 DA F5 D7>)
(   4,<2014-05-31 00:13:55.634 -0700>,<Administrator>,<X>,<proc1d>,<TOPSPIN 2.1>,
      <abs ABSG = 1 
       data hash MD5: 128K
       78 19 56 CC E0 91 CD A6 0B EE F5 92 7C 1B 12 71>)
(   5,<2014-05-31 00:13:55.744 -0700>,<Administrator>,<X>,<proc1d>,<TOPSPIN 2.1>,
      <abs ABSG = 2 
       data hash MD5: 128K
       05 D3 91 0A 37 65 E4 68 24 29 34 93 95 33 5D 8D>)
(   6,<2014-05-31 00:13:55.869 -0700>,<Administrator>,<X>,<proc1d>,<TOPSPIN 2.1>,
      <abs ABSG = 3 
       data hash MD5: 128K
       9D 38 D6 C6 7D C8 5E 4F 76 B1 67 D0 1B A0 BD 3C>)
(   7,<2014-05-31 00:13:55.978 -0700>,<Administrator>,<X>,<proc1d>,<TOPSPIN 2.1>,
      <abs ABSG = 4 
       data hash MD5: 128K
       D1 36 44 0F 06 0C 56 F7 D4 81 A9 71 FA A2 A0 70>)
(   8,<2014-05-31 00:13:56.056 -0700>,<Administrator>,<X>,<proc1d>,<TOPSPIN 2.1>,
      <abs ABSG = 5 
       data hash MD5: 128K
       30 70 19 7E DE CD 75 80 74 02 6B 54 B2 7D 6D D9>)
$$ ##END=
$$ 
$$ $$ hash MD5
$$ $$ 74 A4 BF ED 73 33 16 8F 55 CB 54 0E F1 AC 3F C5
##$RELAX= 
##$RELAX= 
##$RELAX= 
##$RELAX= 
##$RELAX= 
##$RELAX= 
##$RELAX= 
##$RELAX= 
$$ Bruker specific parameters
$$ --------------------------
##$DU= <E:\>
##$EXPNO= 12
$$ [...]
##$TP07= 0
##$TPNAME0= <>
##$TPNAME1= <>
##$TPNAME2= <>
##$TPNAME3= <>
##$TPNAME4= <>
##$TPNAME5= <>
##$TPNAME6= <>
##$TPNAME7= <>
##$TPOAL= (0..7)
0.5 0.5 0.5 0.5 0.5 0.5 0.5 0.5
##$TPOFFS= (0..7)
0 0 0 0 0 0 0 0
##$TUNHIN= 0
##$TUNHOUT= 0
##$TUNXOUT= 0
##$USERA1= <user>
##$USERA2= <user>
##$USERA3= <user>
##$USERA4= <user>
##$USERA5= <user>
##$V9= 5
##$VALIST= <valist>
##$VCLIST= <CCCCCCCCCCCCCCC>
##$VD= 0
##$VDLIST= <DDDDDDDDDDDDDDD>
##$VPLIST= <PPPPPPPPPPPPPPP>
##$VTLIST= <TTTTTTTTTTTTTTT>
##$WBST= 2048
##$WBSW= 25
##$XGAIN= (0..3)
0 0 0 0
##$XL= 0
##$YL= 0
##$YMAX_a= 6243431
##$YMIN_a= -13061329
##$ZGOPTNS= <>
##$ZL1= 120
##$ZL2= 120
##$ZL3= 120
##$ZL4= 120
##$ABSF1= 14.96104
##$ABSF2= -5.597142
##$ABSG= 5
##$ABSL= 3
##$ALPHA= 0
##$AQORDER= 0
##$ASSFAC= 0
##$ASSFACI= 0
##$ASSFACX= 0
##$ASSWID= 0
##$AUNMP= <proc_prof1d_extract.lims>
##$AXLEFT= 0
##$AXNAME= <>
##$AXNUC= <1H>
##$AXRIGHT= 0
##$AXTYPE= 0
##$AXUNIT= <>
##$AZFE= 0.1
##$AZFW= 0.1
##$BCFW= 0
##$BC_mod= 0
##$BYTORDP= 0
##$COROFFS= 0
##$CY= 15
##$DATMOD= 1
##$DC= 0
##$DFILT= <>
##$DTYPP= 0
##$F1P= 0
##$F2P= 0
##$FCOR= 0.5
##$FTSIZE= 131072
##$FT_mod= 6
##$GAMMA= 0
##$GB= 0
##$INTBC= 1
##$INTSCL= 1
##$ISEN= 128
##$LB= 0.3
##$LEV0= 0
##$LPBIN= 0
##$MAXI= 10000
##$MC2= 0
##$MEAN= 0
##$ME_mod= 0
##$MI= 0
##$NCOEF= 0
##$NC_proc= -2
##$NLEV= 6
##$NOISF1= 0
##$NOISF2= 0
##$NSP= 0
##$NTH_PI= 0
##$NZP= 0
##$OFFSET= 14.96104
##$PC= 1
##$PHC0= -86.33606
##$PHC1= 0
##$PH_mod= 1
##$PKNL= yes
##$PPARMOD= 0
##$PPDIAG= 0
##$PPIPTYP= 0
##$PPMPNUM= 2147483647
##$PPRESOL= 1
##$PSCAL= 4
##$PSIGN= 0
##$PYNMP= <proc.py>
##$REVERSE= no
##$SF= 400.020009620068
##$SI= 131072
##$SIGF1= 0
##$SIGF2= 0
##$SINO= 400
##$SIOLD= 131072
##$SPECTYP= <>
##$SREGLST= <1H.CDCl3>
##$SSB= 0
##$STSI= 131072
##$STSR= 0
##$SW_p= 8223.68421052631
##$SYMM= 0
##$S_DEV= 0
##$TDeff= 65536
##$TDoff= 0
##$TI= <>
##$TILT= no
##$TM1= 0
##$TM2= 0
##$TOPLEV= 0
##$USERP1= <user>
##$USERP2= <user>
##$USERP3= <user>
##$USERP4= <user>
##$USERP5= <user>
##$WDW= 1
##$XDIM= 131072
##$YMAX_p= 411869895
##$YMIN_p= -10935
##$CURPLOT= <Network HP LaserJet P1505>
##$CURPRIN= <$Network HP LaserJet P1505>
##$DFORMAT= <normdp>
##$LAYOUT= <+/1D_H.xwp>
##$LFORMAT= <normlp>
##$PFORMAT= <normpl>
##$SURQMSG= 1
$$ End of Bruker specific parameters
$$ ---------------------------------
##NTUPLES= NMR SPECTRUM
##VAR_NAME=  FREQUENCY,     SPECTRUM/REAL,   SPECTRUM/IMAG
##SYMBOL=    X,             R,               I
##VAR_TYPE=  INDEPENDENT,   DEPENDENT,       DEPENDENT
##VAR_FORM=  AFFN,          ASDF,            ASDF
##VAR_DIM=   131072,        131072,          131072
##UNITS=     HZ,            ARBITRARY UNITS, ARBITRARY UNITS
##FACTOR=    0.0627417313425164, 1,          1
##FIRST=     8223.62146879497, -1988,        -64057
##LAST=      0,             645,             -64601
##MIN=       0,             -10935,          0
##MAX=       8223.62146879497, 411869895,    0
$$ Real data points
##PAGE= N=1
##DATA TABLE= (X++(R..R)), XYDATA
$$ [...]
63876G08251q9K726M425O139R017J2735J5945J7993J9408K0752K1796K2140K2023
63863H83261K2092K2543K2904K2554K1255J9223J6920J4739J2763J0697Q126M900
63851A081977J322k173n482q890j2507j5922j8597k0551k2252k3948k5499k6905
63839I00573k8526l0480l2244l3143l3080l2459l1568l0392k8959k7474k6004
63828E66244k4297k2135j9838j8138j7376j6970j5977j4194j2297j0874r793q768
63816C75587p945p427o782n718m820m696m771l990k512j548j468j382q83p80j527
63801C19338k223k078j774k248l064l233k852k733k943k996l055l530l816k969
63787B79824j525j112k054k806k253j158p03q23q20o67p06p99o32m01l96l52Q
$$ plain form
63876 708251 708162 710888 715313 721452 730469 743204 759149 777142 796550 817302 839098 861238 883261
63863 883261 905353 927896 950800 973354 994609 1013832 1030752 1045491 1058254 1068951 1077077 1081977
63851 1081977 1083299 1081126 1075644 1066754 1054247 1038325 1019728 999177 976925 952977 927478 900573
63839 900573 872047 841567 809323 776180 743100 710641 679073 648681 619722 592248 566244
63828 566244 541947 519812 499974 481836 464460 447490 431513 417319 405022 394148 384355 375587
63816 375587 367642 360215 353433 347715 342895 338199 333428 329438 326926 325378 323910 322528 321645 320865 319338
63801 319338 317115 315037 313263 311015 307951 304718 301866 299133 296190 293194 290139 286609 282793 279824
63787 279824 278299 277187 275133 272327 270074 268916 268213 267390 266570 265903 265197 264398 263766 263365 262969 262617 262625
63770B62625K85ln12o36n96j048j771j767p89J91K73l21r05j295j617j634r95
63753B49485N7P71P57L89K65N73J093J537J813K007K276K632K825K570J962J484
63737B72496J467J714J839J874K204K902L484L504L086K738K759L090L578M067
63723C10802M330M189L799L616L906M402M508L905K889K041J569J060P4j159j953
63708C47978k062j973k113k256k006j526j267j214r17k38N01J134J886K788L348
63693C42063L162K570K315K632K988K751J928J191J208J947K579K211P95o97j129
63678C68514k91Q71J232O31n1l4L70K76m75j038p03K12R18J123J005N34m57j670
63660C70967k465k691k888l476m207m601m586m431m325m231m015l540k762j950
$$ plain form
63770 262625 262910 262907 262395 261759 261163 260115 258344 256577 255788 255979 256252 255931 255026 253731 252114 250480 249485
63753 249485 249542 250313 251070 251459 251724 252297 253390 254927 256740 258747 261023 263655 266480 269050 271012 272496
63737 272496 273963 275677 277516 279390 281594 284496 287980 291484 294570 297308 300067 303157 306735 310802
63723 310802 315132 319321 323120 326736 330642 335044 339552 343457 346346 348387 349956 351016 351090 349931 347978
63708 347978 345916 343943 341830 339574 337568 336042 334775 333561 332644 332406 332907 334041 335927 338715 342063
63693 342063 345225 347795 350110 352742 355730 358481 360409 361600 362808 364755 367334 369545 370340 369643 368514
63678 368514 368223 369094 370326 370957 370906 370872 371242 371518 371043 370005 369302 369514 370432 371555 372560 373094 372637 370967
63660 370967 368502 365811 362923 359447 355240 350639 346053 341622 337297 333066 329051 325511 322749 320799
63646C20799j542j710k096k169j690p83L05J358K228K848L288L687M135M584M882
63631C38124M980N077N412N886O143O121O238O785P467P857Q082Q613R570J0658
63617D37013J1709J2866J4287J6058J8288K0740K2601K3275K3373K4213K6139
63606F50562K8060K8861K8572K7744K6322K3827K0193J5794J0857N454qm733q056
63593H53449r852j0463j0439j0285j0303j0728j1870j3837j6108j7927j9207k0500
63581F91930k1878k2516k1798k0253j8725j7138j4867j2025r475p609n953m073
63569E15620k156m67J144K810M170M820M995N412O439P739Q728R239R618J0277
63555E88388J1272J2431J3710J5228J6976J8847K0983K3678K6859L0022L2912
$$ plain form
63646 320799 319257 317547 315451 313282 311592 310809 311114 312472 314700 317548 320836 324523 328658 333242 338124
63631 338124 343104 348181 353593 359479 365622 371743 377981 384766 392233 400090 408172 416785 426355 437013
63617 437013 448722 461588 475875 491933 510221 530961 553562 576837 600210 624423 650562
63606 650562 678622 707483 736055 763799 790121 813948 834141 849935 860792 866246 866238 861505 853449
63593 853449 843597 833134 822695 812410 802107 791379 779509 765672 749564 731637 712430 691930
63581 691930 670052 647536 625738 605485 586760 569622 554755 542730 533255 525646 519693 515620
63569 515620 513464 512997 514141 516951 521121 525941 530936 536348 542787 550526 559254 568493 578111 588388
63555 588388 599660 612091 625801 641029 658005 676852 697835 721513 748372 778394 811306
63544H11306L5758L8381L9522L7627L2175K3862J3892L666n208j1483j5007j6421
63532I88070j6263j4896j3051j1542j0475r676r896j2475j7404k2791k6841k9541
63520G93219l1676l3117l3217l2203l0894k9261k6571k2986j9807j7757j6065
63509D99665j3885j1688j0468j0168r742q607p172o033n332n030n152n446n267
63496C95675m188k606j339p51n01j52K52L23q5o03p08k26N54J301J979K697L354
63479C94976L660L516L145K758K330J808J329R96O30M7n62q65j008j542k589l461
63463D05168l442k693j980j631j226m08M64Q12P09Q59J698K899L871M428M785
63448D14313N084N387N954P063Q448R426R825J0298J1400J2720J3560J4119J5306
$$ plain form
63544 811306 847064 885445 924967 962594 994769 1018631 1032523 1036189 1030981 1019498 1004491 988070
63532 988070 971807 956911 943860 932318 921843 912167 902271 889796 872392 849601 822760 793219
63520 793219 761543 728426 695209 663006 632112 602851 576280 553294 533487 515730 499665
63509 499665 485780 474092 463624 453456 443714 435107 427935 421902 416570 411540 406388 400942 395675
63496 395675 391487 388881 387542 386791 386290 386138 386390 386713 386628 386025 385317 385091 385645 386946 388925 391622 394976
63479 394976 398636 402152 405297 408055 410385 412193 413522 414518 415148 415195 414633 413768 412760 411218 408629 405168
63463 405168 401726 399033 397053 395422 394196 393788 394252 395064 395773 396632 398330 401229 405100 409528 414313
63448 414313 419397 424784 430738 437801 446249 455675 465500 475798 487198 499918 513478 527597 542903
63435E42903J7441J9902K2274K4928K7987L0262L0017K6651K1197J5276J0051
63424G88889O111L818L445M978P919J1380J4596J7547K0812K4759K8951L2363
63412I65568L3882L2682K8634K2680J6237R927L377l424r216j2704j4136j4790
63400A058717j5190j4866j3807j3076j3817j6324k0245k4853k8959l1475l2462
63389H33643l2843l2854l1654k8916k5833k3795k2731k1582j9737j7205j3920
63378E62573r997o333l905k489r81J122L357N368P363R346J0916J2054J3319J4891
63364F16604J6158J6777J7375J8638K0268K1647K3004K5113K7997L0750L2661
63353H66992L3845L4559L4419L2642K8801K3085J6129Q839K200l118p040r890
$$ plain form
63435 542903 560344 580246 602520 627448 655435 685697 715714 742365 763562 778838 788889
63424 788889 795000 798818 802263 807241 815160 826540 841136 858683 879495 904254 933205 965568
63412 965568 999450 1032132 1060766 1083446 1099683 1109610 1112987 1109563 1100347 1087643 1073507 1058717
63400 1058717 1043527 1028661 1014854 1001778 987961 971637 951392 926539 897580 866105 833643
63389 833643 800800 767946 736292 707376 681543 657748 635017 613435 593698 576493 562573
63378 562573 552576 546243 542338 539849 538868 539990 543347 548715 556078 565424 576340 588394 601713 616604
63364 616604 632762 649539 666914 685552 705820 727467 750471 775584 803581 834331 866992
63353 866992 900837 935396 969815 1002457 1031258 1054343 1070472 1079311 1081511 1078393 1071353 1061463
63341A061463j1880j2972j3199j2985j2961j3537j4796j6696j9227k2231k5304
63330H85675k7965k9797l0422k9600k7542k4883k2129j9282j6194j2976r721o220
63318F28944k513M44J312l67l974q766j4237j9357k2439k2474k0179j7204j4582
63305D84608j2459j0779r506q335o958n606m779m416l894k878j773j131j082j402
63291D09610j845k244k592l050l661m111m077l736l540l574l549l362l143k718
63277C64408j734m19L97L45j1q1l3k45n12l97K9M49J039K183L600M342L834K488
63259C79682J285J106K268M205N634N679M900M700N636O881P544P832Q451R390
63245D55193J0049J0309J0832J2162J4024J5676J6705J7353J8276K0050K2747
$$ plain form
63341 1061463 1049583 1036611 1023412 1010427 997466 983929 969133 952437 933210 910979 885675
63330 885675 857710 827913 797491 767891 740349 715466 693337 674055 657861 644885 635164 628944
63318 628944 626431 626875 628187 627820 623846 615080 600843 581486 559047 536573 516394 499190 484608
63305 484608 472149 461370 451864 443529 436571 430965 426186 421770 417876 414998 413225 412094 411012 409610
63291 409610 407765 405521 402929 399879 396218 392107 388030 384294 380754 377180 373631 370269 367126 364408
63277 364408 362674 362255 362652 362997 362986 362905 362872 362627 362115 361718 361747 362196 363235 365418 369018 373360 377194 379682
63259 379682 380967 382073 384341 388546 394180 399859 404759 409459 415095 421976 429520 437352 445803 455193
63245 455193 465242 475551 486383 498545 512569 528245 544950 562303 580579 600629 623376
63234F23376K5782K8289K9816L0610L1222L2016L3072L4316L5460L5915L5217
63223I75091L3614L2020L1183L1082L1217L1196L0842L0052K8938K7969K7370
63212A310574K6497K4276K0329J5189R338K656m886j2606j9725k6124l1972l6914
63200A276632m0384m2461m3740m4268m3287m0306l5923l1287k7093k3321j9698
63189H84864j6078j2490q969n443j800J863N171P851J0096J2301J4471J6166J7044
63176I25047J7229J7170J7312J7807J8329J8270J7361J5970J4534J2959J0967
63165A102955Q707O432L724r2m802r358j3361j7606k2652k7576l0862l2183l2507
63152I30819l2699l2653l1838l0166k8073k5951k3754k1205j8444j6218j5057
$$ plain form
63234 623376 649158 677447 707263 737873 769095 801111 834183 868499 903959 939874 975091
63223 975091 1008705 1040725 1071908 1102990 1134207 1165403 1196245 1226297 1255235 1283204 1310574
63212 1310574 1337071 1361347 1381676 1396865 1406203 1408859 1403973 1391367 1371642 1345518 1313546 1276632
63200 1276632 1236248 1193787 1150047 1105779 1062492 1022186 986263 954976 927883 904562 884864
63189 884864 868786 856296 847327 841884 840084 841947 847118 854969 865065 877366 891837 908003 925047
63176 925047 942276 959446 976758 994565 1012894 1031164 1048525 1064495 1079029 1091988 1102955
63165 1102955 1111662 1118094 1121818 1121726 1116924 1107566 1094205 1076599 1053947 1026371 995509 963326 930819
63152 930819 898120 865467 833629 803463 775390 749439 725685 704480 686036 669818 654761
63141F54761j4384j3000j0506p758n662m185k900j924j624j763j598p36N17J628
63127E90866K303K667L167M158N324N917N779N678O174O698O328N078L778K902
63113F56817K300J839J608J541J462J404J386J060K55m35m10j28n10j355j519
63098F65315p18K6Lk27n4J10k34o18l54L33Q51J329K192L064L176K651K416K855
63080F82116L479L939M531N423O256O832P566Q804J0161J1037J1449J1909J2674
63067G86176J3539J4342J5348J7042J9643K2842K5959K8471L0488L2703L5796
63056A042349L9838M4321M8628N2538N6233N9993O3862O7633P1097P4170P6832
63045A697494P9072Q0959Q2502Q3346Q2850Q0826P8100P5920P4781P4078P3033
$$ plain form
63141 654761 640377 627377 616871 609113 603451 599266 596366 594442 592818 591055 589457 588721 589238 590866
63127 590866 593169 595836 599003 603161 608485 614402 620181 625859 632033 638731 645059 650137 653915 656817
63113 656817 659117 660956 662564 664105 665567 666971 668357 669417 669672 669237 668827 668699 668189 666834 665315
63098 665315 664597 664623 664626 664399 664345 664455 664221 663603 663249 663582 664433 665762 667954 671018 674194 676845 679261 682116
63080 682116 685595 689534 694065 699488 705744 712576 720142 728946 739107 750144 761593 773502 786176
63067 786176 799715 814057 829405 846447 866090 888932 914891 943362 973850 1006553 1042349
63056 1042349 1082187 1126508 1175136 1227674 1283907 1343900 1407762 1475395 1546492 1620662 1697494
63045 1697494 1776566 1857525 1940027 2023373 2106223 2187049 2265149 2341069 2415850 2489928 2562961
63034B562961P1587P0145O8659O6337O2281N6178M8205L8466K6737J2870k679
63023C081747j8944l5102n0877o6100p9983r1189r8840j03272j05475j05814j03691
63012B222460r8591r1152q2763p4263o5466n5975m6009l6109k6502j7218q649
63001A619763j406M460R649J4741J9455K3042K5302K6867K8488L0250L1573L1864
62989A864048L1109K9852K8677K7669K6324K3969K0326J5748J0845N768r4p508
62977B076733j6454k5947l4915m2979n0287n6755o1885o5214o6672o6499o5077
62966A524049o2856o0191n7096n3411m9274m5259m1888l9111l6424l3526l0701
62955A014312k8484k7006k5849k4628k3500k2764k2157k1049j9411j7997j7294
$$ plain form
63034 2562961 2634548 2704693 2773352 2839689 2901970 2958148 3006353 3044819 3071556 3084426 3081747
63023 3081747 3062803 3027701 2976824 2910724 2830741 2739552 2640712 2537440 2431965 2326151 2222460
63012 2222460 2123869 2032717 1949954 1875691 1810225 1754250 1708241 1672132 1645630 1628412 1619763
63001 1619763 1618357 1622817 1632466 1647207 1666662 1689704 1715006 1741873 1770361 1800611 1832184 1864048
62989 1864048 1895157 1925009 1953686 1981355 2007679 2031648 2051974 2067722 2078567 2084335 2084241 2076733
62977 2076733 2060279 2034332 1999417 1956438 1906151 1849396 1787511 1722297 1655625 1589126 1524049
62966 1524049 1461193 1401002 1343906 1290495 1241221 1195962 1154074 1114963 1078539 1045013 1014312
62955 1014312 985828 958822 932973 908345 884845 862081 839924 818875 799464 781467 764173
62944G64173j6844j6010j4865j3750j2516j0966r685r384r619r175p783o428n710
62931F21438m990l587j927q18l47j88l78r93j524j379p69m04n58r98j574k247
62915E98757k718k731k598k861l490l988m164m211m102l586k815k368k463k692
62901E53970k704k673k861l106l025k443j482m13M27P61N19j77j096j854k003
62886E31840j473p49k98m0L16O19M99L2l34m24l69j29L84Q26P99O45J032J631
62868E34807J218n55k409l016k570k035j590q13J16M77J96O3N92J389J840J826
62852E29536J562J212R30Q50P85L17n66j244j167n55j33k79p27j013j054j187
62836E27267j754k599l033k459j071K50Q61R40J054J337J467J354J422K020K906
$$ plain form
62944 764173 747329 731319 716454 702704 690188 679222 669537 660153 650534 641359 633576 627148 621438
62931 621438 616448 612861 610934 610116 609769 609581 609203 608210 606686 605307 604538 604134 603576 602578 601004 598757
62915 598757 596039 593308 590710 587849 584359 580371 576207 571996 567894 564308 561493 559125 556662 553970
62901 553970 551266 548593 545732 542626 539601 537158 535676 535263 535690 536451 536970 536793 535697 533843 531840
62886 531840 530367 529618 529320 529280 529596 530215 530714 530746 530412 529988 529619 529490 529874 530700 531499 532144 533176 534807
62868 534807 536025 535470 533061 530045 527475 525440 523850 523037 523153 523630 523826 523889 524481 525870 527710 529536
62852 529536 531098 532310 533240 534090 534875 535192 534626 533382 532215 531660 531527 531248 530521 529508 528454 527267
62836 527267 525513 522914 519881 517422 516351 516601 517462 518402 519456 520793 522260 523614 525036 527056 529962
62821E29962L553L811L983M331M801N237N558N672N470N048M713M674M894N377
62807E97084O246P417Q450R091R654J0512J1459J2030J2342J3035J4418J6175
62795G27913J7953J9713K1399K2879K4460K6888L0445L4596L8882M3693M9514
62784A058335N5877O1846O7345P3223P9935Q6933R3580R9949J06364J12593J17937
62773B013917J21780J23667J23083J19644J13408J04663R3406P9343O2360M2818
62763B998089K1437q03k2778m3502o2387p9095r3225j04462j12953j19081j22844
62752B258396j23823j22033j18373j13903j08994j03490r7350r0650q3188p4874
62742A221718o6494n9388n4077m9719m5271m0699l6587l3043k9634k6191k3004
$$ plain form
62821 529962 533515 537326 541309 545640 550441 555678 561236 566908 572378 577426 582139 586813 591707 597084
62807 597084 603330 610747 619197 628288 637942 648454 659913 671943 684285 697320 711738 727913
62795 727913 745866 765579 786978 809857 834317 861205 891650 926246 965128 1008821 1058335
62784 1058335 1114212 1176058 1243403 1316626 1396561 1483494 1577074 1677023 1783387 1895980 2013917
62773 2013917 2135697 2259364 2382447 2502091 2615499 2720162 2813568 2892911 2955271 2998089
62763 2998089 3019526 3018723 2995945 2952443 2890056 2810961 2717736 2613274 2500321 2381240 2258396
62752 2258396 2134573 2012540 1894167 1780264 1671270 1567780 1470430 1379780 1296592 1221718
62742 1221718 1155224 1095836 1041759 992040 946769 906070 869483 836440 806806 780615 757611
62731G57611k0136j7225j4127j1324r380q233p341o364n375m468l444k015k36
62718F47943J418K541L277M219N769P815J0023J2236J4454J6708J9235K2417K6257
62705G94312L0059L3117L5591L8287M1685M5587M9648N3637N7231O0163O2768
62694A302085O5699O8840P1143P1856P1310O9894O6892O1164N2707M2673L1849
62683A976112J9969O687p436k1281l4115m5743n6002o4513p0934p5214p7582p8386
62671A471562p7861p6034p2878o8619o3835n9137n4815n0749m6641m2313l7897
62660H20783l3761l0228k7375k5048k3010k0958j8609j5928j3289j1255j0089
62649E91233r579r311r081r014r271r618r404q141o154m389l445k972k213r33
$$ plain form
62731 757611 737475 720250 706123 694799 685419 677186 669845 663481 658106 653638 650194 648179 647943
62718 647943 649361 651902 655179 659398 665167 672982 683005 695241 709695 726403 745638 768055 794312
62705 794312 824371 857488 893079 931366 973051 1018638 1068286 1121923 1179154 1239317 1302085
62694 1302085 1367784 1436624 1507767 1579623 1650933 1720827 1787719 1848883 1901590 1944263 1976112
62683 1976112 1996081 2002768 1995332 1974051 1939936 1894193 1838191 1773678 1702744 1627530 1549948 1471562
62671 1471562 1393701 1317667 1244789 1176170 1112335 1053198 998383 947634 900993 858680 820783
62660 820783 787022 756794 729419 704371 681361 660403 641794 625866 612577 601322 591233
62649 591233 581654 572343 563262 554248 544977 535359 525955 517814 511660 507271 503826 500854 498641 497708
62635D97708M38J407J808J645R54l8q64j132q70m64k51k06o1K79N09L67K00P13
62617E02142K023L396M273N045O296P600Q021P662P763Q954J0370J1070J1520
62604E96135J2811J4979J7128J9023K1389K4563K7884L0861L4024L7933M2069
62593H78799M5573M8634N2101N5874N8654N9546N8990N7675N5280N0935M4482
62582A466543L6505K7367J6950N384o572j8009k8262l6853m3519m8599n2839n6504
62570A261592n8917n9236n7474n4451n1070m7836m4941m2235l9239l5581l1505
62559G39107k7708k4565k1811j8971j5979j3274j1385j0448j0034r510q601p562
62547E59259o640n619m146k402j074o51r91j596k031j985j318k71O01R26Q73Q84
$$ plain form
62635 497708 498146 499553 501361 503006 503960 503922 503058 501926 501056 500592 500341 500135 500074 500353 500862 501229 501429 502142
62617 502142 504165 507561 511834 516879 523175 530775 538796 546458 554221 563175 573545 584615 596135
62604 596135 608946 623925 641053 660076 681465 706028 733912 764773 798797 836730 878799
62593 878799 924372 973006 1025107 1080981 1139635 1199181 1258171 1315846 1371126 1422061 1466543
62582 1466543 1503048 1530415 1547365 1552749 1546177 1528168 1499906 1463053 1419534 1370935 1318096 1261592
62570 1261592 1202675 1143439 1085965 1031514 980444 932608 887667 845432 806193 770612 739107
62559 739107 711399 686834 665023 646052 630073 616799 605414 594966 584932 575422 566821 559259
62547 559259 552619 547000 542854 540452 539378 538727 537736 536140 534109 532124 530806 530535 531136 532062 532935 533819
62531E33819J188J731K430L235L995M541N018N929P715J0262J3007J5526J7896
62518F26292K0371K2890K5179K7314K9776L2717L5600L7871L9686M1553M3398
62507I82647M4589M4785M4207M2876M0288L6202L1238K6134K0713J4262O867k32
62495A334576n766r460j1674j2442j1370q360m001J011O463J2393J8432K3946
62483A333748K8851L3747L8866M3364M6223M7543M8054M7390M3780L6023K5132
62472A772721J3475K696p101j6640k6719l7783m9377n9945o7846p2702p5241p6000
62460A299538p4893p2123o8590o4905o0629n5075m8440m1587l5063k8913k3329
62449G25991j8790j5446j2832j0355p836n438l260j207Q15K624L821M236M299
$$ plain form
62531 533819 535007 536738 539168 542403 546398 550939 555957 561886 569601 579863 592870 608396 626292
62518 626292 646663 669553 694732 722046 751822 784539 820139 858010 897696 939249 982647
62507 982647 1027236 1072021 1116228 1159104 1199392 1235594 1266832 1292966 1313679 1327941 1334808 1334576
62495 1334576 1328810 1319350 1307676 1295234 1283864 1275504 1271503 1272514 1278977 1291370 1309802 1333748
62483 1333748 1362599 1396346 1435212 1478576 1524799 1572342 1620396 1667786 1711566 1747589 1772721
62472 1772721 1786196 1788892 1781791 1765151 1738432 1700649 1651272 1591327 1523481 1450779 1375538 1299538
62460 1299538 1224645 1152522 1083932 1019027 958398 903323 854883 813296 778233 749320 725991
62449 725991 707201 691755 678923 668568 660732 655294 652034 650827 651642 654266 658087 662323 666622
62436F66622M625N159N123M058K478J103k27k218m895p348q848r614j0236j0886
62422F34896j1375j1628j1650j1331j0645r910r490r338r131q733q298p920p458
62409E07989o756n791m672l625k974k915l249l446l014j877m48O04Q68O20O08
62394D71922J198J929K170K062K341L220L992L921L247K855L180L851M385M804
62380E15077N354N973O439O918P904R406J0636J0883J0522J0620J1568J2661J3233
62367F37194J3646J4626J6115J7488J8774K0820K4031K7691L0892L3655L6645
62356H91577M0089M3584M6826M9825N2340N3561N2650M9443M4368L7911L0345
62345A392519K2000J3529N725r73o718j1960j6965k1709k6125l0136l3412l5409
$$ plain form
62436 666622 671247 676406 681529 685587 688065 689168 688941 686723 681828 674480 665632 656018 645782 634896
62422 634896 623521 611893 600243 588912 578267 568357 558867 549529 540398 531665 523367 515447 507989
62409 507989 501233 495442 490770 487145 484171 481256 478007 474561 471547 469670 469222 469826 470694 471314 471922
62394 471922 473120 475049 477219 479281 481622 484842 488834 492755 496002 498857 502037 505888 510273 515077
62380 515077 520431 526404 532843 539761 547665 557071 567707 578590 589112 599732 611300 623961 637194
62367 637194 650840 665466 681581 699069 717843 738663 762694 790385 821277 854932 891577
62356 891577 931666 975250 1022076 1071901 1124241 1177802 1230452 1279895 1324263 1362174 1392519
62345 1392519 1414519 1428048 1433773 1432800 1426082 1414122 1397157 1375448 1349323 1319187 1285775 1250366
62333A250366l5967l5658l5211l4609l3147l0437k7027k3847k1334j9384j7989
62322I35756j7487j8107j9453k0756k1518k1793k1819k1676k1412k1267k1392
62311G09076k1376k0439j8340j5787j3700j2235j0849r228p669o554n806n067
62299E62026m106k913j624n61j22l42o99n59K54J452K677L684M236M209L769L291
62283E74672L091L414M405N768O608O248N199M793N613O904P908R061J1126J3596
62269F68406J4994J4883J4630J5782J8342K1155K3486K5562K7833L0440L3416
62258I08929L6853M0621M4286M7480N0181N2451N4166N5067N4896N3256M9600
62247A447786M3626L5638K6368J6491O503l074j1696j9187k5854l2102l7992m3378
$$ plain form
62333 1250366 1214399 1178741 1143530 1108921 1075774 1045337 1018310 994463 973129 953745 935756
62322 935756 918269 900162 880709 859953 838435 816642 794823 773147 751735 730468 709076
62311 709076 687700 667261 648921 633134 619434 607199 596350 587122 579453 572899 567093 562026
62299 562026 557920 555007 553383 552822 552700 552358 551659 551100 551354 552806 555483 559167 563403 567612 571381 574672
62283 574672 577763 581177 585582 591350 597958 604206 609405 614198 619811 626715 634623 643684 654810 668406
62269 668406 683400 698283 712913 728695 747037 768192 791678 817240 845073 875513 908929
62258 908929 945782 986403 1030689 1078169 1128350 1180801 1234967 1290034 1344930 1398186 1447786
62247 1447786 1491412 1527050 1553418 1569909 1576412 1573338 1561642 1542455 1516601 1484499 1446507 1403129
62235A403129m8268n2754n6533n8832n9003n7146n3962n0154m6064m1797l7478
62224H41138l3346k9650k6417k3333k0057j6746j4019j2224j0985r778q634p832
62212F28117p218o387n413m615l757k364r47p51j864k562j420Q01K349K942L728
62197F00639N181O461O952P163P597P847P462O959P172Q040Q674Q535Q046Q101
62183G04829R121J0538J1254J0824J0019R766R788R047P506O382O454P130P734
62170H20392Q751J0932J3983J7136K0459K4520K9014L2818L5391L7154L8435L8848
62158A127833L7905L5505L1602K6050J9171J1970N436j86n296j0327j5289j9658
62146A244716k2810k4799k6562k8847l1091l1940l0927k8900k6637k3772j9641
$$ plain form
62235 1403129 1354861 1302107 1245574 1186742 1127739 1070593 1016631 966477 920413 878616 841138
62224 841138 807792 778142 751725 728392 708335 691589 677570 665346 654361 644583 635949 628117
62212 628117 620899 614512 609099 604484 600727 598363 597416 596665 594801 592239 590819 591620 593969 596911 600639
62197 600639 605820 612281 619233 626396 633993 641840 649302 656261 663433 671473 680147 688682 696728 704829
62183 704829 713950 724488 735742 746566 756585 766351 776139 785186 792692 799074 805528 812658 820392
62170 820392 829143 840075 854058 871194 891653 916173 945187 978005 1013396 1050550 1088985 1127833
62158 1127833 1165738 1201243 1232845 1258895 1278066 1290036 1295472 1295286 1289990 1279663 1264374 1244716
62146 1244716 1221906 1197107 1170545 1141698 1110607 1078667 1047740 1018840 992203 968431 948790
62135I48790j4698j0435p887o687n630l980k129j001r65j473j807j845j815j590
62121H86848p76O09K106L490M926O303P024O821O235N773M989K945m36m016o523
62106I26318p656p947p803p129n942m953n050o230p447p764p214o280n043l405
62092H36455j762o75M9J116K568L613L846L856M299N015N540N860O163O359O457
62077H88759P011Q529J0670J2654J4247J5777J7290J8361J8778J8860J8960J9116
62065A069012J9307J9680K0426K1630K3285K5071K6167K5649K3334J9841J5733
62054A309135J0938N363k99m912q127j0831j4208j8512k2980k6769k9720l2210
62042A156868l4581l6856l8752l9798l9600l8269l6436l4623l2733l0431k7848
$$ plain form
62135 948790 934092 923657 915770 909083 903453 899473 897344 896343 895378 893905 892098 890253 888438 886848
62121 886848 886072 886681 888787 892277 897203 903506 910530 917351 923586 929359 934348 937293 936857 932841 926318
62106 926318 918662 910715 902912 895783 889841 884888 879838 873608 866161 858397 851183 844903 839860 836455
62092 836455 834693 834018 834067 835183 837751 841364 845210 849066 853365 858380 863920 869780 875943 882302 888759
62077 888759 895770 904299 914969 927623 941870 957647 974937 993298 1012076 1030936 1049896 1069012
62065 1069012 1088319 1107999 1128425 1150055 1173340 1198411 1224578 1250227 1273561 1293402 1309135
62054 1309135 1320073 1325436 1325137 1320225 1312098 1301267 1287059 1268547 1245567 1218798 1189078 1156868
62042 1156868 1122287 1085431 1046679 1006881 967281 929012 892576 857953 825220 794789 766941
62031G66941k5462k3419k1422j9341j7431j5816j4250j2605j1152j0078r189q362
62019E78414p871p894q030p801p271o810o383n643m547l460k664k200k079k252
62005E03509k387k045j109J94J613K971M020M595M869N116N334N368N264N120
61991E42432M684L604K030N82m56j405k641m173n831p438q609q914q492q119q277
61976D88977q497q010o828n729n263n146m713l686k404j443j090j159j292j386
61962D32331j612j952j996j407m43K80N25O62J033J481J635J514J421J399J231
61947D36102J082J652L320N415O857P423P870Q809R988J0880J1412J1818J2098
61934E34726J2131J1981J1734J1199J0247R246Q693Q419P701O181M315K779J773
$$ plain form
62031 766941 741479 718060 696638 677297 659866 644050 629800 617195 606043 595965 586776 578414
62019 578414 570543 562649 554619 546818 539547 532737 526354 520711 516164 512704 510040 507840 505761 503509
62005 503509 501122 499077 497968 498162 499775 502746 506766 511361 516230 521346 526680 532048 537312 542432
61991 542432 547116 550720 552750 553332 552876 551471 548830 544657 538826 531388 522779 513865 505373 497254 488977
61976 488977 480480 472470 465642 459913 454650 449504 444791 441105 438701 437258 436168 435009 433717 432331
61962 432331 430719 428767 426771 425364 424921 425201 425726 426388 427421 428902 430537 432051 433472 434871 436102
61947 436102 437184 438836 442156 447571 454428 461851 469721 478530 488518 499398 510810 522628 534726
61934 534726 546857 558838 570572 581771 592018 601264 609957 618376 626077 632258 636573 639352 641125
61921F41125R84Qj339k851m034m495m249l492k238m65J502L227M759O555Q674
61906F43671J0489J1397J1461J1112J0553R704Q481O885M901K585J61k178m365
61893G24857o247p469p777p440p073p035p109o806n995n126m825n236n976o740
61879F34003p653q781r638r672r065q553q472q519q435q248p718o295m055k031
61865E26868j047o67J24J606L281M764N998O730O713O457P050Q904J1253J3222
61851F01256J4842J6610J8443J9637J9774J9234J8688J8378J7959J6936J5154
61840G96911J2921J0647Q372N722K415j304m726p202q484q606p670n862l622j535
61826G87977O2J298K521L892N312O532P150O688N074K914Q82j190m045p710j1085
$$ plain form
61921 641125 642109 642117 640778 637927 633893 629398 625149 621657 619419 618954 620456 623683 628442 634997 643671
61906 643671 654160 665557 677018 688130 698683 708387 716868 723753 728654 731239 731400 729222 724857
61893 724857 718610 711141 703364 695924 688851 681816 674707 667901 661906 656780 651955 646719 640743 634003
61879 634003 626350 617569 607931 598259 589194 580641 572169 563650 555215 546967 539249 532954 528899 526868
61865 526868 525821 525154 525278 526884 530165 534929 540927 547657 554370 560827 567877 576781 588034 601256
61851 601256 616098 632708 651151 670788 690562 709796 728484 746862 764821 781757 796911
61840 796911 809832 820479 828851 834573 836988 835684 830958 823756 815272 806666 798996 793134 789512 787977
61826 787977 788039 789337 791858 795750 801062 807594 814744 821432 826506 829420 830302 829112 825067 817357 806272
61811H06272j3203j4368j5471j6545j6752j5715j4123j2925j2407j2311j2325
61800F50127j2258j1972j1447j0728r800q665p584o901o581o185n406m371l434
61787E44795k892k919l355l551k903j606n22j10k1Q2k2m87p89l62N23J119J169
61770E28149J016Q99Q03Q99J492K480L345L774L957M166M424M652M811M897M998
61755E74762N317N816N999N423M277K988J477n65k721m057m384m640n562o724
61741E77406p253o950o222n400m687m397m586m678l973k473q42L22Q49Q99Q47
61726E28862J078J530J699J363J031J258J867K298K417K448K367J987J383P08
61712E52296j48j116j509p93L46N90l91j719k647l206l470l225k662k489k891
$$ plain form
61811 806272 793069 778701 763230 746685 729933 714218 700095 687170 674763 662452 650127
61800 650127 637869 625897 614450 603722 593922 585257 577673 570772 564191 558006 552600 548229 544795
61787 544795 541903 538984 535629 532078 529175 527569 527047 526937 526916 526998 526976 526489 525700 525338 525861 526980 528149
61770 528149 529165 530064 530867 531766 533258 535738 539083 542857 546814 550980 555404 560056 564867 569764 574762
61755 574762 580079 585895 591894 597317 601594 604582 606059 605494 602773 598716 594332 589692 584130 577406
61741 577406 570153 563203 556981 551581 546894 542497 537911 533233 529260 526787 525945 526267 527116 528015 528862
61726 528862 529940 531470 533169 534532 535563 536821 538688 540986 543403 545851 548218 550205 551588 552296
61712 552296 552148 551032 549523 548730 549076 549666 549275 547556 544909 541703 538233 535008 532346 529857 526966
61697E26966l211l060k963l360l769l650l393l665m263m472m167l812l575l214
61683D76392k689k179j676j176j071j697k552k761k283j904j989j978j418p46
61669D50273n86q15q38n01k06j63p2L62R32J203J187J368J945K415K240J704J589
61652D62037K024K336K125J829J855J851J393Q17O70P71O26M17P26J375J528R45
61636D83325L21J81K76L27N76J146J428P32p25j951k190j602j086j524k985m555
61620D71694n240n042m790m931m964m305l166k214j803j900k453l340m112m249
61606D19185l733l131l010l428l967m182l989l587l098k450j688j129r92j079
61592C79722j175j410j893k199j895j349j317j777j951j571j267j452j663j439
$$ plain form
61697 526966 523755 520695 517732 514372 510603 506953 503560 499895 495632 491160 486993 483181 479606 476392
61683 476392 473703 471524 469848 468672 467601 465904 463352 460591 458308 456404 454415 452437 451019 450273
61669 450273 449687 448872 448034 447533 447327 447164 447092 447454 448386 449589 450776 452144 454089 456504 458744 460448 462037
61652 462037 464061 466397 468522 470351 472206 474057 475450 476267 476937 477708 478334 478751 479477 480852 482380 483325
61636 483325 483646 483827 484103 484430 485006 486152 487580 488312 487587 485636 483446 481844 480758 479234 476249 471694
61620 471694 466454 461412 456622 451691 446727 442422 439256 437042 435239 433339 430886 427546 423434 419185
61606 419185 415452 412321 409311 405883 401916 397734 393745 390158 387060 384610 382922 381793 380801 379722
61592 379722 378547 377137 375244 373045 371150 369801 368484 366707 364756 363185 361918 360466 358803 357364
61578C57364j057q94o70o2N15M42j29n63p00q90j193j268r10k49N51J302J667
61561C53256J536J352J546J812J526P51K20L08O73R43J145J276J128P93Q11J448
61545C70524K181K266J581O18q6k74L7O12J107J424J785K358K915L027K491J457
61529C94023K71p14j289j558j839k254k580k601k485k542k727k617j996j157n35
61514C67400j98J29N82R31Q68L67l05q27r40m75M74J366J521P84j94n48m1Q37
61496C71731J521J920K215K402K308J978J755J835J993J928J671J455J297J083
61482C97092Q95R28J040Q96O18P64J443K021K047J920K092K171J540M50l25o35
61466D14957q95j040o75j26k69j068j470j139j087j871k315j198O45J256K25q54
$$ plain form
61578 357364 356307 355413 354743 354681 355196 355638 355509 354946 354246 353356 352163 350895 349985 349736 350287 351589 353256
61561 353256 354792 356144 357690 359502 361028 361779 361999 362307 362980 363923 365068 366344 367472 368265 369076 370524
61545 370524 372705 374971 376552 377170 377084 376810 376847 377459 378566 379990 381775 384133 387048 390075 392566 394023
61529 394023 394294 393580 392291 390733 388894 386640 384060 381459 378974 376432 373705 371088 369092 367935 367400
61514 367400 367202 367331 367913 368844 369712 370079 369774 368947 368007 367532 368006 369372 370893 371677 371483 370935 370894 371731
61496 371731 373252 375172 377387 379789 382097 384075 385830 387665 389658 391586 393257 394712 396009 397092
61482 397092 397987 398915 399955 400851 401469 402233 403676 405697 407744 409664 411756 413927 415467 415917 415592 414957
61466 414957 414062 413022 412347 412221 411952 410884 409414 408275 407188 405317 403002 401804 402449 403705 403930 403076
61450D03076n77O90J676J707J033L01J17P28J768K524K577K047J290O23L02M01
61434D20283O97R14J056J210J195P74J36k26j16K37N70P63O70K35j92q0N99J286
61416D30011J516J342J015N95Q5l56n98p65j045j417j685j740j608j283o99j8
61400D23350J90n75j920k603j863m92N9m49q55l66M44P59P10P86P91L74K8N15
61382D18883J622K475K865L296L845L976L536L035K758K502K231K213K293J991
61368D57521J453J436J985K121J279K32K2O82J599K519L444M075M091L691L376
61353D89526L384L758M592N791O914P683Q228Q561Q212O951N386M255L523K688
61339E69452J698R07L88k0j53K90J039J367R89K70m72j355k446l318l448k819
$$ plain form
61450 403076 402499 403189 404865 406572 407605 407906 408023 408751 410519 413043 415620 417667 418957 419580 419882 420283
61434 420283 420980 421894 422950 424160 425355 426129 426265 426039 425923 426160 426730 427493 428163 428398 428206 428126 428725 430011
61416 430011 431527 432869 433884 434479 434564 434208 433610 432845 431800 430383 428698 426958 425350 424067 423368 423350
61400 423350 423540 422965 421045 418442 416579 416087 416146 415697 414842 414476 414920 415679 416389 417175 417966 418340 418368 418883
61382 418883 420505 422980 425845 429141 432986 436962 440498 443533 446291 448793 451024 453237 455530 457521
61368 457521 458974 460410 462395 464516 465795 466027 466049 466731 468330 470849 474293 478368 482459 486150 489526
61353 489526 492910 496668 501260 507051 513965 521648 529876 538437 546649 553600 558986 563241 566764 569452
61339 569452 571150 572057 572445 572425 572272 572562 573601 574968 575957 576227 575755 574400 571954 568636 565188 562369
61323E62369j962j401j189r07j62R42J996K877L888N217O596P683Q433Q930R218
61308F12528R616J0723J2596J4349J5089J5061J5164J5472J4948J2724R135N254
61296G62659J876q70l210n308p103q418r227r726r984r837r322q950r100r351
61282F64129q928p708o254m922l582k297j490j165n95P32K305L255L482L537L650
61267F44149L555L183K944L098L368L434L462L860M738N868O946P608P373O036
61253G09622M088K360J175J91q48j605j691j394j448k129k944l226k847k201j701
61238F95402j321p14J89Q24N88j99m60K72J202J517J671K704M572O158O872P219
61222G26496P645P771P192O281N640N373N410N935O965P914Q172P792P215O645
$$ plain form
61323 562369 560407 559006 557817 556910 556748 557690 559686 562563 566451 571668 578264 585947 594380 603310 612528
61308 612528 622144 632867 645463 659812 674901 689962 705126 720598 735546 748270 757405 762659
61296 762659 764535 763665 760455 755147 748044 739626 730399 720673 710689 700852 691530 682580 673480 664129
61282 664129 655201 647493 641239 636317 632735 630438 628948 627783 627188 627920 630225 633480 636962 640499 644149
61267 644149 647704 650887 653831 656929 660297 663731 667193 671053 675791 681659 688605 696213 703586 709622
61253 709622 713710 716070 717245 717436 716588 714983 713292 711898 710450 708321 705377 702151 699304 697103 695402
61238 695402 694081 693367 693556 694380 694968 694769 694309 694581 695783 697300 698971 701675 706247 712405 719277 726496
61222 726496 734141 741912 749104 755385 761025 766398 771808 777743 784708 792622 800794 808586 815801 822446
61208H22446O054N395M487L144J784J331K088L345M557O155Q470J0699J1950J2723
61194I04628J4092J5895J6986J7124J7124J7091J5879J2780Q581M471R29j797
61182A043783l190l290l252m185n909p497q625r695j0991j2378j3624j4504j4758
61169I31885j4425j4007j3919j4044j4149j4337j4700j4901j4647j4235j4057
61158G74464j3858j3078j1710j0197q668o962n292m108l249j939J63K420L915
61145G01901M156L014O25k344m874o486p566q422q565p428n460l732k567j248
61131F51004Q08L244N369P033Q476R695J0530J1280J2642J4928J7646K0076K1935
61118G94666K3335K4369K5077K5680K6434K7198K7471K7008K6192K5503K4868
$$ plain form
61208 822446 828500 833895 838382 841526 843310 844641 846729 850074 854631 860786 869256 879955 891905 904628
61194 904628 918720 934615 951601 968725 985849 1002940 1018819 1031599 1040180 1044651 1045580 1043783
61182 1043783 1040593 1037303 1034051 1029866 1023957 1016460 1007835 998140 987149 974771 961147 946643 931885
61169 931885 917460 903453 889534 875490 861341 847004 832304 817403 802756 788521 774464
61158 774464 760606 747528 735818 725621 716953 709991 704699 700591 697342 695403 695566 697986 701901
61145 701901 706057 709071 709696 707352 702478 695992 688426 680004 671439 664011 658551 654819 652252 651004
61131 651004 651812 655056 660425 667458 675934 685629 696159 707439 720081 735009 752655 772731 794666
61118 794666 818001 842370 867447 893127 919561 946759 974230 1001238 1027430 1052933 1077801
61107A077801K3738K1868J9646J7612J5851J4024J1821R137N862J837k895p951
61095A208351j2851j7281k1009k3750k5348k6008k6150k6018k5660k5206k4857
61084I54213k4547k3899k2654k0927j8945j6791j4577j2611j1155j0183r517q978
61072G59429q280p012n090l026j377j22J097K284L142L773M677O009P266Q042
61058G70812Q695R897J1764J3705J5085J5767J6079J6424J6956J7609J8421J9736
61046I50950K1885K4608K7065K8553K9129K9438L0097L1261L2639L3759L4338
61035A273722L4533L4760L5262L5937L6667L7548L8719M0123M1625M3247M5055
61024A697198M6900M8424M9392M9963N0669N2235N5383O0684O8475P8792R1364
$$ plain form
61107 1077801 1101539 1123407 1143053 1160665 1176516 1190540 1202361 1211498 1217360 1219197 1216302 1208351
61095 1208351 1195500 1178219 1157210 1133460 1108112 1082104 1055954 1029936 1004276 979070 954213
61084 954213 929666 905767 883113 862186 843241 826450 811873 799262 788107 777924 768407 759429
61072 759429 751149 744137 739047 736021 734644 734522 735619 737903 741045 744818 749495 755504 762770 770812
61058 770812 779507 789404 801168 814873 829958 845725 861804 878228 895184 912793 931214 950950
61046 950950 972835 997443 1024508 1053061 1082190 1111628 1141725 1172986 1205625 1239384 1273722
61035 1273722 1308255 1343015 1378277 1414214 1450881 1488429 1527148 1567271 1608896 1652143 1697198
61024 1697198 1744098 1792522 1841914 1891877 1942546 1994781 2050164 2110848 2179323 2258115 2349479
61013B349479J05864J22293J41023J62353J86215K12661K42444K76945L17648
61004D116925L66082M24048M93332N75370O71767P84651R15226J062020J222243
60995A0631664J393849J569779J722653J795558J719427J455406J031404N40400
60987B1860140R9572j98999l16042k67497j15901M2173R9914k1094l33387p73463
60977B0075416j229972j593837j800166j841533j753647j588712j392850j195835
60969G678864j012369q48378p05972n85103m83929l99993l31363k76449k33078
60960B802230j98602j71023j49282j32250j18133j05423r3924q4161p5992o8480
60950A604960o1056n4099m8204m3532m0106l8215l7885l8301l8306l7419l5991
$$ plain form
61013 2349479 2455343 2577636 2718659 2881012 3067227 3279888 3522332 3799277 4116925
61004 4116925 4483007 4907055 5400387 5975757 6647524 7432175 8347401 9409421 10631664
60995 10631664 12025513 13595292 15317945 17113503 18832930 20288336 21319740 21860140
60987 21860140 21959712 21760713 21444671 21177174 21061273 21103446 21203360 21182266 20848879 20075416
60977 20075416 18845444 17251607 15451441 13609908 11856261 10267549 8874699 7678864
60969 7678864 6666495 5818117 5112145 4527042 4043113 3643120 3311757 3035308 2802230
60960 2802230 2603628 2432605 2283323 2151073 2032940 1927517 1833593 1749432 1673440 1604960
60950 1604960 1543904 1489805 1441601 1398069 1357963 1319748 1281863 1243562 1205256 1167837 1131846
60939A131846l4468l2972l1568l0419k9460k8287k6616k4654k2824k1284j9887
60928H29407j8426j6816j5155j3722j2760j2113j1283j0030q754p934p415o651
60916F88348n569m709m404m309l999l568l221k631j339L24J391J410R01M87J36
60901F59248m00r51j218j353j657j999k115k285l058m241m942m719m076l680l661
60886F18893l911m462n101n236m699m226m518n125n062m315l997m838o182o833
60872E50388o422n589n059m886m563l701k509j617j349j329q83J69J349K152K628
60857E18779L149L732L807K866J282J77K61J020J375J029O22O05O42L52K5J06
60841E39829M23M46j6q31j934l179m092m379m409m609m651l929k658j721j500
$$ plain form
60939 1131846 1097378 1064406 1032838 1002419 972959 944672 918056 893402 870578 849294 829407
60928 829407 810981 794165 779010 765288 752528 740415 729132 719102 710348 702414 694999 688348
60916 688348 682779 678070 673666 669357 665358 661790 658569 655938 654599 654923 656314 657724 658625 659112 659248
60901 659248 658848 657897 656679 655326 653669 651670 649555 647270 644212 639971 635029 630310 626234 622554 618893
60886 618893 614982 610520 605419 600183 595484 591258 586740 581615 576553 572238 568241 563403 557221 550388
60872 550388 543966 538377 533318 528432 523869 520168 517659 516042 514693 513364 512481 512650 513999 516151 518779
60857 518779 521928 525660 529467 532333 533615 533792 534053 535073 536448 537477 538099 538704 539346 539698 539723 539829
60841 539829 540252 540698 540682 539851 537917 534738 530646 526267 521858 517249 512598 508669 506011 504290 502790
60826E02790j641j926k569l416l709l054k007j346j226j392j704k065k278k338
60812D72119k555l064l506l469k997k465k291k757l694m277l736k481j808k196
60798D30823k665k251j387j038j188j163j010j432k390k838k157j036n09o73q49
60783D08237n93r6K91N49Q92J369J685J508R46M76L59L80L14M00R38J664J980
60766D21299J774J585J839K291K396K029J606J570J843J860J183Q6o18m51K09
60751D40501O18N02J48j38l42n54p99j015j043o43J44P59N36n57j891k916l625
60734D29685m170m367l912k944k103j939k403k951l083k719k094j419p52j47K33
60719C94915K48k4m17q36j211j369j102m36L15P82Q19N48J94k4P5N94J431K274
$$ plain form
60826 502790 501149 499223 496654 493238 489529 486475 484468 483122 481896 480504 478800 476735 474457 472119
60812 472119 469564 466500 462994 459525 456528 454063 451772 449015 445321 441044 437308 434827 433019 430823
60798 430823 428158 425907 424520 423482 422294 421131 420121 418689 416299 413461 411304 410268 409759 409086 408237
60783 408237 407644 407548 407839 408388 409280 410649 412334 413842 414788 415264 415623 416003 416317 416717 417655 419319 421299
60766 421299 423073 424658 426497 428788 431184 433213 434819 436389 438232 440092 441275 441361 440743 440292 440501
60751 440501 441119 441621 441769 441631 441289 440735 439936 438921 437878 437235 437379 438138 438674 438117 436226 433310 429685
60734 429685 425515 421148 417236 414292 412189 410250 407847 404896 401813 399094 397000 395581 394829 394682 394915
60719 394915 395163 395139 394722 393886 392675 391306 390204 389768 390083 390865 391684 392232 392426 392402 392477 393071 394502 396776
60701C96776K828L074L094K734J784O01Q2O13J416J492R56P75J270J727J614J320
60685D22156J290J225P88M81J002K054K644K492K362K851L511L453K495J373R35
60670D51112J261J586J102q7j050j144q12r80j864k833l259l102k655k151j763
60655D33361j628j712j797j723j440q62J14J364K432K811K334J370N70K88J62
60640D35644m36j491k195k004j428j320j695j797j224m39p1k30o26r53r72n10
60624D18253L66J327K010K234K003J503R87N26j4n54n86K23J360J897J518P31
60608D33784O7l91o04l73K65Q16Q93O50M24K37n1l59m77l94j86J87Q01J498K042
60589D38829K411K738L014L022K585J772R06M05M86R35J285J296J133J060J174
$$ plain form
60701 396776 399604 402678 405772 408506 410290 410891 410973 411586 413002 414494 415450 416225 417495 419222 420836 422156
60685 422156 423446 424671 425459 425940 426942 428996 431640 434132 436494 439345 442856 446309 448804 450177 451112
60670 451112 452373 453959 455061 454974 453924 452780 451968 450988 449124 446291 443032 439930 437275 435124 433361
60655 433361 431733 430021 428224 426501 425061 424199 424313 425677 428109 430920 433254 434624 435194 435482 435644
60640 435644 435208 433717 431522 429518 428090 426770 425075 423278 422054 421615 421544 421314 420688 419735 418763 418253
60624 418253 418619 419946 421956 424190 426193 427696 428683 429209 429195 428641 428055 428278 429638 431535 433053 433784
60608 433784 433851 433460 432856 432483 432748 433564 434457 435107 435531 435768 435717 435358 434881 434487 434301 434488 435289 436787 438829
60589 438829 441240 443978 446992 450014 452599 454371 455277 455682 456168 457103 458388 459684 460817 461877 463051
60574D63051J601K636M348O199P386P630P438P516Q155R188J0338J1385J2147
60561E59018J2393J1859J0398Q128N509L063R43j122l310n225o125n712m417k882
60547E82518j375J25J549K785L948N232O529P533Q301R360J1101J3303J5396J6991
60533F83296J8038J8631J8750J8047J5981J2467Q312M556J334k043n788r031j0880
60520G71670j1457j1387j0833r759q676q170p846o641m364k116r05m08M94K352
60506F91954M780P123R110J0847J2537J4352J6516J9400K3304K8040L2826L6830
60494I07619L9781M1990M3817M5302M6149M5865M3965M0232L4839K8173K0621
60483A338353J2498L974n022j4492k3917l2441l9690m5952n1342n5175n6637n5681
$$ plain form
60574 463051 464652 467288 471636 477835 485221 492851 500289 507805 515960 525148 535486 546871 559018
60561 559018 571411 583270 593668 601796 607305 610368 611311 610189 606879 601654 595529 589817 585400 582518
60547 582518 581143 581268 582817 585602 589550 594782 601311 608844 617145 626505 637606 650909 666305 683296
60533 683296 701334 719965 738715 756762 772743 785210 793522 798078 799412 797369 791581 782550 771670
60520 771670 760213 748826 737993 728234 719558 711388 703542 696901 692537 690421 689516 689108 689602 691954
60506 691954 696734 703857 712967 723814 736351 750703 767219 786619 809923 837963 870789 907619
60494 907619 947400 989390 1033207 1078509 1124658 1170523 1214488 1254720 1289559 1317732 1338353
60483 1338353 1350851 1354825 1349803 1335311 1311394 1278953 1239263 1193311 1141969 1086794 1030157 974476
60471I74476n2919m8978m4407l9855l5718l1838k7944k4207k0958j8183j5827
60460F13642j4123j3087j2040j0404q620p498o943o230n304m822m919m937m499
60447E10216l916l467l025k630k490k354j671o08nj54n42r04j530k176j896n63
60431D82285N30K76q50j723k003j866j175N0R99R48L75K80P39J084J156J428K016
60414D84549K451K498K376K199J831J326R33O66M16L85Q12J373J400Q14K32J57
60398E04418N15J025J548K032K520L184L951M199L450K308K053L056M231M375
60384E42865L554K746K472K389K059J650J619K048K552K789K778K613K154J291
60370E75579L65K3N56J655K750L366L217K449J802K061L116M055M321M324M635
$$ plain form
60471 974476 921557 872579 828172 788317 752599 720761 692817 668610 647652 629469 613642
60460 613642 599519 586432 574392 563988 555368 547870 540927 534697 529393 524571 519652 514715 510216
60447 510216 506300 502833 499808 497178 494688 492334 490663 490055 490050 489896 489354 488450 486920 484744 482848 482285
60431 482285 482815 483091 482241 480518 478515 476649 475474 475524 476523 477471 477846 478126 478865 479949 481105 482533 484549
60414 484549 487000 489498 491874 494073 495904 497230 498163 498829 499245 499630 500442 501815 503215 504029 504261 504418
60398 504418 504933 505958 507506 509538 512058 515242 519193 523392 526842 529150 531203 534259 538490 542865
60384 542865 546419 549165 551637 554026 556085 557735 559354 561402 563954 566743 569521 572134 574288 575579
60370 575579 575944 575967 576523 578178 580928 584294 587511 589960 591762 593823 596939 600994 605315 609639 614274
60355F14274N156N524N901O708P914R079R966J0592J0833J0469R579Q428P014
60342G21437N033K345q26m045o822q722r595r705r453r009q377p615o841o117
60328F41688n405m604l628k718k510l319m348m268k756r02J47L38K46K77P62K122
60312F11122M227O206P533Q803J0715J2877J4408J5267J6011J6701J6971J6859
60300G57700J6504J5280J2404Q365M502J046l201q769j4261j7834j9214j9453
60288G33069j9277j8501j6832j4488j1969r623p575n921m780m149l799l509l418
60275F09228l833m622n182n233n207n463n645n273m576m084l780l338k899k770
60261E47323k682k147j451j340j835k196k069j760j374o46K60P38P55R44J487
$$ plain form
60355 614274 619430 624954 630855 637563 645477 654556 664522 675114 685947 696416 705995 714423 721437
60342 721437 726470 728815 727989 723944 717122 708400 698805 689100 679647 670638 662261 654646 647805 641688
60328 641688 636283 631679 628051 625333 622823 619504 615156 610888 608132 607230 607377 607715 607961 608238 609000 611122
60312 611122 615349 621555 629088 637891 648606 661483 675891 691158 707169 723870 740841 757700
60300 757700 774204 789484 801888 810253 814755 815801 812600 803831 789570 771736 752522 733069
60288 733069 713792 695291 678459 663971 652002 642379 634804 628883 624103 619954 616155 612646 609228
60275 609228 605395 600773 595591 590358 585151 579688 574043 568770 564194 560110 556330 552992 550093 547323
60261 547323 544641 542494 541043 539703 537868 535672 533603 531843 530469 529823 530083 530821 531576 532520 534007
60246E34007J823J780J943K455K412J252q8k46Q29J909J949R33l52q74p1J510
60230E51171K600K639K397K774L559M004M089M345M722M565L773L177L505M531
60216F01851N551O332P184Q244R144R478R437R616J0200J0672J0559J0106R821
60203G18195R600Q909P697O546N845N415N007M537L746K361P50k73o30j219k603
60188G73883m126m981n396o058o834p029o644o494o999p638p783p565p492p575
60174F81269p226o025m354l089k626k509k120j536j252j363j489j547j854k364
60160F41915k505k046j499j316j212p41o9L29M19N31Q46J307J845K319K522K527
60144F45172K687L085L300L053K707K786L388M347N495O499O911O855P110Q043
$$ plain form
60246 534007 535830 537610 539553 542008 544420 545672 545584 545338 546167 548076 550025 550958 550606 549732 549661 551171
60230 551171 553771 556410 558807 561581 565140 569144 573233 577578 582300 586865 590638 593815 597320 601851
60216 601851 607402 613734 620918 629162 638306 647784 657221 666837 677037 687709 698268 708374 718195
60203 718195 727795 736704 744401 750947 756792 762207 767214 771751 775497 777858 778608 778335 777705 776486 773883
60188 773883 769757 764776 759380 753322 746488 739459 732815 726321 719322 711684 703901 696336 688844 681269
60174 681269 674043 668018 663664 660575 657949 655440 653320 651784 650532 649169 647680 646133 644279 641915
60160 641915 639410 637364 635865 634549 633337 632596 632527 632856 633275 633806 634652 635959 637804 640123 642645 645172
60144 645172 647859 650944 654244 657297 660004 662790 666178 670525 676020 682519 689430 696285 703395 711438
60130G11438Q938Q893P886O462M899L365K394K368K876L246L482L995M683N053
60116G79978M947M564L948L180K719K784K758J942O42l75j154k293l698m703n281
60101G89958n958o559o322n422m967n203n030l869k727k592k943k824k404k329
60087G30809k281j522m09r6q78j934k635l036l103k509j551j345k585m717o683
60072F95525p923q320p833o782o012o076o461o258n504n142n562n935n359m159
60058F08199l397l351l178k188p84J33L37L72P21J370K175L220M579N954O775
60043F20937O711O017N399N447O124O801O839O084M857L594K595J892J164m8j798
60028F82615l538m662n179n609o305p130p784q122q123p844p549p715q638r989
$$ plain form
60130 711438 720376 729269 737155 743617 748516 751881 754275 756643 759519 762765 766247 770242 774925 779978
60116 779978 784925 789489 793437 796617 799336 802120 804878 806820 807462 807087 805933 803640 799942 795239 789958
60101 789958 784000 777441 771119 765697 760730 755527 750497 746628 743901 741309 738366 735542 733138 730809
60087 730809 728528 727006 726597 726501 725623 723689 721054 718018 714915 712406 710855 709510 706925 702208 695525
60072 695525 687602 679282 671449 664667 658655 652579 646118 639860 634356 629214 623652 617717 612358 608199
60058 608199 604802 601451 598273 596085 595301 595434 595771 596143 596864 598234 600409 603629 608208 614162 620937
60043 620937 627648 633665 639064 644511 650635 657436 664275 670359 675216 678810 681405 683297 684461 684413 682615
60028 682615 679077 674415 669236 663627 657322 650192 642408 634286 626163 618319 610770 603055 594417 584428
60014E84428j0839j0308q403o206m899m588m355l584k669k183j880j193l10O5
60000E23076p7N1Q02J539J596J169R06J118J775K762L761M253M174M119M476M722
59984E60222M181L161K566K528K203J098k03j010j629k848m600n821n704m634
59970E49510l662l373l592l955m273m270l459j706K37J225R21K30L07J339K528
59955E28007L101L020K701K437K241K052J867J741J756J874J782J124R3n26k68
59940E53002K33j3r05j223l87N39K64q34j137JJ468K005J728J618K090K803L430
59923E64682M056M857N833O778P259O866N676M312L223K337J617J504K211L030
59909F24241L047K334J671J294P97K06J89R00J515J376R06Q43J132J282J339J768
$$ plain form
60014 584428 573589 563281 554878 548672 543773 539185 534830 531246 528577 526394 524514 523321 523011 523076
60000 523076 522999 523050 523852 525391 526987 528156 529062 530180 531955 534717 538478 542731 546905 551024 555500 560222
59984 560222 564403 567564 570130 572658 574861 575959 575756 574746 573117 570269 565669 559848 554144 549510
59970 549510 545848 542475 538883 534928 530655 526385 522926 521220 521457 522682 523603 523833 524140 525479 528007
59955 528007 531108 534128 536829 539266 541507 543559 545426 547167 548923 550797 552579 553703 553796 553270 553002
59940 553002 553235 553222 552317 551094 550707 551246 551510 550676 549539 549540 551008 553013 554741 556359 558449 561252 564682
59923 564682 568738 573595 579428 586206 593465 600331 606007 610319 613542 615879 617496 619000 621211 624241
59909 624241 627288 629622 631293 632587 633384 633590 633779 634679 636194 637570 638476 639319 640451 641733 643072 644840
59893F44840K603L383L859M240M705N158N491N659N539N029M396M089M180M295
59879G07466M114L668L105K581K386K754L335L301K258O69q44k237l723n095n934
59864G17804o217o175n736m726l566l048l186k988j696J93J516J660R69L54Q36
59849F85994K915N847P945Q176P265O687O893P091O492M990K811L16j744k544
59835G49134j952n85Q20J600J043j000l348m426m162m077n122o471o916o482n942
59820G02114n580n292n209n311m978l861k703k400k641k471j916j897k667l334
59806F51854l139k348j650j351j361j458j330q64l91l72p79j185j331j233r51
59791F32111p03r53j775k437k264j655j495j777j761j340j266j869k562k773k583
$$ plain form
59893 644840 647443 650826 654685 658925 663630 668788 674279 679938 685477 690506 694902 698991 703171 707466
59879 707466 711580 715248 718353 720934 723320 726074 729409 732710 734968 735637 734793 732556 728833 723738 717804
59864 717804 711587 705412 699676 694950 691384 688336 685150 682162 680466 680659 682175 683835 684804 685158 685994
59849 685994 688909 694756 702701 710877 718142 724829 731722 738813 745305 750295 753106 753422 751678 749134
59835 749134 747182 746597 747417 749017 750060 749060 745712 741286 737124 733047 727925 721454 714538 708056 702114
59820 702114 696534 691242 686033 680722 675744 671883 669180 666780 664139 661668 659752 657855 655188 651854
59806 651854 648715 646367 644717 643366 642005 640547 639217 638353 637962 637590 636811 635626 634295 633062 632111
59791 632111 631408 630455 628680 626243 623979 622324 620829 619052 617291 615951 614685 612816 610254 607481 604898
59776F04898k145j389n44j72k66m7R49K207L055L474L700L662L309K989K996L138
59760F29814L202L404M007M842N614O361P206P951Q227P897P175O542O539P268
59746G16049Q037Q033P344O741O389N531L718J543j44j162j753k045k107k070
59732G54104j857j389j134j678k551k451j141j8k13j049j279r07p41q51p32m86
59716G35627o30j014r98o13m62n93m16K49R21J306J632K068K580L351M629O119
59700G53756P135P435P300O950O481O288O759P541P878P672P443P189O120L794
59686H49741Q18j828l583m268l925l038k418k506l102l828m430m716m750n033
59672H03134n878o635o423n620n595o677p414o484m384k467j107J90J466K209
$$ plain form
59776 604898 602753 601364 600820 600648 600382 600335 601284 603491 606546 610020 613720 617382 620691 623680 626676 629814
59760 629814 633016 636420 640427 645269 650883 657244 664450 672401 680628 688525 695700 702242 708781 716049
59746 716049 724086 732119 739463 746204 752593 758124 761842 763385 763241 762079 760326 758281 756174 754104
59732 754104 752247 750858 749724 748046 745495 743044 741903 741885 741672 740623 739344 738437 737696 736845 736113 735627
59716 735627 734997 733983 732985 732372 731910 731317 730901 731150 732071 733377 735009 737077 739657 743008 747637 753756
59700 753756 760891 768326 775626 782576 789057 795345 802104 809645 817523 825195 832638 839827 845947 849741
59686 849741 850559 848731 845148 840880 836955 833917 831499 828993 825891 822063 817633 812917 808167 803134
59672 803134 797256 790621 784198 778578 772983 766306 758892 752408 748024 745557 744450 744640 746106 748315
59658G48315K454K903L855M771N192N379N703N895N382M216L180K869K906K245
59644H05265K83k535n231p250q731r989j0999j1441j1015r734q020o481n386m502
59630G04234l642l121l270l753l948l956m474n571o367o222n589n216n067m686
59616F39352m225m358n253o195o330n443l994k634j678q64K48J544K269J935J063
59601F05437O42R91J588J896J866J605J096M15p9r0K71O28P67P92Q99J060R18
59584F20702Q1j391k844l553l419k974k703k542k187j714j611k179l043l426k985
59569E84212k175j784k063k464k260j312j38O41Q24O12K36k55q93j530j855j635
59553E68161q95J48J239K170K820L250L653M160M674N012N150N327N982P489R706
$$ plain form
59658 748315 750769 753672 757527 762298 767490 772869 778572 784467 789849 794065 797245 800114 803020 805265
59644 805265 805548 803013 797782 790532 781801 771812 760813 749372 738357 728623 720603 714122 708736 704234
59630 704234 700592 697471 694201 690448 686500 682544 678070 672499 666132 659910 654321 649105 644038 639352
59616 639352 635127 630769 625516 619321 612991 607548 603554 600920 599242 598378 598626 600170 602439 604374 605437
59601 605437 606079 607070 608658 610554 612420 614025 615121 615536 615457 615367 615638 616266 617033 617825 618724 619784 620702
59584 620702 620783 619392 616548 612995 609576 606602 603899 601357 599170 597456 595845 593666 590623 587197 584212
59569 584212 582037 580253 578190 575726 573466 572154 572016 572657 573481 574093 574329 574074 573181 571651 569796 568161
59553 568161 567266 567414 568653 570823 573643 576893 580546 584706 589380 594392 599542 604869 610851 618340 628046
59538F28046J1839J3195J4128J5659J7766J8658J6455J1277N030n87m910p474
59526G39082p723o025l880k380j207J74J228J166L96r2m22j612l741n627o651
59511G02686p633r237j0608j0511r153p813p010o143m845l660l088k750k078j260
59497F16897r81j399j928j948j354l83P37J862K848L546L827L633L136K855L331
59482F34679M562N942O892P345P462P177O452N833O114P299Q322Q158O864N194
59468G28295L495J570m90j929k139j504j091j547k440k651j386J114L754N522
59454G28573O290O739P615R098J0709J1573J0946Q824O104L799K106N29j201k897
59440H08807m625o881r546j1359j1187r508p902p158o701n803m535l280k065q70
$$ plain form
59538 628046 639885 653080 667208 682867 700633 719291 735746 747023 752053 751466 746556 739082
59526 739082 731359 725334 721454 719074 717867 718041 719269 720435 720831 720739 720317 718705 714964 709337 702686
59511 702686 695053 685816 675208 664697 655544 647731 640721 634578 629733 626073 622985 620235 618157 616897
59497 616897 615916 614517 612589 610641 609287 608904 609641 611503 614351 617897 621724 625357 628493 631348 634679
59482 634679 639241 645183 652075 659420 666882 674059 680511 686344 692458 699757 708079 716237 723101 728295
59468 728295 731790 733360 732870 730941 728802 727298 726207 724660 722220 719569 718183 719297 723051 728573
59454 728573 734863 741602 749217 758315 769024 780597 791543 800367 806471 810270 812376 812905 811704 808807
59440 808807 804182 797301 787755 776396 765209 755701 747799 740641 733940 728137 723602 720322 718257 717387
59426G17387J5M78J032K294M178O117P859R621J1632J3900J6416J9074K1384K2681
59412H54068K2884K2803K3327K4103K3152J8235R045k018j1535j7475j9775j8987
59400I27827j5430r738l190L040Q243J1247J0176M243m717j3500k0010k3720k4460
59387H50011k2325j8633j5307j2866j0227o789l469j229K15J445K263K389K336
59374G67814K606K819K565K388K912L578L453K777K524K813K930K765K934L520
59360H08398L881L940M427N557O513O805P156Q406J0257J1803J2805J3738J4934
59347I18620J6235J7259J7574J6907J5597J4524J4139J3775J2433R985P154M492
59335A078694J928o83l237n769q586j1700j4414j5958j6320j6097j5665j4962
$$ plain form
59426 717387 717402 717880 718912 721206 725384 731501 739360 748981 760613 774513 790929 810003 831387 854068
59412 854068 876952 899755 923082 947185 970337 988572 997617 995599 984064 966589 946814 927827
59400 927827 912397 902659 899469 902509 910752 921999 932175 936418 931701 918201 898191 874471 850011
59387 850011 827686 809053 793746 780880 770653 763864 760395 759166 759381 760826 763089 765478 767814
59374 767814 770420 773239 775804 778192 781104 784682 788135 790912 793436 796249 799179 801944 804878 808398
59360 808398 812279 816219 820646 826203 832716 839521 846677 855083 865340 877143 889948 903686 918620
59347 918620 934855 952114 969688 986595 1002192 1016716 1030855 1044630 1057063 1067048 1074202 1078694
59335 1078694 1080622 1079939 1076702 1070933 1062347 1050647 1036233 1020275 1003955 987858 972193 957231
59323I57231j4090j3572j3634j3679j2949j1521j0157r305q779q373q160q091
59311H24921p904p647p605p559o826n444m553m897n607n283l798k066l46K010
59297G57396N179Q187R885R859Q161M917N56m145q543j2242j4677j5203j3799
59284G35531j1195q128n039k514j170o85L35K892O435R594J1652J2803J3445J3837
59270G77793J4170J4456J4430J3943J3258J2540J1398R339O542L748J447m42k226
59257H90396m125o184q206r770j0612j0872j0800j0391r563q509p469o322m761
59244G82812k826r60N03J610K588L614M750N872O652O757O118M969L705K724K205
59229H31093J902J345M17n92j606l066n201p399q841r530j0067j0472j0063q593
$$ plain form
59323 957231 943141 929569 915935 902256 889307 877786 867629 858324 849545 841172 833012 824921
59311 824921 817017 809370 801765 794206 787380 781936 777383 772486 766879 761596 757798 755732 755386 757396
59297 757396 762575 770762 780647 790506 798667 803584 804140 799995 791452 779210 764533 749330 735531
59284 735531 724336 716208 711169 708655 707485 706800 707135 710027 716462 726056 737708 750511 763956 777793
59270 777793 791963 806419 820849 834792 848050 860590 871988 881327 887869 891617 893064 892622 890396
59257 890396 886271 880087 871881 862111 851499 840627 829827 819436 809873 801364 793895 787573 782812
59244 782812 779986 779026 779529 781139 783727 787341 792091 797963 804615 811372 817490 822459 826164 828888 831093
59229 831093 832995 834340 834757 834165 832559 829493 824292 816893 808052 798522 788455 777983 767920 759327
59215G59327o864n797n448n393n585o139o576o090m621l030k033j458q69k88O4
59200F99200L57Q06J046N59l31n65L71J903L234M147M628M489L881L684M530N796
59184G37735O297N839N386N639O229O423O044N434M941M691M571M329L910L609
59170H11077L653L731L477L146L205L358K868J847J236J246Q44o80k579l905n062
59155H27462p067r693j1596j2139j2072j2227j2487j2337j1775j1136j0526r864
59143F94543r202q641q045p221o245n428m927m618m297l872l316k600j796j132
59129F23203p67m54L30J787L386M314M365M211M818O581Q999J1053J1985J1956
59115F95767J1829J2224J2873J3063J2491J1413J0185R039Q161P523O687N244
$$ plain form
59215 759327 752463 746666 741218 735825 730240 724101 717525 711435 706814 703784 701751 700293 699424 699136 699200
59200 699200 699557 700363 701409 701968 701637 701072 701443 703346 706580 710727 715355 719844 723725 727409 731939 737735
59184 737735 744032 749871 755257 760896 767125 773548 779592 785026 789967 794658 799229 803558 807468 811077
59170 811077 814730 818461 821938 825084 828289 831647 834515 836362 837598 838844 839688 839008 836429 832524 827462
59155 827462 820395 810702 799106 786967 774895 762668 750181 737844 726069 714933 704407 694543
59143 694543 685341 676700 668655 661434 655189 649761 644834 640216 635919 632047 628731 626131 624335 623203
59129 623203 622436 621982 622312 624099 627485 631799 636164 640375 645193 651774 660773 671826 683811 695767
59115 695767 707596 719820 732693 745756 758247 769660 779845 788884 797045 804568 811255 816499
59103H16499L443J945J010L47l23j112k247l797n083n187m269l580l831m291l955
59088G85569k872j737q61k96l83j329k547l246l529m174n424o624p149p050o746
59073G31602o452o122n610m895m261m099m351m393l887l390l641m423m733m060
59059F67285k944k215k108k282k290j940j414j130j238j358j032l91Lr0l41m42
59043F46073n16q08j256j613j734j548q77L59J758K594K503J880J403J300J425
59028F50943J903L145N065O857P914Q468Q896R046Q870R098J0217J1224J0640
59015G52286Q630O776N654M185J745o32j925k646l603m287l733k175o03P74K362
59000G62808L964M954N346N604N643N159M583M577M743M047K516J308J004R50
$$ plain form
59103 816499 819942 821887 822897 823244 822921 821809 819562 815765 810682 805495 801226 797646 793815 789524 785569
59088 785569 782697 780960 780099 779803 779420 778091 775544 772298 768769 764595 759171 752547 745398 738348 731602
59073 731602 725150 719028 713418 708523 704262 700163 695812 691419 687532 684142 680501 676078 671345 667285
59059 667285 664341 662126 660018 657736 655446 653506 652092 650962 649724 648366 647334 646943 646946 646856 646515 646073
59043 646073 645557 644749 643493 641880 640146 638598 637721 638080 639838 642432 644935 646815 648218 649518 650943
59028 650943 652846 655991 661056 667913 675827 684295 693191 702237 711107 720205 730422 741646 752286
59015 752286 760916 767692 773346 777531 779276 778644 776719 774073 770470 766183 762450 760275 759672 760446 762808
59000 762808 766772 771726 777072 782676 788319 793478 798061 802638 807381 811428 813944 815252 816256 817206
58986H17206N20o1m36p04q42l62J008K826M439N545O146O494P213Q828J1019J2883
58970H81722J3993J4654J5074J5093J4825J4781J5036J4925J3903J2173J0202
58959A036381Q098N725K949l61m171p903j0761j2634j4187j5944j7709j8985j9544
58946I30954j9405j8732j7839j6902j5663j3903j2016j0522r158p335n404m465
58934G79610m646m627l345j367%K87J4j81n7K21J57n71j485j680j053n12o91j128
58916G58946j096o01k2N56J143J548J859K643M060N358N921O308P518R596J1726
58901H15463J3401J4727J5739J6328J6725J7347J7997J7927J6824J5291J4140
58890I91909J3711J3988J4972J6556J8288J9572K0061J9748J8667J6713J3881
$$ plain form
58986 817206 817726 817665 817229 816525 815683 815321 816329 819155 823594 829139 835285 841779 848992 857820 868839 881722
58970 881722 895715 910369 925443 940536 955361 970142 985178 1000103 1014006 1026179 1036381
58959 1036381 1044479 1050204 1053153 1052792 1048621 1040718 1029957 1017323 1003136 987192 969483 950498 930954
58946 930954 911549 892817 874978 858076 842413 828510 816494 805972 796814 789479 784075 779610
58934 779610 774964 770337 766992 765625 765625 765912 765926 765745 765688 765909 766066 765495 764010 762330 761277 760765 760074 758946
58916 758946 757850 757249 757227 757783 758926 760474 762333 764976 769036 774394 780315 786623 794141 803737 815463
58901 815463 828864 843591 859330 875658 892383 909730 927727 945654 962478 977769 991909
58890 991909 1005620 1019608 1034580 1051136 1069424 1088996 1109057 1128805 1147472 1164185 1178066
58879A178066J0525P165L935N74k903n906q038r755j1667j3466j4290j4075j3680
58866A106485j3556j3181j2112j0770r722q975q507q795j0053j1529j2307j2484
58854I74494j2806j3446j3941j4118j4295j4426j3843j2189j0210r250r961j1601
58842H24408j2658j2270j1008j0135j0173j0550j0593j0253r705q838p581o233
58830G04411m969l495j670j19M52K89K85Q47J651K459L453M668N687O159O220
58815G26328O153N926N276M170L001K325K374K764K740J789K3k002l727m846n365
58800G46929n517n463n123m489m077m543n763o715o578n574m470l690l191k889
58786F78847k628k032q30P50K235L452M560N663O697P580Q081P782O504M677K881
$$ plain form
58879 1178066 1188591 1195756 1199691 1200265 1197362 1191456 1183418 1173663 1161996 1148530 1134240 1120165 1106485
58866 1106485 1092929 1079748 1067636 1056866 1047144 1038169 1029662 1020867 1010814 999285 986978 974494
58854 974494 961688 948242 934301 920183 905888 891462 877619 865430 855220 845970 836009 824408
58842 824408 811750 799480 788472 778337 768164 757614 747021 736768 727063 718225 710644 704411
58830 704411 699442 695947 694277 694158 694610 694899 695184 696031 697682 700141 703594 708262 713949 720108 726328
58815 726328 732481 738407 743683 747853 750854 753179 755553 758317 761057 762846 762869 760867 757140 752294 746929
58800 746929 741412 735949 730826 726337 722260 717717 711954 705239 698661 693087 688617 684927 681736 678847
58786 678847 676219 674187 673357 674107 676342 679794 684354 690017 696714 704294 712375 720157 726661 731338 734219
58771G34219J103j171m050o889q923j0002j0441j0453r968r010p926p065o368
58758F43056n513m458l517k852k198j309l57M29J206K095K654K368J576J272J885
58743F36337K932L889M835N947O999P644P905Q030Q162Q309Q347Q036P282O418
58729G31072N897N737N664N630N620N157L851K370J962K780L630L681L514M006
58715G90571N038N952O578O972O752N460L291Q58j496l692n554o964q177r577
58701G96012j1360j3593j6156j8448j9623j9508j8796j8108j7339j6212j4781
58690F12088j3107j1087q997p514o736n920m685l684l518l729l619l344l344l310
58676E29494k700j721r01j16J010K124K487K269K492L758N684P607R220J0471
$$ plain form
58771 734219 735322 734151 730101 723212 714289 704287 693846 683393 673425 664415 656489 649424 643056
58758 643056 637543 633085 629568 626716 624518 623209 622852 623281 624487 626582 629236 631604 633180 634452 636337
58743 636337 639269 643158 647993 653940 660939 668583 676488 684518 692680 700989 709336 717372 724654 731072
58729 731072 736969 742706 748370 754000 759620 764777 768628 770998 772960 775740 779370 783051 786565 790571
58715 790571 795609 801561 808139 815111 821863 827323 830614 831472 829976 826284 820730 813766 805589 796012
58701 796012 784652 771059 754903 736455 716832 697324 678528 660420 643081 626869 612088
58690 612088 598981 587894 578897 571383 564647 558727 554042 550358 546840 543111 539492 536148 532804 529494
58676 529494 526794 525073 524172 524056 525066 527190 529677 531946 534438 538196 543880 551487 560707 571178
58662E71178J1338J1750J1447J0088P680M632J192k629o338q902r820r732r470
58649E82414r152q622q036p387o270m801l935m093m226l250j645o02j91M13J341
58634E21958J937J974J905K003K121K147J979J359L96k04j41j18o17q08J91J678
58618E37760K275J981J964K702L662M598N743O809P032O303N260M347L659L438
58604E97533L654L544K654J879K157K637J749k69j619j628j348j448j239k03J106
58589F09159K266L661N430O939P820Q496R330J0203J1155J2347J3261J3116J2184
58576G25367J1503J1206J0512R421Q921R225R497R634J0786J3471J6670J9385
58564H65598K1765K4134K6328K8458L0840L2569L1817K8338K4049K0287J6127
$$ plain form
58662 571178 582516 594266 605713 615801 623481 628113 629305 626676 620338 611436 601616 591884 582414
58649 582414 573262 564640 556604 549217 542947 538146 534211 530118 525892 522642 520997 520395 520204 520617 521958
58634 521958 523895 525869 527774 529777 531898 534045 536024 537383 537779 537575 537434 537316 536699 535891 536082 537760
58618 537760 540035 542016 543980 546682 550344 554942 560685 567494 574526 580829 586089 590436 594095 597533
58604 597533 601187 604731 607385 609264 611421 614058 615807 615538 613919 612291 610943 609495 608256 608053 609159
58589 609159 611425 615086 620516 627455 635275 643771 653101 663304 674459 686806 700067 713183 725367
58576 725367 736870 748076 758588 768009 776930 786155 795652 805286 816072 829543 846213 865598
58564 865598 887363 911497 937825 966283 997123 1029692 1061509 1089847 1113896 1134183 1150310
58553A150310J0470M162j314n759r384j1401j1166r710q555p793o913o686q440
58540A077821j1909j5476j8350k1096k4041k6611k8277k8981k8537k6670k3796
58529H24077k0864j8200j5312j2050r202p627p213p093o625n961n592n530n150
58516F97658m090k898k341k337k243j985k035k364k401k087j909j848j383o88
58502F67049n65q97n53O58J366P13l39o32m60n08l28Q08K461L688M489N438O537
58485F88925P562Q962J1218J3809J5817J7157J8272J9082J9295J9247J9400J9287
58473H78033J7928J5004J0870N750j27n877j0331j2968j3944j3492j1917r769
58461H49160p415m774j950M42K152L907O449R546J2499J4923J6420J6216J4003
$$ plain form
58553 1150310 1160780 1164942 1163628 1157869 1148485 1137084 1125918 1116208 1107653 1099860 1092947 1086261 1077821
58540 1077821 1065912 1050436 1032086 1010990 986949 960338 932061 903080 874543 847873 824077
58529 824077 803213 785013 769701 757651 748449 740822 733609 726516 719891 713930 708338 702808 697658
58516 697658 693568 690670 688329 685992 683749 681764 679729 677365 674964 672877 670968 669120 667737 667049
58502 667049 666484 665587 665034 665692 667058 667771 667432 666800 666340 665832 665504 666312 668773 672461 676950 682388 688925
58485 688925 696487 705449 716667 730476 746293 763450 781722 800804 820099 839346 858746 878033
58473 878033 895961 910965 921835 927585 927458 921581 911250 898282 884338 870846 858929 849160
58461 849160 841745 836971 835021 835463 837615 841522 847971 857517 870016 884939 901359 917575 931578
58448I31578J0488O396J596l985r408j3611j6496j8256j8437j6849j4595j2926
58436H25495j1555r412o579m209k810j769m36J331L462N626P161P879Q511R524
58422H32219J0107R369P802O332M545J391k733o159q188r655j1149j2064j1794
58409H10023j0843j0162j0089j0180r737q421o771n821n773n558m230k241n70
58396G19627O48J713K300K047J689K199L175L444L037L135M155N243N799O174
58382G64385O597O546N701M642M153M406M980N224M706L816L743N144P095Q097
58368H39235P967P867Q625R895J0989J1743J2436J3385J4656J5853J6336J5917
58356I84904J4899J3296J0725P510M878L414K176K74j614k267j693p24L41J574
$$ plain form
58448 931578 942066 948462 950058 946073 936665 923054 906558 888302 869865 853016 838421 825495
58436 825495 813940 804528 797949 793740 790930 789161 788725 790056 793518 799144 806305 814184 822695 832219
58422 832219 842326 851695 859497 865829 870374 871765 869032 862873 854685 845030 833881 821817 810023
58409 810023 799180 789018 778929 768749 759012 750591 743820 737999 732226 726668 722438 720197 719627
58396 719627 720275 721988 724288 726335 728024 730223 733398 736842 739879 743014 747169 752412 758211 764385
58382 764385 770982 777528 783229 787871 792024 796430 801410 806634 811340 815156 818899 824043 831138 839235
58368 839235 847202 855069 863694 873589 884578 896321 908757 922142 936798 952651 968987 984904
58356 984904 999803 1013099 1023824 1031334 1036212 1039626 1041802 1042076 1040462 1038195 1036502 1035778 1036119 1037693
58342A037693K658L443M577O406Q061Q873R783J1917J4583J6290J7047J7910J8847
58329A178088J8874J7913J6666J4951J2007Q324N414L685K206N87m77o76n55l08
58315A276699N68K234M192O063P654Q549Q718R172J0760J2681J3517J3285J3147
58302A387239J3477J3822J4343J5675J7503J8736J9008J8754J8173J7444J7409
58291A571583J8641K0341K1488K2394K3703K4770K4789K4558K5275K6451K7088
58280A831081K7858K9823L1980L2547L1968L2005L2634L2604L2397L3597L5836
58269B184330L7418L8674M1521M5845M9511N1991N4822N8356O1299O3579O6464
58258B753810O9503P0708P0182P0301P1779P2794P2651P2968P4633P6752P9422
$$ plain form
58342 1037693 1040351 1043794 1048371 1054777 1062838 1071711 1081494 1093411 1107994 1124284 1141331 1159241 1178088
58329 1178088 1196962 1214875 1231541 1246492 1258499 1266823 1272237 1275922 1278128 1278715 1278238 1277562 1277007 1276699
58315 1276699 1277267 1279501 1283693 1289756 1297410 1305959 1314677 1323849 1334609 1347290 1360807 1374092 1387239
58302 1387239 1400716 1414538 1428881 1444556 1462059 1480795 1499803 1518557 1536730 1554174 1571583
58291 1571583 1590224 1610565 1632053 1654447 1678150 1702920 1727709 1752267 1777542 1803993 1831081
58280 1831081 1858939 1888762 1920742 1953289 1985257 2017262 2049896 2082500 2114897 2148494 2184330
58269 2184330 2221748 2260422 2301943 2347788 2397299 2449290 2504112 2562468 2623767 2687346 2753810
58258 2753810 2823313 2894021 2964203 3034504 3106283 3179077 3251728 3324696 3399329 3476081 3555503
58247C555503Q4154R0807R7219J02692J08751J15832J22528J28717J35999J44394
58237D686596J52163J59529J68800J80154J91228K01656K13969K28972K44455
58228F427522K59601K76514K96189L17268L39802L65910L95618M26746M59931
58219I565101M98823N44272N93743O47688P10723P85086Q69179R64358J076896
58210A6255869J211625J370717J560891J794773K083260K434058K858468L368460
58202C2938121L963181M628659N355681O149887P025352Q005538R135755J0476048
58194H7678222J2073133J3957339J6170627J8760866K1723011K4975241K8407688
58187B23746127L1852812L4832490L6268062L4600857K8518686J7885587M165274
$$ plain form
58247 3555503 3639657 3730464 3827683 3930375 4039126 4154958 4277486 4406203 4542202 4686596
58237 4686596 4838759 4998288 5167088 5347242 5538470 5740126 5954095 6183067 6427522
58228 6427522 6687123 6963637 7259826 7577094 7916896 8282806 8678424 9105170 9565101
58219 9565101 10063924 10608196 11201939 11849627 12560350 13345436 14214615 15178973 16255869
58210 16255869 17467494 18838211 20399102 22193875 24277135 26711193 29569661 32938121
58202 32938121 36901302 41529961 46885642 53035529 60060881 68066419 77202174 87678222
58194 87678222 99751355 113708694 129879321 148640187 170363198 195338439 223746127
58187 223746127 255598939 290431429 326699491 361300348 389819034 407704621 411869895
58180D11869895j0043009k2088931l0305125l4423456l5261897l4024443l1706948
58173B14016086k8887843k5836240k2698524j9604484j6684923j4050467j1764820
58166G4488785r833656q222151o886105n786938m887051m147720l537096l033337
58158B8154731k617839k271837j981178j737861j534593j362748j216599j094069
58150A4338007r91743r03684q25982p57729o96768o39109n83478n31903m84930
58141G922681m40496l98324l60970l29403l01647k76848k56658k41423k28706
58132E088206k16822k06324j97013j86945j75531j64355j53994j43221j32152
58123C511849j22788j15462j08152j00328r4117r0425q7219q2966p8658p5064
$$ plain form
58180 411869895 401826886 379737955 349432830 315009374 279747477 245723034 214016086
58173 214016086 185128243 159292003 136593479 116988995 100304072 86253605 74488785
58166 74488785 64655129 56432978 49546873 43759935 38872884 34725164 31188068 28154731
58158 28154731 25536892 23265055 21283877 19546016 18011423 16648675 15432076 14338007
58150 14338007 13346264 12442580 11616598 10858869 10162101 9522992 8939514 8407611 7922681
58141 7922681 7482185 7083861 6722891 6393488 6091841 5814993 5558335 5316912 5088206
58132 5088206 4871384 4665060 4468047 4281102 4105571 3941216 3787222 3644001 3511849
58123 3511849 3389061 3273599 3165447 3065119 2971002 2880577 2793358 2710392 2631734 2556670
58113B556670p1040o6144o2017n9470n6950n3458n0463m9188m8387m6691m4853
58102A948009m3916m3151m1647m0154l9687l9771l9553l9180l8779l7662l5674
58091A508835l3869l2658l0946k8197k5603k4062k2646k0498j8610j8200j8740
58080A234806j9083j9312k0023k0756k0603j9613j8596j8099j8298j8976j9132
58069A022315j7746j5458j4205j4584j5032j4235j2778j1611j0493r138q307q504
58057H70224q863q610q428r102r945r878r162q761q849q995r136r204q589p040
58043G45662n384m524m377m566n210o214o759o458o137o467o740o120n250n449
58029F66007o796q215r015r432r900j0553j1130j1005r779q100p108o805o073
$$ plain form
58113 2556670 2485630 2419486 2357469 2297999 2241049 2187591 2137128 2087940 2039553 1992862 1948009
58102 1948009 1904093 1860942 1819295 1779141 1739454 1699683 1660130 1620950 1582171 1544509 1508835
58091 1508835 1474966 1442308 1411362 1383165 1357562 1333500 1310854 1290356 1271746 1253546 1234806
58080 1234806 1215723 1196411 1176388 1155632 1135029 1115416 1096820 1078721 1060423 1041447 1022315
58069 1022315 1004569 989111 974906 960322 945290 931055 918277 906666 896173 887035 878728 870224
58057 870224 861361 852751 844323 835221 825276 815398 806236 797475 788626 779631 770495 761291 752702 745662
58043 745662 740278 735754 731377 726811 721601 715387 708628 702170 696033 689566 682826 676706 671456 666007
58029 666007 659211 650996 641981 632549 622649 612096 600966 589961 580182 572082 564974 558169 552096
58016E52096m622l648l820m058l355k477k597l294l328k506j418j27J388K143
58002E20377J117r95k336k091r84J36J007J373R21rn90m99j63o5m09j352k845
57985E12593m267m801m172k798j382o01p71j490j979k033k101k298k119j442r12
57970D79427q46o72o8L36J31n7K55L95k24q92q16o78j517k773l013k175j563j835
57952D63415k373k601k596k372j752j034p16n75N6J112J941K474L209M111M627
57937D66926M899N734P240Q552R150R396R535R141P914O145M069J594j034l159
57923E46102m638o050p662q971r617r946j0261j0241r643q827q067p000n342l591
57909D36246k341j410l58N30O39K53M85J805L271L570K523J156N11O84J115J415
$$ plain form
58016 552096 547474 543826 540006 535948 532593 530116 527519 524225 520897 518391 516973 516846 518234 520377
58002 520377 521494 520499 518163 516072 515088 515224 516231 517604 518525 518516 517926 517427 517264 517199 516790 515438 512593
57985 512593 508326 503525 499353 496555 495173 494572 493801 492311 490332 488299 486198 483900 481781 480339 479427
57970 479427 478581 477909 477841 478177 478308 478251 478506 478901 478677 477785 476969 476291 474774 472001 468988 466813 465250 463415
57952 463415 461042 458441 455845 453473 451721 450687 449971 449396 449452 450564 452505 454979 458188 462299 466926
57937 466926 471825 477559 484799 493351 502501 511897 521432 530573 538487 544632 548701 550295 549261 546102
57923 546102 541464 535414 527752 518781 509164 499218 488957 478716 469073 460246 452179 445179 439837 436246
57909 436246 433905 432495 432137 432667 433306 433559 434044 435849 439120 442690 445213 446369 446880 447564 448679 450094
57893D50094J677K085K557K891L037L079L034K751J958M87j328k590k611j842
57879D65279j546k354l598m250m143l813l585l320k854k240j678j354j207q62
57865D28475j25N18M89K44Q84K426L550L623L820N249P056P681P219O963P089
57850D85161O534N085L917L633L303K034L39p89j278j739k452l298m199n112n891
57835D85248o416o562o017m612k940j980j933k092j948j740j635j258m85J06Q7
57820D45823j07O9L33J3j006k290l436m140m051l223k446k594l745n295o707p786
57804C99412q464q763q847q738q076o573m524k612j282n54k41k8M33J269K266
57789C44678L227M135M783M695L853L185L688N199O607P259P569Q071Q518Q312
$$ plain form
57893 450094 451771 453856 456413 459304 462341 465420 468454 471205 473163 473650 472322 469732 467121 465279
57879 465279 463733 461379 457781 453531 449388 445575 441990 438670 435816 433576 431898 430544 429337 428475
57865 428475 428350 428868 429357 429601 430485 432911 436461 440084 443904 449153 456209 463890 471109 478072 485161
57850 485161 491695 496780 500697 504330 507633 509667 510006 509217 507939 506200 503748 500450 496251 491139 485248
57835 485248 478832 472270 466253 461641 458701 456721 454788 452696 450748 449008 447373 446115 445630 445736 445823
57820 445823 445716 445785 446118 446131 445125 442835 439399 435259 431208 427985 425539 422945 419200 413905 407198 399412
57804 399412 390948 382185 373338 364600 356524 349951 345427 342815 341533 340979 340738 340710 341143 342412 344678
57789 344678 347905 352040 356823 361518 365371 368556 372244 377443 384050 391309 398878 406949 415467 423779
57775D23779P431O482N869N380M605L508K395J466N70n61j969l437m695n604o132
57760D39087o322o270o086n781n299m649m013l593l339k893k007r85m59n93p91
57745C86007m61J59L82R6k01l22o24j142j258o73m0m1l65k55L59R73J376J690
57727C85660J852J791J927K627L339L165K223J533J464J262L09r89j923k268k070
57712C99902j385o93q09j851k907l239l258l721m547n015m815m181l378k659k509
57697C54935l222m234m447l339j494k7L25l57j337j845j656j052k80O94J894L194
57681C37752M578O175P901R493J1171J3633J7129K0991K4601K8310L2859L8251
57669E52844M3976N0114N7298O5344P2219P4547O8944N3437K8649j710l1869n6315
$$ plain form
57775 423779 431210 437692 443561 448941 453546 457054 459449 460915 461485 460924 458955 455518 450823 445219 439087
57760 439087 432765 426495 420409 414628 409329 404680 400667 397074 393735 390842 388835 387850 387391 386798 386007
57745 386007 385546 385705 386087 386183 385982 385660 385036 383894 382636 381963 381923 381882 381517 381262 381621 382594 383970 385660
57727 385660 387512 389303 391230 393857 397196 400361 402584 404117 405581 406843 407152 406163 404240 401972 399902
57712 399902 398517 397824 397015 395164 392257 389018 385760 382039 377492 372477 367662 363481 360103 357444 354935
57697 354935 351713 347479 343032 339693 338199 338172 338497 338140 336803 334958 333302 332250 331970 332664 334558 337752
57681 337752 342330 348505 356406 365899 377070 390703 407832 428823 453424 481734 514593 552844
57669 552844 596820 646934 704232 769576 841795 916342 985286 1038723 1067372 1065662 1033793 977478
57657I77478p1877p8262p7200p1193o2626n3413m4824l7371l0975k5472k0933
57646D03332j7295j3976j0425p059n031m786n386n594n072m165l005j535r8P16
57632C20621P72M82J53l01j028j913k642k867k400j475o83m40o52j034j528k101
57616C02964k500k513k344k250k062j423m14M75Q28N58j25o83n45J65N31J0p09
57599B89963p30m57j089k664l717l242k087j724k298k703k290j651j613k053k143
57584B59502j526p91p03j210j580j380q68l56J86O13L01j022k517l041k562k033
57568B41013j986k048j862j643j571j404j005o68n14k03L79O93L89M5M37J388
57552B31440J992J798J204Q12R14J543K457K986K492J106l08j074j293j369j338
$$ plain form
57657 977478 905601 827339 750139 678946 616320 562907 518083 480712 449737 424265 403332
57646 403332 386037 372061 361636 354577 349546 344760 339374 333780 328708 324543 321538 320003 319905 320621
57632 320621 321393 321875 322028 321727 320699 318786 316144 313277 310877 309402 308719 308279 307627 306593 305065 302964
57616 302964 300464 297951 295607 293357 291295 289872 289458 289933 290761 291319 291194 290511 289966 290131 290662 290672 289963
57599 289963 289233 288776 287687 285023 281306 278064 275977 274253 271955 269252 266962 265311 263698 261645 259502
57584 259502 257976 257185 256482 255272 253692 252312 251444 251088 251274 251887 252188 251166 248649 245608 243046 241013
57568 241013 239027 236979 235117 233474 231903 230499 229494 228826 228312 228109 228488 229181 229570 229615 230052 231440
57552 231440 233432 235230 236434 237246 238160 239703 242160 245146 247638 248744 248436 247362 246069 244700 243362
57537B43362q66K11J568K544K575J641L60n66j045j545k322k995l019k373j453
57522B36077n10M77J417J961J894J429R65P37P89J060J365J470J379J406J734
57507B53650K090K071J677J207Q50O46P08J080J349R33j78j363k174k775l346
57492B56425l564l029j978j120q85j093j285j129o37j69j42n52r37q59l22L87
57476B39111R80J196Q95K95j15j75k19m60n64j98L64N15L8q02j592j976j758j138
57458B34397n82j93L63J066J270O97J23L37R48J001N04K83N92P96N57L90Q04J637
57440B44990K446K975L019K453J549Q36N07M67Q16J645K441K474J832J279J010
57425B70739M81l17m97L81J466J772J449J245J286J091M93j15k40L13J261J925
$$ plain form
57537 243362 242496 242707 244275 246819 249394 251035 251395 250829 249784 248239 245917 242922 239903 237530 236077
57522 236077 235567 236044 237461 239422 241316 242745 243710 244447 245236 246296 247661 249131 250510 251916 253650
57507 253650 255740 257811 259488 260695 261545 262191 262899 263979 265328 266261 266083 264720 262546 259771 256425
57492 256425 252861 249832 247854 246734 245849 244756 243471 242342 241705 241536 241394 240842 239905 239046 238724 239111
57476 239111 240091 241287 242182 242477 242362 242187 241968 241508 240944 240746 241110 241625 241663 240861 239269 237293 235535 234397
57458 234397 233815 233622 233985 235051 236321 237018 237141 237478 238426 239427 239931 240214 240806 241602 242159 242549 243353 244990
57440 244990 247436 250411 253430 255883 257432 258268 258775 259242 260058 261703 264144 266618 268450 269729 270739
57425 270739 271220 270903 270406 270787 272253 274025 275474 276719 278005 279096 279589 279474 279234 279547 280808 282733
57409B82733J869J547J765K410K521J736Q12K83k89j117j337k92J131J554J009
57394B96335O80J118J798K221K451K571K551K653L251M210N015N367N218M457
57380C39896L278K477K598K986K619J670J274J772K264K042J424Q76K78m55q05
57365C64194l31N78J160J108O21K9l03l7Q25J912K901L739M291M244L569K834
57349C91334K757L532M663N332N026M029L176K908K800K424K173K590L172K916
57335D38832J991J805L033M528M797L815K738K378K574K791K744K584K821L814
57321D81245N136N796N400M668M483M809N003M808M496M360M552N196O166O837
57307E52955O606N659M835M746N280N916O180N912N312M851M857N245N748O279
$$ plain form
57409 282733 284602 286149 287914 290324 292845 294581 295393 295676 295387 294270 292933 292641 293772 295326 296335
57394 296335 297015 298133 299931 302152 304603 307174 309725 312378 315629 319839 324854 330221 335439 339896
57380 339896 343174 345651 348249 351235 353854 355524 356798 358570 360834 362876 364300 365176 365454 364999 364194
57365 364194 363863 364441 365601 366709 367330 367359 367056 367019 367844 369756 372657 376396 380687 384931 388500 391334
57349 391334 394091 397623 402286 407618 412644 416673 419849 422757 425557 427981 430154 432744 435916 438832
57335 438832 440823 442628 445661 450189 454986 458801 461539 463917 466491 469282 472026 474610 477431 481245
57321 481245 486381 492177 497577 502245 506728 511537 516540 521348 525844 530204 534756 539952 546118 552955
57307 552955 559561 565220 570055 574801 580081 585997 592177 598089 603401 608252 613109 618354 624102 630381
57293F30381O872P380P564P465P447P822Q492R021R050Q729Q628R096R754R923
57279G47624R519R180R412J0062J0794J1623J2666J3708J4473J5056J5639J5939
57267H95695J5464J4353J3489J3548J4194J4475J3975J3335J3497J4580J5735
57256A052340J6244J6377J6911J7986J9006J9555J9839K0128K0294K0250K0414
57245A259344K1251K2618K3881K4635K4997K5296K5683K6013K6146K6255K6757
57234A532876K7638K8247K8146K7960K8694L0326L1863L2827L3752L4972L5977
57223A873278L6515L7416L9408M1876M3750M5103M6813M9016N0918N2138N3195
57212B369426N4586N6188N7834N9763O2185O4869O7403O9579P1480P3503P6162
$$ plain form
57293 630381 637253 644633 652197 659662 667109 674931 683423 692444 701494 710223 718851 727947 737701 747624
57279 747624 757143 766323 775735 785797 796591 808214 820880 834588 849061 864117 879756 895695
57267 895695 911159 925512 939001 952549 966743 981218 995193 1008528 1022025 1036605 1052340
57256 1052340 1068584 1084961 1101872 1119858 1138864 1158419 1178258 1198386 1218680 1238930 1259344
57245 1259344 1280595 1303213 1327094 1351729 1376726 1402022 1427705 1453718 1479864 1506119 1532876
57234 1532876 1560514 1588761 1616907 1644867 1673561 1703887 1735750 1768577 1802329 1837301 1873278
57223 1873278 1909793 1947209 1986617 2028493 2072243 2117346 2164159 2213175 2264093 2316231 2369426
57212 2369426 2424012 2480200 2538034 2597797 2659982 2724851 2792254 2861833 2933313 3006816 3082978
57201C082978P9450Q2387Q3723Q3135Q1411P9548P8078P7050P6100P4570P2106
57190C950536O9223O6730O4693O2562O0241N8344N7189N6242N4868N3025N0971
57179D604624M8772M6488M4454M2983M2043M1511M1482M2087M3172M4327M5076
57168E087019M4963M3740M1619L9161L6832L4781L2992L1379K9849K8524K7701
57157E478560K7243K6207K3789K0568J8114J7163J6917J6264J4993J3448J1769
57146E685035J0108R026Q948R445R733R762J0215J1363J2490J2650J1673J0123
57134E810571Q356O076L033j49k341l160l219k936j751Q93M486Q223J2318J7460
57120E857860K3211K8191L1977L5619L9959M4642M9309N4750O2203P2316Q5574
$$ plain form
57201 3082978 3162428 3244815 3328538 3411673 3493084 3572632 3650710 3727760 3803860 3878430 3950536
57190 3950536 4019759 4086489 4151182 4213744 4273985 4332329 4389518 4445760 4500628 4553653 4604624
57179 4604624 4653396 4699884 4744338 4787321 4829364 4870875 4912357 4954444 4997616 5041943 5087019
57168 5087019 5131982 5175722 5217341 5256502 5293334 5328115 5361107 5392486 5422335 5450859 5478560
57157 5478560 5505803 5532010 5555799 5576367 5594481 5611644 5628561 5644825 5659818 5673266 5685035
57146 5685035 5695143 5704169 5713117 5722562 5732295 5742057 5752272 5763635 5776125 5788775 5800448 5810571
57134 5810571 5818927 5825003 5828036 5827887 5825546 5822386 5819167 5816231 5814480 5815373 5819859 5828082 5840400 5857860
57120 5857860 5881071 5909262 5941239 5976858 6016817 6061459 6110768 6165518 6227721 6300037 6385611
57109F385611J03066J26169J55896J93070K38610K93386L58582M36656N31035
57100H822081O43954P74671R19565J073058J228921J383556J540131J708865J901935
57091A9996737K127828K389518K684038L000440L318272L608398L832098L937667
57083D4894996L865267L569096L044862K337556J521951O74712j41171q79689
57075E8887580j513654k036514k457484k790356l044822l225244l333370l370872
57067C7115264l341181l250537l107278k920469k700208k458751k209397j963445
57059A5163998j728782j510907j313681j138708r85376q52362p38416o41613n59168
57050E694985m88742m29201l79605l38380l03989k75512k51895k31399k12599
$$ plain form
57109 6385611 6488677 6614846 6770742 6963812 7202422 7495808 7854390 8291046 8822081
57100 8822081 9466035 10240706 11160271 12233329 13462250 14845806 16385937 18094802 19996737
57091 19996737 22124565 24514083 27198121 30198561 33516833 37125231 40957329 44894996
57083 44894996 48760263 52329359 55374221 57711777 59233728 59908440 59767269 58887580
57075 58887580 57373926 55337412 52879928 50089572 47044750 43819506 40486136 37115264
57067 37115264 33774083 30523546 27416268 24495799 21795591 19336840 17127443 15163998
57059 15163998 13435216 11924309 10610628 9471920 8486544 7634182 6895766 6254153 5694985
57050 5694985 5206243 4777042 4397437 4059057 3755068 3479556 3227661 2996262 2783663
57041B783663j95368j80095j66417j53427j40660j28079j15435j02431q9464p7403
57031A434884o6671n6975m7854l8997l0125k1093j2134l629M178J0763J4532J3009
57019A199888M323j1247l0775m9608o3308o9746o9754o5811o0099n3754m7331
57008F82778m1219l5601l0513k6175k2879k0506j8518j6538j4623j2940j1429
56997D31837r997q722p713o863n958m896l727k539j343OJ751L916O140P917R037
56982D08846R578R534Q548O059J696m222j0422j5189j7573j8003j7450j6225j4080
56969C31097j1268q702o888n357l405r40J736M427O948Q989J0624J2586J5429
56956C55276J8497K0196J9230J5251Q559n2r060j6493k0993k2556k2078k0358
$$ plain form
57041 2783663 2588295 2408200 2241783 2088356 1947696 1819617 1704182 1601751 1512287 1434884
57031 1434884 1368213 1311238 1263384 1224387 1194262 1173169 1161035 1157406 1161584 1172347 1186879 1199888
57019 1199888 1204211 1192964 1162189 1112581 1049273 979527 909773 843962 783863 730109 682778
57008 682778 641559 605958 575445 549270 526391 505885 487367 470829 456206 443266 431837
56997 431837 421840 413118 405405 398542 392584 387688 383961 381422 380079 380085 381836 385752 391892 399809 408846
56982 408846 418424 427958 436506 442565 444261 440039 429617 414428 396855 378852 361402 345177 331097
56969 331097 319829 311127 304239 298882 295477 294537 296273 300700 307648 316637 327261 339847 355276
56956 355276 373773 393969 413199 428450 437009 436957 427897 411404 390411 367855 345777 325419
56944C25419j7697j4298j0668p456m888k480N11M266Q191J1599J4537J7659K1361
56931C46056K5275K8519L0057K8676K3223J3504J097j1204k1038k7590l1185l2225
56919C73165l0994k8141k4725k1498j8539j5806j3535j1784r997p663n181l466
56907A81836k777k559k419k527k829k630j460J40J243J635J842K289K938L660
56893A78382M545N804P507R433J1094J2271J3575J5929J9177K1570K1192J7556
56881C38035J1505M161l288r221j2251j2473j1307r899q258o029l325m40K651
56868B79861O055R547J2822J5922J9160K2812K7022L1732L6588M0972M4047M4422
56856E90962M0128K9867J4699k056j6939k8052l4754l6789l4542k9477k3325j6881
$$ plain form
56944 325419 307722 293424 282756 275300 270412 267932 268443 272709 280900 292499 307036 324695 346056
56931 346056 371331 399850 429907 458583 481806 495310 496407 485203 464165 436575 405390 373165
56919 373165 342171 314030 289305 267807 249268 233462 219927 208143 198146 190483 185302 181836
56907 181836 179059 176500 174081 171554 168725 166095 164635 164775 166018 167653 169495 171784 174722 178382
56893 178382 182927 188731 196238 205671 216765 229036 242611 258540 277717 299287 320479 338035
56881 338035 349540 353701 350413 341192 328941 316468 305161 295262 287004 280975 277650 277210 279861
56868 279861 285916 295463 308285 324207 343367 366179 393201 424933 461521 502493 546540 590962
56856 590962 631090 660957 675656 673600 656661 628609 593855 557066 522524 493047 469722 452841
56844D52841j0171l497K531P892J3308J9373K6076L3318M1181M9553N7947O5763
56832G56115P1948P3987O8165N2045K6968k162k9642n1352o5256p0993o9698o3725
56820F96400n5568m6804l8046k9606k1726j4245o611J440R519J7064K4026L0836
56808E66679L7787M4549N0043N2499M9806M0286K3737K114k0663m0023n2785n8492
56796F95537n8848n5782n0340m3247l5609k8407k1694j5099q907l876j3L706Q165
56783C85586J3203J8133K2549K6268K8666K8468K4198J5141K318j1433k2973l0774
56771D99350l5179l6965l6352l3606k9727k5873k2410j9102j6029j3702j2318
56760B18087j1355j0084q322o570n381m664l801k588j691j737k184j899p66L2
$$ plain form
56844 452841 442670 439173 441704 449596 462904 482277 508353 541671 582852 632405 690352 756115
56832 756115 828063 902050 970215 1022260 1049228 1047066 1017424 966072 900816 829823 760125 696400
56820 696400 640832 594028 555982 526376 504650 490405 483794 485234 494753 511817 535843 566679
56808 566679 604466 649015 699058 751557 801363 841649 865386 867500 846837 806814 754029 695537
56796 695537 636689 580907 530567 487320 451711 423304 401610 386511 377604 373728 373715 377421 385586
56783 385586 398789 416922 439471 465739 494405 522873 547071 562212 564530 553097 530124 499350
56771 499350 464171 427206 390854 357248 327521 301648 279238 260136 244107 230405 218087
56760 218087 206732 196648 188326 181756 176375 171711 167910 165322 163631 161894 159710 157811 157045 157077
56746A57077l33j287j874k013k118k093j587q65n59o69n73j4N22N31Q3l86m79
56729A43363o1O31J108J093Q19O26N39N29Q46J527J958J523O36L39R13J564J626
56712A59579J372J347J514J468J169R78J184J705K195K260J741R43M59N75R72
56697A79461J082O98J68m0J13J63k64q25p57J11R94J080M97K6N1L60P37J202J659
56678A86516J820J617J269R07M21j70o28q12p73n09P0P69J104Q33K19k98m85l37
56660A91533j6J25j46n49n29k3M35N60Q00J574K412K418J445L38q4Q8J89j02m77
56641A99991n23k09K16N44O26K78m74j113j040l58J12j91r07j403j624j925k281
56624A89719k296j872j240m56N47J314R78n67k146k470j586o43l74l50R0O90N81
$$ plain form
56746 157077 156744 155457 153583 151570 149452 147359 145772 144907 144348 143679 143106 143092 143614 144145 144228 143842 143363
56729 143363 143302 143933 145041 146134 146953 147579 148118 148647 149493 151020 152978 154501 155137 155476 156389 157953 159579
56712 159579 160951 162298 163812 165280 166449 167427 168611 170316 172511 174771 176512 177455 177914 178489 179461
56697 179461 180543 181241 181409 181369 181482 181645 181381 180556 179799 179910 180904 181984 182481 182507 182558 182918 183655 184857 186516
56678 186516 188336 189953 191222 192129 192550 192380 191752 190940 190167 189658 189728 190497 191601 192434 192653 192355 191870 191533
56660 191533 191517 191642 191496 190947 190418 190395 190830 191390 192190 193764 196176 198594 200039 200377 200293 200381 200570 200468 199991
56641 199991 199468 199259 199475 200019 200645 200923 200449 199336 198296 197938 198050 197859 196952 195549 193925 192000 189719
56624 189719 187423 185551 184311 183855 184402 185716 186694 186127 183981 181511 179925 179282 178908 178558 178648 179338 179919
56607A79919l87j168p36N40J310R39J91J7K75J79m19q34n09L77J280J787J713
56590A84474J153N55M26P90J144J034N12K3j9M26R84J211J043P76O17N67P70J477
56572A97963K420K794K348J969K520L617M255M372M765N710O579O963P264P962
56558B61501R033J0272J1397J1632R977O371K080j501l906n324n938n948n764
56545B93882n617n330m784m267l961l509k571j483r65j257j865k117j769j134
56531B53253p23o62o18l87l25p19j104p94j5L58J18j21j15l53r19j089n81k79
56513B44925r04j832k040j619j351j389j329j238j549k111k315k123k038k075
56499B21012j641o23K58M58K76K01K00L4j97l31n23r09j074m73P11J626J741J394
$$ plain form
56607 179919 179532 178364 177628 178168 179478 180417 180608 180625 180900 181079 180660 179826 179317 179694 180974 182761 184474
56590 184474 185627 186182 186608 187398 188542 189576 190088 190111 190092 190518 191502 192713 193756 194532 195149 195716 196486 197963
56572 197963 200383 203177 205525 207494 210014 213631 217886 222258 227023 232733 239312 246275 253539 261501
56558 261501 270534 280806 292203 303835 313812 320183 322263 320762 316856 311532 305594 299646 293882
56545 293882 288265 282935 278151 273884 269923 266414 263843 262360 261395 260138 258273 256156 254387 253253
56531 253253 252530 251868 251250 250863 250538 249819 248715 247921 247906 248264 248382 248261 248146 247793 246874 245785 245204 244925
56513 244925 244021 242189 240149 238530 237179 235790 234461 233223 231674 229563 227248 225125 223087 221012
56499 221012 219371 218748 219006 219464 219740 219941 220141 220175 219978 219647 219124 218215 217141 216668 217379 219005 220746 222140
56481B22140J139R60N60J48L23J058J473R89J94K4M36O57M85N47J146J682J485
56464B35446O37m10j404k138k233j612q62o23q08p76j11R50J754J756J084N69
56448B31219Q92J679J994J664J469J858K274K147J721J357Q09j41r44j032q10
56433B46156j023j552j661j196o30j20N24J000O28n01j278q97J96J017J238J206
56417B43107J159R28M10o0o5L40O34M69P7j85m37r62j429j085J47J375J800J562
56399B47785J216R75Q19R00J284J719K045K442K869K765J856P77L86P78J476K131
56383B72223K469K069R15k28o87p57j000j078k70J173K131K059J464Q99M02J1
56367B81795K1M94J083J510J715J537Q38O4J5Q51J820K176J966J716J740J951
$$ plain form
56481 222140 223279 224239 224799 224947 225270 226328 227801 228790 228984 229008 229444 230101 230586 231133 232279 233961 235446
56464 235446 236083 235673 234269 232131 229898 228286 227424 226801 225993 225217 225106 226056 227810 229566 230650 231219
56448 231219 232111 233790 235784 237448 238917 240775 243049 245196 246917 248274 249083 248942 247998 246966 246156
56433 246156 245133 243581 241920 240724 240094 239974 240498 241498 242126 241625 240347 239450 239646 240663 241901 243107
56417 243107 244266 245194 245604 245544 245479 245819 246453 246922 246999 246814 246377 245415 243986 242901 243048 244423 246223 247785
56399 247785 249001 249976 250795 251695 252979 254698 256743 259185 262054 264819 266675 267452 267838 268616 270092 272223
56383 272223 274692 276761 277676 277448 276761 276004 275004 273926 273656 274829 276960 279019 280483 281382 281784 281795
56367 281795 281816 282310 283393 284903 286618 288155 288993 289057 289072 289923 291743 293919 295885 297601 299341 301292
56351C01292K120K150K182K287K126J201k68j255j124m48l0L12J210K381K863
56336C16999K484K102K337K883L266L490L757M145M685N214N274M715M248M557
56322C70156N004M273K314O01J74N09O40M51K48O6rM26J381K130K222K161K484
56305C95231K905L127L801N524P442Q068P392O936P575Q368Q034O673N256M170
56291D80502L161K421K649L908N238N909O396P474Q884R767J0164J0986J2354
56278E69813J3075J2424J1479J1799J3332J4695J5246J5780J7151J9186K1300
56267G35280K3398K5739K8320L0928L3516L6254L9338M2925M7207N2411N8760
56256A154076O6288P4667Q3410R2395J01942J12195J22734J33079J43213J53205
$$ plain form
56351 301292 303412 305562 307744 310031 312157 313358 313090 311835 310711 310263 310233 310545 311755 314136 316999
56336 316999 319483 321585 323922 326805 330071 333561 337318 341463 346148 351362 356636 361351 365599 370156
56322 370156 375160 379433 381747 382348 382522 383031 383671 384122 384370 384436 384427 384853 386234 388364 390586 392747 395231
56305 395231 398136 401263 405064 410588 418030 426098 433490 440426 448001 456369 464403 471076 476332 480502
56291 480502 483663 486084 488733 492641 497879 503788 510184 517658 526542 536309 546473 557459 569813
56278 569813 582888 595312 606791 618590 631922 646617 661863 677643 694794 713980 735280
56267 735280 758678 784417 812737 843665 877181 913435 952773 995698 1042905 1095316 1154076
56256 1154076 1220364 1295031 1378441 1470836 1572778 1684973 1807707 1940786 2083999 2237204
56246B237204J62639J70895J77704J82944J86032J86049J82241J74035J60935
56237C820678J42987J21143R6521O9494M0028Q772k2766n3002q0726j05068j25634
56226C912427j42556j55926j65394j70749j72474j71213j67218j60993j53893
56217B452011j47019j39934j31562j22104j12902j04609r6724q8927q1604p4904
56207A351722o8411o2136n6749n2466m8542m4315l9987l6016l2433k9116k6140
56196H55411k3554k1212j9001j6859j4614j2391j0879j0516j0585r951q487o900
56184F90462n462l936k587j984j891j556j148j483k257k099o96N85P95O96J237
56169F68676K105K637L092M030N251O293P150P841P986P677P994R773J2394J4565
$$ plain form
56246 2237204 2399843 2570738 2748442 2931386 3117418 3303467 3485708 3659743 3820678
56237 3820678 3963665 4084808 4181329 4250823 4290851 4299623 4276857 4223855 4143129 4038061 3912427
56226 3912427 3769871 3613945 3448551 3277802 3105328 2934115 2766897 2605904 2452011
56217 2452011 2304992 2165058 2033496 1911392 1798490 1693881 1597157 1508230 1426626 1351722
56207 1351722 1283311 1221175 1164426 1111960 1063418 1019103 979116 943100 910667 881551 855411
56196 855411 831857 810645 791644 774785 760171 747780 736901 726385 715800 705849 697362 690462
56184 690462 685000 681064 678477 676493 674602 673046 671898 670415 668158 666059 665363 665948 666743 667439 668676
56169 668676 670781 673418 676510 680540 685791 692084 699234 707075 715061 722738 730732 740505 752899 767464
56155G67464J5868J6953J8601K1172K4523K8071L1301L4504L8555M3794M9756
56144A090562N6184O3452P1805Q0973R0834J01466J12069J20787J26140J27933
56134B042205J26250J20472J10072R5825P9820O4665N2757M5257M1035L7241L1371
56123B846970K2537J0963k500j6016k7233l5068m0631m6038n2980o2467p4777
56112B522760q8956j02975j14850j23145j26607j24507j17586j07654r5984q3088
56102A437408p0001n8306m8560m0096l2653k6815k2379j8032j3281r243o724n014
56090A086304l331j991j237l16J312L031M199N027N684N897O110P457R788J1245
56076A139179J0845R930J0075J1073J2084J3173J4488J5410J5768J6502J7962
$$ plain form
56155 767464 783332 800285 818886 840058 864581 892652 923953 958457 997012 1040806 1090562
56144 1090562 1146746 1210198 1282003 1362976 1453810 1555276 1667345 1788132 1914272 2042205
56134 2042205 2168455 2288927 2398999 2494824 2574644 2639309 2692066 2737323 2778358 2815599 2846970
56123 2846970 2869507 2880470 2877970 2861954 2834721 2799653 2759022 2712984 2660004 2597537 2522760
56112 2522760 2433804 2330829 2215979 2092834 1966227 1841720 1724134 1616480 1520496 1437408
56102 1437408 1367407 1309101 1260541 1220445 1187792 1160977 1138598 1120566 1107285 1098042 1091318 1086304
56090 1086304 1082973 1080982 1079745 1079429 1080741 1083772 1087971 1092998 1098682 1104579 1110689 1118146 1127934 1139179
56076 1139179 1150024 1159954 1170029 1181102 1193186 1206359 1220847 1236257 1252025 1268527 1286489
56065A286489J8992J8864J8569J9013J9540J9477J9458J9824J9436J7654J5782
56054A493098J5010J4596J3778J3583J4835J6155J6075J5651J6727J9009K0988
56043A669505K2511K4177K5445K5649K5815K7198K9087L0108L0661L1838L3093
56032A975087L3345L3391L4853L7501L9958M2251M5313M8653N0807N1719N2627
56021B445505N4012N5581N7585O0450O3609O6316O8825P1417P3411P4653P6634
56010C167998Q0492Q5305Q9927R4799J00323J05409J09550J14210J20222J26115
56000D194350J31143J37336J45967J54871J62188J69936J80418J91983K02121
55991E670313K12155K24753K39268K53815K69616K88815L10212L31651L54610
$$ plain form
56065 1286489 1305481 1324345 1342914 1361927 1381467 1400944 1420402 1440226 1459662 1477316 1493098
56054 1493098 1508108 1522704 1536482 1550065 1564900 1581055 1597130 1612781 1629508 1648517 1669505
56043 1669505 1692016 1716193 1741638 1767287 1793102 1820300 1849387 1879495 1910156 1941994 1975087
56032 1975087 2008432 2041823 2076676 2114177 2154135 2196386 2241699 2290352 2341159 2392878 2445505
56021 2445505 2499517 2555098 2612683 2673133 2736742 2803058 2871883 2943300 3016711 3091364 3167998
56010 3167998 3248490 3333795 3423722 3518521 3618844 3724253 3833803 3948013 4068235 4194350
56000 4194350 4325493 4462829 4608796 4763667 4925855 5095791 5276209 5468192 5670313
55991 5670313 5882468 6107221 6346489 6600304 6869920 7158735 7468947 7800598 8155208
55982H155208L81837M12633M45047M80529N21747N68305O19455O78296P48263
55973A3011320Q28550R18498J023135J148824J297656J472945J686148J951183
55965B3338259K276380K669074L141019L698377M331915N029016N791818O635273
55957E6911131P578691Q655197R919290J1424752J3203805J5287157J7722673
55950A40702696K0532320K3661521K7011379L0460219L3661222L5677577L4927527
55943C46634461K9823895J9823347O074677q891629k2222310l1838176l6987080
55936C02417185l8131610l6416155l3076720k9069505k4988141k1152847j7718669
55929A01863538j4742233j2223014j0131902q422193p033013n901641m977919
$$ plain form
55982 8155208 8537045 8949678 9394725 9875254 10397001 10965306 11584761 12263057 13011320
55973 13011320 13839870 14758368 15781503 16930327 18227983 19700928 21387076 23338259
55965 23338259 25614639 28283713 31424732 35123109 39455024 44484040 50275858 56911131
55957 56911131 64489822 73145019 83064309 94489061 107692866 122980023 140702696
55950 140702696 161235016 184896537 211907916 242368135 276029357 311706934 346634461
55943 346634461 376458356 396281703 402356380 393464751 371242441 339404265 302417185
55936 302417185 264285575 227869420 194792700 165723195 140735054 119582207 101863538
55929 101863538 87121305 74898291 64766389 56344196 49311183 43409542 38431623
55922C8431623m224105l606318l094579k668454k314496k019034j768943j556872
55914A7178822j378972j228746j098418r84521q86752q02696p28504o63105o06889
55905H800219n57543n11607m68779m30579l96237l63853l34031l08263k85203
55896E144124k62438k40580k21822k05758j90412j76004j63935j53346j42398
55887C387431j31798j23327j15975j07277r7594q9308q2640p5949o9575o5681
55877B428307o4546o4359o4502o5796o7625o8007o6573o4794o3189o0949n8107
55866A719860n5550n3005m9480m5533m2657m0680l8196l5328l3641l3428l3521
55855A258841l3585l4215l4883l4226l2378l0751k9508k7559k5024k3314k2628
$$ plain form
55922 38431623 34207518 30601200 27506621 24838167 22523671 20504637 18735694 17178822
55914 17178822 15799850 14571104 13472686 12488165 11601413 10798717 10070213 9407108 8800219
55905 8800219 8242676 7731069 7262290 6831711 6435474 6071621 5737590 5429327 5144124
55896 5144124 4881686 4641106 4419284 4213526 4023114 3847110 3683175 3529829 3387431
55887 3387431 3255633 3132306 3016331 2909054 2811460 2722152 2639512 2563563 2493988 2428307
55877 2428307 2363761 2299402 2234900 2169104 2101479 2033472 1966899 1902105 1838916 1777967 1719860
55866 1719860 1664310 1611305 1561825 1516292 1473635 1432955 1394759 1359431 1325790 1292362 1258841
55855 1258841 1225256 1191041 1156158 1121932 1089554 1058803 1029295 1001736 976712 953398 930770
55844I30770k1712k0322j9678k0059k0129j9168j7988j7146j6032j4447j3301
55833G30788j3112j3160j2688j1784j0768r791r234r339r435q687p486o933p136
55820F01235p396p750q817j0182j0645j0057r356q673p108m606k437j415j002
55807E11791n07R2Q35K039L488M490M949N396N838N720N065M499L943K520k1k887
55791E57250n484q038j0611j2543j3175j2470j0816q878p527p149p173p092p503
55778D38791r114j1157j2082j1558j0481r275p592n599m022k828j313L73J195
55765C55338Q86K59l47j428k865l585l265l006l657m634n083n151n367n616n508
55750C06971n097m664m318m188m481n050n456n583n660n601n110m401m020l932
$$ plain form
55844 930770 909058 888736 869058 848999 828870 809702 791714 774568 758536 744089 730788
55833 730788 717676 704516 691828 680044 669276 659485 650251 640912 631477 622790 615304 608371 601235
55820 601235 593839 586089 577272 567090 556445 546388 537032 528359 521251 516645 514208 512793 511791
55807 511791 511284 511376 512211 514250 517738 522228 527177 532573 538411 544131 549196 553695 557638 560158 560137 557250
55791 557250 551766 543728 533117 520574 507399 494929 484113 475235 467708 460559 453386 446294 438791
55778 438791 429677 418520 406438 394880 384399 375124 367532 361933 357911 355083 353770 354143 355338
55765 355338 356224 356483 356136 354708 351843 348258 344993 341987 338330 333696 328613 323462 318095 312479 306971
55750 306971 301874 297210 292892 288704 284223 279173 273717 268134 262474 256873 251763 247362 243342 239410
55736B39410l573k904k429k151j589r29j052k033k714k344j628j565k007k104
55722B10388j626j158j260j868k402k288j586r98j002j169q38j39K94L93N38O71
55706A95950M29R3L65J170J612J301P88M76n8j332l199m975n826n117l103j135
55690A77439m16o48p00k94PJ48O95J568K029K022K295L022L479L385L273L252
55674B00556K610J160k20q99j250j632j688j218p60o96o69m03j94j09L07J104
55658A95999J630J637J735K231K556K397K334K679K777K106J097K00q41k083k879
55643B13575l053l497m614n366m955m349m802n802n958n209m566m205l455k359
55629A51385j694j443q05J65L76n30j462j456q91n93o42o98q10j143j454j422
$$ plain form
55736 239410 235837 232933 230504 228353 226764 225835 224783 222750 220036 217692 216064 214499 212492 210388
55722 210388 208762 207604 206344 204476 202074 199786 198200 197202 196200 195031 194193 194054 194348 194741 195279 195950
55706 195950 196379 196472 196837 198007 199619 200920 201708 202184 202126 200794 197595 192620 186794 181677 178574 177439
55690 177439 177023 176375 175675 175381 175388 175536 176231 177799 179828 181850 184145 187167 190646 194031 197304 200556
55674 200556 203166 204326 204106 203207 201957 200325 198637 197419 196659 195963 195294 194891 194697 194588 194895 195999
55658 195999 197629 199266 201001 203232 205788 208185 210519 213198 215975 218081 219178 219378 218537 216454 213575
55643 213575 210522 207025 202411 197045 192090 187741 182939 177137 171179 165970 161404 157199 153744 151385
55629 151385 149691 148248 147443 147608 147984 147454 145992 144536 143645 143052 142410 141712 140902 139759 138305 136883
55613A36883j237j278j471j411j070q64j060j478j755j716j358p64k13q5m35p50
55597A19938m93J22L01k94j094j385j124p45n11m96p55j038p25L06J212J237Q85
55580A15341J134J786J683N74m26m30J79P12J169J706J980J738J545K206L699
55565A34596N140N584M721L000J253n7j177k395l278l250k683k503k715k432j436
55550A32368o02n06o69o36o37p29l89L52N07k93q58j27J127J353L77o81j045p52
55532A28160Q9J291K031J464r9j465k067k384k849l190l027k513k079j882j666
55517A09814j055l0Q33Q68J43n88r30j249j790k061j575o99j25j5j47m93r94j254
55499I8653j052q17r62j170r39m32j33m0J64M12M42L36K85J36k60n58m30j19O7
$$ plain form
55613 136883 135646 134368 132897 131486 130416 129552 128492 127014 125259 123543 122185 121421 121208 121123 120688 119938
55597 119938 119445 119567 119868 119574 118480 117095 115971 115226 114715 114219 113464 112426 111701 112007 113219 114456 115341
55580 115341 116475 118261 119944 120518 120092 119662 119841 120553 121722 123428 125408 127146 128691 130897 134596
55565 134596 139736 145320 150041 153041 154294 154237 153060 150665 147387 144137 141454 138951 136236 133804 132368
55550 132368 131766 131260 130591 129955 129318 128589 128200 128552 129059 128766 127908 127781 128908 130261 130638 129957 128912 128160
55532 128160 128249 129540 131571 133035 132936 131471 129404 127020 124171 120981 117954 115441 113362 111480 109814
55517 109814 108759 108729 109562 110430 110573 109985 109055 107806 106016 103955 102380 101681 101556 101541 101394 100901 99907 98653
55499 98653 97601 96784 95822 94652 93713 93281 93148 93108 93272 93684 94126 94462 94747 94883 94623 94065 93635 93516 93583
55480I3583K98O29M72m26j121n93O49J292J166J289J996K356J665M43m44q10r85
55463A01459j242j630j894j555n66K37Q3n67o39j01N5m82p96k59M72M82j41o73
55445I2243o80k08N04J011Q84L26Q4M53R04R30P28O20L96k52j096j623j623j166
55427I2435l41N65R95P14K31J84N01N75J38m06n07l5O76J138J099P36L83J07k45
55408I8943n97n60j5N11L74m16j165j187m08O05J122P90p9p92q68m05Q5J55k40
55389I5853p54j022j032r98q94l97M99J208J200O93L27L06L29J87kj66l53m60
55371I4524l09l7Q4K00P19J501J771J146K00l25m27n51p57p96p03p43q04m26M50
55352I4717J211J269P30J22k41l60k15K01N78M13l42j088j255q95m12R2P56J428
$$ plain form
55480 93583 93881 94510 94982 94556 93435 92842 93491 94783 95949 97238 99234 101590 103255 103698 103254 102444 101459
55463 101459 100217 98587 96693 95138 94572 94809 94892 94325 93686 93585 93640 93158 92362 92103 92575 93057 92916 92243
55445 92243 91563 91355 91859 92870 93754 94080 94164 94617 95521 96451 97179 97799 98195 97943 96847 95224 93601 92435
55427 92435 92094 92659 93654 94368 94599 94783 95284 95859 95997 95591 95084 95049 95725 96863 97962 98698 99081 99188 98943
55408 98943 98346 97786 97771 98282 98656 98240 97075 95888 95480 96085 97207 97997 97918 97126 96258 95853 95938 96093 95853
55389 95853 95099 94077 93045 92047 91153 90756 91255 92463 93663 94356 94683 94989 95318 95505 95503 95337 94984 94524
55371 94524 94215 94178 94262 94462 95181 96682 98453 99599 99799 99474 99047 98496 97739 96943 96240 95497 94693 94267 94717
55352 94717 95928 97197 97927 98049 97808 97448 97233 97434 98012 98425 98083 96995 95740 94845 94433 94525 95281 96709
55334I6709J673J322O88K11J57O18J369J778J338L36m92r83j546k117j935p11
55318I8415P13J416J454J314R71K81k28O0P69Q48J8r41j335j301j274j306j198
55301I8676q62l97J4K49M39Q74J456J573Q68j28o12n26l92l92k38J41M22M04K31
55282A01800L1j58j56J82N80N93J94k95p42j203j487j304p84l50q7K49O69Q90
55264I8622Q06N75K72j0L7N31R33O68l3m97o51q79j059o58J96P62Q31R24J155
55245A02525R57J95m16m61m48q35j209j063o45m40m57n62r21j448j426l47J220
55228I4219K254K372J838R31n7o01l51L43Q10P50K45m91j044q56K7O80L07p06
55210A00670j352j272q95n61k34N7K02L96R62J637J711J013K68J27K96J3q53j625
$$ plain form
55334 96709 98382 99704 100392 100603 100760 101378 102747 104525 105863 106199 105707 104724 103178 101061 99126 98415
55318 98415 99128 100544 101998 103312 104283 104564 104336 104396 105165 106013 106031 105090 103755 102454 101180 99874 98676
55301 98676 97814 97417 97431 97680 98119 98993 100449 102022 102890 102762 102150 101624 101232 100840 100602 100743 101165 101569 101800
55282 101800 101831 101673 101517 101699 102279 102872 103066 102771 102029 100826 99339 98035 97251 96901 96814 97063 97732 98622
55264 98622 99428 100003 100275 100265 100302 100833 101766 102434 102401 101904 101253 100374 99315 98657 98853 99615 100446 101370 102525
55245 102525 103482 103677 103261 102800 102352 101517 100308 99245 98600 98160 97703 97141 96220 94772 93346 92999 94219
55228 94219 96473 98845 100683 101614 101557 100956 100605 100948 101758 102508 102753 102262 101218 100362 100389 101069 101376 100670
55210 100670 99318 98046 97151 96590 96356 96413 96615 97011 97973 99610 101321 102334 102602 102729 103025 103038 102185 100560
55192A00560j701j199o25j70L08P67R01P05O49R38J049M54m22o55r3M97N25K18
55174A02706M4J08K89M25K14n24j296j256k67R15J638J930J890J320L85j79J1
55157A08353M18N04M83O40N96N9l44J02R44J081K96n96r66q85n38LM01K38k42
55138A10547k95K36O31K86m92r64q12k52L62P60P91M95M8l82o63o59l24J05K30
55119A09648j39p81j150q17K4N85L24k50j14Q51J666J668J384J462J478O31q21
55102A15649j743j559p45P2O95J091J191J117J077J024Q30O81P73P68K71l25j73
55085A20694P42J467J348P35J79k77p15q53m93l8m2n11r66j021o38q7K23J10r4
55066A19763J06O38R05N88L7l38n12n55l76o0nl32o23n37l30l61n16n48n82p80
$$ plain form
55192 100560 98859 97660 97035 96865 97173 97940 98841 99546 100195 101133 102182 102636 102214 101559 101466 101963 102488 102706
55174 102706 102750 102858 103147 103572 103786 103262 101966 100710 100443 101358 102996 104926 106816 108136 108521 108342 108353
55157 108353 108771 109275 109758 110398 110994 111053 110709 110811 111755 112836 113132 112536 111570 110685 110147 110150 110551 110789 110547
55138 110547 110252 110488 111119 111405 110913 109949 109137 108885 109247 110007 110798 111293 111341 110959 110296 109637 109313 109418 109648
55119 109648 109509 108728 107578 106761 106785 107370 107694 107444 107330 108181 109847 111515 112899 114361 115839 116470 115649
55102 115649 113906 112347 111602 111674 112369 113460 114651 115768 116845 117869 118699 119380 120153 120921 121192 120867 120694
55085 120694 121436 122903 124251 124986 125165 124888 124173 123320 122827 122789 122747 122236 121270 120249 119611 119524 119747 119857 119763
55066 119763 119869 120507 121412 122000 122037 121699 121187 120632 120256 120196 120191 119859 119236 118699 118369 118008 117492 116944 116362 115582
55046A15582p91j56Q98J620J635J152M50l37r61j088p31k41J53M04L50j49o87
55029A17103n52K85R48P14j30q42j176j320j275q77l00P3J97L09L73J83PM19J336
55010A15475J861J543J111J368J897J607L35r55j510j500j253o30L75J126J073
54995A21923O37O81J230J445Q99K23K08O63P20N9o21n60J00N31K69l25o38m10
54977A27034K69J135J700J408K88p63q34K4R73J412J353R69L49k60n69o60p61
54960A33067o47P1R86J048P3p36l60O43R94M29k67n89p54r27q71n52l96o39r19
54941A29654p30m5P10J082R49O72Q21J566K360K477J867J221J215J927K868L425
54925A52039L312K879K851L569M677N761O901Q126Q749P987O097M150K565P10
$$ plain form
55046 115582 114791 114635 115533 117153 118788 119940 120390 120053 119092 118004 117273 117032 117185 117589 117939 117790 117103
55029 117103 116551 116836 117784 118498 118368 117526 116350 115030 113755 112878 112578 112651 112848 113157 113530 113713 113720 114139 115475
55010 115475 117336 118879 119990 121358 123255 124862 125197 124242 122732 121232 119979 119349 119724 120850 121923
54995 121923 122560 123241 124471 125916 126815 127038 127246 127909 128629 128688 128067 127507 127607 128138 128407 128082 127444 127034
54977 127034 127303 128438 130138 131546 131834 131071 130237 130261 131234 132646 133999 134968 135317 135057 134488 133828 133067
54960 133067 132420 132491 133477 134525 134598 133862 133502 134145 135139 135568 135301 134712 133958 133031 132160 131608 131212 130573 129654
54941 129654 128924 128879 129589 130671 131620 132292 133113 134679 137039 139516 141383 142604 143819 145746 148614 152039
54925 152039 155351 158230 161081 164650 169327 175088 181989 190115 198864 206851 212948 217098 219663 220373
54911B20373j815m247n576n903o253p205q191q183o787m647k935k439k989l700
54897A49503l749k896j411J56J249J653J690J820J986J712R66M97J018K265L266
54882A59725L385K883K518K876L996N380O322O468O082N656N243M432K984J244
54868B19194l00j613l002m485n712o537p242p965q256p567n999m264l015k545
54854A50692k877l587l736k670r99p0l09p29m31J27n8j066k029k300j948j306
54838A26704p00n18r18j479j527q68J57J143J808J873J329O58L54K82J0l97m83
54821A27428k09K2R7L07O50P18M96N49J155J741J651J000L64j5l01o00q31r15
54803A33307q45n99k22R2J93J96L24O18Q15O33J25k64j41L32O74Q49J324K123
$$ plain form
54911 220373 218558 214311 208735 202832 196579 189374 181183 173000 166213 161566 158631 156192 153203 149503
54897 149503 145754 142858 141447 141603 142852 144505 146195 148015 150001 151713 152679 153176 154194 156459 159725
54882 159725 163110 165993 168511 171387 175383 180763 187085 193553 199635 205291 210534 214966 217950 219194
54868 219194 218894 217281 214279 209794 204082 197545 190303 182338 174082 166515 160516 156252 153237 150692
54854 150692 147815 144228 140492 137822 136823 136753 136444 135715 135284 135411 135353 134287 132258 129958 128010 126704
54838 126704 126004 125486 124568 123089 121562 120694 120851 121994 123802 125675 127004 127662 128016 128298 128308 127911 127428
54821 127428 127219 127241 127338 127645 128295 129013 129509 130058 131213 132954 134605 135605 135969 135954 135653 135053 134222 133307
54803 133307 132462 131863 131641 131733 131926 132122 132446 133064 133879 134512 134637 134373 134232 134564 135238 136087 137411 139534
54785A39534K439J718O20J34J89M3k12K58J450K293K331K380K989L407L000K639
54769A65212L529N268O443O724P088P970Q516Q025O968O009M878K928L31k110
54755B37779m046n758p302q220q193p536o700n733m614l747l570l695l136j672
54741A63857m01m77j589k342j990j107n42l18M7P12J446K140K845L408L496L166
54725A72351L043L759N174O374O542N810N076M911M886M212K738R83p43k663m894
54710B17559o911p967p801o789n502m382l599l145k967l045l237l216k829k420
54696A53749k410k603k323j384m52k42o73j072r65m06K15M72J67n09j117j357
54680A39090j218p71j74J69j39q56j157n77L51P06K39n17r67r76p51n16l55k08
$$ plain form
54785 139534 141973 143691 144311 144445 144634 144677 144465 144723 146173 148466 150797 153177 156166 159573 162573 165212
54769 165212 168741 174009 180452 187176 194264 202234 210750 218775 225743 231752 236630 239558 239889 237779
54755 237779 233733 227975 220673 212453 204260 196724 190024 184291 179677 175930 172360 168665 165529 163857
54741 163857 163456 162979 161390 159048 157058 155951 155409 155091 155138 155850 157296 159436 162281 165689 169185 172351
54725 172351 175394 179153 184327 190701 197243 203053 208129 213040 217926 222138 224876 225859 225116 222453 217559
54710 217559 210648 202681 194880 188091 182589 178207 174608 171463 168496 165451 162214 158998 156169 153749
54696 153749 151339 148736 146413 145029 144577 144335 143662 142590 141625 141219 141434 141906 142073 141564 140447 139090
54680 139090 137872 137101 136927 137096 136957 136101 134944 134367 134718 135424 135663 135146 134179 133203 132452 131936 131581 131373
54662A31373M9M23P81R44Q11M34P0L2L20M90K04k19j94K96P28Q45Q67Q67N54m7
54642A39628l80j96r9o27j244r54K64J261J158M16J99Q64J526J194J05n45k17
54625A42353J92l52j443j734q71M7N8m69p34p32q70r89n58L53J052J124Q48O78
54607A37953P03O49K22n42j168j169o79k95k02Q6Q66J667J883J522Q91M4q87j291
54589A40253p36K03N22N3m85o21n68n28k53M01J031J065M03m90r86p63p6M76N89
54570A39490M86M35K92j03m02j34N33R39Q12N25M45M67L31O9q5k6J34K24K54M84
54550A45170J086J716J741J034J78k84m61o17n57o4M86N73L72M44P75Q45N70M50
54532A53457O29O00M6o74j162j525j901j908j207k80r0q89j809j794p94K83O60
$$ plain form
54662 131373 131422 131845 132626 133570 134381 134815 134885 134917 135237 135727 135931 135712 135518 135814 136542 137387 138254 139121 139675 139628
54642 139628 139248 139052 138953 138326 137082 136128 136392 137653 138811 139227 139426 140290 141816 143010 143115 142570 142353
54625 142353 142545 142193 140750 139016 138145 138192 138250 137781 137047 136315 135445 134456 133898 134251 135303 136427 137275 137953
54607 137953 138656 139305 139527 138985 137817 136648 135969 135674 135472 135558 136424 138091 139974 141496 142387 142431 141544 140253
54589 140253 139517 139720 140242 140295 139810 139189 138621 138093 137840 138241 139272 140337 140740 140250 139264 138501 138425 138901 139490
54570 139490 139976 140411 140703 140600 140198 140064 140597 141536 142348 142873 143318 143785 144116 144185 144100 144074 144208 144432 144686 145170
54550 145170 146256 147972 149713 150747 150925 150641 150180 149563 149006 148942 149428 150001 150373 150817 151592 152437 153007 153457
54532 153457 154086 154686 154732 154058 152896 151371 149470 147562 146355 146075 145985 145096 143287 141493 140699 140982 141642
54515A41642M95M54P74J111J189J130J021P46M03L74O82P04j3j094j877k141j915
54498A43685j053L05J315J266N84K82O39J169J562J812J613O15o50j116o45k45
54482A51138n34r18o16J54O31N47K35J09L95J033J573J492Q61L48M06Q52J347
54465A59053J754J912J602J002O36O23N34J72q2r0l41j057j523j037m3M19J46
54448A63680j15J04L83J49n33j145j401j465j581j690j460p12L21J221J796K052
54432A59604J972J558J028N65K6p08j150o99L36Q67M44j66k00%k79q12o56M78
54414A62208J729K082J377K89m79p68q65q93n07O00J965K630K195J256N80L25
54398A73724K74L64O29Q66Q48O35M58M24N34P88J043J029O49Q2n31j128j433j090
$$ plain form
54515 141642 142137 142591 143365 144476 145665 146795 147816 148562 148965 149339 150021 150725 150712 149618 147741 145600 143685
54498 143685 142632 142937 144252 145518 146102 146384 147023 148192 149754 151566 153179 153794 153144 152028 151383 151138
54482 151138 150604 149686 149070 149224 149855 150402 150637 150746 151141 152174 153747 155239 156100 156448 156854 157706 159053
54465 159053 160807 162719 164321 165323 165959 166582 167116 167288 167206 167116 166775 165718 164195 163158 163115 163534 163680
54448 163680 163565 163669 164052 164201 163668 162523 161122 159657 158076 156386 154926 154214 154535 155756 157552 159604
54432 159604 161576 163134 164162 164727 164753 164045 162895 162196 162532 163399 163843 163677 163477 163477 163198 162386 161730 162208
54414 162208 163937 166019 167396 167685 167206 166438 165573 164680 164173 164773 166738 169368 171563 172819 173399 173724
54398 173724 173998 174362 174991 175857 176705 177340 177798 178222 178756 179544 180587 181616 182265 182347 181816 180688 179255 178165
54380A78165k96K15J01j67j02O0q7l81l81j6N60J378K388L062K932K258J721J625
54362A93035J871K428L201L731L657L289L118K982K354J273K51o39j762l021l752
54347B12016l729l512l539l529l124k530k155k071k156k329k365j837p14L69P55
54332A79550M70j4l47l60O5P06Q96K23p65j109o36m3J52J98M69Q41J024J092J129
54313A83541P73l11j616k150j674r73p23o77l96j25l51q76j095r48q61q60n09
54296A70169K07O53M85O4k41n45q47o71J84J053J144N66O3P5M68Q59Q37K00o15
54277A74108p64j13M04O9n59o08k98m16q13n68M54J379J717J830J912J573Q58
54260A80165N34Q67J089O99L98R35J799J977J460R75O49J0q99j430j441j526j939
$$ plain form
54380 178165 177869 178084 178185 178018 177916 177976 177889 177508 177127 177111 177671 179049 181437 184499 187431 189689 191410 193035
54362 193035 194906 197334 200535 204266 207923 211212 214330 217312 219666 220939 221190 220551 218789 215768 212016
54347 212016 208287 204775 201236 197707 194583 192053 189898 187827 185671 183342 180977 179140 178426 178795 179550
54332 179550 180020 180006 179659 179299 179364 180070 180966 181189 180424 179315 178679 178636 178788 178986 179455 180296 181320 182412 183541
54313 183541 184314 184003 182387 180237 178563 177590 176867 176190 175794 175669 175318 174442 173347 172399 171538 170678 170169
54296 170169 170376 171029 171514 171578 171337 170792 169945 169274 169458 170511 171655 172221 172284 172359 172827 173686 174523 174723 174108
54277 174108 173344 173231 173635 173704 173145 172537 172239 171823 171010 170442 170896 172275 173992 175822 177734 179307 180165
54260 180165 180699 181566 182655 183354 183752 184687 186486 188463 189923 190898 191547 191557 190658 189228 187787 186261 184322
54243A84322k102j554p39l65m72n97n32m14k87LM77Q89R59N88l8m74l05L20O71
54224A80350K40n27o87OP69Q09K84m0J67N19N76L64J56L4j18l28m69m25k55j73
54204A81252l76p97j099r63l95L05Q18R45O17Nm63m20M2N42Q73J078J133R50O84
54185A84731N98N47P3q10j394j151m14J68M30N23M04ql75l05K4J10o7j33o7k43
54165A82641o02n38J81R38J055O16J54j02k48l10k67k88m91o19l71nq1o07q96
54146A80160n26M3J43j39j54L45R57J321J511J613J500J258J302J649J576O27
54130A93186n10q64n91o76j324j706j381r10o91k53O98J462J449J272J807K660
54114A93628K671J637N01l8j11R0O61J333J400N89n19j274j566j501j007q5J013
$$ plain form
54243 184322 182220 180666 179927 179562 179090 178493 177961 177547 177260 177263 177740 178629 179588 180176 180138 179664 179359 179679 180350
54224 180350 180590 180063 179376 179382 180151 180960 181244 181204 181371 181890 182466 182830 182986 183020 182902 182574 182105 181680 181425 181252
54204 181252 180876 180079 178980 178017 177622 177927 178745 179690 180307 180312 179849 179429 179471 180013 180886 181964 183097 184047 184731
54185 184731 185329 185876 185949 185139 183745 182594 182180 182348 182778 183301 183705 183697 183322 183017 183041 183151 183084 182951 182884 182641
54165 182641 182039 181501 181682 182620 183675 184291 184445 184343 184095 183785 183518 183230 182739 182120 181749 181744 181663 181056 180160
54146 180160 179634 179677 179820 179681 179527 179872 180829 182150 183661 185274 186774 188032 189334 190983 192559 193186
54130 193186 192676 191812 191221 190545 189221 187515 186134 185224 184533 184280 184978 186440 187889 189161 190968 193628
54114 193628 196299 197936 198437 198399 198288 198378 199039 200372 201772 202361 201842 200568 199002 197501 196494 196409 197422
54097A97422K091L119L942M295M276M330M561M556M074L463L071K679J829M32
54083B44140j218k819m120m869m939m460l689k842k110j561j109o57k30K40J029
54068B10786K105K774K428J468Q47P82P17N31P76J516J920J515R74J042J469J688
54052B33338J834K259K609K345J778J657J945J944J520J253J361J358J052J036
54038B57289J796K961L877M479N176O110O918P082O370N016L642K833K684K805
54024C19038K793K534K117J643J243J017R03O78J84n75j499k416l095l441l620
54009C17504l878m262m727n326o019o344n806m678l929m123m696m659l817k825
53995B52415k235j890j434r18p18r33j238j306j157r89q45o44m90o86j327j995
$$ plain form
54097 197422 199513 202632 206574 210869 215145 219475 224036 228592 232666 236129 239200 241879 243708 244140
54083 244140 242922 240103 235983 231114 226175 221715 218026 215184 213074 211513 210404 209747 209517 209757 210786
54068 210786 212891 215665 218093 219561 220408 221190 221907 222438 223214 224730 226650 228165 229139 230181 231650 233338
54052 233338 235172 237431 240040 242385 244163 245820 247765 249709 251229 252482 253843 255201 256253 257289
54038 257289 259085 262046 265923 270402 275578 281688 288606 295688 302058 307074 310716 313549 316233 319038
54024 319038 321831 324365 326482 328125 329368 330385 331288 331966 332150 331575 330076 327660 324565 321124 317504
54009 317504 313626 309364 304637 299311 293292 286948 281142 276464 272535 268412 263716 259057 255240 252415
53995 252415 250180 248290 246856 245938 245220 244287 243049 241743 240586 239597 238752 238108 237618 236932 235605 233610
53979B33610k064j358m06J37K08L36P97J117O77k77p43j71Q65J461J464J390J519
53962B38562J626J506J307J289J613K332L272L936M020L937M400N476O611P563
53948B87450Q673J0000J0928J1015J0570R910Q547N806J961j828m485n553n119
53935C47875l782k514j896j591j008l09j20l81k73O11J690K224K259K380K986
53920C48151M032N181N946N983N549N370N871O714P286P382P176O804O288N704
53906D33437N049M053K472N58j146k383l313l985m122l662l190l449m466n528
53892D10325n952n699n215n004n379o280p150p314o736o103n951n994n678n081
53878C26789m741m818n008n195n488n590m891l459k264k072k609l163l456l542
$$ plain form
53979 233610 231546 230188 229782 229919 230127 230463 231260 232377 233054 232777 232034 231863 232728 234189 235653 237043 238562
53962 238562 240188 241694 243001 244290 245903 248235 251507 255443 259463 263400 267800 273276 279887 287450
53948 287450 296123 306123 317051 328066 338636 348546 357093 362899 364860 363032 358547 352994 347875
53935 347875 344093 341579 339683 338092 337084 336775 336655 336274 336001 336612 338302 340526 342785 345165 348151
53920 348151 352183 357364 363310 369293 374842 380212 386083 392797 400083 407465 414641 421445 427733 433437
53906 433437 438486 442539 445011 445569 444423 442040 438727 434742 430620 426958 423768 420319 415853 410325
53892 410325 404373 398674 393459 388455 383076 376796 369646 362332 355596 349493 343542 337548 331870 326789
53878 326789 322048 317230 312222 307027 301539 295949 291058 287599 285335 283263 280654 277491 274035 270493
53864B70493l354k953k763k961k966k196j042m99q98j673k215k331j936r93Q0
53849B41793N56K08m06o58m80k11j79n50j291k063k344j853p71L93J031Q24J70
53832B34169k3O34J391J244K28p39j111j042n98M31J704K255J751J101J315K244
53816B44954L018L177K803K028J093O04R83J850K474K720K971L306L419L339L505
53801B82244M070M638M908N032N167N119M724M190L756L303K651J975J608J601
53787C34986J762J932J945J514N67m19q55q81j319k631m254n267n466n426n607
53772C10581n836n697n128m417l833l472l347l392l435l316l078k899k836k766
53758B57129k575k347k241k243k133j732j143o80n58p27j011j225j163p00q3R6
$$ plain form
53864 270493 267139 264186 261423 258462 255496 253300 252258 251759 250861 249188 246973 244642 242706 241713 241793
53849 241793 242349 242557 242151 241493 241013 240802 240623 240073 238782 236719 234375 232522 231751 232144 233175 233999 234169
53832 234169 234146 234780 236171 237415 237643 236904 235793 234751 234153 234584 236288 238543 240294 241395 242710 244954
53816 244954 247972 251149 253952 255980 257073 257677 258660 260510 262984 265704 268675 271981 275400 278739 282244
53801 282244 286314 290952 295860 300892 306059 311178 315902 320092 323848 327151 329802 331777 333385 334986
53787 334986 336748 338680 340625 342139 342706 342287 341432 340551 339232 336601 332347 327080 321614 316188 310581
53772 310581 304745 299048 293920 289503 285670 282198 278851 275459 272024 268708 265630 262731 259895 257129
53758 257129 254554 252207 249966 247723 245590 243858 242715 242035 241477 240750 239739 238514 237351 236651 236568 236664
53742B36664m00r56p63N9N37J53n00o04j56L46P51J214J613J649J370J085P82
53725B42844K53l04l46K88J187K006K689L087K910K331J984K210K667K917K887
53710B69610K539J740Q05M85R64J423J209Q66J227K048K450K473L022M304N375
53695C00540N536N234N055M715L713K350J318O47j07q90j179q96n62l91rO84J042
53678C26800N68k48n67l77m07r59j454j288o47j87k22n17o93o24m48l45l22j97
53660C17866J37N03O15M51K60K00J87J38Q3%j46j40L38J057J242N67j99j12O88
53641C23735J181R17M97O07J112J449J431J280J173J171J372J773K081J991J666
53626C43436J657K255L133L732L887L886L951L913L584L266L526M414N259N496
$$ plain form
53742 236664 236264 235308 234545 234604 235141 235294 234794 234190 234034 234380 235131 236345 237958 239607 240977 242062 242844
53725 242844 243097 242793 242447 242735 243922 245928 248617 251704 254614 256945 258929 261139 263806 266723 269610
53710 269610 272149 273889 274694 275179 276143 277566 278775 279641 280868 282916 285366 287839 290861 295165 300540
53695 300540 306076 311310 316365 321080 324793 327143 328461 329108 329001 328111 326932 326036 325474 325083 325074 325758 326800
53678 326800 327368 327120 326553 326176 325769 324810 323356 322068 321421 321234 321012 320495 319802 319178 318730 318385 318063 317866
53660 317866 318003 318506 319121 319572 319832 320032 320219 320357 320440 320440 320294 320154 320492 321549 322791 323358 323159 323047 323735
53641 323735 324916 325833 326330 326937 328049 329498 330929 332209 333382 334553 335925 337698 339779 341770 343436
53626 343436 345093 347348 350481 354213 358100 361986 365937 369850 373434 376700 380226 384640 389899 395395
53612C95395N386N506N801N647M747L539K604K152K112K286K249J625O36N6L21
53597D40062J072J762K281K603K281R11j042k457k667j971j104n80n76j103j979
53582D37493k842l270k981k008q55k46m87j100j376j220j160j516j945j961j538
53567D12988r96n51k74k95o41r17n65L77J085P83k61r07l48J018K037K011J282
53550D15826P31Q26J248J355R67O05R05J832K687K932K760K638K630K527K547
53535D43016L256M673N965O392O206O277O967P876Q580R146R765J0274J0429J0495
53521E49317J1117J2538J4184J5263J5645J5884J6468J7355J8256J9055J9788
53510G24870K0438K1024K1698K2550K3439K4202K4861K5393K5523K5056K4252
$$ plain form
53612 395395 400781 406287 412088 417735 422482 426021 428625 430777 432889 435175 437424 439049 439685 439741 440062
53597 440062 441134 442896 445177 447780 450061 450972 449930 447473 444806 442835 441731 441151 440575 439472 437493
53582 437493 434651 431381 428400 426392 425537 425291 424804 423704 422328 421108 419948 418432 416487 414526 412988
53567 412988 411992 411441 411167 410872 410231 409314 408749 409126 410211 410994 410733 409826 409478 410496 412533 414544 415826
53550 415826 416557 417383 418631 419986 420953 421558 422463 424295 426982 429914 432674 435312 437942 440469 443016
53535 443016 446272 450945 456910 463302 469508 475785 482752 490628 499208 508354 518119 528393 538822 549317
53521 549317 560434 572972 587156 602419 618064 633948 650416 667771 686027 705082 724870
53510 724870 745308 766332 788030 810580 834019 858221 883082 908475 933998 959054 983306
53499I83306K3459K2604K1420K0048J8901J8122J7591J7464J7953J8644J8664
53488A198176J7813J6838J6402J6384J6441J6627J7035J7424J7679J8070J8561
53477A387450J8380J6973J4888J3068J1592R877P799N760L778J424j282l712n645
53464A480350p627j0018j2177j3168j2910j2297j2243j2908j3806j4482j4979
53453A343735j5692j6769j7913j8792j9350j9469j8805j7383j6023j5597j5915
53442A152027j5995j5256j3869j2047r781p387n492m224l064j773q03l98K9J061
53428A063028K374L325L930M631N440O097O838Q210J0107J1737J2731J3666J5234
53415A167348J7345J9308K0630K1371K1978K2966K4587K6605K8564L0329L2092
$$ plain form
53499 983306 1006765 1029369 1050789 1070837 1089738 1107860 1125451 1142915 1160868 1179512 1198176
53488 1198176 1215989 1232827 1249229 1265613 1282054 1298681 1315716 1333140 1350819 1368889 1387450
53477 1387450 1405830 1422803 1437691 1450759 1462351 1472228 1480027 1485787 1489565 1490989 1489707 1485995 1480350
53464 1480350 1472723 1462705 1450528 1437360 1424450 1412153 1399910 1387002 1373196 1358714 1343735
53453 1343735 1328043 1311274 1293361 1274569 1255219 1235750 1216945 1199562 1183539 1167942 1152027
53442 1152027 1136032 1120776 1106907 1094860 1085079 1077692 1072200 1067976 1064912 1063139 1062336 1061938 1061967 1063028
53428 1063028 1065402 1068727 1072657 1077288 1082728 1088825 1095663 1103873 1113980 1125717 1138448 1152114 1167348
53415 1167348 1184693 1204001 1224631 1246002 1267980 1290946 1315533 1342138 1370702 1401031 1433123
53404A433123L3763L4798L4945L4932L5880L8044M0614M2855M4971M7446M9926
53393A871297N1388N1522N1317N1892N3134N3958N3719N2823N1914N1059M9909
53382B443932M8274M6154M3554M0610L7707L5075L2368K8966K4671J9816J4833
53371B815960R974N361R09l793r069j4599j9663k4117k8675l3908l9303m3720
53359B615357m6539m8017m8705m8990m9143m9314m9297m8618m7031m4785m2321
53348B092597l9983l8010l6566l5574l4841l4469l4789l5705l6385l5948l4283
53337A696044l1905k9277k6606k4079k1829j9699j7503j5391j3621j2072j0556
53326A473506r553r884j1547j3498j4902j5853j6585j6743j6104j5302j4938j4441
$$ plain form
53404 1433123 1466886 1501684 1536629 1571561 1607441 1645485 1686099 1728954 1773925 1821371 1871297
53393 1871297 1922685 1974207 2025524 2077416 2130550 2184508 2238227 2291050 2342964 2394023 2443932
53382 2443932 2492206 2538360 2581914 2622524 2660231 2695306 2727674 2756640 2781311 2801127 2815960
53371 2815960 2825934 2831295 2832204 2828411 2819342 2804743 2785080 2760963 2732288 2698380 2659077 2615357
53359 2615357 2568818 2520801 2472096 2423106 2373963 2324649 2275352 2226734 2179703 2134918 2092597
53348 2092597 2052614 2014604 1978038 1942464 1907623 1873154 1838365 1802660 1766275 1730327 1696044
53337 1696044 1664139 1634862 1608256 1584177 1562348 1542649 1525146 1509755 1496134 1484062 1473506
53326 1473506 1463953 1454069 1442522 1429024 1414122 1398269 1381684 1364941 1348837 1333535 1318597 1304156
53314A304156j2888j0695r276q979q524o925m885l560k818j685LJ491K441L371
53300A241227M666O048P311Q852J0955J3152J4845J6225J7973K0214K2354K3857
53288A407679K4689K4918K4422K3245K1827K0580J9434J8069J6383J4489J2430
53277A628165J0176P762N202K361p96l972o813r382j2023j4793j7357j9398k0853
53264A548279k1767k2277k2720k3379k4117k4627k5051k5792k6710k7123k6877
53253A277839k6662k6897k6953k6114k4750k3777k3297k2669k1742k1166k1334
53242A012478k1808k1946k1536k0597j9145j7536j6441j6066j5781j4932j3746
53231H12944j2934j2518j1687r872p568n827n188n445o306p767r677j1363j2234
$$ plain form
53314 1304156 1291268 1280573 1271297 1262318 1253794 1246869 1241984 1238424 1235606 1233921 1233924 1235415 1237856 1241227
53300 1241227 1245893 1251941 1259252 1268104 1279059 1292211 1307056 1323281 1341254 1361468 1383822 1407679
53288 1407679 1432368 1457286 1481708 1504953 1526780 1547360 1566794 1584863 1601246 1615735 1628165
53277 1628165 1638341 1646103 1651305 1653666 1652870 1648898 1642085 1632703 1620680 1605887 1588530 1569132 1548279
53264 1548279 1526512 1504235 1481515 1458136 1434019 1409392 1384341 1358549 1331839 1304716 1277839
53253 1277839 1251177 1224280 1197327 1171213 1146463 1122686 1099389 1076720 1054978 1033812 1012478
53242 1012478 990670 968724 947188 926591 907446 889910 873469 857403 841622 826690 812944
53231 812944 800010 787492 775805 765933 758365 752538 747350 741905 735599 727832 718155 706792 694558
53218F94558j2641j3516j5085j6485j6895j6536j6087j5624j4731j3370j1985
53207E31603j0876j0016r411r091q813q326p868p851q124q191q107q397r003r141
53193D08388q505p855p884q170p873p018o395o378o488o124n219m150l295k747
53179C20287k344j915j537j460j741k185k627l010l174k890k208j462q26k58R8
53164B92748j21q64j538j748j728j753j592r16O9Q33J043O96Mn16l73J99L41j74
53146B84610m71J21Q75O33m72j279j279j047j026r39o05m15n60n39Q0R73J540
53129B80200J661J544J269Q69O10P50J170J574J872K168K420K409J964J155L58
53114C01993Q8N63J337J638J145K70m19p74r64j122j248j345j392j352j306j451
$$ plain form
53218 694558 681917 668401 653316 636831 619936 603400 587313 571689 556958 543588 531603
53207 531603 520727 510711 501300 492209 483396 475070 467202 459351 451227 443036 434929 426532 417529 408388
53193 408388 399883 392028 384144 375974 368101 361083 354688 348310 341822 335698 330479 326329 323034 320287
53179 320287 317943 316028 314491 313031 311290 309105 306478 303468 300294 297404 295196 293734 292908 292650 292748
53164 292748 292627 291763 290225 288477 286749 284996 283404 282488 282557 283390 284433 285129 285133 284617 284244 284443 284784 284610
53146 284610 284139 284260 285135 285768 285296 284017 282738 281691 280665 279726 279121 278706 278146 277607 277687 278660 280200
53129 280200 281861 283405 284674 285543 286153 286903 288073 289647 291519 293687 296107 298516 300480 301635 301993
53114 301993 302081 302644 303981 305619 306764 307034 306615 305841 304877 303755 302507 301162 299770 298418 297112 295661
53098B95661j830k214k311k026j474r18o28o26o04l49k17o94j542j898j418p79
53082B76133o77q18m47M74J183J103L53o15j362j488q77m1K42j75o57o80m25k64
53064B70962j33J65M05K35j12o7L13K14q53k230k772k100q75L7L78M79P30J189
53046B65965J559J512J054N61L58L78L58K55K17K55J88Jp6J03L52L48j8n40q24
53027B72006n80P0N92N90K47J8ok8M6N10J159J355J013Q87J403J843J368L55p2
53008B82776L90R46R41O00M07M42N83P81Q33L45o63j444j175J23J545K056J299
52991B90785j51j146q80M12J684K103J715J127Q58J003J330J539J544J604J990
52976C05517K515K641K078J088J51m29n44k38K47N53N04K34nJ1M02R56J131N86
$$ plain form
53098 295661 293831 291617 289306 287280 285806 284888 284260 283634 283030 282681 282464 281770 280228 278330 276912 276133
53082 276133 275456 274638 274191 274665 275848 276951 277304 276689 275327 273839 272962 272921 273163 272988 272331 271651 271226 270962
53064 270962 270829 270994 271399 271634 271522 271455 271768 271982 271129 268899 266127 264027 263152 263189 263567 264046 264776 265965
53046 265965 267524 269036 270090 270651 271009 271387 271745 272000 272217 272472 272660 272661 272585 272688 273040 273388 273370 272830 272006
53027 272006 271426 271496 272088 272678 272925 272943 272937 272909 272955 273465 274624 275979 276992 277879 279282 281125 282493 282848 282776
53008 282776 283166 284112 285053 285653 286060 286502 287085 287866 288699 289044 288381 286937 285762 285885 287430 289486 290785
52991 290785 290634 289488 288608 289020 290704 292807 294522 295649 296507 297510 298840 300379 301923 303527 305517
52976 305517 308032 310673 312751 313839 313990 313561 313017 312779 313026 313579 314083 314317 314312 314323 314725 315681 316812 317398
52958C17398k14m22P1L83k54j540k529k699k330j982j881j801j414p98n07q56
52942B98625j310j068k86j0p22j572j497n75L10O63O78N59L01k0k41m02n73n31
52924B92329q7L99L91J1j6O73J613K110J898J147K41l32l22l2K2k00l29l58p19
52905B98439j413j734j264o45p89j620k179j812p45M39J379J916J926J408N97
52890B93903j17l29J13Q11R94L10o15q30k34L09R7n95j012p90k1J119K351L092
52872B98556K884K027J407J518J965K088J792J562J781K264K507K257J778J488
52858C25874J381R77n3j413k641l682m658n210m856l967l583l931l932k783j372
52843B86151j164k169k960k623j641q72o41r75j813k513k121o70N29N63J33L67
$$ plain form
52958 317398 317184 316762 316833 317216 316962 315422 312893 310194 307864 305882 304001 302200 300786 299988 299481 298625
52942 298625 297315 296247 295961 295951 295229 293657 292160 291585 291895 292558 293236 293795 294096 294076 293835 293433 292860 292329
52924 292329 292242 292641 293032 293043 293027 293700 295313 297423 299321 300468 300709 300377 300055 300023 300045 299845 299516 299158 298439
52905 298439 297026 295292 294028 293383 292594 290974 288795 286983 286238 286677 288056 289972 291898 293306 293903
52890 293903 293786 293457 293570 294381 295375 295685 295070 294240 294006 294315 294412 293817 292805 292015 291994 293113 295464 298556
52872 298556 301440 303467 304874 306392 308357 310445 312237 313799 315580 317844 320351 322608 324386 325874
52858 325874 327255 328232 328179 326766 324125 320443 315785 310575 305719 301752 298169 294238 290306 287523 286151
52843 286151 284987 282818 279858 277235 275594 274722 274081 273106 271293 268780 266659 265989 266518 267081 267214 267581
52827B67581J127J417J052O96N64K24k56j79M30N33k50p42R7J392J448K34n55
52810B74813L0R18P76k0j83L67L45q71k200k319j389o31o54j048j412j862k324
52793B62336k216j270j80K08m2k11k5J44P3J1J45J85j55o76r20o64OQ81J699K154
52773B61483K082J577Q24o3r09j327r44J10J156J510J081L58j52l54l93l08p0
52756B65661J59J17j04j04K67O51P81R28J403J934J981J568J245J272J319J056
52740B80134N97K65K66O67J345J852J800J458J481J873J819Q62k65o17l53l88
52724B92796r99j501j357q34m21j76mp9o27j434k017k088j669q89J3O07N24j43
52706B79702q59j133q43j98N09J002J098Q24M46L31O81J338J825J703R66Q8m15
$$ plain form
52827 267581 268708 270125 271177 271873 272437 272661 272405 272226 272656 273189 272939 272197 272294 273686 275134 275368 274813
52810 274813 274843 275761 276537 276517 276334 276701 277046 276175 273975 271656 270267 269636 268982 267934 266522 264660 262336
52793 262336 260120 258850 258670 258878 258836 258625 258600 258744 258817 258828 258973 259158 259003 258327 257407 256743 256749 257630 259329 261483
52773 261483 263565 265142 265966 265903 264994 263667 262723 262833 263989 265499 266580 266938 266786 266432 266039 265731 265661
52756 265661 265820 265937 265833 265729 265996 266647 267428 268356 269759 271693 273674 275242 276487 277759 279078 280134
52740 280134 280731 280996 281262 281929 283274 285126 286926 288384 289865 291738 293557 294419 294154 293537 293184 292796
52724 292796 291797 290296 288939 288105 287684 287508 287504 287425 286798 285364 283347 281259 279590 278701 278714 279321 279845 279702
52706 279702 278843 277710 276867 276669 277178 278180 279278 280102 280548 280879 281560 282898 284723 286426 287392 287480 287065
52689B87065m36k29j4K35N89R56J113R07L77k54p19q86q37o73l75N2L57K76n7
52670B87447k45j87j60k09Q8Q65J408R15l26j132q23J41R78J441J675J728J635
52653B95239J657J981K330K263J741J127O67K37l56j101j749k031j855j402q72
52638B97876k50N11J133J203Q41O71J004J427J586J820K485L108K895J923J087
52623C19320R36J145J168P99j0j256k544l147k726j720q33m55o33j140j475j146
52607C06283k15P82J507J983K050J303n0r64p45k5R9m44p89n40k18k69l37R6Q14
52588C10321J119P33J28o8K87Q25J163J263J344J511J611J443J022O02M59O42
52572C24405Q68P65K53l29p18j116j805k478k448j641q44p27j045j144r06p12
$$ plain form
52689 287065 286629 286400 286386 286621 287210 288166 289279 290186 290563 290309 289590 288704 287867 287194 286819 286871 287228 287504 287447
52670 287447 287202 287015 286855 286646 286734 287599 289007 289922 289596 288464 287641 287782 288760 290201 291876 293604 295239
52653 295239 296896 298877 301207 303470 305211 306338 307005 307242 306886 305785 304036 302005 300150 298748 297876
52638 297876 297626 298137 299270 300473 301314 301985 302989 304416 306002 307822 310307 313415 316310 318233 319320
52623 319320 320256 321401 322569 323368 323358 322102 319558 316411 313685 311965 311132 310677 310044 308904 307429 306283
52607 306283 306068 306850 308357 310340 312390 313693 313643 312679 311934 311909 312008 311564 310775 310235 310017 309748 309411 309507 310321
52588 310321 311440 312173 312301 312233 312520 313345 314508 315771 317115 318626 320237 321680 322702 323304 323763 324405
52572 324405 325273 326038 326291 325962 325244 324128 322323 319845 317397 315756 314912 314185 313140 311996 311090 310378
52556C10378p68r56j206j521j689j393o87JL40L78L20L11M10N45N43L35J43J71
52538C05655L32M50O26J012J391J399J106R21R35Q12M56K28L73O10O37O62J046
52521C18651J667K008J806J307Q96P83R76J390J808J959J789J631J997K983L969
52506C45620M106L161J716M14o52j644k392k680k845l473m434m836m160k972k138
52491C22791j811j603j406j446j713j832j580j102o04r9L68N92M48J51P3L76Q80
52474C12483J269J382J343J394J621J838J813J576J433J687K362L143L582L428
52460C40354K841K266J977J776J210Q4j250k200k513k548k851l506m055m110l851
52445C23624l703l695l464k857k113j432p60j56M8k00l00L24J351J838J398O18
$$ plain form
52556 310378 309610 308654 307448 305927 304238 302845 302158 302159 302499 302877 303197 303508 303918 304463 305006 305341 305484 305655
52538 305655 305987 306437 307063 308075 309466 310865 311971 312892 313827 314639 315095 315323 315696 316306 316943 317605 318651
52521 318651 320318 322326 324132 325439 326335 327118 328094 329484 331292 333251 335040 336671 338668 341651 345620
52506 345620 349726 352887 354603 355017 354365 352721 350329 347649 344804 341331 336897 332061 327901 324929 322791
52491 322791 320980 319377 317971 316525 314812 312980 311400 310298 309694 309595 309963 310555 311003 311154 311227 311603 312483
52474 312483 313752 315134 316477 317871 319492 321330 323143 324719 326152 327839 330201 333344 336926 340354
52460 340354 343195 345461 347438 349214 350424 350508 349258 347058 344545 341997 339146 335640 331585 327475 323624
52445 323624 319921 316226 312762 309905 307792 306360 305600 305444 305492 305292 304992 305316 306667 308505 309903 310521
52429C10521K24K12R2l18o65o13j91L87J012J616J970J849J374J001J066J473
52413C21010J917K293K665L017L329L822M818O227P522Q375R017R711J0107R502
52399D03332P610M779J421k268n937q774r935r345p823o417n548m857l853k605
52385C49780j682j394j348r33j00P01J231J774K579L419L919M120M360M712M904
52370C76042M833M729M752M662M201L498K844K214J351L37l81n92n97o99p50n41
52354D05903l18m57p56n23M68J625K266K351K229K010J627J312J519K323L255
52339D24834L972M708N861P331Q639R570J0340J1029J1344J1245J1461J2776J4917
52326E48027J6740J7617J8080J8839J9793K0468K0937K1589K2272K2438K2029
$$ plain form
52429 310521 310745 310957 311049 310731 310066 309453 309262 309649 310661 312277 314247 316096 317470 318471 319537 321010
52413 321010 322927 325220 327885 330902 334231 338053 342871 349098 356620 364995 374012 383723 393830 403332
52399 403332 410942 415721 417142 414874 408937 400163 390228 380883 373060 366643 361095 356238 352385 349780
52385 349780 348098 346704 345356 344423 344323 345024 346255 348029 350608 354027 357946 362066 366426 371138 376042
52370 376042 380875 385604 390356 395018 399219 402717 405561 407775 409126 409463 409082 408490 407893 407194 406444 405903
52354 405903 405585 405128 404372 403849 404317 405942 408208 410559 412788 414798 416425 417737 419256 421579 424834
52339 424834 428806 433514 439375 446706 455345 464915 475255 486284 497628 508873 520334 533110 548027
52326 548027 564767 582384 600464 619303 639096 659564 680501 702090 724362 746800 768829
52315G68829K1577K1433K1584K2163K3351K4652K5136K4732K4453K4860K5118
52304A027888K4290K2859K2108K2336K2568K1878K0179J7827J5157J2563J0375
52293A240028Q446O243L418Q7l369o430q566r737j0594j1676j2515j2195j0696
52280A172444r030q017p543p080o279m868k707k16J818L258M871P230R842J1783
52266A165506J2788J3326J3916J4759J5781J6708J7246J7443J7631J7955J8244
52255A341303J8406J8546J8527J7939J6785J5597J4543J2907R998O118K173j328
52243A491514m392p091r524j1947j4362j6187j6937j7026j7370j8298j9374k0075
52231A318931k0185j9687j8877j8326j8228j7906j6671j4877j3437j2484j1368
$$ plain form
52315 768829 790406 811839 833423 855586 878937 903589 928725 953457 977910 1002770 1027888
52304 1027888 1052178 1075037 1097145 1119481 1142049 1163927 1184106 1201933 1217090 1229653 1240028
52293 1240028 1248474 1254717 1258135 1258222 1254853 1248423 1239857 1230120 1219526 1207850 1195335 1183140 1172444
52280 1172444 1163414 1155397 1147854 1140774 1134495 1129627 1126920 1126704 1128522 1131780 1136651 1143881 1153723 1165506
52266 1165506 1178294 1191620 1205536 1220295 1236076 1252784 1270030 1287473 1305104 1323059 1341303
52255 1341303 1359709 1378255 1396782 1414721 1431506 1447103 1461646 1474553 1484551 1490669 1492842 1491514
52243 1491514 1487122 1480031 1470507 1458560 1444198 1428011 1411074 1394048 1376678 1358380 1339006 1318931
52231 1318931 1298746 1279059 1260182 1241856 1223628 1205722 1189051 1174174 1160737 1148253 1136885
52220A136885r953q814q012o740m720k997k610l065k979j796j34J369K712L988
52206A093134M883N015M454L610K889K562K840L786N066O024O203N860N721O166
52192A158213O815P066O762O082N102L896K850K259J702M78j394l283n097p404
52178A184047j0096j1842j1608j0118q998q820q745p917o344m510k830j669j188
52165A089362j017m77N92J706K515L268M231N109N392N051M450L797L009K047
52151A129035J031L5q99j484j200J23J917L275L845M069M497M993M892L943K736
52136A160808K086K172K621L243M315O054Q239J0591J3199J6202J9230K1657K3454
52123A293871K5290K7541K9722L1275L2520L4101L5677L6100L5031L3589L2860
$$ plain form
52220 1136885 1126932 1118118 1110106 1103366 1098646 1095649 1093039 1089974 1086995 1085199 1085065 1086434 1089146 1093134
52206 1093134 1098017 1103032 1107486 1111096 1113985 1116547 1119387 1123173 1128239 1134263 1140466 1146326 1152047 1158213
52192 1158213 1165028 1172094 1178856 1184938 1190040 1193936 1196786 1199045 1200747 1201225 1199831 1196548 1191451 1184047
52178 1184047 1173951 1162109 1150501 1140383 1131385 1122565 1113820 1105903 1099559 1095049 1092219 1090550 1089362
52165 1089362 1088345 1087868 1088460 1090166 1092681 1095949 1100180 1105289 1110681 1115732 1120182 1123979 1126988 1129035
52151 1129035 1130066 1130101 1129202 1127718 1126518 1126641 1128558 1131833 1135678 1139747 1144244 1149237 1154129 1158072 1160808
52136 1160808 1162894 1165066 1167687 1170930 1175245 1181299 1189538 1200129 1213328 1229530 1248760 1270417 1293871
52123 1293871 1319161 1346702 1376424 1407699 1440219 1474320 1509997 1546097 1581128 1614717 1647577
52112A647577L2450L1207K8935K6478K4342K2173J9677J7234J5292J3735J2221
52101A891321J0621Q903P035N242L816K377j05m097q745j2770j5755j8138k0388
$$ plain form
52112 1647577 1680027 1711234 1740169 1766647 1790989 1813162 1832839 1850073 1865365 1879100 1891321
52101 1891321 1901942 1910845 1917880 1923122 1926938 1929315 1929210 1925113 1916368 1903598 1887843 1869705 1849317
$$ [...]
##END NTUPLES=NMR SPECTRUM
##END=
