##TITLE=AC1702_ROEFFECT0027_8637201_Sj94R7fawi
##JCAMPDX= 6.0         $$ Bruker NMR JCAMP-DX V2.0
##DATA TYPE= NMR SPECTRUM
##DATA CLASS= NTUPLES
##ORIGIN= BRUKER
##OWNER= Administrator
$$ 1.72 TOPSPIN		Version 2.1
$$ 2014-05-22 15:55:13.526 -0700  Administrator@X
$$ Compression mode = diff/dup
##.OBSERVE FREQUENCY= 400.02188249412
##.OBSERVE NUCLEUS= ^1H
##.ACQUISITION MODE= SIMULTANEOUS (DQD)
##.ACQUISITION SCHEME= undefined
##.AVERAGES= 64
##.DIGITISER RES= 22
##SPECTROMETER/DATA SYSTEM= spect
##.PULSE SEQUENCE= noesygpps1d.comp
##.SOLVENT NAME= COFFEE_meoh
##.SHIFT REFERENCE= INTERNAL, COFFEE_meoh, 1, 14.96112
##AUDIT TRAIL= $$ (NUMBER, WHEN, WHO, WHERE, PROCESS, VERSION, WHAT)
$$ ##TITLE= Audit trail, TOPSPIN		Version 2.1
$$ ##JCAMPDX= 5.01
$$ ##ORIGIN= Bruker BioSpin GmbH
$$ ##OWNER= Administrator
$$ $$ E:\/data/COFFEE/nmr/AC1702_ROEFFECT0027_8637201_Sj94R7fawi/12/pdata/1/auditp.txt
$$ ##AUDIT TRAIL=  $$ (NUMBER, WHEN, WHO, WHERE, PROCESS, VERSION, WHAT)
(   1,<2014-05-22 15:55:08.370 -0700>,<Administrator>,<X>,<go>,<TOPSPIN 2.1>,
      <created by zg
	started at 2014-05-22 15:43:38.520 -0700,
	POWCHK enabled, PULCHK disabled,
       configuration hash MD5:
       C8 4E 4E 5D D3 5C D8 9E 9F 52 82 E0 59 8A DE 15
       data hash MD5: 64K
       17 1D 12 7C 34 46 B6 E1 A0 81 DC D6 77 70 BE 05>)
(   2,<2014-05-22 15:55:11.401 -0700>,<Administrator>,<X>,<proc1d>,<TOPSPIN 2.1>,
      <Start of raw data processing
       efp LB = 0.3 FT_mod = 6 PKNL = 1 PHC0 = 0 PHC1 = 0 SI = 128K 
       data hash MD5: 128K
       DB 15 08 F4 E4 E4 65 73 BF D1 81 BC F2 51 78 B8>)
(   3,<2014-05-22 15:55:12.323 -0700>,<Administrator>,<X>,<proc1d>,<TOPSPIN 2.1>,
      <pk PHC0 = -82.6062 PHC1 = 0 
       data hash MD5: 128K
       F0 E1 06 F1 DF FB 53 F6 1B 80 B9 AB 75 DF 98 7C>)
(   4,<2014-05-22 15:55:12.839 -0700>,<Administrator>,<X>,<proc1d>,<TOPSPIN 2.1>,
      <abs ABSG = 1 
       data hash MD5: 128K
       4E 20 39 77 15 A2 9B 44 79 E3 55 B1 54 37 02 01>)
(   5,<2014-05-22 15:55:12.979 -0700>,<Administrator>,<X>,<proc1d>,<TOPSPIN 2.1>,
      <abs ABSG = 2 
       data hash MD5: 128K
       1E 58 2F 9D 72 66 62 95 0C 13 BC 60 FE CA D3 DC>)
(   6,<2014-05-22 15:55:13.089 -0700>,<Administrator>,<X>,<proc1d>,<TOPSPIN 2.1>,
      <abs ABSG = 3 
       data hash MD5: 128K
       37 D9 BB ED 0E 83 49 AD E3 F2 D8 C4 50 0B 06 5E>)
(   7,<2014-05-22 15:55:13.183 -0700>,<Administrator>,<X>,<proc1d>,<TOPSPIN 2.1>,
      <abs ABSG = 4 
       data hash MD5: 128K
       08 51 C6 F8 CA 7B B3 7F F2 A7 C0 D8 54 E9 8B 09>)
(   8,<2014-05-22 15:55:13.292 -0700>,<Administrator>,<X>,<proc1d>,<TOPSPIN 2.1>,
      <abs ABSG = 5 
       data hash MD5: 128K
       BC 04 43 B7 9D 2E D4 B4 8C A5 43 B0 37 2C F4 26>)
$$ ##END=
$$ 
$$ $$ hash MD5
$$ $$ 0A A8 72 C3 B6 92 28 75 EE DF CA BC 66 B6 6B 1E
##$RELAX= 
##$RELAX= 
##$RELAX= 
##$RELAX= 
##$RELAX= 
##$RELAX= 
##$RELAX= 
##$RELAX= 
$$ Bruker specific parameters
$$ --------------------------
##$DU= <E:\>
##$EXPNO= 12
$$ [...]
150 150 150 150 150 150 150 150
##$TP07= 0
##$TPNAME0= <>
##$TPNAME1= <>
##$TPNAME2= <>
##$TPNAME3= <>
##$TPNAME4= <>
##$TPNAME5= <>
##$TPNAME6= <>
##$TPNAME7= <>
##$TPOAL= (0..7)
0.5 0.5 0.5 0.5 0.5 0.5 0.5 0.5
##$TPOFFS= (0..7)
0 0 0 0 0 0 0 0
##$TUNHIN= 0
##$TUNHOUT= 0
##$TUNXOUT= 0
##$USERA1= <user>
##$USERA2= <user>
##$USERA3= <user>
##$USERA4= <user>
##$USERA5= <user>
##$V9= 5
##$VALIST= <valist>
##$VCLIST= <CCCCCCCCCCCCCCC>
##$VD= 0
##$VDLIST= <DDDDDDDDDDDDDDD>
##$VPLIST= <PPPPPPPPPPPPPPP>
##$VTLIST= <TTTTTTTTTTTTTTT>
##$WBST= 1024
##$WBSW= 4
##$XGAIN= (0..3)
0 0 0 0
##$XL= 0
##$YL= 0
##$YMAX_a= 5950199
##$YMIN_a= -13628107
##$ZGOPTNS= <>
##$ZL1= 120
##$ZL2= 120
##$ZL3= 120
##$ZL4= 120
##$ABSF1= 14.96112
##$ABSF2= -5.597062
##$ABSG= 5
##$ABSL= 3
##$ALPHA= 0
##$AQORDER= 0
##$ASSFAC= 0
##$ASSFACI= 0
##$ASSFACX= 0
##$ASSWID= 0
##$AUNMP= <proc_prof1d_extract.lims>
##$AXLEFT= 0
##$AXNAME= <>
##$AXNUC= <1H>
##$AXRIGHT= 0
##$AXTYPE= 0
##$AXUNIT= <>
##$AZFE= 0.1
##$AZFW= 0.1
##$BCFW= 0
##$BC_mod= 0
##$BYTORDP= 0
##$COROFFS= 0
##$CY= 15
##$DATMOD= 1
##$DC= 0
##$DFILT= <>
##$DTYPP= 0
##$F1P= 0
##$F2P= 0
##$FCOR= 0.5
##$FTSIZE= 131072
##$FT_mod= 6
##$GAMMA= 0
##$GB= 0
##$INTBC= 1
##$INTSCL= 1
##$ISEN= 128
##$LB= 0.3
##$LEV0= 0
##$LPBIN= 0
##$MAXI= 10000
##$MC2= 0
##$MEAN= 0
##$ME_mod= 0
##$MI= 0
##$NCOEF= 0
##$NC_proc= -2
##$NLEV= 6
##$NOISF1= 0
##$NOISF2= 0
##$NSP= 0
##$NTH_PI= 0
##$NZP= 0
##$OFFSET= 14.96112
##$PC= 1
##$PHC0= -82.6062
##$PHC1= 0
##$PH_mod= 1
##$PKNL= yes
##$PPARMOD= 0
##$PPDIAG= 0
##$PPIPTYP= 0
##$PPMPNUM= 2147483647
##$PPRESOL= 1
##$PSCAL= 4
##$PSIGN= 0
##$PYNMP= <proc.py>
##$REVERSE= no
##$SF= 400.020009587717
##$SI= 131072
##$SIGF1= 0
##$SIGF2= 0
##$SINO= 400
##$SIOLD= 131072
##$SPECTYP= <>
##$SREGLST= <1H.CDCl3>
##$SSB= 0
##$STSI= 131072
##$STSR= 0
##$SW_p= 8223.68421052631
##$SYMM= 0
##$S_DEV= 0
##$TDeff= 65536
##$TDoff= 0
##$TI= <>
##$TILT= no
##$TM1= 0
##$TM2= 0
##$TOPLEV= 0
##$USERP1= <user>
##$USERP2= <user>
##$USERP3= <user>
##$USERP4= <user>
##$USERP5= <user>
##$WDW= 1
##$XDIM= 131072
##$YMAX_p= 486794953
##$YMIN_p= -13219
##$CURPLOT= <Network HP LaserJet P1505>
##$CURPRIN= <$Network HP LaserJet P1505>
##$DFORMAT= <normdp>
##$LAYOUT= <+/1D_H.xwp>
##$LFORMAT= <normlp>
##$PFORMAT= <normpl>
##$SURQMSG= 1
$$ End of Bruker specific parameters
$$ ---------------------------------
##NTUPLES= NMR SPECTRUM
##VAR_NAME=  FREQUENCY,     SPECTRUM/REAL,   SPECTRUM/IMAG
##SYMBOL=    X,             R,               I
##VAR_TYPE=  INDEPENDENT,   DEPENDENT,       DEPENDENT
##VAR_FORM=  AFFN,          ASDF,            ASDF
##VAR_DIM=   131072,        131072,          131072
##UNITS=     HZ,            ARBITRARY UNITS, ARBITRARY UNITS
##FACTOR=    0.0627417313425164, 1,          1
##FIRST=     8223.62146879497, -1923,        -64046
##LAST=      0,             1000,            -65283
##MIN=       0,             -13219,          0
##MAX=       8223.62146879497, 486794953,    0
$$ Real data points
##PAGE= N=1
##DATA TABLE= (X++(R..R)), XYDATA
$$ [...]
61528D38336K047J647J161P44j92j504k176k016k006k549k968k936k808k333p80
61513D21667J296K232J605P81P24R60J091J494K068K028J514J654K525K830K300
61498D46769K424M001N706O154N718N291M796M080L855M495M972M168K371O31
61484E05431n37j039p56L3N86P09J068K120L604N319P321Q985R082P272M555J904
61468E55657m64k334l336l812m573n487n610n007m931n799o515o333n878n673
61454D89905n115l697j959n22O94J654J873J509J537K282K918K943K882L065L057
61439E03026K812K973L554L724L397L444L741K818L56j674j574k12M45j12r75
61424E25743j315p50P98K573L242K609K069K648L552L573K848K193J645P74k59
$$ plain form
61528 438336 440383 442030 443191 443935 443743 442239 440063 438047 436041 433492 430524 427588 424780 422447 421667
61513 421667 422963 425195 426800 427581 428305 429265 430356 431850 433918 435946 437460 439114 441639 444469 446769
61498 446769 449193 453194 458900 465054 470772 476063 480859 484939 488794 493289 498261 502429 504800 505431
61484 505431 504894 503855 503099 503132 503718 504427 505495 507615 511219 516538 523859 532844 541926 549198 553753 555657
61468 555657 555193 552859 549523 545711 541138 535651 530041 525034 520103 514304 507789 501456 495578 489905
61454 489905 484790 481093 479134 478612 479306 480960 482833 484342 485879 488161 491079 494022 496904 499969 503026
61439 503026 505838 508811 512365 516089 519486 522930 526671 529489 529845 528171 526597 526385 526830 526718 525743
61424 525743 524428 523678 524476 527049 530291 532900 534969 537617 541169 544742 547590 549783 551428 552202 551943
61409E51943r73j350j687k140k763l443l573k686j411p51l63Q90K614K963J523
61394E38793J90K53N64j79j097p12N47J183J016J037J478J596J075M31J77M41
61378E46793J182K137K884L373L859M099L433K001R30Q11R63O68J23m30j370k743
61362E68713l698l703l448l713m101l683k302n39J054K246L146M239N832P407
61348E67450Q220Q458Q797Q991Q096O065L829J863J51o62K18J976K877K781K997
61333F32107L490K659L70j298j261r43j477j823j111n32j161j895j419m15K8N16
61317F25835J849L088L132K933L962N685O658P164Q497J0473J1775J2339J3328
61304G16718J5046J6633J7707J8577J8895J7558J4074R008L231k414o978r963
$$ plain form
61409 551943 550970 549620 547933 545793 543030 539587 536014 533328 531917 531166 530803 531693 534307 537270 538793
61394 538793 538983 539236 539800 539621 538524 537812 538359 539542 540558 541595 543073 544669 545744 546175 546352 546793
61378 546793 547975 550112 552996 556369 560228 564327 567760 569761 570691 571502 572465 573133 573256 572826 571456 568713
61362 568713 565015 561312 557864 554151 550050 546367 544065 543526 544580 546826 549972 554211 560043 567450
61348 567450 575670 584128 592925 601916 610012 616077 619906 621769 621920 621258 621476 623452 626329 629110 632107
61333 632107 635597 638256 638626 637328 636067 635124 633647 631824 630713 630181 629020 627125 625706 625291 625319 625835
61317 625835 627684 630772 633904 636837 640799 646484 653142 660306 668803 679276 691051 703390 716718
61304 716718 731764 748397 766104 784681 803576 821134 835208 844216 847447 845033 838055 828092
61292H28092j1808j3238j4443j5374j6065j6082j4553j1568q720p431p433p549
61280F83828p117n958m100k228j391j488j106M54K279L569M740N927O132N069
61266F88610M171M316M185K529O51P21K768N240P519R950J2114J2937J2164J0317
61252G78192P685M580J828j30j887l601m068k567n65N5n90j279j932l140m367
61237G68214m494l651k832k246j570j173j494j800j033O15K366M287O588Q353
61223G70130Q694Q388Q699R232Q719P284O095N423M729M225M487M960M674M001
61209H59740L933M068L203J512K14n98j751k802k184K70K892M618O180Q491J1400
61194H99186J4449J7541K0403K2413K3245K2848K0792J6722J1368O125J733j740
$$ plain form
61292 828092 816284 803046 788603 773229 757164 741082 726529 714961 706241 698810 691377 683828
61280 683828 676711 670753 666653 664425 663034 661546 660440 660894 663173 666742 671482 677409 683541 688610
61266 688610 692781 697097 701282 703811 704462 705183 707951 713191 720710 730660 742774 755711 767875 778192
61252 778192 785877 790457 792285 792155 790268 786667 782599 780032 779467 779522 778932 777653 775721 772581 768214
61237 768214 763720 760069 757237 754991 753421 752248 750754 748954 747921 748536 750902 755189 761777 770130
61223 770130 778824 787212 795911 805143 813862 821146 827241 832664 837393 841618 846105 851065 855739 859740
61209 859740 863673 867741 870944 872456 872670 872072 870321 867519 865335 865605 868497 873115 879295 887786 899186
61194 899186 913635 931176 951579 973992 997237 1020085 1040877 1057599 1068967 1075092 1076825 1075085
61182A075085l971m653m420m320m497m528m777o137q530j0819j2253j2944j3091
61169I80145j2775j2357j2207j2121j1847j1763j2167j2450j1976j1288j1331
61158H47863j1937j2124j1418r902p547m608k050l96J192L586O300Q623J1049
61145H18631J3939J5652J4057R441M093n58m472p161p517n645l029o22J705L802
61131H52316N079N912P605J0482J3369J5357J6910J8870K1408K4247K6991K9219
61119A047765L0926L2759L5028L6910L7642L7971L9121M0771M1502M1036M0466
61108A461897M0314L9838L8458L6573L4652L2670L0574K8357K5487K1190J5355
61097A805365Q560J302n980j2536j7838k2156k5876k8725l0567l2211l4210l5545
$$ plain form
61182 1075085 1071114 1066461 1062041 1057721 1053224 1048696 1043919 1037782 1029252 1018433 1006180 993236 980145
61169 980145 967370 955013 942806 930685 918838 907075 894908 882458 870482 859194 847863
61158 847863 835926 823802 812384 802482 794935 790327 788277 787881 789073 792659 798959 807582 818631
61145 818631 832570 848222 862279 871720 875813 875255 870783 863622 856105 850460 847431 846809 848514 852316
61131 852316 857395 863307 870912 881394 894763 910120 927030 945900 967308 991555 1018546 1047765
61119 1047765 1078691 1111450 1146478 1183388 1221030 1259001 1298122 1338893 1380395 1421431 1461897
61108 1461897 1502211 1542049 1580507 1617080 1651732 1684402 1714976 1743333 1768820 1790010 1805365
61097 1805365 1813925 1815227 1809247 1796711 1778873 1756717 1730841 1702116 1671549 1639338 1605128 1569583
61085A569583l4930l2955l1450l1021l0701k9871k9033k8633k8381k7853k6790
61074A237965k4895k2355k0248j9432j9249j8423j6886j5510j4475j3231j1888
61063A041373j1179j1117j0889j0196r540r124q553p617o514n248l638j836j28
61050I45794J597L413M851N610O384Q058J0367J2272J3388J4162J4908J5487J5815
61037A072106J5985J6048J6127J6427J6790J6670J5851J4798J4055J3915J4538
61026A243310J5621J6089J5289J4373J5092J7349J9674K1967K5591L0457L4316
61015A469128L5624L5111L4081L3394L4497L8961M6301N4687O4131P6101Q9773
61004B011789J02088J12080J21785J32872J46767J68220K03027K51263L08529
$$ plain form
61085 1569583 1534653 1501698 1470248 1439227 1408526 1378655 1349622 1320989 1292608 1264755 1237965
61074 1237965 1213070 1190715 1170467 1151035 1131786 1113363 1096477 1080967 1066492 1053261 1041373
61063 1041373 1030194 1019077 1008188 997992 988452 979328 970775 963158 956644 951396 947758 945922 945794
61050 945794 947391 950804 955655 961265 967649 975707 986074 998346 1011734 1025896 1040804 1056291 1072106
61037 1072106 1088091 1104139 1120266 1136693 1153483 1170153 1186004 1200802 1214857 1228772 1243310
61026 1243310 1258931 1275020 1290309 1304682 1319774 1337123 1356797 1378764 1404355 1434812 1469128
61015 1469128 1504752 1539863 1573944 1607338 1641835 1680796 1727097 1781784 1845915 1922016 2011789
61004 2011789 2113877 2225957 2347742 2480614 2627381 2795601 2998628 3249891 3558420
60995C558420L74421M52783N43525O44813P65756R25154J135917J408288J768370
60986A1577447K227392K685821K892657K587404J743532O55409k58183p42778
60978B3368701p98677n38763n3746N41166J000302J012363M36468n43630j535469
60969B2888715k213281k486873k452089k246048j966503j674837j410360j185930
60961G252794r92588q21349o73742n51376m48705l61060k90222k37335j97778
60952B678639j67124j45282j30982j18669j04947r2569q4287p7803p0312o2929
60942A623735n6944n0518m2972l8023l8622m2221m4756m5805m6388m5310m1541
60931A130635l7196l4468l2230k8846k5584k4099k3142k0950j8398j6841j5276
$$ plain form
60995 3558420 3932841 4385624 4929149 5573962 6339718 7264872 8400789 9809077 11577447
60986 11577447 13804839 16490660 19383317 21970721 23714253 24369662 24111479 23368701
60978 23368701 22570024 22031261 21977515 22518681 23518983 24531346 24967814 24424184 22888715
60969 22888715 20675434 18188561 15736472 13490424 11523921 9849084 8438724 7252794
60961 7252794 6260206 5438857 4765115 4213739 3765034 3403974 3113752 2876417 2678639
60952 2678639 2511515 2366233 2235251 2116582 2011635 1919066 1834779 1756976 1686664 1623735
60942 1623735 1566791 1516273 1473301 1435278 1396656 1354435 1309679 1263874 1217486 1172176 1130635
60931 1130635 1093439 1058971 1026741 997895 972311 948212 925070 904120 885722 868881 853605
60920H53605j2622j0397j0102j0304r137p572p319p570o729n365m786m421l193
60907G54088j790j311j299j131j464k477k812k123k356m523o685p161p213q342
60893G03401r547r627r669j0702j1305j0075q206p127n955l744j913j786k122
60880F11623j609j489k957m433m183l404l767m233l259j959j982k272j096O53
60866E75633J231J265K152L070K660J961K581L607L368K588K808L282K581J644
60852F10431K185L452L626K976K701K176L34j657k136j822k043j813J15J913Q52
60837F21290k451n332p277r445j1277j1275j0142r749r709q340o191n253n380
60824E19469m848l787l745m355l771k107j271j653j904j714j967k448k097j292
$$ plain form
60920 853605 840983 830586 820484 810180 801043 793471 786152 778582 771853 766488 761702 757281 754088
60907 754088 752298 750987 749688 748557 747093 744616 741804 739681 737325 732802 726117 718956 711743 703401
60893 703401 693854 684227 674558 663856 652551 642476 634270 627143 621188 617444 615531 613745 611623
60880 611623 610014 608525 605568 601135 596952 593548 589781 585548 582289 580330 578348 576076 574980 575633
60866 575633 576864 578129 580281 583351 586011 587972 590553 594160 597528 600116 602924 606206 608787 610431
60852 610431 612616 616068 619694 622670 625371 627547 627881 626224 624088 622266 620223 618410 618525 620438 621290
60837 621290 618839 613507 606230 596785 585508 574233 564091 554342 544633 536293 530102 524849 519469
60824 519469 514621 510834 507089 502734 498963 496856 495585 493932 492028 490314 488347 485899 483802 482510
60810D82510j304j933k109k158k925l455k277k31P04O36J066J853J773J233J491
60795D74874J950J260K42O00J496P70j094j626n59R5k12r7N64M20m10m56L2p06
60777D77143k513l316k710k424k977k966k089j813k461k491j286n4M79Q90J203
60762D52615O83k92n13j76m62r68k07J460K177J908K369L521L226R78r84j112
60746D64223l80J01P67J988L028L450L612L228J514r09k336k565l057m187m599
60731D63878l636k317j440o99J6L73Q11K021L221L028J933J663K152J689J42o10
60715D72225K11J175J175P15K02p94k096k717k508k196j769p48O9n69j959k234
60699D58182j519j707l093l863l180k158j430l47R68J296O13K32L81l0q76o43
$$ plain form
60810 482510 481206 479273 477164 475006 472081 468626 466349 466118 466822 467458 468524 470377 472150 473383 474874
60795 474874 476824 478084 478326 478926 480422 481192 480098 478472 477913 478008 477796 477699 478263 478683 478273 477817 477849 477143
60777 477143 474630 471314 468604 466180 463203 460237 458148 456335 453874 451383 450097 450043 450522 451412 452615
60762 452615 453298 453006 452493 452317 451855 450887 450680 452140 454317 456225 458594 462115 465341 466319 465335 464223
60746 464223 463843 463944 464711 466699 469727 473177 476789 480017 481531 480622 478286 475721 472664 468477 463878
60731 463878 460242 457925 456485 455786 455802 456175 456986 459007 462228 465256 467189 468852 471004 472693 472835 472225
60715 472225 472436 473611 474786 475501 475703 474909 472813 470096 467588 465392 463623 462875 462944 462375 460416 458182
60699 458182 456663 454956 451863 448000 444820 442662 441232 440885 441853 443149 443762 443994 444375 444345 443469 442826
60683D42826P84J676J371J163J739K211K190K518L305L625L594M394N757N958
60669D83111M833M218M728M615K704M5k155l996n508n972n413m790m190k793r83
60654D68454k19n55n76LJ23m0R75K967L931L342K836K997K419O54q03j415k481
60637D82612m153m515k926j417j365j476n51L37R6l48O8O99P61P43R89P74N3Q7
60619D70468J204J924J420Q10R14Q68J16l28J69O59M92M21P66N81l44p26j45R3
60601D79362n93q87j16M16j69p53m17o8m83q36m23J20N59J839L855M735L775K915
60583D92831L654M662M146K643J660J274Q57O80J059J296R86J154K719M941O469
60568E31031O881O483N854O068P861J0150J1067J0727J1015J2371J3180J2685
$$ plain form
60683 442826 443610 445286 446657 447820 449559 451770 453960 456478 459783 463408 467002 471396 477153 483111
60669 483111 487944 492162 496890 501505 504209 504254 502099 498103 492595 486623 481210 476420 472230 469437 468454
60654 468454 468235 467680 467104 467107 467230 467190 468165 471132 475063 478405 481241 484238 486657 487311 486508 485093 482612
60637 482612 478459 473944 471018 469601 468236 466760 466209 466546 466642 466294 466362 467061 467822 468565 469554 470328 470381 470468
60619 470468 471672 473596 475016 475826 476740 477608 477724 477396 477565 478224 478716 479137 479903 480484 480140 479414 479269 479362
60601 479362 478769 477882 477766 478182 478013 477260 476843 476775 476292 475456 475033 475153 475712 477551 481406 486141 489916 492831
60583 492831 496485 501147 505293 507936 509596 510870 511727 512407 513466 514762 515748 516902 519621 524562 531031
60568 531031 537912 544395 550249 556317 564178 574328 585395 596122 607137 619508 632688 645373
60556F45373J1852J0737P891L334p03l149n420q129r398q067n849m524l483j798
60542F28667l23K13R18K673M467N521O946R547J2106J3634J5258J8123K1365K3960
60528G63075K6518K9562L1839L2116L0777K8173K3414J6259Q214L80p628j5332
60516I67367k0520k2348k2845k3642k3677k1884j9406j7248j4353j0245o893n616
60504G58690m645k229L82J618K822N914J0014J3340J6584K1470K7581L3391L8926
60491I23858M4802N0019N3253N4856N5343N3490M8355M1449L4534K7166J8977
60480A406102J2491J0662J2935J6388J9278K0802J8968J1853J34j4044k9622m5696
60468A440251n9593o8665p2950p3832p1410o5716n8875n3206m8246m2439l6439
$$ plain form
60556 645373 657225 667962 675853 679187 678484 675335 669915 661786 652388 644321 638472 633948 630465 628667
60542 628667 628344 628557 629475 632148 636615 642136 649082 658629 670735 684369 699627 717750 739115 763075
60528 763075 789593 819155 850994 883110 913887 942060 965474 981733 989947 990327 982699 967367
60516 967367 946847 924499 901654 878012 854335 832451 813045 795797 781444 771199 764306 758690
60504 758690 754045 751816 752198 753816 756638 762552 772566 785906 802490 823960 851541 884932 923858
60491 923858 968660 1018679 1071932 1126788 1182131 1235621 1283976 1325425 1359959 1387125 1406102
60480 1406102 1418593 1429255 1442190 1458578 1477856 1498658 1517626 1529479 1529613 1515569 1485947 1440251
60468 1440251 1380658 1311993 1239043 1165211 1093801 1028085 969210 916004 867758 825319 788880
60457G88880l2029k8900k5499k2014j9610j7654j4662j1258r315q729p766o162
60445E85282n189n002m457l314k333j588o67j31p09j665j811j404j227q41K47
60430E55191P99m42k262k567j548r89j285j484j438j490q82J148L271L364J432
60415E50818o96j839j850n71J510K651K005J252K078L358L103J869J606K383K895
60400E70572L122L769M122L214K160K645L989M395M108M474M946M035K466K245
60386F20262L190L480L072L446M395M218L011K674L671M511M504M420M382L727
60372F72963K859K903L547L527L012L174L774L602K894K905L462L393K926L153
60358G18094L610L009J939K129L447M317M664N718P323Q352R440J2168J5696J7264
$$ plain form
60457 788880 756851 727951 702452 680438 660828 643174 628512 617254 607939 599210 591444 585282
60445 585282 580093 575091 570634 567320 564987 563399 562732 562601 561892 560227 558416 557012 555785 554944 555191
60430 555191 555990 555548 553286 550719 549171 548182 546897 545413 543975 542485 541603 542751 546022 549386 550818
60415 550818 550122 548283 546433 545862 547372 550023 552028 553280 555358 558716 561819 563688 565294 567677 570572
60400 570572 573694 577463 581585 584799 586959 589604 593593 597988 602096 606570 611516 615551 618017 620262
60386 620262 623452 626932 630004 633450 637845 642063 645074 647748 651419 655930 660434 664854 669236 672963
60372 672963 675822 678725 682272 685799 688811 691985 695759 699361 702255 705160 708622 712015 714941 718094
60358 718094 721704 724713 726652 728781 732228 736545 741209 746927 754250 762602 772042 784210 799906 817170
60344H17170J6104J3946J1587Q032L216j372n181r018j2583j4307j4065j3489
60332H00040j3283j2638j1587j1261j1506j0784q873p197o155m699k889k309l365
60319F93494m546m892m899m591l096o13J420K675M303O663Q887J0966J3985J7774
60305G37530K0580K1567K1548K0913J9023J6175J3994J3164J2466J0601P438L314
60293I18313j362n855r934j4551j9965k4048k4600k2590k0586j8733j5339j0867
60281G29883p973p360o929n553m653n246o256o641o768o880o466n832o108p136
60267F40082p456o738o075n667m504k638j407j110p74l64q20j693j370P4Q69O78
60251F01087J072K510L569L667L865M392M026K632J666J557J097L0m01j09n95
$$ plain form
60344 817170 833274 847220 858807 866839 870055 868683 863502 854484 841901 827594 813529 800040
60332 800040 786757 774119 762532 751271 739765 728981 720108 712911 706756 702057 699168 696859 693494
60319 693494 688948 684056 679157 674566 671470 670857 672277 674952 679255 685918 694805 705771 719756 737530
60305 737530 758110 779677 801225 822138 841161 857336 871330 884494 896960 907561 914999 918313
60293 918313 916951 911096 901162 886611 866646 842598 817998 795408 774822 756089 740750 729883
60281 729883 721910 714550 707621 702068 697415 692169 685913 679272 672504 665624 659158 653326 647218 640082
60267 640082 632626 625888 619813 614146 609642 607004 605597 604487 603713 603349 602529 600836 599466 599540 600409 601087
60251 601087 602159 604669 608238 611905 615770 620162 624188 626820 628486 630043 631140 631170 630769 630660 630065
60236F30065j976k365j105O5J04K87J545K730K871K853L551M283M396M529N274
60221F57107O157O810P544Q228Q316Q313R382J1267J2542J2978J3490J3836J2877
60208G88847J1239J0956J2186J3002J2756J2782J3348J2981J1464J0508J0573
60197I20642R985Q117O481N692M298J798j57q99k187n041p795q878r042r361r393
60182I04260q824q661r367r780r199q495q186p508o328n704n611m580k458j075
60168H08484j164j203l82kp85j473j460k083l880n179m889m220m153l695k198
60153G71718q73m44K74J885K929K519K056K633L082K367J678K295L397L771L824
60138H03111M305M833N149O052P739R048R413R694J0155R818Q693Q217Q489P637
$$ plain form
60236 630065 628089 625724 624619 624684 624788 625075 626620 629350 632221 635074 638625 642908 647304 651833 657107
60221 657107 663264 670074 677618 685846 694162 702475 711857 723124 735666 748644 762134 775970 788847
60208 788847 800086 811042 823228 836230 848986 861768 875116 888097 899561 910069 920642
60197 920642 930627 938744 945225 950917 955215 957013 956856 955957 953770 948729 940934 932056 923014 913653 904260
60182 904260 895436 886775 877408 867628 858429 849934 841748 834240 827912 822208 816597 812017 809559 808484
60168 808484 807320 806117 805735 805733 804948 803475 802015 799932 796052 790873 785984 781764 777611 773916 771718
60153 771718 770845 770401 770675 772560 775489 778008 780064 782697 785779 788146 789824 792119 795516 799287 803111
60138 803111 807416 812249 817398 823450 831189 840237 849650 859344 869499 879317 888010 896227 904716 912353
60124I12353N050K574J349L32q56n91J676L914M804N661P398Q481P884P195P713
60109I74937Q073O893N195M111K768N81r63r74j139k755m356m504m389n253n785
60094I72440m667l376l753m923n209n131n951p070p409p510q048q016o640n175
60080H89562m658l956k125o44r50j974k439l407n981q691r788j0172j1339j2395
60066H11043j1813j0379r664r228p933o445n888n604m634l773l831l620k112p21
60052G25398r67j754j463q02r92r93O81L106M641N727P386Q702Q570Q161Q859
60037G74260R447Q256O288N322M610K549J1j191j663l069m821n319n257o486q711
60022G74226j0336j1517j3215j4369j3279j1000j0136j0867j1118j0079q755p561
$$ plain form
60124 912353 917403 919977 921326 921658 920802 920211 921887 925801 930605 936266 943664 952145 960029 967224 974937
60109 974937 983010 989903 995098 999209 1001977 1002558 1001595 1000621 999482 996727 992371 987867 983478 978225 972440
60094 972440 967773 964397 960644 955721 950512 945381 939430 932360 924951 917441 909393 901377 894737 889562
60080 889562 884904 880948 878823 878179 877229 875255 872816 869409 863428 854737 844949 834777 823438 811043
60066 811043 799230 788851 779187 769959 762026 755581 749693 744089 739455 735682 731851 728231 726119 725398
60052 725398 724431 722677 721214 720412 719420 718427 719108 722214 726855 732582 739968 748670 757240 765401 774260
60037 774260 783707 791963 798251 803573 808183 810732 810743 809552 807889 804820 799999 794680 789423 782937 774226
60022 774226 763890 752373 739158 724789 711510 700510 690374 679507 668389 658310 649555 641994
60010F41994o036m500l603k851j681r95j497j770m02J354J578J000J535K904L528
59995F30558L556M018M200K878J249J477L203M398M814N679O744O702N869N626
59981F90971N710M783K985J384k60k587m465m475l649l976n107n316m739m692
59967F66567m724l445j508o91p25R0J827L371N048P666R827R401P128N587N054
59952G10473L608Q84j434k620l367l518k336p57n03j203j146n37j083k745l768
59937F89948l709l548l185j644M57J488J643K539M319N811P036Q788J0151R366
59923G29460O801M329K282j89k327k486j204n01m02Q22L287N301O282O951P068
59908G65474N909M555M675N476M900L221K304J883Q5k775m544n107o252p790p515
$$ plain form
60010 641994 635958 631458 627855 625004 623323 622328 620831 619061 618659 620013 621591 622591 624126 627030 630558
59995 630558 634114 638132 642332 645210 646459 647936 651139 655537 660351 666030 672774 679476 685345 690971
59981 690971 696681 701464 704449 705833 705573 702986 698521 694046 690397 686421 681314 675998 671259 666567
59967 666567 661843 658398 656890 656199 655474 655564 657391 660762 665810 673476 683303 692704 699832 705419 710473
59952 710473 714081 714965 713531 710911 707544 704026 701690 700933 700430 699227 698081 697544 696461 693716 689948
59937 689948 686239 682691 679506 677862 678319 679807 681450 683989 688308 694119 701155 709943 720094 729460
59923 729460 736261 740590 742872 742683 740356 737870 736666 736165 735763 736585 739872 745173 751455 758406 765474
59908 765474 771383 775938 780613 786089 790989 794210 796514 798397 798482 795707 791163 786056 779804 772014 764499
59893G64499n152k784j173Q23L006L716L262L893N771O504N364M561N488O911
59879H04689P777Q668R664R721R038R240J0436J0777R539P943O446M069R88j062
59865I07933j626k116l084l587l640m479n899o126m866l792l600l264k564k537
59851H56753l102l055k674l428m851m783l048j763j559p22J334K973L497M388
59837H39960O485Q698J0161J0896R997O284J349j111J42K869N335Q063J0904J1747
59823I31779R398N027j16n688j0374j2070j0911r274q087n971k668j94K78k72
59809H80857j267l305n609n937m036k269j805j292p2L97n89j821k830m661p059
59794H38702q058p369p045p705p527o016n367o597p756p453o950p156o772n186
$$ plain form
59893 764499 759347 756563 755390 756213 759219 762935 766197 770090 775861 782365 787729 792290 797778 804689
59879 804689 812466 821134 830798 840519 849557 858797 869233 880010 889549 897492 903938 908007 908995 907933
59865 907933 906307 904191 901107 897520 893880 889401 883502 877376 872510 868718 865118 861854 859290 856753
59851 856753 853651 850596 847922 844494 839643 834860 831812 830049 828490 827768 829102 832075 835572 839960
59837 839960 846445 855143 865304 876200 886197 892481 893830 892719 892861 895730 901065 909128 920032 931779
59823 931779 941177 946204 946088 940400 930026 917956 907045 897771 889684 883713 881045 880851 881129 880857
59809 880857 879590 876285 870676 864739 860703 858434 856629 855337 855265 855662 855073 853252 850422 845761 838702
59794 838702 830644 823275 816230 808525 800998 794982 789615 783018 775262 767809 760859 753703 746931 741745
59780G41745m094m454m679l624k534k398k119r14J66O72J878M013N215M841M930
59765G38644O692Q487Q943R181J0167J0713J0121J0039J1608J3277J3482J3180
59753H64534J3812J5015J6076J7382J8746J8570J6332J3700J1810R735O966M759
59741A027437L570J831j156l728m769n479o699p239o545o233p208p856o899n474
59727I63553m682l749k348j914k845l178j944j000j647k250j374m38r10j529p77
59712I32968L75O25R19K422M054M431M356N190O581P765R194J1006J1922J1378
59698A013186J0746J0786J0144Q048O138N892O572P239Q253R089P577L318p92
59685A106196k575l390m958o245n938n301n918o951p148p447r068j1096j2222
$$ plain form
59780 741745 737651 733197 728518 724894 722360 719962 717843 716929 717095 717767 719645 723658 728873 733714 738644
59765 738644 745336 753823 762766 771947 782114 792827 802948 812987 824595 837872 851354 864534
59753 864534 878346 893361 909437 926819 945565 964135 980467 994167 1005977 1015712 1022678 1027437
59741 1027437 1031007 1032838 1031682 1027954 1023185 1017706 1011007 1003768 997223 990990 983782 975926 969027 963553
59727 963553 958871 955122 952774 950860 948015 944837 942893 941893 940246 937996 936622 936184 935274 933745 932968
59712 932968 933343 933968 934887 937309 941363 945794 950150 955340 961921 969686 978880 989886 1001808 1013186
59698 1013186 1023932 1034718 1044862 1052910 1059048 1064940 1071512 1078751 1087004 1096093 1103670 1106988 1106196
59685 1106196 1103621 1100231 1095273 1089028 1083090 1077789 1071871 1064920 1057772 1050325 1041257 1030161 1017939
59672A017939j2811j3262j2515j0318q545q232p680n562l281k088o44K090M375
59659I39466M766M991O908R102R494R036R726J1109J1635J1546J1570J0628P691
59646A057668M088J293j695o142j0704j3509j5256j7539j9823k0746k0650k0297
59634I16688j8844j5639j2293j0467r360p650o072n713n855n913p289j0695j3757
59621G87141j4068j2668j1816j1317r756p540n924m742l559l213l864l646j678
59608F93350j11n66j087N51K923L520K897K939L148K094P12P38J420J011L2O8
59592G13639Q41J299J948L302L799K156k9p73q74j804k622k001j180j783k750
59577G13168k615k586m105n555m903l497l601m268l394j880j796k258j172N55
$$ plain form
59672 1017939 1005128 991866 979351 969033 960488 952256 944576 939014 935733 933645 933001 935091 939466
59659 939466 944232 949223 956131 965233 974727 983763 993489 1004598 1016233 1027779 1039349 1049977 1057668
59646 1057668 1061756 1063049 1061354 1055212 1044508 1030999 1015743 998204 978381 957635 936985 916688
59634 916688 897844 882205 869912 859445 850085 842435 836363 830650 824795 818882 811593 800898 787141
59621 787141 773073 760405 748589 737272 727516 719976 714052 709310 705751 702538 698674 695028 693350
59608 693350 693239 692673 691586 692137 695060 698580 701477 704416 707564 709658 710370 711108 712528 713539 713571 713639
59592 713639 714480 715779 717727 721029 724828 726984 726955 726182 725308 723504 720882 718881 717701 715918 713168
59577 713168 710553 707967 703862 698307 693404 689907 686306 682038 678644 676764 674968 672710 671538 672093
59563F72093N87m73k93Q55Q80j26l96K4j81n74J31J208J177O28Q43J106M67L51
59545F78307K167M225M547M505O121P991P996P704R663J2617J4326J6947K3780
59532H00896L1810L3413K5568J2676N43p829j1064r156n005k144p09J141K729
59519H72869J860n95j727j734l502p278j0262j1417j2352j3369j3005j1607j1172
59506G76709j1427j0227p894p020p753p507n673m487m700m423k937j815j589p73
59492F98484J075K644L590M820N942N659M691N004O254O371N391N124N317M044
59478G64410J754R46J802K023J155J109K243K863K887M019N899N998L897J955
59464H02960J284P07RM27J513J275o0l6J963M202O248R229J2264J2774J0837R310
$$ plain form
59563 672093 672680 672207 671914 672769 673649 673523 673127 673151 672970 672396 672527 673735 674912 675540 676383 677489 677956 678307
59545 678307 680474 684699 689246 693751 699872 707863 715859 723563 733226 745843 760169 777116 800896
59532 800896 832706 866119 891687 904363 904906 897077 886013 876857 871852 869708 868999 870140 872869
59519 872869 874729 874134 872407 870673 867171 859893 849631 838214 825862 812493 799488 787881 776709
59506 776709 765282 755055 747161 740141 732388 724881 719208 714721 710021 705598 702661 700846 699257 698484
59492 698484 699559 702203 705793 710613 716555 722214 726905 731909 738163 744534 749925 755049 760366 764410
59478 764410 766164 767110 768912 770935 772090 773199 775442 778305 781192 785211 791110 797108 801005 802960
59464 802960 804244 804951 804960 805387 806900 808175 808115 808079 810042 814244 820492 829721 841985 854759 865596 874906
59448H74906R035P935N415L563L124K229M6k047l723o342r507j0770r696q527
59434H55641q012o384l365j249r13m79R07J737J721K909N951Q724J0046J1333
59420H78567J3437J5235J6506J8727K1764K3305K2798K2432K3039K2859K2018
59409A100687K4086L0472L6166L4043K1860L600j4121k5621k8586k5073j9334
59398A138179j3797p880l54Q551J6609J9366J2181m385k2282l2626l4074l1584
59386A047904k8465k4251j9308j5919j4131j1389p280m305l181j694Q26K260J989
59373I23056K240L950N197N018M925N520N421M606M997O673P366O660O785Q253
59359A000667Q770P732P577R335J0824J0768J0871J2304J3728J4320J5188J6629
$$ plain form
59448 874906 883941 891876 897291 900854 903978 906207 906253 904206 900483 894141 884634 873864 864168 855641
59434 855641 847629 841245 837880 836631 835718 835239 836146 837883 839604 842513 848464 857188 867234 878567
59420 878567 892004 907239 923745 942472 964236 987541 1010339 1032771 1055810 1078669 1100687
59409 1100687 1124773 1155245 1191411 1225454 1247314 1250914 1236793 1211172 1182586 1157513 1138179
59398 1138179 1124382 1116502 1116148 1124699 1141308 1160674 1172855 1168470 1146188 1113562 1079488 1047904
59386 1047904 1019439 995188 975880 959961 945830 934441 927161 922856 919675 917981 918807 921067 923056
59373 923056 925296 929246 934443 939461 944386 949906 955327 959933 964930 971603 978969 985629 992414 1000667
59359 1000667 1009437 1017169 1024746 1034081 1044905 1055673 1066544 1078848 1092576 1106896 1122084 1138713
59347A138713J7337J7296J7891J8503J6892J3580J1637J1411R887O097K474r8
59335A281620l678q493j1816j3177j5570j9807k2631k2541k2271k3329k3215k0714
59323A074378j8868j9643k0302j8305j5556j4523j4142j2715j1169j0426r154
59312I09575o954o174p826r235q449p316p517p398n546l803l769l834k591j681
59298H27482k331k563p67J312K050L064N884Q898J0597J2797J7502K3179K6677
59285I33781K6310K1238J1250o05q740j0866r936q538n403L26N901R108J1630
59272I75456J5165J8021J8684J8964K0336K0853J8973J6824J6305J5453J2124
59261A167158P901M881J956k263o079p688q478j0098j1297j0841j0370j1183j1453
$$ plain form
59347 1138713 1156050 1173346 1191237 1209740 1226632 1240212 1251849 1263260 1273147 1279244 1281718 1281620
59335 1281620 1277942 1269449 1257633 1244456 1228886 1209079 1186448 1163907 1141636 1118307 1095092 1074378
59323 1074378 1055510 1035867 1015565 997260 981704 967181 953039 940324 929155 918729 909575
59312 909575 902621 896447 888621 879386 870937 863621 856104 848706 843160 839357 835588 831754 829163 827482
59298 827482 825151 822588 821821 823133 825183 828247 834131 843029 853626 866423 883925 907104 933781
59285 933781 960091 981329 992579 991974 983234 972368 962432 953894 948491 948817 954718 963826 975456
59272 975456 990621 1008642 1027326 1046290 1066626 1087479 1106452 1123276 1139581 1155034 1167158
59261 1167158 1175059 1179940 1181896 1179633 1173554 1165866 1157388 1147290 1135993 1125152 1114782 1103599 1092146
59248A092146r843q521r312j0189q942p090o704o646n398m367m953n443m322l406
59234I97010m385n469m863m209n187o157n646n650p812r896r806r491j0974j2144
59220H95321j0665q523q338q570o793m458l935l924k289m27l34l84J503L352K460
59205H43996M26K72J264J137O93J580K232P51q06K45K165J765l4l43M44L69L85
59188H56541K228M095L375J583J721K801J954j17p24l80j447l334l794l399m047
59173H57056m764l646k194k964m547l664o96J465K453L710M387K774L61j02O91
59158H50320J91j292j853k239m292o765p249o654p258q016o571m270m335o361
59144G83356p411p220p737q695q297p107o934p122o112n056n589n919l622m32
$$ plain form
59248 1092146 1082303 1073782 1064470 1054281 1045339 1038249 1031545 1024899 1019501 1015134 1010181 1004738 1000416 997010
59234 997010 992625 987156 982293 978084 972897 966740 961094 955444 947632 937736 927930 918439 907465 895321
59220 895321 884656 876133 867795 859225 852432 847974 844039 840115 837826 837399 837065 836681 838184 841536 843996
59205 843996 844422 844694 845958 847095 847788 849368 851600 852351 851545 851790 853955 855720 855686 855343 855787 856156 856541
59188 856541 858769 862864 866239 867822 869543 872344 874298 874181 873457 873077 871630 868296 864502 861103 857056
59173 857056 852292 848646 846452 843488 838941 835277 834581 836046 838499 842209 846596 849370 849731 849629 850320
59158 850320 850511 849219 847366 845127 840835 834070 826821 820167 812909 804893 798322 794052 789717 783356
59144 783356 775945 768725 760988 752293 743996 736889 729955 722833 716721 711665 706076 700157 696535 696103
59130F96103M69K8J310L805M812M731N776P113O555N605P347J0710J2151J1815
59116G78330J2611J4406J4623J3572J3757J4745J4035J2148J1588J1608R397N636
59104I26456L627L604L087K045K435L399K295j78j166j139k886n764o515n125
59090I24175m453m575l056l99M29m24j62R60o2l156n173n675p188r721j0496r309
59074H61715q828r373q640o745o299p306p077n479n116o218o297n091m866n691
59060G68689n361m025l964m849m254k707l043m847m800k544r82p69K08J933K105
59045G30790R58R42J678N50j763j857L05J384P35Q96K013J559j71o0K004L008
59029G42971K702L872O538P885Q276J1106J6103J9011J8788J8940K0597K0451
$$ plain form
59130 696103 696572 696600 697910 701715 706527 711258 717034 724147 730702 736307 743654 754364 766515 778330
59116 778330 790941 805347 819970 833542 847299 862044 876079 888227 899815 911423 920820 926456
59104 926456 930083 933687 936774 938819 941254 944653 946948 946770 945604 944465 941579 935815 929300 924175
59090 924175 919722 915147 912091 911692 912121 911697 911535 912495 912433 909277 904104 898429 891241 881520 871024 861715
59074 861715 852887 843514 834874 828129 821830 814524 807447 801968 796852 790634 784337 779246 774380 768689
59060 768689 763328 759303 755339 750490 746236 743529 740486 735639 730839 728295 727313 726544 726752 728685 730790
59045 730790 731748 732690 734368 734918 733155 731298 731603 732987 733722 734618 736631 738190 738019 737959 739963 742971
59029 742971 745673 749545 756083 763968 772244 783350 799453 818464 837252 856192 876789 897240
59017H97240J6965J2734R227M816n58m318o153q633j1783j2500j0407q734q325
59004H69571o414k524K06Q43K188N084O870O755P157Q353P474M207J842J340J5
58989I12967k598l516k357k616n203o616n378m348m831m155j238J233K174M101
58975H77619P764J0329J0887J2185J4965J6223J5058J4563J5809J5783J3480J2124
58963A036789J3000J2853R934P065O047M560J190j836l521o296j0892j4301j5347
58950A039245j6885k0022k1560j9818j7696j7311j6768j4846j3596j3696j2418
58939H54629q740n483m025k072J102K665J825J825L970N180L881K647K615J116
58925H61135k486m583l773l602n955p599o348m801m786l944j138N67l34o80J374
$$ plain form
59017 897240 914205 926939 936166 940982 940424 936106 929953 921320 909537 897037 886630 877896 869571
59004 869571 863157 860633 860839 861682 863870 868954 875824 882579 889736 898089 905563 909770 911612 912952 912967
58989 912967 910369 906853 904496 901880 896677 890061 884683 880335 875504 871349 870111 871344 873518 877619
58975 877619 885383 895712 906599 918784 933749 949972 965030 979593 995402 1011185 1024665 1036789
58963 1036789 1049789 1062642 1072576 1079641 1085688 1090248 1091438 1089602 1086081 1079785 1068893 1054592 1039245
58950 1039245 1022360 1002338 980778 960960 943264 925953 909185 894339 880743 867047 854629
58939 854629 845889 840406 836381 834309 835411 838076 839901 841726 845696 850876 854757 857404 860019 861135
58925 861135 858649 854066 850293 846691 840736 833137 826789 821988 817202 813258 812120 812687 812353 811673 813047
58910H13047K999K478K559M714O008N178N785R553J2580J2209J1772J4391J7690
58897I20963J8900J9665K1562K2231K0265J8674J9393J9632J7661J6765J9257
58886A134968K2080K2499K2655K4168K3938J9950J5702J4069J2244P619L256K259
58874A325407J912j291n534p822r557j2785j5258j4440j2399j1988j2153j1363
58862A212729j1380j3320j4450j3144j2480j4628j6587j5720j4486j5174j5184
58851A056176j2367r856j0521j1633j0232q783j0294j2670j3240j4032j7074j9258
58839I06216j7544j4814j4903j6068j4943j2729j2001j1410r012o831o940o946
58827G62075m393j484o23K43K984M729L133J451L078N681O025N779P148P724N327
$$ plain form
58910 813047 816046 818524 821083 825797 831805 836983 842768 852321 864901 877110 888882 903273 920963
58897 920963 939863 959528 981090 1003321 1023586 1042260 1061653 1081285 1098946 1115711 1134968
58886 1134968 1157048 1179547 1202202 1226370 1250308 1270258 1285960 1300029 1312273 1319892 1323148 1325407
58874 1325407 1327319 1326028 1320494 1312672 1303115 1290330 1275072 1260632 1248233 1236245 1224092 1212729
58862 1212729 1201349 1188029 1173579 1160435 1147955 1133327 1116740 1101020 1086534 1071360 1056176
58851 1056176 1043809 1033953 1023432 1011799 1001567 992784 982490 969820 956580 942548 925474 906216
58839 906216 888672 873858 858955 842887 827944 815215 803214 791804 782792 775961 769021 762075
58827 762075 757682 756198 755575 755818 758802 763531 766664 768115 771193 776874 782899 788678 795826 803550 808877
58812H08877L066L814M621K387M4R70K373N88k035k009j578l930o440n530l719
58797H01499m812o548n115k649k995m319l165j700l439n714m025j54J556K326
58783G60746N693R693J0159Q682R607J1962J1897J0379J0976J2563J1486Q469
58771H82312O303L491k722r651j2646j2666j3544j4580j2915j0396j0628j1753
58759G80605r471m976k763k830k034p88j520k826j942o42k046m167l248p14j02
58744G40536j07K408N606N939N106O637Q686P638N666O945R516Q776O157O282
58730H25791Q259P872N893O084P357O061L727M466O903O745N015N775Q039Q125
58716I16112P525J0110J3855J3856J1373J1202J2284R733M314Q89q72n304j1716
$$ plain form
58812 808877 811943 815757 820378 822765 822809 823779 826152 826740 824705 822696 821118 817188 810748 805218 801499
58797 801499 796687 790139 785024 782375 779380 775061 771896 770196 766757 761043 757018 756864 758420 760746
58783 760746 766439 776132 786291 794973 804580 816542 828439 838818 849794 862357 873843 882312
58771 882312 888615 892106 889384 879733 867087 854421 840877 826297 813382 802986 792358 780605
58759 780605 771134 766158 763395 760565 758531 757743 756223 753397 751455 750813 748767 744600 741352 740638 740536
58744 740536 740429 742837 748443 754382 759488 766125 774811 782449 788115 795060 804576 813352 819509 825791
58730 825791 834050 841922 847815 853899 861256 867317 871044 875510 882413 889158 894173 899948 907987 916112
58716 916112 923637 933747 947602 961458 972831 984033 996317 1006050 1010364 1011253 1010381 1005077 993361
58703I93361j5439j6672j9630k3987k5674k5060k5983k7770k6537k3156k1672
58692G41781k1222j7847j2881j0993j1407r595o235n679p092n991l208l293n401
58679F20937m830k292k405m237k814J024J839k76l03J805J556n12O53M885P203
58664F22233P556J0537J5672J7546J5440J3377J1055M488m487r298r307r906j2135
58651F72771j2004r869j0340j2654j1401p048n605p427o803l139j974l979l686
58638E76842l33O21j646j459K528M756L124K123L582L769J665Q97J692Nl816m693
58622E89657k357j945m000l523l9J309o2J094N506P802O761P083R491R268O185
58607F32230N519P545O627K449J427M754N905K525MP37M21k119k190Q22J292j803
$$ plain form
58703 993361 977922 961250 941620 917633 891959 866899 840916 813146 786609 763453 741781
58692 741781 720559 702712 689831 678838 667431 657836 651601 645922 638830 632839 629631 626338 620937
58679 620937 616107 613815 611410 607173 604359 605383 607222 606946 606643 608448 610004 609492 610145 615030 622233
58664 622233 629789 640326 655998 673544 688984 702361 713416 717904 713417 704119 694812 684906 672771
58651 672771 660767 650898 640558 627904 616503 609455 603850 596423 589620 586481 584507 580528 576842
58638 576842 576509 577130 575484 574025 576553 581309 584433 586556 590138 593907 595572 596469 598161 598166 594350 589657
58622 589657 587300 585355 581355 577832 577793 579102 579040 580134 585640 593442 600203 607286 616777 626045 632230
58607 632230 637749 645294 651921 654370 655797 660551 666456 668981 668985 669722 670143 668024 665834 666656 667948 666145
58591F66145k394J381L831K851L750Q595J2114J1853J2254J5139J6157J4107J3772
58578G79555J6071J5505J0761P779Q940R271O769O159R081J0848J0399J3043J9882
58565I24063K4999K6536K9980L6948M1621M1843M2736M5464M3610L4840K5116
58554A317756J7323P037o223j5206j7050j7918k0843k0439j4512r344q230o239
58542A206112j754j526q550j6154j9955k4511l2261l7285l6291l4800l6173l5361
58530I21491k9652k4657k3405k0507j3398q385r127r952p019n126p055p398l527
58517G52283j570m695o586l397r31l023m066m17K122n27l012j361l73k960l442
58502G18045J111M052J211j472K37J046k282l489R67M162J524l99L420P022N456
$$ plain form
58591 666145 663751 665132 668963 671814 675564 684159 696273 708126 720380 735519 751676 765783 779555
58578 779555 795626 811131 821892 829671 838611 847882 854651 860810 869891 880739 891138 904181 924063
58565 924063 949062 975598 1005578 1042526 1084147 1125990 1168726 1214190 1257800 1292640 1317756
58554 1317756 1335079 1342116 1335893 1320687 1303637 1285719 1264876 1244437 1229925 1220581 1212351 1206112
58542 1206112 1204358 1202832 1194282 1178128 1158173 1133662 1101401 1064116 1027825 993025 956852 921491
58530 921491 891839 867182 843777 823270 809872 801487 792360 782408 775389 770263 763208 755810 752283
58517 752283 750713 746018 739432 736035 735104 732081 728015 727598 729720 729193 726181 724820 724447 721487 718045
58502 718045 719156 723208 724419 722947 723184 724230 721948 718459 719426 723588 725112 724713 728133 735155 740611
58487G40611M387Q430J1667R409P970J2913J8728J9919K1172K6742L0922K9071
58475I41941K6947K9002K8512J9695Q720K301l617j3443k1340k1875k0470k2425
58463I53948k2306j5095p186n191m251J536P601Q735R818J5688K0864K0286J9546
58450A003993K3317K4602J6918O357R4o019j6718k5568k6153k4092k5773k6163
58438I24795j9966j3700j3958j4765r388l588m147n445p58M243K863J101O233
58425H53520J2667J3055J2481J7387K1401J6777R238O855M893l487j2216j3115
58413I39456j1230j4336j7657j4205r725j1926j5238j1819p151r108j2142q299
58401G96620l215m960p715l100K992J672j574K165P624N949K262N020Q580M195
$$ plain form
58487 740611 744998 753428 765095 774504 782474 795387 814115 834034 855206 881948 912870 941941
58475 941941 968888 997890 1026402 1046097 1054817 1057118 1053501 1040058 1018718 996843 976373 953948
58463 953948 931642 916547 909361 904170 899919 901455 909056 917791 927609 943297 964161 984447 1003993
58450 1003993 1027310 1051912 1068830 1075187 1075281 1069262 1052544 1026976 1000823 976731 950958 924795
58438 924795 904829 891129 877171 862406 853018 849430 845283 839838 839080 843323 846186 847287 853520
58425 853520 866187 879242 891723 909110 930511 947288 956526 963381 968274 964787 952571 939456
58413 939456 928226 913890 896233 882028 872303 860377 845139 833320 826169 817061 804919 796620
58401 796620 793405 788445 780730 777630 780622 782294 780720 782885 790509 796458 798720 803740 812320 816515
58387H16515j998k06M298J956k166J164O485M270n0L107Q063M924l32K999R369
58372H58398P523K166M337R915Q676N277R931J7422J6697J2361J5354K1342J9800
58359A009199J5283J7961K2331J7288Q139O399P405N33q163o794j241m160j0236
58346A073944o667J378O70m217k77P941P506L122P827J6523J5430R332J2525K0889
58332A165926K0321J4653J7497K4469K1601J3416J4071J8610J2073n59l055J242
58320A320265k737j0966q064J582J636m359n79Q786P103j530N13J0366J0892M600
58306A337508P790J6994J5454P215J0032K0075J8956J0161J2406K2252K0424J0148
58294A509415J1492K2135K2069J3032J4378K3882K2223J2592J5482K7702K7622
$$ plain form
58387 816515 814517 814311 818609 820565 818399 819563 826048 830318 830268 833375 841438 846362 846030 849029 858398
58372 858398 865921 868087 872424 882339 891015 896292 906223 923645 940342 952703 968057 989399 1009199
58359 1009199 1024482 1042443 1064774 1082062 1090201 1096600 1104005 1104538 1096375 1089581 1088340 1084180 1073944
58346 1073944 1067277 1068655 1069325 1065108 1064831 1072772 1080278 1083400 1091227 1107750 1123180 1132512 1145037 1165926
58332 1165926 1186247 1200900 1218397 1242866 1264467 1277883 1291954 1310564 1322637 1322078 1319023 1320265
58320 1320265 1317528 1306562 1298498 1300080 1301716 1297357 1296778 1305564 1312667 1311137 1311650 1322016 1332908 1337508
58306 1337508 1345298 1362292 1377746 1384961 1394993 1415068 1434024 1444185 1456591 1478843 1499267 1509415
58294 1509415 1520907 1543042 1565111 1578143 1592521 1616403 1638626 1651218 1666700 1694402 1722024
58283A722024J7786K0298L2929L2845K1420K1574L2584L2123K1468K3291L5829
58272B014171L5364K3451K4702L8347L9867L0214L4469N1718N6367M9257N6164
58261B454091P5135P7949O4840O3933P5305P1008N2091M8479O0219N7466M1216
58250C141732M3417O3665O8257N5934O0308Q2520Q8059P5820Q1708J07118J14596
58239C983134J01917J07556J34364J43141J31132J38866J68909J78806J65885
58230E253710J74959K09592K23353K12683K26827K70381K91819K85680L05928
58221G454932L58949L88430L87515M15701M81040N21712N30425N74365O62907
58212A1775976P25598P53534Q24416R51804J057288J131794J265751J475230J670490
$$ plain form
58283 1722024 1739810 1760108 1793037 1825882 1847302 1868876 1901460 1933583 1955051 1978342 2014171
58272 2014171 2049535 2072986 2097688 2136035 2175902 2206116 2240585 2292303 2348670 2397927 2454091
58261 2454091 2529226 2607175 2672015 2735948 2811253 2882261 2934352 2982831 3043050 3100516 3141732
58250 3141732 3185149 3248814 3317071 3373005 3433313 3515833 3603892 3679712 3761420 3868538 3983134
58239 3983134 4085051 4192607 4326971 4470112 4601244 4740110 4909019 5087825 5253710
58230 5253710 5428669 5638261 5861614 6074297 6301124 6571505 6863324 7149004 7454932
58221 7454932 7813881 8202311 8589826 9005527 9486567 10008279 10538704 11113069 11775976
58212 11775976 12501574 13255108 14079524 15031328 16088616 17220410 18486161 19961391 21631881
58203B1631881J846926K120171K517044K941038L410858M100045N059648O159534
58195D9787145P396022Q963105J0917601J3137896J5762904J9255538K3879662
58188A49099873K9687807L7159904M6597198N5639018N8199403M8161654K5316971
58181D49861828l061529k7321394m1930994m7192749m6241281m1924566l6117280
58174B06072035l0139758k4696735j9741158j5004598j0682995p451584n899275
58167I2455932o015916p104114q153499q463298q006236p178457o283422n381047
58159C5869943m511369l786755l233366k752184k295804j927919j670489j445908
58151A4246149j214926j031962r18728q12442o84455n89460n51547n13773m45654
$$ plain form
58203 21631881 23478807 25598978 28116022 31057060 34467918 38567963 43627611 49787145
58195 49787145 57183167 66146272 77063873 90201769 105964673 125220211 149099873
58188 149099873 178787680 215947584 262544782 318183800 376383203 424544857 449861828
58181 449861828 446800299 419478905 377547911 330355162 284113881 242189315 206072035
58174 206072035 175932277 151235542 131494384 116489786 105806791 98355207 92455932
58167 92455932 86440016 79335902 71182403 62719105 54712869 47534412 41250990 35869943
58159 35869943 31358574 27571819 24338453 21586269 19290465 17362546 15692057 14246149
58151 14246149 13031223 11999261 11080533 10268091 9583636 8994176 8442629 7928856 7483202
58142G483202l95106l88983l80882l41910l10439l08578k96817k54052k20051
58133D586384k17197k08129j70724j40530j40206j38407j16310j05856j24338
58124C224687j37080j22104j08986j17846j20839r9831q3225q9848r2598p2893
58114B179437n7070o4100o9170n3479m0274m7624n3364m0098k9010l6599m2221
58103A646428l0299k1688l2001m0566l1416k4483l5766m6008l8900l2084m0397
58092A272820m5526l1984j7741j9818k3540j4231o111j1853j5968o043J173q333
58080A072845j8784j5647j2965k3533l2017k4387j5185j9177k3893j6276r112
58069H61869j5027k0850j3518n758j0720j6332r786k850p965j3349o551O91m486
$$ plain form
58142 7483202 7088096 6699113 6318231 5976321 5665882 5357304 5060487 4806435 4586384
58133 4586384 4369187 4161058 3990334 3849804 3709598 3571191 3454881 3349025 3224687
58124 3224687 3087607 2965503 2856517 2738671 2617832 2518001 2434776 2344928 2252330 2179437
58114 2179437 2122367 2058267 1989097 1935618 1895344 1847720 1794356 1754258 1725248 1688649 1646428
58103 1646428 1616129 1594441 1562440 1521874 1490458 1465975 1430209 1384201 1345301 1313217 1272820
58092 1272820 1227294 1195310 1177569 1157751 1134211 1119980 1113869 1102016 1086048 1080005 1081178 1072845
58080 1072845 1054061 1038414 1025449 1001916 969899 945512 930327 911150 887257 870981 861869
58069 861869 846842 825992 812474 806716 795996 779664 769878 767028 759063 745714 739163 739854 735368
58056G35368j1217p165k994j0451j8133j3195n989r199j3286o476J165k625q289
58043F27514l543K635j604p309k694L331j402q706o498j983n988j0781n890R2
58029E77174m394j1489r306m435p669j2246p798j465l941q515m818M30l031q439
58015D90058n457n84l839q451m230J913q42o252l514J708r14n639k061M295K831
58000D59022j662P78N457K971j622J110N974L291k077p97K186k203q250n791K29
57985D58616n80m330j671L013L81m823k552L023J664l254j864L090K634l84K244
57970D55207O844N023Q32L027P396M566j682j703J370j733p868p558l437m636
57956D55648q717p011k388l875q777p725k688k622n835l911J209J055k549j197
$$ plain form
58056 735368 724151 716986 713992 703541 685408 672213 666224 657025 643739 637263 638428 635803 627514
58043 627514 623971 626606 625002 617693 614999 618330 616928 608222 601724 599741 593753 582972 577082 577174
58029 577174 572780 561291 551985 547550 539881 527635 519837 518372 514431 505916 501098 501528 498497 490058
58015 490058 484601 484017 480178 471727 467497 469410 468568 462316 458802 460510 459596 453957 451896 456191 459022
58000 459022 457360 458138 463595 466566 464944 466054 472028 475319 473242 472445 474631 472428 464178 458387 458616
57985 458616 458036 453706 452035 455048 455429 450606 448054 451077 452741 449487 447623 450713 453347 452963 455207
57970 455207 462051 467074 467906 470933 478329 482895 481213 479510 480880 479147 471279 463721 460284 455648
57956 455648 446931 439920 437532 433657 424880 417155 414467 411845 406010 402099 403308 404363 401814 400617
57942D00617L554L695Q33K685P441P568N238Q058J3441J3180R617J1256J6058
57929E03241J5244J0124Q970J0483O614j113m188l332o268j1921j2649r804j1362
57916D94039j6149j6032j1837j1618j4819j3512p914n532o222l203K448L191k49
57903C92591k92K560Q98m515n654k403k237n371m774o11j20l215k493K241L553
57888C70158Q16J189N615P383N296N139P381O314K082R58L120K583n91l96K721
57873D19768K238j659k256P53J206o90J566P537R760P380P023R454Q386L486J626
57858D75578L913M178J627K327O648P794M525L079M811M180N87k9K786K537j751
57843E22790l695k053k938p422r072o257n074p415p763m488k914m492m103p34
$$ plain form
57942 400617 404171 407866 408699 411384 418825 426393 431631 439689 453130 466310 475927 487183 503241
57929 503241 518485 528609 537579 548062 554676 553563 549375 546043 539775 527854 515205 505401 494039
57916 494039 477890 461858 450021 438403 423584 410072 402158 396626 390404 387201 389649 392840 392591
57903 392591 392299 394859 395757 391242 385588 383185 380948 375577 370803 370192 370072 366857 364364 366605 370158
57888 370158 370974 372163 377778 385161 390457 395596 402977 409291 411373 412331 415451 418034 417443 417047 419768
57873 419768 422006 420347 418091 418844 420050 419360 420926 428463 438223 445603 452626 462080 470466 473952 475578
57858 475578 479491 483669 485296 487623 494271 502065 506590 509669 514480 518660 519247 519218 522004 524541 522790
57843 522790 519095 517042 514104 506682 497610 491353 486279 478864 471101 466613 463699 459207 455104 454370
57829D54370K91j782j201K861M227J568J090M658O511M589L977O095N686J725
57815D94665J41K464K662j290l691k309k301n356n924k203j60k573m529l805n112
57800D60679r822j2059r463p617r274r399n549k957m444n077j992K19j091j331
57786C80823K007M063J913J89K092L614J961J119L699N622M250L624O403Q498
57772D29877O951N358O364O504L430P37P58M4l345n604m758m784p661r074o659
57757D18138m768o224p087m520k237l126l797j487Q38R73J903N152O981N726N467
57742D11932P986Q733N473L046M589N844L439J076J985K825P41q01R94K551Q90
57727D61303o54O89J508q70k733j030O26j234l620l334k967m948o057l758j633
$$ plain form
57829 454370 454661 452879 451678 454539 458766 460334 461424 466082 472593 477182 481159 487254 492940 494665
57815 494665 494806 497270 499932 498642 494951 492642 490341 484985 479061 476858 476698 474125 469596 465791 460679
57800 460679 450857 438798 429335 421718 412444 403045 397496 394539 390095 385018 383026 383245 382154 380823
57786 380823 382830 386893 388806 388995 391087 394701 396662 397781 401480 407102 411352 414976 421379 429877
57772 429877 436828 442186 448550 455054 458484 459221 459979 460023 456678 451074 446316 441532 433871 424797 418138
57757 418138 413370 407146 400059 395539 393302 390176 386379 384892 385730 386703 388606 393758 400739 406465 411932
57742 411932 419918 428651 434124 437170 441759 447603 451042 452118 454103 456928 457669 456868 457862 460413 461303
57727 461303 460649 461338 462846 461976 459243 458213 458839 457605 453985 450651 447684 442736 436679 432921 431288
57712D31288k828m233k827j453k706l464j297J52j984l983k507q67k347l646j429
57697C95869R68m0j284J109M374M528L543M503N099K584o5M70J452m82k700j797
57681D18131k04j076j757J023M459M893M759P746J1836J3945J6651K3518L2295
57668E36219L9643M8237O2341Q0049R5657J04954J02440P9920L6398j4583n5417
57657A115858p9366q9663q9468q0831o9203n9916n2115m2728l3515k7740k3588
57646D67725j7759j2207j0366j0135p598m379m176n308l903j440j739l372k421
57633C82922j20m26k373k132m37q39k601k335q33j390l171k849j227j601l261
57618C57327l008j549k015l728l563j983j749k248j052O23j11k113k160q15p55
$$ plain form
57712 431288 428460 424227 421400 419947 417241 413777 412480 412632 410648 406665 404158 403291 400944 397298 395869
57697 395869 396837 396797 395513 396622 400996 405524 409067 413570 418669 421253 421188 421658 423110 422628 419928 418131
57681 418131 417927 416851 415094 416117 420576 425469 430228 437974 449810 463755 480406 503924 536219
57668 536219 575862 624099 686440 766489 862146 967100 1069540 1149460 1185858 1171275 1115858
57657 1115858 1036492 946829 857361 776530 707327 647411 595296 552568 519053 491313 467725
57646 467725 449966 437759 427393 417258 409660 405281 401105 395797 391894 390454 388715 385343 382922
57633 382922 382802 382376 380003 377871 377434 376595 373994 371659 370826 369436 366265 363416 362189 360588 357327
57618 357327 354319 352770 350755 347027 343464 341481 339732 337484 336432 337055 336944 334831 332671 331856 331101
57603C31101j238P8J829J251l15O7J097j89k330j945j84n13k164j959o86j336
57587C22564k944k363m29j94q70L31K177J483o55r12j48j400l456k983j262k066
57571C06873m451m455k548k539m321m508l232l522m862m080j806j454k577j821
57557B60697L67N51r08n44J494J994J277K474M832M574K249K270N088O480M876
57542B97771K934J664o48l366l561j662j057j881j109J062J059j487l016k329
57528B84374j843k206j404L77N95n33k07J554J998J076J283K360J808L80J173
57513B90785L512L767K063J955L518L241R17J22J384J386m87j204l33p67k499
57498C07360k101N74J582j34j150j26K09j112j587o42q07k133j484J219K017k65
$$ plain form
57603 331101 329863 329941 331770 333021 332706 332773 333870 333681 331351 329406 329222 328709 326545 324586 323900 322564
57587 322564 319620 317257 316828 316634 315764 316095 318272 319755 319100 318188 318040 316640 313184 310201 308939 306873
57571 306873 302422 297967 295419 292880 288559 284051 280819 277297 272435 268355 266549 265095 262518 260697
57557 260697 261064 261615 260707 260163 261657 263651 264928 267402 272234 276808 279057 281327 286415 292895 297771
57542 297771 300705 302369 301721 298355 294794 293132 292075 290194 289085 290147 291206 289719 286703 284374
57528 284374 282531 280325 278921 279298 279893 279360 279153 280707 282705 283781 285064 287424 289232 289612 290785
57513 290785 294297 298064 300127 302082 305600 308841 309758 309880 311264 312650 312163 310959 310626 309859 307360
57498 307360 305259 305833 307415 307281 306131 306005 306214 305102 303515 302873 302066 299933 298449 299668 301685 301420
57482C01420k060j448q32j576j649l03L07k54K32J639J023j656k918k012k094
57467B87819l866m091j887n62j390j527O9N79q44j124Q13J915R02N67K009K365
57451B81747O32l2J642K377M06j297n85L21m10j000k50P8m84N01L286M391K606
57434B93929J315K358K914J222M4J350K773K386K100L175L260J073p39m62l49
57419C16349j808k342m59J109L04o57J54P83l55j126J48J492J512K457N650Q041
57403C31252O867L876J776K22j602k323j371q28j558j310Q00K129J393J213L063
57388C43599M292L160K179L318M494M078M226O319P646O224M453M384L895J279
57374D03546q92l76N45n39j860j480j363l352n148m469l287l821m265k626q75
$$ plain form
57482 301420 299360 297912 297080 295504 293855 293552 293859 293605 293837 295476 296499 294843 291925 289913 287819
57467 287819 283953 279862 277975 277413 276023 274496 274565 275144 274300 273176 273989 275904 276806 277373 279382 281747
57451 281747 282379 282347 283989 286366 286772 285475 284890 285211 284801 283801 283551 283629 283145 283646 286932 291323 293929
57434 293929 295244 297602 300516 301738 301782 303132 305905 308291 310391 313566 316826 317899 317160 316698 316349
57419 316349 314541 312199 311740 312849 313153 312496 312650 313433 313078 311952 312100 313592 315104 317561 323211 331252
57403 331252 338119 341995 343771 343993 342391 340068 338697 337869 336311 335001 335801 337930 339323 340536 343599
57388 343599 347891 351051 353230 356548 361042 365120 369346 375665 383311 389535 393988 398372 402267 403546
57374 403546 402654 402278 402823 402284 400424 398944 397581 394229 389081 384612 381325 377504 373239 370613 369738
57359C69738j035j025J289L696L648K982M239N895N696N223O620Q198P747O920
57345D29831P867Q749P112M550L663L497K289J520K812M059L028J666K411L546
57331D86600K705J618K666L995K931J154J465K525J775O54J735L493L151K053
57317E18520K960M596M121K667L052M317L804K586L465N478N728M819N334O615
57303E78062O177M789N034O267N950M596M576N388M864L731M273N802O005N380
57289F50894N915O849O260N268O197Q038Q286P589Q092Q927Q059O866Q000J0332
57275G55572J0878J0234J1117J3077J3677J3468J4666J6202J5333J2989J2435
57264H99648J3586J3749J2931J3371J4726J4785J4110J4992J6712J6774J5870
$$ plain form
57359 369738 368703 367678 368967 372663 376311 379293 383532 389427 395123 400346 406966 415164 422911 429831
57345 429831 437698 446447 453559 458109 461772 465269 467558 469078 471890 475949 478977 480643 483054 486600
57331 486600 489305 490923 493589 497584 500515 501669 503134 505659 507434 508088 509823 513316 516467 518520
57317 518520 521480 526076 530197 532864 535916 540233 544037 546623 550088 555566 561294 566113 571447 578062
57303 578062 584239 589028 594062 600329 606279 610875 615451 620839 625703 629434 633707 639509 645514 650894
57289 650894 656809 663658 669918 675186 681383 689421 697707 705296 713388 722315 730374 737240 745240 755572
57275 755572 766450 776684 787801 800878 814555 828023 842689 858891 874224 887213 899648
57264 899648 913234 926983 939914 953285 968011 982796 996906 1011898 1028610 1045384 1061254
57253A061254J6623J8334J8236J7064J8007K0700K1638K0206J9182J9456J9278
57242A269978J8561J9028K0283K0387J9963K1147K3037K3029K1923K2725K4983
57231A505044K5511K4289K4313K5912K6521K5959K6659K8635K9408K8930K9520
57220A800701L0994L1054L0292L1473L3937L4347L3086L4124L8063M1126M1806
57209B181003M2891M5800M8392M9646N1344N3836N5066N5025N6270N8879N9742
57198B757894N8068N6773N7270N7592N6949N7288N9007N9768N8993N9136O1122
57187C399860O2928O3830O5634O8513P0194P0386P1560P4125P5519P5213P5942
57176D173704P8555Q0431Q0453Q0908Q2815Q3939Q3268Q3058Q4730Q6868Q8781
$$ plain form
57253 1061254 1077877 1096211 1114447 1131511 1149518 1170218 1191856 1212062 1231244 1250700 1269978
57242 1269978 1288539 1307567 1327850 1348237 1368200 1389347 1412384 1435413 1457336 1480061 1505044
57231 1505044 1530555 1554844 1579157 1605069 1631590 1657549 1684208 1712843 1742251 1771181 1800701
57220 1800701 1831695 1862749 1893041 1924514 1958451 1992798 2025884 2060008 2098071 2139197 2181003
57209 2181003 2223894 2269694 2318086 2367732 2419076 2472912 2527978 2583003 2639273 2698152 2757894
57198 2757894 2815962 2872735 2930005 2987597 3044546 3101834 3160841 3220609 3279602 3338738 3399860
57187 3399860 3462788 3526618 3592252 3660765 3730959 3801345 3872905 3947030 4022549 4097762 4173704
57176 4173704 4252259 4332690 4413143 4494051 4576866 4660805 4744073 4827131 4911861 4998729 5087510
57165E087510R1785R5503R7112R5786R3630R1097Q6034P8550P2006O7511O2269
57154F018793N5017M8372M3838L9310L3513K8278K4339J9498J3133P994N383L056
57142F340524N7j066R07L413M824P007J0803J3649J4193J4716J6339J6513J3847
57129F455726J0880R276P101L667K224M666Q295J1119J5517K3118L0831L5821
57117F618241L9855M4709M7861M7168M5740M7764N3255O1210P3892R3381J17355
57106G290431J42897J71409K05968K47710K99222L67602M59395N76156P19695
57097A0480485Q98075J121551J396432J727384K120138K574303L076394L605957
57089B7000719M144782M674126N168720N602025N950663O181115O238569O070492
$$ plain form
57165 5087510 5179295 5274798 5371910 5467696 5561326 5652423 5738457 5817007 5889013 5956524 6018793
57154 6018793 6073810 6122182 6166020 6205330 6238843 6267121 6291460 6310958 6324091 6332085 6337468 6340524
57142 6340524 6340581 6339515 6340422 6343835 6348659 6355666 6366469 6380118 6394311 6409027 6425366 6441879 6455726
57129 6455726 6466606 6475882 6482983 6486650 6488874 6493540 6501835 6512954 6528471 6551589 6582420 6618241
57117 6618241 6658096 6702805 6750666 6797834 6843574 6891338 6944593 7005803 7079695 7173076 7290431
57106 7290431 7433328 7604737 7810705 8058415 8357637 8725239 9184634 9760790 10480485
57097 10480485 11378560 12500111 13896543 15623927 17744065 20318368 23394762 27000719
57089 27000719 31145501 35819627 40988347 46590372 52541035 58722150 64960719 71031211
57081G1031211N666908N060606M278979L313202K153762Q49266m89702j747582
57073I0116650k853707l780371m517882n070061n463258n734772n901616n947325
57065E0847658n844691n587511n198927m718048m186930l645601l127328k652883
57057A5885739k231299j866330j559090j305452j096602r24467p83964o69709
57049E448826n74745m94061m26055l69205l20553k78580k44008k16115j91647
57040B333857j68964j49812j35083j22330j09638r8547r0543q3782p6151o8667
57030A230340o2872n7424n0424m2864l6584l0734k3490j5528q355m56J1216K6655
57018I39480M3801O4586R5096J35142J68196J67070J15522K6125o5892j29108
$$ plain form
57081 71031211 76698119 81758725 86037704 89350906 91504668 92353934 91864232 90116650
57073 90116650 87262943 83482572 78964690 73894629 68431371 62696599 56794983 50847658
57065 50847658 45002967 39415456 34216529 29498481 25311551 21665950 18538622 15885739
57057 15885739 13654440 11788110 10229020 8923568 7826966 6902499 6118535 5448826
57049 5448826 4874081 4380020 3953965 3584760 3264207 2985627 2741619 2525504 2333857
57040 2333857 2164893 2015081 1879998 1757668 1648030 1549483 1458940 1375158 1299007 1230340
57030 1230340 1167468 1110044 1059620 1016756 980172 949438 925948 910420 902065 901609 912825 939480
57018 939480 983281 1047867 1142963 1278105 1446301 1613371 1728893 1755018 1689126 1560018
57008A560018j55968j57900j47316j29806j09323r1051p6936o4526n2583m3390
56998E31219l7847l3201k7760k3408k1271j9130j5545j2521j1702j1629j1029
56987C06176j0949j1324r235l061N088J2825J9282K1717J5524R37j4682k4552
56975C07746k8702k9915k8263k3473j8272j4946j1977p861m667m044l372n9L983
56962A36178O310Q837J4270K1177K7337L4615M4840N3198N1384L6580J3413j1252
56950D36887l1614m3355m5688m2468l8060l3162k6981k0829j6202j1798o084n37
56938A20109L100O275J0943J5977J9914K4665L2822M3658N4744O4104O7226N6555
56926E20092K9723m242l2265m8740n5764n5717m9801m1616l5511l1712k7768k3654
$$ plain form
57008 1560018 1404050 1246150 1098834 969028 859705 768654 691718 627192 574609 531219
56998 531219 493372 460171 432411 409003 387732 368602 353057 340536 328834 317205 306176
56987 306176 295227 283903 274668 271607 276695 289520 308802 330519 346043 346980 332298 307746
56975 307746 279044 249129 220866 197393 179121 164175 152198 144337 139670 135626 132254 132195 136178
56962 136178 142488 151325 165595 186772 214109 248724 293564 346762 398146 434726 448139 436887
56950 436887 405273 361918 316230 273762 235702 202540 175559 154730 138528 126730 120646 120109
56938 120109 123209 129484 140427 156404 176318 200983 233805 277463 332207 396311 463537 520092
56926 520092 549815 545573 513308 464568 408804 353087 303286 261670 226159 194447 166679 143025
56914A43025k0933j8497j4196r368o997o571n385l567l135l439k318n18k89q50
56900D6962J11J779J784J007K082M386N386N660P697J0924J2894J4171J7143K1275
56886A53261K4576K8180L3709L7279L2417J8930L336r319j8705k4723k5893k3138
56874B29910j9889j7281j3484q234l736n70L064P640J1756J5540K0787K7598L4646
56861B87747M2718N4284O9172Q3235R0452Q4237N9908K0872j9485m7428n9896
56850F65816o2522n9740n2500m3240l5510k8787j9884r457j261M732J2348K2433
56838C92428L2163M1278N2912O8099Q5511J06288J31059J50373J46167J07949
56828A314227M4226k4196p8732j10583j20498j15623j04225r0796p6491o2791
$$ plain form
56914 143025 122092 103595 89399 80031 73034 66463 61078 57511 54376 50937 48619 48101 47812 46962
56900 46962 47073 48852 50636 51643 53725 58111 63497 69157 76854 87778 100672 114843 131986 153261
56886 153261 177837 206017 239726 277005 309422 328352 331688 322369 303664 278941 253048 229910
56874 229910 210021 192740 179256 171022 167286 166716 169780 177420 189176 204716 225503 253101 287747
56861 287747 330465 384749 453921 537156 627608 711845 771753 792625 773140 725712 665816
56850 665816 603294 543554 491054 447814 412304 383517 363633 354176 352915 357647 369995 392428
56838 392428 424591 465869 518781 586880 672391 778679 909738 1060111 1206278 1314227
56828 1314227 1358453 1334257 1255525 1144942 1024444 908821 804596 713800 637309 574518
56818E74518n1231m0598k8873j7523r505l561M582J5680K6768L7397N0956O9048
56806F27658Q8472J03031J04232Q2894L7641j8052o4082r0274j00070r9636r1319
56795E80495p8130o5629n5969m6180l4808k4605j6915r428j506M297P979J3344
56783B72945K1507K9312L6222M5889N7548O2207N1894K8371j89k6574m5964n5416
56771D77752n6104n2787m8393m2224l4569k8432k4916k1620j7472j4541j3373
56760A23321j1551q578p155p748p156m389k589l065k975j053n5j097j265N97J426
56745F6668l2n46J317K049l04k230r08J049P34k66P3K77q31j126N11J443K03m90
56727F7591J100K346J406Q23K515L997L206K372L374M032K607J394K121K433O25
$$ plain form
56818 574518 523287 482689 453816 436293 426788 423227 427809 443489 470257 507654 558610 627658
56806 627658 716130 819161 923393 1006287 1043928 1025876 961794 871520 771450 671814 580495
56795 580495 502365 436736 380767 334587 299779 275174 258259 248831 247325 251622 259601 272945
56783 272945 294452 323764 359986 405875 463423 525630 577524 605895 605706 579132 533168 477752
56771 477752 421648 368861 320468 278244 243675 215243 190327 168707 151235 136694 123321
56760 123321 111770 103192 96037 88289 81133 76744 74155 71090 68115 67062 67007 65910 64645 65242 66668
56745 66668 66636 66090 67407 69456 69152 66922 66014 67063 67797 67531 67604 67881 67050 65924 66435 67878 68081 67591
56727 67591 68691 71037 72443 73266 75781 79778 82984 85356 88730 92762 95369 96763 98884 101317 101942
56712A01942q12M9R59K67L81K635L790J675n37J26J454Q54K37J677K908J757N47
56695A19909J484K155K85j471l37J360O26p01J70J645J208M38J698L403L285K815
56679A37972L866M700L676L060M642N528K978m92j512j359k467l430k380j301
56665A53481k060k234K10K189O66j613r99N79l88k321j805L7L21J80J961L774
56649A51978K687M32K88J106Oj871j749n22l75k9K248L963K237o72j114l14j307
56632A56992k802j919j51o79k417k427j636k449l403k019j80r02k404j296R81
56617A33289R12n44k07J002J39j699j484j56m77j248K81K543K191L28J35O29j039
56600A34595l314k687l74j81j506q26J519K318J689K181L224K398P58J030K144
$$ plain form
56712 101942 101130 101179 102138 102405 102786 105421 109211 110886 110349 110475 111929 112783 113020 114697 117605 119362 119909
56695 119909 121393 123548 123833 122362 122025 123385 124011 123310 123480 125125 126333 126771 128469 131872 135157 137972
56679 137972 141838 146538 150214 153274 157916 163444 166422 165930 164418 163059 160592 157162 154782 153481
56665 153481 151421 149187 149397 151586 152252 150639 149640 150219 149831 147510 145705 145742 146063 146243 148204 151978
56649 151978 154665 155097 155385 156491 156497 154626 152877 152355 151980 151951 154199 158162 160399 159727 158613 158299 156992
56632 156992 154190 152271 152120 151441 149024 146597 144961 142512 139109 137090 136910 136008 133604 132308 133289
56617 133289 134201 133657 133450 134452 134591 132892 131408 131252 130775 129527 129808 132351 134542 134870 135005 135634 134595
56600 134595 131281 128594 128220 128039 126533 125707 127226 129544 131233 133414 136638 139036 139794 140824 142968
56585A42968J314l18J50J543Q72o88j26J294M58j171r6K315K121J84N26K877L606
56568A57829K668L011M381M184L342M869P896R292R898J3073J8532K3453K7588
56555B90016L1004K9419J9113M571n977j0903j4094j6001j3909r515p707q358
56543B87659p229m393l990o083o560m948m756o151n689l307k394l062k379r83
56529B25735k226n072n135k548j559k525j728R71J729J25l40P96M72j364j793
56514B05538j213k553m682l861j304j626m252m249j419m25j911j826J71J5k512
56499A73891l070j081o30k293k116K97Q83p71m81K208K860N40n52P78R15q78r16
56482A69584J336J865j48q83N26O57p62KK820L081L56m61J750K432K26o03J343
$$ plain form
56585 142968 144282 143964 144114 145657 146529 145841 145715 147009 147467 146296 146200 148515 150636 150820 151346 154223 157829
56568 157829 160497 163508 167889 172073 175415 180284 188180 197472 207370 220443 238975 262428 290016
56555 290016 321020 350439 369552 374123 368146 357243 343149 327148 313239 303724 296017 287659
56543 287659 280430 276037 272047 265964 259404 254456 249700 243549 237860 234553 232159 229097 226718 225735
56529 225735 223509 218437 213302 210754 209195 206670 204942 205913 207642 207767 207427 208223 208695 207331 205538
56514 205538 204325 201772 197090 193229 191925 190299 186047 181798 180379 179954 178043 176217 176388 176403 173891
56499 173891 170821 169740 169110 166817 164701 164998 165881 165110 164629 166837 169697 170237 169685 170463 171378 170500 169584
56482 169584 170920 172785 172637 171754 172280 172937 172175 172177 174997 178078 178434 177973 179723 182155 182381 181778 183121
56465A83121K021J05m57J561K105j94j339K61R85n82j038P11J224l07k49J996
56449A89924K377J80k45K163L108J447J546M588N776L020M19K72m62k952l727
56434B07434j930j569l685m107j611m12j874j888P80J801k51j058R28J547o10
56419A93495j235J091J912k88r96J398K292q9j140J050J897o06j933N9J089p65
56403A97231j206J312J924j113k391O09K644O65o08J900L710J726J54J985L190
56388B11732R85n70J190K122l77j964J44J639l41j554P91K288m1j749M16K246
56372B16957M49r12J459L632K170M46J348J660n12r67K137L563N61j479J078L434
56356B35024J881P74L387M893J787p62J596M192K297k69P33J673j146l563j406
$$ plain form
56465 183121 185142 185247 184790 186351 188456 188262 186923 187184 188169 187587 186549 187260 188484 188177 187928 189924
56449 189924 192301 192481 192236 194399 197507 198954 200500 205088 210864 213884 214303 214575 214113 211161 207434
56434 207434 205504 203935 200250 196143 194532 194120 192246 190358 191138 192939 192688 191630 192558 194105 193495
56419 193495 192260 193351 195263 194975 193979 195377 197669 197580 196440 197490 199387 198781 196848 196907 197996 197231
56403 197231 196025 197337 199261 198148 195757 196366 199010 199675 199067 200967 204677 206403 206557 208542 211732
56388 211732 212717 212147 213337 215459 215082 213118 213262 214901 214560 213006 213797 216085 216044 214295 214711 216957
56372 216957 217406 216494 217953 221585 223755 224201 225549 227209 226697 225730 227867 231430 231991 230512 231590 235024
56356 235024 236905 237679 241066 245959 247746 246984 248580 252772 255069 254800 255533 257206 256060 252497 251091
56341B51091J505J004L49K755M254J725m2K889N874M566L191N902Q289N957L196
56326C02505M612O297M065K142M715P019M027N9M53J642j112m022k402j63k077
56311C27760m206j769J089p36l216j019K097Q71r52J952N868N264L548O105R561
56296C52217Q478N962P108Q684N856K437L914O889N900M003O082Q587O617M287
56282D37021P160J1252J0505Q201R937J2280R838O633Q769J2615J1926R903J2352
56269E68392J5744J4200J1554J4222J8645J8360J6840K0649K6292K6927K5817
56258G77642L0043L6853L9531M0929M7918N8029O4842P0971Q2387R5534J03611
56247A448290J10077J22294J37198J46943J53388J63081J73166J76185J73846
$$ plain form
56341 251091 252596 253600 253949 256704 260958 262683 262641 265530 271404 275970 279161 285063 293352 299309 302505
56326 302505 307117 313414 317479 319621 324336 331355 335382 335441 335894 337536 336424 332402 330000 329837 327760
56311 327760 323554 321785 322874 322138 318922 317903 320000 320871 319919 321871 327739 333003 336551 342656 352217
56296 352217 360695 366657 373765 382449 388305 390742 394656 401545 407445 411448 417530 426117 432734 437021
56282 437021 444181 455433 465938 474139 484076 496356 506194 512827 521596 534211 546137 556040 568392
56269 568392 584136 598336 609890 624112 642757 661117 677957 698606 724898 751825 777642
56258 777642 807685 844538 884069 924998 972916 1030945 1095787 1166758 1249145 1344679 1448290
56247 1448290 1558367 1680661 1817859 1964802 2118190 2281271 2454437 2630622 2804468
56238B804468J72155J67960J54321J34125J14426R2632O2523K8613l1k4989n2817
56227C653386p9702r7139j07805j20251j32611j37256j36927j40114j44501j41293
56217B415787j32285j26614j23979j17068j07322j02328j00513r4120q4450p8868
56207A348240p5951o8944o0293n7268n6913n1068m2333l9069l8812l3225k5224
56196G99140k3939k6640k3337j5710j3563j5845j3384p450p200j1199r949m528
56184F26396m251q028o537r45q54n376m903lJ25l622j923M173M990J299K626Q098
56168F11265Q128L826N181J1190J1531O945Q002J4416J5710J1741J2346J7180
56156G37461J6378J0832J1156J6758J6725J1390J1913J8522K0520J8051K2132
$$ plain form
56238 2804468 2976623 3144583 3298904 3433029 3547455 3640087 3702610 3731223 3731192 3706203 3653386
56227 3653386 3573684 3476545 3368740 3248489 3115878 2978622 2841695 2701581 2557080 2415787
56217 2415787 2283502 2156888 2032909 1915841 1808519 1706191 1605678 1511558 1427108 1348240
56207 1348240 1272289 1203345 1143052 1085784 1028871 977803 935470 896401 857589 824364 799140
56196 799140 775201 748561 725224 709514 695951 680106 666722 659272 652072 640873 630924 626396
56184 626396 622145 614117 607580 606635 605781 600405 595502 595499 595624 592002 590079 594252 599242 600541 603167 611265
56168 611265 619393 623219 628400 639590 651121 658066 666068 680484 696194 707935 720281 737461
56156 737461 753839 764671 775827 792585 809310 820700 832613 851135 871655 889706 911838
56145I11838L2571L7860L7974M5324O1600P5435Q4408R7735J15974J29852J40250
56134A770821J56830J75432J79332J64872J44125J21881R3250O4640N2101N5980
56124B979264O0148N7954N5551M9531K7767n042k8616l7084m2968m9969m9073
56113C017463m4572n5343q4651j14947j37339j59475j80031j83988j69809j54175
56103A733133j43204j25537r9622q0181p1086n9216m1792l2293l2786k8514j6501
56092A002401j1243j5390j3819l681n34p292p399L080P336K52k007O183R636L447
56078I70970K875J2157J5017O731M023J2411J5605Q191O424J5375J8362J0509
56066A098650R349K0098K4432J6188J3509K2593K4809J3504P873J5741J8683R071
$$ plain form
56145 911838 944409 982269 1020243 1065567 1127167 1202602 1287010 1384745 1500719 1630571 1770821
56134 1770821 1927651 2103083 2282415 2447287 2591412 2713293 2806543 2871183 2923284 2979264
56124 2979264 3039412 3097366 3152917 3202448 3230215 3225173 3196557 3159473 3116505 3066536 3017463
56113 3017463 2972891 2917548 2832897 2717950 2580611 2421136 2241105 2057117 1887308 1733133
56103 1733133 1589929 1464392 1364770 1284589 1213503 1154287 1112495 1080202 1047416 1018902 1002401
56092 1002401 991158 975768 961949 958268 957734 950442 943043 946123 953459 953711 951704 957887 967523 970970
56078 970970 973845 986002 1001019 1007750 1011773 1024184 1039789 1047980 1054404 1069779 1088141 1098650
56066 1098650 1107999 1128097 1152529 1168717 1182226 1204819 1229628 1243132 1251005 1266746 1285429 1294500
56054A294500N392J5137J9304R941N887J4874J7869P846N456J8632K6028J8655
56042A459521J7625L1721L8513K7909K2623L4147M0268K8505J9644K5491K6080
56031A772047J2218P222K2223L3566K8779L0100M7704N6285M4082L7655N0872
56020B142753N7925M5050L9065N4862O5472N5182N0540O6699P6046O3494N8518
56009B775606P7623R0559P9573P4949R4370J06165R2136Q5987J08048J24218J12993
55998C822227J08923J34144J53004J42393J39020J66843J87875J77397J75219
55989E207045K07289K32054K22619K23546K64713L00382K98619L06088L55549
55980G617904L98163M00569M15873M80544N38846N52428N81517O68351P49775
$$ plain form
56054 1294500 1299892 1315029 1334333 1344274 1350161 1365035 1382904 1390750 1396206 1414838 1440866 1459521
56042 1459521 1477146 1508867 1547380 1575289 1597912 1632059 1672327 1700832 1720476 1745967 1772047
56031 1772047 1784265 1791487 1813710 1847276 1876055 1906155 1953859 2010144 2054226 2091881 2142753
56020 2142753 2200678 2245728 2284793 2339655 2405127 2460309 2510849 2577548 2653594 2717088 2775606
56009 2775606 2853229 2943788 3023361 3098310 3192680 3298845 3390981 3476968 3585016 3709234 3822227
55998 3822227 3931150 4065294 4218298 4360691 4499711 4666554 4854429 5031826 5207045
55989 5207045 5414334 5646388 5869007 6092553 6357266 6657648 6956267 7262355 7617904
55980 7617904 8016067 8416636 8832509 9313053 9851899 10404327 10985844 11654195 12403970
55971A2403970P81557Q33386R56736J082213J160565J273057J479343J699167
55963B1669994J880039K127387K520806K974582L448701M106602N070043O227272
55955E0025426P501782R070844J1070363J3382572J6038261J9495253K4157419
55948A50741920L0100686L7735163M7708974N8481890O4201998N7382829L5556541
55941D81910001M884952k3896270m3079582n1503475n2148962m8370641m2531859
55934B25264164l6296318l0645898k5737841k1374482j7564293j4422126j1847784
55927F7375422r657002p847701o471685n407296m489290l721502l162727k735252
55919B3882967k327906j968117j724045j543485j342057j151157j035680r55818
$$ plain form
55971 12403970 13185527 14018913 14975649 16057862 17218427 18491484 19970827 21669994
55963 21669994 23550033 25677420 28198226 31172808 34621509 38728111 43798154 50025426
55955 50025426 57527208 66598052 77668415 91050987 107089248 126584501 150741920
55948 150741920 180842606 218577769 266286743 324768633 388970631 446353460 481910001
55941 481910001 486794953 462898683 419819101 368315626 316166664 267796023 225264164
55934 225264164 188967846 158321948 132584107 111209625 93645332 79223206 67375422
55927 67375422 57718420 49870719 43399034 37991738 33502448 29780946 26618219 23882967
55919 23882967 21555061 19586944 17862899 16319414 14977357 13826200 12790520 11834702
55911A1834702q42928p27973o70081o35618n65128m87432m56600m43765l96479
55902F608698l41199l26744l26427k92098k48409k41445k47491k21305j84379
55893D179201j80019j88440j68491j38728j38024j48129j31583j06127j07903
55884B871757j19328j04755q0942q2932r5052q2913o0460n9944o7500n2186k8377
55873B037368k7336l6228k5955j1289k3656n0372n8659n4962o4477p6550o6028
55862A541856m5953m4916n3593m5744l0772l4092m5941m0411k5745k6255l3256
55851A115178k2876m753n080j7787j8967j3393k1037l3424k8721j5416j6879k6898
55839H89947k3601j3223j7030k8350k5186j2979j3081k0805j5976l775m582j3770
$$ plain form
55911 11834702 10991774 10263801 9593720 8958102 8392974 7905542 7448942 7005177 6608698
55902 6608698 6267499 5940755 5614328 5322230 5073821 4832376 4584885 4363580 4179201
55893 4179201 3999182 3810742 3642251 3503523 3365499 3217370 3085787 2979660 2871757
55884 2871757 2752429 2647674 2566732 2483800 2388748 2305835 2245375 2185431 2117931 2065745 2037368
55873 2037368 2010032 1973804 1947849 1936560 1912904 1862532 1803873 1748911 1684434 1607884 1541856
55862 1541856 1495903 1450987 1397394 1351650 1320878 1286786 1240845 1200434 1174689 1148434 1115178
55851 1115178 1092302 1087549 1082469 1064682 1045715 1032322 1011285 977861 949140 933724 916845 889947
55839 889947 866346 853123 836093 807743 782557 769578 756497 735692 719716 715941 711359 697589
55827F97589j1229q20j581r583o674K210j773j3822j4138n566o444j4173j1763
55814F02233k749m158j2074q953J825K833l099P22J1095J1162L948O387J5944
55801F25116J5994Q775J0415J8403J6181N333J558L281m259j8003k1431j6009
55789F45354j7674k5495k4262j5093j3393j8826j6700o922l011m885r51N451K61
55776E03854j2927j6859j0936r861j4329j1258j630J36n984n794J486K540l410
55763D15028l725J871P84p047q700l565l886r810q996j611p86p345q507k680j449
55748C49576n892m978J323J149n798p274k244k280q151q328k360k350r189j0442
55734B82762m215k250o703o540N1J962k942m061O25R12m717n731m68M30n072o602
$$ plain form
55827 697589 686360 685540 683959 674376 667702 669912 668139 654317 640179 634613 628169 613996 602233
55814 602233 599484 595326 583252 574299 576124 578957 575858 576580 587675 598837 602785 609172 625116
55801 625116 641110 649885 660300 678703 694884 700217 701775 705056 700797 682794 661363 645354
55789 645354 627680 602185 577923 562830 549437 530611 513911 506989 503978 499093 498142 503593 503854
55776 503854 490927 474068 463132 453271 438942 427684 426054 426190 420206 414412 415898 418438 415028
55763 415028 411303 413174 413958 406911 398211 394646 390760 380950 371954 370343 369557 362212 353705 351025 349576
55748 349576 343684 338706 340029 341178 335380 328106 325862 323582 315431 307103 304743 302393 293204 282762
55734 282762 278547 276297 269594 263054 263105 265067 262125 258064 258689 259601 254884 249153 248685 249115 244043 237441
55718B37441j885p04m988n177J30R78l972m339J593L301j453k460K699M115m94
55703B24785j104M767O851J727j303J177Q79m453n912j239L70l680m364Q64K866
55688B22231j139k071L079N300J189o43L486N735K799K104O326P807L958K207
55674B62368M498K906m089p191l325j038l661l434K187M804J463N11N060O761
55660B67820K299J05M045O069K014o26K405M426J813R39M410M919l59l704j825
55645B94750k394q824j2994j0344p975j0497j1756q023n653q100q737m041p67
55632A94645k710l354J001L780J054r60J529K624q52k513Q17K295j664m092q77
55617A90723J285k086m834k603j167m407o189k393P96j272l180o90J055j505k738
$$ plain form
55718 237441 235556 234852 229864 224687 224817 225795 221823 217484 219077 222378 220925 218465 221164 225279 224785
55703 224785 223681 228448 235299 237026 235723 236900 237779 233326 227414 226175 226545 222865 218501 219365 222231
55688 222231 221092 219021 222100 227400 228589 227946 231432 237167 239966 242070 248396 256203 260161 262368
55674 262368 266866 269772 265683 258492 255167 254129 250468 247034 249221 254025 255488 255999 261059 267820
55660 267820 270119 270224 274269 280338 282352 281726 284131 288557 290370 291309 295719 300638 300279 296575 294750
55645 294750 292356 283532 270538 260194 252219 241722 229966 221943 216290 208190 199453 195412 194645
55632 194645 191935 188581 189582 193362 194416 193456 194985 197609 196757 194244 195061 197356 195692 191600 190723
55617 190723 192008 189922 185088 182485 181318 176911 170722 168329 169125 167853 164673 163983 165038 163533 160795
55602A60795Q24K953m22l147p13J121k216n138k869m28k210l358j9K294q10l906
55586A42751k041L15j164k217O85K552k64k343M75K883M86j616J047L549J522
55571A46620qL439O663M617K056M318P358O036L627M284M494Q24k276r71j7l664
55555A87400p074n308k521l634n145k849n22k121l534o86K068L55j487J176M110
55540A60228K342l20J172L548K116r9J133K660M40k362k002j667m389n973l158
55525A53669j002l747o305l605l63k253n217l316K15l11k295q00J372m24l025
55510A22593j477J176j43k658j365J185J60k015p90J284k32k547r56J919J250
55495A17384p71K78K185Q94j030M44K425O29j929n88J844N99j732l92K133J103
$$ plain form
55602 160795 161619 164572 164150 161003 160290 161411 159195 154057 151188 150760 148550 145192 145173 147467 146657 142751
55586 142751 140710 141025 139861 137644 138329 140881 140617 138274 138749 141632 142118 140502 141549 145098 146620
55571 146620 146612 150051 156714 161331 163387 167705 175063 181099 184726 189010 193504 194328 192052 191081 191064 187400
55555 187400 180326 175018 172497 168863 163718 160869 160347 158226 154692 154006 156074 156429 154942 156118 160228
55540 160228 162570 162250 163422 166970 169086 168987 170120 172780 173220 170858 168856 167189 162800 156827 153669
55525 153669 152667 148920 142615 139010 138647 136394 131177 127861 128076 127765 125470 124670 126042 125618 122593
55510 122593 121116 122292 122149 119491 118126 119311 119471 117456 116666 117950 117718 115171 114215 116134 117384
55495 117384 116613 116891 119076 119970 118940 119384 121809 122438 120509 119921 121765 122364 120632 120240 122373 123476
55479A23476j058M10L141K201m62k06J276j8j906n29J284q60m024l192p87j783
55463A16963l949k363P81M45j470j77K216P09k635k390P7k64k214j136J544J104
55447A07241j137m74J952J588o32n82P05l98k140p01J673N03k113j279J351R10
55431A06467j212l61K027J288j141n94J442J92k769k256N89N71j524p36K208K363
55415A06554K46O42L154L126P10J27J097j69k658k021Q29J111r45j028O83L20
55399A11778j545j008J092N99j654j307R31O21j643j300J253J309j235j961l62
55384A05568j05j401r85Q21P59m29P06L000K332m18p93R20O77j207q71J107P14
55367A10395j458j267P68M45j759j465J149J828M83Q23K424J435j341j403Q50
$$ plain form
55479 123476 122418 122828 125969 128170 127708 127502 128778 128760 126854 126325 127609 126749 122725 119533 118746 116963
55463 116963 113014 110651 111432 111877 110407 110230 112446 113155 110520 108130 108207 107943 105729 104593 106137 107241
55447 107241 106104 105630 107582 109170 108538 107956 108661 108263 106123 105422 107095 107598 105485 104206 105557 106467
55431 106467 105255 104894 106921 108209 107068 106474 107916 108108 105339 103083 103672 104243 102719 101983 104191 106554
55415 106554 106800 107442 110596 113722 114432 114559 115656 115487 112829 110808 111637 112748 111803 110775 111458 111778
55399 111778 110233 109225 110317 110916 109262 107955 108886 109507 107864 106564 107817 109126 107891 105930 105568
55384 105568 105463 104062 103077 103898 104657 104228 104934 107934 110266 109848 109055 109975 110652 109445 108574 109681 110395
55367 110395 108937 107670 108438 108883 107124 105659 106808 108636 109119 109942 112366 113801 112460 111057 111907
55352A11907P88j571j773K47O3k489k877n19L72r93r20J140J692L34K38J249Q5
55335A06973k478k331J17N44r79k92K369K446j86r13Q20P81j449j623O37Q71j566
55318A03741k166J62J247k39p36P11P23j210j373P84J376l65o78J236J659k83
55302A04589j054K14L16j043l34K397K730p8j628m14N6j297j119J239J926j10
55286A06390j236k19j28j528j020J669K473O15J22J965K090p02k279q64J19r19
55270A06548r71R59J560r0n19J202J405r52k037m43K50j356j758M31J655K71m91
55253A05664R26J562K10j57J229R12j828k811m98J095j97j073M98J632O05O5J205
55236A09039J176p90j214Q76J633l73j374K27P50j313j953P21K505P38r66K30
$$ plain form
55352 111907 112695 111124 109351 109598 109661 107172 104295 103776 104148 103155 102235 103375 105067 105401 105639 106888 106973
55335 106973 104495 102164 102281 102825 101846 101554 103923 106369 106183 105270 106090 106871 105422 103799 104436 105307 103741
55318 103741 101575 101737 102984 102745 102009 102720 103443 102233 100860 101644 103020 102655 101977 103213 104872 104589
55302 104589 103535 103749 104065 103022 102688 105085 107815 107737 106109 105695 105751 104454 103335 104574 106500 106390
55286 106390 105154 104935 104807 103279 102259 103928 106401 107016 107138 109103 111193 110491 108212 107348 107467 106548
55270 106548 105577 106536 108096 108006 107487 108689 110094 109142 107105 106662 106912 105556 103798 104229 105884 106155 105664
55253 105664 106590 108152 108362 108205 109434 110346 108518 105707 105209 106304 106107 105034 105532 107164 107769 107834 109039
55236 109039 110215 109425 108211 109087 110720 110347 108973 109200 109950 108637 106684 107405 109910 110648 109682 109912
55220A09912J242n91k359j341m4q75j435L93K036J221K39J140J712K27q23L29
55204A10983J089m74j803p60N07J05j73P42N05j581k129K61J867L00j321k93R71
55187A08796K4j121m48J88n74m62J506K121k45k182j226m7q92j279P40K427J547
55170A08873N10J241J263r44k068R6K172J213n7J291K846J735R5O24J341j17j490
55153A18624k28J382N21q78p8J124k1j995k095j241j303j223P2N91q89j734j58
55136A10471J171J25p26Q98K359R81r38n97J72r94k085p71P74L9r00M12J795O35
55118A12821q62J39J612O22r27N8J956J595J12K97J187M52p08j27P85r8j119O0
55100A17855J771J415K52N03R10k50j017O40K314J214n59K09K023J775N51J063
$$ plain form
55220 109912 111154 110563 108204 106863 106819 105944 104509 104902 106938 108159 108398 109538 111250 111477 110654 110983
55204 110983 112072 111598 109795 109035 109542 109647 109474 110216 110721 109140 107011 107272 109139 109439 108118 107825 108796
55187 108796 108820 107699 107251 107439 106865 106403 107909 110030 109785 107603 106377 106330 105438 104159 104899 107326 108873
55170 108873 109383 110624 111887 110943 108875 108971 111143 112356 112299 113590 116436 118171 118266 118890 120231 120114 118624
55153 118624 118396 119778 120299 119421 119343 120467 120446 118451 116356 115115 113812 112589 112661 113252 112363 110629 110471
55136 110471 111642 111767 111041 111939 114298 115279 114341 113744 113916 112922 110837 110066 110840 110879 109979 110391 112186 112821
55118 112821 111959 112098 113710 114332 113405 113463 115419 117014 117126 117423 118610 119062 118354 118227 119012 118914 117795 117855
55100 117855 119626 121041 121293 121796 122706 122456 121439 122079 124393 125607 125048 125257 127280 129055 129606 130669
55084A30669K181J327l55l09M83j72j024P1J542R04n64n99m79j930k694m28K109
55067A30732J198j299j243O38P14p81q44L05Q7j155j081j44m44j293p26K72l82
55050A24554j537r36K54l65j700j278J0j40q21P0J362Q42k28M44J564Q17l47N62
55032A23127K047J434J89J053K358R00j731j595O93J348R8k95K18n33j897j420
55016A25994J24K6j114o47Q38P03m72q6J220P42r37j053l7n21j967j558M53J356
54998A23064J047J444J955O02j350j040O83P55m11P3J920K351J486J684K374J099
54982A37736j154j203L55P9j909k129j33Q89qm37L64O24J97P91J906J329l71n14
54964A36412P56R34J62P84K255J723m01p19J183K125J031J90M39M3j106q97O84
$$ plain form
55084 130669 132850 134177 133822 133513 133996 133824 132800 132871 134413 135317 134753 134154 133675 131745 129051 128623 130732
55067 130732 131930 130631 129388 130026 130740 129959 129115 129420 129507 128352 127271 127127 126683 125390 124664 124936 124554
55050 124554 123017 122081 122335 121970 120270 118992 119002 118862 118041 118111 119473 120315 120087 120531 122095 122912 122565 123127
55032 123127 125174 126608 126797 127850 130208 131108 129377 127782 128475 129823 129921 129626 129844 129311 127414 125994
55016 125994 126118 126144 125030 124383 125221 125924 125452 125366 126586 127328 126391 125338 125301 124780 122813 121255 121708 123064
54998 123064 124111 125555 127510 128112 126762 125722 126405 127160 126749 126822 128742 131093 132579 134263 136637 137736
54982 137736 136582 135379 135734 135813 133904 131775 131642 132531 132523 132086 132450 133074 133271 134062 135968 137297 136926 136412
54964 136412 137168 138102 138264 139048 141303 143026 142625 141906 143089 145214 146245 146435 146874 146917 145811 144914 145598
54947A45598J140j14j010q76j069j495o98N58M9j550j440L12R20k1j09J138J620
54930A42953Q69O78J397J779K310M497P130P567O420O533P877Q065P332P976R217
54915B22600P901M165J296p6k364n649p270p071p688r204q831o451n144n548m977
54900A65689k873j855k458k073k14M04q33j160K84R36o4j76J576K749K090J517
54884A63539J999J901R17J248L355M770M567M963P063R051R703R810R197O430
54870B38513K369k03j280l609p340r356q802q347q991q480o262m969n459n190
54856A62594l259k263l347l972k562j004o61k32O45P5j945k441m47J098L91n75
54840A42095k97l80j748k426j358n52j211j579n64J80k20j02J058J141m92j283
$$ plain form
54947 145598 146738 146624 145614 144738 143669 142174 141476 142034 142083 140533 139093 139405 140325 140304 140195 141333 142953
54930 142953 143822 144500 145897 147676 149986 154483 161613 169180 175600 182133 190010 198075 205407 213383 222600
54915 222600 230501 234666 235962 235886 233522 227873 220603 213532 205844 196640 187809 181358 176214 170666 165689
54900 165689 162816 160961 158503 156430 156216 156620 155787 154627 154911 155847 155783 155607 157183 159932 162022 163539
54884 163539 165538 167439 168356 169604 172959 177729 182296 187259 194322 203373 213076 222886 232083 238513
54870 238513 240882 240679 239399 235790 228450 219094 210292 201945 192954 184474 178212 173243 167784 162594
54856 162594 159335 157072 153725 149753 147191 146187 145526 145294 145939 146014 144069 141628 141181 142279 142670 142095
54840 142095 141798 141418 139670 137244 135886 135334 134123 132544 131980 132160 131940 131838 132896 134037 133545 132262
54824A32262Q1J330Q16J91P42Q42o56j946j540o75n22j79P23P59k61m21O80R63
54806A33189k5L6J754K492J152K83J395K295J382N69J387J991P28q80j203j233
54790A45312j857j724j71R64O40M93J424J696M92j33R76J779P58m40k76J58n1
54773A50040M31K266L741L983M576O158O905O255O362Q019Q947Q111P649Q302
54759B31745P259L194p97k164k859n205p667q023p282p183p011n918n333o037
54745A76719n973l779j534j172j338n29n5j037j654l92J004P68K51R93J718J068
54729A65058L52Q52J409J309K335N215P424P331P110Q607R789Q475O153M782L111
54714B39312l36l824n403o261p818q625p481o381o925p044m929k893l402m482
$$ plain form
54824 132262 132343 133673 134489 134680 135422 136264 135608 133662 132122 131447 130925 130746 131469 132228 131967 131546 132226 133189
54806 133189 133164 133200 134954 137446 138598 138881 140276 142571 143953 144522 145909 147900 148628 147748 146545 145312
54790 145312 143455 141731 141560 142524 143164 143657 145081 146777 147269 147136 148112 149891 150649 150209 149933 150091 150040
54773 150040 150471 152737 156478 160461 165037 171195 178100 184355 190717 198736 207683 215794 223443 231745
54759 231745 239004 242198 241401 239237 236378 231173 223506 215483 208201 201018 194007 188089 182756 176719
54745 176719 170746 166967 165433 164261 162923 162394 162339 161302 159648 159256 160260 161028 161279 162272 163990 165058
54729 165058 165410 166262 167671 168980 171315 176530 183954 191285 198395 207002 216791 225266 231419 236201 239312
54714 239312 238976 235152 229749 223488 215670 207045 199564 193183 186258 179214 174285 171392 167990 163508
54700A63508l192p69o6o15m09q9j180k434k011j143j701k381j248K76q4j145o12
54683A44705N05oj081l32J295J118n18j222r12j201j718r54L22K04q26r19k64
54666A38196j93k48O21J335M70p10k90P51L61p44n11N96O49j16j12L83P2n17j66
54647A39827M03M1k05Q80J748M82j457j369K66J002O65Q04J128J43j585k145j515
54630A39113j018n85N81J661J465Q49J152J577Q13k84m72p40k196l212j946J16
54614A36874N00j63K01J108Q59J60O64J454P39l53M05K095K102O06k27l04j031
54597A45689j797j000M27L56n89k39R22P20m56l50Q91J085R9k79L9l20q47J40
54579A44491J871J902L04n85j84K3k28J31O75R1q04j18J424J403n0n31L58O65
$$ plain form
54700 163508 160316 159547 159481 158866 158457 158368 157188 154754 152743 151600 149899 147518 146270 146546 146462 145317 144705
54683 144705 145210 145204 144123 143791 145086 146204 145686 144464 143552 142351 140633 139679 140001 140205 139379 138460 138196
54666 138196 138003 137755 138376 139711 140181 139471 139181 139932 140293 139549 139038 139634 140283 140167 140055 140438 140510 139993 139827
54647 139827 140230 140271 140066 140946 142694 143176 141719 140350 140616 141618 142283 143087 144215 144358 142773 140628 139113
54630 139113 138095 137510 138091 139752 141217 142066 143218 144795 145608 145324 144852 144112 141916 138704 136758 136874
54614 136874 137374 137211 137412 138520 139379 139539 140203 141657 142396 142043 142448 144543 146645 147251 147024 146720 145689
54597 145689 143892 142892 143319 143675 143086 142847 143769 144489 144033 143683 144574 145659 145758 145479 145518 145198 144351 144491
54579 144491 146362 148264 148568 147983 147799 147822 147594 147725 148400 148491 147687 147569 148993 150396 150346 149815 150173 150838
54561A50838r6l38K82L45l53l75N32J074Q84P00L42q23j835j277Q7N28M22J175
54543A52112K039J249m55p02O59J763K098K492K517J236k15j03O21o8j356r57
54527A62930N36N83o77q42K54M77l83m33M12L40n81m65M68O4j531j758j48R17
54509A60163N02L61J269J676P95j90o50j284j862j200K78Q48M47N33J095Q52R2
54492A63725J71M87n43j978j480L08M71j122j608j49R54O26M65J133J184L83M72
54475A63499J676J983Q04J2N24J126J324K096L065K434M61l54O77J491J051P01
54459A82570J053R48K36K49P18l43k819l971k644p79J43P80J309N54j234j979
54443A74791j245q64j379j178l3P4j261j769m20Q91R07Q81J573J607L20p34n88
$$ plain form
54561 150838 150742 150404 150686 151031 150678 150303 150835 151909 152793 153493 153835 153012 151177 149900 149987 150515 150937 152112
54543 152112 154151 155400 154945 154243 154902 156665 158763 161255 163772 165008 164793 164690 165311 165243 163887 162930
54527 162930 163466 164049 163372 162530 162784 163261 162878 162445 162857 163197 162616 162151 162619 162683 161152 159394 159246 160163
54509 160163 160665 161026 162295 163971 164766 164576 163926 162642 160780 159580 159858 160706 161153 161686 162781 163633 163725
54492 163725 163896 164383 163840 161862 160382 160690 161161 160039 158431 158282 159236 159862 160327 161460 162644 163027 163499
54475 163499 165175 167158 167962 167974 168498 169624 170948 173044 176109 178543 179004 178650 179327 180818 181869 182570
54459 182570 183623 184571 184807 185056 185774 185431 182612 178641 175997 175218 175361 176141 177450 178004 176770 174791
54443 174791 173546 172682 171303 170125 170092 170166 168905 167136 166716 167607 168514 169395 170968 172575 172895 172161 171573
54426A71573l50o28l46P16J083L87J45P24M84r17j458j46J420J992K267K553J819
54409A81318J38r06j138k086l525l119n94J285J103P47J563K114J357P51J305
54394A80313J709J090O52R55O17o83r95M02J430Q43L37J163J764Q01m38o96j003
54377A88261k151k654j368L79J233J998L360M021L093K051K281K893K736K420
54363B08553K535K159Q23j78r8j20r59j348m86L52K05P6P25J080M09k59k88o87
54345B12494j836k374j738j360k076k697k474k406k844k524j211n04q63o86L42
54330A87243K42j528k617j715o82r21j012J02Q54K28q7J010J711O88k70M27J236
54313A84909M90n00p9P07L61k72j13j51j131j485k33O52n11k015j656l02J97K22
$$ plain form
54426 171573 171223 170595 170249 170965 172048 172435 172580 173304 173788 172871 171413 171267 172687 174679 176946 179499 181318
54409 181318 181456 180550 179412 177326 173801 170682 170088 171373 172476 173223 174786 176900 178257 179008 180313
54394 180313 182022 183112 183764 184719 185336 184653 183658 184060 185490 186333 186670 187833 189597 190398 189960 189264 188261
54377 188261 186110 183456 182088 182467 183700 185698 189058 193079 196172 198223 200504 203397 206133 208553
54363 208553 211088 213247 214070 213892 213794 213674 212715 211367 210881 211233 211438 211514 212239 213319 213728 213469 213181 212494
54345 212494 210658 208284 206546 205186 203110 200413 197939 195533 192689 190165 188954 188450 187587 186901 187243
54330 187243 187485 185957 183340 181625 180943 180022 179010 179112 179966 180194 180107 181117 182828 183516 183246 183673 184909
54313 184909 185399 184899 184820 185527 185888 185616 185503 185352 184221 182736 182503 183155 182644 180629 178973 178671 178868 179090
54295A79090P57R15m9n55N77J578P24m37J38J320J068J54K76N64n99k025j510
54278A81986K75J013N57L33K42o54j476p37P31R37M3k46L08N77M45O11P89L51
54260A86085m2N14J389J554J400J645J728J091O24J052J436J016P99J393J360
54245B03044k02j534j036j37p39j841j481k76n6n79n43m14j336k442k074o77J33
54228A87810K90O58R20N17M32J636K938K724J588R65N98l30j092q62o63j490k139
54211A94500j369m88j065j902j147L50P63N94J124J279n10k706k544m28R24P77
54195A88152N10L75m78j397j008ko9o63K7J525J724N90M8M63M02k28J07J715L144
54176A94937L596L466K749J269R8L74J097M69j091j744j418j564k297k380j772
$$ plain form
54295 179090 179847 180762 180713 180158 180735 182313 183037 182600 182738 184058 185126 185280 185556 186120 185521 183496 181986
54278 181986 182261 183274 183831 184164 184406 183752 182276 181539 182270 183207 183250 183004 183312 183889 184334 184945 185734 186085
54260 186085 186043 186557 187946 189500 190900 192545 194273 195364 195988 197040 198476 199492 200291 201684 203044
54245 203044 202842 201308 200272 200135 199396 197555 196074 195798 195742 195163 194620 194206 192870 190428 188354 187677 187810
54228 187810 188100 188758 189678 190195 190627 192263 195201 197925 199513 200478 201076 200746 199654 198792 198129 196639 194500
54211 194500 193131 192643 191578 189676 188529 188879 189642 190236 191360 192639 192129 189423 186879 186451 187375 188152
54195 188152 188662 189037 188559 187162 186154 186152 186083 185420 185447 186972 188696 189286 189334 189797 190199 189971 190078 191793 194937
54176 194937 198533 201999 204748 206017 206115 206489 207586 208055 206964 205220 203802 202238 199941 197561 195789
54161A95789j529j486n90Q00J320J046J157J527R94k99j180j602k321k915k446
54146A88265j524j414j667j008R9K81n4N58J756J875R26M33O16L20m83o75k49
54129A88055k12m64n5O97O28jJ46J142J948K423L090L467K865K236K962M438N208
54112B18573N728P428R618R989P922M853J721j503m177n276n196n131n093m538
54098B34918m131m678n125m043k254j581j878j816j604k164k583j308Q00J602
54084B04155J119R76J185N30m82k68P53Q16Rj55J68k30n89Q91L450M563M045L882
54066B24818M268L461J582P98J429J391N6q24n71o39j508j731q27j96l65j69O87
54049B31660R97N85Q25J979K684K537K660L273L335K959L548N116O104O128O308
$$ plain form
54161 195789 194260 192774 192184 192984 194304 195350 196507 198034 199028 198729 197549 195947 193626 190711 188265
54146 188265 186741 185327 183660 182652 182751 183032 182978 183536 185292 187167 188093 188526 189142 189462 188979 188304 188055
54129 188055 187843 187379 187324 188021 188649 188648 188794 189936 191884 194307 197397 200864 203729 205965 208927 213365 218573
54112 218573 224301 231729 241347 251336 259258 264111 265832 264329 260152 254876 249680 244549 239456 234918
54098 234918 230787 226109 220984 216941 214687 213106 211228 209412 207808 205644 203061 201753 202553 204155
54084 204155 205274 206250 207435 207965 207483 207215 207968 208784 208793 208638 208806 208576 207987 208878 212328 216891 220936 224818
54066 224818 229086 232547 234129 234927 236356 237747 237803 236979 236408 235769 234261 232530 231703 231507 231142 230973 231660
54049 231660 232657 233242 234067 236046 238730 241267 243927 247200 250535 253494 257042 262158 268262 274390 280698
54034B80698O739O366N536N792O893P028O196O301P548P899O656N444N006M152
54020C68254K566J697J932J834R93P99J531J495n6j803k932m147n476n800n283
54005C55604n542o702p045o196n809o366o288n048m225m471m339l125k133k100
53991B86215j996j361j210j792j978j681k157l299l406k289j660j787r35J088
53977B61752K109J377Q91J807K767L032M096O778R681J1788J3458J3729J0151
53964C43416L044l494o685q052r588j0368r236p522o550n244k768q47q70j134
53950B74102L20K351K818K099J911K355K631L125M486N911O371O375O779P212
53936C28846P149P088P202O460M486K575J563N34r94j683o92O42J106J587L047
$$ plain form
54034 280698 287437 293803 299339 305131 312024 319052 325248 331549 339097 346996 353652 359096 364102 368254
54020 368254 370820 372517 374449 376283 377276 378075 379606 381101 381045 379242 376310 372163 366687 360887 355604
54005 355604 350062 343360 336315 330119 324310 317944 311656 306608 302383 297912 293573 290448 288315 286215
53991 286215 284219 282858 281648 279856 277878 276197 274040 270741 267335 265046 263386 261599 260664 261752
53977 261752 263861 265238 266129 267936 270703 273735 277831 284609 294290 306078 319536 333265 343416
53964 343416 346460 342966 336281 328229 318641 308273 299037 291515 284965 279721 276953 276106 275236 274102
53950 274102 274422 276773 279591 281690 283601 285956 288587 291712 296198 302109 308480 314855 321634 328846
53936 328846 335995 343083 350285 356745 361231 363806 365369 365903 364909 363226 362534 363176 364282 365869 368916
53921C68916M525N018N418O701P920P943P543P890Q451Q305Q008Q482R300R719
53907D74139J0063J0578J0327Q724O814N632M613K931J073k24j209k170k706k843
53893E25742l397m384m798m733n713q044j0022j0730j1289j2244j2237j0683r277
53880D18191r241r387q551p630p452o992n570m561m957n370m506l540l938m871
53866C31625m951m656m961n178m329l097k563k445k286k733l949m521l694k881
53852B79381l288l859l361k486k136j597l52L10m37j093l64M87k6q25k88P66O14
53835B61446l76p00l37j46K4N38O28j88p20m9O87L31j86K59P10l5j045r15j85
53816B59741J28O67K066K896J839L51N49J792K024J268J164K082L116M110N317
$$ plain form
53921 368916 373441 378459 383877 390578 398498 406441 413984 421874 430325 438630 446638 455120 464420 474139
53907 474139 484202 494780 505107 513831 520645 526277 530890 533821 534894 534670 533461 531291 528585 525742
53893 525742 522345 517961 513163 508430 502717 494673 484651 473921 462632 450388 438151 427468 418191
53880 418191 408950 399563 391012 383382 375930 368938 363368 358807 353850 348480 343974 340434 336496 331625
53866 331625 326674 322018 317057 311879 307550 304453 301890 299445 297159 294426 290477 285956 282262 279381
53852 279381 276093 272234 268873 266387 264251 262654 262302 262612 262175 261082 260718 261205 261179 260354 260066 260832 261446
53835 261446 261070 260370 260033 259887 259911 260449 261077 260889 260169 260120 260807 261138 260952 261211 261921 261886 260841 259926 259741
53816 259741 259869 260536 262602 265498 267337 267688 268237 270029 272053 273321 274485 276567 279683 283793 289110
53801B89110O046N814N796P122Q808R355R178R319R245Q088O687O137N615M127
53787C90447K902L524M876M672K947J503Q03Qq37j197j857l856o260p285p007
53772C83383o816o972o777o387o338o132n199m428m801n565n603n408n730n690
53758C01537m364k889k655k852k119j222j555k358k072j240j328j855j468p31
53744B72829j072j964j963j491j783k101r38Q63J225L24J6M87M20q4K43J149J266
53727B67426P90J002J611J307M89O11J333J171M82Q78K044K172J309J275K295
53712B86195K653J832J171J258J209P74P69J277J639K048L051L844L435K939M092
53697C18186N996O167M530L447L869M357M046L734L794L562L049K903K654J355
$$ plain form
53801 289110 295156 300970 306766 313888 322696 332051 341229 350548 359793 367881 374568 380705 386320 390447
53787 390447 393349 396873 401749 406421 409368 410871 411674 411682 410845 409648 407791 403935 397675 390390 383383
53772 383383 376567 369595 362818 356431 350093 343961 338762 334334 329533 323968 318365 312957 307227 301537
53758 301537 297173 294284 291629 288777 286658 285436 283881 281523 279451 278211 276883 275028 273560 272829
53744 272829 271757 269793 267830 266339 264556 262455 261517 262380 263605 263929 263945 264432 264852 264768 265011 266160 267426
53727 267426 268216 269218 270829 272136 272625 273236 274569 275740 276222 277100 279144 281316 282625 283900 286195
53712 286195 288848 290680 291851 293109 294318 295092 295861 297138 298777 300825 303876 307720 311155 314094 318186
53697 318186 324182 330349 334879 338326 342195 346552 350598 354332 358126 361688 364737 367640 370294 371649
53683C71649j82l15M51Q7j541k609k608k856l598l540k512j804j557n14J287K231
53667C52069J902J505J249N6j748k237j051j02m70j039q73n30l53J89Q44N17n54
53650C49374p81R1N85J68l0L46K16n34m78P19J459Q87K38N80J246J400J381J672
53632C58539K196L047M336N048L989K053J477K656L827M041M127M381L847K499
53618D06063J763K090K214J534J118J605K177K283K479K946L139L273M182N323
53604D42189N143L763L008L372L349K391J922K597L029K278J361J148Q69j59j217
53589D75043j596j657j626j094l48m44j343j803j605j892k836l135k392j824j956
53574D49492j838j233j257k087k337j574j225j938k352j598q24j037j445j149
$$ plain form
53683 371649 371467 371152 371603 371690 370149 367540 364932 362076 358478 354938 352426 350622 349065 348551 349838 352069
53667 352069 353971 355476 356725 356781 355033 352796 351745 351643 351173 350134 349261 348731 348378 348567 349411 349928 349374
53650 349374 348593 348684 349269 349437 349407 349753 349969 349435 348957 349676 351135 352022 352260 352840 354086 355486 356867 358539
53632 358539 360735 363782 368118 373166 377155 379208 380685 383341 387168 391209 395336 399717 403564 406063
53618 406063 407826 409916 412130 413664 414782 416387 418564 420847 423326 426272 429411 432684 436866 442189
53604 442189 447332 451095 454103 457475 460824 463215 465137 467734 470763 473041 474402 475550 476419 476260 475043
53589 475043 473447 471790 470164 469070 468722 468278 466935 465132 463527 461635 458799 455664 453272 451448 449492
53574 449492 447654 446421 445164 443077 440740 439166 437941 436003 433651 432053 431229 430192 428747 427598
53560D27598o34m03J1O74O59j17l28N23J193Q85N06P97J117J075J394K153K101
53543D39204Q31k15K4Q14J394K187L300L754L398L621M978O020N713N193N787
53528D86003P056Q077Q987R993J0520J0601J1412J3212J4419J4084J3521J4141
53516F22026J5219J5414J5083J5535J7092J9155K1239K2914K3774K4290K5580
53505H37321K7619K9040K9271K9398L0139L0580K9800K8267K6708K5041K3252
53494A146436K1914K1076K0074J8969J8685J9211J9362J8883J8902J9725K0150
53483A363387J9682J9421J9898K0055J9338J8808J9183J9655J9537J9206J8536
53472A576706J6449J3018R975Q187O547M249J972j58l327p638j1230j3104j4603
$$ plain form
53560 427598 426964 426561 426572 427246 427905 427788 427460 427983 429176 430061 430567 431364 432481 433556 434950 437103 439204
53543 439204 440035 439820 439844 440658 442052 444239 447539 451293 454691 458312 463290 469310 475023 480216 486003
53528 486003 493059 501136 510123 520116 530636 541237 552649 565861 580280 594364 607885 622026
53516 622026 637245 652659 667742 683277 700369 719524 740763 763677 787451 811741 837321
53505 837321 864940 893980 923251 952649 982788 1013368 1043168 1071435 1098143 1123184 1146436
53494 1146436 1168350 1189426 1209500 1228469 1247154 1266365 1285727 1304610 1323512 1343237 1363387
53483 1363387 1383069 1402490 1422388 1442443 1461781 1480589 1499772 1519427 1538964 1558170 1576706
53472 1576706 1593155 1606173 1616148 1624335 1630882 1635131 1637103 1636945 1633618 1625980 1614750 1601646 1587043
53459A587043j6665j7963j7356j6036j5550j5681j5867j6778j8786k0733k1783
53448A393845k2637k3602k3490k1995k0944k1467k2050k1177j9794j9145j8225
53437A159319j5660j2362j0027q369o141l585j912j312j187j257j028M75L083
53424A100037N084N741O545Q563J0520J1163J1571J3182J5353J6847J8072J9831
53412A242509K1488K2432K3792K6661K9953L2048L3195L4392L5362L5607L6072
53401A573511L7747L9832M1201M2373M4335M6738M8990N1574N4554N6473N6676
53390B094004N6960N8860O1073O1706O1388O1716O2212O1388N9443N7499N5433
53379B751682N2786N0489M9169M7162M2720L6997L2226K8198K3314J7927J3674
$$ plain form
53459 1587043 1570378 1552415 1535059 1519023 1503473 1487792 1471925 1455147 1436361 1415628 1393845
53448 1393845 1371208 1347606 1324116 1302121 1281177 1259710 1237660 1216483 1196689 1177544 1159319
53437 1159319 1143659 1131297 1121270 1112901 1106760 1103175 1101263 1099951 1098764 1097507 1096479 1096954 1100037
53424 1100037 1105121 1110862 1117407 1125970 1136490 1147653 1159224 1172406 1187759 1204606 1222678 1242509
53412 1242509 1263997 1286429 1310221 1336882 1366835 1398883 1432078 1466470 1501832 1537439 1573511
53401 1573511 1611258 1651090 1692291 1734664 1778999 1825737 1874727 1926301 1980855 2037328 2094004
53390 2094004 2150964 2209824 2270897 2332603 2393991 2455707 2517919 2579307 2638750 2696249 2751682
53379 2751682 2804468 2854957 2904126 2951288 2994008 3031005 3063231 3091429 3114743 3132670 3146344
53368C146344J0226N630n36p104j3910k1928l0935l9372m6362n1909n5601n7118
53356B837425n7607n8541n9672n9901n9467n9336n9154n7799n5350n2581m9340
53345B208677m5425m2292m1689m3188m4921m6033m6460m5441m2481l9002l6683
53334A735062l4944l2316k9330k7535k6443k4171k0690j7776j6005j4364j2780
53323A478708j2548j4132j6477j8511j9676j9365j7647j6044j5660j5329j3571
53312A299748j1415j0825j1192j0145p386m829l196j334R95K517L016L970O079
53299A256003Q347J0132J2003J4058J5407J5879J6603J8308K0627K3212K6152
53288A436731K8987L0874L1800L2316L2199L0750K8287K5897K3965K2210K0754
$$ plain form
53368 3146344 3156570 3162200 3161664 3154560 3140650 3118722 3087787 3048415 3002053 2950144 2894543 2837425
53356 2837425 2779818 2721277 2661605 2601704 2542237 2482901 2423747 2365948 2310598 2258017 2208677
53345 2208677 2163252 2120960 2079271 2036083 1991162 1945129 1898669 1853228 1810747 1771745 1735062
53334 1735062 1700118 1667802 1638472 1610937 1584494 1560323 1539633 1521857 1505852 1491488 1478708
53323 1478708 1466160 1452028 1435551 1417040 1397364 1377999 1360352 1344308 1328648 1313319 1299748
53312 1299748 1288333 1277508 1266316 1256171 1248785 1243956 1240760 1239426 1240421 1242938 1245954 1249924 1256003
53299 1256003 1264350 1274482 1286485 1300543 1315950 1331829 1348432 1366740 1387367 1410579 1436731
53288 1436731 1465718 1496592 1528392 1560708 1592907 1623657 1651944 1677841 1701806 1724016 1744770
53277A744770J9549J7452J3526Q800M939J832j683n299p702r071j0953j3784j6649
53264A745727j9264k2188k5160k7250k8540k9778l0663l0385k9524k9423k9977
53253A443575l0128l0089l0843l1795l1406k9965k9259k9490k9011k7245k5514
53242A118830k4651k4131k3863k4562k5876k6321k5519k4560k3867k2695k1080
53231H51705k0033j9371j7532j4167j0950r102p974o810o141o610p809r090j0324
53218G05792j1450j2326j3216j4401j5377j5554j5437j5761j5950j5019j3500
53207E47801j2646j2192j0860q827p522p249p081o942p565q501q463p683p673
53194D34597q536q799q074p541p569p190o340o265p140p416o291m825m050l764
$$ plain form
53277 1744770 1764319 1781771 1795297 1804097 1809036 1810868 1809185 1803886 1796184 1787113 1776160 1762376 1745727
53264 1745727 1726463 1704275 1679115 1651865 1623325 1593547 1562884 1532499 1502975 1473552 1443575
53253 1443575 1413447 1383358 1352515 1320720 1289314 1259349 1230090 1200600 1171589 1144344 1118830
53242 1118830 1094179 1070048 1046185 1021623 995747 969426 943907 919347 895480 872785 851705
53231 851705 831672 812301 794769 780602 769652 760550 752576 745766 739625 733015 725206 716116 705792
53218 705792 694342 682016 668800 654399 639022 623468 608031 592270 576320 561301 547801
53207 547801 535155 522963 512103 503276 495754 488505 481424 474482 466917 458416 449953 442270 434597
53194 434597 426061 417262 409188 401647 394078 386888 380548 374283 367143 359727 353436 348611 344561 340797
53180C40797l668l932m120l378k058j491j908k294k337k574k703j821n28m85j658
53165C05842k150j149J70R16J423J617P70o59j161o44o32j579k218j976j692j513
53149B95365n41Q85J063k12j094p40m63j011j215l96K92K2l66l04n46j215j032
53132B88492L88J531J482J278J688J777R56L92R71J805J993K081K525K576J979
53117C11914J965L226M602M985M886M962M761M009L443L240K386P01l31l3Q8j333
53101C53471l486m923n481n475m713l498k960l261l170k348k138l031l543k872
53087C02572k390k957l003j264P26R49m5n64o78j355k043j453J2P42L32j99j46
53070B89236L52R67J253P04l97j007r32j215k198k666j881r52r61j305j135r88
$$ plain form
53180 340797 337129 333197 329077 325699 323641 322150 320242 317948 315611 313037 310334 308513 307985 307500 305842
53165 305842 303692 302543 302713 303629 305052 306669 307439 306780 305619 304975 304343 302764 300546 298570 296878 295365
53149 295365 294824 295709 296772 296560 295466 294726 294263 293252 292037 291641 291933 291955 291589 291285 290739 289524 288492
53132 288492 288880 290411 291893 293171 294859 296636 297592 297984 298955 300760 302753 304834 307359 309935 311914
53117 311914 313879 317105 321707 326692 331578 336540 341301 345310 348753 351993 354379 355080 354749 354716 354804 353471
53101 353471 349985 345062 339581 334106 329393 325895 322935 319674 316504 314156 312018 308987 305444 302572
53087 302572 300182 297225 294222 292958 293684 294633 294588 294024 293346 291991 289948 288495 288507 289249 289581 289382 289236
53070 289236 289588 290555 291808 292512 292115 291108 290176 288961 286763 284097 282216 281264 280303 278998 277863 276875
53054B76875j495j846j054M50J753K812L608L378K129J445K272L133K214Q6j290
53039B94470j314q93p37r17j415j894j658p78l22o65p81j22L63Q4O2R81J666J069
53021B87199J94L86J033Q08n1m94n36o40k85R97K148J912Q91N22Q18P69K57m0
53003B95888m6q7J10P88J223P99K41M62R51P05J7p8N27J302K299L711M851M878
52985C18541M076L217K342J184P4o69j440k416k808k139j309j220j303o31M52
52970C15951J055J167J194R84N19N95J655K813L130K891K593J916P65O1K59L30
52954C37878m89j279j135p92j147j580j414j481k466l163k364j175j270k074j894
52939C14155q82n33j004j196r37r12r02j65P80P47n0l54K8J70k25o64j039j443
$$ plain form
53054 276875 275380 273534 272480 272930 274683 277495 281103 284481 286610 288055 290327 293460 295674 295760 294470
53039 294470 293156 292263 291526 290609 289194 287300 285642 284864 284542 283877 283096 282974 283337 283421 283483 284464 286130 287199
53021 287199 287393 287779 288812 289620 289569 289075 288539 287899 287614 288611 290759 292671 293562 294084 294902 295671 295928 295888
53003 295888 295842 295755 295865 296653 297876 298675 298916 299378 300329 301034 301051 300973 301500 302802 305101 308812 313663 318541
52985 318541 322617 325834 328176 329360 329434 328765 327325 324909 322101 319962 318653 317433 316130 315499 315951
52970 315951 317006 318173 319367 320351 320870 321465 323120 325933 329063 331954 334547 336463 337228 337289 337548 337878
52954 337878 337389 336110 334975 334183 333036 331456 330042 328561 326095 322932 320568 319393 318123 316049 314155
52939 314155 313273 312740 311736 310540 309603 308691 307789 307624 308404 309151 309101 308747 308775 308945 308720 308056 307017 305574
52921C05574j326l91K78l12j160o14R51J750J329P93N95K02k83q6N39L98p39j819
52903C05679k185k138j849j118k53L8k57m72k71K06Q28J311J119L62P7O82J105
52886C02864N11k27k6N73N96M76J018J611J258N05N02J030J308J706K772L519
52870C19996K962K366L468N241N070K728N15m08j062k004k356j936j920k691l126
52855C26843k720k457k900l202k770k323k552l050l255l288l337l244l064l062
52841B85619l026k554j963j810j686p39P05J389J030N98O61Q06P60Q64J126J022
52825B82802M26j10j42L14J022J410P30q35j809j197P9O36O14R21J363J204Q08
52808B88236R68J220O60j26J24R92Q79l64j311j369j371j726j858j615j496j388
$$ plain form
52921 305574 304248 303857 304135 303823 302663 302049 303000 304750 306079 306872 307467 307669 307386 307300 307839 308237 307498 305679
52903 305679 303494 301356 299507 298389 298136 298174 297917 297445 297174 297380 298208 299519 300638 301000 301077 301759 302864
52886 302864 303375 303148 303122 303695 304291 304767 305785 307396 308654 309159 309661 310691 311999 313705 316477 319996
52870 319996 322958 325324 328792 334033 339103 341831 342346 341938 340876 338872 336516 334580 332660 329969 326843
52855 326843 324123 321666 318766 315564 312794 310471 307919 304869 301614 298326 294989 291745 288681 285619
52841 285619 282593 280039 278076 276266 274580 273841 274546 275935 276965 277563 278224 279030 279790 280654 281780 282802
52825 282802 283228 283118 282976 283290 284312 285722 286452 285617 283808 282611 282690 283326 283940 284861 286224 287428 288236
52808 288236 289204 290424 291084 290958 291082 292074 292953 292589 291278 289909 288538 286812 284954 283339 281843 280455
52792B80455p07R5j66j454k350k029r86J37J058J287N64k47q2O75R84J069J826
52775B80129K698K210N23n48k27M26N55M85M54J18l26j53N05P72N87O33P52J58
52757B89751p72o74O28J842K181K003J488M23n57m24M28M87n11j257j035m37K17
52740B93781J330K626L159K954K957L148K546J250O05R83J261Q56M83N78P43J032
52724C20292J928K769K172K96j173j637k084k778k680j679j140j420j122L15J417
52709C13476J074J91j99n49j335j705r07L39J016J093Q04J7q84r78l33j77p95
52692C10148q73K61J358J215L45k58o26j043j161q54p22q55l70R49J837J300p5
52675C10576j283k171k720k461j475q07r99j254p96N4P78J426J867J554O63K36
$$ plain form
52792 280455 279748 279843 279677 278223 275873 273844 272858 272995 274053 275340 275904 275657 275575 276250 277234 278303 280129
52775 280129 282827 285037 285560 285012 284785 285211 285766 286251 286705 286823 286497 286344 286849 287621 288208 288841 289593 289751
52757 289751 288979 288305 288933 290775 292956 294959 296447 296870 296313 295889 296317 296804 296293 295036 294001 293564 293781
52740 293781 295111 297737 300896 303850 306807 309955 312501 313751 314356 315339 316600 317456 317939 318517 319260 320292
52724 320292 322220 324989 327161 327457 326284 324647 322563 319785 317105 315426 314286 312866 311744 312059 313476
52709 313476 314550 314741 314542 313993 312658 310953 310046 310385 311401 312494 313298 313315 312431 311453 311120 310943 310148
52692 310148 309275 309536 310894 312109 312454 312196 311570 310527 309366 308512 307790 306935 306565 307514 309351 310651 310576
52675 310576 309293 307122 304402 301941 300466 299659 298660 297406 296610 296664 297442 298868 300735 302289 302952 303188
52659C03188N87Q48N95N55J110J579J647J951K626K795K281K248L265M185L915
52644C33375K863J704J51j966l704m186l710k879j723m56J55o4k71N5N08R27J733
52627C22512K742L309M112O704J0450J1938Q869K892k639o155p906q238p489o411
52613C34690n290l599j514m62j041j872j705j259j594k066j517l34K68J87J89
52598C13081N00Q63J281J642J327J88q77j189j162j176p18L87J163R36N07P59
52582C17512J267J389J555K295L003K905K313J790J054k18j455k102k494k876
52568C25938k574j219L20J237J856K456K298J034j97m24l75j019j707j379n99
52553C25646p01j630k140j741j056o20m95o08o39JJ257K128J946J189M58l59j244
$$ plain form
52659 303188 303775 304623 305218 305773 306883 308462 310109 312060 314686 317481 319762 322010 325275 329460 333375
52644 333375 336238 337942 338093 336127 332423 328237 324527 321648 319925 319469 319624 319560 319289 319344 319852 320779 322512
52627 322512 325254 328563 332675 339379 349829 361767 370636 373528 370889 364734 356828 348590 341101 334690
52613 334690 329400 325801 324287 323825 322784 320912 319207 317948 316354 314288 312771 312437 312705 312892 313081
52598 313081 313581 314444 315725 317367 318694 318882 318005 316816 315654 314478 313760 314147 315310 316246 316753 317512
52582 317512 318779 320168 321723 324018 327021 329926 332239 334029 335083 334865 333410 331308 328814 325938
52568 325938 323364 322145 322465 323702 325558 328014 330312 331346 331149 330725 330350 329331 327624 326245 325646
52553 325646 324945 323315 321175 319434 318378 317758 317263 316655 316016 316017 317274 319402 321348 322537 322995 322636 321392
52536C21392j495q82k86l17m40k42k70o80m47R07K153K104J375J111J238J184
52520C26405J194J555J664J125P36J161J732J780J970K979M084M469M672N323
52506C60849N599M543K731J088p66l331n488n863m999m417m286l780l024k837
52492C36019l071k886k290j908j724j337r96j098j254j029q59j086r52J58J351
52477C17038J505J022R26J182J273J480K106K415J940J806L064M714N119M556
52463C50146M437M886N010M818M880M605K959M84j252j941k532l297l653l705
52449C65845m201n117n738n868n648m703k890j327j038j239o25K86M5j083j402
52434C25297n48J04k50r21j236j342j341j014m91m8N77J553K071J407L78K44P60
$$ plain form
52536 321392 319897 319015 318729 318412 317972 317730 317460 316780 316333 317240 319393 321497 322872 323983 325221 326405
52520 326405 327599 329154 330818 331943 332679 333840 335572 337352 339322 342301 346385 350854 355526 360849
52506 360849 366448 370991 373722 374810 374044 370713 365225 359362 354363 349946 345660 341880 338856 336019
52492 336019 332948 330062 327772 325864 324140 322803 321807 320709 319455 318426 317567 316481 315529 315687 317038
52477 317038 318543 319565 320491 321673 322946 324426 326532 328947 330887 332693 335757 340471 345590 350146
52463 350146 354583 359469 364479 369297 374177 378782 381741 382225 380973 379032 376500 373203 369550 365845
52449 365845 361644 356527 350789 344921 339273 334570 331680 330353 329315 328076 327451 327737 327782 326699 325297
52434 325297 324749 324853 324603 323682 322446 321104 319763 318749 318258 318210 318787 320340 322411 323818 324196 324440 325200
52417C25200Q60P37J385K496K705J848J114J042J039R74J509K744L965M899N958
52402C58475P289Q771J0815J3661J6073J6067J2989P816J799l916p988r802j0417
52389D21632j1143j1530j0313p798n571m149k828j581j161j362j106l11Nl27k56
52374C62201P52K185L733N559P249Q048Q210Q539Q571O854L224p01l490m922n034
52359D10978l783j904o80m94o88q71j100r54J24J571K203J896J448J105P01Q76
52343D10428K311L912L809K173J106J507K121K013J934K593L451M069M976O394
52329D52797P543Q008Q516R637J0961J2176J3721J5632J6918J6790J5635J4196
52317F02530J2767J1616J1283J1853J2729J3505J4364J5439J6539J7655J8940
$$ plain form
52417 325200 326060 326797 328182 330678 333383 335231 336345 337387 338426 339400 340909 343653 347618 352517 358475
52402 358475 365764 374535 385350 399011 415084 431151 444140 451956 453755 449839 441851 432049 421632
52389 421632 410489 398959 388646 380848 375277 371128 368300 366719 365558 364196 363090 362779 362784 362457 362201
52374 362201 362953 365138 368871 374430 381679 389727 397937 406476 415047 421901 425125 424424 420934 416012 410978
52359 410978 407195 405291 404611 404117 403429 402558 401458 400504 400628 402199 404402 406298 407746 408851 409552 410428
52343 410428 412739 416651 420460 422633 423739 425246 427367 429380 431314 433907 437358 441427 446403 452797
52329 452797 460340 468348 476864 486501 497462 509638 523359 538991 555909 572699 588334 602530
52317 602530 615297 626913 638196 650049 662778 676283 690647 706086 722625 740280 759220
52306G59220K0152K0904K1428K2211K3073K3546K4001K5183K6789K7607K7052
52295A021166K5464K3013J9547J5473J1578Q020M513J400o00j531k014k201k109
52282A121719k496m030n885o670o463o463o891o867o192n577n174m484l575k861
52268A048091j755O54L714N638N942N806O109O693P623R327J1358J2745J3701
52255A135646J5386J7848J9898K1067K2032K2917K2962K1962K0391J8069J4446
52244A352624J0300P278N598M046K259J043L24j077l206m689n165n984p894r908
52230A345549j1186j2230j3457j4233j4077j3441j2767j2029j1479j1450j1397
52219A207803j0572r593r620j0218r911q605p344n954l488q16Q3m44L0J984L263
$$ plain form
52306 759220 779372 800276 821704 843915 866988 890534 914535 939718 966507 994114 1021166
52295 1021166 1046630 1069643 1089190 1104663 1116241 1124261 1128774 1130174 1129574 1128043 1126029 1123828 1121719
52282 1121719 1119223 1115193 1109308 1102638 1096175 1089712 1082821 1075954 1069762 1064185 1059011 1054527 1050952 1048091
52268 1048091 1046336 1046990 1050704 1056342 1062284 1068090 1074199 1080892 1088515 1097842 1109200 1121945 1135646
52255 1135646 1151032 1168880 1188778 1209845 1231877 1254794 1277756 1299718 1320109 1338178 1352624
52244 1352624 1362924 1370202 1375800 1379846 1382105 1383148 1383472 1382395 1379189 1374500 1369335 1363351 1355457 1345549
52230 1345549 1334363 1322133 1308676 1294443 1280366 1266925 1254158 1242129 1230650 1219200 1207803
52219 1207803 1197231 1187638 1178018 1167800 1157889 1149284 1141940 1135986 1132498 1131682 1131765 1131321 1131351 1133335 1136598
52204A136598L139L624N627P012O187M710M467M951N273O325Q673J0595J0573
52191A217754R948J0679J2119J2288J0989R450P922N805L259Q38j821n259q758
52178A285213j1009j1628j1040r795q824r206j0581j1017r528p436o224n454m079
52165A169392k416j337o46L57J639K910M306N638O031N260M179L023Q43k376m752
52150A192051m980m174l784l292j592P06K181K674K864K826K474K474L165L545
52136A197138K625R72l22j108j492r35O48K145K911L995O354R156J1290J3240
52122A246617J5823J8294J9514J9967K0950K2498K3721K4314K4356K3480K1657
52111A481191J9887J8830J7701J5866J4276J3930J4212J4318J5062J7368K0165
$$ plain form
52204 1136598 1139737 1143361 1148988 1156000 1162187 1166897 1171364 1176315 1181588 1187913 1196586 1207181 1217754
52191 1217754 1227702 1238381 1250500 1262788 1273777 1283227 1291149 1296954 1300213 1301051 1299230 1293971 1285213
52178 1285213 1274204 1262576 1251536 1241741 1232917 1223711 1213130 1202113 1192585 1185149 1178925 1173471 1169392
52165 1169392 1166976 1165639 1164993 1165350 1166989 1169899 1174205 1179843 1185874 1191134 1195313 1198336 1199179 1196803 1192051
52150 1192051 1187071 1182897 1179113 1175821 1174229 1174935 1177116 1179790 1182654 1185480 1187954 1190428 1193593 1197138
52136 1197138 1199763 1200735 1200413 1199305 1197813 1196878 1197526 1199671 1202582 1206577 1212931 1222087 1233377 1246617
52122 1246617 1262440 1280734 1300248 1320215 1341165 1363663 1387384 1411698 1436054 1459534 1481191
52111 1481191 1501078 1519908 1537609 1553475 1567751 1581681 1595893 1610211 1625273 1642641 1662806
52100A662806K1723K2098K2355K2280K0873J8372J5751J2833Q757L781j192o252
52088A824185j1725j6387j8505j8373j7990j8314j8625j8374j7930j7485j6731
52077A633746j5800j5228j4981j4543j3795j2820j1213q710o018l990k368m11
52065A513869J812L869O074Q898J1867J4173J5852J7268J8188J8513J9122K0578
52053A670083K1849K1685K0501J9443J8266J5824J2019P732L352j062m721o859
52041A798112q142r806j1787j3097j3675j4237j4776j4757j4575j5170j6381j7048
52029A634661j6652j5676j4566j3584j3312j4093j5275j6041j6431j6494j5460
52018A467077j3184j1515j2245j4355j5185j4018j2507j1729j0912r325p594o589
$$ plain form
52100 1662806 1684529 1706627 1728982 1751262 1772135 1790507 1806258 1819091 1827848 1831629 1830437 1824185
52088 1824185 1812460 1796073 1777568 1759195 1741205 1722891 1704266 1685892 1667962 1650477 1633746
52077 1633746 1617946 1602718 1587737 1573194 1559399 1546579 1535366 1526656 1520638 1516648 1514280 1513869
52065 1513869 1515681 1519550 1525624 1534522 1546389 1560562 1576414 1593682 1611870 1630383 1649505 1670083
52053 1670083 1691932 1713617 1734118 1753561 1771827 1787651 1799670 1807402 1810754 1809692 1804971 1798112
52041 1798112 1789970 1780164 1768377 1755280 1741605 1727368 1712592 1697835 1683260 1668090 1651709 1634661
52029 1634661 1618009 1602333 1587767 1574183 1560871 1546778 1531503 1515462 1499031 1482537 1467077
52018 1467077 1453893 1442378 1430133 1415778 1400593 1386575 1374068 1362339 1351427 1342102 1334508 1327919
52006A327919o393o891q303j0779j4126j7941k1402k3335k3413k2772k2418k1645
51994A128501j9252j5806j3161j2170j2233j2862j4151j5847j7431j9065k1252
51983I55271k3514k4645k4267k3022k1395j9410j7456j6305j6230j6786j7332
51972G34909j7175j5669j2904r785o873l792m79K169L735N207P236Q777Q802Q209
51958G12367Q221Q043O003K250j613m891p793r685r407p140m157r22K928P102
51944G01306J0876J4511J8851K3801K8670L3396L7711L9660L6950K9531J9318
51933I94581Q033k897j1283j5606j7307j9260k2062k3922k4058k3712k3744k3629
51921G95134k3266k3491k4219k4142k2859k1452k0380j8700j5957j3130j0989
$$ plain form
52006 1327919 1321526 1314635 1306332 1295553 1281427 1263486 1242084 1218749 1195336 1172564 1150146 1128501
51994 1128501 1109249 1093443 1080282 1068112 1055879 1043017 1028866 1013019 995588 976523 955271
51983 955271 931757 907112 882845 859823 838428 819018 801562 785257 769027 752241 734909
51972 734909 717734 702065 689161 679376 672503 668711 668232 670401 674136 679343 686579 695356 704158 712367
51958 712367 720588 728631 734634 736884 735271 730380 722587 712902 703495 696355 692198 691276 694204 701306
51944 701306 712182 726693 745544 769345 798015 831411 869122 908782 945732 975263 994581
51933 994581 1002614 999717 988434 972828 955521 936261 914199 890277 866219 842507 818763 795134
51921 795134 771868 748377 724158 700016 677157 655705 635325 616625 600668 587538 576549
51910E76549r110p136n449m010j924J144M390P101R154J0097R205O913M825L748
51896F05497K838J038j758n206q947j2230j4253j5071j5203j4543j2738j0455
51884D98969q715p213m831j753N94J762K866M708O907R011J1017J2618J3343J3518
51870E52801J3733J3370J1238P551L737L83k879n609o565n726m439l382k088n86
51856E71539L55P34J371K228K511K409K790L086J734j101l504m859o544r085j1036
51841E52628j1546j1643j1944j1338r206o966n956n523m484k963j481K68K418
51828D72264M028M382M059L718K974J481m7q75j244j519j489j182j206j594j470
51813D82280n49L17O39J041J802K060J245rj036j905k370j591L02J740J746J123
$$ plain form
51910 576549 567439 560303 554854 550844 548920 550064 554454 561555 570709 580806 590011 596924 601749 605497
51896 605497 608335 609373 607615 602409 593462 581232 566979 551908 536705 522162 509424 498969
51884 498969 490254 483041 478210 476457 477051 478813 481679 486387 493294 502305 513322 525940 539283 552801
51870 552801 566534 579904 591142 598693 602430 602813 599934 594325 587760 582034 577595 574213 572125 571539
51856 571539 571894 572628 573999 576227 578738 581147 583937 587023 588757 587656 584152 579293 572749 563664 552628
51841 552628 541082 529439 517495 506157 496951 489985 484029 478506 474022 471059 469578 469846 472264
51828 472264 476292 480674 484733 488451 491425 492906 492859 491984 490740 489221 487732 486550 485344 483750 482280
51813 482280 481731 482048 482687 483728 485530 487590 488835 488826 487790 485885 483515 481924 482226 483966 485712 486835
51797D86835Q83Q49P09R95K018K997L187K745J788j16k635m205l861k420j049
51782D88720R6J046J158J69j030j611j815j993j760r36j42L55J411L707O710R507
51766E03592J1716J2975J2814J1619J0506R537P397L502r09m526p387r680j0674
51753E50482r934q531p837q019q452q758q705q061p119o363n402l436j034J41
51739D58972k27n60J64J272K224L644N634P077P655Q709J0737J1858J0194O326
51725E33679K105j452l877m326k458Q52M625Q261J0225Q283K528l647p073p793
51711E39932p330n932l454j171n74j394k539l833n245n694m280j649J358M878
51697E03073Q348R331O327J370k307m086n298n994m999k448O6J593K056R89j848
$$ plain form
51797 486835 487718 488567 489276 490271 492289 495286 498473 501218 503006 502890 500255 496050 492189 489769 488720
51782 488720 488816 489862 491020 491189 490159 488548 486733 484740 482980 482044 481902 482257 483668 487375 494085 503592
51766 503592 515308 528283 541097 552716 563222 572759 580156 583658 582749 578223 570836 561156 550482
51753 550482 540548 532017 524180 516161 507709 498951 490246 482185 475066 468703 463301 459865 458831 458972
51739 458972 458745 458185 458349 459621 461845 465489 471123 478200 485855 494564 505301 517159 527353 533679
51725 533679 535784 534332 530455 526129 523671 524523 529148 537409 547634 555917 558445 554798 547725 539932
51711 539932 532602 526670 523216 522045 521471 520077 517538 513705 508460 502766 498486 496837 498195 503073
51697 503073 511421 520752 527079 528449 526142 522056 516758 510764 505765 503317 503383 504976 507032 508021 506173
51682E06173m982o430o201n704n157l577j104Q05J587K122K846K947J800n9j617
51667D83449k114j224O36K494M317P569J3037J8807K1955K1652J8988J4357P170
51654F11093j809r851j4567j5614j3905j0435o219k172J510N156Q520J0518J0095
51641E72320O976J779l981q453j0730j1474j1763j1810j1332j0496r668q799p837
51628D74732p188o978o482n141l422j955n11J189K420K320J180r7j277k505l348
51613D42937l213k323j438j015j256k210l237l213k035r18n12J03J580K894K928
51598D29072K266K082K377K747L717N778Q155J0169J2649J6196J8920J7976J2867
51585E44971N632j518p162j0099r983q288o827n580l467p31J301K518M242P203
$$ plain form
51682 506173 501191 494761 488560 482856 477699 474122 473018 473823 475410 477532 480378 483325 485125 485066 483449
51667 483449 481335 480111 480747 483241 487558 495127 508164 526971 548926 570578 589566 603923 611093
51654 611093 609284 599433 584866 569252 555347 544912 538693 536521 538031 543187 551707 562225 572320
51641 572320 579296 581075 577094 568641 557911 546437 534674 522864 511532 501036 491368 482569 474732
51628 474732 467544 460566 454084 448943 445521 443566 443055 444244 446664 448984 450164 450067 448790 446285 442937
51613 442937 439724 437401 435963 434948 433692 431482 428245 425032 422997 422079 421567 421670 423250 426144 429072
51598 429072 431338 433420 435797 438544 442261 448039 456194 466363 479012 495208 514128 532104 544971
51585 544971 550603 549085 541923 531824 521841 513553 506726 501146 497679 496948 498249 500767 505009 512212
51571E12212J0802J4247J6936J8049J7377J6471J7468K0610K4062K6027K5981
51560G20242K4341K2373K2064K4608K8999L3193L6301L8478L9245L7299L1835
51549A058978K3017J1558j015j2422k1178k7610l2337l4752l4397l2668l1396
51538H65778l0556k9222k7841k7436k7283k5687k2734k0118j8411j6648j4557
51527F05285j3102j2632j2310j1572j0630r507q073o918o679o783o279n497n239
51514D90064m989l775k298k051k741k730j849j439j807j898j529j591j951j412
51500D58004p1N73J87Q6P90J315J315J728K713L104K552K171K428K427J942K016
51484D83280K778K743J244l76j041j530k740m116m912n417n803n397m124l244
$$ plain form
51571 512212 523014 537261 554197 572246 589623 606094 623562 644172 668234 694261 720242
51560 720242 744583 766956 789020 813628 842627 875820 912121 950599 989844 1027143 1058978
51549 1058978 1081995 1093553 1092538 1080116 1058938 1031328 998991 964239 929842 897174 865778
51538 865778 835222 806000 778159 750723 723440 697753 675019 654901 636490 619842 605285
51527 605285 592183 579551 567241 555669 545039 535532 527459 520541 513862 507079 500800 495303 490064
51514 490064 485075 481300 479002 476951 474210 471480 469631 468192 466385 464487 462958 461367 459416 458004
51500 458004 457933 458506 458693 458779 459569 460884 462199 463927 466640 469744 472296 474467 476895 479322 481264 483280
51484 483280 486058 488801 490045 489669 488628 487098 484358 480242 475330 469913 464110 458713 454589 451345
51470D51345l480l900l624l267l542l808l312k634k646l023k916k353j884j639
51456D09317j506j538j517r04K27J107J529K171L217L927M130M836O619Q545R551
51441D49711R887J0473J1840J4218J7430J9938J9351J4934Q650K978j242m052
51429E74116n010m026k634k877n244q674j2009j4473j5237j3822j0969q228o596
51416D64317n903n449m804m029l340k563j159R12K702L212K643J966J525R92N07
51401D51529P41J708K612L054L501M339N367O351P192P527P064O370O365P066
51387E20786P821Q707J0493J3173J5890J8507K2000K6908L2497L7886M2937M7655
51375H05260N1515N3951N5021N5456N6202N7136N5543M7059K9897P701j3441l0383
$$ plain form
51470 451345 447865 443965 440341 437074 433532 429724 426412 423778 421132 418109 415193 412840 410956 409317
51456 409317 407811 406273 404756 403852 404079 405186 406715 408886 412103 416030 420160 424996 431615 440160 449711
51441 449711 459598 470071 481911 496129 513559 533497 552848 567782 576432 579410 578168 574116
51429 574116 569106 565080 562446 559569 554325 545651 533642 519169 503932 490110 479141 470913 464317
51416 464317 458414 452965 448161 444132 440792 438229 437070 437982 440684 443896 446539 448505 450030 451022 451529
51401 451529 452270 453978 456590 459644 463145 467484 472851 479202 486394 493921 500985 507355 513720 520786
51387 520786 528607 537314 547807 560980 576870 595377 617377 644285 676782 714668 757605 805260
51375 805260 856775 910726 965747 1021203 1077405 1134541 1190084 1237143 1267040 1274741 1261300 1230917
51363A230917m3672n3887o0020o1850o1225n9919n7916n4625n0173m4812l8545
51352F44273l2080k6724k2757j9231j5749j2940j0876q747o555n340n200m823
51340D73251l654k729k622k441j759j715l054m679n287n034m603l957l125k839
51326D25753l330l666l122k173j404p73m51r66j869j830o99J32R3L05J306J954
51310D09260J585J360K211L275L672M002M640M489K968J503J341J440M04j126
51296D41024j848k154l092m216m453m114m132m175l394k162j308m26J254L083
51282D09887L907M057M710N837O528O814P461Q343Q599Q016O856M817J620j766
51268D85686l962m852n137m786l341j267M56J788L256M509M578L296J322q72k850
$$ plain form
51363 1230917 1187245 1133358 1073338 1011488 950263 890344 832428 777803 727630 682818 644273
51352 644273 612193 585469 562712 543481 527732 514792 503916 495169 488614 483274 478074 473251
51340 473251 469597 466868 464246 461805 460046 458331 455277 450598 445311 440277 435674 431717 428592 425753
51326 425753 422423 418757 415635 413462 412058 411285 410834 409868 407999 406169 405470 405602 405695 406000 407306 409260
51310 409260 410845 412205 414416 417691 421363 425365 430005 434494 437462 438965 440306 441746 442150 441024
51296 441024 439176 437022 433930 429714 425261 421147 417015 412840 409446 407284 405976 405550 406804 409887
51282 409887 413794 417851 422561 428398 434926 441740 449201 457544 466143 474159 481015 485832 487452 485686
51268 485686 481724 476872 471735 466949 463608 462341 462797 464585 467841 472350 476928 480224 481546 480674 477824
51253D77824l669k880j637j489k339k978l163l661m463m536l438j919p93j79Q
51238D40688j41k78j50j54p90j775k400k543k501k190j388n36l91r77j554j525
51222D21395r26k21k5o39j460j412l26P96J251J437J794J964J710J643K201K855
51206D32037L149L534M305M789M589M475M949N048L875K343J872K215K028R53
51192D80161l03j352k230k610k271j895k200k650k223r47L73J467K433K898K456
51177D71107J537P24k41j771l301l987l933l647k988j806r46j268k132k182j247
51162D43919l14K2O1L39J290L093M995N514M214K473J664J538J255Q21L80n42
51146D70722j778j759K87K618L183K350J621Q49r72l113l714k647j491r90o20
$$ plain form
51253 477824 474155 471275 469638 468149 465810 462832 459669 456008 451545 447009 443571 441652 440859 440680 440688
51238 440688 440547 440269 440119 439965 439175 437400 435000 432457 429956 427766 426378 425842 425451 424474 422920 421395
51222 421395 420469 420248 420223 419584 418124 416712 416386 417182 418433 419870 421664 423628 425338 426981 429182 432037
51206 432037 435186 438720 443025 447814 452403 456878 461827 466875 470750 473093 474965 477180 479208 480161
51192 480161 479858 478506 476276 473666 471395 469500 467300 464650 462427 461480 461853 463320 465753 468651 471107
51177 471107 472644 473368 473127 471356 468055 464068 460135 456488 453500 451694 450748 449480 447348 445166 443919
51162 443919 443605 443627 443688 444027 445317 448410 453405 458919 463133 465606 467270 468808 470063 470884 471264 470722
51146 470722 468944 467185 467472 470090 473273 475623 477244 478093 477121 474008 470294 467647 466156 465166 464546
51131D64546m10j014k039k306j752j267q15M00K049K942L084L517M169L891K757
51116D77752K203K605K732J984J289J247J200P40M95P47P80L12J49P21J236R79
51100D97171M28L89R76J826K592K854K404J747J539J568J165M26j9k26p15j205
51084E12920r40j43K02pK4M08M46J28K65R07J179R30J099K012K685K339J491J109
51066E27054J560K710M153N269N956P200R925J3422J6125J7746J9358K1561K3815
51053F75854K5310K4998K1196J3224L582l351n168k684K284Q039J1937J1178O212
51040G92611J310K7J267J120k596q755j4657j7744j6304j0277j781N619Q530N353
51026G43723k581j1301j6777j7807j5978j2984r187m794p76K174M474O590Q067
$$ plain form
51131 464546 464136 463122 461083 458777 457025 455758 454943 455343 457392 460334 463418 466935 471104 474995 477752
51116 477752 479955 482560 485292 487276 488565 489812 491012 491752 492247 492994 493774 494086 494235 494956 496192 497171
51100 497171 497599 497988 498964 500790 503382 506236 508640 510387 511926 513494 514659 515085 515066 514840 514125 512920
51084 512920 511980 511837 512039 512032 512056 512464 512910 513038 513303 514210 515389 516319 517418 519430 522115 524454 525945 527054
51066 527054 528614 531324 535477 540746 546702 553902 563827 577249 593374 611120 630478 652039 675854
51053 675854 701164 726162 747358 760582 764164 760813 755645 752961 755245 763284 775221 786399 792611
51040 792611 793921 793948 795215 796335 793739 784984 770327 752583 736279 726002 724221 729840 738370 743723
51026 743723 741142 729841 713064 695257 679279 666295 657108 652314 651538 653712 658186 664776 672843
51013F72843Q335P796P362P372P523P397O681N261L425J686K98p51j472k034k884
50998G28838m057m755m417l690l442l289k361j010l67l99N9J387K843M127N829
50983G15296Q098J0268J2067J3902J5739J7033J8006J9664K2313K5197K7667K9413
50971I34663K9514K7123K3409K1309K2634K6613L1626L6949M2399M7644N2673
50960A296556N7866O3081O7623P1306P4494P6913P7655P6543P4177P0529O4942
50949B071685N7729N0190M2755L4756K6347J8932J3093P918L086k2k50J647L970
50936B331836N409M843J496l717q440j1372j3432j5685j7769j9289k1286k4957
50924B207637l0024l5508m1172m7127n2954n8152o2713o6408o8463o8563o7304
$$ plain form
51013 672843 681178 688974 696336 703708 711231 718628 725309 730570 733995 735681 735979 735228 733756 731722 728838
50998 728838 724781 720026 715609 711919 708477 705188 702827 701817 701450 701051 701110 702497 705340 709467 715296
50983 715296 723394 733662 745729 759631 775370 792403 810409 830073 852386 877583 905250 934663
50971 934663 964177 991300 1014709 1036018 1058652 1085265 1116891 1153840 1196239 1243883 1296556
50960 1296556 1354422 1417503 1485126 1556432 1630926 1707839 1785494 1862037 1936214 2006743 2071685
50949 2071685 2129414 2179604 2222359 2257115 2283462 2302394 2315487 2323405 2326491 2326469 2326219 2327866 2331836
50936 2331836 2337245 2342088 2343584 2339867 2331427 2320055 2306623 2290938 2273169 2253880 2232594 2207637
50924 2207637 2177613 2142105 2100933 2053806 2000852 1942700 1879987 1813579 1745116 1676553 1609249
50913A609249o4994o1234n6267n1534m7937m4709m0937l6999l3595l0511k7426
50902A113106k4927k3589k2819k1665j9998j8063j5715j2952j0405q501o881n269
50890I22322m070l472k942k277k047k329k218j326m52M0J137L385N535O309O373
50875I23968P112Q460R419R950J0794J2073J3400J4933J6920J8604J9009J8577
50863A083219J8893K0710K3226K5276K6549K7699K9710L3095L7401M1895M6806
50852A414479N3184O1259O9915P8332Q7179R7437J08867J20383J31217J41043
50842B363295J49643J57258J64570J71636J77326J80322J79944J75574J66214
50833C885782J51379J31821J08865Q3770N8134L3806J1720q320k6049l9999m8989
$$ plain form
50913 1609249 1544255 1483021 1426754 1375220 1327283 1282574 1241637 1204638 1171043 1140532 1113106
50902 1113106 1088179 1064590 1041771 1020106 1000108 982045 966330 953378 942973 934472 927591 922322
50890 922322 918252 914780 911838 909561 907514 905185 902967 901641 901189 901229 902366 905751 911286 917595 923968
50875 923968 931080 939540 948959 958909 969703 981776 995176 1010109 1027029 1045633 1064642 1083219
50863 1083219 1102112 1122822 1146048 1171324 1197873 1225572 1255282 1288377 1325778 1367673 1414479
50852 1414479 1467663 1528922 1598837 1677169 1764348 1861785 1970652 2091035 2222252 2363295
50842 2363295 2512938 2670196 2834766 3006402 3183728 3364050 3543994 3719568 3885782
50833 3885782 4037161 4168982 4277847 4361617 4419751 4453557 4465277 4456957 4430908 4390909 4341920
50822D341920n3351n3795n0128m2096l0714j7857n219N495J2209J3375Q816r08
50810D127747j5304l3485n3710p4149r3748j11958j28347j42844j55412j65025
50800C153765j69922j69441j64612j56685j46169j33782j20937j08555r6493q4726
50790A802443p3827o3733n3549m3277l4265k7081k0596j4162r050o399n216l934
50778A447354k631k268k794l508m361n573o795p848r265j1113j2341j2471j2660
50765A353726j3922j5511j6377j6846j7464j7570j6626j5759j6231j7308j7339
50754A172773j6000j3963j1380q295n456l139j90M114Q415J1233J3335J6243J9570
50741A187260K2031K4042K6952L0457L3184L5362L8607M3442M9068N5210O1977
$$ plain form
50822 4341920 4288569 4234774 4184646 4142550 4111836 4093979 4088760 4094255 4106464 4119839 4128655 4127747
50810 4127747 4112443 4078958 4025248 3951099 3857351 3745393 3617046 3474202 3318790 3153765
50800 3153765 2983843 2814402 2649790 2493105 2346936 2213154 2092217 1983662 1887169 1802443
50790 1802443 1728616 1664883 1611334 1568057 1533792 1506711 1486115 1471953 1462903 1456504 1451288 1447354
50778 1447354 1444723 1442455 1439661 1436153 1431792 1426219 1419424 1411576 1402311 1391198 1378857 1366386 1353726
50765 1353726 1339804 1324293 1307916 1291070 1273606 1256036 1239410 1223651 1207420 1190112 1172773
50754 1172773 1156773 1142810 1131430 1123135 1117679 1114540 1114350 1118464 1126879 1138112 1151447 1167690 1187260
50741 1187260 1209291 1233333 1260285 1290742 1323926 1359288 1397895 1441337 1490405 1545615 1607592
50730A607592O8392P3295P7423Q2258Q7127Q9774Q9777Q8986Q8460Q7339Q5059
50719B525482Q2288P9022P3812O5665N5019M2178K6592Q484j0268k7521m2008
50708B878745n2671n8404n9016n5404m8433l8738k7772j7554q952j397N393J0685
50696B526482J3848J4704J2455N761n439j9485l4889n1317o8029q2705r2897r7965
50684B120524r8855r6628r1921q5245p7192o8426n9632n1190m2945l4697k6703
50673A387090j9211j1874m413K562Q303J3158J7991K2647K6129K8066K8799K8232
50661A527479K5986K2624J9442J6911J4654J2974J2892J4354J5838J6311J6422
50650A715887J7096J8062J8458J8193J7947J8408J9987K2789K6370K9895L2868
$$ plain form
50730 1607592 1675984 1749279 1826702 1908960 1996087 2085861 2175638 2264624 2353084 2440423 2525482
50719 2525482 2607770 2686792 2760604 2826269 2881288 2923466 2950058 2958542 2948274 2920753 2878745
50708 2878745 2826074 2767670 2708654 2653250 2604817 2566079 2538307 2520753 2511801 2510404 2515797 2526482
50696 2526482 2540330 2555034 2567489 2573250 2567811 2548326 2513437 2462120 2394091 2311386 2218489 2120524
50684 2120524 2021669 1925041 1833120 1747875 1670683 1602257 1542625 1491435 1448490 1413793 1387090
50673 1387090 1367879 1356005 1351592 1354154 1362457 1375615 1393606 1416253 1442382 1470448 1499247 1527479
50661 1527479 1553465 1576089 1595531 1612442 1627096 1640070 1652962 1667316 1683154 1699465 1715887
50650 1715887 1732983 1751045 1769503 1787696 1805643 1824051 1844038 1866827 1893197 1923092 1955960
50639A955960L5499L8280M1533M5321M9324N2813N5026N5640N4631N2104M8530
50628B484661M4763M1258L7651L3724L0453K9525L1673L5291L6058K8527J0211
50617B843795j4697l7055m9654n1954m7748m0100l0300j9927j0990m068J706O670
50605B545678J0177J1835J1642Q994L107n601j5877k7165l9435n1767o2602p1302
50593B317684p8109q2853q5098q5359q4628q2783p8953p3375o7431o1966n6905
50582A480224n2287m8226m4061l9047l3725k9139k5086k0728j6523j3590j1463
50571A146349q503m495q05K063M975Q035J0133J1036J1959J3557J5191J6574J8341
50558A244410K0374K1510K1444K1273K1555K1729K2027K4012K8174L2764L5957
$$ plain form
50639 1955960 1991459 2029739 2071272 2116593 2165917 2218730 2273756 2329396 2384027 2436131 2484661
50628 2484661 2529424 2570682 2608333 2642057 2672510 2702035 2733708 2768999 2805057 2833584 2843795
50617 2843795 2829098 2792043 2742389 2690435 2642687 2602587 2572287 2552360 2541370 2537302 2539008 2545678
50605 2545678 2555855 2567690 2579332 2588326 2591433 2585832 2569955 2542790 2503355 2451588 2388986 2317684
50593 2317684 2239575 2156722 2071624 1986265 1901637 1818854 1739901 1666526 1599095 1537129 1480224
50582 1480224 1427937 1379711 1335650 1296603 1262878 1233739 1208653 1187925 1171402 1157812 1146349
50571 1146349 1137846 1133351 1132546 1134609 1139584 1147619 1157752 1168788 1180747 1194304 1209495 1226069 1244410
50558 1244410 1264784 1286294 1307738 1329011 1350566 1372295 1394322 1418334 1446508 1479272 1515229
50547A515229L7760L8815L8965L8008L6545L5023L3132L0995K9765L0189L1777
50536A896203L4160L8053M4075N1675N9974O8377P5693Q0155Q1441Q1687Q3508
50525B595001Q7872R4569J03345J13439J22934J29941J34091J36020J35957J33477
50515C786646J28185J19921J08620R4383P7413N7867L6252J3835q067k9118m9476
50504D336461o8673q5911j01065j13958j22960j25977j22780j14796j02657q5860
50494C291824o5061m2685k0702M67K0357L7633N1409O1515O6672O4313N3215L4846
50482C553803J1225j6732m7680p8308j04844j25156j38683j45723j47793j47212
50472B612897j45077j40649j33435j24570j15222j05184r4100q2834p2419o2899
$$ plain form
50547 1515229 1552989 1591804 1630769 1668777 1705322 1740345 1773477 1804472 1834237 1864426 1896203
50536 1896203 1930363 1968416 2012491 2064166 2124140 2192517 2268210 2348365 2429806 2511493 2595001
50525 2595001 2682873 2777442 2880787 2994226 3117160 3247101 3381192 3517212 3653169 3786646
50515 3786646 3914831 4034752 4143372 4237755 4315168 4373035 4409287 4423122 4415055 4385937 4336461
50504 4336461 4267788 4181877 4080812 3966854 3843894 3717917 3595137 3480341 3377684 3291824
50494 3291824 3226763 3184078 3163376 3163843 3184200 3221833 3273242 3334757 3401429 3465742 3518957 3553803
50482 3553803 3565028 3548296 3500616 3422308 3317464 3192308 3053625 2907902 2760109 2612897
50472 2612897 2467820 2327171 2193736 2069166 1953944 1848760 1754660 1671826 1599407 1536508
50462A536508n4228m7026m1383l6159l0598k5442k1414j7802j3707r379n208p24
50450A233438M133Q067J0307J2175J5303J9259K2525K4957K7597L0896L4681L9211
50438A482549M4426M8310M7594M0477K8083J3546L35r171j4477j6550j6318j4183
50426A634621j0960q022n864l675r87J433L114M979P857J1073J3708J6157J9289
50413A682723K3142K7653L3562M1127M8867N5131O0152O5125O9870P3018P4030
50402B254400P3584P2114O9258O4691N8578N1328M3625L6213K9007K0768J0417
50391B783983j845j5152k8957m2768n5799o7550p7820q5549q8904q7476q3086
50380B149077p7381o9836n9456m7233l5143k3656j1980k35J0331J8914K5411K9286
$$ plain form
50462 1536508 1482280 1435254 1393871 1357712 1327114 1301672 1280258 1262456 1248749 1239370 1234162 1233438
50450 1233438 1237571 1245638 1255945 1268120 1283423 1302682 1325207 1350164 1377761 1408657 1443338 1482549
50438 1482549 1526975 1575285 1622879 1663356 1691439 1704985 1705320 1696149 1681672 1665122 1648804 1634621
50426 1634621 1623661 1615639 1609775 1606100 1605113 1606546 1609660 1614639 1622496 1633569 1647277 1663434 1682723
50413 1682723 1705865 1733518 1767080 1808207 1857074 1912205 1972357 2037482 2107352 2180370 2254400
50402 2254400 2327984 2400098 2469356 2534047 2592625 2643953 2687578 2723791 2752798 2773566 2783983
50391 2783983 2782138 2766986 2738029 2695261 2639462 2571912 2494092 2408543 2319639 2232163 2149077
50380 2149077 2071696 2001860 1942404 1895171 1860028 1836372 1824392 1824157 1834488 1853402 1878813 1908099
50368A908099K9554K5872J8635Q316m305j7609k9909m0456m8840n3973n4876n2068
50356A688440m7163m1382l5519l1004k9763l2816l9452m7508n4135n6976n5540
50345A217182n1150m5246l8445l1421k5383k0783j6664j2257q229n382l237j023
50333I57962R67K223L240M611N822O071N485M443K798R51M62K078M330N657O701
50318A013801Q734J1004J1876J1706J2300J4012J5499J5989J5847J5204J4106
50307A160078J3602J4790J7051J9236K2046K6915L3080L8454M3312N0198O0169
50296A498931P2557Q8737J11026J34378J42792J20041O5598k391o0688r6621j11410
50285A962950j12460j05680r4301q1141o9005n9090n0625m2664l5293k8742k2437
$$ plain form
50368 1908099 1937653 1963525 1982160 1990476 1986171 1968562 1938653 1898197 1849357 1795384 1740508 1688440
50356 1688440 1641277 1599895 1564376 1533372 1503609 1470793 1431341 1383833 1329698 1272722 1217182
50345 1217182 1166032 1120786 1082341 1050920 1025537 1004754 988090 975833 967604 962222 958985 957962
50333 957962 958929 961152 964392 969003 974825 980896 986381 990824 993622 994573 995035 997113 1001443 1007100 1013801
50318 1013801 1022535 1033539 1045415 1057121 1069421 1083433 1098932 1114921 1130768 1145972 1160078
50307 1160078 1173680 1188470 1205521 1224757 1246803 1273718 1306798 1345252 1388564 1438762 1498931
50296 1498931 1571488 1660225 1771251 1905629 2048421 2168462 2234060 2231669 2170981 2074360 1962950
50285 1962950 1850490 1744810 1650509 1569368 1500363 1441273 1390648 1347984 1312691 1283949 1261512
50274A261512j5802r336m010M3L584P309J1432J5741J9624K2528K4862K7703L1090
50261A396280L3454L3624L2429L1322L0203K7955K4538K1227J9082J8235J8362
50250A686711J8751J8178J5777J1781O618k15r236j9417k8671l5647l9986m1297
50238A583347l9235l4436k8186k1141j3481o358k139k823q531j7197k5331k9803
50226A354686k9961k7823k5552k3357k0408j6928j4114j2598j2201j2737j3907
50215A145100j4772j4559j3745j3358j3557j3743j3595j3087j2075j0790j0098
50204A001721j0262j0262r333q256p970p922p309o838p464q295p722o050m915
50191H99123m602l976k867k397k859l219k979k730k717k435j870j573j390n79
$$ plain form
50274 1261512 1245710 1236374 1232364 1232407 1235991 1243300 1254732 1270473 1290097 1312625 1337487 1365190 1396280
50261 1396280 1429734 1463358 1495787 1527109 1557312 1585267 1609805 1631032 1650114 1668349 1686711
50250 1686711 1705462 1723640 1739417 1751198 1757816 1757601 1748365 1728948 1700277 1664630 1624644 1583347
50238 1583347 1544112 1509676 1481490 1460349 1446868 1440510 1438371 1435548 1427017 1409820 1384489 1354686
50226 1354686 1324725 1296902 1271350 1247993 1227585 1210657 1196543 1183945 1171744 1159007 1145100
50215 1145100 1130328 1115769 1102024 1088666 1075109 1061366 1047771 1034684 1022609 1011819 1001721
50204 1001721 991459 981197 971864 963608 955638 947716 940407 933569 926105 917810 910088 904038 899123
50191 899123 894521 890545 887678 885281 882422 879203 876224 873494 870777 868342 866472 864899 863509 862930
50177H62930O49J272J201J367J902J784O44n03p02q7P29J244J069M13M10J769
50161H76091L400L813L473M161O222Q313R823J1651J4385J7489K0738K4786K9901
50148A034246L5525M1456M8009N4667N9986O3080O3931O2277N7854N1874M6653
50137A619558M3346M1543M1113M2587M5215M6499M4450L8917L0206J8006K533
50126B013973j4540l1109m5728n7380o5355o9889p1837p1473o8537o3447n7293
50115A397385n0569m3311l6370l1026k7315k4357k2217k1611k1652k0045j5946
50104A082966j0879o385k820p14r86k924m114l636l362m991p645r665j1022j2461
50090A001362j3653j3836j3155j2095j0514q344o286m805l428j826n59J49J073
$$ plain form
50177 862930 863579 864851 866052 867419 869321 871105 871749 871246 870544 870457 871186 872430 873499 873912 874322 876091
50161 876091 879491 883304 886777 890938 897160 905473 915296 926947 941332 958821 979559 1004345 1034246
50148 1034246 1069771 1111227 1159236 1213903 1273889 1336969 1400900 1463177 1521031 1572905 1619558
50137 1619558 1662904 1704447 1745560 1788147 1833362 1879861 1924311 1963228 1993434 2011440 2013973
50126 2013973 1999433 1968324 1922596 1865216 1799861 1729972 1658135 1586662 1518125 1454678 1397385
50115 1397385 1346816 1303505 1267135 1236109 1208794 1184437 1162220 1140609 1118957 1098912 1082966
50104 1082966 1072087 1065702 1062882 1062168 1061182 1058258 1054144 1050508 1047146 1042155 1034510 1024845 1013823 1001362
50090 1001362 987709 973873 960718 948623 938109 929765 923479 918674 915246 913420 912861 913010 914083
50077I14083K566L754M138M760O658R233J1214J2185J2230J1298R955R651J0918
50064A022643J2346J2441J1530J0660R711P969N781M135L174K264J163kj410l241
50050A099164m986n965o137n756m762l167j550m65K12Q97J816L268N632Q670J1534
50035A098405J3870J6134J8500K0564K2546K5634L0373L5768M0621M4799M8534
50024A415748N1479N3214N3693N2486M8700M2480L5621K9968K6154K4496K5479
50013A859518K7973K8165K2212R817n776k0988l4179m5359n4967o3082o9147p2388
50001A581799p2527o9865o4711n7354m8672l9906l1773k4638j9366j6673j5521
49990A120793j3750j0704p832o256n548n453o977j0532j4578j7373j8828j9494
$$ plain form
50077 914083 916649 920403 924541 929301 935959 945192 956406 968591 980821 992119 1002074 1011725 1022643
50064 1022643 1034989 1047430 1058960 1069620 1079331 1087300 1093081 1097216 1100390 1102654 1103817 1103815 1102405 1099164
50050 1099164 1094178 1088213 1082076 1076320 1071558 1068391 1066841 1066376 1066588 1067485 1069301 1072569 1078201 1086871 1098405
50035 1098405 1112275 1128409 1146909 1167473 1190019 1215653 1246026 1281794 1322415 1367214 1415748
50024 1415748 1467227 1520441 1574134 1626620 1675320 1717800 1753421 1783389 1809543 1834039 1859518
50013 1859518 1887491 1915656 1937868 1947685 1941909 1920921 1886742 1841383 1786416 1723334 1654187 1581799
50001 1581799 1509272 1439407 1374696 1317342 1268670 1228764 1196991 1172353 1152987 1136314 1120793
49990 1120793 1107043 1096339 1088507 1082251 1076703 1071250 1064273 1053741 1039163 1021790 1002962 983468
49978I83468j9155j7650j5880j4578j3126j0964q978q145p762o695n367m918n088
$$ plain form
49978 983468 964313 946663 930783 916205 903079 892115 883137 874992 867230 860535 855168 850250 845162
$$ [...]
##END NTUPLES=NMR SPECTRUM
##END=
