##TITLE=AC1704_ROEFFECT0028_8638039_x7djjFijcj
##JCAMPDX= 6.0         $$ Bruker NMR JCAMP-DX V2.0
##DATA TYPE= NMR SPECTRUM
##DATA CLASS= NTUPLES
##ORIGIN= BRUKER
##OWNER= Administrator
$$ 1.72 TOPSPIN		Version 2.1
$$ 2014-05-22 22:23:34.645 -0700  Administrator@X
$$ Compression mode = diff/dup
##.OBSERVE FREQUENCY= 400.02188249412
##.OBSERVE NUCLEUS= ^1H
##.ACQUISITION MODE= SIMULTANEOUS (DQD)
##.ACQUISITION SCHEME= undefined
##.AVERAGES= 8
##.DIGITISER RES= 22
##SPECTROMETER/DATA SYSTEM= spect
##.PULSE SEQUENCE= zg30
##.SOLVENT NAME= COFFEE_meoh
##.SHIFT REFERENCE= INTERNAL, COFFEE_meoh, 1, 14.98509
##AUDIT TRAIL= $$ (NUMBER, WHEN, WHO, WHERE, PROCESS, VERSION, WHAT)
$$ ##TITLE= Audit trail, TOPSPIN		Version 2.1
$$ ##JCAMPDX= 5.01
$$ ##ORIGIN= Bruker BioSpin GmbH
$$ ##OWNER= Administrator
$$ $$ E:\/data/COFFEE/nmr/AC1704_ROEFFECT0028_8638039_x7djjFijcj/10/pdata/1/auditp.txt
$$ ##AUDIT TRAIL=  $$ (NUMBER, WHEN, WHO, WHERE, PROCESS, VERSION, WHAT)
(   1,<2014-05-22 22:23:28.145 -0700>,<Administrator>,<X>,<go>,<TOPSPIN 2.1>,
      <created by zg
	started at 2014-05-22 22:22:22.051 -0700,
	POWCHK enabled, PULCHK disabled,
       configuration hash MD5:
       C8 4E 4E 5D D3 5C D8 9E 9F 52 82 E0 59 8A DE 15
       data hash MD5: 64K
       DD B8 45 5E CA B1 A2 BA 95 0D 2E 52 59 54 E0 42>)
(   2,<2014-05-22 22:23:31.066 -0700>,<Administrator>,<X>,<proc1d>,<TOPSPIN 2.1>,
      <Start of raw data processing
       efp LB = 0 FT_mod = 6 PKNL = 1 PHC0 = 0 PHC1 = 0 SI = 32K 
       data hash MD5: 32K
       0A 45 ED 3E FF 8F 76 94 B7 A6 40 A5 19 63 C0 19>)
(   3,<2014-05-22 22:23:31.363 -0700>,<Administrator>,<X>,<proc1d>,<TOPSPIN 2.1>,
      <pk PHC0 = 94.77356 PHC1 = 0 
       data hash MD5: 32K
       45 2E 21 62 27 8C 92 33 56 43 99 27 BA 44 CB CA>)
(   4,<2014-05-22 22:23:31.473 -0700>,<Administrator>,<X>,<proc1d>,<TOPSPIN 2.1>,
      <abs ABSG = 1 
       data hash MD5: 32K
       DA 3A 67 67 00 15 42 63 CC D9 0E E2 A0 2A 9F 82>)
(   5,<2014-05-22 22:23:31.520 -0700>,<Administrator>,<X>,<proc1d>,<TOPSPIN 2.1>,
      <abs ABSG = 2 
       data hash MD5: 32K
       5A 35 26 49 26 03 28 45 22 B6 D7 44 64 4D EE 23>)
(   6,<2014-05-22 22:23:31.582 -0700>,<Administrator>,<X>,<proc1d>,<TOPSPIN 2.1>,
      <abs ABSG = 3 
       data hash MD5: 32K
       21 D5 56 3A F9 40 DC 02 36 3D EB F4 AF 8F F7 A9>)
(   7,<2014-05-22 22:23:31.629 -0700>,<Administrator>,<X>,<proc1d>,<TOPSPIN 2.1>,
      <abs ABSG = 4 
       data hash MD5: 32K
       61 C1 24 D7 D7 E3 F4 86 1B F8 13 FD 59 47 54 A7>)
(   8,<2014-05-22 22:23:31.676 -0700>,<Administrator>,<X>,<proc1d>,<TOPSPIN 2.1>,
      <abs ABSG = 5 
       data hash MD5: 32K
       33 45 7C A6 73 09 1A A3 F5 19 D5 97 10 FA C0 BE>)
$$ ##END=
$$ 
$$ $$ hash MD5
$$ $$ ED 24 FC E9 A2 D3 CA 7F BD 29 0B 9F B4 1F E2 9B
##$RELAX= 
##$RELAX= 
##$RELAX= 
##$RELAX= 
##$RELAX= 
##$RELAX= 
##$RELAX= 
$$ Bruker specific parameters
$$ --------------------------
##$DU= <E:\>
##$EXPNO= 10
$$ [...]
##$TP= (0..7)
150 150 150 150 150 150 150 150
##$TP07= 0
##$TPNAME0= <>
##$TPNAME1= <>
##$TPNAME2= <>
##$TPNAME3= <>
##$TPNAME4= <>
##$TPNAME5= <>
##$TPNAME6= <>
##$TPNAME7= <>
##$TPOAL= (0..7)
0.5 0.5 0.5 0.5 0.5 0.5 0.5 0.5
##$TPOFFS= (0..7)
0 0 0 0 0 0 0 0
##$TUNHIN= 0
##$TUNHOUT= 0
##$TUNXOUT= 0
##$USERA1= <user>
##$USERA2= <user>
##$USERA3= <user>
##$USERA4= <user>
##$USERA5= <user>
##$V9= 5
##$VALIST= <valist>
##$VCLIST= <CCCCCCCCCCCCCCC>
##$VD= 0
##$VDLIST= <DDDDDDDDDDDDDDD>
##$VPLIST= <PPPPPPPPPPPPPPP>
##$VTLIST= <TTTTTTTTTTTTTTT>
##$WBST= 2048
##$WBSW= 25
##$XGAIN= (0..3)
0 0 0 0
##$XL= 0
##$YL= 0
##$YMAX_a= 611295
##$YMIN_a= -518262
##$ZGOPTNS= <>
##$ZL1= 120
##$ZL2= 120
##$ZL3= 120
##$ZL4= 120
##$ABSF1= 14.98509
##$ABSF2= -5.573092
##$ABSG= 5
##$ABSL= 3
##$ALPHA= 0
##$AQORDER= 0
##$ASSFAC= 0
##$ASSFACI= 0
##$ASSFACX= 0
##$ASSWID= 0
##$AUNMP= <proc_prof1d_extract_pilot.lims>
##$AXLEFT= 0
##$AXNAME= <>
##$AXNUC= <1H>
##$AXRIGHT= 0
##$AXTYPE= 0
##$AXUNIT= <>
##$AZFE= 0.1
##$AZFW= 0.1
##$BCFW= 0
##$BC_mod= 0
##$BYTORDP= 0
##$COROFFS= 0
##$CY= 15
##$DATMOD= 1
##$DC= 0
##$DFILT= <>
##$DTYPP= 0
##$F1P= 0
##$F2P= 0
##$FCOR= 0.5
##$FTSIZE= 32768
##$FT_mod= 6
##$GAMMA= 0
##$GB= 0
##$INTBC= 1
##$INTSCL= 1
##$ISEN= 128
##$LB= 0
##$LEV0= 0
##$LPBIN= 0
##$MAXI= 10000
##$MC2= 0
##$MEAN= 0
##$ME_mod= 0
##$MI= 0
##$NCOEF= 0
##$NC_proc= -8
##$NLEV= 6
##$NOISF1= 0
##$NOISF2= 0
##$NSP= 0
##$NTH_PI= 0
##$NZP= 0
##$OFFSET= 14.98509
##$PC= 1
##$PHC0= 94.77356
##$PHC1= 0
##$PH_mod= 1
##$PKNL= yes
##$PPARMOD= 0
##$PPDIAG= 0
##$PPIPTYP= 0
##$PPMPNUM= 2147483647
##$PPRESOL= 1
##$PSCAL= 4
##$PSIGN= 0
##$PYNMP= <proc.py>
##$REVERSE= no
##$SF= 400.02
##$SI= 32768
##$SIGF1= 0
##$SIGF2= 0
##$SINO= 400
##$SIOLD= 32768
##$SPECTYP= <>
##$SREGLST= <1H.CDCl3>
##$SSB= 0
##$STSI= 32768
##$STSR= 0
##$SW_p= 8223.68421052631
##$SYMM= 0
##$S_DEV= 0
##$TDeff= 65536
##$TDoff= 0
##$TI= <>
##$TILT= no
##$TM1= 0
##$TM2= 0
##$TOPLEV= 0
##$USERP1= <user>
##$USERP2= <user>
##$USERP3= <user>
##$USERP4= <user>
##$USERP5= <user>
##$WDW= 1
##$XDIM= 32768
##$YMAX_p= 465694605
##$YMIN_p= -803016
##$CURPLOT= <Network HP LaserJet P1505>
##$CURPRIN= <$Network HP LaserJet P1505>
##$DFORMAT= <normdp>
##$LAYOUT= <+/1D_H.xwp>
##$LFORMAT= <normlp>
##$PFORMAT= <normpl>
##$SURQMSG= 1
$$ End of Bruker specific parameters
$$ ---------------------------------
##NTUPLES= NMR SPECTRUM
##VAR_NAME=  FREQUENCY,     SPECTRUM/REAL,   SPECTRUM/IMAG
##SYMBOL=    X,             R,               I
##VAR_TYPE=  INDEPENDENT,   DEPENDENT,       DEPENDENT
##VAR_FORM=  AFFN,          ASDF,            ASDF
##VAR_DIM=   32768,         32768,           32768
##UNITS=     HZ,            ARBITRARY UNITS, ARBITRARY UNITS
##FACTOR=    0.250966925370066, 1,           1
##FIRST=     8223.43324360094, 53064,        -6498
##LAST=      0,             -149045,         -2087
##MIN=       0,             -803016,         0
##MAX=       8223.43324360094, 465694605,    0
$$ Real data points
##PAGE= N=1
##DATA TABLE= (X++(R..R)), XYDATA
$$ [...]
$$ plain form
19554 65018 -122009 32302 -41201 69686 31855 -106129 -240562 278279 -252861 -144527
19544 -144527 -333955 -52684 19625 -87499 160681 -214890 -63444 -60212 -34723 38689 -43526
19532 -229327 -69541 172355 -83338 3261 115238 -10169 -67815 152338 106712 178781 -295602
19520 -18746 17908 -208291 23957 113977 118773 212612 -13441 -126336 -159997 -237749 -394507
19509 -394507 55724 -100058 24766 79202 282793 -260391 8152 -111688 145514 -175669
19498 216822 -46155 54418 -187006 -154663 -185822 -100686 102679 126693 -209858 -89187 33039
19486 65995 -422368 9920 -156160 -327162 -12333 -39196 -393197 -242355 -76539 -199699 101978
19474 -172785 -271271 -404918 -84161 -135298 -286591 -256535 -75772 -438720 -133467 -186386 12544
$$ packed form
19554F5018a22009C2302d1201F9686C1855a06129j34433B78279b52861J08334
19544a44527j89428e2684A9625h7499A60681b14890f3444L232K5489C8689d3526
19532b29327f9541A72355h3338C261J11977a0169n7646A52338m5626P2069b95602
19520a8746A7908b08291B3957R0020M796R3839a3441j12895l3661p7752j56758
19509c94507E5724a00058B4766N4436K03591b60391H152a11688A45514a75669
19498B16822d6155E4418a87006L2343l1159Q5136A02679K4014b09858h9187C3039
19486F5995d22368I920a56160j71002a2333k6863l54001J50842g6539j23160A01978
19474a72785r8486j33647h4161n1137j51293L0056g5772l62948a33467n2919A2544
$$ plain form
19462 48773 -108746 10259 168285 -181186 -126344 22313 -238810 -228620 -171865 -32314 -79131
19451 -79131 -803016 106216 -77846 -27147 -108746 -133945 -91440 248099 256559 -61903 -198189
19440 -198189 413275 19031 -99218 -128198 -169379 -291764 -150036 -280849 186121 -315897
19429 120996 -84406 -17341 -152487 -213853 -184374 304913 -188559 118923 -219751 148162
19418 -81741 -347971 110422 36495 -59051 -158276 86961 82506 -25100 -164122 31150 162582
19407 162582 -304168 -241357 255431 -12505 135886 -243831 166440 -164078 18497 -112069
19396 -75637 451323 45626 161288 -26425 35166 -133808 143306 -278513 240169 -145818
19385 113031 -160839 -114269 71003 365814 60839 200076 -97709 -122096 -216237 -246764 -49834
$$ packed form
19462D8773a08746A0259J58026a81186N4842B2313b38810J0190N6755c2314m6817
19451g9131p23885A06216g7846b7147q1599k5199M2505B48099Q460f1903j36286
19440a98189D13275A9031i9218k8980m1181j22385J41728j30813A86121c15897
19429A20996h4406a7341j35146o1366K9479C04913a88559A18923b19751A48162
19418h1741k66230A10422C6495e9051r9225H6961m455b5100j39022C1150J31432
19407A62582c04168O2811B55431a2505A35886b43831A66440a64078A8497a12069
19396g5637D51323D5626J15662b6425C5166a33808A43306b78513B40169a45818
19385A13031a60839M6570G1003K94811F0839J39237i7709k4387r4141l0527d9834
$$ plain form
19373 149135 33829 21215 -304603 -2434 129675 86075 -298275 -182971 -170967 59477 -310487
19361 -24966 -109977 145112 177543 -222239 -360197 241978 -19223 35998 -118884 54389 219911
19350 219911 -24965 -109954 -48030 -64357 -137999 216062 52350 -99152 -390247 186730 -24306
19338 -78126 80794 -66591 -357887 98824 -168448 319181 -152750 -124727 144132 -119698
19327 -7095 66046 208820 205585 -101730 -155536 223601 311956 177728 -291490 -59478 -40161
19316 -40161 -129840 -168639 -294911 83358 -36166 -194479 -4315 -206998 -313869 118014 -88679
19304 -204137 -332481 -103454 -177752 16984 -133592 -192754 -11161 -125497 -674 11431 188716
19293 188716 59777 -137068 130708 -250040 -136320 -256981 -245610 -173492 11755 -90098
$$ packed form
19373A49135C3829j2614c04603b434A29675m3600b98275J15304J2004E9477c10487
19361b4966q5011A45112L2431b22239j37958B41978a9223C5998a18884E4389J65522
19350B19911b4965q4989d8030j6327p3642B16062E2350i9152k91095A86730b4306
19338g8126H0794f6591k91296I8824a68448C19181a52750K8023A44132a19698
19327g095F6046J42774l235a01730n3806B23601Q8355j34228b91490e9478J9317
19316d0161q9679l8799j26272H3358c6166j58313d315k02683j06871A18014h8679
19304b04137j28344a03454p4298A6984a33592n9162a1161j14336f74A1431J77285
19293A88716E9777a37068A30708b50040J13720j20661J1371P2118A1755i0098
$$ plain form
19282 -634 173374 -93146 -234938 -232642 -165578 -121962 -228279 -73894 119044 -364672 -32187
19270 89015 215259 -76168 90183 -232535 130905 25034 -34021 23033 -396722 -5958 -222041
19259 -222041 117300 148486 -73419 -124126 105702 -147309 57201 -86858 -29902 -112098 -204285
19248 -204285 314966 -165414 -110354 -382119 -27205 -101303 -52138 -34425 -73744 -12333 97708
19236 -141438 -84911 67607 -125853 64344 -199649 -248596 -52028 166021 -79145 224888 30545
19224 -257023 -158036 14985 -295997 105952 -422047 -25698 86522 25531 39209 -194267 -118641
19213 -118641 -374539 -194148 -152608 -72045 -406662 -74306 230637 -19541 -188521 234686
19202 -279736 -226560 -37130 236999 151384 197015 34382 -82153 149285 -48117 -11415 42521
$$ packed form
19282f34A73374i3146j41792K296O7064M3616j06317g3894A19044c64672c2187
19270H9015J26244g6168I0183b32535A30905B5034c4021B3033c96722e958k16083
19259b22041A17300L1186g3419n0707A05702a47309E7201h6858b9902q2196r2187
19248b04285C14966a65414N5060k71765b7205p4098M9165J7713l9319a2333I7708
19236a41438N6527F7607a25853F4344a99649m8947e2028A66021g9145B24888C0545
19224b57023R8987A4985b95997A05952d22047b5698H6522B5531J3678a94267P5626
19213a18641k55898J80391M1540g2045l34617g4306B30637a9541j68980B34686
19202b79736N3176c7130B36999q5615M5631C4382h2153A49285d8117a1415D2521
$$ plain form
19190 -25216 -179332 -331715 -175119 -103794 111994 -85808 -44544 -442770 -282411 -21897
19179 361918 82513 -117566 -174219 48542 -85063 -101263 62459 191789 -80290 181429 -149799
19167 260289 277003 23503 -70473 92341 233311 74792 -162845 -99557 -31044 59740 -36425
19155 -186735 -156416 -208392 -194492 281318 88635 61517 135142 -139241 46761 133938 33367
19143 37196 -183699 -69189 -248646 -213161 6312 -85260 -242294 457870 -58609 -9789 -218791
19132 -218791 67212 146669 -278266 -240915 -18948 -212336 -129828 37125 -14834 236351 69287
19120 -114912 -19223 87972 -316073 -55990 -254432 -43082 105932 -161392 227721 -99921
19109 226899 26816 -175232 -203420 91696 -77929 -330641 -107888 -343978 -81610 27898 -319678
$$ packed form
19190b5216j54116j52383J56596P1325A11994h5808M1264l98226J60359b1897
19179C61918H2513a17566n6653D8542h5063j6200F2459J29330h0290A81429a49799
19167B60289J6714B3503g0473I2341J40970G4792a62845O3288c1044E9740c6425
19155a86735L0319n1976J3900B81318H8635k7118P3625a39241D6761Q7177C3367
19143C7196a83699f9189j79457L5485F312h5260j57034D57870e8609i789k09002
19132b18791F7212P9457b78266L7351a8948j93388Q2508C7125a4834B36351F9287
19120a14912a9223H7972c16073e5990j98442d3082A05932a61392B27721i9921
19109B26899B6816a75232k8188I1696g7929k52712a07888k36090h1610B7898c19678
$$ plain form
19097 103825 -19675 -310201 -589843 -43175 -414242 31011 -39101 -71329 -103285 50975 215868
19086 215868 179109 -104123 89851 81676 67049 91050 171552 33278 137636 145169 -96360
19074 -54872 -273735 -90921 -151738 122385 80066 -12959 -617676 -9942 -41418 -97100 -131807
19063 -131807 -250197 -234867 -174398 -341050 -9623 -273793 -111775 -171253 67967 -78539 -190210
19052 -190210 266667 68566 60409 -324500 -204235 144326 375862 185341 -23461 -68055
19042 -68055 -92354 -268667 -42259 -173203 -43786 -298238 -66253 -138561 169064 178864 89352
19030 -23369 345695 -33595 20735 23809 41312 284370 533918 161183 49406 -42331 -163862
19019 -163862 102260 -175204 28200 17443 -227554 111581 -19645 -23072 151985 17803 24895
$$ packed form
19097A03825a9675k90526k79642d3175l71067C1011c9101l2228l1956E0975J64893
19086B15868l6759a04123H9851q175j4627K4001Q0502C3278J04358P533i6360
19074e4872k18863i0921o0817A22385m2319a2959o04717i942l1476n5682l4707
19063a31807j18390J5330O0469j66652i623k64170a11775n9478F7967g8539j11671
19052a90210B66667F8566q157c24500J20265A44326K31536A85341b3461m4594
19042f8055k4299j76313d2259j30944d3786k54452f6253p2308A69064R800H9352
19030b3369C45695c3595B0735L074J7503K43058K49548A61183D9406d2331j21531
19019a63862A02260a75204B8200j0757b27554A11581a9645l427A51985A7803P092
$$ plain form
19008 24895 113919 -226004 396006 -82636 -17872 294325 -46426 -218562 -303689 -57131 -188027
18997 -188027 63309 -136266 -317420 87266 15757 103702 276410 -66157 -253692 37829 -133859
18985 194237 192166 122329 123238 -168344 -148933 -16125 1794 -8871 51968 168707 -15431 200588
18972 -48263 -149516 197451 -167842 133108 -401458 36652 -343802 170211 -138276 -45389
18961 -180756 -174971 -321302 -100391 87237 -65043 171131 44610 161062 -101252 -407090
18951 -407090 -320264 121206 20025 -100449 -89958 52822 -243250 134920 -74953 99417 -157798
18939 -293516 306462 235106 90605 156942 -17592 41118 -257542 92860 -117428 6429 19405
18928 19405 -49857 94314 53033 92339 -362288 204593 -324729 -266789 35573 18031 -77296
$$ packed form
19008B4895Q9024b26004C96006h2636a7872B94325d6426j72136q5127e7131j30896
18997a88027F3309a36266j81154H7266A5757Q7945J72708f6157j87535C7829a33859
18985A94237k071o9837R09a68344J9411a6125A794h871E1968J16739a5431B00588
18972d8263j01253A97451a67842A33108d01458C6652c43802A70211a38276d5389
18961a80756N785j46331a00391H7237f5043A71131D4610J16452a01252l05838
18951d07090Q6826A21206B0025a00449J0491E2822b43250A34920g4953I9417a57798
18939b93516C06462p1356I0605O6337a7592D1118b57542I2860a17428F429J2976
18928A9405d9857I4314m1281L9306c62288B04593c24729N7940C5573j7542g7296
$$ plain form
18916 210516 -125886 187828 93468 -213131 -137066 215763 212846 -218995 -35214 -199292
18906 -199292 -102724 99271 -360819 -280101 174909 -256515 -160817 -6424 -238569 50034 -229494
18894 -84453 -473109 385970 -164978 6999 -77872 -165031 -156230 -256267 -330877 20607 345139
18883 345139 23566 158204 35806 -324823 -264729 80895 -235513 -117496 183024 201756
18873 201756 -18287 -117747 -191656 -73035 29404 437129 39107 -49324 323816 416290 151996
18861 -73077 188124 77855 154981 -26122 -125442 24077 96189 -104047 -147819 -286615 -173023
18850 -173023 77802 -113104 -136126 323912 131304 -27701 -60507 -70463 -230496 -1267 -20805
18839 -20805 182371 -28612 -229541 -43414 27770 16062 -20517 -102760 -28984 -58382 184752
$$ packed form
18916B10516a25886A87828I3468b13131P6065B15763k917b18995c5214j64078
18906a99292R6568I9271c60819Q0718A74909b56515R5698f424k32145E0034b29494
18894h4453l88656C85970a64978F999g7872q7159Q801j00037p4610B0607L24532
18883C45139B3566J34638C5806c24823O0094H0895b35513a17496A83024J8732
18873B01756a8287r9460p3909g3035B9404M07725C9107d9324C23816R2474A51996
18861g3077A88124G7855P7126b6122r9320B4077P2112a04047m3772j38796J13592
18850a73023G7802a13104k3022C23912A31304b7701l2806r956j60033a267j9538
18839b0805A82371b8612k00929d3414B7770j1708b0517q2243b8984k9398A84752
$$ plain form
18827 -131037 -24874 125970 -271687 -411459 -130239 39672 187073 -58581 98531 -245848
18816 -6267 -83362 -214144 91771 151017 193460 -20002 -37734 302079 213760 533388 167130
18804 -84531 -208542 -434440 103982 179896 -159326 285990 45737 -406426 107260 -323713
18793 13588 -36114 -145587 -342006 -78914 203050 -213462 -95721 135741 -3457 19307 205366
18782 205366 -64658 185458 -37312 -26984 -342699 112402 -185422 50020 -194621 373721
18771 -172048 -217140 86672 -139743 -22885 -67268 -175946 -97301 -10137 -395091 67060 -256350
18759 -122605 -238804 -179640 -27325 -4326 -313682 -358558 -36638 91132 238319 -235949 -4550
18747 235410 -86154 -29553 -276488 -158837 -198796 -65462 -45962 85139 -83375 -106221 -80079
$$ packed form
18827a31037b4874A25970b71687j39772a30239C9672J47401e8581I8531b45848
18816f267p7095j30782I1771N9246M2443b0002j7732C02079q8319L19628A67130
18804h4531j24011k25898A03982P5914a59326B85990D5737d06426A07260c23713
18793A3588c6114j09473j96419g8914B03050b13462i5721A35741c457A9307J86059
18782B05366f4658A85458c7312J0328l15715A12402a85422E0020a94621C73721
18771a72048m5092H6672a39743b2885m4383j08678P8645a0137l84954F7060b56350
18759a22605j16199N9164b7325d326l09356m4876c6638I1132J47187b35949d550
18747B35410h6154b9553k46935J17651l9959f5462J9500H5139h3375k2846K6142
$$ plain form
18736 -80079 110086 -107276 143850 7833 -96176 -104069 -307919 -19702 30454 -39040 -113910
18725 -113910 -39441 53104 61385 -22750 -96691 -56383 10722 383117 -227149 41140 100616
18714 100616 -185403 72010 35580 -268953 215431 -91794 -53 68303 105585 41073 188475
18703 188475 201139 -198588 -268174 -261086 -23231 -564394 -81835 -85525 -36399 -134763 135934
18691 124631 -85659 -251842 -232389 216285 221621 -191080 -137914 9709 94876 -331880 239665
18679 -204625 -160765 136994 -143874 116567 -311283 -31145 196672 -132414 -190322 -78017
18668 143294 211243 -264011 81357 -34902 -87997 237049 -118696 -140957 -36620 -270871 -81822
18656 -183459 -263599 94114 34228 192752 -140835 58735 137276 44661 126306 714 4185 260810
$$ packed form
18736h0079A10086a07276A43850G833i6176p893k03850a9702C0454c9040p4870
18725a13910c9441E3104Q281b2750p3941M0308A0722L72395b27149D1140N9476
18714A00616a85403G2010C5580b68953B15431i1794e3F8303L7282D1073J47402
18703A88475J2664a98588o9586P088b3231n41163h1835l690c6399r8364A35934
18691A24631h5659j66183J9453B16285N336a91080N3166I709Q5167c31880B39665
18679b04625M3860A36994a43874A16567c11283c1145A96672a32414n7908g8017
18668A43294O7949b64011H1357c4902n3095B37049a18696k2261c6620k34251h1822
18656a83459q0140I4114C4228J58524a40835E8735P8541D4661Q1645G14L471K56625
$$ plain form
18644 260810 30736 -230140 -33780 265871 -249113 -110847 89909 172676 -303877 292096
18633 -73448 58099 36486 23356 344120 -160986 -32446 11647 -130066 -57737 14177 128733
18622 128733 -11531 134693 -38337 -35176 38381 -162053 101452 -103718 -39018 -236226 25784
18610 -73129 -181948 138558 -98477 139591 302028 -102346 -266136 -92620 -95316 78430 -189941
18598 -130066 256930 -303523 155716 155929 -223871 15094 -58034 -146633 -60716 133396 -172369
18586 -82525 -250876 -257128 -466042 -315232 -131016 109781 -357948 -72800 -290660 281135
18575 171996 218275 70273 -284012 -248671 -96070 69504 -145758 -28478 -286007 -31734 20283
18563 -81385 -122484 101251 115292 59933 -168690 60673 -2840 -237607 23851 -220716 211923
$$ packed form
18644B60810C0736b30140c3780B65871b49113a10847H9909Q2767c03877B92096
18633g3448E8099k1613j3130L20764a60986c2446A1647a30066e7737A4177J14556
18622A28733a1531A34693c8337L161C8381a62053A01452a03718c9018j97208B5784
18610g3129j08819A38558i8477A39591J62437a02346j63790i2620k696G8430a89941
18598a30066B56930c03523A55716K13b23871A5094e8034q8599f0716A33396a72369
18586h2525j68351o252k08914J50810a31016A09781c57948g2800k17860B81135
18575A71996M6279G0273b84012L5341i6070F9504a45758b8478k57529c1734B0283
18563h1385m1099A01251J4041n5359a68690F0673b840k34767B3851b20716B11923
$$ plain form
18551 25668 -258893 -191790 -158693 -374479 83062 7734 -10510 -78655 -115540 -80250 27820
18539 -161347 -399615 -15543 -151000 -134223 -36369 63469 224619 180459 -115683 -179816 192458
18527 -41541 -350611 41835 -57199 37343 -82234 -270779 -318740 -63378 -131166 -75901 241836
18515 216968 191901 -199451 -154256 27620 -58035 3543 171375 -147386 -168246 -410775 59338
18503 -214277 -99902 -131141 -12476 -24114 -431753 39746 156740 44713 -152791 129918 139833
18492 139833 -377649 90575 135475 -118547 -338767 -50930 119892 -327367 -30281 57829
18481 -118611 -119257 121809 -218397 -81754 -190066 -246266 -471572 -9097 -35733 249806 -74261
18469 -104050 -55733 -189038 -383708 147162 -14046 2975 205784 -51082 42576 18752 398154
$$ packed form
18551B5668b58893O7103L3097k15786H3062G734a0510o8145l6885L5290B7820
18539a61347k38268a5543j35457J6777c6369F3469J61150m4160a15683o4133A92458
18527d1541l09070D1835e7199C7343h2234j88545m7961f3378o7788N5265B41836
18515B16968k5067a99451M5195B7620e8035C543J67832a47386k0860k42529E9338
18503b14277i9902l1239a2476j1638m07639C9746J16994D4713a52791A29918R915
18492A39833c77649I0575M4900a18547k20220e0930A19892c27367c0281E7829
18481a18611o46A21809b18397h1754j08312n6200k25306i097k6636B49806g4261
18469a04050M8317j33305j94670A47162a4046B975K02809e1082D2576A8752L79402
$$ plain form
18458 398154 -147040 -292402 -168998 32421 -165162 -174519 307639 -15728 -58015 234242
18447 102538 17662 22249 -269579 223438 133639 -402159 -278838 -140370 3653 -164715 57424
18435 -44705 134349 292031 -13888 97532 -173456 -331436 -152907 -50597 -183594 -160801
18425 -160801 -157005 -154540 215660 -399995 29667 -249504 139767 20861 135118 -114039 -257474
18414 -257474 -108486 -370671 -372755 -298861 -119064 -104607 -117587 98302 52683 -129361 153223
18402 -275893 -174498 187198 18135 -131195 242952 -39171 51711 -69841 173322 156837
18392 156837 123879 -137586 -160562 -350470 -20843 85472 112672 171324 61540 -339889 -26492
18380 308394 -328221 -52730 -81059 76981 -25105 354734 246836 -331089 -74997 28646 177946
$$ packed form
18458C98154a47040j45362J23404C2421a65162r357C07639a5728m2287B34242
18447A02538A7662M587b69579B23438q9799d02159J23321J38468C653a64715E7424
18435d4705A34349J57682a3888I7532a73456j57980a52907e0597j32997K2793
18425a60801L796K465B15660c99995B9667b49504A39767B0861J14257a14039j43435
18414b57474a08486k62185k084P3894a19064J4457j2980I8302m5619a29361A53223
18402b75893J01395A87198A8135a31195B42952c9171E1711f9841A73322j6485
18392A56837l2958a37586k2976j89908b0843H5472K7200N8652F1540c39889b6492
18380C08394c28221e2730k8329G6981b5105C54734j07898c31089g4997B8646J49300
$$ plain form
18369 177946 -119277 -74230 133337 -97069 166497 -216472 -64295 158013 -84360 22016
18358 59981 -188608 -73284 -94768 84551 4076 107634 -91768 -125904 305620 -209066 95654
18346 -155050 -129027 -115767 -13896 -192113 -76312 -336850 231394 -145268 -123 42986 277229
18335 277229 -260316 109051 -74813 -46997 46334 -241214 44479 129961 241217 -228248
18324 66831 -227979 -83634 -97675 -78486 -266480 96246 -198987 -144914 41921 -37458 -256973
18313 -256973 73724 -288791 -186492 -140973 248931 11428 140457 -327936 -3434 -227348
18303 -227348 -235854 -193816 254846 41044 -120078 -632028 -33422 -170686 -425116 -255685
18293 -255685 -275051 63835 151147 31010 120470 170370 -62412 213656 197282 58304 -532965
$$ packed form
18369A77946a19277M5047A33337i7069A66497b16472f4295A58013h4360B2016
18358E9981a88608g3284k1484H4551D076J03558i1768l4136C05620b09066I5654
18346a55050K6023J3260a3896j78217g6312k60538B31394a45268a23D2986K34243
18335B77229b60316A09051g4813K7816D6334b41214D4479Q5482J11256b28248
18324F6831b27979h3634j4041J9189j87994I6246a98987N4073D1921c7458k19515
18313b56973G3724b88791J02299M5519B48931A1428J29029c27936c434k23914
18303b27348q506M2038B54846D1044a20078n11950c3422j37264k54430J69431
18293b55685j9366F3835Q7312C1010Q9460M9900f2412B13656j6374E8304e32965
$$ plain form
18281 126128 -77203 -56314 54161 -45965 153826 -29908 78984 -180736 -162148 171144 -59802
18269 176190 179416 137843 17760 -359964 -132876 -154951 76878 131462 39469 324319 40829
18257 -35377 -95371 100727 -270123 -40392 74726 -22553 -319014 -79591 -38057 -208722 -34870
18245 103533 96563 -31187 211776 -89945 -147039 -1210 14948 -38808 43226 71509 -13894 -143162
18233 -143162 26176 -59305 -231840 -220143 -339729 -148376 98520 -201739 -186337 -210712 -4583
18221 42434 187791 -235441 -5322 -69493 -69187 -279822 133775 -5217 -64908 -359175 -63999
18209 -156268 -84142 -89882 -306225 -47166 113395 462167 -145925 24371 -168769 26429 -107192
18197 -64704 -211799 -77647 -146939 -238933 -196460 -150059 -269174 167364 10297 -93953 -271842
$$ packed form
18281A26128g7203K0889E4161d5965A53826b9908G8984a80736J8588A71144e9802
18269A76190L226m1573A7760c59964a32876k2075G6878N4584C9469K84850D0829
18257c5377n9994A00727b70123d0392G4726b2553k96461g9591c8057j70665c4870
18245A03533o970c1187B11776h9945n7094a210A4948c8808D3226K8283a3894j29268
18233a43162B6176e9305j72535J1697j19586a48376I8520b01739J5402k4375d583
18221D2434J45357b35441e322o4171L06k10635A33775e217n9691k94267f3999
18209a56268P2126n740k16343d7166A13395L48772a45925B4371a68769B6429a07192
18197f4704j47095g7647o9292r1994M2473M6401j19115A67364A0297i3953j77889
$$ plain form
18186 -271842 17375 -363120 139568 -381505 218619 15343 230049 -170497 -345586 179614
18175 -37678 -156944 147699 26035 -261892 -229366 153914 -133813 -168152 -72057 210523
18164 -72435 -141778 -381617 117727 11727 47571 323231 24168 -134115 -159028 3252 34995
18153 34995 36395 -87082 -68296 23396 67281 -59386 -156545 -97473 -98282 14587 -36970 -96576
18141 -96576 60171 -1355 -145704 -203801 -159508 -110381 -46984 45811 -166058 -200917 146490
18129 124740 83558 -307019 181380 104388 31883 -217207 -92058 308937 303617 -175291 -358544
18118 -358544 12520 -170704 -232744 -271069 -285368 -162626 121094 -5982 -328708 -36985 69134
18106 62005 -161362 -65291 -148738 93296 46478 -179533 -75021 -88339 96149 -219513 -61992
$$ packed form
18186b71842A7375c63120A39568c81505B18619A5343K14706a70497j75089A79614
18175c7678j19266A47699B6035b61892L2526A53914a33813l4339g2057B10523
18164g2435o9343k39839A17727A1727L5844K75660B4168a34115k4913C252L1743
18153C4995J400h7082J8786B3396M3885e9386r7159N9072q09A4587c6970n9606
18141i6576F0171a355j44349n8097M4293M9127d6984D5811a66058l4859A46490
18129A24740m1182c07019A81380p6992C1883b17207i2058C08937n320a75291j83253
18118c58544A2520a70704o2040l8325j4299J22742A21094e982l22726c6985F9134
18106F2005a61362f5291q3447I3296D6478a79533g5021j3318I6149b19513f1992
$$ plain form
18094 74365 -6759 39783 -137513 -71403 -13699 -257584 129670 193266 52116 -190994 -61514
18082 -22654 -387362 -73834 100409 59720 -149715 -23591 1509 -76001 144344 -18858 104765
18070 1810 -203774 -111114 -180194 -74251 163640 -256083 -40393 -207630 319547 -137518 93686
18058 133999 43098 94390 -180542 -271997 -64380 86017 -16840 55057 102142 19175 -82466
18046 -193236 8024 244710 147684 -3635 203296 -24624 50146 142114 7860 70919 -109819
18034 -28541 38598 -132975 -154852 105913 25365 -151789 12754 82444 66075 19469 -338620
18022 -457659 -232807 -130882 294667 116284 -84089 39038 -22978 -235363 116103 71214
18012 71214 -85971 126734 144155 -50590 322037 199062 105589 134454 404736 42521 -129682
$$ packed form
18094G4365f759C9783a37513O6110a3699k43885A29670O3596E2116a90994f1514
18082b2654l64708g3834A00409m0689a49715b3591A509g6001A44344a8858A04765
18070A810b03774R2660o9080g4251A63640b56083d0393j67237C19547a37518I3686
18058A33999D3098N1292a80542r1455f4380H6017a6840E5057M7085A9175h2466
18046a93236H024K36686r7026c635B03296b4624E0146R1968G860O3059a09819
18034b8541C8598a32975k1877A05913B5365a51789A2754O9690j6369A9469c38620
18022d57659K24852J01925B94667A16284h4089C9038b2978k12385A16103m4889
18012G1214h5971A26734J7421e0590C22037j22975r3473K8865K70282D2521a29682
$$ plain form
18000 -88891 -218134 -254997 33274 52797 64024 14452 -491456 -25388 -175782 90640 96761
17989 96761 -132253 -176766 30975 54102 184281 -124932 -128131 101812 77153 268909 -140445
17977 -344540 -51578 -45641 139328 97579 -45912 182959 191998 -134690 -104085 147700 -145527
17965 -271517 232322 467005 295493 -129846 -277700 219620 3235 84868 281762 -48565
17954 18928 -68135 -187883 -207471 -100315 43220 -184347 -205584 67659 -459676 -143919 -102232
17943 -102232 -135898 -14219 -22734 -110433 -39772 -162158 92544 -261943 154327 -39265 -5388
17931 894 -95775 7719 -47534 -88011 160470 -112606 -48338 -57739 -202833 -47480 70886 -29130
17918 -285807 -240812 -260891 -238762 -49800 -65719 -62985 224160 -147324 -179107 -76984 -26308
$$ packed form
18000h8891j29243l6863C3274J9523J1227A4452d91456b5388j50394I0640O121
17989I6761a32253m4513C0975K3127J30179a24932l199A01812k4659J91756a40445
17977c44540e1578N937A39328m1749d5912A82959R039a34690L0605A47700a45527
17965b71517B32322K34683j71512a29846j47854B19620C235Q1633J96894d8565
17954A8928f8135j19748j9588a00315D3220a84347k1237F7659d59676a43919M1687
17943a02232l3666a4219q515q7699c9772j22386I2544b61943A54327c9265e388
17931H94i5775G719d7534m0477A60470a12606d8338r401j45094d7480G0886b9130
17918b85807M4995k0079K2129d9800j5919K734B24160a47324l1783g6984b6308
$$ plain form
17906 65155 65334 -54265 110038 -151517 92984 -118998 -91708 157606 117461 -1089 21555
17894 96336 93069 312661 -303939 -40560 41995 100695 -22919 10540 -327910 -40715 77856
17882 -30371 180130 -265649 118753 -56339 -119863 -325933 51887 -34992 99749 -277888 66144
17870 -36386 121289 -89020 18220 -233754 -38098 278686 -212602 -35106 149039 -218900
17859 -36923 25422 -38849 -90710 177951 133690 -156514 -24917 128443 -367309 -53421 -78165
17848 -78165 260881 -179206 -114365 -117795 -69159 59062 -228899 -124159 87748 -82155 -9617
17836 -131959 124279 -289874 -179595 944 237365 -91126 -127743 501326 110651 -12268 243270
17824 378458 4407 -206420 285303 -368992 -40070 74757 -25145 -103259 -240742 82837 -280381
$$ packed form
17906F5155J79e4265A10038a51517I2984a18998K7290A57606m0145a089B1555
17894I6336l267K19592c03939d0560D1995N8700b2919A0540c27910d0715G7856
17882c0371A80130b65649A18753e6339o3524k06070E1887c4992I9749b77888F6144
17870c6386A21289h9020A8220b33754c8098B78686b12602c5106A49039b18900
17859c6923B5422c8849n1861A77951m4261a56514b4917A28443c67309e3421k4744
17848g8165B60881a79206O4841l430M8636E9062b28899J04740H7748h2155i617
17836a31959A24279b89874J10279I44K36421i1126l6617E01326A10651a2268B43270
17824C78458D407b06420B85303c68992d0070G4757b5145p8114j37483H2837b80381
$$ plain form
17812 220564 603221 2932 294368 159390 172338 11190 7226 -121106 -218691 89272 -32838
17800 -97192 257728 -197078 -10716 23604 -141653 -187515 -49021 -141696 -57396 256705 -251458
17788 -222988 -244493 203596 -122289 52269 131764 -159419 -114079 141333 244040 114011
17777 -369146 -141761 -88117 -120018 15673 72063 -106947 105424 116983 224349 -234726
17766 21171 -410938 226894 -160582 110265 -8109 119393 174618 -77731 46280 301899 -127676
17754 224960 103212 -73103 133025 156627 234466 -131220 77834 -330556 -75735 -68187 -6517
17742 -138559 89234 -79424 44604 408770 -359951 14681 -296334 -231135 204490 -149959
17731 -322893 -182622 244150 -19191 151514 63614 -153066 -82011 110451 -82951 -36539
$$ packed form
17812B20564L82657B932K91436j34978J2948A1190l964a21106r7585H9272c2838
17800i7192B57728a97078a0716B3604a41653m5862d9021r2675e7396B56705b51458
17788b22988k1505B03596a22289E2269P9495a59419M5340A41333J02707A14011
17777c69146a41761N3644l1901A5673N6390a06947A05424J1559J07366b34726
17766B1171d10938B26894a60582A10265h109A19393N5225g7731D6280K55619a27676
17754B24960A03212g3103A33025K3602P7839a31220G7834c30556g5735P548f517
17742a38559H9234g9424D4604L64166c59951A4681b96334O5199B04490a49959
17731c22893J40271B44150a9191A51514F3614a53066P1055A10451h2951c6539
$$ plain form
17720 -3134 -264584 -71724 -118771 149176 1899 32325 99883 186241 93858 137125 -187812
17708 -130860 142939 -84580 -302152 -147240 191367 41725 60111 -102885 242767 -66625
17697 96984 -115342 24529 133009 -97942 162248 -20608 233061 -86106 -88524 -42673 -188088
17686 -188088 232439 -221761 60020 187902 429530 -251100 261675 62040 -211720 -51527
17675 190140 32668 196229 138325 137660 99183 38043 -23295 110554 -83662 43607 -273802
17663 92193 -228862 96616 -111958 98435 192353 204091 -39640 -29713 -109258 -108172 -20463 81915
17650 -13367 -156870 4178 151966 -114574 -126001 130608 -264073 60755 -304977 258697
17639 -19498 145310 55149 -289288 -25050 -125910 214653 -95773 205443 -107632 -73854
$$ packed form
17720c134k61450g1724m7047A49176A899L0426O7558Q6358r2383M3267a87812
17708a30860A42939h4580k17572a47240A91367D1725J8386a02885B42767f6625
17697I6984a15342B4529J08480i7942A62248b0608B33061h6106k418d2673j45415
17686a88088B32439b21761F0020J27882K41628b51100B61675F2040b11720e1527
17675A90140C2668J63561n7904o65l8477C8043b3295A10554h3662D3607b73802
17663I2193b28862I6616a11958I8435R3918J1738c9640R927p9545J086b0463H1915
17650a3367j43503D178J47788a14574j1427A30608b64073F0755c04977B58697
17639a9498A45310E5149b89288b5050j00860B14653i5773B05443a07632L3778
$$ plain form
17629 -73854 218293 -15839 343479 104922 -28192 21433 -3612 -233994 -40202 -109000 184208
17617 -12807 461828 -20250 -167221 -45368 26235 -111707 196538 117609 166112 30238 461198
17606 461198 250168 81456 -164033 -243501 73553 -47651 36341 129861 221734 -203993 -82666
17594 -192451 79950 -145933 172948 -101124 -392513 293241 -17195 102230 296839 309780
17584 309780 -8921 -163384 -50263 142422 -46828 -84598 -147208 342659 36323 99093 -100678
17572 180414 197875 175307 -190923 61909 148994 -78155 -21119 -30185 -123405 -119668 25662 173751
17560 173751 235220 -25374 48099 125693 48077 288299 -486250 104041 -216430 68981 188248
17549 188248 130241 -303301 147298 -157869 64623 52063 67015 -158005 91426 89833 286788
$$ packed form
17629g3854B18293a5839C43479A04922b8192B1433c612k30382d0202o8798A84208
17617a2807D61828b0250j46971d5368B6235a11707A96538p8929M8503C0238M30960
17606D61198k11030H1456a64033p9468G3553d7651C6341R3520R1873b03993h2666
17594a92451G9950a45933A72948a01124k91389B93241a7195A02230J94609J2941
17584C09780h921j54463e0263A42422d6828l7770o2610C42659C6323O2770a00678
17572A80414J7461k2568a90923F1909Q7085g8155b1119r066r3220L737B5662J48089
17560A73751O1469b5374D8099P7594D8077K40222d86250A04041b16430F8981J19267
17549A88248n8007c03301A47298a57869F4623j2560J4952a58005I1426j593J96955
$$ plain form
17538 286788 -69504 190063 88191 -29794 127021 168571 64219 81416 250731 -63423 210210
17526 -81568 266938 -64935 151086 -136712 -75588 428206 276382 -75027 115399 304897
17516 304897 51611 165185 192604 -118987 -260061 51086 155014 -70467 69781 -214616
17505 36279 97286 -4649 102238 -24214 14218 239537 58810 -424907 13336 199089 -3930
17493 150658 154331 126475 432181 4923 156920 41465 114078 -34483 192221 172419 -64748
17481 156808 -59769 -8962 10299 37705 -2566 -54421 350470 166071 -197423 -153205 -88474
17470 -88474 360022 275965 114624 160775 287797 -141725 -50660 359041 77590 -22620 -198592
17459 -198592 148539 107718 222510 190725 54637 362011 422532 -3482 134040 217670 239355
$$ packed form
17538B86788f9504A90063H8191b9794A27021M1550F4219J7197J69315f3423B10210
17526h1568B66938f4935A51086a36712O1124D28206j51824g5027A15399J89498
17516C04897E1611J13574K7419a18987j41074E1086J03928g0467F9781b14616
17505C6279O1007d649A02238b4214A4218K25319E8810d24907A3336J85753c930
17493A50658L673k7856L05706D923J51997D1465P2613c4483A92221j9802f4748
17481A56808e9769h962A0299K7406b566n1855C50470A66071a97423M4218O4731
17470h8474C60022q4057A14624M6151J27022a41725e0660C59041G7590b2620j75972
17459a98592A48539m0821J14792l1785E4637L07374O0521c482A34040Q3630K1685
$$ plain form
17448 239355 274191 529164 71851 547760 99975 125688 224218 455933 200814 248758 309772
17437 309772 72336 -22469 202462 310571 386885 -105114 132072 469264 169086 380163
17427 380163 149415 332641 395831 -15191 196556 35467 136896 423818 74367 -127187
17416 352223 649686 -12901 264530 97753 378009 355194 53665 240632 202344 128966 163799
17405 163799 41596 243696 289686 75180 -73420 97645 -61855 -13378 -111859 243347 241593
17394 241593 107533 285448 99872 192785 -112700 298324 210674 243577 11247 139311
17384 139311 -59099 554050 -99225 12895 244664 -12565 144703 278364 228626 175637 552942
17373 552942 368908 33968 136074 185803 132946 -35698 -7918 -82308 -1447 90223 201150
$$ packed form
17448B39355L4836K54973G1851M75909I9975K5713R8530K31715B00814M7944O1014
17437C09772G2336b2469B02462J08109P6314a05114A32072L37192A69086K11077
17427C80163A49415J83226O3190a5191A96556C5467J01429K86922G4367a27187
17416C52223K97463a2901B64530I7753K80256k2815E3665J86967l8288p3378L4833
17405A63799D1596K02100M5990G5180g3420I7645f1855a3378r8481B43347j754
17394B41593A07533J77915I9872R2913a12700B98324q7650L2903A1247J28064
17384A39311e9099E54050i9225A2895K31769a2565A44703J33661m9738n2989L77305
17373E52942j84034C3968J02106M9729n2857c5698g918p4390a447I0223J10927
$$ plain form
17362 201150 53189 378518 -136289 107481 21240 -31265 96423 60221 12099 204665 -31227
17350 -51710 68927 178681 -119937 185950 191111 -278059 68469 432243 -83632 256647 18919
17338 245019 19214 257839 43330 25615 314815 261253 136529 195531 288968 197308 217038
17327 217038 215082 -409497 94352 188914 255992 538473 39579 -167672 320992 58886 102068
17316 102068 249328 -32352 -166175 -28554 -16221 379377 518240 -873 182690 305097 -40248
17304 497131 -13120 180613 239589 76937 50502 179326 101769 80859 -51157 -64475 -30516
17292 -133221 286389 -34431 401481 165739 31665 327686 317359 202725 -198715 149116
17281 -118837 121886 247457 203648 115580 36001 -200834 78366 176135 -136289 396336
$$ packed form
17362B01150E3189L25329a36289A07481B1240c1265I6423l6202A2099J92566c1227
17350e1710F8927J09754a19937A85950N161b78059F8469L63774h3632B56647A8919
17338B45019A9214K38625D3330j7715K89200n3562j24724N9002R3437r1660J9730
17327B17038j956d09497I4352R4562O7078K82481C9579a67672C20992E8886M3182
17316A02068J47260c2352j33823b8554J2333C79377J38863h73A82690J22407d0248
17304D97131a3120A80613N8976G6937k6435J28824p7557k0910e1157j3318c0516
17292a33221B86389c4431D01481A65739C1665K96021j0327j14634a98715A49116
17281a18837A21886J25571m3809q8068C6001b00834G8366R7769a36289C96336
$$ plain form
17270 90870 -116775 -2934 361154 -34931 183675 308083 333748 167314 -40052 -13461 286790
17258 280428 143499 19936 221825 320889 121070 -163770 -151120 -11610 316929 225859
17248 225859 345328 15510 185406 -28956 -28730 129811 60191 -192849 298662 419615 543348
17237 543348 267568 19553 139990 -14258 178955 339924 191778 615953 -20855 344453
17226 67200 176713 273696 349953 273037 432882 255547 25116 64161 425404 -259091 205209
17214 -44348 119823 126014 291135 6248 144929 116888 392284 -237559 177519 388514 363858
17203 363858 125228 247921 -184855 158029 -90190 396115 278610 578795 397848 -116439
17192 114938 590084 210075 201883 172256 486417 241389 -85292 395606 598563 427063
$$ packed form
17270I0870a16775b934C61154c4931A83675J24408K5665j66434d0052a3461B86790
17258B80428j36929A9936K01889R9064A21070a63770J2650a1610C16929r1070
17248B25859J19469A5510J69896b8956K26A29811F0191a92849B98662J20953J23733
17237E43348B67568A9553J20437a4258A78955J60969j48146M24175b0855C44453
17226F7200J09513R6983P6257p6916J59845j77335B5116L9045L61243b59091B05209
17214d4348A19823O191J65121F248J38681k8041K75396b37559A77519K10995k4656
17203C63858A25228J22693a84855A58029i0190C96115j17505L00185j80947a16439
17192A14938M75146B10075q192k9627L14161B41389h5292C95606K02957j71500
$$ plain form
17182 427063 239023 276894 277962 617108 15412 408399 90139 35809 -51876 371586 -31748
17170 568464 411244 243316 98963 261674 -8567 401099 132260 331410 211744 312137
17160 312137 284312 143514 557543 234227 132497 302265 339057 169503 112967 -48910
17149 9050 294086 98042 212063 163291 -89219 108175 480149 272013 298385 108947 388870
17138 388870 173455 323592 590388 275240 359175 327142 101118 421700 381278 619993
17128 619993 418601 219014 122532 238455 229223 -45980 272961 490789 -7105 147429 141730
17117 141730 377062 237566 363296 504639 450904 362899 709905 259807 262940 288515
17107 288515 221127 119247 135731 145968 366179 268183 307158 271742 320057 660914 506526
$$ packed form
17182D27063j88040L7871J068L39146A5412L92987I0139C5809e1876C71586c1748
17170E68464j57220j67928I8963J62711h567D01099A32260J99150j19666J00393
17160C12137k7825j40798M14029B34227j01730J69768L6792A69503n6536d8910
17149I050K85036I8042J14021m8772h9219A08175L71974k08136K6372A08947K79923
17138C88870A73455J50137K66796B75240Q3935l2033A01118L20582m0422K38715
17128F19993k01392j99587r6482J15923r232d5980B72961K17828g105A47429n699
17117A41730K35332j39496J25730J41343n3735q8005L47006B59807L133K5575
17107B88515o7388j01880J6484J0237K20211r7996L8975l5416M8315L40857j54388
$$ plain form
17096 506526 339598 300499 458752 111053 140583 568289 240644 409697 130324 173405
17086 173405 578835 286505 261011 361522 107584 299915 343149 306556 747254 441074
17076 441074 335840 113546 725605 417345 458111 554793 266056 366429 490580 312994
17066 312994 183764 427895 455111 520294 411215 653191 389516 550258 479671 823933
17056 823933 560988 403705 248456 393016 648459 813782 438220 606422 537482 345803
17046 345803 422081 787862 513141 492729 230865 412671 -126208 581506 334782 564918
17036 564918 320366 467706 635842 185131 562006 482496 569427 703369 458929 454602
17026 454602 383265 366573 619935 572854 720226 773379 589565 821703 446764 733847
$$ packed form
17096E06526j66928l9099J58253A11053K9530M27706B40644J69053A30324M3081
17086A73405M05430B86505k5494J00511A07584J92331M3234l6593M40698l06180
17076D41074j05234A13546O12059l08260M0766R6682B66056J00373J24151j77586
17066C12994j29230K44131K7216O5183j09079K41976k63675J60742p0587L44262
17056H23933k62945j57283j55249J44560K55443J65323l75562J68202o8940j91679
17046C45803P6278L65781k74721k0412B30865J81806a26208E81506k46724K30136
17036E64918k44552J47340J68136A85131L76875p9510Q6931J33942k44440m327
17026D54602p1337j6692K53362m7081J47372N3153j83814K32138l74939K87083
$$ plain form
17016 733847 676554 678588 562536 810566 951100 645374 490629 569098 970692 553454
17006 553454 760253 662840 926174 1040728 666454 671968 942260 552366 917599 757578
16996 757578 536952 764980 840896 782909 944560 714982 532985 566707 371573 562556
16986 562556 411286 654919 969844 670784 823944 923883 420809 669690 1053757 699750
16976 699750 793496 870040 887050 669674 640420 721033 641735 913906 936151 1125842 980569
16965 980569 1034875 1121009 866373 746922 937393 577745 829052 851882 795618 577105
16955 577105 1174865 933090 1083235 1097017 1046352 1035688 697421 1371660 1337904 966411
16945 966411 882111 1026897 1135230 1309579 1189047 973370 876370 1166264 958519 1108069
$$ packed form
17016G33847n7293K034j16052K48030J40534l05726j54745P8469M01594m17238
17006E53454K06799r7413K63334J14554l74274N514K70292l89894L65233j60021
16996G57578k20626K28028P5916n7987J61651k29578j81997L3722j95134J90983
16986E62556j51270K43633L14925k99060J53160R9939D20809K48881L84067l54007
16976F99750R3746P6544J7010k17376k9254Q0613p9298K72171K2245J89691j45273
16965I80569N4306Q6134k54636j19451J90471l59648K51307K2830n6264k18513
16955E77105N97760k41775J50145J3782n0665j0664l38267O74239l3756l71493
16945I66411q4300J44786J08333J74349j20532k15677r7000K89894k07745J49550
$$ plain form
16935 1108069 1354046 1024305 1068956 1121593 1201542 1040398 1589071 1182030 1176805 1083001
16925 1083001 1320636 1232196 1119921 1483947 1707349 1324914 1316805 1037153 1865366 1437431
16915 1437431 1527179 1471404 1516392 1164060 1401125 1469188 1617785 899785 1319706 1430263
16905 1430263 1203908 1310805 1544976 1510372 1392624 2147445 1718972 1551888 1885796 1508069
16895 1508069 1568137 1480552 1724879 1683310 1912681 1649606 1843015 1552224 1624753 1907670
16885 1907670 1902266 2193561 1923844 2144448 2073893 1906561 1958893 2179790 2142891 2165563
16875 2165563 1854853 2266856 2024384 2037083 2016617 2309412 2169245 2550499 2536498 2151204
16865 2151204 2292365 2409794 2209885 2631908 2765499 2459888 2425488 2486239 2621936 2320978
$$ packed form
16935A108069K45977l29741M4651N2637P9949j61144N48673m07041n225r3804
16925A083001K37635q8440j12275L64026K23402l82435q109k79652Q28213m27935
16915A437431Q9748n5775M4988l52332K37065O8063J48597p18000M19921J10557
16905A430263k26355J06897K34171l4604j17748P54821m28473j67084L33908l77727
16895A508069O0068q7585K44327m1569K29371k63075J93409k90791P2529K82917
16885A907670n404K91295k69717K20604p0555j67332N2332K20897l6899K2672
16875B165563l10710M12003k42472J2699k0466K92795j40167L81254j4001l85294
16865B151204J41161J17429j99909M22023J33591l05611l4400O0751J35697l00958
$$ plain form
16855 2320978 2868533 2390042 3074782 2504810 2780802 2845540 2844776 3187440 3167611 3001740
16845 3001740 3141531 3157121 3374077 3281490 3344202 3315759 3423490 3498896 3595780 3491906
16835 3491906 3803023 4042948 3905686 3969888 3779129 4434500 4166474 4079149 4024893 4133400
16825 4133400 4485210 4331175 4472576 4450220 4910041 4399199 4763200 4762160 4870178 5198266
16815 5198266 5323558 5526081 5545473 5375985 5444914 5630088 5715649 5920455 6230571 5857654
16805 5857654 6248635 6411641 6650481 6851840 6597204 6975267 7289495 7495587 7549003 7570850
16795 7570850 7451726 8252945 8204449 8316844 8844193 9013924 9043019 9263330 9608026 10133480
16785 10133480 9915843 10512903 10737159 11139630 11493049 11770596 12122165 11922665 12570047
$$ packed form
16855B320978N47555m78491O84740n69972K75992O4738p64L42664j9829j65871
16845C001740J39791J5590K16956r2587O2712k8443J07731P5406R6884j03874
16835C491906L11117K39925j37262O4202j90759O55371k68026q7325n4256J08507
16825D133400L51810j54035J41401k2356M59821n10842L64001j040J08018L28088
16815E198266J25292K02523J9392j69488O8929J85174Q5561K04806L10116l72917
16805E857654L90981J63006K38840K01359k54636L78063L14228K06092N3416K1847
16795G570850j19124Q01219m8496J12395N27349J69731K9095K20311L44696N25454
16785A0133480k17637N97060K24256M02471L53419K77547L51569j99500O47382
$$ plain form
16776 12570047 13048571 13471397 13709207 13908776 14895333 15002133 15420553 16039024 16654673
16767 16654673 17218383 17698711 18396122 18971218 19711252 20593507 21320778 21725746 23078331
16758 23078331 23997687 24880169 26061747 27361386 28199204 29608760 30622806 32293888
16750 32293888 33906095 35327037 36840902 39069604 41032346 42977696 45626247 47577769
16742 47577769 50066797 52948798 55814392 59098062 62373083 66145930 70023010 74176856
16734 74176856 78471384 83663998 88766398 94198200 99991526 106128480 112530632 119503127
16726 119503127 126593093 133831235 140856358 148531605 155844830 162628352 168900288 175129124
16718 175129124 180127518 183778159 186949099 188606041 188583155 187874399 185593579 181701098
$$ packed form
16776A2570047M78524M22826K37810J99569R86557J06800M18420O18471O15649
16767A6654673N63710M80328O97411N75096P40034Q82255P27271M04968J352585
16758B3078331R19356Q82482J181578J299639Q37818J409556J014046J671082
16750C2293888J612207J420942J513865K228702J962742J945350K648551J951522
16742D7577769K489028K882001K865594L283670L275021L772847L877080M153846
16734G4176856M294528N192614N102400N431802N793326O136954O402152O972495
16726A19503127P089966P238142P025123P675247P313225O783522O271936O228836
16718A75129124M998394L650641L170940J656942k2886p08756k280820l892481
$$ plain form
16710 181701098 177110984 171370177 165072356 158488248 151611261 143822044 136219064 129064599
16702 129064599 121875794 114590427 108169722 101560266 95463491 89541164 84511508 79359945
16694 79359945 74572390 70212701 65986776 62258128 58642340 55818387 52295546 49595575
16686 49595575 46633620 44592465 42412488 40104015 38094362 36202105 34405067 33212720
16678 33212720 31383652 29889982 28363468 27327702 26370706 25049313 24070058 23188387
16670 23188387 22167202 21417880 20504551 19746674 18830157 18243979 17297241 16873387 16341494
16661 16341494 15697506 14855446 14768839 13919144 13564610 13007772 12336756 11944983 11812309
16652 11812309 11352073 11246694 10733068 10648274 10192070 9770337 9417141 8998954 9068297 8603977
$$ packed form
16710A81701098m590114n740807o297821o584108o876987p789217p602980p154465
16702A29064599p188805p285367o420705o609456o096775n922327n029656n151563
16694G9359945m787555m359689m225925l728648l615788k823953l522841k699971
16686D9595575k961955k041155k179977k308473k009653j892257j797038j192347
16678C3212720j829068j493670j526514j035766r56996j321393r79255q81671
16670B3188387j021185p49322r13329p57877r16517n86178r46738m23854n31893
16661A6341494o43988q42060q6607q49695l54534n56838o71016l91773j32674
16652A1812309m60236j05379n13626q4794m56204m21733l53196m18187O9343m64320
$$ plain form
16642 8603977 8432507 8218334 8261431 8030190 7848140 7609397 7201395 7214633 6960048 6803044
16632 6803044 6795436 6548768 6226313 6070415 5957027 5666120 5576715 5243150 5509079 5180496
16622 5180496 5124907 5229775 5099893 4596297 4783683 4694530 4626494 4384993 4195804 4278589
16612 4278589 4124873 4338188 4101066 3828813 3739530 3891256 3792576 3603197 3704467 3511970
16602 3511970 3374337 3658044 3399060 3164025 2814726 3068959 3148405 2794157 2889674 2953888
16592 2953888 2865139 2721916 2617052 2743589 2731691 2581523 2273652 2330491 2426483 2129824
16582 2129824 2413442 2355062 2018697 2310576 2297312 2215460 2204491 1892839 2083184 1817345
16572 1817345 2257378 1847499 2323871 2135288 1689572 1796863 1645759 2145296 1829805
$$ packed form
16642H603977j71470k14173M3097k31241j82050k38743m08002J3238k54585j57004
16632F803044p608k46668l22455j55898j13388k90907q9405l33565K65929l28583
16622E180496n5589J04868j29882n03596J87386q9153o8036k41501j89189Q2785
16612D278589j53716K13315k37122k72253q9283J51726r8680j89379J01270j92497
16602C511970j37633K83707k58984k35035l49299K54233P9446l54248R5517O4214
16592B953888q8749j43223j04864J26537j1898j50168l07871N6839R5992k96659
16582B129824K83618n8380l36365K91879j3264q1852j0969l11652J90345k65839
16572A817345M40033m09879M76372j88583m45716J07291j51104M99537l15491
$$ plain form
16563 1829805 1983654 2103911 1761523 1615000 1510641 1898731 1573184 1483322 1562424 1467669
16553 1467669 1653722 1560940 1590150 1685250 1505658 1536322 1358428 1317340 1436659 1279930
16543 1279930 1481994 1308006 1392646 1454102 1484267 1532413 1334305 1067528 1479450 1040477
16533 1040477 1191618 1048051 1080495 994312 1154381 1093683 1075261 1135496 1212814 926589
16523 926589 975814 773204 901553 639130 829483 1090964 808337 923791 960458 659863
16513 659863 908923 737021 776792 908600 1093303 1118490 893278 789757 731052 856048
16503 856048 883029 597327 735024 891114 750777 1044655 993272 854240 787309 940544
16493 940544 916663 634980 605954 534310 790724 410687 893521 720155 728428 736433 550975
$$ packed form
16563A829805J53849J20257l42388j46523j04359L88090l25547q9862P9102r4755
16553A467669J86053r2782K9210R5100j79592L0664j77894m1088J19319j56729
16543A279930K02064j73988Q4640O1456L0165M8146j98108k66777M11922m38973
16533A040477J51141j43567L2444q6183J60069o0698j8422O0235P7318k86225
16523I26589M9225k02610J28349k62423J90353K61481k82627J15454L6667l00595
16513F59863K49060j71902L9771J31808J84703K5187k25212j03521n8705J24996
16503H56048K6981k85702J37697J56090j40337K93878n1383j39032o6931J53235
16493I40544k3881k81683k9026p1644K56414l80037M82834j73366Q273Q005j85458
$$ plain form
16482 550975 805643 702464 685864 348083 920746 362961 451287 790668 605430 697384
16472 697384 825404 597662 569152 749207 921852 499422 501611 598680 343689 641854
16462 641854 478266 633192 324700 591565 633031 407998 545171 456302 510340 673918
16452 673918 159109 446495 517733 498573 632974 583045 549688 347387 698698 469026
16442 469026 719798 506098 473597 613402 157372 401691 631962 608646 171386 657292
16432 657292 149994 381273 564809 546400 619710 284229 455814 794887 46727 428542
16422 428542 375880 303278 407273 638751 220085 394779 673062 440144 288818 298228
16412 298228 459953 294914 398137 507627 187987 541271 318188 251732 452372 387289
$$ packed form
16482E50975K54668j03179j6600l37781N72663C62961Q8326L39381j85238R1954
16472F97384J28020k27742k8510J80055J72645m22430K189R7069k54991K98165
16462F41854j63588J54926l08492K66865M1466k25033J37173q8869N4038J63578
16452F73918A59109K87386P1238j9160J34401m9929l3357k02301L51311k29672
16442D69026K50772k13700l2501J39805A57372K44319K30271k3316A71386M85906
16432F57292A49994K31279J83536j8409P3310B84229J71585L39073D6727L81815
16422D28542n2662p2602J03995K31478B20085J74694K78283k32918j51326R410
16412B98228J61725j65039J03223J09490A87987L53284k23083o6456K00640o5083
$$ plain form
16402 387289 117423 -20749 316323 161607 300922 38562 213313 244514 98578 245510
16392 245510 -72519 154031 399704 278961 233883 247992 183405 161438 394282 262018
16382 262018 92787 285988 63755 323586 315157 367833 290887 257204 41932 279431 209513
16371 209513 290369 93359 -428 368194 20404 384347 390192 210124 202800 512529 249173
16359 346940 222534 147306 293751 76441 283726 31856 185313 83609 246423 180193
16349 180193 347285 406934 239816 109603 182116 324654 339188 -64874 357738 -67158
16338 427246 335778 371006 232329 -72788 264048 -101684 156087 505414 158842 151649
16328 151649 126760 389429 317838 66387 38570 70914 294714 -36274 -113351 292056 524276
$$ packed form
16402C87289A17423b0749C16323j54716J39315C8562J74751L1201I8578J46932
16392B45510g2519A54031K45673j20743m5078J4109o4587k1967K32844j32264
16382B62018I2787J93201F3755K59831q429N2676p6946l3683D1932K37499o9918
16371B09513Q0856I3359d28C68194B0404L63943N845j80068p324L09729B49173
16359C46940j24406p5228J46445G6441K07285C1856J53457H3609J62814o6230
16349A80193J67092N9649j67118A09603P2513J42538J4534f4874C57738f7158
16338D27246r1468L5228j38677g2788B64048a01684A56087L49327A58842p193
16328A51649k4889K62669p1591F6387k7817L2344K23800c6274p7077B92056K32220
$$ plain form
16317 524276 88159 38051 99201 22756 -39049 -61968 398744 -75455 237401 79855 44887
16306 44887 -105741 132503 130061 49380 -3317 -75164 25480 277317 108587 94428 200307
16295 200307 -64357 88255 19288 88455 146595 -78290 239255 348052 238263 63049 -19760
16283 50391 529946 -285675 322365 47319 8524 -4714 -181662 142386 239224 -223546 -70323
16271 221939 29215 348214 132962 218545 84469 -72556 180400 68678 278360 321312 -90105
16259 -329295 -99802 -140005 51877 -147551 -77287 229889 -73229 24665 -95473 150621 -7432
16247 35305 302111 -13248 6686 233141 265710 130338 69602 -140581 109320 252861 -92083
16235 159274 -47982 154001 320448 35101 168914 302546 434959 -88226 -102845 -57919
$$ packed form
16317E24276H8159C8051O1150B2756c9049k2919C98744g5455B37401G9855l4968
16306D4887a05741A32503k442D9380c317p1847B5480K51837A08587j4159J05879
16295B00307f4357H8255A9288O9167N8140g8290B39255J08797j09789F3049a9760
16283E0391M79555b85675C22365D7319H524d714j76948A42386R6838b23546g0323
16271B21939B9215L18999A32962Q5583H4469g2556A80400F8678K09682M2952i0105
16259c29295i9802m0203E1877a47551P0264B29889g3229B4665i5473A50621g432
16247C5305K66806a3248F686K26455L2569A30338o0736a40581A09320J43541i2083
16235A59274d7982A54001J66447C5101J33813J33632J32413h8226j4619M4926
$$ plain form
16225 -57919 -70042 339881 -260270 148597 246659 172195 102816 -72582 -50856 74566 590444
16214 590444 313285 -37534 88702 419898 -75192 59735 55431 153500 395403 -79574 76917
16202 -281908 -167413 291029 102491 -5897 88667 -41300 -96658 -57570 280103 97005 -32206
16190 119749 -104246 92827 43485 -127589 -155691 -104831 -109999 88464 -47787 -10311 -31093
16179 -31093 -243901 -452943 120240 4146 -118630 106761 -100566 58710 -107196 270371
16168 -77590 90129 412536 -130309 135326 -5278 67043 -43805 393873 -4795 317 66666 194090
16156 194090 19668 -92520 433237 161954 -82495 -79120 -55773 -280311 -131435 68941 123343
16145 123343 -186824 -29979 63495 90672 52229 -104143 -222396 -84502 168227 -22310 41572
$$ packed form
16225e7919j2123C39881b60270A48597R8062p4464o9379g2582K1726G4566N15878
16214E90444k77159c7534H8702L31196g5192E9735m304R8069K41903g9574G6917
16202b81908J14495B91029A02491e897H8667d1300n5358L9088B80103I7005c2206
16190A19749a04246I2827D3485a27589k8102N0860n168H8464d7787a0311k0782
16179c1093k12808k09042A20240D146a18630A06761a00566E8710a07196B70371
16168g7590I0129L22407a30309A35326e278F7043d3805C93873d795C17O6349J27424
16156A94090A9668i2520D33237A61954h2495L375K3347k24538a31435F8941N4402
16145A23343a86824b9979F3495K7177l8443a04143j18253h4502A68227b2310D1572
$$ plain form
16133 -315468 -129901 -648329 -8581 -9014 -192292 -247633 231933 84232 5158 -268512 233735
16121 -137142 50321 59169 375170 85312 -105735 -227257 -63154 147227 -135492 63092 -107217
16109 131219 113006 -265595 -76484 -6849 -158331 193814 215225 230789 -99808 12605 98449
16098 98449 28399 186842 63701 -257473 123636 201804 -249560 201630 47472 43212 186191
16087 186191 72387 223831 -107884 -82125 -139943 2192 116810 -147975 -256990 245557
16076 49037 -89341 150385 62441 -170062 179912 -26290 -3791 -173064 122597 144874 -50178
16064 -42838 -130387 -192112 -74224 77843 -131787 -179280 247048 24309 -191488 266962 -154247
16052 -34170 -913 -26411 -28097 102313 -32757 56020 -230641 -286734 248338 -231207 35802
$$ packed form
16133c15468a29901n18428h581m33j83278n5341B31933H4232E158b68512B33735
16121a37142E0321Q848L16001H5312a05735j21522f3154A47227a35492F3092a07217
16109A31219j8213b65595g6484f849j51482A93814K1411J5564i9808A2605Q5844
16098I8449B8399J58443F3701b57473A23636P8168b49560B01630D7472m260J42979
16087A86191G2387J51444a07884K5759n7818B192J14618a47975j09015B45557
16076D9037h9341A50385F2441a70062A79912b6290c791j69273A22597K2277e0178
16064d2838q7549o1725g4224G7843a31787m7493B47048B4309a91488B66962a54247
16052c4170i13k5498j686A02313c2757E6020b30641n6093B48338b31207C5802
$$ plain form
16040 226010 9513 -157675 -171035 -235418 -297512 -131130 43952 165409 -61481 -147150 151670
16028 98640 -63308 -23662 -4555 -47896 56384 -8300 375212 -157539 -107658 134685 389232
16017 389232 -123031 -293451 -254036 101716 -100703 -147637 -316714 82757 -104130 -352039
16007 -352039 -357696 13396 59361 136711 155949 -97526 81745 117944 8843 -149660 1044 -122561
15994 180786 -230695 36449 -414769 -2719 51499 385252 -223674 195932 234731 -44269 92628
15982 174551 7667 669683 410923 248696 -54602 120512 35913 50408 127629 -65121 -329394
15971 -329394 149915 150244 283056 -144729 349112 76204 -201809 -327582 67541 -149367
15960 -192543 -24365 192021 -22676 -62664 -324448 139565 90685 64929 -195589 -151322 165489
$$ packed form
16040B26010I513a57675j3360o4383o2094a31130D3952J21457f1481q5669A51670
16028I8640f3308b3662d555m3341E6384h300C75212a57539M9881A34685K54547
16017C89232a23031j70420L9415A01716a00703m6934j69077H2757a04130k47909
16007c52039n657A3396M5965P7350J9238i7526H1745L6199H843a49660A044a22561
15994A80786b30695C6449d14769b719E1499L33753b23674A95932L8799d4269I2628
15982A74551G667O62016k58760j62227e4602A20512C5913J4495P7221f5121k64273
15971c29394A49915L29J32812a44729C49112G6204b01809j25773F7541a49367
15960a92543b4365A92021b2676l9988k61784A39565m8880k5756a95589M4267A65489
$$ plain form
15948 -179460 50366 -11625 -10531 134935 21917 -59042 -127527 -184328 -61035 138884 147289
15937 147289 -97367 -77010 -37681 28615 -327618 -14234 -378671 -65703 -104645 -161705 261004
15925 -278478 -204390 -90949 251489 -133125 291039 -91793 87402 -201735 -130354 -260407
15915 -260407 156940 -27740 -121281 -150651 66447 -231579 -59691 -265440 38212 63510 173032
15904 173032 -21998 -58730 -214378 -119850 -447713 -145197 126561 -125854 -288189 54554
15893 -69231 -118143 7915 -50221 215108 -196468 -53181 -9347 44521 117630 54571 117340 -200463
15880 119725 -161932 117452 -145482 57678 125231 54742 -9405 -95281 -207305 188100 -9414
15868 161017 -153145 48498 -231200 -246421 -161739 -214259 120928 -203013 167812 -67129
$$ packed form
15948a79460E0366a1625J094A34935B1917e9042o8485n6801f1035A38884Q405
15937A47289i7367K0357c7681B8615c27618a4234l64437f5703l8942n7060B61004
15925b78478P4088i0949B51489a33125B91039i1793H7402b01735P1381j30053
15915b60407A56940b7740r3541k9370F6447b31579e9691k05749C8212K5298J09522
15904A73032b1998l6732j55648R4528l27863a45197A26561a25854j62335E4554
15893f9231m8912G915e0221B15108a96468e3181i347D4521P3109E4571O2769b00463
15880A19725a61932A17452a45482E7678O7553E4742i405q5876j12024A88100i414
15868A61017a53145D8498b31200j5221Q4682n2520A20928b03013A67812f7129
$$ plain form
15857 168724 12 -148801 168534 9042 76141 -17217 103105 95016 207176 -283467 -110119
15845 -15979 79865 -27165 36767 250570 -224460 -180807 -145514 -25701 80803 -87742 68090
15833 -14675 242856 -57274 -26328 -82551 -129533 -74540 -158500 -146148 -243593 76458 -130828
15821 -288834 -354828 -24412 -354603 -88114 -280395 43781 -247416 -662177 -5251 -150734 98240
15809 76011 -102344 -69480 103440 -203239 -8088 -63600 51058 -9686 -157040 38517 -361889
15797 -219898 -129949 56496 -75494 169074 97535 109639 -377030 -68104 303222 -23932 -24811
15786 -24811 -270827 -205354 -83217 -34756 -242488 -177759 -164581 182885 197810 -397476 -438933
15775 -438933 114625 82381 36223 118020 54771 -239959 -92787 196400 -229712 -10672 -142778
$$ packed form
15857A68724A2a48801A68534I042O7099a7217A03105q089J12160b83467a10119
15845a5979G9865b7165C6767K13803b24460M3653L5293b5701H0803h7742F8090
15833a4675B42856e7274b6328n6223m6982N4993q3960J2352r7445G6458a30828
15821b88834o5994b4412l30191h8114j92281D3781b47416m14761e251j45483I8240
15809G6011a02344L2864A03440b03239h088n5512E1058i686j47354C8517c61889
15797b19898Q9949E6496g5494A69074p1539J2104c77030f8104C03222b3932q79
15786b4811k46016O5473h3217c4756k07732O4729J3178A82885J4925c97476m1457
15775d38933A14625l2244C6223Q1797E4771b39959i2787A96400b29712a0672j32106
$$ plain form
15764 -142778 111187 50381 217354 158826 93250 -130402 122812 109935 35859 -284664
15753 29867 -354519 35107 227100 -9557 18075 133640 -135249 189040 212294 -43570 -162836
15742 -162836 -134312 46149 -9051 55203 56901 -70994 109804 73189 -80322 187806 -142863
15730 150487 149276 -163516 57856 99616 184895 23922 -54926 -218085 -403578 47592 -394294
15718 133760 278807 -227306 -127922 -11960 77873 -381956 54847 259538 99524 35619 -158623
15706 61716 218330 -167763 235761 116124 -346583 66345 -195582 109970 -79655 -76674
15696 -76674 -40836 155183 259204 -65915 245434 71140 -73534 102931 -261643 -136370
15686 -136370 244243 -134998 -159779 168582 -345467 -18189 72549 -242212 -229120 145722
$$ packed form
15764a42778A11187E0381J66973n8528o5576a30402A22812j2877C5859b84664
15753B9867c54519C5107J91993i557A8075J15565a35249A89040K3254d3570j19266
15742a62836K8524D6149i051E5203J698g0994A09804l6615h0322A87806a42863
15730A50487j211a63516E7856M1760Q5279B3922e4926j63159j85493D7592c94294
15718A33760J45047b27306R9384a1960G7873c81956E4847K04691I9524C5619a58623
15706F1716J56614a67763B35761A16124c46583F6345a95582A09970g9655K981
15696g6674L5838A55183J04021f5915B45434G1140g3534A02931b61643J25273
15686a36370B44243a34998k4781A68582c45467a8189G2549b42212J3092A45722
$$ plain form
15675 276805 -118509 -330226 22577 200214 346361 368768 -91997 31916 102282 -184870
15664 -314105 292 37008 130756 -273443 -119529 -121109 -264664 -203258 -31246 42594 94767
15653 94767 -221580 155648 -172304 92645 113443 16635 -279692 -55386 -51412 154268 7779
15641 109780 -15683 -147378 -34227 14686 271774 217547 -228913 -257176 191712 137572 223467
15630 223467 529 56279 -91754 184057 127565 -131837 -28102 18392 195770 -336991 -92693
15618 -45061 484967 -558 -52995 -23798 -96743 -123486 -70373 -123671 -116149 32861 -208676 150063
15605 101004 110015 -431966 -253750 -206849 232481 -329969 284657 -206994 216138 -87653
15594 -76773 -42842 -64395 -129429 -66203 33448 -55861 -209546 162826 114862 -12379 50895
$$ packed form
15675B76805a18509k11717B2577J77637J46147K2407i1997C1916P0366a84870
15664c14105B92L6716R3748b73443a19529j580j43555O1406c1246D2594N2173
15653I4767b21580A55648a72304I2645K0798A6635b79692e5386L974A54268G779
15641A09780a5683j31695c4227A4686K57088n4227b28913k8263A91712n4140Q5895
15630B23467E29N5750i1754A84057n6492a31837b8102A8392J77378c36991i2693
15618d5061D84967e58n2437b3798p2945k6743N3113n3298P522C2861b08676A50063
15605A01004R011d31966J78216M6901B32481c29969B84657b06994B16138h7653
15594g6773L3931k1553o5034O3226C3448e5861j53685A62826m7964a2379E0895
$$ plain form
15582 -321124 315503 -77489 -243175 -134891 -200271 -51972 -221805 -70005 -169072 -233129 -279689
15571 -279689 20278 191413 289588 16491 -268957 359739 -63308 -256861 50608 220865
15561 220865 224281 -145717 -370055 189523 -129518 -71378 -90506 -167199 -206203 -156163 -37701
15549 25885 -66057 25907 -180195 -283163 279472 -178276 -24542 -31656 -162731 -148377 -10834
15537 184227 285739 -120929 14471 6307 -147676 51443 -298644 -104225 -46087 -1093 -103694
15526 -103694 22539 90838 6715 -273308 437788 -44908 -428729 85577 -83305 114043 28885
15514 70363 -127571 -317372 293164 -44 -86396 129316 195440 96245 -197785 236766 -131706
15502 -366782 -209000 -280309 -314746 51589 2950 -253295 -27715 51778 -24953 18138 15109
$$ packed form
15582c21124C15503g7489j65686J08284o5380e1972j69833g0005r9067o4057m6560
15571b79689B0278J71135R8175A6491b68957C59739f3308j93553E0608J70257
15561B20865L416a45717k24338A89523a29518N8140j9128p6693l9004N0040c7701
15549B5885f6057B5907a80195j02968B79472a78276b4542p114j31075J4354a0834
15537A84227J01512a20929A4471F307a47676E1443b98644a04225d6087a093j02601
15526a03694B2539O8299F715b73308D37788d4908l83821H5577h3305A14043B8885
15514G0363a27571j89801B93164d4q6352A29316O6124I6245a97785B36766a31706
15502c66782J57782p1309l4437E1589B950b53295b7715E1778b4953A8138l029
$$ plain form
15491 15109 11334 -202944 -366445 42160 -140457 -105851 -72621 -111520 31508 149782 -47459
15479 91153 -93715 -152936 54277 49182 153729 -47000 -218403 -204250 112334 17504 -138774
15467 65492 -149600 1105 109090 143592 -65469 -226890 179431 -248913 -382135 -267933
15457 -267933 77216 -32717 176249 214335 79354 475930 -223156 -18313 62135 -152767 155305
15445 157573 174777 -30521 48828 247458 -197102 -72783 143805 26108 -117172 -449444
15435 -449444 167213 -10540 10842 -196240 -207746 137086 -81523 15421 109196 29818 -224207
15423 -14459 52612 211595 -101610 714 -34083 -97806 -136785 119465 -32700 94142 -168789
15411 64451 36519 179546 27612 369798 150807 71221 156788 -36840 -150719 -35553 -118813
$$ packed form
15491A5109l775b02944j63501D2160a40457L4606L3230l8899C1508J18274d7459
15479I1153i3715n9221E4277n095J04547d7000j71403J4153A12334A7504a38774
15467F5492a49600A105J07985L4502f5469j61421A79431b48913j33222J14202
15457b67933G7216c2717A76249L8086G9354L96576b23156a8313F2135a52767A55305
15445A57573J7204c0521D8828J98630a97102g2783A43805B6108a17172l32272
15435d49444A67213a0540A0842a96240j1506A37086h1523A5421R3775B9818b24207
15423a4459E2612J58983a01610G14c4083o3723l8979A19465c2700I4142a68789
15411F4451k7932J43027B7612L42186A50807G1221Q5567c6840j13879c5553q3260
$$ plain form
15400 -118813 -106638 -70343 -66377 2308 -176999 174453 77535 67665 216765 -210760 -37424
15388 241346 -87335 24847 -188666 164693 202328 293153 170842 -116699 192017 -69637
15377 -109504 196150 -53442 75514 -115394 -110421 825 95623 126146 -108585 -16635 -187425
15366 -187425 92852 -372939 -107770 327562 126012 173724 -483354 84613 -81300 168339
15355 -237277 -101183 -227063 17667 246092 17590 -154723 -128372 -194403 -36395 -205245
15345 -205245 -44448 2398 55147 -152050 2719 156144 -369693 52588 4578 -86007 -119765
15334 -119765 -99088 -288765 413545 -6127 304470 -253528 134028 138761 186353 163774 152047
15323 152047 -48062 -257798 27821 -102187 -151097 -177354 136893 -84022 -56512 -15181 59882
$$ packed form
15400a18813J2175L6295L966B308a76999A74453G7535r870J49100b10760c7424
15388B41346h7335B4847a88666A64693L7635R0825j22311a16699A92017f9637
15377a09504A96150e3442G5514a15394M973H25R4798L0523a08585a6635j70790
15366a87425I2852c72939a07770C27562A26012M7712d83354H4613h1300A68339
15355b37277a01183j25880A7667K28425A7590a54723K6351o6031c6395j68850
15345b05245d4448B398N2749a52050B719J53425c69693E2588D578h6007l3758
15334a19765K0677j89677D13545f127C04470b53528A34028M733M7592k2579j1727
15323A52047d8062k09736B7821a02187m8910k6257A36893h4022K7510a5181E9882
$$ plain form
15311 42465 -205442 55837 202862 -123929 99826 143295 107370 8718 -254217 -159025 -250494
15300 -250494 138460 143117 -41776 -295741 181055 -114827 198242 58352 -61098 -13846 301770
15288 -25071 89946 201484 -138586 174374 -53201 154066 263957 146298 -131069 7990
15277 257895 -410545 138501 311962 98487 -166412 147690 -75405 -144614 -211294 -37548
15266 -51834 -12219 -126158 -81704 -14608 443123 169356 436507 -3045 137207 161458 85345
15255 85345 678 76383 235010 81326 47616 140795 -98027 184166 1001124 1364322 935763
15244 935763 1163581 1193223 -28417 273183 -82387 -57378 164496 29715 93591 171750 -82170
15232 -17091 -192807 158208 83282 468748 214110 -45441 -325317 84118 183716 -237065
$$ packed form
15311D2465b05442E5837J47025a23929I9826M3469l5925H718b54217R5192r1469
15300b50494A38460M657d1776k53965A81055a14827A98242E8352f1098a3846C01770
15288b5071H9946J11538a38586A74374e3201A54066J09891j17659a31069G990
15277B57895d10545A38501J73461I8487a66412A47690g5405o9209o6680c7548
15266e1834a2219j13939M4454a4608D43123A69356K67151c045A37207K4251p6113
15255H5345F78P5705J58627H1326l3710R3179i8027A84166Q16958L63198m28559
15244I35763K27818K9642b8417B73183h2387K5009A64496B9715O3876P8159h2170
15232a7091j75716A58208p4926L85466B14110d5441k79876H4118R9598b37065
$$ plain form
15221 -1458 57102 87760 -113724 -207848 -88972 117515 -36756 191017 80010 171004 33940
15209 -57213 3029 -341185 19206 126183 103463 379829 -322484 154780 -3341 -19682 -69497
15198 -69497 28600 -71864 -397424 -2914 -63725 -248553 165880 178310 77542 145241 147892
15187 147892 71436 -36391 -113310 146280 -103450 274451 64597 172841 166178 206304 -278664
15175 -383682 -63055 47025 -15898 -18567 -174868 133941 126984 9103 308027 10094 -21353
15163 59295 20008 -156763 -94461 181733 187027 -18177 224151 -81840 24535 188541 -98732
15151 113032 -101969 100510 176407 -84878 66165 208975 -61634 -46669 -90911 91383 191765
15140 191765 17483 152783 33606 52918 235036 -13913 107057 216339 127973 227746 74465
$$ packed form
15221a458E7102L0658a13724r4124h8972A17515c6756A91017H0010R0994C3940
15209e7213C029c41185A9206J06977k2720K76366c22484A54780c341j6341m9815
15198f9497B8600g1864l25560b914o0811j84828A65880J2430G7542O7699K651
15187A47892G1436c6391p6919A46280a03450B74451F4597J08244o663M0126b78664
15175c83682f3055D7025a5898k669j56301A33941o957I103K98924A0094b1353
15163E9295B0008a56763O2302A81733N294a8177B24151h1840B4535J64006i8732
15151A13032a01969A00510P5897h4878F6165J42810f1634J4965m4242I1383J00382
15140A91765A7483J35300C3606J9312J82118a3913A07057J09282q8366R9773G4465
$$ plain form
15128 146034 134722 33227 519948 -73916 196451 26580 59751 -31644 323939 -199775 66710
15116 170823 -129352 -122689 273794 -43759 147695 -114991 4290 293880 -39480 33173 259631
15105 259631 126637 138754 369948 222173 -116864 -148639 182396 -57346 120188 358197
15095 358197 292253 -47129 100836 2665 -16184 -255508 467344 571311 -116558 -153502 -70880
15083 155085 96670 96111 17150 93883 -50249 -44892 -165807 181730 341063 172116 -202950
15071 -188915 354340 134836 176999 40385 375660 494058 241012 15613 -151661 196362
15060 -81721 -61051 365328 281582 289998 402375 152190 104213 360599 99091 7390 -38514
15048 198429 433660 279005 275108 37600 250324 -11266 222879 -53116 226737 166737 741
$$ packed form
15128A46034j1312C3227M86721g3916A96451B6580L3171c1644C23939a99775F6710
15116A70823a29352O663B73794d3759A47695a14991D290K89590c9480C3173K26458
15105B59631A26637J2117K31194j47775a16864l1775A82396e7346A20188K38009
15095C58197o5944d7129A00836B665a6184k39324D67344J03967a16558l6944g0880
15083A55085n8415n59A7150P6733e0249N357j20915A81730J59333j68947b02950
15071a88915C54340A34836M2163D0385L35275J18398B41012A5613a51661A96362
15060h1721K0670C65328q3746Q416J12377A52190m7977K56386I9091G390c8514
15048A98429K35231j54655l897C7600K12724a1266B22879e3116B26737o0000G41
$$ plain form
15036 302824 164921 201675 -30754 -12708 309975 186167 43972 343668 247894 -222586
15025 123419 82107 3793 53139 -3479 -86709 362215 197387 78717 59606 330649 328599
15014 328599 93892 337641 118606 15278 394094 124535 309733 39979 71561 -166658
15003 311958 -201363 55696 52503 234971 -117594 175876 66507 71212 193515 161115 157005
14992 157005 189827 153651 -3163 -283167 100927 354325 201125 207075 402998 435667 82739
14980 274065 276811 -10578 215477 -50295 203768 192290 540691 360500 -58384 270539 365499
14969 365499 -167952 150084 269512 108507 159142 245620 102843 384308 53791 281965
14959 281965 280891 255643 286879 -71377 212395 -91414 88244 70877 65397 365261 156013
$$ packed form
15036C02824j37903L6754c0754a2708C09975j23808D3972K99696r5774b22586
15025A23419m1312C793M9346c479q3230C62215j64828G8717j9111K71043k050
15014C28599I3892K43749A18606A5278L78816A24535J85198C9979L1582a66658
15003C11958b01363E5696l193J82468a17594A75876F6507M705J22303l2400m110
14992A57005L2822l6176c163k80004A00927K53398j53200N950J95923L2669H2739
14980B74065K746a0578B15477e0295B03768j1478L48401j80191e8384B70539R4960
14969C65499a67952A50084J19428A08507N0635Q6478A02843K81465E3791K28174
14959B81965j074k5248L1236g1377B12395i1414H8244j7367n480K99864A56013
$$ plain form
14947 38842 167464 207013 256432 103724 331986 256642 202786 126591 360386 442366 259958
14936 259958 15992 398435 321788 -179981 387035 220876 242599 95583 146848 341154
14926 341154 144612 254327 332664 168021 142576 177360 61875 210902 467505 186035
14915 518623 252479 287590 180744 -10297 424813 374115 136591 379593 514602 -25666
14904 172477 437646 20015 64267 464208 431766 455768 453281 -46071 384444 294010 179701
14893 179701 307648 224724 394815 140558 473138 273923 215616 364800 99214 402716
14883 402716 497087 293779 622750 387236 278962 241560 184682 378844 301950 251899
14873 251899 371755 169994 584176 463678 643147 466020 238987 340844 450072 464577
$$ packed form
14947C8842J28622L9549M9419A03724K28262p5344n3856p6195K33795Q1980j82408
14936B59958A5992L82443p6647a79981C87035j66159K1723I5583N1265J94306
14926C41154A44612J09715P8337j64643k5445L4784F1875J49027K56603A86035
14915E18623B52479L5111j06846a0297D24813n0698A36591K43002J35009b5666
14904A72477K65169B0015M4252L99941l2442K4002k487d6071C84444r0434j14309
14893A79701J27947q2924J70091A40558L32580j99215n8307J49184I9214L03502
14883D02716R4371k03308L28971k35514j08274l7402n6878J94162p6894n0051
14873B51899J19856A69994M14182j20498J79469j77127k27033J01857J09228J4505
$$ plain form
14863 464577 -73714 365014 511343 459089 225305 355676 386614 501986 300107 405648
14853 405648 124173 265192 399598 508681 396289 422465 89272 198782 187340 305120
14843 305120 221457 72557 42766 584100 399561 376661 129573 613476 195482 496459
14833 496459 535800 210837 512638 283941 125204 281812 550883 552780 610177 523813
14823 523813 614063 627655 378719 416995 670155 604161 297663 97091 199762 312585
14813 312585 882666 622966 291187 412649 563651 275317 414745 714297 413176 574786
14803 574786 324135 407234 435029 431197 351232 401468 372110 574506 677263 128572 329870
14792 329870 180973 697224 642982 506460 783793 251490 402980 768190 337812 326253
$$ packed form
14863D64577g3714C65014J46329n2254B25305J30371L0938J15372k01879J05541
14853D05648A24173J41019J34406J09083j12392K6176H9272J09510j1442J17780
14843C05120q3663G2557k9791N41334j84539k2900A29573M83903A95482L00977
14833D96459L9341B10837L01801k28697A25204J56608K69071J897N7397q6364
14823E23813R0250J3592k48936L8276K53160o5994B97663I7091J02671J12823
14813C12585N70081k59700B91187J21462J51002B75317J39428K99552l01121J61610
14803E74786k50651Q3099K7795l832p9965N0236k9358K02396J02757A28572K01298
14792C29870j48897N16251n4242j36522K77333B51490J51490L65210C37812j1559
$$ plain form
14782 326253 458620 370933 504014 215481 351276 519168 411725 702498 452182 676025
14772 676025 518391 396063 269441 305821 427184 536489 704482 470177 900307 403724
14761 545993 486805 668402 307287 347549 775252 187711 211415 -15988 848316 675154
14751 675154 587943 750324 677315 878394 811365 430147 678888 502392 480973 617790
14741 617790 692809 668072 768769 575516 636467 305829 753703 733288 711946 562789
14731 562789 491851 316451 493115 588507 435746 239468 637633 595062 629248 843762
14721 843762 752066 805896 714223 546717 937695 588510 940362 239784 426555 351245
14711 351245 852739 712184 773323 599553 401397 550375 767489 751474 509804 790866
$$ packed form
14782C26253J32367q7687J33081B15481J35795J67892j07443K90773k50316K23843
14772F76025j57634j22328j26622L6380J21363J09305J67993k34305M30130D03724
14761E45993n9188J81597C07287M0262M27703A87711K3704a5988H48316j73162
14751F75154q7211J62381p3009K01079o7029l81218K48741j76496k1419J36817
14741F17790P5019k4737J00697j93253O0951C05829M47874k0415k1342j49157
14731E62789p0938j75400J76664R5392j52761j96278L98165m2571L4186K14514
14721H43762r1696N3830r1673j67506L90978l49185L51852B39784J86771p5310
14711C51245N01494j40555O1139j73770j98156J48978K17114j6015k41670K81062
$$ plain form
14701 790866 444800 801300 1030228 718028 805338 911918 396063 958498 635623 632293
14691 632293 1087822 474849 833703 629617 525221 518235 924330 1059528 816506 612575
14681 612575 685131 532373 926956 789831 1063791 970888 877730 668446 927909 650813
14671 650813 841286 864721 874099 1157544 867381 700384 820714 804833 798639 1068983 930473
14660 930473 1087448 758355 937917 744752 832281 799421 1265509 813448 799368 627569
14650 627569 950933 693977 1401187 1538307 845087 920456 1181385 1060162 1182128 1262032
14640 1262032 993121 1233308 1173667 1103513 1039358 1004117 1058777 947948 842383 1204427
14630 1204427 715388 1333040 1227808 1253881 1115473 1135165 1306432 842853 1384348 1285307
$$ packed form
14701G90866l46066L56500K28928l12200Q7310J06580C96063N62435l22875l330
14691F32293M55529D74849L58854k04086j04396o986M06095J35198k43022k03931
14681F12575P2556j52758L94583j37125K73960r2903r3158k09284K59463k77096
14671F50813J90473K3435R378K83445k90163j66997J20330j5881o194K70344j38510
14660I30473J56975l29093J79562j93165Q7529l2860M66088m52061j4080j71799
14650F27569L23364k56956P07210J37120o93220P5369K60929j21223J21966P9904
14640A262032k68911K40187n9641p0154o4155l5241N4660j10829j05565L62044
14630A204427m89039O17652j05232K6073j38408J9692J71267m63579N41495r9041
$$ plain form
14620 1285307 1207348 1242900 1314727 1158334 942079 868039 1285204 1298774 1198924 1428747
14610 1428747 1473023 1338227 1137845 1203837 1633509 1391503 1179235 1484498 1584875 1161370
14600 1161370 1287415 1449540 1568226 1547122 1401352 1379405 1358050 1452102 2024385 1697620
14590 1697620 1371843 1460702 1837509 1453469 1716625 1769018 1449886 1772091 1907211 1905756
14580 1905756 1950856 1601178 1736829 1698348 1856544 1746207 1861257 2117149 1983566 1494522
14570 1494522 1761170 1858337 2098059 1968812 1908903 2456557 2391748 2055246 2418724 1958693
14560 1958693 2200591 2434302 2431917 2642961 2336800 2747506 2870420 2962671 3247522 4072618
14550 4072618 4626663 5636504 8969583 16698048 33172603 45444913 23229683 12086081
$$ packed form
14620A285307p7959L5552P1827j56393k16255p4040M17165J3570r9850K29823
14610A428747M4276j34796k00382O5992M29672k42006k12268L05263J00377m23505
14600A161370J26045J62125J18686k1104j45770k1947k1355R4052N72283l26765
14590A697620l25777Q8859L76807l84040K63156N2393l19132L22205J35120j455
14580A905756M5100l49678J35651l8481J58196j10337J15050K55892j33583m89044
14570A494522K66648R7167K39722j29247n9909N47654o4809l36502L63478m60031
14560A958693K41898K33711k385K11044l06161M10706J22914R2251K84851Q25096
14550D072618N54045J009841L333079P728465J6474555J2272310k2215230j1143602
$$ plain form
14542 12086081 7707577 4001002 2728296 2146684 2129990 1785082 1938169 1956443 1725165
14533 1725165 1978199 2013927 1702190 1954997 1925921 2106802 2130336 2031788 2076351 2034564
14523 2034564 1661877 2314731 2270421 2128081 2344415 2450330 2341460 2612092 2399858 2362174
14513 2362174 2325918 2467396 2537377 2593186 2474644 2744077 2659708 2528147 2486601 2571334
14503 2571334 2717627 2701666 2622973 2693912 2815461 2598235 2756123 3199445 3101548 3013607
14493 3013607 3258805 2830316 3317561 2897476 3089080 2902641 3063672 3087057 3253005 3425161
14483 3425161 3481339 3269144 3347782 3584072 3439340 3441194 3762058 3494756 3755534 3410859
14473 3410859 3942010 3792452 3957294 3689922 4050080 3717484 3794098 4053381 4194515 4171829
$$ packed form
14542A2086081m378504l706575j272706n81612j6694l44908J53087J8274k31278
14533A725165K53034L5728l11737K52807k9076J80881K3534r8548M4563m1787
14523B034564l72687O52854m4310j42340K16334J05915j08870K70632k12234l7684
14513B362174l6256J41478O9981N5809j18542K69433q4369j31561m1546Q4733
14503B571334J46293j5961p8693P0939J21549k17226J57888M43322r7897q7941
14493C013607K45198m28489M87245m20085J91604j86439J61031K3385J65948J72156
14483C425161N6178k12195P8638K36290j44732J854L20864k67302K60778l44675
14473C410859N31151j49558J64842k67372L60158l32596P6614K59283J41134k2686
$$ plain form
14463 4171829 4103830 4359006 4121095 4339094 4193670 4251480 4314071 4092526 4742438 4516063
14453 4516063 4455657 4878527 4565808 4690732 4893258 4461698 4723758 4811350 4892430 4924571
14443 4924571 5372739 5420578 5208006 5425659 5454680 5501888 5503583 5693183 5439986 5654753
14433 5654753 5523081 5928216 6124909 5806397 6388176 6377659 6397996 6437958 6261636 6107434
14423 6107434 6766817 6699152 6714478 6809736 6966864 7008711 7363341 7335287 7628810 7285697
14413 7285697 7995547 7836074 7801731 7715211 7918983 8360947 8608987 8147882 8599783 8774813
14403 8774813 8864649 8983011 9140394 9181847 9548873 9667392 9439070 9950438 9954034 10247429
14393 10247429 10331036 10710624 10642171 10881766 11229361 11074614 11689274 11472627 11918987 11889423
$$ packed form
14463D171829o7999K55176k37911K17999j45424N7810O2591k21545O49912k26375
14453D516063o0406M22870l12719J24924K02526m31560K62060Q7592Q1080L2141
14443D924571M48168M7839k12572K17653K9021M7208J695J89600k53197K14767
14433E654753j31672M05135J96693l18512N81779j0517K0337L9962j76322j54202
14423F107434O59383o7665J5326R5258J57128M1847L54630k8054K93523l43113
14413G285697P09850j59473l4343q6520K03772M41964K48040m61105M51901J75030
14403H774813Q9836J18362J57383M1453L67026J18519k28322N11368L596K93395
14393A0247429Q3607L79588o8453K39595L47595j54747O14660k16647M46360k9564
$$ plain form
14383 11889423 12471905 12253838 12615144 13130560 12902602 13265825 13659443 13799684 14545880
14374 14545880 14078909 15063551 15060491 15347643 15605919 15979093 16298461 16630674 17238827 17304285
14364 17304285 17508755 18075681 18533768 18682870 19175023 19898489 20296810 20371707 20515716
14355 20515716 21754145 21857738 22349133 23108198 23803099 24113961 24912915 25221110 26094143
14346 26094143 26565427 27375927 28133351 28752473 29618271 30314486 30956734 32185431 32777909
14337 32777909 33706853 34617915 35846715 36731264 37942094 38786333 40485402 41362050 42670291
14328 42670291 44147115 45534717 47024026 48235930 49860145 51822135 53577089 55374756
14320 55374756 57608063 59324703 61779305 63902964 66707724 68821697 71852638 74771320
$$ packed form
14383A1889423N82482k18067L61306N15416k27958L63223L93618J40241P46196
14374A4545880m66971R84642l060K87152K58276L73174L19368L32213O08153O5458
14364A7304285K04470N66926M58087J49102M92153P23466L98321P4897J44009
14355B0515716J238429J03593M91395P59065O94901L10862P98954L08195Q73033
14346B6094143M71284Q10500P57424O19122Q65798O96215O42248J228697N92478
14337C2777909R28944R11062J228800Q84549J210830Q44239J699069Q76648J308241
14328D2670291J476824J387602J489309J211904J624215J961990J754954J797667
14320E5374756K233307J716640K454602K123659K804760K113973L030941K918682
$$ plain form
14312 74771320 77544836 80994437 84408304 87931672 91826140 95502987 100162062 104653076
14304 104653076 109697115 114468743 120542804 125809025 132441686 139253495 146160901 153817770
14296 153817770 161901787 170854428 179800957 189757380 199770494 210599794 222045470
14289 222045470 233994364 246701410 260160237 274321230 289032282 304264857 319880082
14282 319880082 336337461 352115125 368829519 384846069 400414615 415856075 429884139
14275 429884139 442733592 453753023 461927395 465694605 465209959 465064269 464169470 458752039
14267 458752039 454207365 447416369 440000554 430557924 419458233 406202753 391031428
14260 391031428 374325823 357660887 340630728 323964667 307677223 291775546 276752328
$$ packed form
14312G4771320K773516L449601L413867L523368L894468L676847M659075M491014
14304A04653076N044039M771628O074061N266221O632661O811809O907406P656869
14296A53817770Q084017Q952641Q946529R956423J0013114J0829300J1445676
14289B22045470J1948894J2707046J3458827J4160993J4711052J5232575J5615225
14282C19880082J6457379J5777664J6714394J6016550J5568546J5441460J4028064
14275D29884139J2849453J1019431Q174372L767210m84646j45690q94799n417431
14267D58752039m544674o790996p415815r442630j1099691j3255480j5171325
14260C91031428j6705605j6664936j7030159j6666061j6287444j5901677j5023218
$$ plain form
14253 276752328 263284534 249529400 236357049 223444807 211893637 200802067 190402282
14246 190402282 180618753 171397302 162949787 155135391 147323375 139980351 133264274 127026104
14238 127026104 121271889 116184177 111031435 106062702 101342254 96833814 92793809 89404261
14230 89404261 85557642 82542909 78995048 76169639 72863255 69793473 67184123 65179691
14222 65179691 62314999 60382394 58101337 56359478 54408127 52524045 51035715 49331784
14214 49331784 47698130 46146013 45130335 43359411 41687960 40512576 39406610 38738667
14206 38738667 37874792 36451260 34947786 34409016 33047076 32300580 31989632 30916206 29862909
14197 29862909 29053464 28418312 27393817 27018456 26428879 25894175 24999150 24280909 23756454
$$ packed form
14253B76752328j3467794j3755134j3172351j2912242j1551170j1091570j0399785
14246A90402282r783529r221451q447515p814396p812016p343024o716077o238170
14238A27026104n754215n087712n152742m968733m720448m508440m040005l389548
14230H9404261l846619l014733l547861k825409l306384l069782k609350k004432
14222F5179691k864692j932605k281057j741859j951351j884082j488330j703931
14214D9331784j633654j552117j015678j770924j671451j175384j105966o67943
14206C8738667q63875j423532j503474n38770j361940p46496l10948j073426j053297
14197B9862909q09445o35152j024495l75361n89577n34704q95025p18241n24455
$$ plain form
14188 23756454 23367882 22627852 21989821 21848659 20843245 20482951 19793853 19914710 19616008
14179 19616008 18811654 18252525 18177172 17710542 17447966 16772746 16899275 16860056 16156646 15598678
14169 15598678 15576878 15157965 14906641 14818810 14257218 14293046 14116457 13547474 13444453 13306911
14159 13306911 12745120 12684345 12581572 12578173 11785478 11871716 11717292 11360566 11274180 10852114
14149 10852114 10691406 10771225 10631160 10433773 10513521 10248993 10093009 9856873 9697797 9525917
14139 9525917 9215553 9266899 9130961 8902070 8743575 8660081 8404994 8183107 8213501 8190414
14129 8190414 8004410 7890451 8118465 7770245 7544375 7778928 7501427 7215054 7448788
14120 7448788 6981601 6902911 6838781 7031328 6672163 6543631 6282962 6547700 6333663 6379064
$$ packed form
14188B3756454l88572p40030o38031j41162j005414l60294o89098J20857k98702
14179A9616008q04354n59129p5353m66630k62576o75220J26529l9219p03410n57968
14169A5598678k1800m18913k51324q7831n61592L5828j76589n68983j03021j37542
14159A3306911n61791o0775j02773l399p92695Q6238j54424l56726q6386m22066
14149A0852114j60708P9819j40065j97387P9748k64528j55984k36136j59076j71880
14139I525917l10364N1346j35938k28891j58495q3494k55087k21887L0394k3087
14129H190414j86004j13959K28014l48220k25870K34553k77501k86373K33734
14120G448788m67187p8690o4130J92547l59165j28532k60669K64738k14037M5401
$$ plain form
14110 6379064 6234322 6202439 6263557 5940610 5960296 6024820 5507799 5553108 5612102 5646316 5505418
14099 5505418 5539750 5393915 5404368 5480429 5124995 5442269 4937444 4946802 5052817 4953870
14089 4953870 4794748 4778767 4913878 4583719 4762387 4693783 4486758 4432556 4452003 4474863
14079 4474863 4424192 4500603 4318726 4345255 4004507 4255145 4204472 3835581 4016658 4045014
14069 4045014 3802654 4187085 3780751 3481208 3535959 3849234 3594671 3876551 3660020 3724241
14059 3724241 3423054 3671126 3960145 3730415 3321636 3202211 3780987 3351221 3232286
14050 3232286 3399112 3490822 3304631 3205040 3170576 3434914 3109185 2607799 2708910 2952293
14040 2952293 2671083 2682992 2889053 2915651 2846053 2712570 2685982 2762924 2887563 2862516
$$ packed form
14110F379064j44742l1883O1118l22947J9686O4524n17021M5309N8994L4214j40898
14099E505418L4332j45835J0453P6061l55434L17274n04825R358J06015r8947
14089D953870j59122j5981J35111l30159J78668o8604k07025n4202J9447K2860
14079D474863n0671P6411j81877K6529l40748K50638n0673l68891J81077K8356
14069D045014k42360L84431m06334k99543N4751L13275k54563K81880k16531O4221
14059C724241l01187K48072K89019k29730m08779j19425N78776m29766j18935
14050C232286J66826R1710j86191r9591l4464K64338l25729n01386J01111K43383
14040B952293k81210J1909K06061K6598o9598j33483k6588P6942J24639k5047
$$ plain form
14030 2862516 2860952 2544690 2915677 2740767 2548393 2627155 2819902 2590127 2681709 2339862
14020 2339862 2440531 1953635 2345037 2453841 2317272 2531843 2256257 2378596 2308799 2223998
14010 2223998 2142194 2072644 2080810 2018169 2180712 1880946 1716857 2103566 2030910 2056756 1729473
13999 1729473 1622485 1932236 2059801 1600088 1727002 1686496 1818515 2196830 1561039 2094085
13989 2094085 2628303 4494439 10810527 25807686 45736248 28520572 14915560 9104489
13981 9104489 6434680 4708485 4191943 3508745 3447040 2668433 2923043 2432637 2579319
13972 2579319 2494866 2431723 2405510 2146329 2115994 2211866 2616820 2119561 1852749 2238002
13962 2238002 1956844 2080884 1954812 1969629 2064556 2081739 1900555 1593775 1864211 1780559
$$ packed form
14030B862516j564l16262L70987j74910j92374P8762J92747k29775R1582l41847
14020B339862J00669m86896L91402J08804j36569K14571k75586J22339o9797q4801
14010B223998q1804o9550Q166o2641J62543k99766j64089L86709p2656K5846l27283
13999A729473j06988L09751J27565m59713J26914m0506J32019L78315o35791N33046
13989B094085N34218J866136O316088J4997159J9928562j7215676j3605012n811071
13981I104489k669809j726195n16542o83198o1705p78607K54610m90406J46682
13972B579319q4453o3143k6213k59181l0335R5872M04954m97259k66812L85253
13962B238002k81158J24040j26072J4817R4927J7183j81184l06780K70436q3652
$$ plain form
13952 1780559 1543296 1709367 1880390 1805481 1782084 1881447 1472025 1743145 1841037 1501911
13942 1501911 1776953 1733420 1784145 1625287 1610342 1432645 1403006 1569759 1467166 1687773
13932 1687773 1559881 1481314 1311463 1492601 1202368 1388498 1351829 1548048 1098852 1385004
13922 1385004 1542463 1520194 1538449 1502452 1413842 1346899 1126329 1267872 1282378 1190832 1239766
13911 1239766 1458646 1661437 1202691 1470651 1303022 1029332 1094526 821534 1545591 992299
13901 992299 1362919 1264394 1307173 1182298 976080 1251370 1196236 992332 721166 1300101
13891 1300101 1006830 1281136 902694 1190320 1431068 1155767 833975 1106659 1183805 1017560
13881 1017560 1019339 666860 905724 1388822 1071439 806300 1223991 993226 681749 839632
$$ packed form
13952A780559k37263J66071J71023p4909k3397R9363m09422K71120R7892l39126
13942A501911K75042m3533N0725j58858j4945j77697k9639J66753j02593K20607
13932A687773j27892p8567j69851J81138k90233J86130l6669J96219m49196K86152
13922A385004J57459k2269J8255l5997q8610o6943k20570J41543J4506r1546M8934
13911A239766K18880K02791m58746K67960j67629k73690O5194k72992P24057n53292
13901I92299L70620r8525M2779j24875k06218K75290n5134k03904k71166N78935
13891A300101k93271K74306l78442K87626K40748k75301l21792K72684P7146j66245
13881A017560J779l52479K38864M83098l17383k65139M17691k30765l11477J57883
$$ plain form
13871 839632 1092472 1170974 1104765 1058430 1031647 1037372 885769 921265 888805 769926 1218018
13860 1218018 955512 842120 884047 1269620 720303 706999 1075327 1179625 978361 1130026
13850 1130026 1105502 845124 820575 1041753 484751 971948 733874 891912 879574 1072973
13840 1072973 701464 607869 724188 812596 869426 939429 1033161 708465 879176 726583
13830 726583 864042 882372 794845 867367 704690 961860 941760 1024720 880210 677067
13820 677067 865977 1184685 644561 457256 945543 597651 876094 867434 845731 511281
13810 511281 703447 1020774 604036 359717 915851 249832 776419 871980 599691 788826
13800 788826 752950 580011 626885 827466 748718 592691 687336 638875 702111 689153 415834
$$ packed form
13871H39632K52840P8502o6209m6335k6783N725j51603L5496l2460j18879M48092
13860A218018k62506j13392M1927L85573n49317j3304L68328J04298k01264J51665
13850A130026k4524k60378k4549K21178D84751M87197k38074J58038j2338J93399
13840A072973l71509r3595J16319Q8408N6830P0003R3732l24696J70711j52593
13830G26583J37459J8330q7527P2522j62677K57170k0100Q2960j44510k03143
13820F77067J88910L18708n40124j87305M88287l47892K78443q660k1703l34450
13810E11281J92166L17327m16738k44319N56134B49832N26587R5561k72289J89135
13800G88826l5876j72939M6874K00581p8748j56027R4645m8461O3236j2958k73319
$$ plain form
13789 415834 768738 877771 614322 885544 609056 369875 519310 719001 398969 563145
13779 563145 768706 1009858 666934 622963 422062 1161505 922858 614490 829368 293206
13768 642257 620245 780002 210981 1023633 867128 890163 593652 320849 704828 560973
13758 560973 816182 381114 894789 469821 544720 857651 752795 725080 195627 794945
13748 794945 425030 445235 680595 276578 489841 425818 608565 597871 536576 408611
13738 408611 697909 885639 622521 413361 375919 452436 740113 831014 348347 650610
13728 650610 489416 251440 557593 857747 835621 324221 395906 295733 91696 107399
13718 107399 702800 306399 515510 523786 699709 603986 486102 588822 221863 580366
$$ packed form
13789D15834L52904J09033k63449K71222k76488k39181J49435J99691l20032J64176
13779E63145K05561K41152l42924m3971k00901P39443k38647l08368K14878B93206
13768F42257k2012J59757B10981Q12652j56505K3035k96511k72803L83979j43855
13758E60973K55209C81114N13675m24968P4899L12931j04856k7715A95627N99318
13748G94945l69915K0205K35360B76578K13263o4023J82747j0694o1295j27965
13738D08611K89298J87730k63118k09160l7442P6517K87677R0901C48347L02263
13728F50610j61194k37976L06153L00154k2126C24221P1685j00173I1696J5703
13718A07399N95401C06399K09111Q276J75923r5723j17884J02720B21863L58503
$$ plain form
13708 580366 675817 544295 671125 490108 554691 111006 333454 497887 729767 548334
13698 548334 588451 370611 397743 534495 309755 353210 483997 579215 568985 579804 366488
13687 366488 699087 347640 245017 299668 545765 150007 717377 280198 366528 373874
13677 373874 738983 738611 466307 479405 492832 489258 562382 307123 119297 361376 504895
13666 504895 357840 626449 667045 693300 513283 532807 442922 320252 389070 281338
13656 281338 458531 345041 644563 486211 106409 596076 370187 584081 375717 436716
13646 436716 532287 346972 365491 336784 176636 440870 481428 211911 191121 324576
13636 324576 552788 -45260 563458 230026 441600 610365 549856 45797 418067 459018
$$ packed form
13708E80366R5451j31522J26830j81017O4583A11006K22448J64433K31880j81433
13698E48334M0117k17840K7132J36752k24740M3455J30787R5218j0230J0819k13316
13687C66488L32599C47640j02623N4651K46097A50007N67370B80198Q6330P346
13677C73874L65109l72k72304J3098J3427l574P3124k55259A19297K42079J43519
13666E04895j47055K68609M0596K6255j80017J9524q9885j22670O8818j07732
13656B81338J77193j13490K99522j58352A06409M89667k25889K13894k08364O0999
13646D36716R5571j85315J8519k8707j60148K64234M0558B11911k0790J33455
13636C24576K28212d5260E63458B30026K11574J68765o0509D5797L72270M0951
$$ plain form
13626 459018 141083 668415 464730 109077 378951 569403 493116 663008 268116 289398
13616 289398 429577 330815 295823 477542 448740 142430 162863 371357 158096 18950
13605 525222 429641 186238 271559 322476 192194 221206 430849 414953 482077 128182 345674
13594 345674 104673 194367 468243 514347 288774 397568 -91611 104439 344406 505376
13584 505376 263498 173132 538478 201751 344734 438323 113231 -341981 398332 294133
13574 294133 -97157 352867 143530 475200 303653 437084 158169 293182 -71600 260752
13563 265459 114283 210307 161119 110237 367706 312912 25415 469000 343598 156039
13552 391916 172276 508206 222314 -76440 168406 19841 171925 359979 57640 87878
$$ packed form
13626D59018A41083N27332k03685A09077K69874J90452p6287J69892B68116K1282
13616B89398J40179r8762l4992J81719k8802A42430K0433K08494A58096A8950
13605E25222r5581A86238Q5321N0917j30282K9012K09643j5896O7124A28182K17492
13594C45674A04673Q9694K73876M6104k25573J08794i1611A04439K39967J60970
13584E05376k41878r0366L65346B01751J42983R3589A13231c41981C98332j04199
13574B94133i7157C52867A43530L31670j71547J33431A58169J35013g1600B60752
13563B65459A14283R6024m9188n0882K57469n4794B5415M43585j25402A56039
13552C91916A72276L35930B22314g6440A68406A9841J52084J88054E7640L0238
$$ plain form
13542 87878 141381 395214 340014 46660 31062 380214 226126 246126 48366 324698 272227
13531 272227 188695 577584 -207365 88683 418319 44025 144386 180495 118151 455046
13521 455046 397676 300017 -41612 62076 -74411 406183 231197 478116 180169 244388 211576
13510 211576 105758 131469 691533 107846 155696 229278 381168 214037 238891 307595
13500 307595 98077 99508 469885 483650 278211 50703 426212 419168 433777 116037 360034
13489 360034 302162 183174 395692 150563 235700 63374 95511 364082 199491 292180
13479 292180 5453 256102 69422 164835 314917 229154 197571 463844 447112 101127 -417473
13467 3351 78701 380220 247985 126211 88935 386417 263343 321717 221266 204705 379113
$$ packed form
13542H7878N3503K53833n5200D6660j5598L49152j54088K0000D8366K76332n2471
13531B72227q3532L88889b07365H8683L29636D4025J00361L6109o2344L36895
13521D55046n7370r7659d1612F2076g4411D06183j74986K46919A80169O4219l2812
13510B11576A05758K5711N60064A07846M7850P3582J51890j67131K4854O8704
13500C07595I8077J431L70377J3765k05439E0703L75509p044J4609A16037K43997
13489C60034n7872j18988K12518A50563Q5137F3374L2137K68571j64591R2689
13479B92180E453K50649F9422R5413J50082q5763l1583K66273j6732A01127d17473
13467C351P5350L01519j32235j21774l7276K97482j23074N8374j00451j6561J74408
$$ plain form
13456 379113 386652 394733 274643 371861 130694 118658 269850 298598 110333 111021 67334
13445 67334 379020 369715 214402 180997 300429 159048 610548 322985 27999 -219889
13434 155216 -9658 6131 184853 368591 75155 224654 91371 11190 82023 241904 -66443
13422 347175 -195367 -184038 35104 258264 587874 157834 168889 360462 243512 186230
13412 186230 -56998 452243 689633 70224 547550 255593 -4379 131602 364905 82579
13401 407637 387618 382011 -45589 81402 218476 -174082 309471 -4640 148147 230830 585812
13390 585812 458364 62668 121591 130464 8213 -23009 107341 88766 89715 270707 300524 430903
13378 430903 222175 242601 174044 38570 190356 282622 254897 185740 209761 107948 44302
$$ packed form
13456C79113P539Q081j20090R7218A30694j2036J51192K8748A10333O88m3687
13445F7334L11686r305j55313l3405J19432j41381M51500k87563B7999b19889
13434A55216i658F131J78722J83738G5155J49499I1371A1190P0833J59881f6443
13422C47175a95367J1329C5104K23160L29610A57834J1055J91573j16950n7282
13412A86230e6998D52243K37390G0224M77326B55593d379A31602K33303H2579
13401D07637k0019n607d5589H1402J37074a74082C09471d640A48147Q2683L54982
13390E85812j27448F2668N8923Q873H213b3009A07341j8575R49J80992K9817J30379
13378D30903k08728K0426o8557C8570J51786R2266k7725o9157K4021j01813D4302
$$ plain form
13366 362121 510402 -37376 168819 49749 90814 324024 85383 73048 538071 -27558 167527
13354 497274 145547 456913 359077 551219 50392 -13221 170323 396270 229650 430427
13344 430427 98878 94306 194436 303704 274725 316206 190088 520275 178217 235317 111215
13332 157795 248445 284633 305913 276555 596770 58002 231206 400545 68471 382618 -97775
13320 339872 324067 402145 242785 351546 151604 149528 191557 480061 410914 110127 30527
13308 220391 415302 235289 157625 180921 -88735 187421 184305 -139983 -307090 12487 236176
13297 236176 84891 497016 11722 442572 50406 -78549 56567 88810 372989 -46096 118311
13285 452896 170359 248409 265555 128779 -20328 143167 100442 329495 -37635 282403
$$ packed form
13366C62121J48281c7376A68819D9749M1065K33210H5383j2335M65023b7558A67527
13354D97274A45547L11366r7836J92142E0392a3221A70323K25947j66620K00777
13344D30427I8878m572J00130J09268k8979M1481j26118L30187A78217N7100A11215
13332A57795R0650L6188K1280k9358L20215E8002J73204J69339F8471L14147i7775
13320C39872j5805P8078j59360J08761A51604k076M2029K88504o9147A10127C0527
13308B20391J94911j80013p7664K3296h8735A87421l116a39983j67107A2487K23689
13297B36176H4891M12125A1722M30850E0406g8549E6567L2243K84179d6096A18311
13285D52896A70359P8050J7146A28779b0328A43167m2725K29053c7635B82403
$$ plain form
13274 91384 -161486 120772 245241 204220 -32638 188571 -226154 78247 125954 377722
13264 377722 431321 138909 54633 125981 169092 -114044 -168095 20005 401684 318842 226904
13253 226904 301717 64872 -196696 -188657 223722 358498 268048 -24910 105645 -127633 347709
13241 153060 -31359 -165465 25726 141207 334814 5727 74046 170789 -72040 239470 154911
13230 154911 -247094 156387 382072 143405 277256 177560 52873 148389 141652 -133653
13219 261784 34478 303520 -16757 -247303 5272 172318 214626 214914 51875 230808 -37597
13207 91880 -187893 201505 50944 -61381 59030 168269 169359 186748 204057 -24706 134110
13195 149236 -162543 285057 78118 -46391 20514 151920 -14258 -134741 140605 61102
$$ packed form
13274I1384a61486A20772J24469m1021c2638A88571b26154G8247M7707K51768
13264C77722N3599A38909E4633P1348M3111a14044n4051B0005L81679q2842r1938
13253B26904P4813F4872a96696Q039B23722J34776r0450b4910A05645a27633C47709
13241A53060c1359j34106B5726J15481J93607E727O8319R6743g2040B39470q4559
13230A54911b47094A56387K25685A43405J33851r9696E2873R5516o737a33653
13219B61784C4478K69042a6757k30546E272J67046M2308K88E1875J78933c7597
13207I1880a87893B01505E0944f1381E9030J09239J090J7389J7309b4706A34110
13195A49236a62543B85057G8118d6391B0514J31406a4258j20483A40605F1102
$$ plain form
13184 176713 -112502 54630 119585 345654 -36546 -279091 -49423 618972 -62947 34141 30115
13173 30115 227589 440807 95681 345474 -8639 -68076 47316 163828 112409 37503 202914
13162 202914 96658 177628 32195 67764 -23347 239119 -43969 -94097 50568 109536 4145
13150 -296163 385403 296705 -199888 -233419 231795 -88831 171764 -53339 -112580 270364
13139 -3757 103295 399545 236289 -251925 162340 -11958 1712 113052 -282148 68898 -11379
13127 -350505 279533 200136 204398 -28878 70374 39830 -6524 -233309 86174 35083 79460
13116 79460 215574 -28101 -21465 191396 -12814 194185 167084 105426 127003 8697 217095
13105 217095 219007 6937 -209079 138948 -62267 -2100 307325 101870 116833 59215 13685
$$ packed form
13184A76713a12502E4630O4955K26069c6546k42545d9423F18972f2947C4141m026
13173C0115J97474K13218I5681K49793h639n9437D7316J16512n1419C7503J65411
13162B02914I6658Q0970C2195L5569b3347B39119d3969n0128E0568N8968D145
13150b96163C85403q8698a99888l3531B31795h8831A71764e3339n9241B70364
13139c757A03295K96250j63256b51925A62340a1958A712J11340b82148F8898a1379
13127c50505B79533p9397M262b8878G0374l0544f524k26785H6174C5083M4377
13116G9460J36114b8101O636A91396a2814A94185k7101o1658K1577H697K08398
13105B17095J912F937b09079A38948f2267b100C07325A01870J4963n7618A3685
$$ plain form
13093 108083 89527 42585 121273 -76666 95234 200722 203323 -191355 -165610 -154676 279470
13081 -83210 -49255 -157100 -243070 111238 -287199 -288468 307063 63203 284344 -257550 122206
13069 95516 -48673 -325378 -253077 -54004 122415 360235 -19055 288141 226519 189373 165268
13058 165268 53317 -1599 63184 116547 235227 206277 176109 59706 31278 382914 -53809
13046 483386 166400 -82201 -34447 13860 346823 252695 346868 79003 160333 154747 -5120
13034 -118010 -105087 -462405 393434 261923 280032 159111 302208 77722 -203072 97123
13023 -185100 73246 306558 -73705 155993 96470 375867 33702 232195 163741 200769 30946
13011 -18245 185418 -49495 247953 315978 309780 -165807 100664 230991 132287 -32307 212541
$$ packed form
13093A08083j8556D2585P8688g6666I5234J05488K601a91355K5745J0934B79470
13081h3210L3955j07845q5970A11238b87199j269C07063F3203K21141b57550A22206
13069I5516d8673k76705P2301e4004A22415K37820a9055B88141o1622l7146k4105
13058A65268E3317a599F3184N3363J18680k8950l0168E9706k8428L51636e3809
13046D83386A66400h2201c4447A3860L32963r4128R4173G9003Q1330n586e120
13034a18010J2923l57318C93434j31511J8109j20921J43097G7722b03072I7123
13023a85100G3246K33312g3705A55993n9523K79397C3702J98493o8454L7028C0946
13011a8245A85418d9495B47953O8025o198a65807A00664J30327r8704c2307B12541
$$ plain form
12999 305027 119025 183931 -37226 -12304 38443 -205526 154200 -86946 253997 299283 -260764
12987 347215 310399 57553 32387 230963 -30243 273650 61423 -206441 162270 35827 -194451
12975 74214 128008 8376 290796 205876 106998 480 225989 -59625 169751 -9640 -82020 23260
12962 397471 -283445 66763 192687 13748 -31736 19614 274481 256077 101971 118049 314622
12951 314622 -151714 1318 -151720 40106 -47285 351472 -12415 -162113 110390 73487 145798
12940 145798 -78797 165714 -52747 240661 82469 121848 344832 -320130 -313210 245992 2378
12928 232578 -32997 -138902 -143640 123848 -119674 -47619 67753 -20477 264561 62958 -94061
12916 207158 48541 170576 161515 62988 425800 20951 -53620 206047 -176073 14210 -240107
$$ packed form
12999C05027A19025O4906c7226a2304C8443b05526A54200h6946B53997M5286b60764
12987C47215l6816E7553k5166J98576c0243B73650F1423b06441A62270C5827a94451
12975G4214N3794H376K82420q4920r8878D80K25509e9625A69751i640p2380B3260
12962C97471b83445F6763J25924A3748c1736A9614K54867j8404A01971J6078J96573
12951C14622a51714A318a51720D0106d7285C51472a2415j49698A10390l6903P2311
12940A45798g8797A65714e2747B40661H2469L9379K22984c20130O920B45992B378
12928B32578c2997j05905m738A23848a19674d7619F7753b0477B64561F2958i4061
12916B07158D8541J22035r061F2988L62812B0951e3620B06047a76073A4210b40107
$$ plain form
12904 184427 14040 -97876 25627 162017 -203838 -30434 -119526 1199 87985 126713 -230010
12892 48789 -164033 -58510 137287 254322 399482 49852 54192 342474 -64826 301923 35640
12880 180737 34270 222746 -69673 22872 -103775 8960 -54570 -37548 -581 1102 -2763 -106012
12868 -106012 93577 34394 385200 397458 141284 48797 -143789 -43844 101320 160597 -231106
12856 -194472 133064 150517 -296030 79726 -10918 191400 -204092 136069 -314809 -125194
12845 94625 261567 78007 94751 125180 109770 -154040 78945 12770 45526 167224 307526
12834 307526 256570 211945 140731 -203884 348017 -278236 32909 -177768 -191256 419118
12823 56425 -80829 76399 25234 104213 -210649 -104821 329237 158233 130443 -3944 69618
$$ packed form
12904A84427A4040i7876B5627J36390b03838c0434q9092A199Q6786L8728b30010
12892D8789a64033e8510A37287J17035J45160D9852M340K88282f4826C01923C5640
12880A80737C4270J88476f9673B2872a03775H960e4570J7022e81A102b763j03249
12868a06012I3577C4394L50806J2258A41284D8797a43789d3844A01320N9277b31106
12856a94472A33064J7453b96030G9726a0918A91400b04092A36069c14809a25194
12845I4625J66942G8007J6744L0429j5410a54040G8945A2770L2756J21698J40302
12834C07526n0956m4625p1214b03884C48017b78236C2909a77768j3488D19118
12823E6425h0829G6399B5234P8979b10649a04821C29237A58233k7790c944F9618
$$ plain form
12811 126181 13064 -170722 61035 -291293 8299 31333 -1378 202457 228056 152066 -248367
12799 115286 -138428 110761 154687 -142261 -8159 -219110 -68303 -36033 -185770 71123 -207843
12787 -250853 46755 -10594 -53574 183313 115218 100069 -69253 263327 -167323 190143 -81590
12775 -54521 138447 238012 139330 40334 -405079 151298 -100582 -261636 268883 65600
12764 -310177 -222645 204659 11921 115609 41734 246267 -181735 -189624 329975 -62109 63512
12752 118006 59877 52798 -161395 10776 -59736 -114121 -72205 118125 -16058 -50858 193422
12740 96683 154955 180067 -117012 -220076 84410 140557 415535 125384 248818 -99463 180469
12728 118767 305412 194117 -88230 126156 102228 146958 170810 276014 46293 -18479 175209
$$ packed form
12811A26181A3064a70722F1035b91293H299K3034a378B02457K5599p5990b48367
12799A15286a38428A10761M3926a42261h159k10951f8303L2270j49737G1123b07843
12787b50853D6755a0594m2980A83313o8095j5149f9253B63327a67323A90143h1590
12775e4521A38447R9565r8682D0334d05079A51298a00582j61054B68883F5600
12764c10177Q7532B04659A1921J03688D1734K04533a81735p889C29975f2109F3512
12752A18006n8129p079a61395A0776e9736n4385M1916A18125a6058l4800A93422
12740I6683N8272K5112a17012j03064H4410N6147K74978A25384J23434i9463A80469
12728A18767J86645j11295h8230A26156k3928M4730K3852J05204D6293a8479A75209
$$ plain form
12716 -262987 207456 148383 183791 5180 -94297 195632 365114 511591 -59711 44731 7385
12704 346456 341383 129670 104419 290858 81832 30562 145354 504678 38916 -121540 -111036
12693 -111036 45510 -148701 -187323 435 -301327 80103 192420 37761 110164 295829 407315
12682 407315 213408 -37612 539857 -118401 147882 -6677 339544 137185 111661 326535
12672 326535 -61633 17050 277018 45062 167216 -8475 -89139 72058 -220975 152170 -166021
12660 -227772 221105 128607 556052 254930 117628 -167165 53828 13680 268159 145522
12650 145522 -74455 381261 40799 13325 126677 -37222 -144872 22789 46060 180888 19163
12638 61601 225537 338923 434592 225357 270199 -341317 -132176 37454 108211 150534 70911
$$ packed form
12716b62987B07456n9073L5408E180i4297A95632J69482J46477e9711D4731G385
12704C46456n073A29670k5251J86439H1832C0562J14792L59324C8916a21540J0504
12693a11036D5510a48701l8622D35c01327H0103J12317C7761P2403J85665J11486
12682D07315j93907c7612E39857a18401A47882f677C39544A37185k5524K14874
12672C26535f1633A7050K59968D5062J22154h475q0664G2058b20975A52170a66021
12660b27772B21105r2498M27445B54930A17628a67165E3828A3680K54479j22637
12650A45522g4455C81261D0799A3325J13352c7222j07650B2789K3271J34828A9163
12638F1601J63936J13386R5669k09235M4842c41317a32176C7454P0757M2323G0911
$$ plain form
12626 46931 257099 113274 -141121 -97114 73803 -93041 -115162 215792 48321 -99201 -199740
12615 -199740 -60742 166615 -113520 -131339 -43120 194857 48008 101340 250910 1410 300321
12604 300321 -8755 -214375 327047 54667 105301 148429 254370 79343 -313792 7270 364259
12593 364259 175781 139819 -100853 113165 -121489 -54310 294621 165256 -249388 9182
12582 -138373 69318 -60835 77218 92859 -28317 -50062 -169858 302198 101163 354915 387848
12571 387848 210553 -206626 392426 66456 106936 -27787 45209 -4916 346336 109317 207254
12560 207254 87893 160157 35877 204278 172765 188911 217330 -61319 35751 273592 355710
12549 355710 131242 -51835 -145369 -130235 17942 43434 -140118 -19246 -134293 194819 -6459
$$ packed form
12626D6931K10168A13274a41121M4007G3803i3041k2121B15792D8321i9201j00539
12615a99740f0742A66615a13520j7819d3120A94857D8008N3332J49570A410K98911
12604C00321h755k05620C27047E4667N0634M3128J05941G9343c13792G270L56989
12593C64259A75781l5962a00853A13165a21489e4310B94621j29365b49388I182
12582a38373F9318f0835G7218J5641b8317k1745j19796C02198A01163K53752L2933
12571C87848j77295b06626C92426F6456M0480b7787D5209d916C46336A09317R7937
12560B07254H7893P2264C5877J68401l1513J6146K8419f1319C5751K37841Q2118
12549C55710A31242e1835r3534J5134A7942K5492a40118a9246j15047A94819f459
$$ plain form
12537 -12203 -327613 -172044 260725 94467 -236000 281414 -32744 -249029 144076 -35218
12526 -48726 356429 -236690 -106939 -158516 58754 148757 -40 100346 145696 121638 -206858
12514 -153737 -140216 -43868 188789 203035 392359 76791 -9382 171094 414666 -294143 102027
12502 -520 95646 272652 341662 -23666 -121838 392550 -142334 -40315 -250760 402582 -124347
12490 -7133 -340539 110474 -260392 36899 109355 -155611 33385 83890 -147117 298522 75449
12478 -89577 -186803 -48290 -142859 -178550 -84549 -199478 8051 -18389 176611 -200127 105649
12466 -23487 22029 -55009 -101953 32743 7339 -124581 109904 -52494 -95362 -128107 -144088
12455 -144088 -26428 -265428 -108426 -48394 -273442 -225396 205692 99423 375297 177377
$$ packed form
12537a2203l15410J55569B60725I4467b36000B81414c2744k16285A44076c5218
12526d8726C56429b36690a06939n1577E8754R0003d0A00346M5350k4058b06858
12514a53737J3521d3868A88789J4246J89324G6791i382A71094K43572b94143A02027
12502e20I5646J77006O9010b3666r8172C92550a42334d0315k10445D02582a24347
12490g133l33406A10474b60392C6899P2456a55611C3385N0505a47117B98522G5449
12478h9577r7226d8290r4569l5691h4549j14929H051a8389A76611b00127A05649
12466b3487B2029e5009m6944C2743G339a24581A09904e2494m2868l2745j5981
12455a44088b6428k39000a08426d8394k25048M8046B05692I9423K75874A77377
$$ plain form
12444 -64737 262742 84367 81146 -243970 251944 -104855 -78264 79449 39613 -161609 296632
12432 105222 38439 69153 -99016 28936 222035 41455 -174830 70473 113771 155894 -3126
12420 -16793 -222902 42647 -94097 219641 -84607 165917 -258163 267257 -16644 -148630
12410 -148630 61456 -7700 16483 50209 -17400 -297332 93704 -174141 251589 60379 -117343
12398 -6929 -136035 136050 147937 -4719 -16562 154014 134600 -19114 122385 -397612 -79078
12386 -369867 -37460 -385451 -213523 205492 137336 8936 72783 273876 185764 -375024 -131893
12374 -40025 -75544 -118717 -76796 37534 402140 -88308 -221007 164256 -155640 257564 69871
12362 26223 251092 -17704 89722 -124218 -330037 37852 585523 103539 121268 19156 -121247
$$ packed form
12444f4737B62742H4367l221b43970B51944a04855K6591G9449C9613a61609B96632
12432A05222C8439L0714i9016B8936J93099D1455a74830G0473M3298M2123c126
12420a6793k06109D2647i4097B19641h4607A65917b58163B67257a6644j31986
12410a48630F1456g700A6483L3726a7400k79932I3704a74141B51589F0379a17343
12398f929j29106A36050J1887d719j1843A54014j9414a9114A22385c97612g9078
12386c69867c7460l47991J71928B05492o8156H936O3847K01093q8112c75024a31893
12374d0025l5519m3173M1921C7534L64606h8308j32699A64256a55640B57564F9871
12362B6223K24869a7704H9722a24218k05819C7852N47671A03539J7729A9156a21247
$$ plain form
12350 -189006 107186 -42287 77179 256461 450808 41268 -96717 59905 -238903 -204056 317997
12338 189949 102416 -137293 -20756 105536 109045 -420903 -94671 -209561 307510 -1696 -164137
12327 -164137 238805 -182393 -249116 -157568 185197 107925 -137709 312295 -68065 -109966
12317 -109966 95461 49255 -144954 295639 -132007 198868 -86161 -258778 79794 -147775
12306 153377 -166763 -207075 -61871 151195 -138175 148870 185254 -353375 326097 -261275
12295 151435 296754 -61085 287103 -15261 165556 -58149 -165705 12295 -312700 138379
12284 74464 -79257 69087 95820 233430 236335 133238 -111273 22271 -13514 19209 463637
12273 463637 279189 435942 130012 147385 309749 194909 114457 -26237 430382 -94183
$$ packed form
12350a89006A07186d2287G7179J79282J94347D1268i6717E9905b38903L4847C17997
12338A89949q7533a37293b0756A05536L509d20903i4671j14890C07510a696j62441
12327a64137B38805a82393o6723R1548A85197p7272a37709C12295f8065m1901
12317a09966I5461m6206a44954B95639a32007A98868h6161j72617G9794a47775
12306A53377a66763m0312f1871A51195a38175A48870L6384c53375C26097b61275
12295A51435J45319f1085B87103a5261A65556e8149j07556A2295c12700A38379
12284G4464g9257F9087K6733J37610K905j03097a11273B2271a3514A9209M44428
12273D63637j84448J56753A30012J7373J62364j14840q0452b6237D30382i4183
$$ plain form
12262 177485 32237 143641 -17778 282927 289566 -20197 137645 241930 -69847 324248 370401
12251 370401 56413 65584 140409 291734 256471 305969 48502 288263 -46952 513771 -118401
12239 78612 37096 123711 61365 133908 83308 193813 -6164 100597 189928 410225 103221
12227 186376 517936 446940 208365 313383 239627 291328 296480 254741 312478 157947 -24876
12215 402437 67362 58625 199595 -40781 195807 384964 208748 -240376 171424 139644
12205 139644 611846 232226 54970 111014 266014 264166 496827 -90765 191292 267581 306017
12194 306017 -88680 -100319 -85153 110635 263882 -37428 384793 -222101 394143 -81327
12183 103853 54433 164944 370380 295062 132972 344723 -76458 94823 37091 397088
$$ packed form
12262A77485C2237J11404a7778B82927O639b0197A37645J04285f9847C24248M6153
12251C70401E6413R171P4825J51325l5263M9498D8502K39761d6952E13771a18401
12239G8612C7096Q6615F1365P2543n0600J10505f164A00597Q9331K20297A03221
12227A86376L31560p0996B08365J05018p3756N1701N152m1739N7737j54531b4876
12215D02437F7362q737J40970d0781A95807J89157j76216b40376A71424l1780
12205A39644M72202B32226E4970N6044J55000j848K32661i0765A91292P6289L8436
12194C06017h8680j1639J5166A10635J53247c7428C84793b22101C94143h1327
12183A03853m9420J10511K05436p5318A32972K11751g6458I4823C7091L59997
$$ plain form
12173 397088 125884 -271841 -209299 149745 78533 280011 -226260 208554 411879 235270
12163 235270 409206 341380 399445 284434 -781 185647 313289 140721 -142314 3031 59630
12152 59630 16889 90864 -24355 -71592 -351770 -118082 -156904 -131500 -69612 186782 40670
12140 -6088 139297 299746 -77036 48721 156106 3911 164295 131118 101679 50714 -99188
12128 -109621 -169065 -437917 40310 120577 -127175 -191051 93688 390399 -55718 153504 -155335
12116 -285200 36279 -59743 149695 227477 71950 -30960 -12254 -7779 324296 4135 74725
12105 74725 68354 -387757 87487 23341 187398 -118986 -65061 58933 139569 -389163 162315
12093 76742 -48278 28487 70236 59328 -353094 -109176 122427 -181510 -253755 -6626 61161
$$ packed form
12173C97088A25884b71841O2542A49745p1212K01478b26260B08554K03325j76609
12163B35270J73936o7826N8065j15011g81A85647J27642A40721a42314C031N6599
12152E9630A6889P3975b4355m7237k80178a18082l8822K5404O1888A86782D0670
12140f088A39297J60449g7036D8721J07385C911J60384l3177k9439E0714i9188
12128a09621n9444k68852D0310Q0267a27175o3876I3688K96711e5718A53504a55335
12116b85200C6279e9743A49695P7782G1950c0960a2254M475C24296D135P0590
12105G4725o371c87757H7487B3341J64057a18986N3925E8933Q0636c89163A62315
12093G6742d8278B8487M1749j0908c53094a09176A22427a81510p2245f626F1161
$$ plain form
12081 339030 91901 88313 491137 795970 1369158 1265596 588141 238753 167903 61860
12070 155575 16108 273203 50002 -173189 77867 -142319 -84983 224390 -189644 -25174
12059 12683 81121 72755 346582 230161 56315 165611 170517 -302086 -2289 -185367 89679
12047 390162 -187229 -321864 -343930 -74039 171085 -50872 -212156 -60536 -158791 -55248 -157853
12036 -157853 -376266 -7481 124014 -144472 -185658 -149958 -122600 -10726 -46884 249097 47878
12024 -240937 -34777 -124079 159908 105883 58911 290798 145336 342017 -68424 417246
12013 19732 -22729 -105777 107615 19562 123097 239802 22140 174175 -104340 144427
12002 -192945 -120750 195584 -30747 158374 -17552 -51463 163943 -222962 -65233 213374
$$ packed form
12081C39030I1901l588M02824L04833N73188j03562E88141B38753p0850F1860
12070A55575A6108K57095E0002a73189G7867a42319N7336B24390a89644b5174
12059A2683O8438q366K73827j16421E6315J09296M906c02086b289j83078H9679
12047C90162a87229j34635k2066g4039A71085e0872j61284f0536r8255e5248j02605
12036a57853k18413g481A24014a44472m1186L5700K7358a0726l6158B49097D7878
12024b40937c4777q9302A59908n4025m6972K31887A45336J96681f8424D17246
12013A9732b2729q3048A07615A9562J03535J16705B2140J52035a04340A44427
12002a92945P2195A95584c0747A58374a7552l3911A63943b22962f5233B13374
$$ plain form
11991 -63460 186378 60358 -238036 -30867 162436 126403 -209417 -64354 73640 -310660 113901
11979 192030 89324 112175 107661 -82012 -100069 -192929 -241358 56167 -156730 -13642 -120645
11968 -120645 129952 -235223 300095 45716 -173647 -31933 -141673 185062 -265434 -546126
11958 -546126 -384080 91708 -208236 -2241 50484 168671 -86768 -135096 78532 371566 292637
11947 292637 -38271 -93321 170774 80806 282797 22351 -132235 243566 -215037 46703
11936 432992 14081 -50348 -209035 235195 -58177 138316 -10446 86176 -145381 133131
11925 10249 30890 -30603 -86109 109171 -148443 104301 -66521 -214913 -129309 25113 115851
11914 115851 197025 12215 282687 122924 -80784 -99052 54456 11752 -150888 165841 148273
$$ packed form
11991f3460A86378F0358b38036c0867A62436l6033b09417f4354G3640c10660A13901
11979A92030H9324K2851m514h2012j8057r2860m8429E6167a56730a3642j07003
11968a20645A29952b35223C00095D5716a73647c1933j09740A85062b65434k80692
11958e46126J62046I1708b08236b241E0484J18187h6768m8328G8532K93034p8929
11947B92637c8271n5050A70774H0806K01991B2351a32235B43566b15037D6703
11936D32992A4081e0348j58687B35195e8177A38316a0446H6176a45381A33131
11925A0249K0641c0603n5506A09171a48443A04301f6521j48392Q5604B5113R0738
11914A15851Q1174A2215K70472A22924h0784j8268E4456A1752a50888A65841j7568
$$ plain form
11903 148273 529387 -153047 226089 100860 3863 -234873 -314947 142513 -210526 -79915
11892 136791 82648 -13815 180796 -81821 57260 60859 211466 177458 9118 -13211 -60664
11881 -60664 118833 109159 -232053 -177602 -110403 -126970 38865 -378113 155250 -54409 161060
11869 -181658 47412 -95894 -142857 -386127 -121091 328617 -152959 -170641 -91387 -69418 -290148
11858 -290148 -154573 -193446 114490 -87515 -76038 -49993 -213427 164723 -101909 124033
11847 109216 368427 198659 32432 -13983 58995 -224805 -278568 -91890 256229 -229779
11836 -149253 123181 -272654 -12025 -118804 -65879 441481 -553655 -8499 114668 -276549
11825 -43304 134577 -6906 -145601 224840 166671 -175380 -57310 -120883 -35352 85470 42742
$$ packed form
11903A48273L81114a53047B26089A00860C863b34873q0074A42513b10526g9915
11892A36791n4143a3815A80796h1821E7260L599J50607l4008I118a3211m7453
11881f0664A18833r674b32053N4451O7199j6567C8865c78113A55250e4409A61060
11869a81658D7412i5894m6963k43270a21091C28617a52959j7682P9254K1969k20730
11858b90148J35575l8873A14490h7515J1477K6045j63434A64723a01909A24033
11847A09216K59211j69768C2432a3983E8995b24805n3763i1890B56229b29779
11836a49253A23181b72654a2025j06779N2925D41481e53655h499A14668b76549
11825d3304A34577f906j38695B24840n8169a75380e7310o3573c5352H5470m2728
$$ plain form
11814 42742 174398 -385904 -65733 -248232 596 -123062 340696 -139189 -129870 -110205 53589
11802 67247 -31855 -98741 -314986 -47668 -28844 -187274 140102 -12007 -179640 103097 -415533
11790 19368 58636 -183173 -1549 338383 -202583 -84011 -252713 183272 -111513 44612 132597
11779 132597 123832 142837 189303 208147 -142372 50581 195101 40975 -100276 -203425 95273
11767 37508 276625 -250802 -45801 -241404 -204771 82796 -117966 -361060 -28866 29870 -274165
11755 -122258 -79197 -153149 18823 -91281 -215898 -174594 15914 -13346 -44773 28603 -242617
11743 369851 -32026 250720 110361 -79729 197329 -114420 -142638 151386 -201015 1432
11732 -220274 346765 200249 -34134 1143 -166314 334535 87755 -233584 -370375 47771
$$ packed form
11814D2742J31656c85904f5733j82499E96a23062C40696a39189R319J9665E3589
11802F7247c1855o6886k16245d7668J8824j58430A40102a2007j67633A03097d15533
11790A9368L9268a83173a549C38383b02583h4011j68702A83272a11513D4612Q7985
11779A32597q765J9005M6466J8844a42372E0581J44520D0975a00276j03149I5273
11767C7508K39117b50802d5801j95603L6633H2796a17966k43094b8866B9870b74165
11755a22258M3061p3952A8823i1281j24617M1304A5914a3346l1427B8603b42617
11743C69851c2026B50720A10361g9729A97329a14420k8218A51386b01015A432
11732b20274C46765j46516c4134A143a66314C34535H7755b33584j36791D7771
$$ plain form
11721 98140 20759 214104 151665 -150725 83801 118496 -225529 1256 107482 325360 221853
11710 221853 91940 369103 213825 206065 -55157 -44739 78573 82362 154501 153248 258311
11699 258311 372226 -24103 -474973 223148 24345 -12895 -110130 -171710 240998 17116 129008
11688 129008 283595 245833 248445 165306 -3205 11848 -195441 54826 116037 327110 167175
11677 167175 344785 -123429 -52641 305769 -130704 -53810 98850 116526 2705 -235909 330246
11665 337328 169905 66420 -146454 19613 84195 -19716 115634 -126934 166165 -132585
11654 99510 -65325 93290 5022 13852 -265400 -155883 91490 228135 -228037 96546 -162955
11642 27437 -102954 -54268 -29516 223374 200806 -152661 207910 -112350 -379391 35091
$$ packed form
11721I8140B0759J93345o2439a50725H3801L4695b25529A256J06226K17878j03507
11710B21853I1940K77163j55278p760e5157J0418G8573L789P2139j253J05063
11699B58311J13915b4103m50870B23148B4345a2895r7235o1580B40998A7116J11892
11688A29008J54587l7762K612q3139c205A1848a95441E4826O1211K11073j59935
11677A67175J77610a23429e2641C05769a30704e3810I8850J7676B705b35909C30246
11665C37328j67423F6420a46454A9613O4582a9716A15634a26934A66165a32585
11654I9510f5325I3290E022Q830b65400J09517I1490J36645b28037I6546a62955
11642B7437a02954M8686K4752B23374k2568a52661B07910a12350k67041C5091
$$ plain form
11631 414529 -188513 -165112 149449 179747 170184 43591 131429 40489 179470 174047 -165385
11619 243355 218066 -26966 -105077 -85444 -92887 -151608 13801 23562 -123172 -56932 157112
11607 366728 -119116 89889 39905 53190 155660 114369 -13019 20528 -36479 206228 106429
11596 106429 4095 260272 -169586 -95122 99337 -17705 -40079 326108 112490 60736 453601
11585 453601 121943 194474 406974 231789 16868 285196 -5216 299701 -94174 31853 93374
11574 93374 190185 155846 -114295 359875 29890 -173296 154829 44022 614895 -42006 127788
11562 69587 -10462 358756 -124159 -107341 300169 -89348 -96616 145799 226400 -24681 218203
11550 -207349 291690 144495 -106331 403853 212800 96334 -54227 261620 218078 544219
$$ packed form
11631D14529a88513K3401A49449L0298r563D3591Q7838D0489J38981n423a65385
11619B43355k5289b6966p8111J9633p443n8721A3801R761a23172e6932A57112
11607C66728a19116H9889C9905J3285J02470m1291a3019B0528c6479B06228r9799
11596A06429D095K56177a69586P4464I9337a7705k2374C26108A12490n1754L92865
11585D53601A21943P2531K12500j75185A6868K68328e216B99701i4174C1853O1521
11574I3374R6811l4339a14295C59875B9890a73296A54829D4022N70873d2006A27788
11562F9587a0462C58756a24159J6818C00169h9348p268A45799Q0601b4681B18203
11550b07349B91690A44495a06331D03853j91053I6334e4227B61620m3542L26141
$$ plain form
11540 544219 106112 176018 -54898 82050 187835 -4388 615195 -45720 196160 -6376 175147
11528 76634 296161 -303826 252201 234314 -134965 231726 164045 260943 286901 26292 132057
11517 132057 95547 418328 -95544 -47801 8284 181562 181296 -2242 290132 155916 13444
11505 251847 270413 -66714 230459 358328 89464 24432 -190498 151636 104367 75226 -124774
11493 149577 73154 251030 -121615 -221901 52665 157463 80834 316970 338898 -72872
11482 586487 196425 58402 21811 318719 -195650 153383 339927 295580 327715 332702 -261716
11470 260273 361637 160936 222825 473139 63515 -114145 -8432 124701 219434 344479
11460 344479 -58448 208102 -59010 8518 -125013 126622 135509 -129089 -131646 255705 235951
$$ packed form
11540E44219A06112O9906e4898H2050J05785d388F15195d5720A96160f376A75147
11528G6634K19527c03826B52201j7887a34965B31726o7681R6898K5958B6292J05765
11517A32057l6510L22781i5544M7743H284J73278k66b242B90132j34216A3444
11505B51847J8566f6714B30459J27869H9464B4432a90498A51636m7269k9141a24774
11493A49577G3154J77876a21615j00286E2665J04798p6629K36136K1928g2872
11482E86487A96425E8402B1811K96908a95650A53383J86544m4347L2135M987b61716
11470B60273J01364A60936O1889K50314F3515a14145h432A24701R4733J25045
11460C44479e8448B08102e9010H518a25013A26622Q887a29089k557B55705j9754
$$ plain form
11449 235951 268615 76416 -40068 99231 414038 92358 109037 372610 -87887 148691 453772
11438 453772 -103545 315693 11411 241632 295520 170349 -25804 253764 28970 -347620
11427 23051 -69594 349992 354340 38755 109280 -13666 42679 271456 -131614 67856 354570
11416 354570 -266200 364855 97902 74749 89182 96440 -312 -118088 357355 -160637 -328627
11405 -328627 -100463 -197450 143822 -9624 318233 142073 247219 -29385 119781 237561
11395 237561 257363 138679 174671 85016 -50150 -111911 -231066 8455 -112758 67337 -41062
11383 92163 -147170 260849 51210 212188 215422 -60920 254431 229017 -100412 40765 48219
11372 48219 151511 166847 -111105 3821 8684 166998 -181795 -343662 3815 -384232 -210627
$$ packed form
11449B35951L2664G6416d0068I9231L14807I2358J6679K63573h7887A48691L05081
11438D53772a03545C15693A1411K30221N3888j25171b5804B53764B8970c47620
11427B3051f9594C49992M348C8755P0525a3666D2679K28777a31614F7856K86714
11416C54570b66200C64855I7902k3153J4433P258c12j17776C57355a60637j67990
11405c28627a00463r6987A43822i624C18233A42073J05146b9385A19781J17780
11395B37561J9802j18684L5992H5016e0150o1761j19155H455a12758F7337d1062
11383I2163a47170B60849E1210J60978L234f0920B54431k5414a00412D0765P454
11372D8219J03292J5336a11105C821M863J58314a81795j61867C815c84232J73605
$$ plain form
11361 -210627 28706 50592 -94701 65315 -137381 -239290 -38565 114490 -629649 -217103
11350 229827 165769 -140597 -111101 232242 -50001 10032 -143123 89840 -241506 67523 90389
11339 90389 -10464 -87775 -24897 -162431 -341142 -191176 -11005 -90742 88928 146414 -66860
11327 166419 -129420 -190218 -109666 -198541 57932 -113704 45767 -30481 -160035 74261 161089
11316 161089 424925 -289698 -99304 164156 2233 -226623 -45277 -70387 -140913 238919 145576
11305 145576 -154001 -28098 117856 -48261 77659 -45702 -79422 77922 -220631 -83541 138670
11293 -271170 -223402 194938 149879 362835 -208853 213989 -141358 213227 70519 -221381
11282 -280704 -277395 211444 -194751 336920 73318 75425 95002 32829 -358853 -117609 -96963
$$ packed form
11361b10627B8706K1886i4701F5315a37381j01909c8565A14490f29649b17103
11350B29827o4058a40597K9496B32242e0001A0032a43123H9840b41506F7523K2866
11339I0389a0464p7311b4897j37534j78711J49966a1005p9737H8928N7486f6860
11327A66419a29420o0798Q0552q8875E7932a13704D5767c0481j29554G4261Q6828
11316A61089K63836b89698i9304A64156B233b26623d5277k5110p0526B38919r3343
11305A45576a54001b8098A17856d8261G7659d5702l3720G7922b20631h3541A38670
11293b71170M7768A94938m5059K12956b08853B13989a41358B13227G0519b21381
11282b80704L309B11444a94751C36920G3318K107J9577C2829c58853a17609K0646
$$ plain form
11271 -96963 -45034 -94629 31364 -281373 23129 -219993 -3863 191055 -228250 -230168 -234658
11260 -234658 142506 47195 37130 -261123 -101588 -129282 -113180 321061 -383 -239499 -306683
11249 -306683 175742 83175 -242623 104449 216826 -56750 -158890 56560 69964 -266611
11238 -60691 165989 54418 232494 -158913 -150387 159674 -377841 -211976 2368 -48265 120260
11226 266142 23221 21441 -12946 -16272 -360025 114105 -60456 332876 208818 -194390 57692
11214 -16802 8663 -269769 -178530 264097 -269069 117354 -223339 -13699 21444 -215839 -204037
11203 -204037 -347893 -71563 -137472 -287113 228205 -3625 183702 12516 -302335 -26780 -331421
11192 -331421 -268992 -86947 153411 -16664 140147 -183358 97369 -82794 59792 -188290 -271193
$$ packed form
11271i6963d5034m9595C1364b81373B3129b19993c863A91055b28250j918m490
11260b34658A42506D7195j0065b61123a01588k7694J6102C21061c83k39116o7184
11249c06683A75742H3175b42623A04449J12377e6750j02140E6560J3404b66611
11238f0691A65989E4418J78076a58913Q526A59674c77841J65865B368d8265A20260
11226B66142B3221j780a2946l326l43753A14105f0456C32876j24058a94390E7692
11214a6802H663b69769R1239B64097b69069A17354b23339a3699B1444b15839J1802
11203b04037j43856g1563o5909j49641B28205c625A83702A2516c02335b6780l04641
11192c31421O2429h6947A53411a6664A40147a83358I7369h2794E9792a88290q2903
$$ plain form
11181 -271193 80672 -111369 -18219 44094 -64291 70050 -68828 -233211 30762 -86715 237789
11169 13085 -196074 -371476 58243 31477 232111 236354 -36701 -321161 -172869 107767 8157
11157 265691 -25899 100545 -124417 -270356 -129495 120157 -30617 55090 13941 -257869
11146 -25388 98636 93699 105735 -77544 -192696 -207460 -174680 -63843 295766 -375508 -18894
11134 -235468 -24509 139555 -85338 67466 58543 19915 294565 -105097 408975 -412763 -74913
11122 22551 -50993 -67998 -27841 93146 333061 20393 135695 -192427 194333 39562 -133230
11110 -156478 -46962 246892 -87694 15376 91917 412463 208807 105797 -167537 284618
11099 449468 65344 396404 520363 213690 24528 376151 77253 191917 250232 1677 279178
$$ packed form
11181b71193H0672a11369a8219D4094f4291G0050f8828j64383C0762h6715B37789
11169A3085a96074j75402E8243k6766K00634M243c6701k84460J48292A07767H157
11157B65691b5899A00545a24417j45939a29495A20157c0617E5090A3941b57869
11146b5388I8636m937J2036g7544j15152j4764L2780f3843B95766c75508a8894
11134b35468b4509A39555h5338F7466q923A9915K74650a05097D08975d12763g4913
11122B2551e0993j7005b7841I3146K39915B0393J15302a92427A94333C9562a33230
11110a56478d6962B46892h7694A5376P6541L20546k03656j03010a67537B84618
11099D49468F5344L31060J23959B13690B4528L51623G7253J14664N8315A677K77501
$$ plain form
11088 279178 201882 120775 357958 343755 211960 486739 226763 243535 528159 127432
11077 51693 297023 150846 365800 201124 506042 260085 430850 76661 351676 550818
11067 550818 308085 288621 566678 389936 516845 213840 997924 275468 857723 515140
11057 515140 472705 319312 793950 637703 769067 870202 730264 584703 572482 709661
11047 709661 682576 770729 1052305 1135744 720862 637658 540260 771271 665441 524237
11037 524237 825050 1004888 864090 704041 650128 680823 505932 1118943 713990 565192
11027 565192 827257 1025706 972555 858380 867903 592986 875421 741838 836805 1075958
11017 1075958 605214 538185 573875 706250 545306 583633 390804 760954 439300 902667
$$ packed form
11088B79178p7296q1107K37183j4203j31795K74779B26763J6772K84624A27432
11077E1693K45330j46177K14954j64676L04918k45957J70765G6661K75015J99142
11067E50818k42733j9464K78057j76742J26909B13840P84084B75468N82255l42583
11057E15140m2435j53393M74638j56247J31364J01135j39938j45561j2221J37179
11047G09661k7085Q8153K81576Q3439m14882q3204r7398K31011j05830j41204
11037E24237L00813J79838j40798j60049n3913L0695j74891O13011m04953j48798
11027E65192K62065J98449n3151j14175R523k74917K82435j33583R4967K39153
11017A075958m70744o7029L5690J32375j60944L8327j92829L70150l21654M63367
$$ plain form
11007 902667 867823 571128 697806 859113 616261 824028 736489 933446 936269 580772
10997 580772 959932 718102 767819 888110 1046311 858727 729704 501406 512533 974102
10987 974102 838448 968932 937459 1139056 898680 1305166 988556 1374954 1239487 1783872
10977 1783872 1718556 2062801 2015250 2198337 2432255 2947657 2794079 3060649 3089018 3239882
10967 3239882 3042562 2588149 2413794 2174000 2089868 1969818 1898492 1655912 2011987 1771752
10957 1771752 1923133 2251631 2399831 1987946 1608991 1568275 1227932 1266916 1046867 1072912
10947 1072912 588749 632487 461893 596298 586011 131457 300950 300015 116411 281661
10937 281661 147320 397533 96354 76938 -30727 71067 277331 -109075 258519 234021
$$ packed form
11007I02667l4844k96695J26678J61307k42852K07767q7539J96957K823l55497
10997E80772L79160k41830M9717J20291J58201j87584j29023k28298J1127M61569
10987I74102j35654J30484l1473K01597k40376M06486l16610L86398j35467N44385
10977A783872o5316L44245m7551J83087K33918N15402j53578K66570K8369J50864
10967C239882j97320m54413j74355k39794q4132j20050p1326k42580L56075k40235
10957A771752J51381L28498J48200m11885l78955m0716l40343L8984k20049K6045
10947A072912m84163M3738j70594J34405j0287A31457J69493r35A16411J65250
10937B81661j34341K50213I6354j9416c0727G1067K06264a09075B58519k4498
$$ plain form
10927 234021 -82151 220925 -160755 10654 90543 -118346 466647 -19871 167836 -101837
10916 313585 250214 -153584 61382 -39865 334699 -60018 98457 -170552 230435 83282 139470
10905 139470 -102540 -1398 -69938 242235 141623 48004 44471 -194607 -181095 74350 84801
10894 84801 141126 -87499 60076 -76311 221595 -205642 -141620 -236600 414897 36712 88713
10883 88713 233362 -90207 -116185 38870 -41284 -381043 46288 -251436 -101763 -153894 -87582
10872 -87582 142274 410015 115225 187989 453 -55677 -345069 -114043 118522 -10598 94538
10860 163676 24422 -84971 -208591 -14998 -57982 253822 99139 114464 250381 203079 122046
10849 122046 -262258 -451955 57647 424475 70909 -72488 -247301 9615 -63210 -28589 422318
$$ packed form
10927B34021h2151B20925a60755A0654P9889a18346D66647a9871A67836a01837
10916C13585o3371a53584F1382c9865C34699f0018I8457a70552B30435H3282N6188
10905A39470a02540a398o8540B42235j00612D8004l533a94607J3512G4350J0451
10894H4801N6325h7499F0076g6311B21595b05642O4022r4980D14897C6712N2001
10883H8713J44649i0207k5978C8870d1284l39759D6288b51436a01763n2131O6312
10872h7582A42274K67741A15225P2764D53e5677k89392a14043A18522a0598I4538
10860A63676B4422h4971j23620a4998m2984B53822I9139J5325J35917m7302q1033
10849A22046b62258j89697E7647L66828G0909g2488j74813I615f3210b8589D22318
$$ plain form
10837 73539 27880 -109654 -77330 389914 -43677 -205043 -119247 45294 -120403 -105258 -73099
10826 -73099 79582 -52934 -113271 51231 192237 1042 105194 186620 157723 36818 -45709
10814 -172589 -180213 17379 -215321 -235382 18709 -297591 -194665 -163309 112719 -74371 20128
10802 47885 -75574 -45556 261472 -38733 141503 404138 -366458 -354982 -169592 -327057
10792 -327057 -171567 -137239 108827 417873 -226821 -342669 -75207 -133257 -40486 -37282 -191654
10781 -191654 138970 60690 -196409 -200114 -81035 152661 -52350 30046 -234793 -132146 64739
10769 -51950 -216825 -4224 -65971 -5770 -151380 -265419 133183 -112620 246911 -6268 -289630
10758 -289630 -108890 -38505 -169204 -378599 239563 4161 -23371 37133 264083 -149506
$$ packed form
10837G3539B7880a09654L2324C89914d3677j61366Q5796D5294a20403J5145L2159
10826g3099G9582e2934o0337E1231J41006A042J04152Q1426k8897C6818d5709
10814a72589p624A7379b15321k0061A8709b97591J02926L1356A12719g4371B0128
10802D7885g5574L0018B61472c8733A41503K62635c66458J1476a69592j57465
10792c27057J55490L4328A08827L09046b26821j15848g5207n8050d0486L204j54372
10781a91654A38970F0690a96409l705h1035A52661e2350C0046b34793J02647F4739
10769e1950j64875d224o1747e770j45610j14039A33183a12620B46911f268k83362
10758b89630a08890c8505j30699k09395B39563D161b3371C7133K26950a49506
$$ plain form
10747 -7254 -56611 -120262 -111468 68891 -388332 289358 -7077 154718 -543391 -72838 146736
10735 -92631 -167325 13359 -209356 155059 -246361 256135 -110485 -276486 77689 -141240
10724 -13365 60791 227543 -155385 95871 -66976 39727 -124896 -77864 89160 118950 130699
10713 130699 -236868 87300 -58001 37940 -350806 46353 9476 -54121 -30679 205534 18510
10701 -31899 102883 135997 -15814 -151519 -151451 19158 -94166 -63853 -197246 -35912 -34683 -10008
10688 -161517 569645 -8883 -182274 -278170 -253111 4053 79470 300563 -175497 -111414 10485
10676 -221498 72805 134271 170155 -5026 -7808 11508 59864 142080 -395410 -69192 262872
10664 -83151 170377 -158215 141382 -38082 87381 -94034 -219553 265838 -330888 -112998
$$ packed form
10747g254m9357o3651Q794F8891c88332B89358g077A54718e43391g2838A46736
10735i2631p4694A3359b09356A55059b46361B56135a10485j66001G7689a41240
10724a3365F0791J66752a55385I5871f6976C9727a24896M7032H9160K9790J1749
10713A30699b36868H7300e8001C7940c50806D6353I476e4121K3442B05534A8510
10701c1899A02883L3114a5814j35705O8A9158i4166L0313j33393c5912J229a0008
10688a61517E69645h883j73391r5896K5059D053P5417K21093a75497O4083A0485
10676b21498G2805O1466L5884e026k782A1508M8356Q2216c95410f9192B62872
10664h3151A70377a58215A41382c8082H7381i4034j25519B65838c30888a12998
$$ plain form
10653 -326725 313600 -446677 -10836 209192 -47163 190432 -392620 -255409 -155911 -283507
10643 -283507 88492 3954 74715 281863 -171507 -317689 -22956 18176 118423 81901 -30888
10631 -45073 -285261 -144456 198351 153994 -145757 37722 -61145 -174633 -248091 345517
10620 -12848 128766 -50987 -206561 168295 4956 -252442 -105760 -179754 -444455 -199484
10609 -101143 -17516 -396730 -251860 -107450 -177682 228014 -31388 -165762 187852 189160
10599 189160 251729 44006 137940 -311303 -188855 66153 -6309 -89626 73160 -146502 -10604
10587 -239488 -103940 -307256 -282703 -66202 168669 197565 63625 -80966 173448 62249 7557
10575 171914 -302797 -22631 158430 40997 -232434 84831 -339880 15528 -348246 -225929
$$ packed form
10653c26725C13600d46677a0836B09192d7163A90432c92620J37211R9498j27596
10643b83507H8492C954P0761K07148a71507j46182b2956A8176J00247l6522c0888
10631d5073k40188J40805A98351m4357a45757C7722f1145j13488p3458C45517
10620a2848A28766e0987j55574A68295D956b52442a05760p3994k64701a99484
10609a01143a7516l79214J44870a07450p0232B28014c1388j34374A87852J308
10599A89160O2569D4006R3934c11303J22448F6153f309q3317G3160a46502a0604
10587b39488a03940k03316K4553f6202A68669K8896F3625h0966A73448F2249G557
10575A71914c02797b2631A58430D0997b32434H4831c39880A5528c48246J22317
$$ plain form
10565 -225929 -42165 87136 -175012 -75453 -376759 141278 4201 143549 -71691 24137 -84752
10553 56600 -110133 111792 10853 -81185 111342 115673 180596 -104280 -363131 24933 -57817
10541 404350 262470 57709 -26856 79578 -224741 9877 46851 39438 155516 -266224 -8576
10529 61314 -158169 -124338 -45155 -7782 -95755 -19282 98263 -264403 27859 -338123 53149
10517 -284841 -136413 238969 -9939 -236384 -8544 90181 59638 320190 -54156 -114361 116968
10505 -333942 -46632 -76069 -147793 -116487 106375 49365 -371820 -22886 60456 153010 -27451
10493 -265433 -184297 63063 -134922 91321 286050 -27787 292098 -57729 367645 244695
10483 244695 156645 232517 623373 398739 274433 309741 527955 215163 377287 190329
$$ packed form
10565b25929d2165H7136a75012g5453l01306A41278D201J39348g1691B4137h4752
10553E6600a10133A11792A0853h1185A11342M331O4923a04280k58851B4933e7817
10541D04350j41880E7709b6856G9578b24741I877L6974p413J16078b66224h576
10529F1314a58169L3831d5155g782q7973a9282I8263b64403B7859c38123E3149
10517b84841a36413B38969i939k26445h544I0181l0543K60552e4156o0205A16968
10505c33942d6632k9437p1724L1306A06375D9365c71820b2886F0456R2554b7451
10493b65433Q1136F3063a34922I1321J94729b7787B92098e7729C67645j22950
10483B44695q8050P5872L90856k24634j24306L5308K18214B15163J62124j86958
$$ plain form
10473 190329 52907 -517 119394 -13910 -54476 -204283 -284685 78401 108225 -119183 -83953
10462 -83953 -379473 -158464 130071 185774 -17005 81849 -217414 335296 111647 31807
10451 165506 90705 -24777 -384644 33086 -183566 -226188 137281 38633 164301 67833 -13772
10439 -56480 -137968 -248490 73607 281489 214803 -241967 -166880 198386 177871 -174003 -52536
10427 123970 -186086 -59410 148169 -126103 -361565 -18557 111283 -102700 -150791 -306594
10417 -306594 134587 262485 -65479 -28234 -24273 -69368 82455 -8855 216619 -197677 168082
10405 44163 -25887 213459 -54771 305880 23394 374075 188453 26087 -86202 -288451 -57024
10393 -221596 -114291 5595 172603 278114 13864 -266159 62088 -30699 -150615 271845
$$ packed form
10473A90329E2907e17A19394a3910m0566j49807q0402G8401K9824a19183L5230
10462h3953k95520a58464A30071N5703a7005H1849b17414C35296A11647C1807
10451A65506p4801b4777l59867C3086a83566m2622A37281C8633J25668F7833a3772
10439e6480q1488j10522G3607K07882o6686b41967P5087A98386k0515a74003e2536
10427A23970a86086e9410A48169a26103k35462a8557A11283a02700m8091j55803
10417c06594A34587J27898f5479b8234L961m5095H2455h855B16619a97677A68082
10405D4163b5887B13459e4771C05880B3394L50681j85622B6087h6202k02249e7024
10393b21596J07305E595J67008J05511A3864b66159F2088c0699j19916B71845
$$ plain form
10382 34184 387261 -238265 317488 394714 179445 319471 360618 245160 386117 341576
10372 341576 -90051 564041 261133 382363 114417 427142 403286 824412 454392 87749
10361 14006 718334 267339 445976 383649 133881 -45506 371821 70890 524815 231939
10350 428717 299847 424003 344380 295133 415591 445213 520640 312333 292543 395924
10340 395924 -77974 305001 -97558 709337 344962 140492 -33182 319229 271923 149179
10330 149179 220537 145817 339122 160213 -137240 66289 -44205 377546 335559 -9785 342911
10318 -112681 -109833 214885 188190 211223 -94125 84700 327573 21297 27982 -348303 64443
10306 101977 278897 191866 189573 -21613 856 -28649 -146182 -24297 164792 24719 -244835
$$ packed form
10382C4184L53077b38265C17488P7226A79445J40026M1147j15458J40957m4541
10372C41576i0051E64041B61133J21230A14417L12725k3856M21126l70020H7749
10361A4006P04328B67339J78637o2327A33881d5506C71821G0890M53925B31939
10350D28717j28870J24156p9623m9247J20458K9622P5427k08307j9790J03381
10340C95924g7974C05001i7558G09337C44962A40492c3182C19229m7306j22744
10330A49179P1358p4720J93305A60213a37240F6289d4205C77546m1987i785C42911
10318a12681K848B14885k6695K3033i4125H4700K42873B1297O685c48303F4443
10306A01977J76920q7031k293b1613H56b8649j17533b4297A64792B4719b44835
$$ plain form
10294 -32531 -454703 138669 -491747 -83752 222256 -165437 -81195 26994 116839 -114357
10283 121915 77035 -205860 22622 13843 -19287 -326004 326436 -8268 -1724 -123703 -21347
10271 299751 -132547 -29655 -49304 114022 134254 161986 234597 -56036 40760 -75941 304985
10259 549890 223857 385478 749990 304616 892368 151061 543520 17171 82010 422521
10249 422521 246227 161556 56056 -128115 -58758 -104338 -45038 -4970 44086 333247 91323
10237 -78852 -312124 64615 167431 84741 -98655 -242961 -93944 -337154 79562 -169093 -77553
10225 -80738 144397 333854 -369800 24755 -400889 -138108 -11293 -237028 -547316 165289
10214 135629 -40081 59760 35462 63120 -107399 -145424 -98365 -247466 157743 -39231 88328
$$ packed form
10294c2531m22172A38669d91747h3752B22256a65437h1195B6994Q9845a14357
10283A21915m4880b05860B2622q779a9287l06717C26436h268a724j21979b1347
10271B99751a32547b9655j9649A14022K0232K7732P2611e6036D0760g5941C04985
10259E49890B23857J61621L64512C04616N87752A51061L92459A7171O4839L40511
10249D22521j76294q4671E6056a28115e8758m5580d5038d970D4086K89161I1323
10237g8852k33272F4615J02816q2690i8655j44306i3944k43210G9562a69093g7553
10225h0738A44397J89457c69800B4755d00889a38108a1293k25735l10288A65289
10214A35629d0081E9760k4298K7658a07399l8025M7059j49101A57743c9231H8328
$$ plain form
10202 -39350 -67279 -19482 7994 -120609 -231454 -434202 -59786 -80564 -144094 -161741 147237
10190 151146 -164343 -18251 257847 -17907 -114574 251823 -23318 -242471 98270 104963 -70662
10178 -247797 -175204 -35277 -97050 -57173 21563 -127032 -161218 35423 -338514 -149920 14548
10166 -87819 47509 54561 -116656 23570 -101298 -152866 35360 173412 48828 21815 -123316
10154 3153 87364 202508 -421539 -94175 -238738 -84715 212217 -315027 -40925 394145 44311
10142 48318 -106344 -372900 84342 -116412 288091 230064 -124414 -86057 -348972 -179552
10132 -179552 377425 -160748 -148019 -135295 -285489 -183592 -143032 -11649 -8237 -126077 134870
10120 110762 318729 -125677 85500 92974 -188397 30163 -222468 97286 -55396 -58464 51358
$$ packed form
10202c9350k7929a9482G994a20609j10845k02748e9786k0778o3530j7647A47237
10190A51146a64343a8251B57847a7907r6667B51823b3318k19153I8270O693g0662
10178b47797P2593c5277o1773L9877B1563a27032l4186C5423c38514a49920A4548
10166h7819D7509P052a16656B3570a01298n1568C5360J38052D8828B1815a23316
10154C153Q4211J15144d21539i4175j44563h4715B12217c15027d0925C94145D4311
10142D8318a06344k66556H4342a16412B88091n8027a24414L8357k62915J69420
10132a79552C77425a60748J2729J2724j50194J01897M0560a1649L412j17840A34870
10120A10762K07967a25677H5500P474a88397C0163b22468I7286e5396l068E1358
$$ plain form
10108 62186 -340482 113708 -291178 252356 -71755 -410493 52079 -202917 203630 -366092
10097 98622 -4173 72358 7657 -277120 115274 -86080 -14043 -124140 -173607 -90896 -59817
10086 -59817 -304707 -169030 -68941 -82821 239734 -46791 68586 109073 -1766 172877 -259465
10074 -173841 329346 -437272 203436 -80104 72300 -121100 151953 -143473 121807 -152880
10063 -232161 -54965 -207204 12316 -147591 67915 -123636 -334319 253740 -59064 -319710
10053 -319710 35037 -165822 -27643 -113635 -245002 59239 -290582 23330 -144763 52387 30110
10042 30110 71248 -16724 -99200 -19804 28697 -304339 75462 -162082 71833 10012 -222715
10030 -251233 -333981 164326 -364527 -309339 -1243 -371433 -71094 -118116 -240390 338387 -126059
$$ packed form
10108F2186c40482A13708b91178B52356g1755l38738E2079b02917B03630c66092
10097I8622d173G2358G657b77120A15274h6080a4043j10097m9467Q2711L1079
10086e9817k44890J35677f8941j3880B39734d6791F8586M0487a766A72877b59465
10074a73841C29346d37272B03436h0104G2300a21100A51953a43473A21807a52880
10063b32161e4965j52239A2316a47591F7915a23636k10683B53740e9064k60646
10053c19710C5037a65822b7643q5992j31367E9239b90582B3330a44763E2387k2277
10042C0110M1138a6724q2476a9804B8697c04339G5462a62082G1833A0012b22715
10030b51233q2748A64326c64527N5188a243l70190g1094m7022j22274C38387a26059
$$ plain form
10018 181364 -202430 -138942 147131 11230 -282354 214232 -51814 166349 91703 138072
10008 138072 57711 -384789 272011 61077 113474 127679 -121315 41696 -89953 53616 60718
9997 60718 -86429 259080 12868 -136101 -232486 -319081 -80842 -278772 1976 252830 -1763
9985 -184070 -61069 36913 -96876 -157523 -25800 133193 -4160 216284 261231 16461 18856 81710
9973 81710 -118742 148627 -28111 99363 91133 -16622 -48433 7435 -35815 -136490 -156208 -77446
9960 -531781 -137970 -238495 -215187 47288 -27081 -232602 -95523 252265 -219491 -262863 245990
9948 -237632 -161731 -7431 -127748 -373317 -111395 331297 64834 -223194 -26321 -145318 188818
9936 80869 249189 -234803 168876 -11250 -201557 -173517 94669 55226 -404503 -313671 -207771
$$ packed form
10018A81364b02430O3488A47131A1230b82354B14232e1814A66349p4646M6369
10008A38072E7711c84789B72011F1077N2397J4205a21315D1696h9953E3616P102
9997F0718h6429B59080A2868a36101r6385q6595h0842j97930A976K50854a763
9985a84070f1069C6913i6876o0647b5800A33193d160B16284M4947A6461K395O2854
9973H1710a18742A48627b8111I9363q230a6622l1811G435c5815j00675j9718g7446
9960e31781a37970j00525K3308D7288b7081k05521i5523B52265b19491m3372B45990
9948b37632P5901g431j20317k45569a11395C31297F4834b23194b6321j18997A88818
9936H0869J68320b34803A68876a1250j90307K8040I4669l9443d04503R0832J05900
$$ plain form
9925 -207771 -206933 129184 246539 413043 -147566 -131257 -117487 -149829 180374 -282220 -378300
9914 -378300 322823 -236172 127651 147816 -175539 -157423 121567 73946 -214479 38184
9903 -364040 99217 73912 -21497 -143886 19824 78646 87721 -42854 -12727 -302779 -112919
9891 -175647 -333572 -107144 -247253 6079 -141498 -93021 -11968 -80184 -4351 -238555 -140206
9880 -140206 -212097 -58952 -1387 144685 44782 117161 -133694 -166745 26470 147277 -139360
9868 28737 78490 84735 60559 -369779 724 -22959 148272 -334711 -101695 -40861 -47155 -128646
9856 -128646 -83953 -57491 41610 105577 58573 -321919 51486 -235073 224192 20494 92235
9845 92235 28553 -134581 145094 -242525 -52984 205249 208336 151296 -272060 146244 252405
$$ packed form
9925b07771Q38A29184J17355J66504a47566J6309J3770l2342A80374b82220r6080
9914c78300C22823b36172A27651K0165a75539J8116A21567m7621b14479C8184
9903c64040I9217k5305b1497j22389A9824N8822R075d2854a2727k90052a12919
9891a75647j57925a07144j40109F079a41498M8477a1968o8216d351k34204R8349
9880a40206p1891e8952a387A44685D4782P2379a33694l3051B6470J20807a39360
9868B8737M9753O245k4176c69779G24b2959A48272c34711a01695d0861o294q1491
9856a28646M4693K6462D1610O3967m7004c21919E1486b35073B24192B0494P1741
9845I2235B8553a34581A45094b42525e2984B05249L087n7040b72060A46244J06161
$$ plain form
9834 252405 -73935 58068 -163510 -232725 -508325 -78028 -59294 -180857 240796 -77631 180150
9822 190905 158244 -268118 -291159 -152422 -253226 -95799 -169123 -317422 -153411 159990
9811 -153096 6807 24331 7236 -19278 -175144 316626 15862 -163121 -51302 148992 -96135
9799 270903 -256285 -419773 -111590 -30000 -183465 -134232 110893 -108430 -450483 -221644
9788 -102638 98908 -217968 330729 284296 -95185 184161 -32411 -363600 -117368 31253 -185487
9776 -216871 111462 -52051 277718 39830 47476 -239056 -35668 -209088 -144859 -12145 38399
9764 -93912 23603 4213 -130866 173336 -191246 66483 -294297 -238566 -223465 -76142 -248738
9753 -248738 210179 -107254 -14638 -235664 -411689 258458 -96140 -61393 -238590 -186238
$$ packed form
9834B52405g3935E8068a63510o9215k75600g8028J8734j21563B40796g7631A80150
9822A90905l2661b68118k3041J38737j00804i5799p3324j48299a53411A59990
9811a53096F807J7524G236a9278j55866C16626A5862a63121e1302A48992i6135
9799B70903b56285j63488a11590c0000j53465M9233A10893a08430l42053b21644
9788a02638I8908b17968C30729m6433i5185A84161c2411l31189a17368C1253a85487
9776b16871A11462e2051B77718C9830P646b39056c5668j73420O4229a2145C8399
9764i3912B3603D213a30866A73336a91246F6483b94297N5731J5101g6142j72596
9753b48738B10179a07254a4638k21026j76025B58458i6140L4747j77197N2352
$$ plain form
9743 -186238 -230216 -111874 -142107 271425 72544 109547 189022 -154520 -35184 -186758 -114342
9732 -114342 134512 -133469 57511 -268300 -60625 29251 -160382 12550 141418 -311273
9721 23762 -279131 -50774 32885 -166793 77863 -78139 170438 160476 -156772 -55701 56811
9709 -310718 12931 -89050 -106662 -107134 -316036 14613 115744 -7824 -279705 -94293 -376399
9698 -376399 -165778 -15255 126937 -172110 -73064 -190961 -283752 -133850 -62172 6780 8450
9687 8450 -236137 19395 -24865 11571 -146401 -141417 225625 137752 -222915 228165 -109511
9675 -66196 -40901 -306232 -51784 247656 73016 91368 -38911 25453 -24630 79919 -154192
9663 -358082 -159636 78289 -63383 220945 -130539 -119631 -81401 67429 -319043 -52570 420585
$$ packed form
9743a86238m3978a11874l0233B71425G2544L7003P9475a54520c5184j51574P2416
9732a14342A34512a33469E7511b68300f0625B9251a60382A2550J28868c11273
9721B3762b79131e0774C2885a66793G7863g8139A70438r962a56772e5701E6811
9709c10718A2931h9050j7612m72k08902A4613J01131g824k71881i4293k82106
9698c76399a65778a5255A26937a72110g3064j17897r2791a33850f2172F780J670
9687H450b36137A9395b4865A1571a46401M984B25625q7873b22915B28165a09511
9675f6196K5295k65331e1784B47656G3016J8352c8911B5453b4630G9919a54192
9663c58082a59636G8289f3383B20945a30539J0908L8230F7429c19043e2570D20585
$$ plain form
9651 -280817 -111444 100718 -161514 -44266 -15197 34442 131908 -666372 -259179 23553 232970
9640 232970 -184876 -55449 241244 247149 78147 -321300 -242010 -133475 -83835 -136946 74407
9628 -212820 57284 -180293 54127 -177738 -228846 219718 -44855 -201170 -160073 60453 82604
9617 82604 -172963 204954 -444731 -146005 -198929 130790 -355350 181958 8131 -85787 -200106
9606 -200106 -235872 -47226 -156241 48048 -140850 -85049 -41139 -303652 -55451 -363657 -136188
9594 -306471 -163451 13485 -229795 -453688 -310678 -253235 89062 136497 307610 85547 84459
9583 84459 -254916 36067 -70239 -54204 59175 -240744 1249 347458 61351 -445622 -140802
9571 288420 -267252 156584 -43200 205655 261057 110617 -219449 -102473 -177861 -320657
$$ packed form
9651b80817a11444A00718a61514d4266a5197C4442R7466f66372b59179B3553K09417
9640B32970a84876e5449B41244N905G8147c21300P9290J08535M9640n3111G4407
9628b12820E7284a80293E4127a77738n1108B19718d4855j56315M1097F0453K2151
9617H2604a72963B04954d44731a46005n2924A30790c55350A81958H131h5787j14319
9606b00106l5766d7226j09015D8048a40850N5801d1139k62513e5451l08206a36188
9594c06471J43020A3485b29795k23893J43010N7443H9062M7435J71113H5547j088
9583H4459b54916C6067g0239J6035E9175b40744A249L46209F1351d45622a40802
9571B88420b67252A56584d3200B05655N5402A10617b19449a02473p5388j42796
$$ plain form
9561 -320657 -36396 -140816 283935 -220050 -16173 -47078 176888 -14800 -133621 2965 177378
9550 177378 -78884 22822 -25602 163621 -253195 -75062 7909 -29843 34283 -85520 -201525
9539 -201525 -114163 -11137 -5295 5129 -164338 -219723 -222920 57117 -386964 -494289 -74478 207418
9526 445887 -240633 -45379 278888 -462315 55776 173648 -330448 278979 189639 -7799 -111455
9515 -111455 -221144 38954 -127641 5912 11891 307005 148559 -19363 -238929 -77912 -33820
9503 -11755 119444 -235642 223024 -290463 24796 -97653 169394 -64004 40054 343021 -21324
9491 -87695 -87629 232433 22992 227600 -183042 80750 57331 -18773 132287 -62659 -102254 -150093
9479 -150093 -295117 97407 -194106 -230122 92448 -456679 -75258 -18853 234246 -83107 -228387
$$ packed form
9561c20657c6396j04420B83935b20050a6173l0905A76888a4800j18821B965J74413
9550A77378g8884B2822b5602A63621b53195g5062G909b9843C4283h5520j16005
9539b01525Q7362a1137e295E129a64338n5385l197E7117c86964j07325g4478B07418
9526D45887b40633d5379B78888d62315E5776J17872c30448B78979q9340g799j03656
9515a11455j09689C8954a27641E912N979K95114A48559a9363k19566g7912c3820
9503a1755A19444b35642B23024b90463B4796i7653A69394f4004D0054L02967b1324
9491h7695O6B32433B2992K04608a83042H0750k3419a8773A32287f2659l9595m7839
9479a50093j45024I7407a94106l6016I2448d56679g5258a8853B34246h3107j45280
$$ plain form
9468 -228387 -285608 -82391 -145573 -38431 409211 291539 134613 -220129 118086 -207593
9457 -35458 -91169 -220011 99280 -15147 -63825 -389876 -192537 -93900 70653 -77513 -121795
9446 -121795 155461 -168850 -294959 -296399 -88750 -21787 110211 -167709 -87251 218745 31444
9434 -135773 -147751 -206478 -438114 -16873 -46654 -205752 -81352 -100534 -206945 -168646 -186170
9423 -186170 -458438 -125603 -62664 -85833 93384 -14563 31637 235369 -90665 57755 185339
9412 185339 -52934 -1756 -332935 -71132 91013 -125438 111560 -11288 84348 251209 -90466
9400 -168988 18353 267024 -553322 158175 -96265 -151774 -141778 -524069 -209739 -132159 -69254
9389 -69254 -17094 -113057 -63437 -25480 -39304 -6927 135237 27295 -75130 -152127 -91781 -325094
$$ packed form
9468b28387n7221h2391o3182c8431D09211j17672A34613b20129A18086b07593
9457c5458n5711j28842I9280a5147m8678l26051a92537i3900G0653g7513m4282
9446a21795A55461a68850j26109j440h8750b1787A10211a67709Q0458B18745C1444
9434a35773j1978n8727k31636a6873k9781j59098h1352j9182j06411L8299j7524
9423a86170k72268a25603f2664k3169I3384a4563C1637K03732i0665E7755J27584
9412A85339e2934a756l31179g1132I1013a25438A11560a1288H4348J66861i0466
9400a68988A8353K48671e53322A58175i6265n5509R996l82291b09739P7580O2905
9389f9254a7094r5963M9620b5480j3824f927A35237B7295g5130p6997O0346k33313
$$ plain form
9377 -325094 -195709 107640 409725 -69780 -71927 -139536 150524 -149186 331 -74552 -175610
9366 -175610 -145725 -75354 100563 65213 128272 156332 -10454 -22994 -52662 -335506 -80405
9354 93215 429377 193749 -154495 -416544 -114932 -88813 -67642 -187229 74472 -93595 -188830
9343 -188830 -275060 69205 49631 -91498 -192350 -6729 72136 -127251 248796 40710 -78382
9331 -310037 -219285 -401237 -101171 33148 -136963 -20069 -123821 -179158 43211 -264461 35916
9319 -131947 29276 -41079 162712 -257387 67725 -3996 209410 -127028 -188423 197128 -223258
9307 335067 -267985 60981 -302564 -316988 196270 -104947 -55826 347292 -362651 167927
9296 -84372 80448 -150896 -185189 -320742 123232 85829 133766 -160726 -220980 97497 214247
$$ packed form
9377c25094J29385A07640L02085f9780k147o7609A50524a49186C31g4552j01058
9366a75610K9885P0371A00563l5350O3059K8060a0454j2540k9668k82844h0405
9354I3215L36162A93749a54495k62049a14932K6119K1171j19587G4472i3595r5235
9343a88830q6230F9205j9574i1498j00852f729G2136a27251B48796D0710g8382
9331c10037R0752j81952a01171C3148a36963b0069j03752n5337D3211b64461C5916
9319a31947B9276d1079A62712b57387F7725c996B09410a27028o1395A97128b23258
9307C35067b67985F0981c02564j4424A96270a04947M9121C47292c62651A67927
9296h4372H0448a50896l4293j35553A23232l7403M7937a60726o0254I7497J16750
$$ plain form
9285 214247 -74929 -193328 163955 267846 -141883 -139154 117273 -265922 -125594 -172608
9275 -172608 -207227 -8208 -25041 349636 -108092 -22221 -270985 -276682 294461 -4085 127708
9263 -116434 -265373 -14581 -83486 -245242 -350092 -81069 153882 242841 -67162 -318063 -30536
9251 -96068 -137886 49130 34216 19956 -363183 -245977 94973 -5104 68660 -45013 -246168
9240 -246168 -178985 -252998 103343 -76665 -2429 -215262 136080 -332830 102442 -186360 81599
9228 18203 -67756 -182699 115781 143422 -55437 -46156 -120866 -167196 -28797 -253229 178042
9216 -27521 -248257 24306 -170228 -174074 -112510 -120120 -106935 212984 -38239 38849 -142011
9204 -114598 367671 -178135 -121108 -510746 -209813 -159364 68913 23226 84850 44746 154692
$$ packed form
9285B14247g4929j18399A63955J03891a41883K729A17273b65922a25594m7014
9275a72608l4619h208j6833C49636a08092b2221k48764n697B94461d085A27708
9263a16434j48939a4581o8905j61756j04850h1069A53882Q8959f7162k50901c0536
9251i6068m1818D9130j4914j4260c63183J17206I4973e104F8660d5013k01155
9240b46168O7183p4013A03343g6665b429k12833A36080c32830A02442a86360H1599
9228A8203f7756j14943A15781K7641e5437R281p4710m6330b8797k24432A78042
9216b7521k20736B4306a70228l846O1564p610J3185B12984c8239C8849a42011
9204a14598C67671a78135N7027l89638b09813N0449F8913B3226O1624m0104J09946
$$ plain form
9193 154692 -188251 48470 -401941 53260 -73407 47875 -4790 -27516 -364338 146403 -101336
9181 -237601 29192 -156418 -181490 -37037 -352572 -54336 -196157 -397897 -414534 -113569 -267555
9170 -267555 -315068 -297167 -328883 2498 -126326 96154 133505 67718 97398 -99710 33003 -83802
9157 -77703 473848 237727 -178646 66737 -240071 -261251 -111267 -151427 456797 11134 -93322
9145 226786 40937 159453 117228 -97218 -94728 134945 -326053 -34184 -29832 -113763 -161929
9134 -161929 -298445 -69533 -205132 433186 12482 -116194 25368 -63620 60401 27475 38496
9123 38496 226075 90501 182257 102328 -239823 -446353 -104074 83151 -58298 -114816 -87986
9112 -87986 -442381 -2213 -28434 -117257 118355 65239 -129036 -158531 118184 -121080 139568
$$ packed form
9193A54692a88251D8470d01941E3260g3407D7875d790k2726l36822A46403a01336
9181b37601B9192a56418k5072c7037l15535e4336j41821k01740j6637a13569j53986
9170b67555m7513J7901l1716B498a26326I6154L7351o5787K9680i9710C3003h3802
9157g7703D73848k36121a78646F6737b40071k1180a11267m0160D56797A1134i3322
9145B26786D0937J18516m2225i7218K490A34945c26053c4184M352q3931m8166
9134a61929j36516f9533j35599D33186A2482a16194B5368f3620F0401B7475J1021
9123C8496J87579I0501R1756p9929b39823k06530a04074H3151e8298n6518K6830
9112h7986l54395b213k6221q8823A18355n3116a29036k9495A18184a21080A39568
$$ plain form
9100 -118803 -149045 -306968 205861 184724 -17033 -94812 372707 -101647 18574 -89549 -49261
9089 -49261 -65748 129210 149865 306029 -232206 -192136 -101889 -222224 50585 -51748 149907
9077 -169790 245647 155653 -6905 245561 -171004 211113 133294 -89362 78794 203692 143361
9066 143361 -162996 -154086 -122811 -170206 51652 -159797 -22170 287406 -317826 -23225 -15592
9055 -15592 -13813 383373 -179375 -136546 -177987 -85970 119327 61765 -10343 -2465 -39282 -228119
9043 -228119 -154848 49864 -315470 -230966 -182361 -52756 -9371 9502 -150102 153656 -94609
9031 326 -142524 44446 122767 -52083 -392010 -398613 68898 70259 -121105 -116046 -27379 -338285
9019 -338285 -47944 -263228 114513 -66507 333083 -82214 -45054 -31993 130258 -200915 142147
$$ packed form
9100a18803l0242j57923B05861k1137a7033p7779C72707a01647A8574h9549M0288
9089d9261j6487A29210K0655J56164b32206M0070R0247j20335E0585e1748A49907
9077a69790B45647q9994f905B45561a71004B11113p7819h9362G8794J24898o0331
9066A43361a62996Q910L1275m7395E1652a59797b2170B87406c17826b3225P633
9055a5592J779C83373a79375M2829m1441h5970A19327n7562a0343b465l6817j88837
9043b28119P3271D9864c15470Q4504M8605e2756i371I502a50102A53656i4609
9031C26a42524D4446P8321e2083l39927o603F8898J361a21105N059b7379l10906
9019c38285d7944k15284A14513f6507C33083h2214L7160J3061A30258b00915A42147
$$ plain form
9007 -229209 -24634 -31586 101871 -199849 -162353 84492 -297510 -255765 -96620 -18682 -432372
8996 -432372 91506 76307 -88294 -264700 -15587 157548 34606 -33534 -125857 -456407 -421867
8985 -421867 121754 -177389 31088 -107524 -34269 -6505 162670 -39276 196558 -325565 68786
8973 -384541 21229 146392 -95365 13847 18748 38454 106128 -82676 -41875 113516 -220495
8961 82469 40641 -126685 -18541 -14516 78747 -32040 -56142 -181514 -242475 218744 76948
8949 -58824 345789 -34225 25788 -70411 -338523 106814 -241489 241359 197857 -175340 76696
8937 -7399 -160101 60333 135361 204882 -153743 105608 190620 -140519 -123571 -17926 244 295111
8925 295111 306545 539497 2070594 6006466 12371153 3969451 1374299 711091 476299
$$ packed form
9007b29209b4634o952A01871a99849L7496H4492b97510M1745i6620a8682m13690
8996d32372I1506j5199h8294j76406a5587A57548C4606c3534r2323l30550L4540
8985d21867A21754a77389C1088a07524c4269f505A62670c9276A96558c25565F8786
8973c84541B1229J25163i5365A3847M901J9706O7674h2676M0801A13516b20495
8961H2469D0641a26685a8541M025G8747c2040k4102j25372o0961B18744G6948
8949e8824C45789c4225B5788g0411k68112A06814b41489B41359m3502a75340G6696
8937g399j52702F0333P5028O9521a53743A05608Q5012a40519J6948a7926B44K94867
8925B95111J1434K32952J531097L935872O364687C969451A374299o63208k34792
$$ plain form
8916 476299 638134 157933 -105538 -304881 222752 42180 51468 136219 478007 160291
8905 -218613 42495 143632 95550 -51040 93916 -399758 -24989 88574 107227 -283967 -132607
8893 -488514 43700 -198430 162664 -211328 11613 7956 -314075 -127152 -157212 -190598 -153075
8882 -153075 -212327 -96993 131460 216058 -237725 6358 225359 -63869 -132827 -13617 -29286
8871 -29286 199115 -160441 -156697 -315478 -144256 229554 -254109 -69871 29519 -139539 -204660
$$ packed form
8916D76299J61835A57933a05538j99343B22752D2180R288Q4751L41788A60291
8905b18613D2495J01137m8082e1040I3916c99758b4989H8574J8653b83967a32607
8893d88514D3700a98430A62664b11328A1613l657c14075a27152l0060l3386L7523
8882a53075n9252i6993A31460Q4598b37725F358K19001f3869o8958a3617j5669
8871b9286A99115a60441L744j58781a44256B29554b54109f9871B9519a39539o5121
$$ [...]
##END NTUPLES=NMR SPECTRUM
##END=
