##TITLE=AC1712_14FALM0001_8743523_LyKpv0qBwT
##JCAMPDX= 6.0         $$ Bruker NMR JCAMP-DX V2.0
##DATA TYPE= NMR SPECTRUM
##DATA CLASS= NTUPLES
##ORIGIN= BRUKER
##OWNER= Administrator
$$ 1.72 TOPSPIN		Version 2.1
$$ 2015-08-08 03:07:00.438 -0700  Administrator@X
$$ Compression mode = diff/dup
##.OBSERVE FREQUENCY= 400.02188249412
##.OBSERVE NUCLEUS= ^1H
##.ACQUISITION MODE= SIMULTANEOUS (DQD)
##.ACQUISITION SCHEME= undefined
##.AVERAGES= 8
##.DIGITISER RES= 22
##SPECTROMETER/DATA SYSTEM= spect
##.PULSE SEQUENCE= zg30
##.SOLVENT NAME= COFFEE_meoh
##.SHIFT REFERENCE= INTERNAL, COFFEE_meoh, 1, 14.98509
##AUDIT TRAIL= $$ (NUMBER, WHEN, WHO, WHERE, PROCESS, VERSION, WHAT)
$$ ##TITLE= Audit trail, TOPSPIN		Version 2.1
$$ ##JCAMPDX= 5.01
$$ ##ORIGIN= Bruker BioSpin GmbH
$$ ##OWNER= Administrator
$$ $$ E:\/data/COFFEE/nmr/AC1712_14FALM0001_8743523_LyKpv0qBwT/40/pdata/1/auditp.txt
$$ ##AUDIT TRAIL=  $$ (NUMBER, WHEN, WHO, WHERE, PROCESS, VERSION, WHAT)
(   1,<2015-08-08 03:06:53.000 -0700>,<Administrator>,<X>,<go>,<TOPSPIN 2.1>,
      <created by zg
	started at 2015-08-08 03:05:47.156 -0700,
	POWCHK enabled, PULCHK disabled,
       configuration hash MD5:
       21 0F 79 D6 B3 7B B4 F6 88 20 88 DB 03 48 BD 9F
       data hash MD5: 64K
       0A 58 BC 57 09 FB D5 53 4E BE CA 9D C1 78 E0 53>)
(   2,<2015-08-08 03:06:56.281 -0700>,<Administrator>,<X>,<proc1d>,<TOPSPIN 2.1>,
      <Start of raw data processing
       efp LB = 0 FT_mod = 6 PKNL = 1 PHC0 = 0 PHC1 = 0 SI = 32K 
       data hash MD5: 32K
       D4 ED C1 23 ED B8 9A AC 2F 20 52 88 76 4C D7 5E>)
(   3,<2015-08-08 03:06:56.563 -0700>,<Administrator>,<X>,<proc1d>,<TOPSPIN 2.1>,
      <pk PHC0 = 92.26868 PHC1 = 0 
       data hash MD5: 32K
       86 D0 35 07 98 81 FA 9D A3 72 13 BC 3A 52 05 6C>)
(   4,<2015-08-08 03:06:56.719 -0700>,<Administrator>,<X>,<proc1d>,<TOPSPIN 2.1>,
      <abs ABSG = 1 
       data hash MD5: 32K
       79 EC AE 1D F1 9D 38 C7 AE C0 87 5D D0 7E EB 7C>)
(   5,<2015-08-08 03:06:56.781 -0700>,<Administrator>,<X>,<proc1d>,<TOPSPIN 2.1>,
      <abs ABSG = 2 
       data hash MD5: 32K
       C8 61 08 1F 04 FF 71 EB A9 78 8B F9 0A AA 2A 32>)
(   6,<2015-08-08 03:06:56.828 -0700>,<Administrator>,<X>,<proc1d>,<TOPSPIN 2.1>,
      <abs ABSG = 3 
       data hash MD5: 32K
       BD 52 45 45 F1 84 45 DC 53 C4 CB 26 9A BA 4F D5>)
(   7,<2015-08-08 03:06:56.891 -0700>,<Administrator>,<X>,<proc1d>,<TOPSPIN 2.1>,
      <abs ABSG = 4 
       data hash MD5: 32K
       72 05 6D FE 6E AC 7A 20 F9 E0 18 B2 14 71 51 80>)
(   8,<2015-08-08 03:06:56.969 -0700>,<Administrator>,<X>,<proc1d>,<TOPSPIN 2.1>,
      <abs ABSG = 5 
       data hash MD5: 32K
       95 72 10 2A CB BD 5B A8 86 EE 17 39 12 ED 13 89>)
$$ ##END=
$$ 
$$ $$ hash MD5
$$ $$ 6D 00 91 F8 85 BF CF 7F AD 97 03 35 CB 72 BE B4
##$RELAX= 
##$RELAX= 
##$RELAX= 
##$RELAX= 
##$RELAX= 
##$RELAX= 
##$RELAX= 
$$ Bruker specific parameters
$$ --------------------------
##$DU= <E:\>
##$EXPNO= 40
##$NAME= <AC1712_14FALM0001_8743523_LyKpv0qBwT>
$$ [...]
150 150 150 150 150 150 150 150
##$TP07= 0
##$TPNAME0= <>
##$TPNAME1= <>
##$TPNAME2= <>
##$TPNAME3= <>
##$TPNAME4= <>
##$TPNAME5= <>
##$TPNAME6= <>
##$TPNAME7= <>
##$TPOAL= (0..7)
0.5 0.5 0.5 0.5 0.5 0.5 0.5 0.5
##$TPOFFS= (0..7)
0 0 0 0 0 0 0 0
##$TUNHIN= 0
##$TUNHOUT= 0
##$TUNXOUT= 0
##$USERA1= <user>
##$USERA2= <user>
##$USERA3= <user>
##$USERA4= <user>
##$USERA5= <user>
##$V9= 5
##$VALIST= <valist>
##$VCLIST= <CCCCCCCCCCCCCCC>
##$VD= 0
##$VDLIST= <DDDDDDDDDDDDDDD>
##$VPLIST= <PPPPPPPPPPPPPPP>
##$VTLIST= <TTTTTTTTTTTTTTT>
##$WBST= 2048
##$WBSW= 25
##$XGAIN= (0..3)
0 0 0 0
##$XL= 0
##$YL= 0
##$YMAX_a= 618964
##$YMIN_a= -523234
##$ZGOPTNS= <>
##$ZL1= 120
##$ZL2= 120
##$ZL3= 120
##$ZL4= 120
##$ABSF1= 14.98509
##$ABSF2= -5.573092
##$ABSG= 5
##$ABSL= 3
##$ALPHA= 0
##$AQORDER= 0
##$ASSFAC= 0
##$ASSFACI= 0
##$ASSFACX= 0
##$ASSWID= 0
##$AUNMP= <proc_prof1d_extract_pilot.lims>
##$AXLEFT= 0
##$AXNAME= <>
##$AXNUC= <1H>
##$AXRIGHT= 0
##$AXTYPE= 0
##$AXUNIT= <>
##$AZFE= 0.1
##$AZFW= 0.1
##$BCFW= 0
##$BC_mod= 0
##$BYTORDP= 0
##$COROFFS= 0
##$CY= 15
##$DATMOD= 1
##$DC= 0
##$DFILT= <>
##$DTYPP= 0
##$F1P= 0
##$F2P= 0
##$FCOR= 0.5
##$FTSIZE= 32768
##$FT_mod= 6
##$GAMMA= 0
##$GB= 0
##$INTBC= 1
##$INTSCL= 1
##$ISEN= 128
##$LB= 0
##$LEV0= 0
##$LPBIN= 0
##$MAXI= 10000
##$MC2= 0
##$MEAN= 0
##$ME_mod= 0
##$MI= 0
##$NCOEF= 0
##$NC_proc= -8
##$NLEV= 6
##$NOISF1= 0
##$NOISF2= 0
##$NSP= 0
##$NTH_PI= 0
##$NZP= 0
##$OFFSET= 14.98509
##$PC= 1
##$PHC0= 92.26868
##$PHC1= 0
##$PH_mod= 1
##$PKNL= yes
##$PPARMOD= 0
##$PPDIAG= 0
##$PPIPTYP= 0
##$PPMPNUM= 2147483647
##$PPRESOL= 1
##$PSCAL= 4
##$PSIGN= 0
##$PYNMP= <proc.py>
##$REVERSE= no
##$SF= 400.02
##$SI= 32768
##$SIGF1= 0
##$SIGF2= 0
##$SINO= 400
##$SIOLD= 32768
##$SPECTYP= <>
##$SREGLST= <1H.CDCl3>
##$SSB= 0
##$STSI= 32768
##$STSR= 0
##$SW_p= 8223.68421052631
##$SYMM= 0
##$S_DEV= 0
##$TDeff= 65536
##$TDoff= 0
##$TI= <>
##$TILT= no
##$TM1= 0
##$TM2= 0
##$TOPLEV= 0
##$USERP1= <user>
##$USERP2= <user>
##$USERP3= <user>
##$USERP4= <user>
##$USERP5= <user>
##$WDW= 1
##$XDIM= 32768
##$YMAX_p= 438425084
##$YMIN_p= -676792
##$CURPLOT= <Network HP LaserJet P1505>
##$CURPRIN= <$Network HP LaserJet P1505>
##$DFORMAT= <normdp>
##$LAYOUT= <+/1D_H.xwp>
##$LFORMAT= <normlp>
##$PFORMAT= <normpl>
##$SURQMSG= 1
$$ End of Bruker specific parameters
$$ ---------------------------------
##NTUPLES= NMR SPECTRUM
##VAR_NAME=  FREQUENCY,     SPECTRUM/REAL,   SPECTRUM/IMAG
##SYMBOL=    X,             R,               I
##VAR_TYPE=  INDEPENDENT,   DEPENDENT,       DEPENDENT
##VAR_FORM=  AFFN,          ASDF,            ASDF
##VAR_DIM=   32768,         32768,           32768
##UNITS=     HZ,            ARBITRARY UNITS, ARBITRARY UNITS
##FACTOR=    0.250966925370066, 1,           1
##FIRST=     8223.43324360094, -131484,      16509
##LAST=      0,             -115232,         -145345
##MIN=       0,             -676792,         0
##MAX=       8223.43324360094, 438425084,    0
$$ Real data points
##PAGE= N=1
##DATA TABLE= (X++(R..R)), XYDATA
$$ [...]
19535C9347B287L3928b61681A57013G4373m592J63137c35514b0839q2521p1420
$$ 39347 2287 36215 -261681 157013 74373 69781 232918 -335514 -20839 -103360 -174780
19524a74780a9247n7143j80559D6041e5604H9963a04350L2949q1160l15218A11197
$$ -174780 -19247 -76390 -256949 46041 -55604 89963 -104350 -71401 -152561 -467779 111197
19512c39572A68936d22252a13407l09673J24843A7505a04190A13799a08101o7238
$$ -339572 168936 -422252 -113407 -423080 -298237 17505 -104190 113799 -108101 -175339
19502a75339A01534L1220l3601b80542B40838r8080a42461f8743g399A26735m2462
$$ -175339 101534 132754 99153 -280542 240838 142758 -142461 -68743 -7399 126735 84273
19491H4273L8656a31629A17293a16992h226l43501g3783k14401B202b93772J17258
$$ 84273 122929 -131629 117293 -116992 -8226 -351727 -73783 -288184 2202 -293772 -176514
19480a76514c7992k0685C8961J92442a99289A9767K03143b0985p8700j22791J06962
$$ -176514 -37992 -58677 38961 231403 -199289 19767 222910 -20985 -99685 -222476 -115514
19469a15514B50550q7760d4869m3779b7649k96368D1435h4503c0774o7058a9331
$$ -115514 250550 162790 -44869 -88648 -27649 -324017 41435 -84503 -30774 -97832 -19331
19457a10889b211k01149E1027h030j42228L0818j29936J5146O7070I1494G639
$$ -110889 -2211 -203360 51027 -8030 -150258 -119440 -249376 -234230 -167160 91494 7639
19445b0003j59920f8912k64444D9572N7509a77997H2527b3993e081j38116b4509
$$ -20003 -179923 -68912 -333356 49572 107081 -177997 82527 -23993 -5081 -143197 -24509
19433A78916h3140E6101b51744G89J29813b20045D1151K291b82726a14567r1469
$$ 178916 -83140 56101 -251744 789 130602 -220045 41151 43442 -282726 -114567 -206036
19422b06036j64737a66898A25946f9371j84742K2237A50541a89160K2522q8589
$$ -206036 -370773 -166898 125946 -69371 -254113 -231876 150541 -189160 -166638 -255227
19412b55227J21729L1932j91967k8880c9656A68626c82913J51871c6995A90191
$$ -255227 -133498 -101566 -293533 -322413 -39656 168626 -382913 -231042 -36995 190191
19401a9263o2753k06041H845K50925c9803B62017D6728L0583a1762k58235D4906
$$ -19263 -82016 -288057 8845 259770 -39803 262017 46728 77311 -11762 -269997 44906
19389a87006H1669J72380n4150b05443A43488a11866j23257g3340j92721b9126
$$ -187006 81669 254049 199899 -205443 143488 -111866 -235123 -73340 -266061 -29126
19378e4495J5705q9403e9905H3148B2175r7O9445c5319G8894j8950a64033B7896
$$ -54495 -38790 -128193 -59905 83148 22175 22078 91523 -35319 78894 59944 -164033 27896
19365B38302j06593h9745j70862f0331r6723d9464o6084B46410b35176P9932l25941
$$ 238302 131709 -89745 -260607 -60331 -157054 -49464 -115548 246410 -235176 -155244 -481185
19354d81185h3368K3737k23858J06884c7380l00816I7285a26546j6539j04856
$$ -481185 -83368 -59631 -283489 -176605 -37380 -338196 97285 -126546 -143085 -247941
19344b47941A19383c12841d108j92203N3358A16467j8598g9075k95004J50337
$$ -247941 119383 -312841 -4108 -196311 -142953 116467 97869 -79075 -374079 -223742
19334b23742H619M2014N9968a19250D4538P8920a41248N3452k38695a52526J1043
$$ -223742 8619 50633 110601 -119250 44538 123458 -141248 -87796 -326491 -152526 -141483
19323a41483r7253A88232G2441i289A48285h2581D466P9781b54862b0238B29556
$$ -141483 -238736 188232 72441 -9289 148285 -82581 4466 84247 -254862 -20238 229556
19311D4869a87866i3621L8419n9018A17635e2605B86472j26956b71586a25896
$$ 44869 -187866 -93621 -55202 -114220 117635 -52605 286472 159516 -271586 -125896
19300b9192n02499A34397b25198o7834i3536o7743L1276a2398M223m6877A84772
$$ -29192 -531691 134397 -225198 -293032 -93536 -161279 -130003 -12398 -8175 -55052 184772
19288e0243j78595A43185a17626J3799j29040f4148l53084I2413J74086c11121
$$ -50243 -228838 143185 -117626 -103827 -232867 -64148 -417232 92413 266499 -311121
19277h574o1315k13822N2203J15288c3736k24521M3147P6995p7542d2602A7153
$$ -8574 -69889 -283711 -231508 -116220 -33736 -258257 -215110 -138115 -215657 -42602 17153
19265H5836I173e743j59064d6721j55806B46973D9467M4671d78693a64219j20572
$$ 85836 9173 -5743 -164807 -46721 -202527 246973 49467 94138 -478693 -164219 -284791
19254b84791J17785f9598A8265a63155j3608P3783a8446C14295k7066a586l3735
$$ -284791 -167006 -69598 18265 -163155 -176763 -102980 -18446 314295 287229 -1586 -35321
19243c5321l05819F8046J19266f7541J611G2431c3191H5913f5594A13510a1649
$$ -35321 -341140 68046 187312 -67541 -65930 72431 -33191 85913 -65594 113510 -11649
19231D1240p972c6161j88855m0640h6396b6002j070j3158A20625f8766j27380
$$ 41240 33268 -36161 -225016 -265656 -86396 -26002 -27072 -40230 120625 -68766 -196146
19220a96146O1506A04203B508a52776K6350j91526c8215F4881d29139J42088J10906
$$ -196146 -134640 104203 2508 -152776 -126426 -317952 -38215 64881 -429139 -287051 -176145
19209a76145B4058g0347j54348F1733h7712k06528K9027g1607D8995b40623A85141
$$ -176145 24058 -70347 -224695 61733 -87712 -294240 -265213 -71607 48995 -240623 185141
19197c4815m622A42989L0639L4241H3371a56275c6708r3419D9047c04422a41988
$$ -34815 -39437 142989 173628 207869 83371 -156275 -36708 -130127 49047 -304422 -141988
19185H9578L818m3653i293q8115k5940C8923J96632k5565h45C030a45703K7649
$$ 89578 93396 49743 -9293 -97408 -123348 38923 235555 209990 -845 3030 -145703 -118054
19173a18054K4517L3761k95708R9181A70192H1983a17052j74367Q6973O1932C7462
$$ -118054 -93537 -59776 -355484 -256303 170192 81983 -117052 -291419 -204446 -142514 37462
19161f9075m3321I4262b25954a6544j91494c4083A10443g3852A6923g1668k19896
$$ -69075 -112396 94262 -225954 -16544 -208038 -34083 110443 -73852 16923 -71668 -291564
19150b91564C2724g504r3952b5718A7000M1495N2359L968a80999h3051G0478O195
$$ -291564 32724 -7504 -101456 -25718 17000 58495 110854 114822 -180999 -83051 70478 76673
19138G6673a08183L4339C4089b83102A7395d6669j78232c1609F0024b75288a1819
$$ 76673 -108183 -73844 34089 -283102 17395 -46669 -224901 -31609 60024 -275288 -11819
19126A2800N832a9773B5985F450O802d080H0322b78522f142A23335N9691b27788
$$ 12800 18632 -19773 25985 6450 13252 -4080 80322 -278522 -6142 123335 183026 -227788
19113A6528d58366R0769B47198h0901A58258e7840d316B65988m7263a80528B7357
$$ 16528 -458366 -367597 247198 -80901 158258 -57840 -4316 265988 218725 -180528 27357
19101B5085J07783b94676D3099f6750j70168i8047d1337p7023G3702b98399J48886
$$ 25085 132868 -294676 43099 -66750 -236918 -98047 -41337 -118360 73702 -298399 -149513
19090a49513o1607p7735B181c23943B8064h7766n0134B1846K10826j11391a29547
$$ -149513 -211120 -288855 2181 -323943 28064 -87766 -137900 21846 232672 121281 -129547
19078c53742i039j57697f9241I3661a94626h2098H0638Q8241c6989j23740f8573
$$ -353742 -9039 -166736 -69241 93661 -194626 -82098 80638 168879 -36989 -160729 -68573
19066b34711L9406A81398k9421c30787g0784a3636o8946A12793A6701h0647A74943
$$ -234711 -195305 181398 151977 -330787 -70784 -13636 -82582 112793 16701 -80647 174943
19054G4175i8336G2359b28152L0737b6213j75746J5546O0653q7425i9187o8759
$$ 74175 -98336 72359 -228152 -197415 -26213 -201959 -186413 -125760 -213185 -99187 -167946
19043a67946E6031j4698i3139K5313l41707H2123b99744A02970c39473a9842j56454
$$ -167946 56031 41333 -93139 -67826 -409533 82123 -299744 102970 -339473 -19842 -176296
19032a76296B53284c38B14794c42435A48567m13E8654b4208H0522K85160A47395
$$ -176296 253284 -338 214794 -342435 148567 148154 58654 -24208 80522 365682 147395
19020A84469c72551B47014a34406d8597j54281A52824J49168H4603L5968J27324
$$ 184469 -372551 247014 -134406 -48597 -202878 152824 301992 84603 120571 247895
19010B47895A00962b41746a4348k85668J28529A29402a96106i0216B09174j00017
$$ 247895 100962 -241746 -14348 -300016 -171487 129402 -196106 -90216 209174 109157
19000A09157b12547Q5573E1915Q8663f41r9996j44887B17829h4838A57713a16206
$$ 109157 -212547 -126974 51915 140578 -641 -100637 -245524 217829 -84838 157713 -116206
18988c48515F8247b37063J13814j76274A06815k7342a12752I9496a47966J6338
$$ -348515 68247 -237063 -123249 -299523 106815 79473 -112752 99496 -147966 -131628
18978a31628G2332B998J42170a89505A2573J74001c27966c7992H3177h6073A44139
$$ -131628 72332 2998 145168 -189505 12573 186574 -327966 -37992 83177 -86073 144139
18966A53602g0081k0753A47534d2454D1864K40218a42368j58965J23211A91517
$$ 153602 -70081 -90834 147534 -42454 41864 282082 -142368 -301333 -178122 191517
18955E7616Q6193a48267C29627j53430m0960a02152k1359M9297p8405L0191C24345
$$ 57616 143809 -148267 329627 176197 135237 -102152 -123511 -74214 -152619 -122428 324345
18943a01929M8483A13363h8599n6504N3617A26236b2438r2218m7033I4630d24258
$$ -101929 -53446 113363 -88599 -145103 -91486 126236 -22438 -114656 -161689 94630 -424258
18931f7539D01784b3626C48280E1552L8817a72270e9707A19871n1862a70593A57072
$$ -67539 401784 -23626 348280 51552 90369 -172270 -59707 119871 68009 -170593 157072
18919a4345J369j19952O0949j21800k23147e9702C6314N3816b53740B11012a86436
$$ -14345 -12976 -132928 -71979 -193779 -416926 -59702 36314 90130 -253740 211012 -186436
18907A1033N7966O0658b01796A22571J20930b29389k4453a00321c7828A25447
$$ 11033 68999 129657 -201796 122571 243501 -229389 -253842 -100321 -37828 125447
18896a48558A33291C1036M0898a00166A2121L8274A1854J77807a62414f7319b5115
$$ -148558 133291 31036 71934 -100166 12121 50395 11854 189661 -162414 -67319 -25115
18884a61326k79099J40763b473j11114k79667J61599m479a05727a2033l70460
$$ -161326 -440425 -299662 -2473 -113587 -393254 -231655 -236134 -105727 -12033 -382493
18874c82493D4706g3160j05811O1985d4213B20155p1449a3684A89796H9779d20745
$$ -382493 44706 -73160 -178971 -116986 -44213 220155 148706 -13684 189796 89779 -420745
18862C9959f6627l87l19295F9351b79804J33706l9965h8767A43966d3588n4709
$$ 39959 -66627 -67014 -386309 69351 -279804 -146098 -186063 -88767 143966 -43588 -98297
18851i8297m5292A09817a20710o2571D0499a76633A81345e9201J4044B5337c0800
$$ -98297 -143589 109817 -120710 -183281 40499 -176633 181345 -59201 -45157 25337 -30800
18839b14788A43506a25576j06946E3563c8031F3258d91610f2643o394j83212E4049
$$ -214788 143506 -125576 -232522 53563 -38031 63258 -491610 -62643 -69037 -252249 54049
18827b5641A40884F7887k5752L814b2078k26970J11206A01423O6985b52600d9159
$$ -25641 140884 67887 42135 45949 -22078 -249048 -137842 101423 168408 -252600 -49159
18815E42729A63046J97774p8002L59908b5853k65867F3498J38092R3696A13418
$$ 542729 163046 360820 282818 642726 -25853 -291720 63498 201590 295286 113418
18804b47238B42701C7059b26470A14995h2259r1920D151N8886h9426A15128a78883
$$ -247238 242701 37059 -226470 114995 -82259 -174179 4151 63037 -89426 115128 -178883
18792g3832Q668D8926b42804L8107J7519L3783L6471n677E0233a49798j96833
$$ -73832 -65164 48926 -242804 -204697 -187178 -153395 -116924 -122601 50233 -149798 -346631
18781c46631C7495J32645m6194a23235k1356j30128A89667a13573A54848E4621
$$ -346631 37495 170140 123946 -123235 -144591 -274719 189667 -113573 154848 54621
18770a16007p9098D0623J81721E4497B1016L4882c7082k20057B815i0988k42484
$$ -116007 -195105 40623 222344 54497 21016 55898 -37082 -257139 2815 -90988 -333472
18759c33472f3326j4989A97371b20069O5864p6240O8136d8085I1784g2454K0580
$$ -333472 -63326 -78315 197371 -220069 -154205 -230445 -162309 -48085 91784 -72454 -51874
18748e1874B7985c70257g6116j37886M1849A09328O0398b54678F8955J26473b99003
$$ -51874 27985 -370257 -76116 -214002 -172153 109328 169726 -254678 68955 195428 -299003
18736B70763D0377P9338c39351L9160L9104R034A44031B3765a41706P0024A55149
$$ 270763 40377 119715 -339351 -300191 -261087 -252053 144031 23765 -141706 -71682 155149
18724A25459M0334a42762D070c2106n1085I0331b25379j55881E4125A5130K69274
$$ 125459 165793 -142762 4070 -32106 -83191 90331 -225379 -381260 54125 15130 284404
18713B84404a34843k4816O6634o0919K3789m2304g8705A43191a08886b2153q192
$$ 284404 -134843 -159659 -93025 -153944 -130155 -172459 -78705 143191 -108886 -22153 -30345
18702c0345A9558b15090q1754P8947k21367J61266R9198r4847A32481o1997e969
$$ -30345 19558 -215090 -296844 -217897 -439264 -277998 -178800 -273647 132481 70484 -5969
18690b22994j61482a12902K0378A29234c02890j2776A58091f9225j9097B7640
$$ -222994 -384476 -112902 -92524 129234 -302890 -315666 158091 -69225 -88322 27640
18679b96504a35879o4794e1201j07196e0783G5435D112O1100N852L06471C6475
$$ -296504 -135879 -200673 -51201 -158397 -50783 75435 4112 65212 71064 377535 36475
18667a07409p3678g2738m5760H3938b31483I0130J47629r9482C1929b430m2008
$$ -107409 -181087 -72738 -118498 83938 -231483 90130 237759 138277 31929 -2430 -44438
18656d4438j36201j03601a36346g948k28562i3258B44633k1647a21047D719a49836
$$ -44438 -180639 -284240 -136346 -7948 -236510 -93258 244633 222986 -121047 4719 -149836
18644h5621A56459n3684g508k4378k29720a06440l0436o9787a5930l18705h9349
$$ -85621 156459 102775 -7508 -31886 -261606 -106440 -136876 -206663 -15930 -334635 -89349
18632c08935c1006B17024J94969i4158M296k35726D8950j2783b4815k84060a05447
$$ -308935 -31006 217024 411993 -94158 -89862 -325588 48950 36167 -24815 -308875 -105447
18620c79374E9988a25854N2915B6015e4234m7332M7549k05009o8285A53355c0895
$$ -379374 59988 -125854 -72939 26015 -54234 -101566 -54017 -259026 -327311 153355 -30895
18608A11223a16827n6053B17435a82870Q202N2281A69363d3752A09262K89851
$$ 111223 -116827 -172880 217435 -182870 -174668 -122387 169363 -43752 109262 399113
18598C99113a73405j67503J65497H2310a40620e5846l24005c5071B59466j04226
$$ 399113 -173405 -340908 -175411 82310 -140620 -55846 -379851 -35071 259466 155240
18588A55240b93228J37615A53163J19907b48788M6597k39090A13742d4052j99257
$$ 155240 -293228 -155613 153163 273070 -248788 -202191 -441281 113742 -44052 -243309
18578b43309B68872a0276j9163j75713o7188P2321A21167a07419C198a24221K4862
$$ -243309 268872 -10276 -29439 -205152 -272340 -200019 121167 -107419 3198 -124221 -99359
18567i9359K3391M619n8530r808r8893A48746J17165b10608A10012b24340l306
$$ -99359 -75968 -71349 -129879 -139687 -238580 148746 265911 -210608 110012 -224340 -227646
18556b27646A26311C6204j049j5931c57333C3210d5818E6184g1199k63285A04132
$$ -227646 126311 36204 35155 19224 -357333 33210 -45818 56184 -71199 -334484 104132
18544D542J59330b83007A17369b84435D1954J70505e7993o4192M7715p7675n3051
$$ 4542 163872 -283007 117369 -284435 41954 212459 -57993 -122185 -74470 -152145 -205196
18533b05196d9351j23585a342l22002E191K52057a06041J6936H3837a75540a7873
$$ -205196 -49351 -172936 -1342 -323344 5191 257248 -106041 -89105 83837 -175540 -17873
18521A741N0191O3176b61135A09124j3107a41936j41256e6750j71902A79900a09318
$$ 1741 51932 115108 -261135 109124 96017 -141936 -283192 -56750 -228652 179900 -109318
18509b38465N4809d7844h066B43270c7143j24079H8433h0932G2568b64314M3780
$$ -238465 -183656 -47844 -8066 243270 -37143 -161222 88433 -80932 72568 -264314 -220534
18498b20534p1023B90637I4841M2427a34762A46723P1381c90365b4714k41903
$$ -220534 -291557 290637 94841 137268 -134762 146723 218104 -390365 -24714 -266617
18488b66617B04112m9265n1172L9250L1345c45863I4176M6458G399K000e03997
$$ -266617 204112 154847 103675 142925 174270 -345863 94176 140634 7399 9399 -503997
18476a49795l9059D1680c7210a0092K532A2150b0131i410k9175k02803J17582
$$ -149795 -188854 41680 -37210 -10092 -7560 12150 -20131 -9410 -38585 -241388 -123806
18465a23806q5663A09522a4998B40576H8735c81241a13550K9745G2716a4708A55060
$$ -123806 -209469 109522 -14998 240576 88735 -381241 -113550 -83805 72716 -14708 155060
18453d80267c4032j85860J8226E8737L3379J8064O546a2053l592A61861A7742
$$ -480267 -34032 -219892 -201666 58737 92116 110180 116726 -12053 -15645 161861 17742
18441d1911D2052c5483k1011A5260b5244H3915O6357b07955B63759A07964l2319
$$ -41911 42052 -35483 -56494 15260 -25244 83915 150272 -207955 263759 107964 75645
18430G5645k4749a31647m2972b3404A12401b110k23188k14628g6272r2810l9791
$$ 75645 50896 -131647 -174619 -23404 112401 -2110 -225298 -439926 -76272 -169082 -208873
18419b08873d2637B19613o8095b92891F4599a16687A31883g2643a1920p6010j06421
$$ -208873 -42637 219613 151518 -292891 64599 -116687 131883 -72643 -11920 -87930 -194351
18408a94351P9190A88106a84548k04568J24193J6432C24343a61417A79115d28276
$$ -194351 -115161 188106 -184548 -389116 -264923 -248491 324343 -161417 179115 -428276
18397B22397m4222E1253g9603B07057G2868a47641j28141B09211r8893R0255b24730
$$ 222397 178175 51253 -79603 207057 72868 -147641 -275782 209211 110318 200573 -224730
18385b05813m7811d4030A88398f2812Q988j35042B2083g4296F0232a85778Q5545
$$ -205813 -253624 -44030 188398 -62812 -53824 -188866 22083 -74296 60232 -185778 -100233
18374a00233B6126a96475C25783B6343J39842d19219h983j43520A0825b34659
$$ -100233 26126 -196475 325783 26343 166185 -419219 -8983 -152503 10825 -234659
18363F4407r232L7914a7328A04131a65777m9144A62930C2432a4218r7248B30773
$$ 64407 55175 93089 -17328 104131 -165777 -214921 162930 32432 -14218 -111466 230773
18351A52108K05144A48436c51194a6394j41205j03613C87127b8498p5887B33013
$$ 152108 357252 148436 -351194 -16394 -157599 -261212 387127 -28498 -104385 233013
18340a58395C40518b96680A64054h8964j15052B03353E5763b39697b2673p6638
$$ -158395 340518 -296680 164054 -88964 -204016 203353 55763 -239697 -22673 -99311
18330i9311n7439I4150c38545J08905B04040d226B84561q9520c75038a16018H9289
$$ -99311 -156750 94150 -338545 -229640 204040 -4226 284561 195041 -375038 -116018 89289
18318D64177b27899K505i395l39776R7396h4770a2922E4268m735a60381P6752
$$ 464177 -227899 -225394 -9395 -349171 -251775 -84770 -12922 54268 49533 -160381 -83629
18307h3629i485l59667a81811B41973c17223J4409A0461b03703B38988e1151j23654
$$ -83629 -9485 -369152 -181811 241973 -317223 -302814 10461 -203703 238988 -51151 -174805
18296a74805M9381A1115b24142j08043a09267j43169A0859N9096b2658B28474
$$ -174805 -125424 11115 -224142 -332185 -109267 -252436 10859 69955 -22658 228474
18285B34113b29491a02463J145j12788E5287a16005r4426h340k83711c854C7003
$$ 234113 -229491 -102463 -101318 -214106 55287 -116005 -210431 -8340 -292051 -3854 37003
18273A69369a72095J8806j56745f326r3507D2723b9305o6991F9987d1503l4314
$$ 169369 -172095 -153289 -310034 -6326 -99833 42723 -29305 -96296 69987 -41503 -75817
18262g5817K6659F5821c70400D967M8343a32747B65800E615c2552a3343j3816
$$ -75817 -49158 65821 -370400 4967 53310 -132747 265800 5615 -32552 -13343 -27159
18251b7159D82766c1621l2731j68644e9583A86389b163C40336A53199b34836O1285
$$ -27159 482766 -31621 -64352 -232996 -59583 186389 -2163 340336 153199 -234836 -173551
18240a73551f3102j5244C4452a22161F9706L7090E606Q8456a76048j52788a02533
$$ -173551 -63102 -78346 34452 -122161 69706 106796 5606 94062 -176048 -328836 -102533
18228E457f3526l9342C9410b87742h8772I9070B6028b9562r6254e1607B44879
$$ 5457 -63526 -102868 39410 -287742 -88772 99070 26028 -29562 -125816 -51607 244879
18216b7872j51682I0148M49977B58841n4771c1065o6473C7181J31066b69613b0199
$$ -27872 -179554 90148 540125 258841 204070 -31065 -97538 37181 168247 -269613 -20199
18204a92379R2995B7393J52005a17871a0801j17789J3592N765A16620B7272L03777
$$ -192379 -99384 27393 179398 -117871 -10801 -128590 -114998 -109233 116620 27272 331049
18193C31049b38846m2051b3777o0271G0177a70830A25865b68859a7712A18349
$$ 331049 -238846 -280897 -23777 -84048 70177 -170830 125865 -268859 -17712 118349
18182b00404A87195a38884R326J5045q8340A47056a12529K8938A63046n9627c9668
$$ -200404 187195 -138884 -129558 -114513 -202853 147056 -112529 -83591 163046 103419 -39668
18170h112E8108J38070F1069O8940a57372A45155d227n16397c1431l56432B4088
$$ -8112 58108 196178 61069 130009 -157372 145155 -4227 -520624 -31431 -387863 24088
18158D5615a93997C19603b5902j49329A56184n2881b78909c0419A46861A8410
$$ 45615 -193997 319603 -25902 -175231 156184 103303 -278909 -30419 146861 18410
18147a06148A6842a27136p4704R2860B61638H9016b74330N5230A25429a44266
$$ -106148 16842 -127136 -201840 -108980 261638 89016 -274330 -219100 125429 -144266
18136b17202H2360L1744e9446B44520d363j503G0830d9933j12045E3796b65576
$$ -217202 82360 114104 -59446 244520 -4363 -5866 70830 -49933 -161978 53796 -265576
18124b0391k30896c6561E15676b15628H6840a31792M8544A92773a1873b177A08286
$$ -20391 -251287 -36561 515676 -215628 86840 -131792 -83248 192773 -11873 -2177 108286
18112d4268D1815N125J3597J0727J54508a02124p020k85633d5462j46215Q0786
$$ -44268 41815 46940 60537 71264 225772 -102124 -109144 -394777 -45462 -191677 -110891
18101a10891M567l1377n1279B16538n5201c827j86354A59990a67813A20679b73556
$$ -110891 -106324 -137701 -188980 216538 161337 -3827 -190181 159990 -167813 120679 -273556
18089A52191i198A87690f0894K866F8834b3293l13419A8731L2432J09417a51669
$$ 152191 -9198 187690 -60894 -58028 68834 -23293 -336712 18731 51163 160580 -151669
18077E3347a49733B46030d06202D0670a4108o6345c4294I9245b9212B60708d26759
$$ 53347 -149733 246030 -406202 40670 -14108 -80453 -34294 99245 -29212 260708 -426759
18065A26795c0748j24492b6541f408n6115l7803j94271J3570N2283k00800A66815
$$ 126795 -30748 -155240 -26541 -6408 -62523 -100326 -294597 -281027 -228744 -429544 166815
18053a37094o4737B9196b04845m0925A08107J2186d1609p4548A91828a3874j37328
$$ -137094 -201831 29196 -204845 -245770 108107 120293 -41609 -116157 191828 -13874 -151202
18042a51202G9277f0851E5418c7292j58893O4465c2689A75279e6892k9903p5778
$$ -151202 79277 -60851 55418 -37292 -196185 -131720 -32689 175279 -56892 -86795 -162573
18031a62573A42004c01222A977J76344c1699j63854P8588A56011a01539l30521
$$ -162573 142004 -301222 1977 178321 -31699 -195553 -116965 156011 -101539 -432060
18021d32060i4739o1666j356C1456b50930c8539C50787A74251A2933L4148g10
$$ -432060 -94739 -156405 -157761 31456 -250930 -38539 350787 174251 12933 47081 -710
18009f1315N381I3027a72684A27839J5433a02345K7722J2630K4913G5331B7708
$$ -61315 -55934 93027 -172684 127839 143272 -102345 -74623 -61993 -37080 75331 27708
17997A72878i4270F7926J25244c9820F1974d0124n9445L067H7103J53633e612
$$ 172878 -94270 67926 193170 -39820 61974 -40124 -99569 -96502 87103 240736 -5612
17985D0219f3224A285N7202a36990D69359D6421g4377A65630p7623K49093a01339
$$ 40219 -63224 1285 58487 -136990 469359 46421 -74377 165630 88007 337100 -101339
17973c19048l57744G9670C1158K3388M7993a5196j88178n7309L9877j1305A3976
$$ -319048 -676792 79670 31158 54546 102539 -15196 -203374 -260683 -220806 -232111 13976
17961b98472a46928a2583A01132N4315o6561h1254C1053L83098A8847b02545A4470
$$ -298472 -146928 -12583 101132 155447 88886 -81254 31053 414151 18847 -202545 14470
17949g1805A96526a02677A25665L10692e5973l1219j62359R3706p1666i2953K9140
$$ -71805 196526 -102677 125665 436357 -55973 -87192 -249551 -155845 -227511 -92953 -63813
17938f3813K9502B76650c065n5302H1792M959c20853I9715h5225c5129A75636
$$ -63813 -34311 276650 -3065 -58367 81792 86751 -320853 99715 -85225 -35129 175636
17926b53963c1871j13298f5088A00741c6204f412n8378B7063A1254b28830b8500
$$ -253963 -31871 -145169 -65088 100741 -36204 -6412 -64790 27063 11254 -228830 -28500
17914d6797j19317A81649A2719a9865j02750k17390h7038B17819J136h4044C09909
$$ -46797 -166114 181649 12719 -19865 -122615 -340005 -87038 217819 218955 -84044 309909
17902g722m7122P994D5956a39539A8274i0218B19602a28171l67307A33331F896
$$ -7722 -54844 -46850 45956 -139539 18274 -90218 219602 -128171 -495478 133331 6896
17890C667i7652a6193A18452b71399a30389L6225A41532D0641A3352J89416b32885
$$ 3667 -97652 -16193 118452 -271399 -130389 -94164 141532 40641 13352 202768 -232885
17878A56907L3706b346A12760c29440i8785C788K3552a21600H0027i3423H7068
$$ 156907 190613 -2346 112760 -329440 -98785 3788 27340 -121600 80027 -93423 87068
17866a8405D9732b4069H950e5351C07686b25167I7227D4848N7213c38886J66077
$$ -18405 49732 -24069 8950 -55351 307686 -225167 97227 44848 102061 -338886 -172809
17855a72809d7971n2602n1891C2633M7537j1432b11350L8799A54144a27985A70031
$$ -172809 -47971 -100573 -152464 32633 80170 68738 -211350 -172551 154144 -127985 170031
17843A47960b04074E5357i9911M5065G6135K36726b35716h0407n1360d9431a0054
$$ 147960 -204074 55357 -99911 -54846 76135 312861 -235716 -80407 -131767 -49431 -10054
17831c4820A4065K1902c27591e2852j33995G8996i1159j24039a04186m8083B5934
$$ -34820 14065 35967 -327591 -52852 -186847 78996 -91159 -215198 -104186 -152269 25934
17819G8350P6997l9725M0562b33729a04050A20836a47633B38058J18483a01070
$$ 78350 155347 115622 156184 -233729 -104050 120836 -147633 238058 356541 -101070
17808A08128a99709B94388a47645A0548a62618A81095B6219a46774a1642k0643
$$ 108128 -199709 294388 -147645 10548 -162618 181095 26219 -146774 -11642 -32285
17798c2285n1705B36636B3063a3364k396I2490d9353m5090c0377B45394a80281
$$ -32285 -83990 236636 23063 -13364 -15760 92490 -49353 -94443 -30377 245394 -180281
17786F9671a57853J3855A98520e3426E9897b28290L9212B151c5387r4979I0277
$$ 69671 -157853 -143998 198520 -53426 59897 -228290 -189078 2151 -35387 -130366 90277
17774b18958B5872b79735O7060d9611j06092B44212b30626i3243B3902R5454M6053
$$ -218958 25872 -279735 -212675 -49611 -155703 244212 -230626 -93243 23902 119356 165409
17763A65409b72242j09069A23304B424a9809j11702a1214A35736e1749I495N7388
$$ 165409 -272242 -381311 123304 2424 -19809 -131511 -11214 135736 -51749 9495 66883
17752F6883J10909c9889A20985a02850A03586a93229F3593e2724D53910a16916
$$ 66883 177792 -39889 120985 -102850 103586 -193229 63593 -52724 453910 -116916
17741A70295L4262b25864A58167K2866f3478C17086g6753j84405A58847a14798
$$ 170295 204557 -225864 158167 181033 -63478 317086 -76753 -261158 158847 -114798
17730b54971B68730a34919n7091D3357A4848h6744k423r7416B88715B1748K16306
$$ -254971 268730 -134919 -192010 43357 14848 -86744 -89167 -186583 288715 21748 238054
17719B38054n6013L2116C1066f6994a255l1034B37021g8546B31448a03530A03500
$$ 238054 182041 214157 31066 -66994 -1255 -32289 237021 -78546 231448 -103530 103500
17707C15371B2507a85031d8399o1616B52176P827a10299d2688B67082a05701l7093
$$ 315371 22507 -185031 -48399 -110015 252176 260003 -110299 -42688 267082 -105701 -142794
17696a42794k95394b0727k93041C50724I7101M381J13004b73433R024b5705j9127
$$ -142794 -438188 -20727 -313768 350724 97101 101482 214486 -273433 -264409 -25705 -44832
17685d4832A30520c2741d067I3699m97L37368a80164A32303d2629a6257E9191
$$ -44832 130520 -32741 -4067 93699 93202 430570 -180164 132303 -42629 -16257 59191
17673F7364B6584h7292A6310d3441J9124A96704a34071m840k10868a24082I187
$$ 67364 26584 -87292 16310 -43441 -24317 196704 -134071 -138911 -349779 -124082 9187
17661C1666a97362A13205Q5502b45760J9620a3630A05446J54867b05409C26551
$$ 31666 -197362 113205 198707 -245760 -226140 -13630 105446 260313 -205409 326551
17650c59392J04846d2712B46917e07129A4875K10327a20354E6321J15550a27541
$$ -359392 -254546 -42712 246917 -507129 14875 225202 -120354 56321 171871 -127541
17639a06305M8851j16555A40259g4870M907j24088B51140a0062k38287D9520J1290
$$ -106305 -57454 -174009 140259 -74870 -69963 -194051 251140 -10062 -248349 49520 60810
17628F0810J1076b71496G6476a65821F8809A7034K03994a13359B04475F5283b0867
$$ 60810 71886 -271496 76476 -165821 68809 17034 221028 -113359 204475 65283 -20867
17616b67875G2982C1590b4411C56712D1149J71703a49567D10048b75005A38082
$$ -267875 72982 31590 -24411 356712 41149 212852 -149567 410048 -275005 138082
17605A53202J08389C9760A8739b43880J3581C04872a01530D343L57093a20056
$$ 153202 261591 39760 18739 -243880 -230299 304872 -101530 4343 361436 -120056
17594a93526h9294A97629q2126a68643E3427P179P8988b82871J17601M9490J3128
$$ -193526 -89294 197629 115503 -168643 53427 60606 139594 -282871 -165270 -115780 -102652
17583a02652A40102A6335a29241b326A05917F655K27787h6913G3867h6720B46087
$$ -102652 140102 16335 -129241 -2326 105917 6655 234442 -86913 73867 -86720 246087
17571A83455b6847l39955B28639e1856E3482g5291c584C6929J28989f2126B89137
$$ 183455 -26847 -366802 228639 -51856 53482 -75291 -3584 36929 165918 -62126 289137
17559B05530d2246J435D0966a17966B16070i1516k1522K7160A70058O9735H6541
$$ 205530 -42246 -40811 40966 -117966 216070 -91516 -113038 -85878 170058 239793 86541
17547I6535P5347p0457J15124h1493B72571E0522L6800d224n7171j90113N1492
$$ 96535 171882 101425 216549 -81493 272571 50522 87322 -4224 -61395 -251508 -200016
17536b00016B08630j03942D9487K52971j42876J06596A02123C7184a69343H3656
$$ -200016 208630 104688 49487 302458 159582 266178 102123 37184 -169343 83656
17525C1980R0744D6129R6660J98103b01465i7959L5163I3232B1280a61002C7696
$$ 31980 122724 46129 142789 340892 -201465 -97959 -62796 93232 21280 -161002 37696
17513E84266b92313B5638J03491P4531O204I090C544P832e173q9666C8550L17925
$$ 584266 -292313 25638 129129 203660 209864 9090 3544 11376 -5173 -94839 38550 356475
17501C56475A65701a03314A96061o553a3963B55249A11307m1986N8714R1020j3170
$$ 356475 165701 -103314 196061 189508 -13963 255249 111307 69321 128035 219055 205885
17490B05885K7860j1207r9816N1440D3402L3885a39586N7639A87591L5248p3975
$$ 205885 233745 222538 122722 174162 43402 77287 -139586 -81947 187591 222839 148864
17479A48864K27938j53757l5576c0308q6747H6564J40737l7726K49832B16352
$$ 148864 376802 223045 187469 -30308 -117055 86564 227301 189575 439407 216352
17468C5785L22994j10281q2330b19597J07281k16482G4906L09222I9387K40522
$$ 35785 358779 248498 166168 -219597 -112316 -328798 74906 384128 99387 339909
17458C39909L0712R2955j82686j22390A2173L36222A57634k3151A8929K15477
$$ 339909 370621 463576 280890 158500 12173 348395 157634 134483 18929 234406
17448B34406m8387O8634l3762k6886K72550A78758O2795L5346q408N0721l9963
$$ 234406 186019 254653 220891 194005 466555 178758 241553 276899 268491 319212 279249
17437B79249J98703m0962j66827A13655A5272J71001J43514j25944c4354C40605
$$ 279249 477952 436990 270163 113655 15272 186273 329787 203843 -34354 340605
17426C25794F8557Q2227l3978K95123k2631J93499B53532M6534i5920k0796D2981
$$ 325794 68557 150784 116806 411929 389298 582797 253532 300066 -95920 -116716 42981
17414B56486Q7712K34058k76826H2821a28564D43799q3043l1221j43328O6627
$$ 256486 344198 578256 301430 82821 -128564 443799 360756 329535 186207 252834
17404B52834b27497B05674H6021I754O4761l2395K86945o5305q5632p8514K66427
$$ 252834 -227497 205674 86021 9754 74515 42120 329065 263760 178128 99614 366041
17393C66041A13347a29014C43872n8370A19638R6917E7462K30112e1785q314I1413
$$ 366041 113347 -129014 343872 285502 119638 216555 57462 287574 -51785 -60099 91413
17381I339K17507f0604A42181J1805A5478K96133n3972a07560k3227A30955m3688
$$ 9339 226846 -60604 142181 153986 15478 311611 257639 -107560 -130787 130955 87267
17370H7267J35478B8208d0070F3146K27175I7015m4692J1850a51948f2018B69565
$$ 87267 222745 28208 -40070 63146 290321 97015 52323 64173 -151948 -62018 269565
17358C1240a42528A10006M5345J34398J20244j22305j20968f6759b0172B0012
$$ 31240 -142528 110006 155351 289749 409993 287688 166720 -66759 -20172 20012
17347I1553J50695F0336k290a9732A44011P8479b3970H4509K46172R1871A75476
$$ 91553 242248 60336 58046 -19732 144011 222490 -23970 84509 330681 422552 175476
17335C27731d8337A25828k6300J19658J90196k00657l6121N1814m8365K0987J24826
$$ 327731 -48337 125828 99528 219186 409382 208725 172604 224418 176053 197040 321866
17324C21866f188B81596I2415L8601L4909G6839M5863P6787l4469k3469P817J92028
$$ 321866 -6188 281596 92415 131016 165925 76839 122702 199489 165020 141551 149368 341396
17312C41396j06670b3276m8768j5351I3995N3399k7853K28370n6852j06926D1820
$$ 341396 234726 -23276 -72044 -87395 93995 147394 119541 347911 291059 184133 41820
17300B15021m1129L3982J16978a03876D5329J38583p890o1388Q1353J46539A66472
$$ 215021 173892 207874 324852 -103876 45329 183912 176022 114634 195987 342526 166472
17288b9739A70696q4765L1780J80697j43599K73798A23330K22440j71989N2795
$$ -29739 170696 85931 117711 298408 154809 428607 123330 345770 173781 226576
17278B26576q1432M11384i4528G7135N3760l6136l4002Q4742n0323j2541J55034
$$ 226576 145144 556528 -94528 77135 130895 94759 60757 145499 95176 82635 237669
17267B37669L0767A33575a29235H0707f6032C8227b0277B75111N4389j13550M62956
$$ 237669 268436 133575 -129235 80707 -66032 38227 -20277 275111 329500 215950 678906
17256F78906B31854M4997P1079A04574i0377H2360L95222q1501A43159K9029N3294
$$ 678906 231854 276851 347930 104574 -90377 82360 477582 396081 143159 172188 225482
17245B25482j06891k4148c1483A2515K406K18914C7512L03711A1570i4497B97223
$$ 225482 118591 94443 -31483 12515 14921 233835 37512 341223 11570 -94497 297223
17233E54380c2183C58756A08772Q4594a11277D05027j38770I9947J08335F744
$$ 554380 -32183 358756 108772 193366 -111277 405027 266257 99947 208282 6744
17222D70477j53570j39105N7925Q3603m2644j08860p3933K11517Q46j15759e7094
$$ 470477 316907 177802 235727 319330 276686 167826 93893 305410 306256 190497 -57094
17210B13226K01467B00511R161K23175o4108q536Q7680b30290A81032K77360B00647
$$ 213226 414693 200511 209672 432847 368739 360203 447883 -230290 181032 458392 200647
17198B00432q4811K84997J5866f1277B97986b0298A90487q8130J20526J26496
$$ 200432 115621 400618 416484 -61277 297986 -20298 190487 102357 222883 349379
17188C49379k1304c996A04914b11287C37389j55044K09539J09529k35183K80803
$$ 349379 328075 -3996 104914 -211287 337389 182345 391884 501413 266230 547033
17178E47033A59938J19138L5215A26932e399B99436l7424j6492O7893J60144A56561
$$ 547033 159938 279076 314291 126932 -5399 299436 262012 245520 313413 473557 156561
17166D39060A72844K14779A64538H1782O0300K30566j50705H6839J43421J79978
$$ 439060 172844 387623 164538 81782 142082 372648 221943 86839 230260 410238
17156D10238j70179r09p3438K45165j24394J54116j50109j36965L19893k32961
$$ 410238 240059 239150 165712 410877 286483 440599 290490 153525 473418 240457
17146B40457J98016j40741J81131m4313q5538A55000K52709J59085j53447j52599
$$ 240457 438473 297732 478863 434550 349012 155000 407709 566794 413347 260748
17136B60748L08495b8119D45997j55653k8123K18358j66582P970R2602A19794
$$ 260748 569243 -28119 445997 290344 262221 480579 313997 321967 414569 119794
17125D3272M66029n0896L598N70J99770j60805k30397O3128K14564j10890j95237
$$ 43272 509301 458405 462003 462573 662343 501538 271141 334269 548833 437943 242706
17114B42706K07356J92193k20258A30189K12528j19342K99298p2667J06997J05999
$$ 242706 450062 642255 421997 130189 342717 223375 522673 450006 557003 663002
17104F63002k45091P6722J376j08949n724m9847J19366j03167q6691L45858j11301
$$ 663002 417911 494633 496009 387060 381336 331489 450855 347688 260997 606855 495554
17093D95554P1504q4402q1028R0678B41219L5033J99395N847J00316J39205C46469
$$ 495554 567058 482656 401628 492306 241219 276252 475647 481494 581810 721015 346469
17081E61296J44049C39701K67111k67961K28197j05882j31529R1053K72287j97231
$$ 561296 705345 339701 606812 338851 567048 461166 329637 420690 692977 495746
17071D95746j3476k5976Q309l366M37675E1208N36961o9740R2711k00935K06524
$$ 495746 482270 456294 464603 461237 898912 51208 588169 518429 611140 410205 616729
17060F16729R2318j71848k08510l6808K73458j30070L03889k81827L06088j28528
$$ 616729 709047 537199 328689 291881 565339 435269 739158 457331 763419 634891
17050F34891j30775M9832M8251r9820N43354B98101O46936m52366n5150J30976
$$ 634891 504116 553948 602199 502379 1045733 298101 945037 492671 437521 568497
17040E68497j91660L20931K36652k28125j65768J29779l22861L79983l5220j06028
$$ 568497 376837 697768 934420 706295 540527 670306 347445 727428 692208 586180
17030E86180J90163n0627L33941m63698J69012m6499j27178J36161l7496L61249
$$ 586180 776343 725716 1059657 595959 764971 718472 591294 727455 689959 1051208
17020A051208m58361M03234k98817k7524K32561k02303K04561J5568p4737P9475
$$ 1051208 592847 996081 697264 669740 902301 699998 904559 920127 845390 924865
17010I24865k53475K40776k03934J8541n5589J45889J61443J11274l99534L48257
$$ 924865 671390 912166 708232 726773 671184 817073 978516 1089790 690256 1038513
17000A038513k23571J5739l31162K73014L39508l82940q9105K74027K37092l02889
$$ 1038513 814942 830681 499519 772533 1112041 729101 639996 914023 1151115 848226
16990H48226j36368L81219j71264L377L13372m56167L4072N24359k30564j36426
$$ 848226 711858 1093077 921813 925190 1238562 782395 816467 1340826 1110262 973836
16980I73836k00649Q3580q3189M60394m79565P6428Q0648K26738r5544j40423
$$ 973836 773187 856767 773578 1233972 754407 830835 911483 1138221 1042677 902254
16970I02254K45457l62908J56239K8344l054J57117j17690J24099j63674k781
$$ 902254 1147711 784803 941042 969386 966332 1123449 1005759 1129858 966184 963403
16960I63403P4247K59853J4669j84749j06696K67481l07246L05745j59641N984
$$ 963403 1037650 1297503 1312172 1127423 1020727 1288208 980962 1286707 1127066 1133050
16950A133050J33079j34271J4582P4766L65772j83073M4865j20537n9053K44552
$$ 1133050 1266129 1131858 1146440 1221206 1586978 1403905 1448770 1328233 1269180 1513732
16940A513732j87841l38450K29877P49645l61436l10855K78563l74348K62105
$$ 1513732 1325891 987441 1217318 1966963 1605527 1294672 1573235 1198887 1460992
16931A460992L19334l65916M3637L49199m9301k42866q989J53852K68185k49905
$$ 1460992 1780326 1414410 1458047 1807246 1757945 1515079 1506090 1659942 1928127 1678222
16921A678222j10779K45653m26076J75656J66123j66856M28283k07686J16370
$$ 1678222 1567443 1813096 1387020 1562676 1728799 1561943 1990226 1782540 1898910
16912A898910o9775l7435O3406J60925k24420N10429l46752K26141p5186M135
$$ 1898910 1829135 1791700 1855106 2016031 1791611 2302040 1955288 2181429 2106243 2110378
16902B110378j67803P1165l3188p8120L84164N750J56454j66054r1670J68273
$$ 2110378 1942575 2013740 1980552 1902432 2286596 2292346 2448800 2282746 2191076 2359349
16892B359349L5522l46957M40531J41990n9749k65881N296L40128j85944Q8366
$$ 2359349 2394871 2047914 2488445 2630435 2570686 2304805 2310101 2650229 2464285 2552651
16882B552651K73442J3975n0554r6676Q3736K60488j09103J05826k22986p1974
$$ 2552651 2826093 2840068 2789514 2692838 2776574 3037062 2927959 3033785 2810799 2738825
16872B738825L07114q0780K77751m90676Q20784m35005M1725K54289K0826J90499
$$ 2738825 3045939 2965159 3242910 2752234 3573018 3138013 3179738 3434027 3454853 3645352
16862C645352l49306M17734l36225L45207Q0619o6209J52517p343N6851J15810
$$ 3645352 3296046 3713780 3377555 3722762 3803381 3737172 3889689 3882346 3939197 4055007
16852D055007l07420M89245m6175l7325L87135k27397J09240J1004M31715m51207
$$ 4055007 3747587 4236832 4190657 4153332 4540467 4313070 4422310 4433314 4865029 4413822
16842D413822L90382j81816J31192l9751M07391j94059p7315O24751J07307l45332
$$ 4413822 4804204 4622388 4753580 4713829 5121220 4927161 4849846 5474597 5581904 5236572
16832E236572J29927J03712N34814j72559k34265M60108m5800Q2148l404O97956
$$ 5236572 5366499 5470211 6005025 5832466 5598201 6058309 6012509 6094657 6091253 6789209
16822F789209k24016J70003K37798N0464k54426N35344Q6483R6055J21078J44882
$$ 6789209 6565193 6735196 6972994 7023458 6769032 7304376 7390859 7486914 7607992 7752874
16812G752874J79769J32844L73470J17932L62098J53485j46818L89865K70128
$$ 7752874 7932643 8065487 8438957 8556889 8918987 9072472 8925654 9315519 9585647
16803I585647K2708P04032l68023L35693N47065K7848n9878P60031M05274P760
$$ 9585647 9608355 10312387 9944364 10280057 10827122 10854970 10795092 11555123 11960397 11968157
16793A1968157L46591J63557N12836J87532M72856L2071P00201L77665L06912
$$ 11968157 12314748 12478305 12991141 13178673 13651529 13683600 14383801 14761466 15068378
16784A5068378L60094O26596J73775P16228K27523O35533P43934N13419O67683
$$ 15068378 15428472 16055068 16228843 16945071 17172594 17808127 18552061 19065480 19733163
16775A9733163O45835M13108P21825N31114Q54943P18092P20864Q37809R89884
$$ 19733163 20378998 20792106 21513931 22045045 22899988 23618080 24338944 25176753 26166637
16766B6166637Q68102J044406R48218J107836J040588J170104R99775J493582
$$ 26166637 27034739 28079145 29027363 30135199 31175787 32345891 33345666 34839248
16758C4839248J249653J348947J777453J655475J030271K071769J775618K183749
$$ 34839248 36088901 37437848 39215301 40870776 41901047 43972816 45748434 47932183
16750D7932183J720096K415751K192331K746948K258659K865447K777230L289954
$$ 47932183 49652279 52068030 54260361 57007309 59265968 62131415 64908645 68198599
16742F8198599K738532L647619L269769L638061L902622L904266M212611M088010
$$ 68198599 70937131 74584750 77854519 81492580 85395202 89299468 93512079 97600089
16734I7600089M546975M414745M618230M482890M598075M660360M020876M527038
$$ 97600089 102147064 106561809 111180039 115662929 120261004 124921364 128942240 133469278
16726A33469278L615659L995133L104386K993197K077414J822928P22263M52752
$$ 133469278 137084937 141080070 144184456 147177653 149255067 151077995 151800258 152253010
16718A52253010l56195q71008j654772k516662k489714l398726l597968m091651
$$ 152253010 151896815 151025807 149371035 146854373 144364659 140965933 137367965 133276314
16710A33276314m393446m614340m680537m685006m989655m499007m792784m584596
$$ 133276314 128882868 124268528 119587991 114902985 109913330 105414323 100621539 96036943
16702I6036943m381358m220033m665493l362353l991270l756303l577995k845296
$$ 96036943 91655585 87435552 82770059 79407706 75416436 71660133 68082138 65236842
16694F5236842l357315k986035k746592k316478k675348j728929k582332k232133
$$ 65236842 61879527 58893492 56146900 53830422 51155074 49426145 46843813 44611680
16686D4611680j716719k038696j773302j472040j637853j337048j650424j222717
$$ 44611680 42894961 40856265 39082963 37610923 35973070 34636022 32985598 31762881
16678C1762881j299722j078325j121660j042352p14119j379213o52418p20534
$$ 31762881 30463159 29384834 28263174 27220822 26506703 25127490 24475072 23754538
16670B3754538r54221p71543o16725q72086n90849p63574o69963l53312q43284
$$ 23754538 22800317 22028774 21412049 20539963 19949114 19185540 18515577 18162265 17318981
16661A7318981n70642m50501m70146m06216l96349q82797M09544p92230l57683
$$ 17318981 16748339 16297838 15827692 15421476 15025127 14142330 14551874 13759644 13401961
16652A3401961m05585n54841L3252m48156n23797j95609j65628m17936j58106
$$ 13401961 12996376 12441535 12474787 12026631 11502834 11307225 11141597 10723661 10565555
16643A0565555J59199o85977k58910k02019q9237m53465J77050m85522m44790
$$ 10565555 10724754 10038777 9779867 9577848 9488611 9035146 9212196 8726674 8281884
16634H281884l6490R8474m22541j69662j1817l16494l54270J75456m38054M2106
$$ 8281884 8245394 8343868 7921327 7751665 7739848 7423354 7069084 7244540 6806486 6848592
16624F848592k36312o7390j6384k14677J88865o75937J83115l19431J31972J92318
$$ 6848592 6612280 6544890 6528506 6313829 6502694 5826757 6009872 5690441 5822413 6014731
16614F014731m05463K8634j23357L5179m97188l03617Q7242J95675k80926m1158
$$ 6014731 5609268 5637902 5514545 5549724 5052536 4748919 4836161 5031836 4750910 4709752
16604D709752j88493L41918l64952J68307k11641j92280o0384k76845M77332k76648
$$ 4709752 4521259 4863177 4498225 4666532 4454891 4262611 4202227 3925382 4402714 4126066
16594D126066n09999L76649k01981q6649l8104K02229k94740n7114j09132k64069
$$ 4126066 3616067 3992716 3790735 3704086 3665982 3868211 3573471 3516357 3407225 3143156
16584C143156L9213J7775J70093r7334k15068J30993l8032r4445j49806r4954
$$ 3143156 3182369 3200144 3370237 3272903 3057835 3188828 3150796 3056351 2906545 2811591
16574B811591J76284k67261K15622m06924L20787j67762K6640J12419o9123N9225
$$ 2811591 2987875 2720614 2936236 2529312 2850099 2682337 2708977 2821396 2752273 2811498
16564B811498n0589k30933J51846m73815R0929K64654j16617m00104K90765M8123
$$ 2811498 2760909 2529976 2681822 2208007 2298936 2563590 2446973 2046869 2337634 2385757
16554B385757j1622k15830J42420q4683k48283P6390O963n2597K6459j54211J10185
$$ 2385757 2374135 2158305 2300725 2216042 1967759 2044149 2051112 1998515 2024974 1870763 1980948
16543A980948l35731R8712O6055P2955J0993j95538j9566K40600J65390k47167
$$ 1980948 1645217 1743929 1809984 1882939 1893932 1698394 1678828 1919428 2084818 1837651
16533A837651l42077K07322K2912p3005L08989l63278j29695L43148P1057j86555
$$ 1837651 1495574 1702896 1725808 1652803 1961792 1598514 1468819 1811967 1883024 1696469
16523A696469n06073L82032n2479k00551L02544o0345j61550J8561n0143J42266
$$ 1696469 1190396 1572428 1519949 1319398 1621942 1561597 1400047 1418608 1368465 1510731
16513A510731o7098k93582N61821j73421l90467M2382J51336j79810P9372L2368
$$ 1510731 1443633 1150051 1711872 1538451 1147984 1190366 1341702 1161892 1241264 1273632
16503A273632j1047j14608K8806R2109j13455J09962j10359K40482l01956j26362
$$ 1273632 1262585 1147977 1176783 1268892 1155437 1265399 1155040 1395522 1093566 967204
16493I67204Q4633J59154k58671j62531K42314M0082K26003n46031N02908j68979
$$ 967204 1051837 1210991 952320 789789 1032103 1072185 1298188 752157 1255065 1086086
16483A086086m18653K01788K15044j37716P4087j34441K62694j50487L7080j17709
$$ 1086086 667433 869221 1084265 946549 1020636 886195 1148889 998402 1035482 917773
16473I17773N3557L29248m34099J2198P4619q7700l2391J61057D78449L25602
$$ 917773 971330 1300578 866479 878677 953296 865596 833205 994262 478449 804051
16463H04051m0884L27395l24736L93792j61992m32658L47425j61492j19508J64726
$$ 804051 763167 1090562 765826 1159618 997626 564968 912393 750901 631393 796119
16453G96119J12500k32586K57442j6387k94865M9620P3139N6180k07234K84939
$$ 796119 908619 676033 933475 917088 622223 671843 744982 801162 593928 878867
16443H78867J50964m05751j23947j41801M92735o0402j60160j5778O2J10650j58631
$$ 878867 1029831 624080 500133 358332 851067 790665 630505 614727 614789 725439 566808
16432E66808N09120l35325j5280J74944l55844k57865P53898m23401n692j45439
$$ 566808 1075928 740603 725323 900267 544423 286558 1040456 617055 611363 465924
16422D65924Q7356K75215k16658N1659P5005O8161C74885K66987K68027C12510
$$ 465924 553280 828495 611837 663496 738501 806662 374885 641872 909899 312510
16411E59217k35376L96981p1152p0651P4497J53974C30994K10602N2996J18016
$$ 559217 323841 720822 649670 579019 653516 807490 330994 541596 594592 712608
16401G12608j35468n6155M95244D93916K05097n3383l8259j9790L4261o7934m3356
$$ 712608 577140 520985 1016229 493916 699013 645630 607371 587581 621842 553908 510552
16390E10552J2400L89149C57101o9998M27572C56653o3542l6703L17334j97351
$$ 510552 522952 912101 357101 287103 714675 356653 293111 256408 573742 376391
16380C76391K32660o7103j90835O6236J61632J87074l65186K14886k3661J74014
$$ 376391 609051 541948 351113 417349 578981 766055 400869 615755 592094 766108
16370G66108r6251j92995M792j16464J40978P5783j69324F2012J92377P8065E5336
$$ 766108 669857 476862 481654 365190 506168 581951 412627 62012 254389 332454 55336
16358B54764J86935K54172k1214p6642Q510B70081M11127k68641J11611B02594
$$ 254764 441699 695871 674657 598015 606525 270081 681208 412567 524178 202594
16347D42064k17626L60548B01268J05896J53664A87896L97219l8089A97482O7516
$$ 442064 224438 584986 201268 307164 460828 187896 585115 547026 197482 264998
16337B64998J50238r2797p9043M25150A94548L30016H8403K23841j39528J11679
$$ 264998 415236 322439 243396 668546 194548 524564 88403 312244 172716 284395
16327B84395J0840K71852j96075K6484j11337m5985I8482M8237K53003j25009
$$ 284395 295235 567087 371012 397496 286159 240174 98482 146719 399722 274713
16317B74713p699n2217Q4008p3899M09046B74397K99134o9059B17065F1327c5073
$$ 274713 267014 214797 298805 224906 633952 274397 573531 504472 217065 61327 -35073
16305D7485K4446J89048E915K52358K87133A25898J43998a7530B93850J37471
$$ 47485 71931 260979 5915 258273 545406 125898 269896 -17530 293850 431321
16295D31321A36767K49142P2904B15280J04744A51652K57707j42039j21837b1199
$$ 431321 136767 385909 458813 215280 320024 151652 409359 267320 145483 -21199
16284B16878k4188L01176B35521J25111q4881M0739J62133k28979F3437H777N352
$$ 216878 192690 493866 235521 360632 275751 316490 478623 249644 63437 8777 14129
16273A4129M02879A79564R8324A00341n867J26482b8712B55531j14353k8641J37879
$$ 14129 417008 179564 277888 100341 94474 220956 -28712 255531 141178 112537 250416
16262B50416l7161f2852C66306j58577J20243j38401R0052A09800J04801j06203
$$ 250416 213255 -62852 366306 207729 327972 189571 279623 109800 214601 108398
16252A08398J21079D4211c9723A54085a24553D9857a08117B77922a31287B72601
$$ 108398 229477 44211 -39723 154085 -124553 49857 -108117 277922 -131287 272601
16241A32782J94993q4642m9706o6836J62013L0677E9016M385K15323A26651L6978
$$ 132782 327775 243133 193427 126591 288604 319281 59016 63401 278724 126651 163629
16230A63629P7474j685K05002J84251A86840J21739J13593A48847L9152J32175
$$ 163629 241103 239418 444420 628671 186840 308579 422172 148847 187999 320174
16220C20174A28826j9136a21190B62391q2429H0718M8543L97659I8116K65158
$$ 320174 128826 109690 -121190 262391 179962 80718 129261 526920 98116 363274
16210C63274A77836a11527L3526L4885A74443J23740j08962J94538A15965i5782
$$ 363274 177836 -111527 -78001 -43116 174443 298183 189221 383759 115965 -95782
16199a169A76569n7639J47674b11639A73630C1808a3231q5480F2457O20J1285
$$ -1169 176569 118930 266604 -211639 173630 31808 -13231 -98711 62457 63077 74362
16188G4362a61022D87823j13711m5029M06A9054M20567a05080B16084H9007k0328
$$ 74362 -161022 487823 374112 329083 329489 19054 439621 -105080 216084 89007 68679
16177F8679a06436C13633H982J76469B9624J35711k1779a69607D3419c2348B83136
$$ 68679 -106436 313633 8982 185451 29624 165335 143556 -169607 43419 -32348 283136
16165b00174F814J58024L4325a60193A70202C606K19592e5581G1691c34714e3810
$$ -200174 6814 164838 199163 -160193 170202 3606 223198 -55581 71691 -334714 -53810
16153c16362B36403K18312B8186L2498M6129b16486k5122C48236j27680d4793
$$ -316362 236403 454715 28186 60684 106813 -216486 -241608 348236 220556 -44793
16142A18722A8772O7017A9489Q7116j1801f3483D26709j57261B2689L05068A24495
$$ 118722 18772 85789 19489 106605 94804 -63483 426709 269448 22689 327757 124495
16130A82412c161A76883E2675P3654N892e3860A55650b054n4095A00737m5611
$$ 182412 -3161 176883 52675 126329 132221 -53860 155650 -2054 -56149 100737 55126
16119E5126f009B33338J07879c92907F8871p449J67385A0080K04398g3773A73110
$$ 55126 -6009 233338 341217 -392907 68871 61422 228807 10080 214478 -73773 173110
16107C20845A20475a38583A91920m0281P434b19231B11716q9171L21485a31280
$$ 320845 120475 -138583 191920 151639 159073 -219231 211716 122545 444030 -131280
16096E225e9334B0833b72259J12837g1028A30335C8175K49803E9003J1260a23246
$$ 5225 -59334 20833 -272259 -159422 -71028 130335 38175 287978 59003 70263 -123246
16084A40944B9608K17080J30181A76619D6673a94321K3767E9374J13934j3073
$$ 140944 29608 246688 376869 176619 46673 -194321 -170554 59374 173308 160235
16074A60235a03267j47543A68122J06997C3999i17j74647A61284a03348Q615B47605
$$ 160235 -103267 -250810 168122 275119 33999 -917 -175564 161284 -103348 -94733 247605
16062b60023A2175B73O861J44188P5786I5416b56580a1606j90926b9659C198O5230
$$ -260023 12175 273 7134 151322 227108 95416 -256580 -11606 -202532 -29659 3198 68428
16050F8428J6289a00054A30687c59993A42726i4652B46162b10190B042a32344
$$ 68428 84717 -100054 130687 -359993 142726 -94652 246162 -210190 2042 -132344
16039A90174a16448c7590j265n6798k3088L3303d86B22964N7945a52022I4833
$$ 190174 -116448 -37590 -38855 -95653 -118741 -85438 -486 222964 280909 -152022 94833
16027c08056J12898i5102j7973j27217b9140A64818g1938F406J72291i4504A8771
$$ -308056 -195158 -95102 -113075 -240292 -29140 164818 -71938 6406 178697 -94504 18771
16015a95524C76807A33715e2876j21259g6624A3811a63723j9212L6650D2885j1215
$$ -195524 376807 133715 -52876 -174135 -76624 13811 -163723 -182935 -146285 42885 31670
16004C1670N0186a64953A19607Q6403c9654m2406L7560j05968H9125c5653Q928
$$ 31670 81856 -164953 119607 206010 -39654 -82060 -44500 -150468 89125 -35653 -26725
15993b6725j71678N6259k1279k73558a6776k40139f9837j71271b1301B0661J36214
$$ -26725 -198403 -142144 -163423 -436981 -16776 -256915 -69837 -241108 -21301 20661 156875
15982A56875J09962j7877m4236q3631J31611a9489C3980a59656C45395A52153
$$ 156875 266837 248960 204724 121093 252704 -19489 33980 -159656 345395 152153
15971f7774C4081i5295l53620a01264E3382P9080g4593H3609J36776D1969P8738
$$ -67774 34081 -95295 -448915 -101264 53382 132462 -74593 83609 220385 41969 120707
15960A20707l3702J59350F7895O925Q5998c09789D1555c07022J23160A12761b70534
$$ 120707 87005 246355 67895 74820 160818 -309789 41555 -307022 -183862 112761 -270534
15948b50731C39678b03027I1908j3061J91439j07299j1968a3900j96069h1776
$$ -250731 339678 -203027 91908 78847 270286 162987 151019 -13900 -209969 -81776
15937a96271B88812c5388m43357B65580a0497A47151c5303j84939k9338D5869
$$ -196271 288812 -35388 -478745 265580 -10497 147151 -35303 -220242 -249580 45869
15926C2281J35937l5091d187j79327A69395m4015c97246G4593c52018a30626L5626
$$ 32281 168218 133127 -4187 -183514 169395 125380 -397246 74593 -352018 -130626 -95000
15915i5000A27957h4912d2441D947Q1183l5949c3058j8240l38349B15374h725
$$ -95000 127957 -84912 -42441 4947 86130 50181 -33058 -51298 -389647 215374 -8725
15903a0286A80321Q8010g2421A3117J09782c33591C31771A40543a47136D91950
$$ -10286 180321 268331 -72421 13117 122899 -333591 331771 140543 -147136 491950
15892A7140a33346m3707F824P1664b0153o7847A01444m4385J59451p2321b57758
$$ 17140 -133346 -177053 6824 78488 -20153 -88000 101444 57059 216510 144189 -257758
15880a82295q8771f4887B93511I2539a12573B05566a44363B62037a15028B83876
$$ -182295 -271066 -64887 293511 92539 -112573 205566 -144363 262037 -115028 283876
15869A0042f4324A59096i5417B8603L0726j8563K97719d64628B31480a02679n4964
$$ 10042 -64324 159096 -95417 28603 59329 40766 338485 -464628 231480 -102679 -157643
15858a57643M2762j27820e5400K2028B4424L4944J46949J23764A14587d9434q6364
$$ -157643 -114881 -242701 -55400 -33372 24424 59368 206317 330081 114587 -49434 -135798
15847a35798C42057b79303A37437K0059j1557E2933R6366n9280K01594b15634
$$ -135798 342057 -279303 137437 157496 145939 52933 149299 90019 291613 -215634
15836a93635N0477k5321n2960J6021g5242a1608I5031a57720a2906l7783j6866
$$ -193635 -143158 -168479 -221439 -205418 -75242 -11608 95031 -157720 -12906 -50689 -67555
15825f7555b4780l5328A91299d6194j76006M6477j25652C6467A7074M7893b08218
$$ -67555 -24780 -60108 191299 -46194 -222200 -175723 -301375 36467 17074 64967 -208218
15813A0532b45169g588l87730p4766a51920A32247E2267k3412J02784h1524J57
$$ 10532 -245169 -7588 -395318 -470084 -151920 132247 52267 28855 131639 -81524 -81367
15802h1367c9924B02169f9174b6633j84511B78372H2831M2909a94573A21489f936
$$ -81367 -39924 202169 -69174 -26633 -211144 278372 82831 125740 -194573 121489 -6936
15790b61920P7066f3450k5277C7068L313b6109r4384j09401b8146B35565a96959
$$ -261920 -184854 -63450 -88727 37068 40381 -26109 -120493 -229894 -28146 235565 -196959
15778b9564E9167A9424a19459A40316g3333q5889p7502F4951a96251A16528j4732
$$ -29564 59167 19424 -119459 140316 -73333 -159222 -236724 64951 -196251 116528 101796
15767A01796K16090d04075J51797C2004b88352A47108E6044c6206j52513A85902
$$ 101796 317886 -404075 -252278 32004 -288352 147108 56044 -36206 -188719 185902
15756a06482k06144A65811b0555A48827D6208c8154A45277J00399E8482J93905
$$ -106482 -312626 165811 -20555 148827 46208 -38154 145277 245676 58482 252387
15746B52387b29968F295J75074J7301K2359M1231j00612a76711M6070D5303J68395
$$ 252387 -229968 6295 181369 198670 221029 262260 161648 -176711 -130641 45303 213698
15735B13698p5999N0630J20337h1962k17414d568k53285C969c22947a45776j49790
$$ 213698 137699 188329 308666 -81962 -299376 -4568 -257853 3969 -322947 -145776 -295566
15724b95566g944j16281d2193l4623D01876b65652C9751f6436A04273b62697n7404
$$ -295566 -7944 -124225 -42193 -76816 401876 -265652 39751 -66436 104273 -262697 -320101
15713c20101f4535M559l36231b4745k59106e8858D3705h1074A72657b47429j08241
$$ -320101 -64535 -59976 -396207 -24745 -283851 -58858 43705 -81074 172657 -247429 -355670
15702c55670B432d0004B84290b1227A54875g7193e497k82582j40877a77559h871
$$ -355670 2432 -40004 284290 -21227 154875 -77193 -5497 -288079 -428956 -177559 -8871
15690a04867A57869e2414A61902q315G4657K4609j3383L6102J46346A26900J3495
$$ -104867 157869 -52414 161902 153587 74657 99266 85883 121985 268331 126900 140395
15679A40395A8783K668a75066P3146I2688a93741A91180m2784j9126q501D7058
$$ 140395 18783 21451 -175066 -101920 92688 -193741 191180 148396 129270 120769 47058
15667b27074J08210B0626J6401A1031b16118R1484A62623J8583l5992a79749H4662
$$ -227074 -118864 20626 37027 11031 -216118 -124634 162623 181206 145214 -179749 84662
15655B99991H8337c8505J747E6324B2263d0505p5268H943Q5615a32002K9423E8935
$$ 299991 88337 -38505 -36758 56324 22263 -40505 -115773 8943 94558 -132002 -102579 58935
15642a54958A73506L0302f6226H1502b22893A30731a66825A05153N6759b3369
$$ -154958 173506 203808 -66226 81502 -222893 130731 -166825 105153 161912 -23369
15631I6358a31149b3982j57349P6480b2449m8234k12379m8713B29644I8067d2356
$$ 96358 -131149 -23982 -181331 -104851 -22449 -70683 -283062 -331775 229644 98067 -42356
15619a86722r6158A93140a30877G0956b17737E8148a28129h139j05431G094a92050
$$ -186722 -282880 193140 -130877 70956 -217737 58148 -128129 -8139 -113570 7094 -192050
15607G1792b7843D5656a58708A95861E4344a71072d7920l345k78305d8408k80819
$$ 71792 -27843 45656 -158708 195861 54344 -171072 -47920 -51265 -329570 -48408 -329227
15596c29227J42931Q5097F5598J47953b69437a14036j19430M9579J6237A08725
$$ -329227 -186296 -101199 65598 213551 -269437 -114036 -233466 -183887 -167650 108725
15585I9033B7378K6596f1770k31493E0077f3628j13648c0768B56800g7200E7252
$$ 99033 27378 53974 -61770 -293263 50077 -63628 -177276 -30768 256800 -77200 57252
15573h5336r4409K8948k3068J2756A80815b1151k02927h4688k122A79542b67531
$$ -85336 -179745 -150797 -173865 -161109 180815 -21151 -224078 -84688 -86810 179542 -267531
15561A28280K02547e5529B15120q4721K31049B2876f1482k20386A33286J73103
$$ 128280 330827 -55529 215120 130399 361448 22876 -61482 -281868 133286 306389
15551C06389a48657D22773a21831j0826M083K3560a9988B0594a06772n8120j60583
$$ 306389 -148657 422773 -121831 -132657 -128574 -105014 -19988 20594 -106772 -164892 -325475
15540c25475a08920o1237B21229c09106a54346d7176j02509N0056j9253c818p6600
$$ -325475 -108920 -170157 221229 -309106 -154346 -47176 -149685 -99629 -118882 -3818 -80418
15529h0418j20607j12883F5767a43929A41539F7424J65386G701R6660h7488C11907
$$ -80418 -201025 -313908 65767 -143929 141539 67424 232810 7701 104361 -87488 311907
15517e8417j18475A2460i6189o8568q4546f9631L693b5310D1031c11574C43054
$$ -58417 -176892 12460 -96189 -164757 -249303 -69631 -65938 -25310 41031 -311574 343054
15505B98494b52324G8148a08145j65845C4858b1564B53021d2364j08343K9077
$$ 298494 -252324 78148 -108145 -273990 34858 -21564 253021 -42364 -150707 -121630
15495a21630n863j09593e2491l44B42327f7401j9139D4833A6726a47943B27068
$$ -121630 -127493 -237086 -52491 -52835 242327 -67401 -86540 44833 16726 -147943 227068
15483E9103M1163k1542k9053i6342L7213A54335h6406A16673J4654h2956I5022
$$ 59103 100266 78724 49671 -96342 -59129 154335 -86406 116673 131327 -82956 95022
15471a55380A6346N2637J06678A2723J06362c19265d921A53384n2747b6466q172
$$ -155380 16346 68983 175661 12723 119085 -319265 -4921 153384 100637 -26466 -34638
15460c4638E00158a87315C777J19184c89304k7316A53470L89174A33594i140E8917
$$ -34638 500158 -187315 3777 122961 -389304 -416620 153470 542644 133594 -9140 58917
15448a16955B9205J67507b72912i6135a8475b183B1457R9966a91279A07507a08403
$$ -116955 29205 196712 -272912 -96135 -18475 -2183 21457 121423 -191279 107507 -108403
15436B07947a59116B14038b70636h5079m9893B34958c3349j29749a5623k78889
$$ 207947 -159116 214038 -270636 -85079 -134972 234958 -33349 -163098 -15623 -294512
15426b94512H1642L98309F2989A2706K73507B1134J0362f6955C7760d40068J05653
$$ -294512 81642 479951 62989 12706 286213 21134 31496 -66955 37760 -440068 -334415
15415c34415C7816A07c9075p4487a5007D9264a30975A9613b06625K2465A79639
$$ -334415 37816 107 -39075 -113562 -15007 49264 -130975 19613 -206625 -184160 179639
15403i936D8339f3241E3621c79818a79911d2248n8776C18224a00000k1514d3541
$$ -9936 48339 -63241 53621 -379818 -179911 -42248 -101024 318224 -100000 -121514 -43541
15391G0506J54215A5854g6627o6363d539D7437a17661C32564d0475n1910l0831
$$ 70506 224721 15854 -76627 -142990 -4539 47437 -117661 332564 -40475 -92385 -123216
15380a23216k8589A9315a4376k50425B2032a20705A43227b90326H711J16659C4287
$$ -123216 -151805 19315 -14376 -264801 22032 -120705 143227 -290326 8711 125370 34287
15368b11216I0704a92738O4710A92341J01060f4149F831a21544B61242G1829a86582
$$ -211216 90704 -192738 -128028 192341 293401 -64149 6831 -121544 261242 71829 -186582
15356a9274j08369J6281B90212M451e2136l215E1947j6388b49558a07310k42577
$$ -19274 -127643 -111362 290212 294663 -52136 -55351 51947 35559 -249558 -107310 -349887
15345c49887A11733a28351j64345I3732b613G7235a00307M8663k52759A68702
$$ -349887 111733 -128351 -292696 93732 -2613 77235 -100307 -51644 -304403 168702
15334I1066O070M4570m9679b1703r1485A21357K26608b643B18472E1705a62456
$$ 91066 97136 141706 92027 -21703 -113188 121357 347965 -2643 218472 51705 -162456
15322B69227F4125c83206a91022A70832K3084H3880f592k53343I570O4630Q5978
$$ 269227 64125 -383206 -191022 170832 193916 83880 -6592 -259935 9570 74200 160178
15311A60178f2814k39700D99102a26158m7247N5197A6347L9943b00753G23J25351
$$ 160178 -62814 -302514 499102 -126158 -173405 -118208 16347 56290 -200753 723 126074
15300A26074K37522E7361c1957B68742a79712q1891A33761e1021j40752F2265
$$ 126074 363596 57361 -31957 268742 -179712 -261603 133761 -51021 -191773 62265
15289B00973C9840N956g6172B32873h3162F4526a88775B9734J08578N1242E9085
$$ 200973 39840 45796 -76172 232873 -83162 64526 -188775 29734 138312 189554 59085
15277B6807a41758B59576m0833b31685B88106k4306h2051a5100H7338J21061a25286
$$ 26807 -141758 259576 218743 -231685 288106 263800 -82051 -15100 87338 208399 -125286
15265A63788p4033B3273M9690B9003N1562b28357A96588c9351B93628I3557J1129
$$ 163788 89755 23273 72963 29003 80565 -228357 196588 -39351 293628 93557 104686
15254A04686J96668A28222K99K46837h0716E07337N72886N29877j28290L98412
$$ 104686 301354 128222 128521 375358 -80716 507337 1080223 1610100 1481810 1880222
15244A880222m17210E88574o4102c1407C30597d75974b09982B38453B7452L2808
$$ 1880222 1463012 588574 524472 -31407 330597 -475974 -209982 238453 27452 60260
15234F0260K9067k0296B05J8499J55721g8704j16221c2464j37418A71199G1387
$$ 60260 89327 69031 205 18704 174425 -78704 -194925 -32464 -169882 171199 71387
15222a74669a5850n9141H5454k4073B8331O7492L15089c0538A10903J71444J46494
$$ -174669 -15850 -74991 85454 61381 28331 95823 410912 -30538 110903 282347 428841
15211D28841E0467j8058L07895a59580e4097A14827P9933G0870J22833b56561
$$ 428841 50467 32409 340304 -159580 -54097 114827 194760 70870 193703 -256561
15200B06947r9746a93081G6455d1237k48339G1307h1177A93396b3880B9329a06638
$$ 206947 107201 -193081 76455 -41237 -289576 71307 -81177 193396 -23880 29329 -106638
15188b09143B72016G8598k6010a56861A28039a42745B06180a17712l00384a44402
$$ -209143 272016 78598 52588 -156861 128039 -142745 206180 -117712 -418096 -144402
15177G2116j4073N9823b7380B69589j15301K22546j64867K32050j20262A35803
$$ 72116 58043 117866 -27380 269589 154288 376834 211967 444017 323755 135803
15166a83945A33854A87J23535a37465B3996P571J88490g80k43055M3593A00497
$$ -183945 133854 187 123722 -137465 23996 31567 220057 -780 -243835 -200242 100497
15154B33700n6944f8699b7107A89930D1480a9000B64255J43465a90300g3889A20970
$$ 233700 176756 -68699 -27107 189930 41480 -19000 264255 407720 -190300 -73889 120970
15142B19950N8529b4960j22892G3527b66445e5379C97989p9328o878k3169h0736
$$ 219950 278479 -24960 -147852 73527 -266445 -55379 397989 318661 311783 288614 -80736
15130a69238A77058a30724I3264b1329A03231a97354D71762A04444d2965H5125
$$ -169238 177058 -130724 93264 -21329 103231 -197354 471762 104444 -42965 85125
15119F8510P8070M8545o3845i0951j35621O9085B76262j24523D4919a63199c3927
$$ 68510 146580 195125 131280 -90951 -226572 -157487 276262 151739 44919 -163199 -33927
15107B6053J20024h5164B86646n7370q04D3960a70864A08651Q3062J61045b419
$$ 26053 146077 -85164 286646 229276 228472 43960 -170864 108651 191713 352758 -2419
15095D02914e9798E1649d1715D5999M28135k15509E4183K54689p1858k9321O4923
$$ 402914 -59798 51649 -41715 45999 474134 258625 54183 308872 237014 207693 272616
15084B72616G0086a34481B51539j13026b19843B56434G1930J16213r124K91234
$$ 272616 70086 -134481 251539 138513 -219843 256434 71930 188143 179019 470253
15074D70253A48945a67865D37501j94649K663a32776F0403N7960l5109J57891
$$ 470253 148945 -167865 437501 242852 245515 -132776 60403 118363 83254 241145
15064B41145d2157F7490M9579J0243a13351C39898j25228r6188K62246Q0391A93397
$$ 241145 -42157 67490 117069 127312 -113351 339898 214670 118482 380728 461119 193397
15052a28131B59853g5950A0176L68650m5283j22486I4889D6428K02449O0697A14413
$$ -128131 259853 -75950 10176 378826 333543 211057 94889 46428 248877 309574 114413
15040B80564J9391A22260J09689P4921i2851B00941E411O1135J33079C7093P1837
$$ 280564 299955 122260 231949 306870 -92851 200941 5411 66546 199625 37093 108930
15029A08930K95371A33073B6947K47804e4875B74645A03758N40133B20374N8044
$$ 108930 404301 133073 26947 274751 -54875 274645 103758 643891 220374 278418
15019B78418E2196L64892a59511P3752B37555P3518p5389I8168d9420E0710B1729
$$ 278418 52196 417088 -159511 -85759 237555 311073 235684 98168 -49420 50710 21729
15007A26615M524K57194o7841B7739K34555o2213l7064K67540A20923K5782K03634
$$ 126615 131139 388333 320492 27739 262294 200081 163017 430557 120923 146705 350339
14996C50339d2246C6073L53157A80850L15384C8216d4594C00576K4603j7331K20631
$$ 350339 -42246 36073 389230 180850 496234 38216 -44594 300576 325179 307848 528479
14985E28479A10817K22790c2641D66957b8226D16788i3872A89301J29025n7588
$$ 528479 110817 333607 -32641 466957 -28226 416788 -93872 189301 318326 260738
14975B60738l4597J33940o8162g265B38748j6731F0869c5372C93872j86098C3249
$$ 260738 226141 360081 291919 -7265 238748 222017 60869 -35372 393872 207774 33249
14963D42427B14211J19252l4449a2648A29340j7871L6606K09293m728k7932e2243
$$ 442427 214211 333463 299014 -12648 129340 111469 148075 357368 352640 324708 -52243
14951C02723K52663j65793A63480L18377j59635a85206B81642f7191A32023L29290
$$ 302723 555386 389593 163480 481857 322222 -185206 281642 -67191 132023 461313
14941D61313B12441J4139M759N9415p0646K44208j31103K14236I2809K8112M5033
$$ 461313 212441 226580 231339 290754 220108 464316 333213 547449 92809 120921 165954
14930A65954j33R4428N4769J5697j17705b39495A54114L9745L80186h7665C31871
$$ 165954 165821 260249 315018 330715 213010 -239495 154114 193859 574045 -87665 331871
14918D07515k6697A65129l8134J6207K69891J18193A01684K67430B5145d6708
$$ 407515 380818 165129 126995 143202 413093 531286 101684 369114 25145 -46708
14907G31329B83018B8007J94391K01850K8741A09824J9637K83491G4825J85838
$$ 731329 283018 28007 222398 424248 452989 109824 129461 412952 74825 260663
14897B60663Q4002N4674J02244J68860B85133p8317J04987N1283Q0806j40948
$$ 260663 344665 399339 501583 670443 285133 206816 311803 363086 443892 302944
14887C02944O6019D6627L06091L9850A90879H8048L05867m2642O232K9660A76453
$$ 302944 368963 46627 352718 392568 190879 88048 393915 351273 357505 387165 176453
14875B02421K53328A80521L65609j48634j40977J64664J33781D1283K50292B6800
$$ 202421 455749 180521 546130 397496 256519 421183 554964 41283 291575 26800
14864A15402L77869B08418L84879j46804j24771K7317O2895L4956K43121C29004
$$ 115402 493271 208418 593297 446493 321722 349039 411934 446890 690011 329004
14853C93881p977l8220J17029j40702J41938j03035m8873L27019k52067J98987
$$ 393881 385904 347684 464713 324011 465949 362914 314041 641060 388993 587980
14843E87980k24302J20682B25058K43500B10584K34785J03560o663B61194j2393
$$ 587980 363678 484360 225058 468558 210584 445369 548929 542266 261194 248801
14833B48801J79941k5925J9412J14932j70458r3275L68489k08978M0747A49157
$$ 248801 428742 402817 422229 537161 366703 273428 641917 432939 473686 149157
14822B69774P1667m8853n8928K85709l6079j17110J68642l1411j61973L28426
$$ 269774 341441 292588 233660 519369 483290 366180 534822 503411 341438 669864
14812F69864A9160M91105p6280J16920K38899j13722B40437L95011j73784K99089
$$ 669864 19160 510265 433985 550905 789804 676082 240437 635448 461664 760753
14802G60753j55253l5839K14756A72901K90117J5412R1502J15125j99151J6454
$$ 760753 605500 569661 784417 172901 463018 478430 569932 685057 485906 502360
14792E02360M3502k24508M2397R9631K3292K5638K00454L4964C46117K0559J19734
$$ 502360 545862 321354 363751 463382 486674 512312 712766 747730 346117 366676 486410
14781D86410O2418N4061j72912N0146k4406J47956K53278C18271J18474O8769
$$ 486410 548828 602889 429977 480123 455717 603673 856951 318271 436745 505514
14771E05514p3502J50763J17864k46155B19820M76833j57525L01575j07440O517
$$ 505514 432012 582775 700639 454484 219820 696653 539128 840703 733263 739780
14761G39780R7113j38550j51258K13958j01387j86370M56546k12585P3952k50309
$$ 739780 836893 698343 547085 761043 659656 473286 929832 717247 791199 540890
14751E40890J44089Q6876j84130L7516J33011J3293k59001L38710m1385p7009
$$ 540890 684979 771855 587725 625241 758252 771545 512544 851254 809869 732860
14741G32860J34150k24469J87939j73796K15292l17609O3218j75032N24665D70521
$$ 732860 867010 642541 830480 656684 871976 554367 617585 442553 967218 470521
14730D46146L65968p8726j61P2618k01357J02883L3686k37662K52249J57084K05984
$$ 446146 812114 733388 733227 805845 604488 707371 741057 503395 755644 912728 1118712
14719A118712l90733K7127L815j57094L0339J27904J90081m10730m6297L1356
$$ 1118712 727979 755106 758921 601827 632166 760070 950151 539421 493124 524480
14709E24480L64452k05228l4939K9079L09600L5588m16369K26000j64158K82975
$$ 524480 888932 683704 648765 677844 987444 1023032 606663 832663 668505 951480
14699I51480n6293o4826K38651k24363j7419J83179M3284j11539j12738Q8357
$$ 951480 895187 830361 1069012 844649 827230 1010409 1053693 942154 829416 917773
14689I17773j99318k2467L91706j22720k87654L71016j94563J74310l82843J98203
$$ 917773 718455 695988 1087694 964974 677320 1048336 853773 1028083 645240 843443
14679H43443J23306J04134l58673M61037j91461k64142J1905O88668E97048K86273
$$ 843443 966749 1070883 712210 1173247 981786 717644 729549 1418217 597048 883321
14669H83321l3611J65766k8882N032o5033K58875p7440j08049J49316j23079J33041
$$ 883321 849710 1015476 986594 991626 926593 1185468 1108028 999979 1149295 1026216 1159257
14658A159257K26222j45459k39812L31316J89017j44306k17425j59560J89735
$$ 1159257 1385479 1240020 1000208 1331524 1520541 1376235 1158810 999250 1188985
14649A188985J23610F45805Q16422l48652J28542K43934k26537j62219Q6178k7285
$$ 1188985 1312595 645805 1462227 1113575 1242117 1486051 1259514 1097295 1183473 1156188
14639A156188j03217L29911j52371o2055n068r0781J60577K484L27752k0287j43114
$$ 1156188 1052971 1382882 1230511 1168456 1163388 1072607 1233184 1235668 1563420 1543133 1400019
14628A400019K62199n88704N71650j84266O836k15707M5472K91999k10325n5119
$$ 1400019 1662218 1073514 1645164 1460898 1467734 1252027 1297499 1589498 1379173 1324054
14618A324054j51713K13721N7965j3874L29450r3831M5851Q7669o28449O20783
$$ 1324054 1172341 1386062 1444027 1430153 1759603 1665772 1711623 1799292 1170843 1791626
14608A791626j63592k23453L37401l9962l04385N23597j17154k18545J39888K85577
$$ 1791626 1628034 1404581 1741982 1702020 1397635 1921232 1804078 1585533 1725421 2010998
14598B010998k05521l61387L74509n53l26752M38969k50838N7245L85308r7687
$$ 2010998 1805477 1444090 1818599 1818046 1491294 1930263 1679425 1736670 2121978 2024291
14588B024291K73442j27805l43999l7509K22615j54931m6212K40285j70740m187
$$ 2024291 2297733 2169928 1825929 1788420 2011035 1856104 1809892 2050177 1879437 1875250
14578A875250R3722o8445Q8124K16595j61555J37077j28462L96386j32655l1583
$$ 1875250 1968972 1900527 1988651 2205246 2043691 2180768 2052306 2448692 2316037 2284454
14568B284454j50962L496J98539J40919M7576J65042K28538k28673L27296K0261
$$ 2284454 2133492 2136988 2335527 2476446 2524022 2689064 2917602 2688929 3016225 3036486
14558C036486j4946M30003l47703K36543M18100j33957N33899N98624J416127
$$ 3036486 3021540 3451543 3103840 3340383 3758483 3624526 4158425 4757049 6173176
14549F173176J453334M266639P352270J5117403P565673k0460397r739534E548542
$$ 6173176 7626510 11893149 19245419 34362822 41928495 21468098 11728564 5548542
14540B804022k75936l02628L8023j74777n8889k3612j27837O5221n4214K5368
$$ 2804022 2528086 2225458 2263481 2088704 2029815 2006203 1878366 1943587 1889373 1914741
14530A914741J3825J54142L84731m69903L17757R4095O9056J0762R8898k34389
$$ 1914741 1928566 2082708 2467439 1997536 2315293 2409388 2478444 2489206 2588104 2353715
14520B353715K35606j06704m7901Q2489L57617j06729M28299n10740j0983J61023
$$ 2353715 2589321 2482617 2434716 2517205 2874822 2768093 3196392 2685652 2674669 2835692
14510B835692J69868l03987J32204O2655K28153q7590l38978K37018J57155M12366
$$ 2835692 3005560 2701573 2833777 2896432 3124585 3036995 2698017 2935035 3092190 3504556
14500C504556j82298P4265j44261k24833M56982k7710N4122j56839R2752J71573
$$ 3504556 3322258 3396523 3252262 3027429 3484411 3456701 3510823 3353984 3446736 3618309
14490C618309j89039L19854l70664N85694j92336k4996O5584k23241O25102j90766
$$ 3618309 3429270 3749124 3378460 3964154 3771818 3746822 3812406 3589165 4214267 4023501
14480D023501M5983J03178k82544J22611J01494K86745R7936p1725m8476N7265
$$ 4023501 4069484 4172662 3890118 4012729 4114223 4400968 4498904 4427179 4378703 4435968
14470D435968K02150J14697j62636J5671J02260n3373p3266K64264P2244O2852
$$ 4435968 4638118 4752815 4590179 4605850 4708110 4654737 4581471 4845735 4917979 4980831
14460D980831j2676K94585l24861Q3416K75820J3474J6876M4838j92576O31801
$$ 4980831 4968155 5262740 4937879 5021295 5297115 5310589 5327465 5372303 5179727 5811528
14450E811528l44359M94855j33293l01333N47627l08310o7684M86707K56486k35105
$$ 5811528 5467169 5962024 5828731 5527398 6075025 5766715 5699031 6185738 6442224 6207119
14440F207119o5285L00115J89886O9733P1398K86689q372j64245K03263R4420
$$ 6207119 6141834 6441949 6631835 6701568 6772966 7059655 7051283 6887038 7090301 7184721
14430G184721N9878j82470N69105j88758N1507N63203m8867m0514j55061L40569
$$ 7184721 7244599 7062129 7631234 7442476 7493983 8057186 8008319 7967805 7812744 8153313
14420H153313K44650O1158j53754K32818J00186J69613R635L35963N1488K73811
$$ 8153313 8397963 8459121 8305367 8538185 8638371 8807984 8817619 9153582 9205070 9478881
14410I478881L62163k24442L36739J59084J31287l12325K53594N10335K00848
$$ 9478881 9841044 9616602 9953341 10112425 10243712 9931387 10184981 10695316 10896164
14401A0896164k5410L66169n358L29706M15164k33362O03672l76M03635j69518
$$ 10896164 10870754 11236923 11231565 11561271 11976435 11743073 12346745 12346369 12750004 12580486
14391A2580486J54923L93915M16967k0723J39642M12163l0535M23489N34518O3185
$$ 12580486 12735409 13129324 13546291 13525568 13665210 14077373 14046838 14470327 15004845 15068030
14381A5068030L00254P6173K82742M30077L38949O23946j84545K47365N43605
$$ 15068030 15368284 15444457 15727199 16157276 16496225 17120171 16935626 17182991 17726596
14372A7726596K43132P14117m923O67261L72091N51750j02106O97748L95690M36911
$$ 17726596 17969728 18683845 18678922 19346183 19718274 20270024 20167918 20865666 21261356 21698267
14362B1698267L30329O74421M24635M59520N52672N14972P61414M58144N34213
$$ 21698267 22028596 22703017 23127652 23587172 24139844 24654816 25416230 25874374 26408587
14353B6408587N87525L65871Q62776O60430J058303O34099O40042M93671R11196
$$ 26408587 26996112 27361983 28224759 28885189 29943492 30577591 31217633 31711304 32622500
14344C2622500Q90477Q74166P94656R89512R20519J078065J106631R02321J281765
$$ 32622500 33512977 34387143 35181799 36171311 37091830 38169895 39276526 40178847 41460612
14335D1460612J162897J004090J386188J498986J423132Q11090J935159J472292
$$ 41460612 42623509 43627599 45013787 46512773 47935905 48746995 50682154 52154446
14327E2154446J461276J688639J942771J493842K011255K113959K138349K245618
$$ 52154446 53615722 55304361 57247132 58740974 60752229 62866188 65004537 67250155
14319F7250155K023965K619244K395853K718001K379417L544388K435509L747431
$$ 67250155 69274120 71893364 74289217 77007218 79386635 82931023 85366532 89113963
14311H9113963L380892L524874M047030L853664M245104M575129M702923N224060
$$ 89113963 92494855 96019729 100066759 103920423 108165527 112740656 117443579 122667639
14303A22667639N008667N727499N329696O860666N883193P362813P217169P914769
$$ 122667639 127676306 133403805 138733501 145594167 151477360 158840173 166057342 173972111
14295A73972111Q033256Q457509Q933558R360524R491109J0777601J0593067J1168542
$$ 173972111 182005367 190462876 199396434 208756958 218248067 229025668 239618735 250787277
14287B50787277J2220617J1962931J2915412J2922010J3628923J3686292J3392010
$$ 250787277 263007894 274970825 287886237 300808247 314437170 328123462 341515472
14280C41515472J3943648J3600509J3256584J2272666J1724451J0999839R470997
$$ 341515472 355459120 369059629 382316213 394588879 406313330 417313169 426784166
14273D26784166O398600J603336O46056J078702J914224j435109k907675k985707
$$ 426784166 433182766 434786102 435432158 436510860 438425084 436989975 434082300 431096593
14265D31096593q397596j0921658j2774636j3813245j4446314j4923419j5278738
$$ 431096593 422698997 411777339 399002703 385189458 370743144 355819725 340540987
14258C40540987j5059216j5115188j4711498j4275884j3701350j2340399j2502476
$$ 340540987 325481771 310366583 295655085 281379201 267677851 255337452 242834976
14251B42834976j2227898j1617820j0476428j0646474r808978r056999q484813
$$ 242834976 230607078 218989258 208512830 197866356 188057378 179000379 170515566
14244A70515566q154175p215641p719380o727391o528974o178660n253224n135297
$$ 170515566 162361391 155145750 147426370 140698979 134170005 127991345 122738121 117602824
14236A17602824n625594m555678m895991m257300l693647l540804l545925l469813
$$ 117602824 111977230 107421552 102525561 98268261 94574614 91033810 87487885 84018072
14228H4018072l103025l198271k960915k630098k982046k250591k328890k477011
$$ 84018072 80915047 77716776 74755861 72125763 69143717 66893126 64564236 62087225
14220F2087225k181081j672896j983108j891559k094282j268620j081413k019588
$$ 62087225 59906144 58233248 56250140 54358581 52264299 50995679 49914266 47894678
14212D7894678j396720j164362j623720j310032j149942p45688q98806j577744
$$ 47894678 46497958 45333596 43709876 42399844 41249902 40504214 39605408 38027664
14204C8027664j193254q36866j191721p64786p43723r01357o89170j259386p09647
$$ 38027664 36834410 35997544 34805823 34041037 33297314 32395957 31706787 30447401 29737754
14195B9737754m31868o73758m95627p81897r37613n85472k81561p15867o22149
$$ 29737754 29305886 28632128 28136501 27354604 26416991 25831519 25549958 24834091 24211942
14186B4211942o20021o78176l40028n50230o57341k86776m38275l56664m45645
$$ 24211942 23591921 22913745 22573717 22023487 21366146 21079370 20641095 20284431 19838786
14177A9838786m43575m59179l85080l05338J2548n76014m12805m64929k99302
$$ 19838786 19395211 18936032 18550952 18245614 18258162 17682148 17269343 16804414 16505112
14168A6505112k02198l49686l07885l47342l25250r0026l18271k45040l66691
$$ 16505112 16302914 15953228 15645343 15298001 14972751 14882725 14564454 14319414 13952723
14159A3952723k53278j76966p9893l13047o03434J56479l08957l27725m4885j64077
$$ 13952723 13699445 13522479 13442586 13129539 12526105 12682584 12373627 12045902 12001017 11836940
14149A1836940J89156n39285n9942j91497j56644l77241l8514K14038l47338l02734
$$ 11836940 12026096 11486811 11426869 11235372 11078728 10701487 10662973 10877011 10529673 10226939
14139A0226939J4002m52301j6266l84978R1552j89035m2080j47266J87826o28066
$$ 10226939 10240941 9788640 9772374 9387396 9478948 9289913 9247833 9100567 9288393 8660327
14129H660327j26957j20829L11890m29362k0859j6114l95711K87686j20314m17626
$$ 8660327 8533370 8412541 8724431 8295069 8274210 8258096 7862385 8150071 8029757 7612131
14119G612131q1617N745k28497J42574l8748q5282k89569j44310J10397l10299
$$ 7612131 7530514 7536259 7307762 7450336 7411588 7326306 7036737 6892427 7002824 6692525
14109F692525J87839O0794l68970q4699j08280k70322K28751k35779J58989l09024
$$ 6692525 6880364 6941158 6572188 6487489 6379209 6108887 6337638 6101859 6260848 5951824
14099E951824j03609n1229J60152j64864k32566m3271K51583m95787J48161q2388
$$ 5951824 5848215 5796986 5957138 5792274 5559708 5516437 5768020 5272233 5420394 5338006
14089E338006o3858J52430j83712J13513k99746j03363K83631k80038k17235j01967
$$ 5338006 5274148 5426578 5242866 5356379 5056633 4953270 5236901 4956863 4739628 4637661
14079D637661K454N251J74726J5310j45036j22181J16077m17171J16988j74010
$$ 4637661 4640115 4645366 4820092 4835402 4690366 4568185 4684262 4267091 4384079 4210069
14069D210069L68304l81333J3712J45316o66713N10983n9614l6109j65829O3060
$$ 4210069 4578373 4197040 4210752 4356068 3689355 4200338 4140724 4104615 3938786 4001846
14059D001846J67917k47830l16134J91166r8657J21286M0872j29397j86317Q3638
$$ 4001846 4169763 3921933 3605799 3796965 3698308 3819594 3860466 3731069 3544752 3628390
14049C628390m5940k28552J68350L23909j94671j13720j83298l999N5308k35081
$$ 3628390 3582450 3353898 3522248 3846157 3651486 3537766 3354468 3350469 3405777 3170696
14039C170696O1704J9446r7220O4399k40317L02587j50002p2313J36986j83006
$$ 3170696 3232400 3251846 3154626 3219025 2978708 3281295 3131293 3058980 3195966 3012960
14029C012960R4612j93527L52666k93878J88812l72870r6963K7915l76632L62572
$$ 3012960 3107572 2914045 3266711 2972833 3161645 2788775 2691812 2719727 2343095 2705667
14019B705667J07656o4047J1242k98244Q7385j13080L56863m60806O8958L62341
$$ 2705667 2813323 2749276 2760518 2462274 2549659 2436579 2793442 2332636 2401594 2763935
14009B763935o24120K05136Q5266J17900j24004J96830J57528l71983K78535k45740
$$ 2763935 2139815 2344951 2430217 2548117 2424113 2620943 2778471 2406488 2685023 2439283
13999B439283j71483j7233J06383j67686j32721J90054K81043j1073p7252Q2796
$$ 2439283 2267800 2250567 2356950 2189264 2056543 2246597 2527640 2516567 2439315 2522111
13989B522111J598675L009011N536224J4127281J5920862j5817341j2835607o157146
$$ 2522111 4120786 7129797 12666021 26793302 42714164 26896823 14061216 7904070
13981G904070k566858j085591l38525n64809l17111j41549m727M3461n0719o5271
$$ 7904070 5337212 4251621 3913096 3348287 3031176 2889627 2884900 2928361 2877642 2812371
13971B812371K0246k39710p5414l74541K7717R083o743J38866j98419K48564m46899
$$ 2812371 2832617 2592907 2517493 2142952 2170669 2179752 2173009 2311875 2113456 2362020 1915121
13960A915121j7820M59379k81933O7220q1302l4510Q2123m40299N64085l24549
$$ 1915121 1897301 2356680 2074747 2141967 2060665 2026155 2108278 1667979 2232064 1907515
13950A907515O8079K33787k13020j80622K8986P5590j38950j8770l9170J52892
$$ 1907515 1975594 2209381 1996361 1815739 1844725 1920315 1781365 1762595 1723425 1876317
13940A876317j56400j7974K31348k38065Q5525l7720j29426K08671j77734N6953
$$ 1876317 1719917 1701943 1933291 1695226 1780751 1743031 1613605 1822276 1644542 1701495
13930A701495L7968k17549Q6745P8943P8335l3849l44964M71551n98727K14567
$$ 1701495 1739463 1521914 1608659 1687602 1765937 1732088 1387124 1858675 1259948 1474515
13920A474515M63560n65371L98686k02387J83756l10311L95173k09681j3963j87893
$$ 1474515 1938075 1372704 1771390 1569003 1752759 1442448 1837621 1627940 1613977 1426084
13910A426084q7625M5528J97898j51995r684J99945m03240l4959J58738K48721
$$ 1426084 1338459 1383987 1581885 1429890 1420206 1620151 1216911 1181952 1340690 1589411
13900A589411k22091J58692m0739N2207l06894r02L5666O4420J932k52952K40849
$$ 1589411 1367320 1526012 1485273 1537480 1230586 1229684 1265350 1329770 1331702 1078750 1319599
13889A319599J94330j09519k37808P0116R0753J267J62794l02575q0774n9400
$$ 1319599 1513929 1404410 1166602 1236718 1327471 1328738 1491532 1188957 1108183 1048783
13879A048783L59644j43706j3630K01355P1566m49439j15696K34767q5573n3015
$$ 1048783 1408427 1264721 1251091 1452446 1524012 1074573 958877 1193644 1108071 1055056
13869A055056J78475j53316J47297k9456k03324R2771K19784K8713j81558j08891
$$ 1055056 1233531 1080215 1227512 1198056 994732 1087503 1307287 1336000 1154442 1045551
13859A045551K48071j07740j39101J16751J4506l10423J85596n3650K24578j55005
$$ 1045551 1293622 1185882 1046781 1163532 1178038 867615 1053211 999561 1224139 1069134
13849A069134K13458k55225L5337k7481J40086K0174j40015o1762K16357m17118
$$ 1069134 1282592 1027367 1062704 1035223 1175309 1195483 1055468 993706 1210063 792945
13839G92945n1284O6620p4549M22813l44403R7628J88349l18152k7792Q8824k05809
$$ 792945 741661 808281 733732 1156545 812142 909770 1098119 779967 752175 840999 635190
13828F35190K59736j13742k2237Q3878L26113k99372D03129M98734K67968j45004
$$ 635190 894926 781184 758947 842825 1168938 869566 403129 901863 1169831 1024827
13818A024827l11344J29794N6396j93497K63089j88152K80047Q223j94522J47663
$$ 1024827 713483 843277 899673 706176 969265 781113 1061160 1069383 874861 1022524
13808A022524L2077k19896Q1144j96943J51644J05819D02402L31536N2657k40616
$$ 1022524 1054601 834705 915849 718906 870550 976369 402402 733938 786595 545979
13798E45979L11412j21070J81904k5985K31548C44553N53382L2690l60850K56889
$$ 545979 857391 736321 918225 892240 1123788 344553 897935 930625 569775 826664
13788H26664C37017N20421o8370q7087n0118r2701J49822k43531N56027m22346
$$ 826664 337017 857438 789068 701981 651863 559162 708984 465453 1021480 599134
13778E99134O9649P2406k25494K27042j45419K93435k01975j30472L5268J20442
$$ 599134 668783 741189 515695 742737 597318 890753 688778 558306 593574 714016
13768G14016L27798m90312L7134j1027O0673J90061n3571j27848L42384k36357
$$ 714016 1041814 551502 588636 577609 638282 828343 774772 646924 989308 752951
13758G52951o7846k4498P6534j65727j01092J65318k81002K19350R0336K95199
$$ 752951 685105 660607 737141 571414 470322 635640 354638 573988 664324 959523
13748I59523k32270N7934k49092j88654N58186l10833K11674j17895L28070C34230
$$ 959523 727253 785187 536095 347441 905627 594794 806468 688573 1016643 334230
13737F07843O667J41014o7095C36266J79927K29998r0375J08549A49181M44337
$$ 607843 614510 755524 688429 336266 516193 746191 655816 764365 149181 593518
13727E93518p6388L25081l69242B12410N25229J25709n0151C52625L11448R4247
$$ 593518 517130 842211 472969 212410 737639 863348 813197 352625 664073 758320
13717G58320l50736K64835J1240N2223A96302m5350N17053j47267K27787B32706
$$ 758320 407584 672419 683659 735882 196302 150952 668005 520738 748525 232706
13706F60869A70181K25726L02317p3506l9650o7631L46623k91931B60598J68265
$$ 660869 170181 395907 698224 624718 585068 517437 864060 572129 260598 428863
13696D28863K77099L7834k36869j12497K04757K7779B87909N37290l42798R8224
$$ 428863 705962 743796 506927 394430 599187 626966 287909 825199 482401 580625
13686E80625L60116C98745J27899J30900k60869J6810j02622J32935J6248K31989
$$ 580625 940741 398745 526644 657544 396675 413485 310863 443798 460046 692035
13676F92035n4394l00041J37289J2548J12565J39800k40142j14302A45345J65151
$$ 692035 637641 337600 474889 487437 600002 739802 499660 385358 145345 310496
13666C10496J30554l0592K1285J01059o4260O3033J5558p7766M8028B09750L16249
$$ 310496 441050 410458 431743 532802 468542 531575 547133 469367 517395 209750 525999
13655E25999k48067L36110k43340n7458o5818K50202j25526L36069B07139J87294
$$ 525999 277932 614042 370702 313244 247426 497628 372102 708171 207139 394433
13645C94433K37779k49242L71065l09305R0214J47834K8108C06586L16991a77185
$$ 394433 632212 382970 754035 444730 534944 682778 710886 306586 623577 -177185
13634C20241J24718q819A83566m8106M51855q0302j54240J03704r4199K48086
$$ 320241 444959 436140 183566 135460 587315 507013 352773 456477 362278 610364
13624F10364j57955A36340l6699K51492j6162J35908J69292j06690k06693r5053
$$ 610364 452409 136340 99641 351133 334971 470879 640171 533481 326788 231735
13614B31735K09917j79627e5361E43290k4510j12848J92709k04277p7652L8443
$$ 231735 441652 262025 -55361 543290 518780 405932 598641 394364 316712 355155
13604C55155J89143j70302l9013J36219k0594A63907K49664j71178O9221L42705
$$ 355155 544298 373996 334983 471202 450608 163907 413571 242393 311614 654319
13594F54319B44965N44216k01343k32077j30802J23269r2170J95992n5611N5636
$$ 654319 244965 789181 587838 355761 224959 348228 256058 452050 396439 452075
13584D52075A71178d235C34183A45389K36661j19302J20570K0294o1543L38739
$$ 452075 171178 -4235 334183 145389 382050 262748 383318 403612 342069 680808
13574F80808l06482r9455J7969K9837M0744M8597r3555J99296k5348R7132B29098
$$ 680808 374326 274871 292840 322677 363421 412018 318463 517759 492411 589543 229098
13562A55276K41280L7749A94553J80218l7893r9104m4523J09693A18425D8889
$$ 155276 396556 434305 194553 374771 336878 237774 193251 302944 118425 48889
13551C21594n875j731M2051J3762l548d341B95968L0339J15660j27404p4230J69581
$$ 321594 315719 313988 356039 369801 366253 -4341 295968 326307 441967 314563 240333 409914
13539D09914K02309k72012M08728C54166j01014n1734J27440B2501J72385K74365
$$ 409914 612223 340211 748939 354166 253152 201418 328858 22501 194886 469251
13529D69251j78038J68162n0462m5155A22403K18747J25130k04239J12308j08100
$$ 469251 291213 459375 408913 363758 122403 341150 466280 262041 374349 266249
13519B66249N1760J27189j59112R4494j00732q0330Q8842g5995D73571j31186
$$ 266249 318009 445198 286086 380580 279848 199518 288360 -75995 473571 342385
13509C42385j28188j6815K37485k05754N29J6071Q7158k9097o8174N2315J68690
$$ 342385 214197 197382 434867 229113 229642 245713 332871 303774 235600 287915 456605
13498D56605j69488J87731A31446K19601C6881K94766L45731B47402O9544H9230
$$ 456605 287117 474848 131446 351047 36881 331647 677378 247402 316946 89230
13487B49874K86588B60795K43260j56208R6046A82349M2698Q8157A04319K73017
$$ 249874 536462 260795 504055 347847 443893 182349 225047 313204 104319 377336
13477C77336L2217J38782j77633i9377G6749L35066A80457J56150j02160K35754
$$ 377336 409553 548335 370702 -99377 76749 411815 180457 336607 234447 470201
13467D70201a2357A93477a20314D49868h2390C28325J23864H6144K24595G6510
$$ 470201 -12357 193477 -120314 449868 -82390 328325 452189 86144 310739 76510
13456B78008I6906L45798H7256O6907m73l3620M49343M2939n3849J0111I6908
$$ 278008 96906 442704 87256 154163 153690 120070 569413 612352 558503 568614 96908
13444i2496D29359B01281J55012A69634l0400R1424n3805J40853C5148J95924
$$ -92496 429359 201281 356293 169634 139234 230658 176853 317706 35148 231072
13434B31072N5222O0263E8564O6461N7642J30360f877C48208K7446C2980J39328
$$ 231072 286294 346557 58564 125025 182667 313027 -6877 348208 375654 32980 172308
13423A72308M14296k52353j7695J69175k24443m6871G906K96999j27761g1344
$$ 172308 586604 334251 316556 485731 261288 214417 7906 304905 177144 -71344
13412e6406B06225M02647A91064J10512A35907J85360J30571a81468B08795K87086
$$ -56406 206225 608872 191064 301576 135907 321267 451838 -181468 208795 495881
13402D95881C919L86583A90046M9664J06545j67574e8041B00157D2717J39808
$$ 495881 3919 390502 190046 239710 346255 178681 -58041 200157 42717 182525
13392A82525G0297J66801j9302m0802F3411J21044M2030J32694A58085p7918K58807
$$ 182525 70297 237098 217796 176994 63411 184455 226485 359179 158085 80167 338974
13381C38974j31336I393N85675A96037a05142D03104j33918m2488Q9471E7305
$$ 338974 207638 9393 595068 196037 -105142 403104 269186 226698 316169 57305
13370C51067o8484j10082c6759A23405l5402L91113j6280r1159n1165a33715E64013
$$ 351067 282583 172501 -36759 123405 88003 479116 462836 371677 320512 -133715 564013
13358B65227E4096L50194j9966a1937E68482B27755A04523j5841M30681m6887
$$ 265227 54096 404290 384324 -11937 568482 227755 104523 88682 519363 472476
13348D72476A58734L7290L7073K50707I3444Q2211K34318l3246j7472J38749j68442
$$ 472476 158734 196024 233097 483804 93444 175655 409973 376727 359255 498004 329562
13337C29562A38763J45699N6857K7786F8576J47349K7960l4004j1151n8470h7421
$$ 329562 138763 284462 341319 369105 68576 215925 243885 209881 198730 140260 -87421
13325A64250J26415j4536j19630L9238J05859L29931C07485j9913E5511K80572
$$ 164250 290665 276129 156499 195737 301596 631527 307485 287572 55511 336083
13315C36083A8673K55403Q0062F4161M89305A93202P1673K34350h6864A32065
$$ 336083 18673 274076 354138 64161 553466 193202 264875 499225 -86864 132065
13304A79477J17400K14893B2286M47963a6606B54806q5571P8992a57795E54024
$$ 179477 296877 511770 22286 470249 -16606 254806 169235 248227 -157795 554024
13293G2281J794k4579I79K58414j25662f3213j40454A4198J15220a17824D48724
$$ 72281 74075 49496 979 259393 133731 -63213 -203667 14198 129418 -117824 448724
13281B71987A27335b1353B22745c6121G8079J06441A7592H024K61692M7770F8727
$$ 271987 127335 -21353 222745 -36121 78079 184520 17592 8024 269716 317486 68727
13269D24181d6180G938K30806k5716c4649B33845I7335L73294A97492I3463J17682
$$ 424181 -46180 7938 238744 213028 -34649 233845 97335 470629 197492 93463 211145
13258B11145A1429K40762C8455L6804b32468G5107h5367C0392J95799L9939N4600
$$ 211145 11429 252191 38455 75259 -232468 75107 -85367 30392 226191 266130 320730
13247C20730j12587J00913E5348D068K78160g257G0740b55364A06233g0111c1198
$$ 320730 208143 309056 55348 4068 282228 -7257 70740 -255364 106233 -70111 -31198
13235G9456m828h1462C01279c2153A81926P4411j01794J9145o9104a45634C12143
$$ 79456 74628 -81462 301279 -32153 181926 256337 154543 173688 104584 -145634 312143
13223C08879A33159a8357F4295k255K22632M0327d9452J778F880K17453j09597
$$ 308879 133159 -18357 64295 62040 284672 324999 -49452 -47674 6880 224333 114736
13212A14736K4822D4426R8526m1258O9859h5414A74311m3262n7257k0242J01934
$$ 114736 139558 44426 142952 101694 171553 -85414 174311 131049 73792 53550 155484
13201A55484k7404n1824K2085C7678J62482n7547P7296P5342j45828K76852n6517
$$ 155484 128080 76256 98341 37678 200160 142613 219909 295251 149423 426275 369758
13190C69758C8007J72761a5878A99574i3733B12395I5350B5016J06474K49407
$$ 369758 38007 210768 -15878 199574 -93733 212395 95350 25016 131490 380897
13180C80897A25930a69515F9178d8173A65794A2174K31247G1402a03935B90551
$$ 380897 125930 -169515 69178 -48173 165794 12174 243421 71402 -103935 290551
13169B00227a27865B53723a40470D31120F9789K43038j37431J90649J69616A90075
$$ 200227 -127865 253723 -140470 431120 69789 312827 175396 366045 535661 190075
13158B29387h960E2498g7619C51722i7489a61j21740B25148K10020c1055A6927
$$ 229387 -8960 52498 -77619 351722 -97489 -161 -121901 225148 435168 -31055 16927
13146A93977J73428H2903b8203j72716G064J82243J89726c1416k4470D49359j77353
$$ 193977 367405 82903 -28203 -200919 7064 189307 379033 -31416 -55886 449359 272006
13135B72006c5367A68879c3324i9A92609b27766N6105B92050A29671J63869g5987
$$ 272006 -35367 168879 -33324 -99 192609 -227766 -171661 292050 129671 293540 -75987
13123h5481B14711i8797j7469A86414G9982a0667D8562p869a07732F5381R000
$$ -85481 214711 -98797 -116266 186414 79982 -10667 48562 40693 -107732 65381 74381
13112G4381J01412J50153n8464R5485A73005n2186d706B24959G9341O5225m8478
$$ 74381 175793 325946 267482 362967 173005 120819 -4706 224959 79341 144566 96088
13101I6088G70Q1334P7800K922d9251A64630J7164o8950f5847A5026K85225M6321
$$ 96088 770 82104 159904 162826 -49251 164630 181794 112844 -65847 15026 300251 346572
13089C46572A32048l938b95311D23634b7431F4504M1160b12898j32385b0819C41939
$$ 346572 132048 128110 -295311 423634 -27431 64504 105664 -212898 -345283 -20819 341939
13077h0178k1316A95976A6925J42091a67952A20602f392A15137a66636B34063
$$ -80178 -101494 195976 16925 159016 -167952 120602 -6392 115137 -166636 234063
13066B409g8772j09480a2394B95817a32937D13869A29939h4857C24659j58979
$$ 2409 -78772 -188252 -12394 295817 -132937 413869 129939 -84857 324659 165680
13056A65680J21762J2531C2520K98878e2779C44681E8003O630k6883J69421c0505
$$ 165680 287442 299973 32520 331398 -52779 344681 58003 64633 37750 207171 -30505
13044d0113j6063B16175A00622A771J39756E3988b10368A79605O4356A6044K01506
$$ -40113 -56176 216175 100622 1771 141527 53988 -210368 179605 243961 16044 217550
13033B17550J90775A61005J46911k2231G1061M33000A09830k0463m2323L19699
$$ 217550 408325 161005 307916 285685 71061 504061 109830 89367 47044 366743
13023C66743j5841A62440L6118F9455Q7726N1223j02666J94786f7913B61611Q235
$$ 366743 350902 162440 198558 69455 157181 208404 105738 300524 -67913 261611 269846
13012B69846n0501q7246J21883F19a49821E7753A2725N04731A65264a04713B16037
$$ 269846 219345 132099 253982 619 -149821 57753 12725 517456 165264 -104713 216037
13000b8009n2812H7656o778b6434j04942K08D9097b6044r336I1297J14822d27698
$$ -28009 -80821 87656 80878 -26434 -131376 -131168 49097 -26044 -35380 91297 206119 -427698
12987b8997j76215D52018A92303i9933d6699I0434P4398c15496D4235b06318f2037
$$ -28997 -205212 452018 192303 -99933 -46699 90434 164832 -315496 44235 -206318 -62037
12975A43062E8874k2867K4461J09062a44268D5203J85399j12772n5182r978k5461
$$ 143062 58874 36007 60468 169530 -144268 45203 230602 117830 62648 52670 27209
12964B7209k487J88539B5601e09475A29964E0227c427J360n1079q8836C94226
$$ 27209 24722 213261 25601 -509475 129964 50227 -3427 -2067 -53146 -141982 394226
12952b72777C13510b7413N914B56564l8098N4171G6335a95449b346A85109n6064
$$ -272777 313510 -27413 -21499 256564 218466 272637 76335 -195449 -2346 185109 129045
12941A29045l224b5517A63055G7623C6514e2538A13559c28304e9532b000A09698
$$ 129045 125821 -25517 163055 77623 36514 -52538 113559 -328304 -59532 -2000 109698
12929H2448j9704O7319C9418M7694K98722i7181j2357A34888N5498L3174a08594
$$ 82448 62744 130063 39418 87112 385834 -97181 -109538 134888 190386 223560 -108594
12917B91055j0614b50857c2749D7377m317b62085f0961K8212B13468Q7515b00163
$$ 291055 280441 -250857 -32749 47377 43060 -262085 -60961 -32749 213468 300983 -200163
12905B63899k2362j08160b34518B63137H075K32928H8671K70790Q709A53889b8427
$$ 263899 241537 133377 -234518 263137 8075 241003 88671 359461 368170 153889 -28427
12893G3393b08809R2141C6337a94161j12597B47011E9418Q055g4114F8358b340
$$ 73393 -208809 -116668 36337 -194161 -306758 247011 59418 67473 -74114 68358 -2340
12881e5818B59644K33162B23690c7785I5945c7349n5368B14981A3888e1797D6195
$$ -55818 259644 492806 223690 -37785 95945 -37349 -92717 214981 13888 -51797 46195
12869b36959B59835O5734j12246r0593h2397F0693L10652g4619A81979b32493
$$ -236959 259835 325569 213323 122730 -82397 60693 371345 -74619 181979 -232493
12858e318B74622c689G6842R7350G7555J95468r1828k2755E4487P594K21495a56877
$$ -5318 274622 -3689 76842 174192 77555 273023 181195 158440 54487 62081 283576 -156877
12845C6978K07678O27D2497J44407J76676j55603b4550J2056p7728A45562c9134
$$ 36978 244656 245283 42497 186904 363580 207977 -24550 -12494 -90222 145562 -39134
12833b55437a27282I0908b16896c9454B4787c23693e1549B67425P9640i6914I1794
$$ -255437 -127282 90908 -216896 -39454 24787 -323693 -51549 267425 347065 -96914 91794
12821a86371l1936A5936O6452R5016Q3957D1566a82791I4764a26937P800B27984
$$ -186371 -218307 15936 82388 177404 261361 41566 -182791 94764 -126937 -119137 227984
12809e5068B6482f3656j16407A81186a02920B30571B0386J5941K75829a61033
$$ -55068 26482 -63656 -180063 181186 -102920 230571 20386 36327 312156 -161033
12798F9553a91095A02709L6245q886b98525M6798C10418C0379a00942A45287a0264
$$ 69553 -191095 102709 138954 130068 -298525 -251727 310418 30379 -100942 145287 -10264
12786A04353d999l2314E2724a32373E0749J10485b4360H4173a28613d9110C96074
$$ 104353 -4999 -37313 52724 -132373 50749 161234 -24360 84173 -128613 -49110 396074
12774D33863a71370i794A0982K20446e3432H5204a20302B72509B2236J41247c7141
$$ 433863 -171370 -9794 10982 231428 -53432 85204 -120302 272509 22236 163483 -37141
12762B36967E117K91990c2729H1160L1119a73753A05871k1125J72172H8505K20819
$$ 236967 5117 297107 -32729 81160 112279 -173753 105871 84746 256918 88505 309324
12751C09324a55283e521B40411b3142B20698H772K7118R706a05051K9273k79703
$$ 309324 -155283 -5521 240411 -23142 220698 8772 35890 45596 -105051 -75778 -355481
12740c55481A46900f1027B49240C094J74301g7108C00316A01126O6636a34194
$$ -355481 146900 -61027 249240 3094 177395 -77108 300316 101126 167762 -134194
12729I6031h3362A5835b26642A80361n7124d488D9684L9138K4984Q0683k6003
$$ 96031 -83362 15835 -226642 180361 123237 -4488 49684 88822 113806 194489 168486
12718A68486b4098A54049j5809C767d6112A29862Q1000q1909L4296B9120K70291
$$ 168486 -24098 154049 138240 3767 -46112 129862 210862 128953 163249 29120 299411
12707B99411l6853j24467E3245N1637M9573A8912J73084b2137A00439J25374b54383
$$ 299411 262558 138091 53245 104882 154455 18912 191996 -22137 100439 225813 -254383
12695a42054C13256a3340A3503a86314b1791A21466n196K71533i3804a9094q1309
$$ -142054 313256 -13340 13503 -186314 -21791 121466 116270 387803 -93804 -19094 -100403
12684a00403A56263E5966M12696D8398a67428B23797N6654j12108K9015E9050
$$ -100403 156263 55966 468662 48398 -167428 223797 280451 168343 197358 59050
12673C39208j03922j03582I869P1202J37468F7043b9493B74181a51830E4621L09655
$$ 339208 235286 131704 9869 81071 218539 67043 -29493 274181 -151830 54621 364276
12662C64276R6215E3556d6225k8062q941r5478f8639J9116A84910a20139B89916
$$ 364276 460491 53556 -46225 -74287 -83228 -178706 -68639 -49523 184910 -120139 289916
12650h3490a2937I3956m1455K10349A25563G479N7644M9154E4472K6869a9920
$$ -83490 -12937 93956 52501 262850 125563 7479 65123 114277 54472 81341 -19920
12638a3110A08392e2871i866G7683L30390k02555a58550A3020J54890K1847B4488
$$ -13110 108392 -52871 -9866 77683 408073 205518 -158550 13020 167910 189757 24488
12626B02774o0442c7976C23293e9857C95191A90783A1119a54955B38120b05008
$$ 202774 142332 -37976 323293 -59857 395191 190783 11119 -154955 238120 -205008
12615B00256K8661r9816a03546C01078r5321N0097o4478F2599J79170H3833a37578
$$ 200256 228917 129101 -103546 301078 205757 255854 191376 62599 241769 83833 -137578
12603a52845c3518A8513a30996A30265f4873G5818e9585n6625c1614I7118a2368
$$ -152845 -33518 18513 -130996 130265 -64873 75818 -59585 -116210 -31614 97118 -12368
12591B28886e7247A00283a97286b1545A85892J11655j45014b63492B606J28277
$$ 228886 -57247 100283 -197286 -21545 185892 297547 152533 -263492 2606 130883
12581A30883b14927C1852L5795L6522a94142A9025a52239m6103A86024k689b12946
$$ 130883 -214927 31852 67647 104169 -194142 19025 -152239 -198342 186024 183335 -212946
12569c25317A05230D1442J91270j04398J41563A16073a44850G4543a5576A67846
$$ -325317 105230 41442 232712 128314 269877 116073 -144850 74543 -15576 167846
12558A7732Q3619L3626R7955A7807Q4380m637K4114K46362a84642A57936h6097
$$ 17732 101351 134977 232932 17807 102187 97550 121664 368026 -184642 157936 -86097
12546G2104M358L0492a29886j16203b0807k9634A83201m8856J70044a17707i439
$$ 72104 76462 106954 -129886 -246089 -20807 -50441 183201 134345 304389 -117707 -9439
12534c53929A21174l3787k228g0818m983A23100A288L87148c5357F918b9265B44232
$$ -353929 121174 87387 85159 -70818 -75801 123100 1288 388436 -35357 6918 -29265 244232
12521A30069N3610J45376I2315K04629a78780F7457M7932b89833h2423H8208J47256
$$ 130069 183679 329055 92315 296944 -178780 67457 115389 -289833 -82423 88208 235464
12510B35464d4760D75248b61062m2756N8670A57763c3249j70878B2513b91750
$$ 235464 -44760 475248 -261062 -303818 -245148 157763 -33249 -204127 22513 -291750
12499D2623j0733b67458l0151D9951C545K22625E9964O5588p761c0584o0798B50375
$$ 42623 31890 -267458 -297609 49951 3545 226170 59964 125552 117791 -30584 -91382 250375
12486F511i37B93359a5466H4229L31737c6990J5099o5483B61715G9549a49354
$$ 6511 -937 293359 -15466 84229 415966 -36990 -21891 -87374 261715 79549 -149354
12474a03154F0425a39851B22415j6329b75101A71860a82114e7300k48381A31413
$$ -103154 60425 -139851 222415 206086 -275101 171860 -182114 -57300 -305681 131413
12463H7387L11910a80256a5546M78j02928B21331j06290N2148e3928B42183n508
$$ 87387 399297 -180256 -15546 -15068 -117996 221331 115041 167189 -53928 242183 236675
12452B36675i289G094a04307D9245K47275D8663a97938N3901A82586b4815A14585
$$ 236675 -9289 7094 -104307 49245 296520 48663 -197938 -144037 182586 -24815 114585
12440b3933m663j58697P2272o835C19360C8508A6150d4446C18304g0980l89764
$$ -23933 -28596 -187293 -115021 -121856 319360 38508 16150 -44446 318304 -70980 -460744
12429d60744A54001C9879r746M0640a88675F1467a80386o3002a7568q3014c3948
$$ -460744 154001 39879 30133 70773 -188675 61467 -180386 -243388 -17568 -100582 -33948
12417f6674a7414H8823N4471L1223c29301B82091E3639l307a29577A31278g0238
$$ -66674 -17414 88823 143294 174517 -329301 282091 53639 50332 -129577 131278 -70238
12405A83470e3888H7603d1119B48408A02811f6007H2873f9569D7389c53763D485
$$ 183470 -53888 87603 -41119 248408 102811 -66007 82873 -69569 47389 -353763 4485
12393a18563C598c0653n9181C47994b04420o498f6474I5801b6311k67845K175
$$ -118563 3598 -30653 -89834 347994 -204420 -210918 -66474 95801 -26311 -294156 -291981
12382b91981B82369E6771A9822f1805A31475a17321A71526E2466J29175i5156
$$ -291981 282369 56771 19822 -61805 131475 -117321 171526 52466 181641 -95156
12371d9732m8290D47267r2302A09961P0615B6910L5192a08658C462L2522b25254
$$ -49732 -98022 447267 354965 109961 180576 26910 62102 -108658 3462 35984 -225254
12359a12273G5532b75779B8533J66512D6003J18446a19876A62004P6131h515I4641
$$ -112273 75532 -275779 28533 195045 46003 164449 -119876 162004 238135 -8515 94641
12347a9849A80252o3989J10636a50718K3511A08329C7166a545A59798D4562J31121
$$ -19849 180252 116263 226899 -150718 -127207 108329 37166 -1545 159798 44562 175683
12336A75683h8110G7193J83073a8362j72217P3487k55274A3535b330C34673j01175
$$ 175683 -88110 77193 260266 -18362 -190579 -117092 -372366 13535 -2330 334673 233498
12325B33498a16729A19971a23387G5577A5164a61117f7304b00F0037e6359j9351
$$ 233498 -116729 119971 -123387 75577 15164 -161117 -67304 -200 60037 -56359 -75710
12314g5710F4M09629c3415G4605J42923j06966d5718J7070A73135a35580I7374
$$ -75710 64 409693 -33415 74605 217528 110562 -45718 -28648 173135 -135580 97374
12302A36933g2898A10364d2125m3913B1322g3078C7003J91724a09306C01548c148
$$ 136933 -72898 110364 -42125 -86038 21322 -73078 37003 228727 -109306 301548 -3148
12290f8701B81293B9103d643k23692i7748C6391a15648A94245e5992a4982A27894
$$ -68701 281293 29103 -4643 -228335 -97748 36391 -115648 194245 -55992 -14982 127894
12278F9446a77954F6384J03488J35623a69248A63076R353k9891A9303R8147A2523
$$ 69446 -177954 66384 169872 305495 -169248 163076 172429 142538 19303 117450 12523
12266E32722F0122c7645j38772A91057F5113a06573L1517C4532L478a05473b1798
$$ 532722 60122 -37645 -176417 191057 65113 -106573 -75056 34532 38010 -105473 -21798
12254b61700A58302o9153J09577P5670a23011j29804A09578a46217I6863L29797
$$ -261700 158302 89149 198726 274396 -123011 -252815 109578 -146217 96863 426660
12244D26660b37761H2138b54330A2428J84520r4338h4251k8658H5461O3052O7552
$$ 426660 -237761 82138 -254330 12428 196948 102610 -84251 -112909 85461 148513 216065
12233B16065l4033d5747D1708a30651C27839G4098a61193B73304a84240k0746
$$ 216065 182032 -45747 41708 -130651 327839 74098 -161193 273304 -184240 -204986
12223b04986O4176B75555D9334N1566J55149m8681k1455r102O9455a11572A65721
$$ -204986 -140810 275555 49334 100900 256049 207368 185913 176811 246266 -111572 165721
12211C6219j3120J21550o4336L31304p2405c1130c377A67740P0550r6483J04418
$$ 36219 23099 144649 80313 411617 339212 -31130 -3377 167740 238290 141807 246225
12200B46225I6075O4752J3893K55622A08605J8397L35371C6476K63827A21362
$$ 246225 96075 160827 174720 430342 108605 127002 462373 36476 300303 121362
12189A72909k7890J5001a18365C5126P2892L7994J32863G1011P1358a63957A35366
$$ 172909 145019 160020 -118365 35126 108018 146012 278875 71011 142369 -163957 135366
12177a37452A07980A7017g6116j15564B718J05115A1080O2275o401a57557e7503
$$ -137452 107980 17017 -76116 -191680 2718 107833 11080 73355 66954 -157557 -57503
12165A07948a84110B17709P006B5949C34R4392d6330C93135A43296A3534J38637
$$ 107948 -184110 217709 224715 25949 334 94726 -46330 393135 143296 13534 152171
12154A52171g345n2122I623J10408J25601a55306C6955K41130b32739k497A00484
$$ 152171 -7345 -59467 9623 120031 245632 -155306 36955 278085 -232739 -235236 100484
12142B36909b17068A93073H3794N2357d5931B21503b51029f3516A81872L4741
$$ 236909 -217068 193073 83794 136151 -45931 221503 -251029 -63516 181872 216613
12132B16613q7932R7686c38771F5642a7427B47253F5164a12166A60993D3541J15961
$$ 216613 128681 226367 -338771 65642 -17427 247253 65164 -112166 160993 43541 159502
12121A59502a76832d3747G6938j4040g326G9174a37162O5431m1770r0128C4452
$$ 159502 -176832 -43747 76938 62898 -7326 79174 -137162 -71731 -113501 -203629 34452
12109F7865k0831J16698p8436j1112a53037P6021J2844A09551C6703a02539q2737
$$ 67865 47034 163732 85296 74184 -153037 -77016 -64172 109551 36703 -102539 -185276
12098a85276A32248b26552d4337A98270b15600f4007j9153A38321J40486d599
$$ -185276 132248 -226552 -44337 198270 -215600 -64007 -83160 138321 278807 -4599
12087e9585A9749c1257j71260B00890F1399K1875b41229B33115c5183B06015H8816
$$ -59585 19749 -31257 -202517 200890 61399 83274 -241229 233115 -35183 206015 88816
12075f6330j87979P9230b0157B47910a04789A67007L59669N45999P36643H83440
$$ -66330 -254309 -175079 -20157 247910 -104789 167007 526676 1072675 1809318 883440
12064F22688A42050L5324d0043K970G6291K73004c60458h3110K3522m0161F3032
$$ 622688 142050 177374 -40043 -37073 76291 349295 -360458 -83110 -59588 -99749 63032
12052a30489L3957A25944C8070a26377J3851A42205a60422D4565a14793k214A13988
$$ -130489 -96532 125944 38070 -126377 -112526 142205 -160422 44565 -114793 -117007 113988
12040B13476b7505j05264d8992a7947B12447F558c8512B8548N9349a35034a2772
$$ 213476 -27505 -132769 -48992 -17947 212447 6558 -38512 28548 87897 -135034 -12772
12028C32771a52186B80148p4625I954b72472A47747k0658k5033B0593J23599b2497
$$ 332771 -152186 280148 205523 9954 -272472 147747 127089 102056 20593 144192 -22497
12016H5282J98149H4619J66355a20567M3843B67922a11964B14514b6162A09674
$$ 85282 283431 84619 250974 -120567 -76724 267922 -111964 214514 -26162 109674
12005b19660d9095C78155e4295j11973q4789b5748H034a2221C298M2234K64412
$$ -219660 -49095 378155 -54295 -166268 -251057 -25748 8034 -12221 3298 45532 309944
11994C09944a46027p0520D09415A29140J65945c4806q7776A50298K21735B1254
$$ 309944 -146027 -216547 409415 129140 295085 -34806 -122582 150298 372033 21254
11983A14268h1049q662A25489C2072R8984C9381a44979A67158N9296a51020r2578
$$ 114268 -81049 -89711 125489 32072 131056 39381 -144979 167158 226454 -151020 -243598
11972b43598P7666G9800a45939B8235d30297c1325o1547L4670A5220J68770B6444
$$ -243598 -165932 79800 -145939 28235 -430297 -31325 -92872 -58202 15220 183990 26444
11960h4982j62100D32928h2147B32495I7127k3798R8388m0173E0674J82469h8270
$$ -84982 -247082 432928 -82147 232495 97127 73329 171717 131544 50674 233143 -88270
11948a23251C45307c17011A01532j2799i9152B7859J0907A7584L22339a04978
$$ -123251 345307 -317011 101532 88733 -99152 27859 38766 17584 339923 -104978
11937b15792N431b2675A7735a21531e0102C1364a15723J1761m3677d3473q0250
$$ -215792 -210361 -22675 17735 -121531 -50102 31364 -115723 -103962 -147639 -43473 -123723
11926a23723D6050a78769c1754j50731j27784G3693C5196R5961J23472G0647c2609
$$ -123723 46050 -178769 -31754 -182485 -310269 73693 35196 131157 254629 70647 -32609
11914a5884A25467a39016N6141n8612g224A68062C6040L9139J58797C7340L6038
$$ -15884 125467 -139016 -82875 -141487 -7224 168062 36040 75179 233976 37340 73378
11903G3378K00078j26378C442J61048B4095B841b06200G7228i5900K6167a3383
$$ 73378 273456 147078 3442 164490 24095 2841 -206200 77228 -95900 -69733 -13383
11891H1628A7324J55410D2286b12030c3127j71720m0503F9334r895b50769A85296
$$ 81628 17324 172734 42286 -212030 -33127 -204847 -245350 69334 59439 -250769 185296
11879i4568K2421d303A78499c63476A10672d7701b1124j68823A22925a28904c4258
$$ -94568 -72147 -4303 178499 -363476 110672 -47701 -21124 -189947 122925 -128904 -34258
11867b21591g9495A03066k2827e5166p0596A30482b74832Q8659A86526K36482
$$ -221591 -79495 103066 80239 -55166 -125762 130482 -274832 -186173 186526 423008
11857D23008C5421K46121j24125J61745a56922c5687k62965Q29C69937G1524b41931
$$ 423008 35421 281542 157417 319162 -156922 -35687 -298652 -297823 369937 71524 -241931
11845A20619e2649B0139g7258F8968e3910j05482a9378m7346B8870b53521a23417
$$ 120619 -52649 20139 -77258 68968 -53910 -159392 -19378 -66724 28870 -253521 -123417
11833b77768h6457A55661L23266a44700k32382d206l8468n0159C877J31812D971
$$ -277768 -86457 155661 478927 -144700 -377082 -4206 -42674 -92833 3877 135689 4971
11821H0566h3310j28745l0717J02061B15967b48344O5378E8107K2610J60193a00263
$$ 80566 -83310 -212055 -242772 -140711 215967 -248344 -182966 58107 80717 240910 -100263
11809a30704k19011A5462M8587g4337A65013M6972d7956a2725B51981d0619j17548
$$ -130704 -349715 15462 64049 -74337 165013 211985 -47956 -12725 251981 -40619 -158167
11798a58167M7559E6931c35764A5508i6905p59M7619r131B94919d0301l2783B42233
$$ -158167 -110608 56931 -335764 15508 -96905 -97664 -50045 -59176 294919 -40301 -73084 242233
11785d616j44411H9649D4267d0888k8114G5530K27635D318d7917I3964K45705
$$ -4616 -149027 89649 44267 -40888 -69002 75530 303165 4318 -47917 93964 339669
11774C39669b5011H9411a62458F5870a62209C5769M840c5620G7868a55050A30308
$$ 339669 -25011 89411 -162458 65870 -162209 35769 40609 -35620 77868 -155050 130308
11762d3480r0630k78905b9862A19762C3334j2778K54801D3996P157K28582c86612
$$ -43480 -134110 -413015 -29862 119762 33334 20556 275357 43996 51153 279735 -386612
11750f5475a8477k315H9339B7146L7261a1943A73994M3263e6795l6830d0422A88483
$$ -65475 -18477 -20792 89339 27146 64407 -11943 173994 217257 -56795 -93625 -40422 188483
11737g9266n3580j9415G1316d2926j0839A44760B5235J45057G4570L955A0365
$$ -79266 -132846 -152261 71316 -42926 -53765 144760 25235 170292 74570 78525 10365
11725E2666b02906A03140K6250a13993j9649K1672c2537A17092D5087a73163o7780
$$ 52666 -202906 103140 129390 -113993 -133642 -111970 -32537 117092 45087 -173163 -240943
11714b40943J02899A780J13281J38095H1829a59193C45014c07024k6752D9791
$$ -240943 -138044 1780 115061 253156 81829 -159193 345014 -307024 -333776 49791
11703A55678a56438j74150J63621c4345J1908B1865J0350a27829G270J3812b436
$$ 155678 -156438 -330588 -166967 -34345 -22437 21865 32215 -127829 7270 21082 -2436
11691A58154l1475a67767a3034H752J9671L3908J83880A08369D2028L0978K58431
$$ 158154 126679 -167767 -13034 8752 28423 62331 246211 108369 42028 73006 331437
11680C31437q8494d5200I1869J07651J64560b1215B35148j05160J55012A4810
$$ 331437 242943 -45200 91869 199520 364080 -21215 235148 129988 285000 14810
11669A79433a8083k7838m1157j282o4725I1064A1113J37127O2260A5723J06976
$$ 179433 -18083 -45921 -87078 -88360 -153085 91064 11113 148240 210500 15723 122699
11658A22699K5134M690g1708p7625e6754l7725B88019m7058I7127M0869j7850
$$ 122699 147833 152523 -71708 -149333 -56754 -94479 288019 240961 97127 137996 120146
11647A20146J68753A23047a1469A95167l4448B6831d5105k969B06562c03730f6543
$$ 120146 288899 123047 -11469 195167 160719 26831 -45105 -48074 206562 -303730 -66543
11635a79508B31191G1260i9419c3433A77737L926L831J7911C2578K5225a07136
$$ -179508 231191 71260 -99419 -33433 177737 181663 185494 203405 32578 57803 -107136
11623c7566f155A32920b4753A10373k564L633f4977B1124G151h040E3956e1218
$$ -37566 -6155 132920 -24753 110373 107809 111442 -64977 21124 7151 -8040 53956 -51218
11610g1758A70273f3353f788k04030B27923K0979d3480j4412b7247C79326a82358
$$ -71758 170273 -63353 -6788 -210818 227923 248902 -43480 -57892 -27247 379326 -182358
11598a43569f5911A43617J7667J39809c7345H4133K13831j02666g9190A45600
$$ -143569 -65911 143617 161284 301093 -37345 84133 297964 195298 -79190 145600
11587I8850K28497k8814o1054C1063f3206j3592A29628J25624e5149j38914G6757
$$ 98850 327347 298533 237479 31063 -63206 -76798 129628 255252 -55149 -194063 76757
11575A81806a43570B73597B8979J19387a22998F1020b99424h8986C91916F8425
$$ 181806 -143570 273597 28979 148366 -122998 61020 -299424 -88986 391916 68425
11564b6872D4584M55933B16714a59092C08260A21463o0265L4090b2744G7275a02877
$$ -26872 44584 500517 216714 -159092 308260 121463 61198 95288 -22744 77275 -102877
11552B6892f357B17502g4462k29801J36415B78707E5908L06632c7742D7402B1617
$$ 26892 -6357 217502 -74462 -304263 -167848 278707 55908 362540 -37742 47402 21617
11540B3872J33925J36114G142a26380o8382I7159A0911e2949j12586b3112n5431
$$ 23872 157797 293911 7142 -126380 -194762 97159 10911 -52949 -165535 -23112 -78543
11529g8543A55170J04845B8714c9163C85076a3864A43047i2731n7668B53473c82820
$$ -78543 155170 260015 28714 -39163 385076 -13864 143047 -92731 -150399 253473 -382820
11517G4729C6481M3380a13408C65939j52316a75146C45667j49993K14425A35752
$$ 74729 36481 79861 -113408 365939 213623 -175146 345667 195674 410099 135752
11506B01075j2723D4844A6156d4796j26896B49153g4055A53402E9668a28812E1922
$$ 201075 188352 44844 16156 -44796 -171692 249153 -74055 153402 59668 -128812 51922
11494H2804r425M6912k4147J60753K21651j50865b17916g9810C27540j39569L5825
$$ 82804 73379 120291 96144 256897 478548 327683 -217916 -79810 327540 187971 223796
11483B23796b6050A47433E0817K73478a52231G5297f4035H2369P2659a28310B77343
$$ 223796 -26050 147433 50817 324295 -152231 75297 -64035 82369 155028 -128310 277343
11471C4772K33622P3944K16828g4175A32971a47438C78094l9992f0910A73795
$$ 34772 268394 342338 559166 -74175 132971 -147438 378094 338102 -60910 173795
11460A72798F3723J41089J20848a37855B83222I0901J63666N219A15632K8300
$$ 172798 63723 204812 325660 -137855 283222 90901 254567 259786 115632 143932
11450A43932J54030A27773K41768B4469a77726d7483A96236a00906G6264e9749
$$ 143932 297962 127773 369541 24469 -177726 -47483 196236 -100906 76264 -59749
11439b56083H0600i7037c3870k22307a08466A02657g4589A01717J78393k0802
$$ -256083 80600 -97037 -33870 -256177 -108466 102657 -74589 101717 280110 259308
11429B59308K2587a6912A83124E9364c34667d1541j67346D5865b15917A59482
$$ 259308 281895 -16912 183124 59364 -334667 -41541 -208887 45865 -215917 159482
11418b04628A5420a59408B58713b06261d973j6097l3541A8436L34400j42580c46615
$$ -204628 15420 -159408 258713 -206261 -4973 -21070 -54611 18436 352836 210256 -346615
11406a30416A28513a56188D9438P9339B5202K23619d2787B52805I8622b36801
$$ -130416 128513 -156188 49438 128777 25202 248821 -42787 252805 98622 -236801
11395A00035c57398b3361j2833j90471m8892d3028A55063i2619A11994K32814
$$ 100035 -357398 -23361 -36194 -226665 -275557 -43028 155063 -92619 111994 344808
11385C44808f5627j45186B69449h0705G3813J86035b55855e9714n1281F9715a47398
$$ 344808 -65627 -210813 269449 -80705 73813 259848 -255855 -59714 -110995 69715 -147398
11373C07252D3796d0140F3454j0045b73684f2137m0398j68099C88194f0204K7863
$$ 307252 43796 -40140 63454 53409 -273684 -62137 -102535 -270634 388194 -60204 -32341
11362c2341n2928J6483i551A1113M28811j94602a08035o5627D063a82472J6255
$$ -32341 -85269 -68786 -9551 11113 439924 245322 -108035 -173662 4063 -182472 -166217
11351a66217C28790C9761M2324J4164m0154J68762H4921a03640F7480b46153M6019
$$ -166217 328790 39761 82085 96249 56095 224857 84921 -103640 67480 -246153 -200134
11340b00134A10077A5486i7526G3707M30499B44410g0334k56673A89709b11573
$$ -200134 110077 15486 -97526 73707 504206 244410 -70334 -327007 189709 -211573
11329A69635q3699h8387k0239J9495K0421j31105j18087a8691D3311B1388i6315
$$ 169635 85936 -88387 -108626 -89131 -68710 -199815 -317902 -18691 43311 21388 -96315
11317d7626G2075J65964G3777h6594E1216K68134h0822o4283g2295G974f3242
$$ -47626 72075 238039 73777 -86594 51216 319350 -80822 -145105 -72295 7974 -63242
11305i065r1818r6418A59012E3899a11648H1611I614b22886Q4111m427K5804d4160
$$ -9065 -100883 -197301 159012 53899 -111648 81611 9614 -222886 -138775 -143202 -117398 -44160
11292G1747e864l82554f907A21969a43264L1035M6037j67125B97153a32752K425
$$ 71747 -5864 -388418 -6907 121969 -143264 -112229 -66192 -233317 297153 -132752 -130327
11281a30327R322J1933k89716a7688k34717B48297D8305J95439p7103B1376g7929
$$ -130327 -121005 -109072 -398788 -17688 -252405 248297 48305 243744 166641 21376 -77929
11269f7280j48137j9243a17165j79404C1342b75394B39104j03087O3179A2490
$$ -67280 -215417 -234660 -117165 -296569 31342 -275394 239104 136017 199196 12490
11258B55691c0103j20220D82005d9024E0447K14283C1100c0599j33672I3224P6210
$$ 255691 -30103 -150323 482005 -49024 50447 264730 31100 -30599 -164271 93224 169434
11247A69434b6398l1223B00991k9166B0513J60718n6144E6799J40048h2421B8123
$$ 169434 -26398 -57621 200991 171825 20513 181231 125087 56799 196847 -82421 28123
11235A58160a35060B01892c0632G4129c7271j09957j63185f6732D1008J78593
$$ 158160 -135060 201892 -30632 74129 -37271 -147228 -310413 -66732 41008 219601
11225B19601a9922A41208a23575C9798J3226P057B0610a80786D6458b44533a21197
$$ 219601 -19922 141208 -123575 39798 53024 60081 20610 -180786 46458 -244533 -121197
11213f0442j35597b9855A74683f503j56143D1835a70614A29684m6027a92190Q7275
$$ -60442 -196039 -29855 174683 -6503 -162646 41835 -170614 129684 83657 -192190 -104915
11202a04915C22747A29919P6253k1954c09815A60544c63569M072M1335d8013j50820
$$ -104915 322747 129919 206172 184218 -309815 160544 -363569 -359497 -318162 -48013 -198833
11191a98833e7853k03262j15926B48973f3313p7829A66170h9435j39775C841L1458
$$ -198833 -57853 -261115 -377041 248973 -63313 -141142 166170 -89435 -229210 3841 35299
11180C5299J34844b23831A07786k8529h7163l865J6033j3237a188k7115E6970
$$ 35299 170143 -223831 107786 79257 -87163 -91028 -74995 -88232 -1188 -28303 56970
11168D3635a0590C8052b7230C2093b17841A35638a6157B73103i8839A19233n4071
$$ 43635 -10590 38052 -27230 32093 -217841 135638 -16157 273103 -98839 119233 65162
11157F5162a63512A74978H1267C3325b51004P6051r7984i5918b3355B15248a8153
$$ 65162 -163512 174978 81267 33325 -251004 -174953 -272937 -95918 -23355 215248 -18153
11145h0861j39126R8423B21844b61577k4990F5235a76394o859g9391b1652H8000
$$ -80861 -219987 -121564 221844 -261577 -286567 65235 -176394 -183253 -79391 -21652 88000
11133B25323L9566a29627b1767B10357a969A08527D0690d7877B64401a26033c7998
$$ 225323 264889 -129627 -21767 210357 -1969 108527 40690 -47877 264401 -126033 -37998
11121B00745B0539L39121j30050j8022q4501D737J77110a50403C41540C7055K20794
$$ 200745 20539 359660 229610 211588 127087 4737 181847 -150403 341540 37055 257849
11110B57849g9714B29382F8646K12467I7605a249B98597A41272J04453p4122j2369
$$ 257849 -79714 229382 68646 281113 97605 -1249 298597 141272 245725 171603 159234
11099A59234j1191N0434n4163R9048q2815K1639e9303A1267J90375p4335c0840
$$ 159234 148043 198477 144314 243362 160547 182186 -59303 11267 201642 127307 -30840
11087I0790J97549n105A11896c8406I9733J90788q4214L6898j1436e1804B55361
$$ 90790 288339 283234 111896 -38406 99733 290521 206307 243205 231769 -51804 255361
11075C09717J5755K52452k48842K46432A40045J86694J15250k04122L8341P3814
$$ 309717 325472 577924 329082 575514 140045 326739 441989 237867 276208 350022
11065C50022L04082k64324j10645K76088j70345K46008K8137P8322j18843M09983
$$ 350022 654104 389780 279135 555223 384878 630886 659023 737345 618502 1028485
11055A028485n07160L73052l80521L3118L17560M3087q562j17220o2731L85824
$$ 1028485 521325 894377 513856 546974 864534 907621 899059 781839 719108 1104932
11045A104932k57535N1075j17812k62119K44125q4968J21539j6168l8846K5074
$$ 1104932 847397 898472 780660 518541 762666 677698 799237 783069 744223 769297
11035G69297o5996j30890R8250R2154K09949j26137k93116K06478o3743k27206
$$ 769297 703301 572411 670661 762815 972764 846627 553511 759989 696246 469040
11025D69040L63373J4167J78745k07309j2616k91536K10150K02120m33333J40873
$$ 469040 832413 846580 1025325 818016 805400 513864 724014 926134 492801 633674
11015F33674J01809j27978K26664k06030R3652j42416R7100j52284Q7756K80635
$$ 633674 735483 607505 834169 628139 721791 579375 676475 524191 611947 892582
11005H92582k21621k14204J66567j560A97652Q29043l36653K7373o3593j73228
$$ 892582 670961 456757 623324 621764 197652 1026695 690042 717415 653822 480594
10995D80594M80055k39362J45738k04594K52975k02220L71931k80516k2326k01206
$$ 480594 960649 721287 867025 662431 915406 713186 1085117 804601 782275 581069
10985E81069L85930J47992j36928K24558K9293J0018L09110k94025K49627K48435
$$ 581069 966999 1114991 978063 1202621 1231914 1241932 1551042 1257017 1506644 1755079
10975A755079J25338M20870J22347J60536L36649J83001P6297Q2038j89103j25534
$$ 1755079 1880417 2301287 2423634 2584170 2920819 3103820 3180117 3262155 3073052 2947518
10965B947518j65027l83712o05913j72818L41096m64547M6005k14594L3164l1850
$$ 2947518 2782491 2398779 1792866 1620048 1961144 1496597 1542602 1328008 1361172 1329322
10955A329322n4387L22874m09718J05313l80407J3079l06234J16391j08329J15303
$$ 1329322 1274935 1597809 1188091 1293404 912997 926076 619842 736233 627904 743207
10945G43207l47929j1999j75120K11418H8739L76181A11827J27717k4854H1360
$$ 743207 395278 383279 208159 419577 88739 464920 111827 239544 214690 81360
10934H0327M50017c4979j34231A39724M6185k4174F5317K09535b71230A06706
$$ 80327 530344 -34979 -169210 139724 185909 161735 65317 274852 -271230 106706
10923F7240a13876M521o9266C07722G5213c5266A802b15822A54877b2177A70146
$$ 67240 -113876 -109355 -178621 307722 75213 -35266 1802 -215822 154877 -22177 170146
10911h4651A98166b8648A34149O858F2520N2438E5219J23841a61113B5748a82195
$$ -84651 198166 -28648 134149 141007 62520 114958 55219 179060 -161113 25748 -182195
10899b91242C3785N5999C2137a861k30774c8834J4864j01465a6078f872C1615
$$ -291242 33785 89784 32137 -1861 -232635 -38834 -23970 -125435 -16078 -6872 31615
10887a4838I1332P3213K69504c06776B35969a70185A5344i3952L4789M744p3631
$$ -14838 91332 164545 434049 -306776 235969 -170185 15344 -93952 -59163 -54419 -128050
10876a28050B31239b66643g2606A34170K40930a43977A37226n4557K4641a28276
$$ -128050 231239 -266643 -72606 134170 375100 -143977 137226 82669 107310 -128276
10865a4974C27467b45534c9603k23846e6472I0304L1245c4103j41393A05434g3193
$$ -14974 327467 -245534 -39603 -263449 -56472 90304 121549 -34103 -175496 105434 -73193
10853A96098h387B25373a49013j39367g6872H2815b32094B27657a10786o344A2219
$$ 196098 -8387 225373 -149013 -288380 -76872 82815 -232094 227657 -110786 -117130 12219
10841b67733A19795J2776J5913R1871c26904I5507d25575J48669b6908B7291b77474
$$ -267733 119795 132571 148484 240355 -326904 95507 -425575 -276906 -26908 27291 -277474
10829C1196b47048G2879e8181m0684B4348h5228I840Q7765J5486a52067L1025
$$ 31196 -247048 72879 -58181 -98865 24348 -85228 9840 97605 113091 -152067 -121042
10818a21042b1432B81737I3267i5176j50190Q1687O0349B37129a48643E53c64345
$$ -121042 -21432 281737 93267 -95176 -245366 -163679 -103330 237129 -148643 553 -364345
10806C3770L6843g2804A48179A0940b17219c8889a405j6302B905d6637m9541A21994
$$ 33770 70613 -72804 148179 10940 -217219 -38889 -1405 -17707 2905 -46637 -96178 121994
10793B56516b54007A46628D6871b6620j46859g9153j00234d5483G9998J0812e4372
$$ 256516 -254007 146628 46871 -26620 -173479 -79153 -179387 -45483 79998 90810 -54372
10781C56698F1752c26860R6796A05334a24641G6356b2417k10340r4396R2969L7418
$$ 356698 61752 -326860 -230064 105334 -124641 76356 -22417 -232757 -327153 -234184 -196766
10770a96766c4590m6975A3384Q6726l110b08242H4985a56163K3361o5670E8188
$$ -196766 -34590 -81565 13384 100110 97000 -208242 84985 -156163 -132802 -198472 58188
10758d0582E3947g7702e895m0288o0652d8569l05851J21041m1774C2410K59318
$$ -40582 53947 -77702 -5895 -46183 -106835 -48569 -354420 -233379 -275153 32410 291728
10747B91728K6560A16897o146i5379m0828M2572G5330J46898j06985D2420B518
$$ 291728 318288 116897 110751 -95379 -136207 -93635 75330 222228 115243 42420 2518
10735a33832o0191J7043f8317k23591J41150j31132A07296c3195A10782l4655
$$ -133832 -194023 -176980 -68317 -291908 -150758 -281890 107296 -33195 110782 76127
10725G6127K10868a02171m8738k9325A92843h9217I1104f862A77133f7398j28371
$$ 76127 286995 -102171 -150909 -180234 192843 -89217 91104 -6862 177133 -67398 -195769
10714a95769Q6471M9468e424C4434A3274E696c3309j03068B9896P9223a97740
$$ -195769 -109298 -59830 -5424 34434 13274 5696 -33309 -136377 29896 109119 -197740
10702I7416d3425J0773B28217o6883D8472c13425B06150d2609A24357J4044m2844
$$ 97416 -43425 -32652 228217 161334 48472 -313425 206150 -42609 124357 138401 95557
10691I5557a73365c15k94709A08567k1486a91258B8935i3681E3763a772A6587
$$ 95557 -173365 -315 -295024 108567 87081 -191258 28935 -93681 53763 -1772 16587
10679b40934B5494a84769D58368d7938q1661L5922A67155a66328h1937A35495
$$ -240934 25494 -184769 458368 -47938 -129599 -93677 167155 -166328 -81937 135495
10668b05114B9956Q8314b54826B47822a11837m29400a69966q8352J6923c7526
$$ -205114 29956 118270 -254826 247822 -111837 -541237 -169966 -258318 -241395 -37526
10657F4259a15003A4547e7902k48570k04044A24614f8261k13655o4946J36566
$$ 64259 -115003 14547 -57902 -306472 -510516 124614 -68261 -281916 -346862 -210296
10647b10296j16270B6158c00275n380J47978q0690a09586n6417h478l36170A99551
$$ -210296 -326566 26158 -300275 -305655 -157677 -238367 -109586 -166003 -8478 -344648 199551
10635B1151Q8670L0452i3827p899D1146M1754b44293g922C1101a19850l4650A56309
$$ 21151 109821 140273 -93827 -101726 41146 82900 -244293 -7922 31101 -119850 -154500 156309
10622E652c86064R8191H4405C9810g3529K835i15F5236L02868a85392j29377B32013
$$ 5652 -386064 -287873 84405 39810 -73529 -70694 -915 65236 368104 -185392 -314769 232013
10609a5118A249R1894a62303C0284K84940a27099C2503e6933m54808E8776j9550
$$ -15118 1249 93143 -162303 30284 315224 -127099 32503 -56933 -511741 58776 39226
10598C9226j1446d89A6866M290K39831a48687A26472a27987j6059A56921C3704
$$ 39226 27780 -489 16866 21156 260987 -148687 126472 -127987 -144046 156921 33704
10586a52620k49863m9631J46585f0264q5859G0696c15578i663A94069c25249j08817
$$ -152620 -402483 -452114 -305529 -60264 -146123 70696 -315578 -9663 194069 -325249 -434066
10575d34066a6325A01443a31673D0192c73409d4748q7443I626K34092a22123F3234
$$ -434066 -16325 101443 -131673 40192 -373409 -44748 -132191 9626 243718 -122123 63234
10563a49542A19762a0871K542A66003a23068B90578A19788A0815N1018c10669
$$ -149542 119762 -10871 -8329 166003 -123068 290578 119788 10815 61833 -310669
10552a947n0996j06309A36457d8465k31089J19062b4263N755M970k35323B64207
$$ -1947 -52943 -159252 136457 -48465 -279554 -160492 -24263 -18508 -13538 -248861 264207
10540A34810J74973L9427b33447E45645a64437H9428K145d510j63229E6014a32657
$$ 134810 309783 349210 -233447 545645 -164437 89428 91573 -4510 -167739 56014 -132657
10528e4325C62277a28694A98210P2322j26839a3639A39869E7935i3808j32098
$$ -54325 362277 -128694 198210 270532 143693 -13639 139869 57935 -93808 -225906
10518b25906k6318j7869b7840l6847k26101C3046C12a13960B82012i5505I5279
$$ -225906 -252224 -270093 -27840 -64687 -290788 33046 312 -113960 282012 -95505 95279
10506C2225a18193A35565O9218c11687C9169a39142B47037a75584q9964B59954
$$ 32225 -118193 135565 204783 -311687 39169 -139142 247037 -175584 -265548 259954
10495a48785b3194j09721N6680B52144A13367c48667a2906n921m3404j28286L8722
$$ -148785 -23194 -132915 -76235 252144 113367 -348667 -12906 -18827 -62231 -190517 -151795
10484a51795J6149a9894j06151A66289F8950J63021n7915j0865l7920n9163c29291
$$ -151795 -135646 -19894 -126045 166289 68950 231971 174056 163191 125271 66108 -329291
10472H37d5894A55498l3930f0609l10585C64399j12469j05781a20975G1416j2510
$$ 837 -45894 155498 121568 -60609 -371194 364399 251930 146149 -120975 71416 58906
10461E8906a34648G7419a0778A20812A2870j720K53831h7152B4557P6967c2419
$$ 58906 -134648 77419 -10778 120812 12870 11150 264981 -87152 24557 101524 -32419
10449A5365b84094e5649j56530A76178a36366A68506d7940D0066c53098A82588
$$ 15365 -284094 -55649 -212179 176178 -136366 168506 -47940 40066 -353098 182588
10438C60994D1892a38509A65315a28923j22501B07385p0087O6887G9917i6360
$$ 360994 41892 -138509 165315 -128923 -251424 207385 137298 204185 79917 -96360
10427B14325a29476A91177b00317F9870K06938b31881k41483g6642r2526D8594
$$ 214325 -129476 191177 -200317 69870 276808 -231881 -473364 -76642 -169168 48594
10416b30073A25492b6032j8547A31037c06330C00091c0353r7799f0793A06724
$$ -230073 125492 -26032 -44579 131037 -306330 300091 -30353 -128152 -60793 106724
10405I9595g4131H9817b95923M8199A44224b3391a1489A12278N3461b40083g9478
$$ 99595 -74131 89817 -295923 -247724 144224 -23391 -11489 112278 165739 -240083 -79478
10393a1808I6500c7293C67090b59353A52704L5788D1509Q1459J64919J8994K91602
$$ -11808 96500 -37293 367090 -259353 152704 188492 41509 122968 287887 306881 598483
10382E98483A28690m6310a18819e6477K1708A42787J32201J10863j650r5186A23003
$$ 598483 128690 82380 -118819 -56477 -34769 142787 274988 385851 384201 289015 123003
10370B05617l6402E7161L71344m9049j2489J55416J26509B32697J45184K47056
$$ 205617 169215 57161 428505 379456 366967 522383 648892 232697 377881 624937
10360F24937k78916D8760Q125L02070e7243A03551R3967R5305j9143K92652B29251
$$ 624937 346021 48760 56885 358955 -57243 103551 197518 292823 273680 566332 229251
10348I02977k17873r9609k33793A18606K98183R11K40264A81573M9591A10881
$$ 902977 685104 585495 351702 118606 416789 417700 657964 181573 231164 110881
10337B11765J19658c6964B30535F0618K48166C9040K85993q0668p2862J59024
$$ 211765 331423 -36964 230535 60618 308784 39040 325033 244365 171503 330527
10327C30527A5850J94058G9667a62618D6983A4579O2688K57295k0485a7774G8049
$$ 330527 15850 209908 79667 -162618 46983 14579 77267 334562 314077 -17774 78049
10315h3673B59480c4946F9555L6580l9035a50826H1268a05698I8112d5562m524
$$ -83673 259480 -34946 69555 106135 67100 -150826 81268 -105698 98112 -45562 -50086
10304e0086p7010D2216a85653B0880L06689A53540m7677f4201k6424B35445J35987
$$ -50086 -127096 42216 -185653 20880 327569 153540 105863 -64201 -90625 235445 371432
10293C71432A44108b1182C680R1275c16697J51708I8992a45270p1214N5776N0163
$$ 371432 144108 -21182 3680 94955 -316697 -164989 98992 -145270 -216484 -160708 -110545
10282a10545m230j85032c3982A96062A773N9623b45591n5537h5838d1295j02759
$$ -110545 -114775 -299807 -33982 196062 1773 61396 -245591 -301128 -85838 -41295 -144054
10271a44054e9060G2876J65472i2375H4405J35242e9174m4510E836c89D2068Q306
$$ -144054 -59060 72876 238348 -92375 84405 219647 -59174 -103684 5836 -389 42068 50374
10259E0374e9A80083H8973k6353L14923A36772A9776e5727G4758h3496E1533A6744
$$ 50374 -59 180083 88973 62620 377543 136772 19776 -55727 74758 -83496 51533 16744
10246A3204O3541k0097a5898j57061B96072A12947a81646D3290a2928A2910a9785
$$ 13204 76745 56648 -15898 -172959 296072 112947 -181646 43290 -12928 12910 -19785
10234G31a94789A24982P2981b11520O6891K3725j53194i0934d3145j91884b4717
$$ 731 -194789 124982 197963 -211520 -144629 -120904 -274098 -90934 -43145 -235029 -24717
10222h8660B34598q9D0535i26C48417A4755J39690b3613F7753K14637j27634a61033
$$ -88660 234598 234509 40535 -926 348417 14755 154445 -23613 67753 282390 154756 -161033
10209A44201d37683A1139E530J9268a17104m7951f1763f224G6191a34121l0046
$$ 144201 -437683 11139 5530 24798 -117104 -165055 -61763 -6224 76191 -134121 -164167
10198a64167b3605D1612c79626a23427A39240b17845C1642a58185k66974e2443
$$ -164167 -23605 41612 -379626 -123427 139240 -217845 31642 -158185 -425159 -52443
10187H5359B4024O633K17129a20638N4202A69350d19181j93249a61328A17099
$$ 85359 24024 30657 247786 -120638 -66436 169350 -419181 -612430 -161328 117099
10176i2316B9714d05073c3997j04832N129j67868B06234e3553i626A0442A634
$$ -92316 29714 -405073 -33997 -138829 -133700 -301568 206234 -53553 -9626 10442 1634
10164e0308j61827j3583P1361J1836j77955A20956J1429g0040k49409J58452A17483
$$ -50308 -212135 -225718 -154357 -142521 -320476 120956 132385 -70040 -319449 -160997 117483
10152i9704A23712C4490b0165A51604a86329j1808k40036a75151c5454C486K14564
$$ -99704 123712 34490 -20165 151604 -186329 -198137 -438173 -175151 -35454 3486 218050
10141B18050q0387a22922A4227a92243A16714a21440A7352c4965E6911g2408j84703
$$ 218050 137663 -122922 14227 -192243 116714 -121440 17352 -34965 56911 -72408 -257111
10130b57111J08210g3520q204A08712c7846H5001J80797a88690H576L9039a56821
$$ -257111 -148901 -73520 -81724 108712 -37846 85001 265798 -188690 8576 47615 -156821
10118A17524e1481n8779G058b65758i4034E2230g8099j8805K6109a268k01479
$$ 117524 -51481 -110260 7058 -265758 -94034 52230 -78099 -96904 -70795 -1268 -202747
10107b02747B23436a25562J8498H9832a85940L180B50742A09213d06008D6146
$$ -202747 223436 -125562 -107064 89832 -185940 -182760 250742 109213 -406008 46146
10096A88695c6219A6237a25814f1316B73850k4596C4310a23006L6522j15028I2152
$$ 188695 -36219 16237 -125814 -61316 273850 249254 34310 -123006 -86484 -201512 92152
10084F9547R6398B6464B945N0950a7322A69905m4242g5796A46075a34493m3016
$$ 69547 165945 26464 2945 53895 -17322 169905 125663 -75796 146075 -134493 -177509
10073a77509B21474G5710a33360A37952J84429e39325a9084j33582o7006A83872
$$ -177509 221474 75710 -133360 137952 322381 -539325 -19084 -152666 -219672 183872
10062c90823I9498g1099A6946A79J5800c1325j03799A05J08480i536G334a22507
$$ -390823 99498 -71099 16946 179 15979 -31325 -135124 105 108585 -9536 7334 -122507
10049h999r1169J4671n586A3281K04717O8716q3928d7005H6937b33122F977R671
$$ -8999 -100168 -85497 -91083 13281 217998 286714 202786 -47005 86937 -233122 6977 16648
10037A6648a96318j21246B50505a54993j3427c7756I3789g4282C2252a73603c7021
$$ 16648 -196318 -317564 250505 -154993 -168420 -37756 93789 -74282 32252 -173603 -37021
10025b99213a37357K2930A17250b59814N0578h6203C2413b16645i5106g819A51743
$$ -299213 -137357 -114427 117250 -259814 -209236 -86203 32413 -216645 -95106 -7819 151743
10013b6784D45a1234j41235B8783k091i8999j54512O2262n4437A61502a2557G4878
$$ -26784 445 -11234 -152469 28783 26692 -98999 -253511 -191249 -245686 161502 -12557 74878
10000f7537k96511J05613c6867A32718o1821a00406J0824r1414g7861j61892j2907
$$ -67537 -364048 -258435 -36867 132718 70897 -100406 -89582 -180996 -77861 -239753 -252660
9989b52660A44468a73580B14297f2287A70323b88870F5789k731b19367n3707J35448
$$ -252660 144468 -173580 214297 -62287 170323 -288870 65789 63058 -219367 -273074 -137626
9978a37626D074c6896A88931e40691c7869q4013a3426A27687j8522a30200e168
$$ -137626 4074 -36896 188931 -540691 -37869 -121882 -13426 127687 109165 -130200 -5168
9966b80162i4157M180j74709F9876c44535J66263Q5808c7524o3350G4308a17560
$$ -280162 -94157 -89977 -264686 69876 -344535 -178272 -92464 -37524 -100874 74308 -117560
9954B1004K44715C3590M1645O676h3360A11921d98498a95057j81436L2012g3594
$$ 21004 265719 33590 75235 81911 -83360 111921 -498498 -195057 -376493 -344481 -73594
9942a95720i3760k59747h2810m9796A61712a9397C24295A48741b65284i600D35806
$$ -195720 -93760 -353507 -82810 -132606 161712 -19397 324295 148741 -265284 -9600 435806
9930b7171j193r2549F5088k5348J71555c17582j53503J79148B9667L9501d5472
$$ -27171 -28364 -120913 65088 39740 211295 -317582 -471085 -291937 29667 69168 -45472
9918a79915a6116n88340F073b68177a4881A89168a98057B55989G1371K1613b16863
$$ -179915 -16116 -604456 6073 -268177 -14881 189168 -198057 255989 71371 92984 -216863
9906b89475A69490a2024j2069n4812q2986o054m3796e2885A96542a82791K1618
$$ -289475 169490 -12024 -24093 -78905 -161891 -167945 -211741 -52885 196542 -182791 -161173
9895a61173g5850o1354J1946D71047c10097J825D1628a4297q1186A10173a82286
$$ -161173 -75850 -137204 -125258 471047 -310097 -308272 41628 -14297 -95483 110173 -182286
9883E6034L1942J0016e8158C53602G8790k6593a46814p6533Q7776B43733C3557
$$ 56034 87976 97992 -58158 353602 78790 52197 -146814 -223347 -135571 243733 33557
9871a46985l3835K7727j1720A35040c6181B04686a26678I4781m6478c17301B06869
$$ -146985 -180820 -153093 -164813 135040 -36181 204686 -126678 94781 48303 -317301 206869
9859A71356c39097a26681B05625A4638J17828b55671Q5156m2721Q0771q4851A38249
$$ 171356 -339097 -126681 205625 14638 132466 -255671 -170515 -213236 -132465 -217316 138249
9847c24328a21395e1751J7538q1744A50007e1598k65339a55184b1768l48210d3550
$$ -324328 -121395 -51751 -34213 -115957 150007 -51598 -316937 -155184 -21768 -369978 -43550
9835I7884a32413j40162d6963j99239B6680b45366A0190a45008j39329A64457
$$ 97884 -132413 -272575 -46963 -246202 26680 -245366 10190 -145008 -284337 164457
9824b19973J8849A04427J1144b1187g400k98927J13723P8901C0151c98411P2656
$$ -219973 -201124 104427 115571 -21187 -7400 -306327 -192604 -113703 30151 -398411 -325755
9813c25755A62206a07528j5262K5527D2177b47872d9944L253k11638a15334J6029
$$ -325755 162206 -107528 -122790 -97263 42177 -247872 -49944 -46691 -258329 -115334 -99305
9802i9305A25796b82587C52609b8581E3828h1466j9419p8295j19078m9082a57889
$$ -99305 125796 -282587 352609 -28581 53828 -81466 -100885 -179180 -298258 -347340 -157889
9790d8404l4723B49969b26510B68N189c42790e0478B3327f5932p0230B51831a52793
$$ -48404 -83127 249969 -226510 268 5457 -342790 -50478 23327 -65932 -136162 251831 -152793
9777g3552o7077j88249a16128b9455A33295a73759G7270O1258a1644l77319N3449
$$ -73552 -140629 -328878 -116128 -29455 133295 -173759 77270 138528 -11644 -388963 -335514
9766c35514a02650A26599n2043b8744k00393A20858a20634A19063C2226d6683
$$ -335514 -102650 126599 74556 -28744 -229137 120858 -120634 119063 32226 -46683
9755b92419f5406A39914K4583E5912O6962b08502G1865J273a64742I7504a00100
$$ -292419 -65406 139914 164497 55912 122874 -208502 71865 73138 -164742 97504 -100100
9743a61822j56482P9555K4641o7625F3301e1199B5715K11750r1119a80865j4402
$$ -161822 -318304 -238749 -214108 -281733 63301 -51199 25715 237465 146346 -180865 -195267
9732a95267Q287p9080a5359G3024b25284b5131j25480j03993A0407e8676j88304
$$ -195267 -186980 -266060 -15359 73024 -225284 -25131 -150611 -254604 10407 -58676 -246980
9721b46980d3241j95734f193r8432k934B58315a76992f4626J7493F9734O5848
$$ -246980 -43241 -238975 -6193 -104625 -107559 258315 -176992 -64626 -47133 69734 135582
9710A35582a27033A84804j992b15509g9803G7934a99647C6846O7388K2242b81479
$$ 135582 -127033 184804 182812 -215509 -79803 77934 -199647 36846 104234 126476 -281479
9698a99097E7676A6467J2086K33056i2690F2207Q5007O5812e245n24350D6444
$$ -199097 57676 16467 28553 261609 -92690 62207 147214 213026 -5245 -529595 46444
9686a8041j62526M5961B93566A9385i374q8577E8956N628B0985J42833k4562i4015
$$ -18041 -180567 -134606 293566 19385 -9374 -97951 58956 64584 20985 163818 139256 -94015
9673f3473k54216e0731o5766A30266n8616K5153a1281l35589C05407b5351k27406
$$ -63473 -317689 -50731 -116497 130266 71650 96803 -11281 -346870 305407 -25351 -252757
9662b52757i4543m72N216j99614A91316e8064p3722j25762a14394j11578M2000
$$ -252757 -94543 -95015 -89799 -289413 191316 -58064 -131786 -257548 -114394 -225972 -183972
9651a83972A91292b38210h6649J9936J6377b2454A25638n1450a13438m9354l154
$$ -183972 191292 -238210 -86649 -66713 -50336 -22454 125638 74188 -113438 -162792 -165946
9640a65946B20787h1224B251R9024a5576A40289a38634B33279B7181c09321L005
$$ -165946 220787 -81224 2251 101275 -15576 140289 -138634 233279 27181 -309321 -306316
9629c06316O2565j18971E8012K33775a41299N8806I1582b55094e1244G1568a71532
$$ -306316 -243751 -362722 58012 291787 -141299 -82493 91582 -255094 -51244 71568 -171532
9617a0331B7869L28543a38862l3263m7948c2483e937k93715a42614A82494b60017
$$ -10331 27869 356412 -138862 -172125 -220073 -32483 -5937 -299652 -142614 182494 -260017
9605a50540F800J88219C3530a03417E0158a62893A47998a08536j0318k1376d5671
$$ -150540 6800 195019 33530 -103417 50158 -162893 147998 -108536 -118854 -140230 -45671
9593c1399B9707J0550a58419A77412b3044l56136B43114H9633B2424a14583p5981
$$ -31399 29707 40257 -158419 177412 -23044 -379180 243114 89633 22424 -114583 -190564
9582a90564r2556d1286j2495E4148B4844O5942a7078k35976O1149A13330a8726
$$ -190564 -283120 -41286 -53781 54148 24844 90786 -17078 -253054 -191905 113330 -18726
9570A00290b7488H2040c09413I6939j9559J22055c38800B3162c7585B66545c66040
$$ 100290 -27488 82040 -309413 96939 77380 199435 -338800 23162 -37585 266545 -366040
9558G4654c43543A02563i2150A92815G0865c23782A0511J37046i07l88977j69131
$$ 74654 -343543 102563 -92150 192815 70865 -323782 10511 147557 -907 -389884 -559015
9547e59015K60295C3386g4886G2133d14092a87150B88862h4340A16092L6662a89140
$$ -559015 -298720 33386 -74886 72133 -414092 -187150 288862 -84340 116092 152754 -189140
9535E1348h566F8692n365f4371l2558L3565j49447N2290M5619j64427o9515M5147
$$ 51348 -8566 68692 63327 -64371 -96929 -63364 -212811 -160521 -114902 -279329 -348844 -303697
9523c03697c6919n1593p2014F9207a8376A62651c01765J35918q0539a9222A94126
$$ -303697 -36919 -88512 -160526 69207 -18376 162651 -301765 -165847 -246386 -19222 194126
9511a01264I5864a65669O9425j43168P7215k49763J61475R2616j5174E6889a8014
$$ -101264 95864 -165669 -96244 -239412 -162197 -411960 -250485 -157869 -173043 56889 -18014
9499a09213L0570j2782D9246b38653b0997B0621N9999K48740E9748K37969a42192
$$ -109213 -78643 -91425 49246 -238653 -20997 20621 80620 329360 59748 297717 -142192
9487A99280q6114J8714a27165O581l5145r0933O8851g3218o2187I852L11622b91604
$$ 199280 113166 131880 -127165 -120584 -155729 -246662 -177811 -73218 -135405 9852 321474 -291604
9474A13882a82618e5095b1148G7875b5457q1362B56009R3318a7844j07997B4189
$$ 113882 -182618 -55095 -21148 77875 -25457 -106819 256009 349327 -17844 -125841 24189
9462b59459R3584F6243a24495A82626m046o1768b46917j88334J99131E0786c3680
$$ -259459 -165875 66243 -124495 182626 178580 116812 -246917 -435251 -236120 50786 -33680
9450d82700C1900K8822a22595O936e4354j6725D1986K0961d3264I17f1117k17130
$$ -482700 31900 60722 -122595 -115659 -54354 -71079 41986 62947 -43264 917 -61117 -278247
9438b78247j9859D25978B9623c16550f5947C0054b79638Q4047c2930A06644a25230
$$ -278247 -298106 425978 29623 -316550 -65947 30054 -279638 -195591 -32930 106644 -125230
9426c34498E6247a16182B95162a37651j36753B989J25192g8082H6441a39511A29423
$$ -334498 56247 -116182 295162 -137651 -274404 2989 128181 -78082 86441 -139511 129423
9414c67167a54420j48487B04314c19558Q5083M2475O8844k97650a00459l29448
$$ -367167 -154420 -302907 204314 -319558 -234475 -192000 -123156 -420806 -100459 -429907
9404d29907d9192A11093J89821J00902a80584j02058A78474a09101A17586D3129
$$ -429907 -49192 111093 300914 401816 -180584 -282642 178474 -109101 117586 43129
9393b27559j44098A29654c49730A35688h2490B41552D3121c3692k5041D4197f9099
$$ -227559 -371657 129654 -349730 135688 -82490 241552 43121 -33692 -58733 44197 -69099
9381E9620K19798f9739A03458a95202H4549a99164c9528A95567A0066K2572a32793
$$ 59620 279418 -69739 103458 -195202 84549 -199164 -39528 195567 10066 32638 -132793
9369c8164a4351l02755f4734k76959B38064h8623a6895n7125N478E2452a04646
$$ -38164 -14351 -317106 -64734 -341693 238064 -88623 -16895 -74020 -68542 52452 -104646
9357D7670b60424l938f3054r3826J1561E7092j4905a89499j44979J65146c8932
$$ 47670 -260424 -264362 -63054 -156880 -145319 57092 42187 -189499 -334478 -169332 -38932
9345a93182N5354B34542h9908n2534p1812a7117I8062a41515C1720a51362E9973
$$ -193182 -137828 234542 -89908 -142442 -214254 -17117 98062 -141515 31720 -151362 59973
9333C4015J49127C968b05949a9585B60022d7237p5427a6040C17734D4170d575
$$ 34015 183142 3968 -205949 -19585 260022 -47237 -122664 -16040 317734 44170 -4575
9321g3614J4116D5265b69272a7523B65832a70915B1704b01216j59707A57523C8188
$$ -73614 -59498 45265 -269272 -17523 265832 -170915 21704 -201216 -360923 157523 38188
9309B28547h6578A4507i6294j02118q421R9743Q140B4055h0355J2893j01713B17106
$$ 228547 -86578 14507 -96294 -198412 -206833 -107090 -98950 24055 -80355 -67462 -169175 217106
9296B8609a00261N64q8298O9528M0600H7136a89977F0223d8379o6474A4175g7022
$$ 28609 -100261 -99697 -187995 -118467 -77867 87136 -189977 60223 -48379 -114853 14175 -77022
9283f5148J0118F6129f2078n0026A21022i5148k74634A52204c81106N4703j07741
$$ -65148 -55030 66129 -62078 -112104 121022 -95148 -369782 152204 -381106 -326403 -434144
9272d34144F215d9767j86787N9500l0962C47491F3712J67346a91761B8698J64050
$$ -434144 6215 -49767 -236554 -177054 -208016 347491 63712 231058 -191761 28698 192748
9261A92748b13033B14466a14929j88390N5797i6085B72104A6103J55709r266m0013
$$ 192748 -213033 214466 -114929 -303319 -247522 -96085 272104 16103 171812 162546 122533
9250A22533e4440a7739A22916b05367R5397l0944B4882g118C11540a76280B69121
$$ 122533 -54440 -17739 122916 -205367 -109970 -140914 24882 -7118 311540 -176280 269121
9238a2356k19427h4787B17128a99587c2216k16862m2877A72214a33472J8446B66030
$$ -12356 -231783 -84787 217128 -199587 -32216 -249078 -291955 172214 -133472 -115026 266030
9226A32830f6937l9172j23159a1320n4019l39714J78140b7982J3412j27273A18721
$$ 132830 -66937 -106109 -229268 -11320 -65339 -405053 -226913 -27982 -14570 -141843 118721
9214a33731G3781b43274j09148a32088L2076q4340n1816m54Q3081e4808J4438
$$ -133731 73781 -243274 -352422 -132088 -100012 -184352 -236168 -236622 -153541 -54808 -40370
9203d0370q6894j998j8235j6189E1473c08807E2719N720A9779j161b74932M700
$$ -40370 -127264 -129262 -147497 -163686 51473 -308807 52719 58439 19779 18618 -274932 -270232
9191b70232B2145J13259b57495a14083d4293q1131J7609j69732M2692B9305K08991
$$ -270232 22145 135404 -257495 -114083 -44293 -125424 -107815 -277547 -234855 29305 238296
9180B38296p1294D6777M6001J46139j2885i3687m37113B26133A9776k124Q4321
$$ 238296 167002 46777 92778 238917 226032 -93687 -530800 226133 19776 17652 101973
9169A01973b18428A36639A0395J88691p8153N4044b19477j64285E5194b84683
$$ 101973 -218428 136639 10395 199086 120933 174977 -219477 -383762 55194 -284683
9158G222b54835k35977b9075A8743K10779o6570h2657j15702a7044q2313r1376
$$ 7222 -254835 -490812 -29075 18743 229522 162952 -82657 -198359 -17044 -99357 -190733
9147a90733j18871A64278G7882m605K00318c38155a19369A84534C3199b57175
$$ -190733 -309604 164278 77882 73277 273595 -338155 -119369 184534 33199 -257175
9136a68184b0683C58150c09449d1487j51152A22502a46579I4072a2109p6755J8543
$$ -168184 -20683 358150 -309449 -41487 -192639 122502 -146579 94072 -12109 -88864 -70321
9125g0321k18308C49159H5189b3785l75182h1437b0425A48517a07285H3747c66602
$$ -70321 -288629 349159 85189 -23785 -398967 -81437 -20425 148517 -107285 83747 -366602
9113A25858e5935B19270a27640q984A27611e4371D4327g9165B90270d9091G162
$$ 125858 -55935 219270 -127640 -136624 127611 -54371 44327 -79165 290270 -49091 7162
9101f4924D473J2307b19424b7590H3364c31920i3484r411q2267A3314J51689K0812
$$ -64924 4473 16780 -219424 -27590 83364 -331920 -93484 -102895 -185162 13314 165003 185815
9089A85815a35450K9213l9707b3232o3247G5057c93890g7395b5504G5554K7238
$$ 185815 -135450 -106237 -145944 -23232 -86479 75057 -393890 -77395 -25504 75554 102792
9078A02792L4546J694a78555C12920G6082B7444a62991F8671a34294d3608p8491
$$ 102792 137338 139032 -178555 312920 76082 27444 -162991 68671 -134294 -43608 -122099
9067a22099k8545j13692A62015c19765A7318Q0356a86654A76375c32997H2901
$$ -122099 -150644 -264336 162015 -319765 17318 97674 -186654 176375 -332997 82901
9056b15516R8128L7710R569m7038k62981J53663n7948F8781b05810A8346b08422
$$ -215516 -117388 -79678 -70109 -117147 -380128 -226465 -284413 68781 -205810 18346 -208422
9044A82463a00246k86917A61033c78B9593o388a72707g3393c0584k9109n3903
$$ 182463 -100246 -387163 161033 -378 29593 23205 -172707 -73393 -30584 -59693 -113596
9033a13596b071j96114H9908k331f2352A65444a54083L4285k41447g822j61037
$$ -113596 -2071 -198185 89908 87577 -62352 165444 -154083 -119798 -361245 -7822 -168859
9022a68859e3331C4766A1947b46799F8955e42k94841b6473k58593R1631g3976
$$ -168859 -53331 34766 11947 -246799 68955 -542 -295383 -26473 -285066 -193435 -73976
9010d276j72885B7515b3502l48836F0390J89182f2156C16025b20972m2276K1976
$$ -4276 -177161 27515 -23502 -372338 60390 249572 -62156 316025 -220972 -263248 -241272
8999b41272c0203j96210f5781l3616F5908j6247a06145A30766a27652B52916b15080
$$ -241272 -30203 -226413 -65781 -99397 65908 49661 -106145 130766 -127652 252916 -215080
8987A15946e78854A432Q0699b33116B06759a25977B0611a22851k79713B41514
$$ 115946 -578854 1432 82131 -233116 206759 -125977 20611 -122851 -402564 241514
8976d6538A22611a30244A36559J4208b57709j04797a48506a1752r9882K6807c6233
$$ -46538 122611 -130244 136559 150767 -257709 -362506 -148506 -11752 -111634 -84827 -36233
8964h6533A12464L391l6726B7141J2197c3896A66920n0679a04358q4053g3807
$$ -86533 112464 115855 79129 27141 39338 -33896 166920 116241 -104358 -188411 -73807
8952a75588G429c4292k79949I4582d6323k2806k11027A2446c09117I474K41080
$$ -175588 7429 -34292 -314241 94582 -46323 -69129 -280156 12446 -309117 9474 250554
8941B50554j4480a75703j9726J0680b8363F4017k4523a0958j44216A50857E4147
$$ 250554 236074 -175703 -195429 -184749 -28363 64017 39494 -10958 -155174 150857 54147
8929a8466F4789a07768M2076j69920a05930A14171k1177J39096d1893o2051H8182
$$ -18466 64789 -107768 -65692 -235612 -105930 114171 92994 232090 -41893 -103944 88182
8917a19265n6450l5026c6113B09432a76303K9978B4671d4395j09217k95378C05017
$$ -119265 -175715 -210741 -36113 209432 -176303 -146325 24671 -44395 -153612 -448990 305017
8905A2964K13925I2143D3557c44170h1892J8221j46810E6167b31195E902J13548
$$ 12964 226889 92143 43557 -344170 -81892 -63671 -210481 56167 -231195 5902 119450
8894A19450K06265a30453L8759I3488a68515N5980H9017K39521g6800l5060A01774
$$ 119450 325715 -130453 -91694 93488 -168515 -112535 89017 328538 -76800 -111860 101774
8882A97230l9347D3592a58622A58426C9374a65747A96811b315A00983g0592A88872
$$ 197230 157883 43592 -158622 158426 39374 -165747 196811 -2315 100983 -70592 188872
8870h0095k1171B7653n419c23899a36754C04811f9810j67517j3535n5509J14613
$$ -80095 -101266 27653 22234 -323899 -136754 304811 -69810 -237327 -250862 -306371 -191758
8859a91758k70170K23953C04769D0976a87736P3420k13555C6936I543H41N6547
$$ -191758 -461928 -237975 304769 40976 -187736 -114316 -327871 36936 9543 841 57388
8848E7388J06077b71552R9556O8246m2404R985A12301a81357A51372A9437i661
$$ 57388 163465 -271552 -171996 -103750 -146154 -136169 112301 -181357 151372 19437 -9661
8836c18757B27076a30412C8753g1217a9528p024j11565I3869a8149l19500J07623
$$ -318757 227076 -130412 38753 -71217 -19528 -26552 -138117 93869 -18149 -337649 -230026
8825b30026D5008d20903h5136k39003d3029q6010K6072L525j13534A54432d7275
$$ -230026 45008 -420903 -85136 -324139 -43029 -129039 -102967 -99442 -212976 154432 -47275
$$ [...]
##END NTUPLES=NMR SPECTRUM
##END=
