##TITLE=AC1715_NARAH15001_9207329_vqpc6y24Qk
##JCAMPDX= 6.0         $$ Bruker NMR JCAMP-DX V2.0
##DATA TYPE= NMR SPECTRUM
##DATA CLASS= NTUPLES
##ORIGIN= BRUKER
##OWNER= Administrator
$$ 1.72 TOPSPIN		Version 2.1
$$ 2015-06-01 22:16:15.061 -0700  Administrator@X
$$ Compression mode = diff/dup
##.OBSERVE FREQUENCY= 400.02188249412
##.OBSERVE NUCLEUS= ^1H
##.ACQUISITION MODE= SIMULTANEOUS (DQD)
##.ACQUISITION SCHEME= undefined
##.AVERAGES= 8
##.DIGITISER RES= 22
##SPECTROMETER/DATA SYSTEM= spect
##.PULSE SEQUENCE= zg30
##.SOLVENT NAME= COFFEE_meoh
##.SHIFT REFERENCE= INTERNAL, COFFEE_meoh, 1, 14.98509
##AUDIT TRAIL= $$ (NUMBER, WHEN, WHO, WHERE, PROCESS, VERSION, WHAT)
$$ ##TITLE= Audit trail, TOPSPIN		Version 2.1
$$ ##JCAMPDX= 5.01
$$ ##ORIGIN= Bruker BioSpin GmbH
$$ ##OWNER= Administrator
$$ $$ E:\/data/COFFEE/nmr/AC1715_NARAH15001_9207329_vqpc6y24Qk/10/pdata/1/auditp.txt
$$ ##AUDIT TRAIL=  $$ (NUMBER, WHEN, WHO, WHERE, PROCESS, VERSION, WHAT)
(   1,<2015-06-01 22:16:07.967 -0700>,<Administrator>,<X>,<go>,<TOPSPIN 2.1>,
      <created by zg
	started at 2015-06-01 22:15:01.764 -0700,
	POWCHK enabled, PULCHK disabled,
       configuration hash MD5:
       21 0F 79 D6 B3 7B B4 F6 88 20 88 DB 03 48 BD 9F
       data hash MD5: 64K
       EC 4B 1E FC 40 60 0D DE 54 2A 5D 97 62 FB 36 31>)
(   2,<2015-06-01 22:16:11.030 -0700>,<Administrator>,<X>,<proc1d>,<TOPSPIN 2.1>,
      <Start of raw data processing
       efp LB = 0 FT_mod = 6 PKNL = 1 PHC0 = 0 PHC1 = 0 SI = 32K 
       data hash MD5: 32K
       E8 34 1F A0 87 CF 38 37 B7 9D E7 B8 C1 A9 5D 0F>)
(   3,<2015-06-01 22:16:11.311 -0700>,<Administrator>,<X>,<proc1d>,<TOPSPIN 2.1>,
      <pk PHC0 = 90.51636 PHC1 = 0 
       data hash MD5: 32K
       80 34 63 23 F8 73 22 49 F6 43 79 88 17 12 7F 98>)
(   4,<2015-06-01 22:16:11.420 -0700>,<Administrator>,<X>,<proc1d>,<TOPSPIN 2.1>,
      <abs ABSG = 1 
       data hash MD5: 32K
       0A 04 BE FA 48 B3 73 89 54 92 B1 5E 02 0B 48 DB>)
(   5,<2015-06-01 22:16:11.483 -0700>,<Administrator>,<X>,<proc1d>,<TOPSPIN 2.1>,
      <abs ABSG = 2 
       data hash MD5: 32K
       4D 69 63 08 7E F2 D9 BC 8B E5 94 AA 71 AA 04 6E>)
(   6,<2015-06-01 22:16:11.545 -0700>,<Administrator>,<X>,<proc1d>,<TOPSPIN 2.1>,
      <abs ABSG = 3 
       data hash MD5: 32K
       68 DC 80 ED 51 AA A5 07 0D 1B A1 1F 8C 77 D9 C1>)
(   7,<2015-06-01 22:16:11.608 -0700>,<Administrator>,<X>,<proc1d>,<TOPSPIN 2.1>,
      <abs ABSG = 4 
       data hash MD5: 32K
       06 05 98 30 ED 7D 66 2C CB 85 4B 02 51 24 17 97>)
(   8,<2015-06-01 22:16:11.670 -0700>,<Administrator>,<X>,<proc1d>,<TOPSPIN 2.1>,
      <abs ABSG = 5 
       data hash MD5: 32K
       C8 49 9C 4E DC 34 DC DB D9 20 8D E4 C3 1E F7 CD>)
$$ ##END=
$$ 
$$ $$ hash MD5
$$ $$ 43 73 47 A2 EB 7E 96 5C B5 36 6C E5 46 9C B2 74
##$RELAX= 
##$RELAX= 
##$RELAX= 
##$RELAX= 
##$RELAX= 
##$RELAX= 
##$RELAX= 
$$ Bruker specific parameters
$$ --------------------------
##$DU= <E:\>
##$EXPNO= 10
##$NAME= <AC1715_NARAH15001_9207329_vqpc6y24Qk>
$$ [...]
150 150 150 150 150 150 150 150
##$TP07= 0
##$TPNAME0= <>
##$TPNAME1= <>
##$TPNAME2= <>
##$TPNAME3= <>
##$TPNAME4= <>
##$TPNAME5= <>
##$TPNAME6= <>
##$TPNAME7= <>
##$TPOAL= (0..7)
0.5 0.5 0.5 0.5 0.5 0.5 0.5 0.5
##$TPOFFS= (0..7)
0 0 0 0 0 0 0 0
##$TUNHIN= 0
##$TUNHOUT= 0
##$TUNXOUT= 0
##$USERA1= <user>
##$USERA2= <user>
##$USERA3= <user>
##$USERA4= <user>
##$USERA5= <user>
##$V9= 5
##$VALIST= <valist>
##$VCLIST= <CCCCCCCCCCCCCCC>
##$VD= 0
##$VDLIST= <DDDDDDDDDDDDDDD>
##$VPLIST= <PPPPPPPPPPPPPPP>
##$VTLIST= <TTTTTTTTTTTTTTT>
##$WBST= 2048
##$WBSW= 25
##$XGAIN= (0..3)
0 0 0 0
##$XL= 0
##$YL= 0
##$YMAX_a= 598776
##$YMIN_a= -516328
##$ZGOPTNS= <>
##$ZL1= 120
##$ZL2= 120
##$ZL3= 120
##$ZL4= 120
##$ABSF1= 14.98509
##$ABSF2= -5.573092
##$ABSG= 5
##$ABSL= 3
##$ALPHA= 0
##$AQORDER= 0
##$ASSFAC= 0
##$ASSFACI= 0
##$ASSFACX= 0
##$ASSWID= 0
##$AUNMP= <proc_prof1d_extract_pilot.lims>
##$AXLEFT= 0
##$AXNAME= <>
##$AXNUC= <1H>
##$AXRIGHT= 0
##$AXTYPE= 0
##$AXUNIT= <>
##$AZFE= 0.1
##$AZFW= 0.1
##$BCFW= 0
##$BC_mod= 0
##$BYTORDP= 0
##$COROFFS= 0
##$CY= 15
##$DATMOD= 1
##$DC= 0
##$DFILT= <>
##$DTYPP= 0
##$F1P= 0
##$F2P= 0
##$FCOR= 0.5
##$FTSIZE= 32768
##$FT_mod= 6
##$GAMMA= 0
##$GB= 0
##$INTBC= 1
##$INTSCL= 1
##$ISEN= 128
##$LB= 0
##$LEV0= 0
##$LPBIN= 0
##$MAXI= 10000
##$MC2= 0
##$MEAN= 0
##$ME_mod= 0
##$MI= 0
##$NCOEF= 0
##$NC_proc= -8
##$NLEV= 6
##$NOISF1= 0
##$NOISF2= 0
##$NSP= 0
##$NTH_PI= 0
##$NZP= 0
##$OFFSET= 14.98509
##$PC= 1
##$PHC0= 90.51636
##$PHC1= 0
##$PH_mod= 1
##$PKNL= yes
##$PPARMOD= 0
##$PPDIAG= 0
##$PPIPTYP= 0
##$PPMPNUM= 2147483647
##$PPRESOL= 1
##$PSCAL= 4
##$PSIGN= 0
##$PYNMP= <proc.py>
##$REVERSE= no
##$SF= 400.02
##$SI= 32768
##$SIGF1= 0
##$SIGF2= 0
##$SINO= 400
##$SIOLD= 32768
##$SPECTYP= <>
##$SREGLST= <1H.CDCl3>
##$SSB= 0
##$STSI= 32768
##$STSR= 0
##$SW_p= 8223.68421052631
##$SYMM= 0
##$S_DEV= 0
##$TDeff= 65536
##$TDoff= 0
##$TI= <>
##$TILT= no
##$TM1= 0
##$TM2= 0
##$TOPLEV= 0
##$USERP1= <user>
##$USERP2= <user>
##$USERP3= <user>
##$USERP4= <user>
##$USERP5= <user>
##$WDW= 1
##$XDIM= 32768
##$YMAX_p= 436081428
##$YMIN_p= -669532
##$CURPLOT= <Network HP LaserJet P1505>
##$CURPRIN= <$Network HP LaserJet P1505>
##$DFORMAT= <normdp>
##$LAYOUT= <+/1D_H.xwp>
##$LFORMAT= <normlp>
##$PFORMAT= <normpl>
##$SURQMSG= 1
$$ End of Bruker specific parameters
$$ ---------------------------------
##NTUPLES= NMR SPECTRUM
##VAR_NAME=  FREQUENCY,     SPECTRUM/REAL,   SPECTRUM/IMAG
##SYMBOL=    X,             R,               I
##VAR_TYPE=  INDEPENDENT,   DEPENDENT,       DEPENDENT
##VAR_FORM=  AFFN,          ASDF,            ASDF
##VAR_DIM=   32768,         32768,           32768
##UNITS=     HZ,            ARBITRARY UNITS, ARBITRARY UNITS
##FACTOR=    0.250966925370066, 1,           1
##FIRST=     8223.43324360094, 115760,       -71089
##LAST=      0,             103289,          -144606
##MIN=       0,             -669532,         0
##MAX=       8223.43324360094, 436081428,    0
$$ Real data points
##PAGE= N=1
##DATA TABLE= (X++(R..R)), XYDATA
$$ [...]
23870 210754 163701 -91683 -325583 69750 -32718 191206 -221949 -106557 -224961 204039
23859 -97221 -163387 185437 -20768 80011 -52505 319056 75738 -111824 54522 82990 70959
23848 70959 -119528 -135589 144179 -71367 -94953 32470 16492 208705 107794 -231397 117843
23836 -127779 -222109 -34618 -189985 123430 74578 134631 428334 46077 68380 -46102 -140301
23825 -140301 122838 -39385 -89377 -68473 -156890 99634 -62924 -153941 121565 -11478 -107413
23814 -107413 364344 -161027 -55697 -161169 28449 -18323 -64323 133050 -194076 124170
23803 -106863 198839 172295 -57654 1504 -54957 -47708 -162520 -10560 298165 47145 35636
23792 35636 12708 11342 -42915 609 -77707 -192967 28303 -148560 36433 14792 106361 1401
23779 67666 201131 -164647 17876 -206647 -290724 83616 193940 -350937 38769 -97078 -26882
23767 43025 -70499 -168513 -41625 -14458 -202334 162828 209716 82657 -257681 276163 -68037
23755 49915 160655 194083 -79902 -142525 251946 -159839 -196292 146712 -1024 -117066 -284291
23744 -284291 59106 -129157 -54582 -74732 -248975 -68440 222351 99387 -509830 -32429 -125755
23733 -125755 143405 -19591 226138 -18210 -266985 -140866 -211284 137146 -105002 17079
23722 82725 352543 -126013 -167193 138612 191279 138550 -131736 79044 -31852 79768 118846
23711 118846 -68877 -84770 68530 103765 -1262 -392849 -93333 -177306 197511 -57081 197697
23699 -79270 159147 -22303 -140476 -309079 -104586 210058 160691 -2928 -62304 48420 94310
23688 94310 8337 146811 143823 -135479 -305384 254008 -29905 -183271 176456 -274173 21354
23676 -3892 -117838 283232 -33792 -185113 11029 25266 -53782 -143710 370136 30828 5232
23664 26109 22621 13480 195027 108044 29785 269948 -239336 237698 -4470 -13407 -18157 -198764
23652 -198764 72688 -144163 179805 -113280 -119483 95704 -207929 53811 90884 -25583 -33786
23641 -33786 -42746 120840 -103552 379410 -258951 17542 117470 10168 -106252 -44671 -223521
23630 -223521 83655 -10242 -304047 -119960 131427 -147791 271903 -171015 136396 -69022
23619 -204385 183525 -214090 -73109 59743 -15669 -21778 3861 -153922 11094 98320 141853
23608 141853 -107487 -82108 316429 -152210 -209440 -27901 370137 -43955 -58543 234829
23597 -4008 -219258 32917 202336 -129858 267746 131948 58781 -70330 27871 164288 -168734
23585 151381 164993 38161 -94390 -28464 92445 -147001 69269 168604 183426 -3900 -175097
23574 -175097 -105558 -202374 -253857 346723 45489 274389 -171423 -117774 72318 -45464 -71551
23563 -71551 53142 -162291 -22130 59379 -179083 221445 26169 22602 70424 73977 -337107
23551 107996 75016 207303 -18132 319396 32973 -403572 -289112 256827 -152886 -19714
23540 -297973 247524 -199516 119608 -158038 31706 250572 122522 204238 -113150 143750
23529 -327381 318776 -281202 74606 38107 47305 -133663 85200 212716 122760 164104 -250813
23517 -97808 -99916 -56465 -105067 225922 -39129 -122808 -164838 -316825 -150289 -296021 156809
23505 7404 -44554 424737 198387 122389 74415 -91379 73147 244664 -232746 57354 -110577
23493 -89134 -24498 23808 -108894 -62315 150888 61600 -257526 -310351 -156048 54191 -69179
23481 -146562 264120 188322 6022 136158 -6737 -310067 -131151 -11285 -119796 224430 -142417
23469 50995 304422 154486 55622 -18555 -138961 -160665 -6206 -118065 253184 -96012 -79040
23458 -79040 -324168 107092 -183430 40998 170019 60835 27357 -33197 -124010 115263 124805
23447 124805 -326064 -72209 -51869 68578 173232 -16897 30235 91648 -149752 252747 -8226
23435 82502 -102682 31251 9498 -137838 85812 104857 -60112 -3091 -194434 128704 -23449
23423 -138057 248943 35229 83966 121050 -120061 -137380 169724 -96688 -66934 -27639 54514
23411 176137 -140046 116239 116635 -217896 57939 -33306 -45582 -114979 174645 -101477 -14170
23399 -187488 182530 -255032 -33351 -104419 -184429 68946 -5230 236772 176908 111364 -182767
23387 -127764 33762 236099 223460 43455 -199738 178301 136006 -298352 -197899 37051
23376 -281166 305862 -168119 112233 104602 -130586 -38403 72496 -60568 -25576 147252 -23712
23364 -231341 -3166 265777 112358 -155240 66355 -112093 -157371 -323848 82242 -15872 -164018
23353 -164018 -63911 -41918 -151887 37132 179473 -52359 9936 -171683 -132548 80751 -102866
23341 -52623 -151143 -22969 -176286 -226873 -202356 297615 113770 14300 233949 -258286 -242405
23330 -242405 134298 106334 67685 274537 -204701 -10042 46639 -231254 -43031 129322
23319 -68510 -71190 15434 -277211 1910 121120 53562 -262247 43554 -104915 -291782 -121626
23307 -187496 -153689 223907 116504 -300914 -60341 108857 167442 262683 -12248 13903 -174335
23295 -309152 -47689 -4848 -109239 35940 152490 -25344 -51683 -46851 -40534 -80699 49082 -68077
23282 -96896 22327 253944 -36398 435998 144336 -84623 169900 -96317 266102 -112831
23271 -17211 114588 -127609 -141377 -135622 -345861 -464220 -148449 69568 -291432 -22232 109163
23259 36125 272631 -119837 20317 -73419 -125684 -63144 46857 102011 -205382 43375 280115
23248 280115 51976 -346221 -70486 117500 72385 201579 160164 -250206 100984 128491
23238 128491 -149862 -53018 -10923 279310 91497 -55148 66149 -60215 -45322 -297921 -58887
23226 -250122 -156898 -226797 -89219 -194159 -167891 49189 182488 -243633 -191356 -156223 -86360
23215 -86360 276736 291226 215644 208585 -6372 52161 185386 -285870 -299418 193643 -9647
23203 -149284 -147119 -3443 -323053 17238 -67090 296277 -32194 -138544 -122084 -224286 263411
23191 -121205 -125384 -26230 -15021 -26619 290392 45747 -294798 -116894 -115795 -202194 -229932
23180 -229932 275216 -28612 120252 32449 28370 -140890 125580 -113986 5339 -74179 -109629
23169 -109629 98415 -48237 -100887 82615 -144697 -110815 245721 167589 196770 185776 122793
23158 122793 -145528 -90483 -268544 -107634 -79398 197978 53626 -188686 -219953 -21966
23147 -213378 -67191 87399 146637 -156589 170174 297095 274627 12855 -11121 207710 112408
23136 112408 -465590 -188676 131516 152353 -50733 141482 152065 -48431 28891 -130431
23125 203597 -164823 291743 174257 -279812 -45648 56938 -39187 191302 235468 298224
23115 298224 104286 -130788 34636 94735 51410 224581 -69953 -39551 -46507 63625 137108
23104 137108 -143568 62731 12076 -49178 -99242 -180922 -9839 75732 -67560 -53887 -355238
23093 -355238 152828 -60842 -159604 -59791 36008 -144528 -61881 52162 203702 81845 -78564
23081 -28099 361475 48434 -132604 -151616 106942 208540 330299 -34320 101182 -176051
23070 101631 -453232 138899 65829 161812 256102 -64536 -79841 21730 -256871 86205 99251
23059 99251 -241922 71199 254766 -100996 -189768 -229098 -19060 200203 24448 329744 -168319
23047 392613 -195002 -258768 233065 -169951 -202440 49311 350135 -148813 -109414 -45439
23036 153406 163818 5069 -99670 -89479 -233293 120746 -74720 -173557 17571 290273 -87331
23024 -211215 -95149 369746 60909 -131039 -28304 79814 -5001 -123037 -129806 -277877 96288
23012 -240768 261631 96103 64486 -51550 -135401 37914 -199222 187530 97516 24025 -1431
23000 -31130 121090 -302789 -207176 69439 394789 -70109 -94755 -59153 62553 -7212 -344547
22989 -344547 157176 -17122 -249750 280194 138676 3551 -60622 175005 66053 -398654
22978 107295 -141428 -314734 -159261 -175642 78108 -6905 -156111 -377842 -229639 258423
22967 56601 139645 -25503 -136164 179334 -205277 146164 -176353 -418171 106885 252551
22957 252551 -22972 -185874 -44955 50105 -223382 -25732 -104223 26963 -78384 -154373 -87523
22946 -87523 129384 -127038 235130 -251173 -165515 -280066 -111826 167559 83173 206999
22936 206999 21383 12440 188216 145482 98198 38858 193559 -33607 135888 -51957 -243233
22925 -243233 1104 -137692 18585 -216673 -252509 -180242 13546 -27464 67335 10242 65212
22914 65212 -147865 238693 -127452 78955 -21230 86494 -161631 38578 -171995 -117202 165746
22902 -101457 -175347 -307552 130590 182670 -308290 -340018 226365 80732 148994 -17615 -25937
22891 -25937 14267 19849 202602 91016 -227479 183743 -13304 135459 -54182 -31334 -164281
22880 -164281 162565 -360008 -47957 -98484 55211 153404 216873 -144690 20146 -192224 -92207
22868 78529 -131948 17866 238410 -111339 -466783 33124 -97986 -150093 -336295 189059
22857 122656 55401 -143576 23687 -65549 -217620 -69474 104263 -395820 -3214 -105222 -234665
22846 -234665 97539 113746 -22861 67732 29803 98802 -112676 167486 8819 -10731 -110159
22835 -110159 -162340 159945 116420 -301801 -35344 -168177 -27413 -41165 264179 83880 35904
22823 -118180 -60566 94950 102974 -384570 120742 -184275 -353902 168303 -119059 -241963
22813 -241963 -119466 -210984 121444 -75670 -174276 -32786 198131 -6578 -129098 36542 -273686
22801 203941 -34617 314584 118459 193660 -73699 127023 -67807 -13020 -34393 -237855 9737
22789 -270986 236704 364474 40370 -76758 -83297 268451 72096 -217221 131943 -262277
22778 79469 -37469 155948 215705 -63055 -4426 -397251 313703 -93207 -141200 -12880 68217
22766 84450 -265181 -10130 -181053 32048 -493711 161867 58074 232620 -65569 250190
22755 116036 148885 47880 -13866 351811 117360 -193946 57111 196498 -482554 -166379
22744 -79524 94881 -96210 -143734 189209 -128481 34169 -97615 -117474 -74203 15207 -10069
22732 -371778 -14891 151029 -97415 71605 76301 78319 21441 11256 -6061 -18613 -326347 42999
22719 -214585 -103597 -23619 -4513 303197 -330659 22934 -382338 -121651 148094 -48920
22708 -134991 162361 180288 29528 -122907 -153150 -149208 49760 -278514 -60952 114779 -325484
22696 -7426 -31480 -196597 -174352 104602 161375 -119728 108199 214664 104355 220333
22686 220333 132254 15693 400056 102901 -101106 92584 -275908 425250 -78644 -85394 330494
22674 150252 97562 -19331 -161612 -14800 -178043 -231541 14989 40855 -86167 228409 -128846
22662 -274500 29737 -139662 -7252 -178563 161701 20179 -279048 -70818 -308599 10365 -258390
22650 -222396 -97210 -278470 -6671 -13198 -55694 -86086 88184 -177048 -355831 -103078 15879
22638 86238 65480 -146926 -219472 5898 65087 56926 -8975 154316 114850 114815 -144388 56336
22625 -224888 -34656 145123 -147323 -178138 -70435 -57775 -122732 -46889 242035 43695 -86469
22613 -80852 84787 -53396 -70729 -208809 138818 -137645 399007 182308 133899 106730 234623
22602 234623 -78727 -139649 -101284 8964 291814 -133675 -157457 58225 151268 -265288 7933
22590 -346894 -172323 -127961 -219992 -251443 86936 -109815 -17346 18922 -205910 -206956 49669
22578 -66246 -7446 -24238 -70795 -84759 -14242 -271144 146179 99776 -70395 140573 -348403
22566 347190 -134590 -202752 309388 140924 47193 -112389 152619 -265785 7455 -184092
22555 -159433 -109398 -27136 -259262 -211556 11623 -211314 165413 -115693 -138041 63433 -113300
22543 -55260 142465 45638 -316975 -201587 -34976 -115496 46519 -185976 85560 3993 205473
22532 205473 -237248 -59358 92992 67743 -24027 -125804 -141880 -188079 -213320 -26135 -81298
22521 -81298 10472 -106985 -404189 -64166 -115158 -135966 63176 75514 87669 -241674 185966
22509 -201876 19561 -116574 -258661 53355 -82044 193867 -302203 -159393 -54704 196340
22498 53504 179127 -102798 -115166 -75275 -96430 -143369 195162 80048 -81907 -236926 73469
22486 -18156 -92655 -253322 -31109 115148 191423 63416 -110498 -211444 104827 94863 -61908
22474 46593 -280445 137849 68089 -355726 -105047 358856 -1099 -57313 86278 73419 -184934
22462 109143 -451885 59759 -131109 -314068 29889 -331620 -132418 -7535 -13835 15179 -173223
22450 -111504 83397 -56231 68300 -92994 -107827 -271521 45305 7022 77706 116356 36165
22438 -321889 -53399 -223162 224217 27689 -149663 -99227 121671 -260195 -289 33949 47507
22427 47507 -354085 66131 -175640 -226368 -53765 -906 309302 -283466 298006 -21262 -234725
22416 -234725 -135006 -18112 -38893 -96603 -83602 -1438 171289 227989 -39680 28259 -5825 163921
22403 21648 -34090 88482 -82110 -242944 6008 -83991 -115470 318576 391129 -279428 -112705
22391 248237 39775 -141096 108383 52993 -18017 -136671 68034 -234489 -120672 -80689
22381 -80689 -256262 -160265 89480 -168750 -164287 44467 292569 9014 200511 201593 -136477
22369 -8791 -7027 237511 -124306 -83961 3385 -456573 -260111 178451 88198 -189397 10244
22357 -1715 43328 10246 -511074 133474 47802 -42719 244444 -224633 4858 -236968 271198
22345 -157890 -142672 -40506 -95926 261338 -128251 -15715 61602 46525 -161590 -112028 58660
22333 -210759 208785 148094 -45032 -8898 140506 159747 -126667 18399 328028 74045 66340
22322 66340 173723 210717 33672 -150643 -237810 56382 103062 -5700 104657 95284 59885
22311 59885 -5463 -317312 222542 263690 -9107 -2972 126796 -335741 -61029 172811 157991
22300 157991 185430 -290490 123337 -69753 120659 -73122 257241 -84078 -286766 -106204
22289 -226424 353279 -158346 -251735 32633 -133417 -99298 96266 209768 1525 -193187 -118647
22278 -118647 -91484 -80577 -284067 -89402 -186200 -171969 -146241 -295823 -316676 -25645 120428
22266 -306001 130349 391804 -53390 -70331 -57591 -35443 -316814 -30934 -129129 -155471 -205355
22255 -205355 -117408 -92006 -59283 -130505 -40751 96415 -309459 271126 -266624 -25807 -91447
22244 -91447 119834 -274088 -124213 34324 16142 58893 15068 -411559 -233960 -270993 123596
22232 -131720 365742 289122 -232985 336094 80111 123405 -241515 6430 -44363 -179296 -208783
22221 -208783 98600 -161545 -74877 224364 209225 26329 -35305 -137326 -71878 17384 -66306
22209 -186817 166452 30816 -169774 2470 130123 199778 246480 -86758 -149429 55793 1288
22197 -57786 -131650 -212001 -95533 16749 -124100 4910 17443 -66108 -169054 6275 34464 63028
22185 63028 -143552 -225250 -76282 234832 -291814 51379 126553 -112897 -29681 -105514 204841
22173 197689 5610 62277 68774 -8802 -41520 -63419 57766 97739 -286269 -184015 -252454 -240401
22161 -240401 -152009 -19981 -201006 -212480 220573 -124287 89226 -79358 -33278 -15077 130238
22149 -222 -190650 196092 112337 16672 -3713 12639 -95171 -196611 70957 68484 217508 -48698
22136 -61299 6700 340651 262220 93442 -204573 106129 176405 -59747 125561 -72451 70331
22124 80112 108729 216867 86452 -419833 -144972 107722 -407973 37459 -245095 -94070
22113 74059 -170378 -43822 109919 72595 -198120 -204345 298210 219647 23419 -290238 66907
22101 -452664 -197871 -121622 -345776 -246167 -4852 -427249 -153577 243479 -88624 306399
22090 -35996 -363058 -252796 33031 -129747 -93235 148090 -166054 -211116 27239 -242590
22079 94649 -214252 -138521 39272 7952 41017 -32032 58968 31640 -83429 -31287 221650
22067 -202279 -10683 88707 176891 81202 -145226 50820 -23285 -303374 261764 -119650 -22656
22055 -121201 -34679 -21524 -52623 90160 -17453 -268376 99487 -63343 154431 135935 -346380
22043 -60351 281 -169982 33276 -141752 -172594 -36208 92689 -9100 518705 -36425 -100016 178631
22030 -15892 -192091 144314 7217 -182072 109997 -250372 -285088 41646 49559 235448 -40683
22018 137918 -56419 187418 -68236 40917 5033 56245 21209 -268442 15106 41732 195993
22007 195993 -29212 -173662 -35818 -12287 6318 -1677 -186955 -83810 -50755 -196790 76712
21995 7228 -53278 -256179 245273 63486 -308967 -247594 -43566 268987 -195915 277250 36158
21983 -74678 -190742 -379476 217205 180213 -151613 -221630 -315094 281791 -375195 64576
21972 -74017 -328100 -177341 -300483 122611 90145 182087 -217159 46613 -277596 159411
21961 209784 -204674 -242787 183160 88406 -323554 39302 151009 203023 -224971 -180496
21951 -180496 -72687 152750 -185670 -6820 -192219 25411 -277235 -201954 -100518 -41444 79368
21939 48868 -52159 299600 -69341 94002 60628 -32995 182384 -101082 299567 -176191 115331
21927 -61507 53687 281140 -234342 -220200 -239245 -76818 266521 -153631 -92850 123324 289819
21916 289819 19203 318456 -112788 -212538 -190674 -138467 3385 277445 -4340 192765 -560924
21904 -97523 -192917 -155272 -202113 -29404 33184 80 -182722 67969 113007 -369444 9515 380141
21892 380141 19767 -117995 227250 -116938 -89273 109408 -60746 -186119 -142950 -8153 -23034
21881 -23034 78453 14300 -49762 -94162 -77250 -258957 216461 -122029 -322784 44781 12632
21869 123878 267495 123180 282974 148791 250311 23483 241067 66168 -199446 -66585
21858 -104754 -15883 170642 -165761 -40720 -126800 3105 29247 39470 -238695 140619 23635
21846 -407708 -136529 -98351 -49957 -146786 -120863 225389 -57451 211641 -43701 -271216 -255953
21835 -255953 38886 -442689 -294838 -220769 237480 -199051 -242898 -373106 169657 -155725
21824 105230 -37512 -274960 35561 -24051 -29088 -119291 -234341 -99738 277436 282295 -94808
21812 -192679 187388 45028 378548 -474252 2621 -181794 34594 2885 80249 43223 74380
21801 74380 83800 15128 135447 -106179 -181420 -236813 -73118 159114 -57560 4526 328409
21790 328409 -218163 95607 -92027 -16358 -55355 -171629 -98666 94548 12149 -42180 -60352
21779 -60352 -231564 -43869 -43673 -197453 -213141 60052 -385902 64962 -155687 -114509 -44530
21767 -151176 -25469 177819 338896 196805 -118148 -216182 -100234 -15881 -106469 46101
21756 154265 -144790 -133837 175707 -50184 234774 -180626 240930 183797 -242459 237833
21745 -174900 -115333 35188 -1373 4931 -331031 284609 14091 -52791 -178522 -258791 32823
21733 -64773 -70751 -77056 -144887 125711 -174147 107498 169272 176468 -80283 -14363 -41048 -136620
21721 -136620 -115425 -345118 -32231 -174729 -102562 194833 -48665 76011 -134554 -4593 87337
21709 211326 -239555 156998 -240276 22266 -247838 -1942 -169609 -158812 48265 -16486 183699
21697 247670 -118599 13331 -87621 -21729 -216429 139408 71323 -194615 98064 110021 -141520
21685 -83177 -66251 199481 -24990 -236218 -168048 102561 -183036 -40249 -103334 47925 -145616
21673 205453 -48430 14017 11158 -164278 -22135 117721 -122879 140014 -286647 -17986 8890
21661 -133057 -13778 61738 2895 270128 -49418 416759 148579 -253367 -70700 -108092 -219953
21650 -219953 -191037 212620 64647 -44378 63327 35592 288298 -125371 -56105 2260 151055
21639 151055 218764 -10995 -78272 -102365 147106 143261 -214620 254648 -244383 -250060 -34192
21627 472 147602 175503 -87633 -90873 41104 -138992 25397 -216406 -50566 -100315 18409 -138096
21614 -55583 -34114 107786 -201757 -31585 -36260 -313667 80583 7763 232790 -162392 4911
21602 24746 -389384 -216499 -151401 77040 100248 -81557 46869 150656 -103079 349061 -260054
21590 -48414 -29421 193652 160380 -144123 -332073 44889 -80582 252509 -67483 360348 -77479
21578 -43951 110298 48191 -226026 221200 340361 -242519 -165013 -146497 85744 -96718 -284970
21567 -284970 152095 -28201 -52240 45490 -234295 -100402 -142677 -493299 -160508 -7099 55207
21555 258004 -274485 -215861 -181505 -116191 139694 366814 -40648 76752 38838 82729 -81939
21543 -343317 -17950 -173037 -197539 -2689 -206608 -12559 -90197 160452 149265 -38545 -30307
21532 -30307 -307760 -140910 -55028 -47597 -841 -251785 -204833 190656 -64318 -386118 -311278
21521 -311278 -343042 -79282 -26768 -12788 -34306 127501 55357 -186596 -184696 -199265 -81006
21509 -35426 84278 -74970 -329919 107613 209815 -94944 42026 -221553 -12117 10284 -90225
21497 61576 156278 21063 29190 111474 -330803 16790 69118 46971 -170808 -130048 43186
21485 -162035 -29089 -160045 -27858 -52448 65768 -47208 -125129 -140107 -264833 -319509 -133628
21473 -40497 -100264 -2166 -167520 -398212 -177986 46704 -265254 151521 -225916 53010 34953
21462 34953 -395489 41999 88416 134537 -11125 -25749 -189293 -220730 -105305 -236748 -81830
21450 -283713 131958 -12550 -74712 -85069 267851 39296 -14455 -8804 93213 240366 465967
21439 465967 -89348 148741 61226 149953 74527 -116757 211412 156629 -192190 118801
21428 -45453 -70787 316516 -162015 -158927 -50464 -156615 -93375 172246 30604 -87628 -27080
21416 117476 -102435 232994 5766 111282 143835 -51995 -166447 7469 432 -456435 98391
21404 -243951 298430 -208742 -396158 -85838 -68309 279801 -149409 -105689 156759 -106727
21393 194216 13695 -439053 -97754 -10555 -204688 -213558 277974 -131532 82949 -73369 87183
21381 342308 -217828 -155113 -156798 255765 -113141 -35738 175366 -311148 -57445 -126594 158436
21369 130901 -250858 -290283 142018 -47524 218364 10187 -16758 -107637 63382 -95080 237813
21357 28126 -110678 -432 -37992 15824 -168543 -140733 -86904 144689 -105345 80216 -653639
21345 15991 20583 -24296 143149 24008 126599 148015 11739 -241306 375453 132463 197916
21334 197916 -21599 21131 158332 -30258 -100723 -5792 125902 -287167 24728 -166784 -214804
21323 -214804 165483 -51231 -59303 -113782 -188498 -297063 -40162 40733 137554 426440 -51953
21311 -301192 -66640 -5372 -45324 43485 -210330 241488 -25104 104453 -51313 193220 67093
21299 -169783 -313944 -91599 42920 -171226 -325543 -95007 -428036 -9502 -187344 -48488 -158824
21288 -158824 -5219 -42952 41881 -29097 -55213 -55966 -154851 -155779 197945 27058 -131302 -144985
21276 -144985 -48778 -21826 256594 -18479 -10901 -61971 -130162 -50661 77489 -72171 -137816
21265 -137816 16272 88412 42005 19811 221657 194613 -128106 29728 38244 362992 30680
21253 25837 -266921 4390 105305 -90147 -189797 -97001 -302096 -50067 233910 -108813 3774
21241 -248626 -55469 210080 -15007 298827 -323442 -35593 3435 106698 -286948 -131094
21230 -107979 -17195 78855 -140557 -53240 177125 308070 -5488 -72491 -227745 23818 -123667
21218 -173304 -39431 -494952 53864 113546 214530 56418 -80891 72881 -324064 -89437 -126158
21207 -126158 -137989 -27543 -101441 -122539 -92528 80504 -33672 -340239 55368 -79219 78957
21195 132396 -209107 236775 29885 -34004 74736 -293679 -84031 -362519 -15152 -42001 32589
21183 275690 100839 -170448 22499 -36318 -123542 25738 -172171 -165988 -164560 -116146 -21539
21171 19676 -296297 -108901 15563 126244 -152474 70688 -26475 7732 72065 -219442 -114912
21160 -114912 114413 -123631 -39359 -164111 -15957 -226524 -74107 43668 53914 1642 -339342
21148 -132171 158151 -69409 145481 59272 12921 -49746 139193 46685 -204329 -90428 -126532
21137 -126532 230552 145525 160694 -121675 49560 -295747 2376 89027 -374001 -194544 -182549
21126 -182549 -307951 229374 -156612 -230326 -28228 -79715 -284764 70323 -81027 85986 60060
21115 60060 62794 194063 53694 142409 -83385 8167 32425 -136290 135414 16849 -44690
21103 -186420 149241 -128054 -119299 -299083 -23978 141352 -112606 295133 149113 -6705
21092 -49462 4205 266915 69437 -81808 -358725 -2080 -67648 -92734 12095 -96393 -231610
21081 -231610 15302 -47244 -26376 185148 -255633 90026 -126676 538 210342 -82347 112537
21069 56425 -214883 -208618 151476 123347 9202 -92931 -184977 -96028 -54054 46476 94632 -200342
21056 -84817 -170934 158427 -121843 -318174 -74974 -3111 227602 43784 -122988 -96206 -120265
21045 -120265 -88977 -139906 -163213 -290942 -64380 -97516 -134668 368819 72362 106224 44123
21033 22272 5444 -157098 445365 -77444 -180031 43024 -139475 -847 -164520 -154646 -217569
21022 -217569 -319321 75146 -111495 -171231 -49201 -79698 -9614 -171142 62562 109300 245111
21011 245111 -182548 180310 95560 220169 -154616 -217376 -177622 -155213 85529 -138725
21000 130906 193744 146837 -57012 -242826 -64154 376261 108216 -27323 -204109 195950
20989 44873 -202687 52231 -39674 129669 -284122 149476 -41251 98543 277065 85656 87766
20978 87766 -275482 44047 -5889 -82622 -279273 -241357 -39343 -113230 -50339 -39244 -90166
20967 -90166 18398 4886 -47303 38954 9469 303435 52304 -108286 -238919 -194525 -122096
20956 -122096 -294921 -240643 -58639 75549 142426 -211285 -140079 -83296 77162 -74326 257277
20944 -67410 28793 -208327 -108640 88143 43307 137603 269829 109404 75100 14078 180331
20933 180331 4782 96415 -30439 -18820 -241879 368248 279533 -109788 -262905 122963 -261350
20921 136759 -75077 79025 -98731 33822 -116785 409741 -47268 132361 226253 -9134 -99479
20910 -99479 -96557 -59994 -149211 27058 64141 -113544 -64246 -171358 -314503 -115446 -144296
20899 -144296 -343226 -39323 -75140 -117508 -89618 -138396 -180506 -42012 -63151 257714 -295769
20887 224757 -40534 -5697 -5476 -65668 121592 -179708 -301324 -57144 71105 -129690 201354
20875 -189669 127813 -216310 -87777 -319897 402 -30315 237559 -27349 -219208 106184 55507
20864 55507 78830 -6371 -139168 105036 -242657 -189737 141063 -98384 -32156 -162148 -414747
20853 -414747 174578 -66438 -225106 -94327 -314564 -185259 -642 -136524 -123538 -164672 -16079
20841 97144 303264 -35729 -31785 -63352 -192907 -143319 -248259 272502 244897 -20459 -321666
20830 -321666 -18095 54505 16795 -208816 113387 -148752 75281 -103975 -20209 -238885
20820 -238885 -104489 -394879 -148236 -189849 85736 -20301 -83105 -89370 -40121 199029 -171765
20808 -61691 -194917 -95127 -61207 -199034 46423 -24390 104670 -118870 72707 95125 71688
20797 71688 113073 50841 10226 -386524 -24922 173298 -230350 -44915 37211 -105762 -223663
20786 -223663 -204719 208479 -3229 -8050 152504 221830 62310 -57152 -63496 -184952 169224
20774 -296772 21996 -79030 -82583 -263569 -143860 114758 -241995 94497 -83940 239970 61707
20762 239962 -42644 231393 32011 -136569 -229261 219695 14437 192269 -371494 12229
20751 -235293 96806 -99768 309605 -271809 229599 34809 -4744 -5392 -215398 -114248 332758
20739 -191458 -79536 -20802 -181133 -238189 -159552 -64811 -45405 221971 -68264 -166307 202906
20727 -24872 -141639 -131768 16408 -324564 -482386 89875 -194656 -167318 205340 -62292 441808
20715 -84462 76528 191192 -74539 -228878 183321 -283180 -7459 40190 -297873 68527 108469
20704 108469 -102580 119764 -72077 176563 -315024 -54891 78076 -7264 90668 -219407 -309346
20693 -309346 -11220 91877 341562 -505134 246151 79870 28447 -12891 -28511 132314 -32955
20681 -60819 -110490 -130254 -93130 93758 115644 -190372 144064 -151957 89274 -146343 -48295
20669 -4368 -37114 -108148 181059 -173819 -25065 -139407 191598 191635 163725 -336936 -51126
20657 59821 -225231 240890 44360 -27136 -338066 -132466 160219 -68237 305511 -164653
20646 -143867 166649 -202469 121593 -133217 -171696 -39168 -107745 -208261 -27131 -202540
20636 -202540 19406 -182105 234807 -147031 -16435 504566 -107732 263122 -299523 134944
20625 69266 27231 -123751 -175517 131864 -260590 39038 -107807 23811 -280128 -59506 -328190
20614 -328190 -97280 -407882 10236 55599 27881 -246206 -84019 104945 57791 75790 -105470
20602 -395817 -9204 -148666 -153603 -322256 67200 152245 30940 -189672 -118121 -180315 -299531
20591 -299531 -71660 6049 221331 -57838 258791 16097 348089 93762 32944 26828 -32259
20579 304900 173132 40455 -64348 -160884 -430357 -144024 170158 -96771 -25147 -335101
20569 -335101 -212614 -193195 275948 -65719 -158212 -193582 13227 88633 150245 36705 337833
20558 337833 -132874 9193 47186 -35467 86300 161297 59081 18812 32246 -345314 -56861
20546 317193 -221982 -18459 -81514 40678 -173142 -314377 -271693 193079 65790 -143295
20535 119500 -127680 -32652 -5169 -400846 4253 33379 -314821 90887 189334 63690 -15799
20523 -51054 -105611 -319272 -69093 160614 -84217 -100004 -138589 57517 -22574 -72297 -61006
20512 -61006 -157968 89657 51203 -50627 -117659 -46909 -176764 4938 -38276 -405895 -31579
20500 -353178 -303551 -2980 -269597 -276224 127223 11501 -272186 -165486 -293246 49903 87700
20489 87700 -140335 -25523 -11442 160561 -58393 -58105 230517 39392 -136053 -317615 277536
20477 -90717 -152550 98500 205260 -28540 -49452 -139507 -30990 -192306 113249 4590 82689
20466 82689 -136009 77908 -185323 -180699 14804 -53122 127520 24303 -267816 321730 162978
20455 162978 211278 259941 213987 54310 63758 -174314 -103403 -12265 -278920 -139942 -80050
20444 -80050 232085 93820 -60900 -113417 -7720 -136975 234888 23276 -101758 -147510 -124857
20433 -124857 -96765 -128713 341300 21144 -90989 -19578 -227829 230175 -38148 -55336 -148135
20422 -148135 -85406 -238642 -208420 146473 208823 -17278 40004 230572 -121312 -121042 -90606
20411 -90606 -204811 -180632 100231 -21374 60433 -33747 19178 -77555 111118 12657 -201819
20399 108066 138475 52962 -94387 131104 14583 -303120 89876 -52544 828 22581 372820
20388 372820 242734 29741 -306462 113432 -35617 -30654 -61874 85399 -93691 -100930 -127718
20377 -127718 28135 151091 18840 46737 -14188 -166477 -35485 85010 -39238 -86195 -156888
20366 -156888 -30396 263681 40273 -34173 -72164 80565 36246 294834 -151340 -93810 -262267
20355 -262267 -398358 -117709 -174 -95545 -359015 10773 -51528 126541 -13263 187743 -467735
20343 -72959 151107 -200354 -151129 -62717 -249205 -235908 165695 -186568 -317466 -113206
20332 -169404 -140791 -270537 209611 -99930 107227 95680 181905 9493 -303111 -26319 -234412
20321 -234412 -159442 146107 206730 463 -420389 -373471 205065 200928 67338 -123419 -351431
20310 -351431 -360200 -75561 20790 243591 -2813 8545 -50812 19559 -351096 101411 -161214
20298 54919 -222495 -240462 -17033 -117542 -230074 104237 -97733 -210017 126532 41449
20287 8715 -82259 -296878 -68769 147768 9725 51716 -142384 -242214 -16364 -73498 -28440
20275 36593 -29909 -143799 -162365 -123163 -454799 -181715 205433 -284241 -122797 -239080
20265 -239080 -156034 -155596 -40391 21410 -124787 86935 95005 -299505 -31218 -472938 193484
20253 -284450 -60505 -140442 -40152 134350 17288 -209699 140074 43343 -158265 93000 -244595
20241 -69055 -347128 -254354 -373522 83990 -75274 -166609 23671 75634 254220 -20545 89287
20229 45366 -57633 19538 105522 -201982 -152239 150235 362105 89568 63854 -114887 408211
20217 11299 -5156 -121779 -297521 -293 -509670 -276824 -131924 -190118 -367105 -189857 -95220
20206 -95220 -177756 -354656 66803 3356 -6463 -111010 -231594 380891 116252 27710 281933
20195 281933 62376 291559 -155246 -94450 -33770 -54649 510909 -110485 -47442 -13204 -28024
20184 -28024 -8449 39532 -21686 -88631 -56370 229662 11153 -14093 -93097 20588 -141804
20172 58272 -363160 271498 77367 79132 -251314 -301628 -430157 -121412 -91675 170655 -369601
20160 382515 -339919 -55415 141340 234979 59225 -15328 74949 -87035 -378721 -30942 -66995
20149 -66995 44011 1545 253819 157934 268644 -107073 109890 324205 288712 23349 170848
20138 170848 -256540 -194001 153402 -22623 31480 -196449 18573 295968 -148921 -180989
20128 -180989 -19155 -53036 -184343 -261501 183018 -431138 123871 -230401 -270607 103603
20117 -64641 196355 -139532 -145469 -63668 290135 178252 -164468 -197092 63816 118044 -130378
20105 89750 15462 -59841 -249259 -73762 128677 -153576 -84052 -42350 -301175 184295 -235392
20093 -108221 105180 79442 -158601 -98186 -59772 -99870 22647 -96201 35568 47523 -53347
20081 -336819 -36615 157464 -264453 -99184 177538 -304866 21738 40508 -255492 -189639
20071 -189639 42086 -205453 129013 20877 425099 -14928 -16134 233461 -173985 100661
20060 -8017 -218505 -265021 -225340 -54616 -280943 107494 96051 -188993 -214183 84958 -52941
20048 47127 13513 -126079 -211699 -136779 -287063 127355 277984 -193458 2886 -53312 -4084
20036 -212111 -136723 77837 -42239 -29233 109777 -183585 -29829 -183367 -304312 -161733
20026 -161733 53854 -248068 -96909 101441 -264554 -62134 158832 -18343 -109608 -272266
20016 -272266 -239323 165086 -54656 175306 88340 -156308 -217973 102635 -34559 -127785 -74854
20005 -74854 -15468 -85960 -50476 -204597 204680 -4113 94085 119348 -380615 241698 -71379
19993 -111031 -380409 29017 -62083 39426 -203589 -186674 96309 -35851 -49075 -91751 -22089
19981 -403932 131049 100791 -76387 -184967 -4627 -54750 234942 -100652 -48234 -275420 -234997
19970 -234997 48836 -154365 -72996 23356 134722 -20900 -365200 283846 -200455 233114
19959 242079 -138940 -8866 -39694 90125 -121902 220747 21778 178053 -33449 -191754 -220717
19948 -220717 -26255 189481 -3051 149057 -249402 194481 14017 -68829 -407823 -71946 65742
19936 -76453 -48161 -212528 -115739 -875 -223283 -26202 34787 -177326 -117159 -14376 -64024
19925 -64024 176447 119215 -208788 -78917 38212 -147701 -92476 -210679 -241991 102560 242791
19914 242791 47551 -3203 142608 1922 -158119 -134800 130962 129846 122634 -326396 104457
19902 -114969 -173397 116253 163867 47097 -53274 -173586 67151 57073 -202770 238166 -155008
19890 271337 95950 248465 363660 -171302 119900 -74227 253389 -42017 -322179 103791
19879 -78819 74208 197806 -285292 231338 146714 -212715 -248793 -193933 141545 34516 -25200
19867 -148253 -217311 -32277 -135261 -100708 -35272 -79497 -197422 -70005 -535917 -287829 -111998
19855 -179553 -116887 -252834 95143 17128 313370 -517817 -75330 -182247 4408 -221907 10932
19843 -297810 169563 -275939 224693 -107742 16311 201430 -237885 -282624 -18701 -52640
19833 -52640 -401876 -178948 -7241 99831 198152 -86071 -86240 -11355 176830 -66646 -218632
19822 -218632 -195307 -136387 -164711 14473 -64196 -108243 13286 66183 -65399 153871 -322853
19810 90207 -50449 145531 -196671 390686 -197157 -45867 -32838 -220591 43045 37718 -53321
19798 -420392 -328658 163324 -92748 111161 -7344 -93661 35199 8424 -26611 -510749 14241
19786 13655 -130652 133089 -248858 -3030 -65277 -330762 -100853 -113980 17536 -11713 150746
19774 -240067 -46882 -5760 17483 194225 -134038 3468 -132956 -124152 -29708 -270821 253498
19762 147556 -116130 -148764 160637 -289725 -246150 -149965 77872 -325407 -26108 -178144
19752 -178144 -277061 16067 -202210 93514 23502 35153 -152159 208356 -108126 151984
19741 42168 -109149 238878 81763 7565 166644 259323 -21473 -102977 155818 183100 84100
19729 -43404 19796 -125719 -383004 77397 88167 86967 -128869 -154142 -6794 -239496 -13202
19717 -336275 -17310 -319295 -39851 80050 -46642 -137424 5018 -91797 -166803 7699 -330094
19705 -230890 24271 -93093 -225386 -45535 -346076 -89301 -13570 65254 -22471 -100505 -8587
19693 -471399 25986 337888 -21494 -123164 -108625 -217508 -380714 -198079 198090 83950
19682 68695 192328 -120018 -131674 -42640 -168564 81278 98265 232734 452867 -175459
19671 70445 69631 -265822 129704 -37226 -163696 -209322 -132628 -219972 30159 -107950 37577
19659 17725 164797 -9100 190596 -126113 -151675 55195 -102768 -66200 -155012 -170563 6551
19647 -342064 35929 -222500 -27698 32181 -75477 -87669 -181985 -197130 21662 -250502 -198292
19636 -198292 122473 -83620 -79402 -182710 -166991 66290 93762 131313 -214322 -288776 66411
19624 50720 -237669 27624 -31297 7574 -264793 185547 23081 106220 -354244 82824 -84377
19612 -252156 62417 -429049 8832 76735 101297 -171462 -146898 -201672 -39205 -541328 30592
19600 -75657 -178551 -236898 -199184 -25652 -41689 -115063 72095 -99332 102229 -191517 -215102
19589 -215102 -84190 239152 257251 -119201 -305115 151300 -107237 76772 -225491 176967
19578 63582 -114840 -29759 25746 303010 -103448 39183 69436 -252525 -78864 -101517 -368500
19567 -368500 -62949 76006 -25278 80990 -201152 -85759 -394502 -223825 -12114 -7058 -116753
19556 -116753 113931 186774 -92714 -193224 -135328 155108 -69079 -263315 -260426 87230 -180931
19544 -234884 -119672 233463 -285182 -76262 -135930 -131578 -99392 -44136 174483 -59268 -62359
19533 -62359 -292991 -37076 -47225 -12869 -41519 260723 -61553 -265773 525 108335 -168805
19521 -37076 40977 -45781 189056 -207388 -30020 -73881 77694 -168413 8407 -261165 222743
19509 -146724 118105 -305919 -100355 36478 -197085 -96857 -62656 -101475 -326636 48945
19498 -200426 -45656 164904 44617 452097 52380 -154596 191978 -142863 -163518 -29898
19487 -190941 -56088 -183347 -52069 -164782 -42585 68476 -92632 -266953 26969 -241232 -152320
19476 -152320 -28767 -243863 -48281 46046 86116 -178956 124841 -363118 300657 65111
19465 195078 -58819 392766 116708 -238788 36874 -36504 -210356 -28213 139484 -327258
19454 54649 -197802 166675 152900 51200 108234 37916 -44343 -113336 -119010 173733 92336
19443 92336 48686 21976 132436 274041 151890 -111605 118278 -189645 142854 -76151
19432 -128687 10528 196647 -122411 -234960 72569 122943 150313 273857 249039 213793 -260939
19420 4251 104362 216491 -149690 -184167 128597 164537 -4286 -126947 -218614 101720 -30478
19408 -1540 -31723 -217435 28457 199124 142350 133259 -34216 -156580 -272830 -137757 -88926
19397 -88926 -496501 -202222 43747 -106376 -44986 -15045 -211113 6198 -111911 106317 -339171
19385 62380 115656 -235623 116677 -14836 -238056 72927 -85522 -104193 76764 -121842 -71855
19374 -71855 -151720 -40809 -79115 108108 -207733 -7799 -165597 103727 -173875 -56301 -151294
19363 -151294 -254910 -142454 1654 47378 387828 111410 -443642 -10867 238959 -447198
19352 71100 73244 -261196 31912 -235412 60918 -103701 -207559 -268624 -92741 -101899 -171123
19341 -171123 -178894 160058 -167100 25860 -122173 -200596 -321936 -44418 -194662 -137229 -339843
19330 -339843 -84941 -520235 -331615 -116304 -280115 -205409 41499 -126137 20278 34459
19320 34459 -347216 14466 -178385 99923 -70752 -29066 70055 -357393 12629 -69096 -86797
19309 -86797 -231843 113186 95148 110382 240382 95983 189909 -328924 236083 -5623 52349
19297 150873 -66882 -135484 -505184 -84087 129559 -418506 -67943 110377 187292 86549 -224802
19285 139269 185015 -191808 -207138 205151 -150382 163892 30477 353877 -86052 -215852
19275 -215852 246124 -124698 -165827 -355924 32279 -141493 196387 -52911 74601 -224310
19264 -183597 433414 -57592 55557 -24319 102769 373494 -128450 -83735 94077 -7457 -27242
19253 -27242 381035 3242 31542 92951 -62955 57094 -26673 -108917 -117390 159238 -46251 -26352
19241 -26352 254175 142509 -88144 -152733 -165559 -88224 -56056 -14705 -322977 -334605 -39922
19229 -234332 207728 -74588 -122918 -11031 35826 116269 -272171 110403 -80993 198796 82178
19217 114990 176848 -172596 -253399 229312 -65361 -128747 65768 -182245 32625 -185324 -197860
19206 -197860 -33005 -119647 43412 -191724 -161990 126871 -571316 -81362 -356094 -130891
19195 43355 -326757 224200 -165160 -223359 164206 -156877 -131124 -319628 -42811 -204333
19185 -204333 586 -43133 -384060 43591 88342 -350630 -184680 -67947 103054 -9660 -28628
19174 -28628 -142313 94696 -156347 49984 -34296 42865 -269819 -272912 -266258 22024 -149083
19162 -9861 -195680 101052 -266338 -184304 -114272 416031 -341971 177841 130182 -80216 110572
19150 -28536 249614 -188162 -174784 248363 -32019 98003 -30338 -43592 -247801 -165939 178844
19138 132525 6015 60904 27784 -177088 39510 167127 93167 85436 80413 -179829 -262617
19127 -262617 137486 -6796 -204417 -45567 -364085 -14776 186534 147742 -233002 -39808 -59918
19116 -59918 -271076 56273 -101632 30171 -139184 136110 -181878 -243501 114769 14870
19105 24436 -165620 -13029 -77203 106936 18308 -119005 -237031 -18928 -36892 -239373 2115
19093 -116984 177904 -61761 83639 -69818 -503646 26799 3723 -193159 -90260 -57120 -288602
19082 -288602 8119 -78883 -18254 -205492 -81390 -81770 154789 -141048 -12070 94302 -195583
19070 48558 -54296 -136841 -121122 283477 -120905 -107336 138065 -119882 -199042 186226 14805
19058 -327511 -243038 19940 -253435 148911 310740 -35484 -3391 30444 -202720 122052 -26581
19046 -202599 -177590 -8864 -89326 -86149 -74939 -17170 -213931 -42928 127130 217503 -127062
19034 -101021 -7862 -61749 -35831 33894 35864 164061 106163 164356 47264 -33477 297581
19022 -237520 106238 -90231 -24941 -273320 -96712 28031 -63548 -29702 139090 114765 23055
19010 -205653 31100 -145351 -6062 -272224 42780 -34974 -26973 -78500 -97274 13893 -93098
18998 -59390 294450 -35881 -151437 169264 -369569 -144285 82957 -179938 -2339 29097 56662
18987 56662 -203259 21418 5659 -34717 -57117 77762 -186641 -126044 157265 -284429 6305
18975 5211 165804 91368 -224117 -37667 -50102 -58497 -67067 -112428 -145772 265522 -250542
18963 110869 127268 -171108 93126 157725 258405 -85359 44292 -84553 -84708 -127753 -227041
18952 -227041 52304 -280576 119088 -219891 110343 -268336 -77020 -351271 -314031 43251
18941 -175327 -103592 179470 95071 47381 -13243 132848 32349 -200065 172894 24552 -142345
18929 -263105 187067 -179184 25827 -70925 -259385 51600 321574 105193 -81928 123793
18918 96542 -324152 14118 -105972 -212741 -241495 175979 9015 -106335 92506 -97068 -133588
18907 -133588 148515 -1691 115678 130301 -128193 -99623 211053 163365 479839 -123596
18896 -12214 -243140 -56508 -284810 225298 210817 256015 26867 42557 110940 147341 26515
18884 -121454 86554 54219 -41424 -141440 301446 -265021 -11382 198467 183904 38108 66678
18873 66678 -49661 -103996 -89957 -100483 -8857 -367207 60419 27836 -141988 -79596 -53673
18862 -53673 -47998 -126488 24968 -136402 72578 -27310 -207659 -179442 31414 -120710 -113103
18851 -113103 93281 20943 63572 -66484 154712 105731 -459504 45472 -340818 -231108 -43950
18839 82867 147931 74231 -209631 -351280 -34393 131119 -237501 -118163 -8758 3815 -215818
18827 -67580 273813 177825 -41425 -159507 -234588 302959 -13196 -286980 63546 -186288 183356
18815 -14106 116583 -865 -132484 301605 -68569 180238 -32162 18949 75695 10166 4998
18803 -43928 -237836 -171879 -80172 -189150 -270546 -57028 116519 -17127 -79296 -382621 192817
18791 -205223 -94037 41843 131221 -138215 -75606 64501 -358582 55900 -29573 108071 -31675
18779 61879 243589 -378946 -177224 60897 417063 -161869 -26589 -65739 -97832 -356502
18769 -356502 -363727 -227618 -128632 3442 -56412 -50446 -59840 -19817 -123316 -126067 -186221 -90817
18756 -151228 -40711 -189516 -239187 -83385 -64998 91469 -78171 172261 77666 -181648 -295034
18745 -295034 36243 197411 58245 -26630 -138 72173 -307688 -102534 -162835 -65022 -61202
18734 -61202 -214451 -348529 -51125 142739 233188 34996 129516 -195160 -188129 146340 -104041
18722 -272296 -293395 -213784 -42941 45656 -344624 -103269 -84768 70704 -351412 -137886 -205580
18711 -205580 315513 -40573 78317 50890 -244661 -259816 38305 -18610 259407 -37340 -22988
18700 -22988 -183243 -172665 31111 17671 -54354 -180152 -36340 26011 231859 354860 -126430
18688 -349611 -142156 92301 101331 36997 -441858 119995 98280 -76040 27293 -175278 95508
18676 -135427 -41061 38410 -63895 -333589 -52189 117378 184008 95341 55296 20481 -130587
18664 280947 -240227 -281938 -82776 157660 -63041 287962 1405 -279924 95267 -59256 -15178
18652 -14655 204889 -344454 107562 216759 176517 -52205 -177607 -26579 -37852 198051
18641 -40759 129068 -143593 -130665 58815 -358684 8052 115648 283924 -83094 -281123 139586
18629 -186459 -478732 -367764 -184678 170405 -15987 -234984 -80754 46931 119602 6033 118799
18618 118799 -195017 84807 -253366 99705 14878 59137 -406661 -111012 61077 115319 188601
18607 188601 71787 -279484 -237827 -128914 -293075 386911 -253474 -249399 64703 -174132
18596 -80015 42851 -36175 -49705 259608 145901 -41291 -196579 60915 -28489 -16223 -90150
18585 -90150 210879 38080 64696 159867 -273765 57831 -218729 181866 238527 274910 -186659
18573 -218798 -89495 -35351 -201138 162379 78631 171478 -123599 118099 -226898 -63903
18562 -302814 -198905 -92539 68835 -131453 -239538 -98438 -321282 -34531 148479 -304951
18551 -187712 76034 302821 93485 143348 -285967 28464 25887 -183754 -172522 153429 18378
18539 -21490 -187514 42842 139369 -203029 81849 -8248 92674 -199042 -40382 -124794 -132147
18528 -132147 -79122 149143 4334 25967 -110724 -254166 123243 -93252 -142036 -33032 48300
18516 -139521 213540 -227871 211417 -123132 91235 135207 323812 -226464 39267 -30057
18505 -174077 108850 3397 -45574 202824 110237 349731 105063 84047 57912 76873 -69128
18493 -362370 65534 -139802 -186677 -186257 -122025 -30773 -84912 229659 217721 51775 -46660
18481 -42984 28923 -13004 162852 -52883 -122980 63525 -233002 -256495 -3869 -732 38380 -114189
18468 123751 92290 -54750 -185122 -180537 -87199 71171 -300431 -429623 -75922 361808 102699
18456 -13645 -110889 -111238 210592 301684 35364 73298 7569 -166859 -29237 -62521 159544 -189585
18443 -182805 -168020 -196495 298512 -28400 -160116 44532 176489 -234145 -171713 -35927 -47179
18432 -47179 -190364 58083 162112 -364120 175552 -201498 -77531 -22876 -266255 -49302
18421 -109200 -148705 153174 -258603 79214 -70046 -163923 -2451 57218 64138 -157374 115856
18409 19877 33059 -8676 -268931 -190783 119123 140348 233545 202021 129064 54120 -115307
18397 288788 63768 -104363 -181341 -352000 183166 125869 -358091 -132048 100226 167233
18387 167233 -213176 276223 110020 47707 -24304 -169037 -30252 115047 -60550 122004
18376 -19230 226390 35226 -74082 288255 242654 -99692 -294013 -141601 -62624 -49813 -40093
18365 -40093 -134411 -241651 109627 -115676 186221 -145100 216514 -181112 -57813 -121608
18355 -121608 153571 -148622 -10598 -268052 -61833 -37698 -85847 160980 169605 89274 -3973
18343 -107486 16950 -216347 267427 -166030 27027 65371 37330 -2821 278448 -238555 335660
18331 -377841 -117214 -260540 119371 255679 -198527 -59075 -105543 -40910 -283418 -16753
18320 -173189 9605 -110155 44958 31406 -173805 143605 -395669 -220149 -140234 -80330 -302164
18309 -302164 -208298 107333 -267567 20352 45754 -26311 -29816 17538 -159769 109250 -54322
18297 -220299 -293590 312904 -103686 -111635 80951 -268795 153774 219845 7579 -117261 -174912
18286 -174912 222051 90756 -64468 127653 -311850 -91924 12194 56731 39237 -7558 35944
18274 58279 -125284 212878 -239390 233316 -207167 142896 17561 204837 -62848 -159838
18264 -159838 -64665 5604 280529 -118672 107345 214517 96357 -413737 29596 -20690 -123725
18253 -123725 43827 -48427 355805 -33763 175124 -486594 -142058 -224409 -213651 135691
18242 135775 53147 50188 -155879 90236 -92439 -214400 -139488 -232553 -27141 89799 -49404
18230 -140560 263467 -424484 -314158 -125930 -165537 -284600 -113741 -351644 52900 -181283
18219 111693 -49386 -155519 74176 207306 -288269 123378 177284 -203853 -197941 -29504 -217843
18208 -217843 140557 35889 -161718 -83152 -13308 -95946 203916 98189 -136371 72224 -87638
18196 -157185 37158 55649 70244 -44249 -145858 105107 205069 -38118 393577 -353623 -284579
18185 -284579 227798 255059 144696 -168525 10078 22529 48212 -181587 350343 -269308
18174 6844 205165 -221491 35178 -100511 252725 -27100 20456 2554 -136170 -93065 339047
18162 -196261 -175643 -104297 92392 -118721 -5746 -6813 99117 -86643 15963 191627 -311704
18150 28426 -16826 -144013 -111071 21438 386056 -19151 20050 95705 -175217 -196619 85965
18138 -50555 -27075 -115252 -5946 119168 -62901 -271866 -67339 288508 100216 -95179 -138560
18127 -138560 45678 151362 -109846 -315652 115388 -228120 47622 322326 74734 -353442
18116 26696 -35144 78762 15263 -1788 -96811 -150007 -80164 53897 -152451 54608 -21040 -103094
18104 -103094 -51480 -2640 201879 -108394 -217667 35119 27955 -37716 -120005 -55801 121607
18092 207126 7084 46412 -162683 -147839 -167754 -125838 -133430 240362 -319198 111143 -208282
18080 133930 -90530 195918 12388 114860 -159478 69335 -45887 -340266 74852 -36972 352692
18068 -5414 19163 -3629 -83597 -132254 -202058 5889 -180643 -279118 125991 237849 -182329
18056 -211042 121096 212515 -148987 -294104 -133961 -56527 217087 -30631 -171543 -340128
18046 -340128 133378 6961 -95411 -70352 -81695 -138196 24819 -335865 47510 -143270 423703
18034 -151540 198179 -129431 11590 159811 -175484 104748 -155054 409319 -33018 4078
18023 91713 123599 -241719 5356 -107031 59186 -252582 41811 -24499 -315312 283810 23519
18011 -273600 224491 -56425 27884 65972 308743 -47548 313134 -54098 -25541 107178 132110
18000 132110 271979 -276040 606387 231000 -72550 227068 126390 -196096 164544 -60743
17989 -410963 -182929 5121 -161864 -478635 -47470 -20611 -293185 -263686 -168565 -219212 -584354
17978 -584354 -89881 -2321 -103269 -287096 255278 -84930 -128168 -147653 -133395 -96659 -73133
17967 -73133 -114565 -384049 50478 -78559 -207135 -34877 168820 62105 -154826 48154 21639
17955 -50278 -112407 111129 -114415 -124890 31161 355394 348726 57206 -26245 410687 -27932
17943 136197 237354 112572 38703 -29735 -240084 91995 50815 198583 -65767 -38370 302368
17931 -95153 -363774 -179511 -86642 162223 -72183 84038 -150325 -72906 188479 -41142 -248729
17920 -248729 -75601 50066 -325120 -161227 -64930 108341 37263 203390 88549 286354
17910 286354 -28116 -141562 275821 218590 -214978 103602 15251 -74920 -206840 -40689
17899 -126234 -125538 -142892 110787 -352101 -28048 -41516 130014 442715 30319 175059 246406
17888 246406 -74414 181376 -65075 139099 36841 -198782 -186200 59300 -313575 -42608 41328
17876 -132950 -368926 -132270 -122061 174656 88196 117542 -16378 260834 -57935 109037
17865 84970 -25316 -105029 -120041 -102384 -89574 -130746 44108 25088 -134456 -89078 317439
17853 70450 -103592 -116938 220901 143960 210052 -21699 -201478 -51177 -154856 -63536 -59572
17842 -59572 116016 -242846 -115882 -56076 219243 190996 85758 -242294 21333 12609 110826
17831 110826 -197744 -51048 8112 -82767 114834 -271882 -377053 -22541 -67868 226474 235887
17820 235887 282593 143089 247475 -207994 -2408 -42387 113818 13564 351656 -213975
17809 180 -136234 -68225 -74521 -85880 42982 219198 -74922 288430 51113 -66794 -10185 -240377
17797 -240377 187575 182214 89060 -192451 111613 -20492 279987 109624 -189559 23392
17786 50448 99673 -169697 -103120 -202240 -246911 -117224 196912 -66870 80151 -94754 -73277
17775 -73277 32395 260037 35802 6365 -119844 190433 -111987 244111 144539 -65395 10790
17763 137594 22380 194662 -56692 -6949 10682 -301113 181427 -18863 182595 -194577 -120299
17752 -120299 2534 126227 133816 54959 -226773 67529 40198 -97425 45044 304234 -277024
17740 -3225 -54835 73833 -2658 13981 -279700 179287 149204 -57219 13982 -96721 -17987 -36845
17728 -36845 254998 76207 203835 76284 91007 -173289 225824 -80097 -86573 27031 156163
17717 156163 -117529 42445 60565 255175 -401970 -345471 -200358 -98615 -62746 -24116 236421
17705 -191928 -59898 99599 -55377 -378491 166869 -295303 -76732 39104 33954 286569 163649
17694 163649 -359457 158106 -66334 117269 -269926 -194280 -23191 3083 55478 -132335 82750
17682 -202695 84074 -13033 242240 237459 58675 -51039 -124546 141491 -71927 -58846 47908
17670 -90340 -176059 68770 -143724 -278020 134037 251046 17276 -40325 -130253 2676 99635
17659 99635 -23837 189771 -104928 6186 360668 -99652 247597 -26371 -148211 -115153 -25428
17647 -106148 57252 -153740 -44689 381818 -94199 99984 31800 96117 -138300 -63226 -76987
17636 -76987 -26161 55887 65653 385637 180288 -81331 -47015 -409751 151155 -137293 275196
17624 -107930 156813 -178793 -46007 57328 171197 418042 49043 -151491 56417 116957
17614 116957 29913 -284857 -26564 -48128 189553 -31755 11652 -178114 14801 -131026 -48964
17602 161443 -124924 -329508 -5032 108170 27314 45010 361117 284212 104246 142159 107307
17591 107307 -36348 -240499 -109521 209047 -59384 42833 -164414 -85753 176372 98338
17581 98338 -459771 294013 -114560 148825 -27886 33868 -43346 63329 -255265 -124514
17570 128115 191884 261639 -345005 4808 -164831 64184 -267054 -63692 327094 -255249 -94108
17558 69041 212487 158369 325591 270759 -184641 -31477 189606 200383 109098 290923 162197
17547 162197 187089 359331 213392 80257 48216 52411 145108 1391 382596 41712 20611
17535 156503 61495 223241 -64750 -148315 206605 163503 -35309 119933 -133692 20738 69131
17524 69131 314959 277779 -22959 -31858 6056 107943 -229689 164618 180545 -161841 181216
17512 -27778 -158184 146884 -112759 -164807 -221263 84094 -190272 31722 10245 29967 -88759
17500 33747 229923 -17151 -185254 237934 -86680 119959 118842 -282020 -42319 279876 212472
17489 212472 76143 12500 32093 157213 448221 397572 -122705 376388 -60836 261044
17478 465741 57141 16133 208154 -223609 141203 285647 387877 263579 126059 -12187
17467 -70567 206911 229633 13398 52995 -141063 39508 -37521 -68126 -119174 -48122 199013
17455 190435 23563 315953 253710 51600 201344 355120 179129 23702 15077 269743 391927
17444 391927 277518 -79962 212873 159930 448414 157125 78168 -43367 83055 155155 -142457
17432 95202 104823 111209 85190 -186494 45610 70558 495850 -82184 194572 -35415 331615
17420 327612 223580 207091 232421 162829 396377 40020 345475 232450 506544 476270
17410 476270 289988 339635 245964 260177 57447 54590 -58974 -113647 -58983 240580 348227
17399 348227 160231 185136 237023 -24608 81123 173989 70914 12272 511465 51235 836
17387 174413 -44915 284989 283259 259959 434075 24645 -197552 -211136 101090 388541 284382
17376 284382 -199374 50323 393778 239432 11994 -179372 246754 153611 94424 -105561
17365 127264 28702 370253 128002 203148 212666 32908 437320 -205361 274742 249844 300792
17354 300792 -51967 281822 230055 91077 48229 159104 -196429 73502 142198 65551 6688
17342 219772 224140 69484 151945 -4197 113878 192151 357098 222954 70209 139972 -40372
17330 -24545 100935 -19106 465103 28704 175743 -121230 -1369 -175120 315282 -20162 106897
17318 214250 346354 532723 265881 -14074 302774 -175731 213905 204669 132073 177839
17308 177839 91377 43771 -75687 -252111 11839 -6996 210838 210365 49769 -85416 284657
17296 334263 -111874 194104 103116 110354 105409 499708 98633 123662 229841 180341 241355
17285 241355 -33489 141268 331170 148313 333037 341028 119316 95470 279853 101199
17274 116315 373733 1254 270397 100086 258139 36007 386538 31471 -39920 32366 90076
17263 90076 -271749 229655 210440 65415 22159 202708 318777 305477 347345 129515 -45552
17251 -81474 111901 178069 -177 99419 450473 174373 239154 469511 122389 504150 221461
17239 308989 254008 145711 126628 312 251426 145297 103630 71604 180733 201492 119022
17228 119022 193602 88986 268551 -309916 222423 371825 25470 339300 231582 173140
17218 173140 334707 454717 146975 187335 128537 -166005 56137 282026 259732 257018 -146613
17206 193607 -20586 118294 518927 308799 120367 -95047 443813 215728 309941 167847
17196 167847 261558 462828 54555 3530 428111 249665 152639 195278 262344 49808 379287
17185 379287 4525 -51836 340399 314742 156724 331356 -14916 243976 57925 209509 404479
17174 404479 268165 -62397 461315 273924 -60261 440418 141502 -3703 641761 447781
17164 447781 547904 213885 -40435 6848 244792 179082 361660 297609 453511 281209
17154 281209 395072 40384 299335 58398 393779 286146 226877 327987 448080 378918
17144 378918 266639 179190 24774 125361 326019 362076 544012 -6466 107212 297165
17134 297165 525043 530151 162154 363548 97540 266060 352219 365407 66676 276112 767757
17123 767757 517051 165087 423906 168525 312629 239117 129525 349617 260741 222587
17113 222587 417142 604869 338151 360265 398806 452368 414542 488909 562982 163663 511805
17102 511805 292741 105727 204295 341512 446983 287018 287808 500830 77561 372792
17092 372792 255239 474288 450723 383259 376409 536267 427205 633363 668206 289268
17081 482935 232328 309965 275883 601673 587359 526069 311948 463320 427539 375060 467707
17070 467707 242239 413333 305068 399934 224527 508036 496896 448324 597195 680973
17060 680973 364122 615262 214153 507092 494161 330589 623690 865667 668044 580754
17050 580754 423166 126100 407825 721932 340346 791179 591555 373335 525769 799355
17040 799355 367896 509516 446482 404357 229325 274630 451753 630179 458639 872218
17030 872218 494143 575242 612842 442597 611172 658188 450996 758615 502199 398687
17020 398687 594390 676117 799494 421377 531400 508751 538586 864398 797019 700751
17010 700751 806348 762799 966542 416824 418486 338417 922997 709490 360881 713884
17000 713884 762011 656488 873802 398460 857946 719339 535713 541005 657643 623948
16990 623948 727461 641531 835745 865068 768715 487751 1032503 610850 782038 973862
16980 973862 921452 879372 601018 785029 500603 896620 1003364 745048 1105115 1138148
16970 1138148 966084 918010 801262 1372882 709952 854077 896392 897919 1181853 1039237
16960 1039237 985704 1257011 1020453 1026405 943054 863290 815728 1010342 823550 1164511
16950 1164511 1035344 660880 748049 1361701 1361708 955479 1474096 1063111 1124886 1101076 1050520
16939 1050520 1098097 1163140 1173191 1080935 840188 1234518 1192633 1063875 1136205 1341525
16929 1341525 1091441 1356219 1067271 1214274 1115121 1350854 1270938 1194094 1660708 1456843
16919 1456843 996337 1727328 1576669 1182214 1347408 1326230 1045629 1289370 1261129 1333826
16909 1333826 1304929 1490587 1532610 1508452 1609371 1255765 1331899 1321721 1425468 1592727
16899 1592727 1424005 1766331 1856791 1702221 1634342 1733586 1676557 1693022 1551745 1957576
16889 1957576 1514559 1968696 2043053 1816763 2062041 2146190 1916696 2008109 2215578 2156608
16879 2156608 2452268 1799464 2243074 2403755 2338159 2026567 2597456 2260389 2129057 2311412
16869 2311412 2468241 2407273 2325915 2339296 2364106 2484844 2326591 2722554 2464558 2745124
16859 2745124 2706927 2721639 2581075 2707718 3073280 3011744 3073605 2843000 3072897 3202356
16849 3202356 3084075 3210446 3100443 3019174 3234548 3319491 3494470 3434404 3281394 3470524
16839 3470524 3692070 3798330 3599431 3765284 3999823 3812669 3864692 3876262 4371325 4045408
16829 4045408 4209097 4105415 4490171 4257800 4631445 4405598 4755352 4554698 4890093
16820 4890093 4892613 4978276 4930890 5396060 5268864 5413573 5691261 5502706 5688210 5731760
16810 5731760 5826219 6008992 6413597 6337317 6330231 6632168 6899075 6985379 7176106 7369384
16800 7369384 7500000 7613871 7692127 8144987 8310036 8494998 8599697 8792992 9020811 9371782
16790 9371782 9653810 9787311 9930315 10554686 10344741 10823730 11015030 11509989 11688863
16781 11688863 12205029 12777773 12892457 13166523 13679464 14090210 14568035 15013253 15585920
16772 15585920 16218830 16725453 17452589 17869366 18597252 19303062 19777896 20759738 21253685
16763 21253685 22233008 22992148 23950324 24870449 26114844 26995391 27900325 29360499 30712358
16754 30712358 31860930 33550366 35072263 36735216 38374209 40202135 42350901 44518293
16746 44518293 46637200 49285340 51877377 54375784 57652048 60941993 64113330 68203954
16738 68203954 71504763 76092696 80497690 85005473 90017624 95860742 101466986 107145546
16730 107145546 113896317 120161102 126793837 133787271 140795068 147716429 154730549 161086338
16722 161086338 167147366 172487234 177424566 180970141 183392773 184801056 184812194 183482048
16714 183482048 180973016 177305108 172757491 167581625 161275351 154488981 147501936 140277576
16706 140277576 132971329 125518250 118670190 111964650 105451586 99290339 93250134 87486555
16698 87486555 82341504 77687029 72994654 68835228 64848871 61184987 57914800 54370708
16690 54370708 51738705 48730757 46451660 44041416 41644972 39473359 37778078 36186161
16682 36186161 33916300 32571919 30764824 29709615 28263588 27226470 26074425 24854421
16674 24854421 23819144 22745088 21900527 21028699 20268810 19566719 18600001 18111134 17667962
16665 17667962 16450044 16257759 15614134 15070016 14605324 13816215 13508294 12904746 12399162
16656 12399162 12565522 11806578 11245166 10596388 11280510 10409387 10216633 10194712 9687790
16647 9687790 9388461 9082903 8884360 8628690 8552534 8200196 7787971 7630815 7538988 7601171
16637 7601171 7325848 6757473 6932620 6570176 6835067 6266447 6151023 5971748 5974082 5745322
16627 5745322 5689077 5351449 5149356 5497527 5324714 4926700 4975896 4553549 4750682 4605656
16617 4605656 4339391 4417183 4140339 4129094 4046470 4253584 4192591 4152384 4125791 3904167
16607 3904167 3902916 3782816 3618696 3492619 3327544 3411021 3380499 3163523 3251305 3265812
16597 3265812 2994316 3120618 3115133 3090061 2694644 2861218 2941422 2829778 2742321 2698102
16587 2698102 2573966 2451070 2636895 2481714 2384980 2242692 2215486 1918763 2139142 2011977
16577 2011977 2506490 2169131 1925720 2303690 1836803 2255727 2084267 1915981 2008464 2018313
16567 2018313 1550916 1953145 1781945 1934344 2020403 1746927 2079414 1646252 1472743 1634433
16557 1634433 1857264 1636869 1675666 1575550 1396206 1492094 1319167 1615644 1641454 1345905
16547 1345905 1424227 1534131 1218220 965938 1602978 1393082 1371971 1404858 1204856 1382486
16537 1382486 1412741 1216219 1134351 1066074 1170369 963440 1362265 1027625 981156 1361287
16527 1361287 1135048 861172 1334180 789145 1120460 910601 1056815 1024324 930959 1145335
16517 1145335 1043255 1088467 886605 943547 854276 780395 980201 838712 637175 810720
16507 810720 976783 1047568 1037210 1174825 725685 914749 782327 574353 663579 873782
16497 873782 770486 970221 821409 792120 944660 726619 612427 1002479 729815 811655
16487 811655 743376 794747 557905 514742 771031 937890 759817 726664 678060 875133
16477 875133 773635 844106 531012 577215 824569 688983 635363 721021 745844 642586
16467 642586 440662 689493 445186 779789 443526 586003 592215 266652 501700 613757
16457 613757 664397 781741 351481 507992 570230 366443 679796 521333 309768 628038
16447 628038 460430 534429 638498 512497 522331 397114 502032 573203 90630 778089
16437 778089 346382 321136 483013 470141 185202 388520 484983 500890 180957 251869
16427 251869 478711 563634 598683 542031 551637 469407 376689 407145 28700 430425 295900
16416 295900 616123 560535 60002 293843 402936 474023 306487 132328 395829 276477
16406 276477 219602 130045 285181 234295 505574 618632 197514 594063 266437 293407
16396 293407 330614 151879 345885 149377 416143 137284 141815 167035 172355 193361 308463
16385 308463 516474 330620 244674 142481 571791 254090 355869 290665 363734 45355
16374 191275 339473 401442 239935 273637 186555 542693 291049 254003 259159 283447 195295
16363 195295 276417 164096 392924 4401 267315 453855 426157 207982 423911 369109
16353 369109 257912 -81931 250071 -121672 40511 379692 434677 551382 75795 168135
16343 168135 136577 380288 116023 254404 278656 94405 207360 333119 -17243 107866
16332 351976 151523 207611 141809 20120 -32370 278426 36452 99220 400414 220358 304914
16321 304914 517363 55610 -163687 326197 303434 280351 357245 -103080 -59829 328684
16310 -85908 152178 196440 -25568 99467 155814 153410 459044 11946 217692 195028 -228194
16298 -32385 342989 121480 -96983 103797 135105 289583 105100 103387 -190275 364538
16287 258263 182077 62704 112015 151382 68107 609610 116342 223829 259391 115466 20557
16275 38375 180712 390812 23010 195230 16929 52608 -132378 -21770 -32666 395525 201339
16264 201339 221243 247740 164947 112678 340775 35785 254202 137145 245115 54051 261395
16253 261395 69507 19241 138194 107616 -2191 325227 -170484 220083 8258 16971 -147543
16241 102045 265338 -149920 118462 62097 30829 58689 -20396 96850 -191054 26700 30218
16230 30218 217842 202970 200888 152462 165521 -101614 -26061 -209412 135978 116351 -73417
16218 -389240 8531 -176712 -12998 62135 -109780 10209 -34751 290558 216285 -13485 29164
16206 68459 98171 -134436 175754 11813 75456 18648 344185 -68858 27817 -21270 188169
16194 -186315 -85334 73526 134239 94979 188275 342911 -182781 23833 148374 -52210 95144
16182 54225 -39276 -154020 -33591 149420 196951 -199318 -93246 -76078 -217560 59463 158411
16171 158411 -8068 -28737 91182 71305 15377 -225867 80145 -75706 254159 -82904 27745
16159 -68987 -80738 -135942 438021 52575 -200953 7838 321896 71299 45685 -40577 -476056
16148 -476056 -128546 224003 14724 358157 -28575 -41866 53504 128148 -151487 -139257 268391
16136 -245233 171698 217252 216424 -26866 -16607 23688 -81027 186277 143978 51853 130878
16125 130878 -60584 27148 -167155 -243800 -339845 108414 205892 112088 -193528 -43871 54442
16113 -266459 178699 -920 -225005 -165437 -89774 -71004 150234 -37488 112842 50102 36610
16102 36610 135726 -12661 342390 24598 50399 329769 -159245 -71059 -53964 -38046 163955
16090 -133269 197377 111208 -152698 88513 -117112 3823 -59096 -124404 53165 182698 -174300
16078 218541 -131267 -276696 -76916 -135544 143471 -119771 -75989 -26454 -18061 -11172 -90750
16067 -90750 22589 -424756 -3880 106254 -142249 -29468 7007 54125 -36758 -20686 53887
16055 238333 -178977 -38472 -108033 -14971 -166461 -136822 -101881 -151198 221032 -155510 172154
16043 79887 -281126 -28360 -99532 337142 -67995 171338 229643 -189314 209582 399620
16033 399620 121052 -108919 19104 158227 54164 156524 279558 -335610 -205059 -271055
16023 -271055 -40783 -94065 176120 -363024 -96209 360272 -67353 324578 -161131 107783
16012 138510 73073 118323 -417153 97875 49506 -259783 108859 3529 -325936 -100900 21476
16000 -99092 32943 -143691 -226211 -181797 172892 -69301 113090 -235556 -279527 160523 51298
15988 -16502 -283525 129150 -96524 -30882 131687 273268 229007 295036 161525 247222 115240
15976 316400 -79314 127861 -56463 -5013 305515 -36496 43946 318649 103404 9560 -182713
15964 -13293 348835 -72721 -221627 41229 139431 192877 -261642 32821 -48968 -17246 -113687
15953 -113687 -29565 266059 29012 -38516 244818 -70031 47621 56739 100034 -247729 90062
15941 163749 13896 22388 -180516 -152055 223182 259115 22823 -192960 -66146 -240074 -199297
15930 -199297 74972 -192038 -248297 285119 -124271 8475 -362034 152002 -213582 91259
15919 -27815 311903 -20598 -269391 -49019 -204928 -161614 13093 -166922 -212889 -217155 -161806
15908 -161806 -35987 -304386 37745 72639 -463959 -30657 41387 -336961 -35895 -40836 -145541
15897 -145541 73262 -19793 -93377 -186282 202084 -117936 241157 -175755 -150670 58575 -75785
15885 -84838 326804 97438 -6 -141482 -31092 45281 30243 -176596 -129356 -42417 437017 -29666
15872 219976 -31665 -94216 -71034 -173047 -47479 177682 94710 -250216 46568 -218320 203697
15860 -36495 -274793 -143136 -162271 -149818 -109623 -189394 24396 73761 305610 789 -279284
15848 1834 -162001 -165477 200439 -32408 26581 -206561 23211 -222782 -208565 170171 288750
15837 288750 39057 -145520 93885 -316440 59972 137196 -33897 -36526 -259755 180371 -242115
15825 -271878 162466 -153434 -36822 -96261 34451 -91788 83970 -143741 66152 3395 28202
15814 28202 108841 30294 301751 75790 -89795 239374 -171086 -56978 104971 -77078 -364432
15803 -364432 141902 27852 244138 78938 -15587 -86108 -64878 -105922 94854 -198610 -173010
15792 -173010 -2699 20725 24555 -236488 93427 966 -221956 -210244 -68718 169598 122118 -164103
15779 242163 -51484 -51959 -87043 1275 -224195 -66544 -79114 -269357 11824 -28127 -255864
15768 -255864 307813 -97883 -181021 9041 109800 -167276 -131651 -126416 59105 -179557 -67155
15756 14098 -115526 -80717 166007 80020 -147052 -97775 73756 -183624 145804 96446 -141185
15744 201414 -167460 213161 -3514 95094 97117 -164301 -223281 -341767 -182842 -48156 205850
15732 -137760 -276731 -208246 -121537 -121287 -82948 -104040 17501 128298 16768 158897 -42087
15720 26217 -90227 229564 265699 -63234 -159901 180500 59753 215792 -186030 -175863 4698
15708 -83260 -48274 -29469 -371280 -206226 377303 273006 15805 -63132 -69596 -103932 -139229
15697 -139229 -286897 -174355 350664 -109971 -118072 12624 -8854 -188664 -107096 -168108 71594
15685 -324496 77405 -95242 -66882 -108552 -438190 84253 80193 -174203 228851 -29841 -109862
15674 -109862 -207231 -52666 282856 -108208 -108703 119801 -111717 -51929 61272 -178129 -79530
15662 115289 212527 -328601 223975 38539 349561 4066 -117986 -129465 -58336 47563 -138413
15650 -12648 -104874 143870 -85442 15846 1320 89625 -99993 -32357 -490 -91116 -236714 68826
15637 -150662 -4177 -80941 -187298 -58042 -184169 -40576 -172959 -184737 61542 29094 -187528
15625 30256 -24867 -66422 130424 31809 -105656 -51232 130463 72830 -270443 8067 99453
15614 99453 -33221 -66541 111544 -114291 -67994 -249679 73943 -36213 -139956 81341 -91029
15602 -82824 -43454 3973 52286 -59398 20046 164019 25530 118192 41747 -342963 -105161
15590 319357 -63493 -121361 385753 207895 93319 -54963 -226297 -217193 120227 144511 -58578
15578 -72505 -54984 -151755 -355245 189470 -43035 -96579 -86160 -56083 -118820 120021 -297393
15566 -234559 249111 -174021 6699 123910 49154 221505 262392 147786 -27763 -38434 194771
15554 -78603 -53140 -42776 71602 -172778 -20320 10627 358720 -225453 -1001 -46077 -284167
15543 -284167 -152528 307786 -178537 -125391 22286 52944 40513 -169198 -288420 -108408
15532 -103530 -230492 128032 216302 -149466 -32331 -72448 -71367 104259 -17539 143668 27634
15520 -171727 217533 -171587 -198034 -68739 -45897 34166 160976 95711 -141806 105794
15509 359096 -183471 93227 25159 118802 97612 -86282 360354 -83337 235041 -102239 51136
15497 33600 -276561 -232325 -23554 -21164 -171942 98125 286931 215952 156438 -83445 54029
15485 -19646 -27490 -141258 -266087 87690 -25193 -172956 258733 146957 -100303 -173652 -130056
15474 -130056 -197828 -24081 -137652 123402 -242201 279734 -27648 -204330 97208 -115667
15463 90003 65830 -140205 181551 -166829 75214 -165283 -7109 -85530 -163235 -37577 -144520
15452 -144520 -52863 -142187 -241202 -321418 -78955 155601 -124593 -149722 175151 -265926 117201
15440 214806 108086 263813 -58508 153514 59222 -189517 -45028 177730 19280 -158445
15429 -152198 -38504 114342 -117411 -330825 48589 -3296 199196 169061 -22001 -128995 83776
15417 -38688 89161 325039 378279 30426 -226613 -112649 -78949 -146700 251344 -37979 -206126
15406 -206126 102676 82864 324440 187312 -23769 157186 -328954 -104138 108760 77275
15396 77275 -10464 -23072 106288 28275 -346824 -381283 -70866 -42951 270395 122426 216940
15385 216940 205353 289055 -174439 -230634 107549 115831 -36287 368402 134482 -225173 155860
15373 -319404 203211 -155261 -309609 159470 81539 109725 236486 -346004 -86686 35418
15362 -1972 395096 -28303 33646 -31466 172454 -177149 -46679 -76177 211108 -200279 77512
15350 -370769 -292074 55567 -27346 -60708 -37518 -60341 407501 102041 71160 -315520 -2893
15338 1767 -281746 26218 112235 57536 56913 99971 32274 -32401 222711 70309 -41213 15660
15325 27035 -160625 -296086 180038 233565 163986 178309 71263 -33256 -177567 -45396 -261735
15314 -261735 217950 -124293 147664 -263430 -29834 -13778 71471 293713 43443 -74923
15303 -128054 75603 108796 244190 183759 -86312 188711 -340553 203574 322438 169161
15293 169161 -126469 -236069 5036 -310622 -76504 420057 473189 -94887 -249136 -44062 -297251
15282 -297251 -21570 105746 47611 83537 -170802 -272901 -151968 123423 222250 -239569
15271 57829 -115610 -2779 116514 293930 95170 44701 282302 48879 -140485 352423 17983
15259 -21488 -31319 -90911 332808 103133 153046 243322 -57694 264633 390171 545011 664420
15248 664420 1453663 950102 1279213 696193 374188 350818 218 165739 117137 -134902
15237 202872 157783 119880 58562 434576 12003 -152380 441902 -70200 -54287 90519 -62891
15225 74607 73924 95706 -126086 206338 157259 200665 217502 141360 97308 -215477 147827
15213 217090 152715 -113241 89795 231797 16214 189878 270252 -42607 -242619 -194566 317162
15201 -84205 -207961 -36460 79016 -172022 -24251 -150480 146652 -138893 144865 116864
15191 116864 -314225 70626 -81736 81736 162098 43133 150939 339749 -65534 -164199 34407
15179 -339373 283136 37773 89170 -237030 232685 277431 -5458 157824 49327 282671 39398
15167 -239645 -157184 -86797 -119109 137850 97625 272519 -124234 169895 75506 -49924 113458
15155 -54576 198900 154651 305099 -112437 136826 141764 -24304 155669 321864 157468
15144 149047 163290 310617 152339 204761 46452 113714 3066 40803 339511 143151 95812
15133 95812 353967 486310 54297 78620 4046 43205 107388 12386 -46329 79773 122691
15122 122691 48322 251440 -301550 -276267 35987 109630 312438 32152 179369 218774 343847
15111 343847 262538 195812 182500 -41338 -222886 241004 208489 518328 62347 398947 123885
15099 -59358 194584 -277355 340746 8605 -60505 188415 148013 206654 281014 287550 464701
15088 464701 -148022 -95917 -212728 104156 -177192 170166 25488 209319 31298 326476
15078 326476 -2257 264772 92419 -37678 -58497 163600 365727 312998 -86405 -26547 346559
15066 157778 -103756 15512 262958 21995 306493 124889 69207 -27429 390757 218370
15056 218370 112438 446932 -19807 355721 -46735 -98423 262247 158980 283519 250149
15046 250149 81708 292957 -61605 -70353 184353 200000 119211 404211 223049 350641 18619
15034 340353 189130 -280608 159254 241132 -37297 89924 208651 81008 412587 28565
15023 49478 199219 468950 89269 196749 395437 -49206 14225 204203 277608 227474 202353
15012 202353 157815 229231 120749 255913 212167 184146 69561 22791 418564 -43648 321877
15000 -65870 304634 167246 273386 -33946 13379 183675 392620 166214 68842 -38973
14989 211834 347430 510800 80337 162233 -2133 -45110 -209261 259632 170127 -76167 248862
14977 229670 236421 202852 272413 561914 -43908 -20156 215481 271538 -33126 23239 359505
14966 359505 443763 334702 279281 390171 6847 19706 300451 197279 408269 -143021
14955 9842 524218 184936 98973 101521 357395 259334 496126 232782 204761 412774 420579
14944 420579 596015 423459 580030 213842 169103 293549 -425 64789 398788 195276
14933 234169 22317 445465 291681 371785 77071 425654 279941 180455 296868 373868
14923 373868 388432 459201 210634 79582 327347 459905 213278 228665 104207 540759
14913 540759 433156 569157 415947 232598 294143 297457 108313 273627 259309 312446
14903 312446 575418 650393 362218 23424 285878 396060 354593 376379 26551 465450
14893 465450 110095 488607 238174 188341 81547 297534 465901 212105 474052 152565
14882 145434 134356 135685 272798 279526 376004 354860 42943 -22993 487739 486811 346167 279084
14870 279084 481593 322305 201305 531419 362583 525382 400777 404104 543391 290564
14860 290564 424547 588022 405629 523510 130174 132836 84325 283051 135694 196343
14850 196343 563442 353573 513126 262423 608341 674324 232297 385003 80288 227776
14840 227776 341159 367183 521791 518846 638425 684351 272980 17086 578480 509643 613820
14829 613820 702493 378039 467230 409949 351758 304450 452616 471214 80865 594069 535374
14818 535374 440745 383489 417732 359079 441730 360987 506569 387110 265188 645058 189367
14806 538119 364445 412227 561853 571168 658319 396878 611805 481120 499350 314888
14796 314888 500889 701235 297420 647761 731151 559858 492347 623092 533868 572527
14786 572527 343228 750449 386762 575051 461653 451530 597118 556559 826418 835174
14776 835174 485266 660042 423208 598443 617982 427191 641492 749762 704751 489374
14766 489374 788205 611013 696248 726266 464352 515588 548991 731546 480990 452376
14756 452376 471828 568767 547065 628939 466240 288279 858426 774146 683041 551138 831281
14745 831281 836817 497674 646270 632481 425572 589891 1033206 826453 613110 700379
14735 700379 790208 417282 680301 794989 628545 645664 694364 635515 567524 973630
14725 973630 723478 674044 634627 684667 650346 580176 494554 872092 701004 682280 405956
14714 405956 785080 884114 597313 901859 940769 870742 970132 894595 739098 803365 833384
14703 833384 607811 936175 553979 786868 1059802 785181 634766 1110228 1134420 847542
14693 847542 791592 972554 998816 566894 831592 1042235 716302 991371 619600 704725
14683 704725 1032979 728756 902553 1262423 1111079 866344 778951 905223 887578 914577
14673 914577 1190399 700868 859434 1014706 881987 1157193 1125943 791879 1058268 780607
14663 780607 1053353 933735 968315 942656 1045262 862473 1046357 911487 1280250 990866
14653 990866 1028674 1125920 790351 1320167 1319194 925241 1220120 1222797 1236556 1247349 1144930
14642 1144930 1026617 1322562 1146148 1206241 1109493 1040550 1141116 1204478 1319743 1085034
14632 1085034 1075088 1437527 1253673 1329403 1390605 1368602 1134637 1200020 1210959 1206712 1322457
14621 1322457 1375074 1233626 1340064 1294567 1216121 1159359 1256578 1659894 1231549 1798285
14611 1798285 1220885 1549882 1470892 1209110 1398329 1488691 1381738 1357526 1498933 1683126
14601 1683126 1252123 1196373 1682038 1535082 1839069 1753247 1472204 1554399 1658474 1735928
14591 1735928 1825945 1791522 1870338 1668848 1688767 1831936 1717942 1617119 1695684 1360892
14581 1360892 1849196 1618464 1991577 1832951 1764321 2140278 2029805 2105025 2063296 2182889
14571 2182889 2067992 2129306 2122383 2332560 2188679 2642919 2306369 2527237 2411800 2596738
14561 2596738 2377784 2586906 2769539 3021937 3026309 3144404 3040093 3420270 3828893 4156375
14551 4156375 4531211 6009716 8651518 12590283 20093966 38562437 42535601 17791398
14542 7234251 3179999 2107499 2001395 2108861 1600657 2012971 1812126 1816412 1849030 2039057
14532 2039057 2243740 2211138 2061739 2079340 2244470 2115014 2031743 2338188 2466905 2452385
14522 2452385 2345426 2325234 2473276 2368647 2592954 2457853 2442191 2711813 2520055 2888575
14512 2888575 2585117 2608931 2971779 2610171 2667418 3141474 3023764 3053522 3212846 2823666
14502 2823666 2950339 2951982 2819013 2964994 3228887 3371084 3105804 3052521 3248265 2910107
14492 2910107 3199526 3180970 3408402 3761753 3427413 3390580 3045062 3726796 4275572 3441278
14482 3441278 3798047 3547670 3601406 3691356 3583357 3798774 3759002 3990600 4172407 3918933
14472 3918933 3803413 4378640 4313662 3972136 3971385 4098760 4314427 4640746 4705842 4315430
14462 4315430 3952687 4527445 4807132 4724988 4889061 4766859 4887720 4868198 5339415 4884308
14452 4884308 5196896 5078386 5354632 5132885 5190338 5154061 5328884 5327683 5295731 5590758
14442 5590758 5668499 5455155 6017095 5996437 5763208 6046964 6167821 6167187 6248240 6185396 6578868
14431 6578868 6777863 6762810 6863838 6811310 6867383 7078021 6848257 7044188 7267292 7337484
14421 7337484 7733151 7355623 7809103 7876048 7753058 8061353 8182258 8198733 8220628 8484031
14411 8484031 8272849 8630492 9185232 8744576 9262859 9452492 9410341 9452866 9783616 9783067
14401 9783067 10124521 10101599 10270021 10326275 10615697 10733324 10816157 11167145 11131644 11389281
14391 11389281 11826232 12073225 12347972 12191039 12586573 12615815 12830807 12936388 13415724
14382 13415724 13454780 13986991 14177806 14289768 15054943 14982661 15058831 15583279 15923346 16196979
14372 16196979 16568511 16682674 17208010 17401252 17758465 18203231 18454279 19047809 19628070
14363 19628070 19851612 20105961 20497412 21221493 21806714 22015401 22412731 23264964 23722949
14354 23722949 24397328 24866693 25079566 26104360 26567641 27309436 27654481 28513263 29550395
14345 29550395 30312754 30641715 31650194 32410766 33414169 34360756 35182795 36157832 37005070
14336 37005070 37915021 39694260 40590842 42089621 43435750 44368666 45991191 47314378
14328 47314378 48747993 51017711 52076999 54017288 56114079 57517545 59414835 61614135
14320 61614135 64209131 66373596 68939945 71256639 74355759 77072574 80328756 83523293
14312 83523293 86499102 90245238 94033072 98061091 101986860 106653093 111683912 116383557
14304 116383557 121598133 126739338 132949514 139168995 145398933 152266404 159440123 167102658
14296 167102658 175380684 183896664 192931805 202642548 212665416 222992629 234055063
14289 234055063 245671606 257519367 269956626 283044721 296299450 309815987 323514575
14282 323514575 336924279 350496078 364650177 377819604 390752511 402695238 413758503
14275 413758503 423907498 430852220 432858941 433396881 434662919 436081428 435641203 430950075
14267 430950075 426805619 421616122 412406982 400866630 388172606 374345665 359771029
14260 359771029 344842381 329862073 314689787 300051964 285767798 272780511 259239560
14253 259239560 246284090 234177936 222543137 211290039 200836136 190943011 181463619
14246 181463619 172662330 164294939 157040601 149594299 142551030 136277017 129625822 124071372
14238 124071372 118789326 113736752 108805385 104066792 99460140 95716630 92000884 88431854
14230 88431854 85042848 81097985 78402528 75568809 72595711 69840021 67307252 64540488
14222 64540488 62670727 60499054 58686410 56719837 54474655 52931576 51118300 49546493
14214 49546493 48289289 46753572 45273107 43691345 42351605 41090784 40145784 39528182
14206 39528182 38009143 37299513 35726190 34821204 33923706 33271775 32671316 31285962 30822448
14197 30822448 29530480 29040371 28409441 27781315 27173640 26297713 25641587 25261719 24560967
14188 24560967 23817738 23321680 22932881 22234253 22039313 21322817 20722734 20748873 20072929
14179 20072929 19537107 19263411 18670499 18263765 18103762 17516237 17291137 17123382 16876060
14170 16876060 16441732 16061726 15788813 15832956 15209451 15073995 14777073 14531254 14113434
14161 14113434 13748338 13593847 12842073 13058038 12932200 12882839 12472147 12157605 11739702
14152 11739702 12104122 11731326 11672513 11403137 10921027 10996521 10882779 10785451 10369383 9959295
14142 9959295 10047598 9974650 9823302 9517920 9232416 9303461 9151148 9006659 8948079 8746016
14132 8746016 8605194 8560844 8437133 8497612 8126687 8241536 8012287 7644434 7911026 7905220
14122 7905220 7457162 7446383 7535869 7007536 7209542 7010900 7022710 6946592 6890837 6746691
14112 6746691 6752242 6356603 6132534 6255897 6540266 6384706 6065924 5757591 6156098 6018669
14102 6018669 5849900 5376298 5606693 5557412 5701130 5513891 5119475 5517870 5038073 5312209
14092 5312209 5072269 4929843 5065509 5153805 4933239 5067705 5055163 5052137 4925322 4524810
14082 4524810 4646642 4862944 4403432 4697791 4378130 4376291 4260544 4116577 4658432 4289388
14072 4289388 4187530 4017222 4273022 4205887 4239057 4162751 4178251 4205738 3927738 3650798
14062 3650798 3677364 3677192 3858788 3956706 3759210 3923109 3755969 3611967 3629038 3542012 3681616
14051 3681616 3391586 3348584 3438931 3595194 3272263 3155927 3040413 3413152 3119315 3364917
14041 3364917 2849200 3245805 2793804 2970767 3044136 3019779 2993129 2505613 2930259 2861928
14031 2861928 3007382 2758793 2814143 2672595 2774076 2643271 2699798 2374044 2289831 2585308
14021 2585308 2509836 2639197 2359742 2481857 2343761 2437333 2741944 2274310 2332000 2189773
14011 2189773 2232390 2360742 2255841 2500245 1994334 2268501 2228139 2065572 2196569 2157053
14001 2157053 2215546 2061511 2045191 2051315 2133525 1958602 2050982 1901712 2294772 1840868
13991 1840868 2428185 2909977 4515889 7407064 13814554 31140799 44110635 22203122
13983 22203122 12008071 7133998 4779867 4172212 3910748 3377485 3010117 2793377 2528884
13974 2528884 2601182 2505460 2718884 2785750 2401243 2671206 2232832 2197115 2184415 2045182
13964 2045182 2112401 2105613 2138539 1991760 2052206 1890995 2035033 1946808 2073245 1860790
13954 1860790 1801256 1655453 2119691 1729313 1757538 1742265 1736191 1890626 1638752 2004753
13944 2004753 1731465 1770644 1845528 1650884 1631047 1648055 1629447 1790731 1563073 1606416
13934 1606416 1574979 1781521 1425777 1660299 1565714 1413838 1429974 1682939 1629574 1566010
13924 1566010 1612479 1593761 1683736 1422767 1255970 1352660 1389674 1631919 1356466 1687224
13914 1687224 1244309 1456529 1254695 1181821 1313328 1077007 1096356 1156760 1336173 1338492
13904 1338492 1322468 1506684 1300998 1307039 1315649 1154314 1385367 1581270 1127364 1351095
13894 1351095 1609865 1138730 1114677 1123989 1407550 1318149 1139040 1054899 1436498 1282607
13884 1282607 1407057 1109831 1439642 1283199 1067665 1441942 867378 1050695 1048098 1081959
13874 1081959 975980 998737 1298426 1414346 1350098 922270 1009479 1081135 976153 904658
13864 904658 1204253 937812 878864 1086288 771449 1159619 995859 877497 817106 1150204
13854 1150204 866794 1044866 976227 1124833 959784 1081813 1013428 839163 845476 1143327
13844 1143327 930629 790436 832120 1020437 872997 929963 990877 684893 890957 1103577
13834 1103577 1181899 1174693 883308 553563 1091886 703170 772005 995766 1014457 837032
13824 837032 1143145 973493 746230 902019 805039 897900 790483 522674 904402 888375
13814 888375 1007482 692167 772030 862636 1053190 1061985 771591 728692 661423 779492 868981
13803 868981 834759 903915 652216 812741 679634 850024 742093 718680 940034 1040136
13793 1040136 659348 980504 518743 976330 803310 737178 843529 544909 823122 696427
13783 696427 592825 543727 616098 649370 740439 306128 469794 978889 775030 798063
13773 798063 796041 623579 767554 512642 650447 738877 449413 700961 695793 566988
13763 566988 818180 700217 553689 778959 526413 713042 611301 846717 584740 868725
13753 868725 648971 422134 865253 748714 386245 184893 526150 648666 643093 919376
13743 919376 789891 658203 355237 684311 584164 542557 566707 466292 514728 379028
13733 379028 733506 883747 720367 709289 553751 841136 981869 410590 635355 884594
13723 884594 682408 516996 803070 644070 519839 647741 491882 547103 720710 741182
13713 741182 713756 382311 307864 411219 431855 721336 519743 474732 438160 361924 610545
13702 610545 382037 394630 435317 791960 270448 318275 483422 613571 511630 638655
13692 638655 496538 745689 432885 471318 509270 406379 394456 548628 379731 408049
13682 408049 535956 704425 555707 391050 499433 758335 444914 402297 523231 640186
13672 640186 240538 -40271 544803 472395 555212 630722 457631 595215 316647 351921
13662 351921 708461 441759 140931 486854 645126 522343 217255 422613 465671 524017
13652 524017 453953 449421 639706 436731 469731 177361 280202 309691 227738 292703 76941
13640 375068 461042 657316 188376 505220 321852 18031 200257 414718 553133 380029
13630 380029 215284 337087 273600 355741 185131 691181 450233 456696 168102 537871
13620 537871 645309 237828 344791 332158 452781 192787 368188 631913 167697 250224
13610 250224 641053 517538 189243 565205 398868 444312 206741 110752 491182 773755
13600 773755 390432 247241 278898 404319 22200 291503 496175 376414 437353 327015
13590 327015 587026 254331 320524 350611 9500 295331 310299 79174 356849 279495 322636
13579 322636 258243 304932 435294 36483 456204 546345 669560 251698 372244 249402
13569 249402 318377 219439 191678 448819 358017 31815 432594 147218 170126 358960 190658
13558 190658 427360 491700 545328 443968 154778 519078 421753 168895 291038 258442
13548 258442 483865 490241 224127 98711 353181 284842 115688 173257 613508 333719
13538 333719 357690 180154 296017 281295 219588 171435 90560 491124 291566 -24646 51299
13526 319980 325802 566338 625906 550600 220988 381478 176973 22026 325046 476955
13516 476955 387308 154772 163315 200114 65473 21830 -1758 77594 201297 160769 127997
13505 127997 362071 446366 366357 365972 379946 177218 29976 469795 -8631 445339 156750
13493 429043 70394 292715 128004 145967 363920 384830 -43389 266343 233579 11513 96406
13482 96406 63835 214071 352783 259863 83785 81449 176532 240497 233354 354055 50022
13470 285644 114745 475918 -1192 177804 233850 645286 421655 15360 194627 28736
13459 353725 168145 -30648 165404 96662 349101 183050 341527 98144 129667 147665
13449 147665 360480 136914 569110 238845 122713 324472 321781 153236 -63 173043 305475
13438 305475 -270796 385731 -78038 298478 -30990 319199 398940 -114850 157943 258449
13428 258449 239811 16694 315168 67845 194503 -23811 137941 305230 148618 566992
13418 566992 13010 271871 312498 133918 75392 64068 217443 144851 311339 254170 213840
13407 213840 413298 403643 -98945 25094 146102 77489 251181 565780 -83217 596596 92423
13395 98647 87569 395848 387626 133209 111137 266156 136418 260902 453858 517687 337932
13384 337932 -37550 -46583 -17674 111850 250242 344909 248660 -46457 323106 71210 377351
13373 377351 272442 296998 600173 -96103 308259 264433 216631 5834 234918 243233 167580
13362 167580 -22676 319061 418059 101975 441982 73503 331333 202775 107840 115940 -125581
13350 -12280 408632 124072 334850 362198 47900 275293 214856 301771 51711 512561 83020
13338 79383 40293 85465 129460 491040 52773 92201 244332 527775 -77948 405801 -144471
13326 152023 206775 329431 223820 590027 304176 141133 373051 515455 224664 332965
13316 332965 286679 133885 85498 214101 -37931 223290 245839 27923 -99135 125437 149242
13305 149242 15064 140860 141954 92062 140769 99215 237621 137204 -80833 546330 -123395
13293 25563 57829 236500 299509 -74263 421954 92401 298518 -193710 141058 -220190
13282 -80954 242446 2531 348437 -161317 -59663 42297 49893 360999 343441 -86435 98643
13270 -62506 439658 333476 113616 260616 182295 33796 383944 385268 384878 191336 66545
13258 147575 185777 216861 220569 313787 202870 287553 -43540 255606 15613 363005 160950
13246 -155003 -54074 42890 -372641 215680 -113784 2540 151312 301630 75669 312628
13236 312628 -2673 178725 108196 25018 188384 71649 -50037 184902 -62168 50831 247013
13225 247013 131974 94917 91229 188443 289947 84977 -115580 77863 531451 230458 -26564
13213 154625 51531 -92370 59672 -158158 45174 133868 109097 310387 113540 -201044 -65731
13201 -138814 232307 -117921 5542 -59039 214284 -43804 176015 44785 48175 -83876 65764
13189 195843 -50630 127 -27830 182230 -49186 -16908 171549 367965 128147 178536 245686
13178 245686 90643 29493 -94102 77414 118715 264632 -60095 -175666 280853 -57002 32773
13166 149010 260939 152461 58508 99377 43087 125138 -59872 43712 138389 -45452 159123
13154 306411 -2558 -106419 -200526 254867 50554 79163 -101025 48415 291439 -104768 109182
13142 197514 -178386 151337 18902 91731 47054 451252 -13454 368530 -34228 -302090
13132 -302090 170750 59593 6292 117916 145327 208436 -106589 223847 189806 311366 15297
13120 41637 140864 72324 -118195 -617 15564 359374 230542 35596 248961 -1659 319054
13108 115512 -279059 38142 -189122 69817 78538 2933 167717 291815 -75567 254543 277022
13097 277022 323946 -16716 63647 42507 5031 13210 -164926 -41611 200139 140843 -62017
13085 178983 311385 16243 48735 121511 24527 358948 34197 -120738 387058 74481 276792
13074 276792 427072 108345 254462 254333 -26151 43316 207043 -20161 74042 220076 48012
13062 -111910 -5768 -41317 46512 195384 -19082 57558 124302 306531 249734 52362 48537
13051 48537 114035 -334921 -5546 77783 348140 -64506 -282512 -68897 245686 -170136 -48943
13039 -121421 147682 -86809 158470 108200 198737 -28217 331215 148517 -209979 139407
13028 114787 72791 264560 191137 -140952 303282 181437 250600 427041 180023 343697
13018 343697 -54498 183493 123440 305611 -112115 57256 202903 -275936 86636 -220282
13007 419729 349324 -28674 -103383 222364 -30371 -99390 78972 -84992 247011 -138003 4229
12995 -178698 140430 23803 -236038 82547 234118 297139 64784 170430 51581 324262
12985 324262 -98299 128125 -184032 431454 169964 53574 -207607 178110 301164 -132228
12974 -159325 96986 206848 -8259 -86116 -132666 142475 -93409 38954 290202 73168 108109
12963 108109 164091 -16349 113549 112318 190942 108112 27996 -34471 4551 152430 -11027
12951 -17803 -44716 127895 10793 -46642 55719 11228 111771 -60894 417236 -41970 -5632
12939 17473 14049 11538 246054 31858 -53355 54239 280201 285580 20177 212155 -145562
12927 -81760 183269 -79970 -126132 -370840 69847 172409 31546 -27306 -10221 -128528 -103747
12916 -103747 1302 93687 151603 -198498 -16584 230744 280476 190523 -258858 289356 -87072
12904 164546 36249 211594 20640 148092 -187760 262286 250911 -154408 123545 33993
12893 -44270 164408 170094 374450 -106163 -206357 389929 -41362 157908 196419 -10084 -69152
12882 -69152 270412 -124513 64435 -189008 363003 -37026 45859 357258 -88545 37278 212926
12871 212926 304925 -70791 424493 82636 -232426 341472 12249 252767 -35146 38159 -275750
12859 144181 309335 91008 -150737 -60791 336842 -149891 144279 82074 240671 142487
12849 142487 238829 67626 -101996 -97833 -27594 87635 34065 16148 -10922 -76475 -4972 -169758
12837 -169758 16759 13677 19127 142164 103745 43764 -10518 28136 -202788 -32917 -65365
12826 -65365 261319 -15593 142768 136504 29223 -103901 183497 -40821 124896 52927 257759
12815 257759 -130612 98805 -3490 561 -64124 -106011 263536 -282475 -169510 33348 272806
12804 272806 -194956 76563 33891 354677 -231241 15218 -186404 45731 2622 326866 -291371
12792 8760 -119969 -163351 69605 114028 166541 53132 182307 -327413 -38805 -66510 291897
12780 -12549 -182344 -45498 234682 -45716 -9483 8226 60769 -4073 234455 -17171 -1524 -38916
12768 -38916 99556 114091 67459 -30684 -37479 105134 -138188 -210100 59158 22895 -206052
12756 126445 11542 165768 5959 -23701 160441 205403 215359 -17684 22220 55030 -27755
12744 -254346 -33106 260457 31932 -263056 228381 150736 212913 -200325 324174 256051
12734 256051 63335 263608 -166710 163660 -30912 137474 74574 173218 98088 -39939 -27552
12723 -27552 110726 -35338 -132532 -6760 -198256 37535 283292 149044 45115 -230518 206536
12711 64939 -269371 -351429 82406 57 172797 296985 400382 196230 45574 289405 219717
12700 219717 124507 -10847 146417 -40364 72066 -200286 318553 285202 317507 123297 -222420
12688 -155181 374515 417450 -259490 -249891 102680 -118989 -156223 260154 -121654 63221
12677 366367 210004 191034 -88249 98015 131270 34925 293289 63288 163990 -161626 321145
12665 187329 -188901 63827 -1081 -172153 -9396 377436 -68080 96961 140849 -77027 117614
12653 58819 87775 113074 81845 51009 94278 -162962 107016 171443 -25280 93723 304195
12642 304195 130836 -240741 196183 360910 23740 29156 -142626 111892 457487 -53160
12631 56244 370147 -95843 75733 385861 170493 -95355 371578 286949 261357 316076 106297
12619 65040 180047 -114707 25604 35462 156833 117905 153599 47318 -116813 224043 151422
12608 151422 32320 182455 42310 -49388 -91812 -94922 15643 -28655 196559 -52737 59793
12596 412427 76086 372367 -48333 10857 -7875 202035 -84873 181550 246312 -36782 77798
12584 -83198 -124253 -185492 121063 -254134 104237 124512 -348521 259382 -106005 -347969
12574 -347969 135207 211655 26708 164990 54270 205414 270660 111458 108531 24875 145284
12563 145284 -35476 31190 100806 218981 -82370 309081 202120 7979 -11848 183265 -230237
12551 -198684 188591 -80172 -246760 103722 -229734 261834 -26413 166672 -114293 52491
12540 -196744 133837 -63816 -75481 82448 219233 -65470 -184988 256497 -225292 -71082
12529 -144 -24073 166775 392459 136938 357748 -120499 -159402 68366 -44394 -17655 -111798
12518 -111798 93565 -58451 297703 131237 339213 253955 42127 -116326 101689 12111
12507 -195131 144357 205273 82576 64640 -7077 196762 -100980 85237 -81799 106906 -43696
12495 69999 70170 -64137 155418 336870 100000 17087 169421 -115054 -26708 -305496 -193101
12484 -193101 129134 1701 -177453 48344 -353209 -69360 -184270 219150 428797 7521 457760
12473 457760 -261312 211919 -13298 -176693 201648 -61523 298147 -45335 -17315 -195640
12463 -195640 122879 -210116 -30773 -227723 -177255 77274 26302 65219 -86879 2935 340627
12452 340627 31315 188911 -95024 -144154 48943 -279630 -102806 -61240 -384312 -43233 121816
12440 -16211 170389 -43786 50453 -138515 -121381 72117 52675 3117 172159 -211957 -39654
12428 205919 -127504 -324232 5917 -31051 -172926 -148219 -66272 58970 -63579 -216613 -673
12416 156424 -100899 -1173 230734 372049 91663 167160 -133732 183086 311494 -94272
12405 -19969 -1154 -82209 206085 -91774 76245 -61651 -9901 -98075 -159746 -125636 37744 93433
12393 93433 54444 -119264 204698 -54629 -380115 20777 -79171 -2558 -74071 149066 311578
12382 311578 515841 -277027 334097 -131903 -84296 50879 -335923 161947 -120617 -209186
12372 -209186 -86785 164119 -155859 99534 5687 -92853 88101 -9032 213167 -126335 -236363
12361 -236363 -36478 508529 14975 26924 -182353 72658 285012 -63715 -476046 -24389 -89361
12350 -89361 34472 7156 39404 -10977 -96156 205675 602271 81614 66164 312645 64775
12338 9906 218953 5907 232671 29299 -91308 -35261 184220 47285 -17658 149594 -71996
12326 -114018 320975 290353 323493 -184873 -103168 -260431 208810 -218857 -136298 -81985
12316 -81985 -95370 30246 -76141 15227 107637 -31481 117319 -425387 -350740 -50168 -159374
12305 -159374 -41057 -188272 -55857 153137 54915 146341 71042 -98034 -8834 -17986 211959
12293 -75498 71949 -254373 131636 -95487 -26489 -93058 -1171 139757 421 244295 -148603
12281 164514 107193 -49435 -223991 29240 309802 327664 215504 -50847 49216 334428 289981
12270 289981 392393 22193 -90640 107173 163635 93942 -233227 1289 226409 231746 243600
12259 243600 290037 -130617 252307 -274305 -15330 220428 190030 110063 408970 188119
12248 341038 468813 -55141 -104811 244281 110800 -92462 66570 -18326 250801 -217791
12237 -329994 255035 33381 146128 310614 401991 45862 111190 175868 39571 374679 69168
12225 125832 173240 180540 455697 59496 -3212 334956 419108 124087 18557 35302 -4457
12213 80959 37618 -117606 -255087 100294 102032 43007 20026 149774 188257 179042 168912
12202 168912 117720 148169 172850 281129 140154 185035 130459 306124 445736 285893
12192 285893 333008 83107 -152630 -194811 91915 95455 -24895 159538 -94722 135454 129948
12181 129948 367428 227539 81550 193998 78527 -17483 167203 -50385 49035 226399
12171 226399 155910 167018 128489 46848 -121873 24244 240970 36051 -60179 70013 241152
12160 241152 -62773 -104164 -210538 102467 60762 44289 83146 -171907 -72339 -148037 170319
12148 -25008 -159531 -244508 -144392 -49802 214773 27650 75699 -185637 13564 -60744 -138139
12137 -138139 235673 -213356 290022 -187736 -111683 227366 397968 -139881 174274 158009
12127 158009 4655 417299 7213 -63682 258289 -245985 151738 181767 137828 60410 -3808
12115 269731 151223 -106410 210759 296048 83680 -217460 131436 250395 181812 113231
12105 113231 217136 -282178 -101005 -321003 -255785 -390439 29012 146977 -375091 -24035
12094 182631 -28108 27944 336118 -181485 -294312 -49850 138605 -28759 -223011 40031
12083 138008 -144916 -24688 220816 -215599 34031 334913 322754 828002 2065093 675031
12072 308368 110992 -4793 115098 -190557 -14326 45985 -280994 -20544 22128 -191639 -304157
12061 -304157 160316 48216 328739 78803 -91325 214187 195554 108691 -26114 147843 -346422
12049 -223095 204425 -254772 -195639 -41748 113010 -155185 388947 8500 -326011 274246
12038 179401 143819 -32702 39647 -37207 -253351 124463 -256342 -147581 -23319 -53506 46961
12026 40261 -306694 212565 -91700 -200378 -82866 170314 -317859 -257519 -187890 -6129 188286
12014 -10925 -50485 -4361 -58389 76632 -48321 181708 -10334 152255 -152334 55127 61177
12003 61177 103120 19496 -14652 121436 -222789 23882 1823 22727 -29020 -310035 -222485
11992 -222485 37208 94184 -238960 100763 8034 -91638 90775 -69125 -43996 -95365 260060
11980 53516 40772 -13667 -8558 -196154 67235 326137 -136933 187066 31844 249449 -424882
11968 -148635 -333354 214183 126835 16067 -15028 -47964 15686 -247592 215929 -127705
11957 -120386 48109 -162506 -159295 180880 600 -91740 -158602 -110014 -61523 51896 -23603 248914
11944 -24155 -51014 -28823 1218 26949 -74463 41727 -5813 16608 -189437 -151585 -134804 -54142
11931 106634 -343506 297178 -188713 51358 31650 -864 -122965 150748 -46 83668 -66411
11919 79821 -44426 -117997 565027 -19 208941 265445 -50864 239508 -78824 -120930 -101532 -141532
11907 -141532 229187 53820 26918 -17526 72483 317738 193272 -258053 -319083 77195 127567
11896 127567 229286 -3161 180193 -482257 -85273 37575 -39020 271690 -30391 30366 107589
11885 107589 -336350 -59233 -86087 -10146 56328 11001 -66269 360666 -140203 220838 5086
11873 -355767 141030 136769 44250 18433 -112238 -189411 -7553 299324 -395757 -206308 88433
11861 -57106 -43252 10321 -85160 -96674 -285214 -35686 239336 190857 5262 -74701 19460
11849 235493 -84333 -384436 -402960 -80914 206469 -154284 -57920 -254661 245348 -70967
11838 24231 -57399 -150817 82146 160806 -103061 102807 -136444 83320 -397016 173656 66202
11826 443432 -50227 -123811 -102091 15136 -152126 -161199 -36899 -97507 -393465 79760 101340
11815 101340 105334 108273 -230538 -112948 111376 18921 -78871 123505 32682 -143285 -33034
11803 -18821 -72422 -143135 -20815 45408 52446 67389 137960 252791 -37483 -152042 196242
11791 200046 -107082 91289 170767 -64220 -56154 -258674 -51543 -7229 -31329 -107391 159896
11779 -24441 112423 25984 -105086 -1111 -114760 -8665 -56011 -188490 74659 -99366 -167045
11768 -167045 34120 -137093 -56935 56396 -75402 8495 -473435 167247 9710 -34546 112593
11756 -312699 -13963 67078 -144057 -22022 118370 -119542 122435 -81808 -128881 109363
11745 -79722 -107355 -139988 -16099 149563 -90030 194628 72765 -291095 11688 -35295 200818
11733 388005 54911 228480 -126988 -83950 -2120 -121530 -74118 233693 -38006 169980 -37420
11721 14907 36629 -122386 189397 172424 -203491 -119607 230570 41589 -243453 258261
11710 -215405 -62359 -208677 -160808 -161801 -21849 -192164 108159 53214 -149228 -120365 174527
11698 -62497 -244127 -187995 -140759 -127780 -117853 375777 118505 -90664 311470 103819 -8894
11686 355875 -49204 188523 155826 -64559 222372 -213893 -56788 -29638 209451 -47252 181918
11674 -131130 -99968 -40471 297827 322011 133344 8146 -75462 172167 10743 -101520 -64664
11663 -64664 69036 98894 128787 -56501 -889 302819 -51861 53125 28737 145827 -32924 24345
11650 -252218 73098 -188748 -38956 -20960 280430 198050 237357 -31467 -308606 -155173 214722
11638 26963 101389 127678 -185511 31918 -76566 -72361 13649 162475 183061 430519 -6077
11626 -350742 -65435 -65939 323943 142772 -239530 302599 -69291 -56710 121868 -153003 185856
11614 -229471 191255 178889 2674 216207 -99280 310469 217986 97703 -311193 -161334 -113131
11603 -113131 379302 459636 92178 20712 117794 185402 342163 8803 -106888 35427 65645
11592 65645 359569 -147948 -219324 180522 -230421 323748 245809 -8650 4268 157083 237774
11581 237774 69542 84645 143790 192576 377411 84039 -63761 -13267 82006 219485 -1795
11569 -282208 195181 369358 1646 -2332 125024 -83765 -179301 89346 2989 -169053 -21333
11557 -538892 150943 76434 114159 113091 804 32489 27555 -177234 -216479 74324 -3304 -138843
11545 -138843 115047 57412 136705 -4329 -51466 -202369 270030 12236 300374 355142 46334
11533 110682 136744 30867 444541 -296888 186497 30859 188520 -123398 50962 22065
11522 -141389 333524 -72842 73983 333971 132218 38915 -128284 21339 134207 34326
11511 146353 101637 40506 -250261 50612 133205 202365 186420 345481 60400 268505 94819
11499 72533 350434 348539 431781 29450 215751 -93594 124446 -167786 -4671 132705 -48595
11487 80547 118082 175702 109098 338507 261851 157660 -170851 318495 104452 47837 44107
11476 44107 241712 23119 142311 332030 -85315 -260233 -6084 174127 5370 48604 287665
11465 287665 -106530 162528 -80832 -180173 -35617 171759 235246 160484 50424 292107 210730
11454 210730 -123735 -130375 -11740 146985 114648 -63277 116225 199211 226002 83705 283033
11443 283033 -339822 79187 -173808 242667 -346822 222673 70096 243145 177592 62949
11432 108147 84743 229712 -2144 -309999 158981 -70955 -161936 240902 390446 -95197 -161382
11421 -161382 105336 -31008 44772 -255991 -71161 -17037 -39372 309355 -322957 -92386 -92529
11410 -92529 -38620 159184 190114 288110 2749 108868 -97530 -403830 208506 432547 -104829
11398 -122521 -270992 35126 141951 -201262 -286918 64118 142504 66952 -139040 32533 -172247
11386 221890 -419668 227512 214186 150854 168726 26354 -42081 62682 169036 -143345 198326
11374 61184 115069 -355861 77014 -33510 -70244 55914 281200 285458 220744 -119580 47717
11362 -177782 198141 -81154 -116513 -102937 -78550 -87772 -170985 -58789 -72908 -106748 8889 119032
11350 119032 -267288 37437 152499 -38215 193757 46271 174925 34942 -103539 -56032
11340 -56032 198688 154997 195160 93774 -191721 375774 8246 -243114 74857 107437 -43819
11328 68551 160161 -249731 63689 -318040 -135806 5775 18106 284618 85438 -144420 -69978
11316 36807 -36713 44514 73562 26954 -250540 -129171 97805 -280293 -239091 -39744 -34672
11305 -34672 -150078 -158164 5837 -304765 -45344 -151551 19138 -7715 304169 155352 18546
11293 42124 -96818 73427 164922 -6713 77798 -58697 -309869 -326826 -97674 150575 34783
11281 -54330 144507 -181410 -116070 -271515 -46224 -69184 211728 -497158 150233 36172
11270 -217816 -12063 -301230 -25625 -83163 164225 -183224 -234459 -186827 -88414 -566187 -83633
11258 206796 103426 53206 90402 71251 -94013 35257 17019 -37847 -81720 267010 -139103
11246 213498 -39184 24618 55235 -200892 54811 -94908 -47200 -167344 221301 105772 73924
11235 73924 -101141 -147020 -82259 79491 -114497 -343496 55352 -114798 -47956 14599 -237061
11223 -306704 13416 -218512 5765 -28080 -258760 -87686 -98738 -144482 -39776 -31805 214828
11211 -16967 9122 -24286 245406 72597 321604 -184487 -249204 -227746 -200305 -100178 239187
11199 -95488 -9092 176478 -44495 245981 -16523 -39519 -49962 -429913 121755 4268 -148093
11187 -130542 77245 59408 28412 -59917 -230901 -152681 232126 39501 -135900 845 14094
11176 14094 -137414 -198922 -98729 -30931 97745 143930 -208910 -159156 -100129 -103295 -20423
11164 -392687 -36422 -227760 83412 -138815 -65989 -63703 -235403 10549 56072 -259706 100868
11152 -144427 -115864 17295 -363968 -254050 -308742 -110794 168200 200486 -109124 380076
11141 -47896 -116333 -199327 80337 155072 106173 -44595 95039 111808 331194 -159433 349085
11129 -16168 -160054 172727 13859 178735 145209 -67114 205261 -202799 64105 20267 107283
11118 107283 -134158 -425097 330631 -68562 -28978 377818 -10643 253159 96668 374603
11108 374603 -140673 196252 -123553 177625 17039 404916 386061 -15536 -126719 41593
11097 -157032 31382 6229 554102 172102 64830 193927 232806 139968 27907 -82119 300745
11085 39381 111636 679880 326782 477479 296663 47256 233450 314837 458972 123976
11074 255893 284625 272394 62582 421001 292146 407476 373711 447428 541338 527479 257430
11062 350944 26493 362407 161908 661053 195884 244401 784110 769941 432824 991139
11052 991139 741041 493036 659670 699164 444871 862479 932418 820399 749331 682155
11042 682155 655588 651714 349677 537116 743874 901320 480064 759107 670053 849673
11032 849673 303228 552983 675284 525369 708745 391625 709778 1167343 737229 622675
11022 622675 840170 506567 549667 415885 539515 346957 685942 286422 660647 637565
11012 637565 545579 449485 591425 684475 629400 724989 735744 569230 437156 721963 609593
11001 609593 301159 896327 643176 519297 812274 890439 719954 163993 781440 400796
10991 400796 401987 715652 688828 496982 467556 1061710 887165 896870 566126 891109 903459
10980 903459 1169700 1483902 1339875 1267179 1832881 2275052 2425093 2511595 2496772 2473158
10970 2473158 2383095 2021394 1859478 1877869 1656689 1753769 1522281 1546921 1607443 1629605
10960 1629605 1110752 1709215 1496203 1641279 1640757 1933159 1404090 1178398 1073067 836884
10950 836884 717647 671942 653767 248334 396963 225930 253427 243849 161635 95411 40253
10938 4043 -45012 154991 267712 322494 -149086 -217447 24169 152026 -102491 61456 233511
10927 233511 187665 153251 -71259 213057 23571 -499844 -49256 -173970 -102294 122620 -129429
10915 -38999 98258 -85393 159287 -259263 -267900 185789 -252725 269728 -201946 219333
10904 -92756 21369 32630 27513 156815 127968 -13449 407334 -19131 -233022 52886 -159930
10892 -113427 62816 -37864 -25241 236482 -62139 -46735 49211 174473 -70413 274560 -57887
10880 120930 120348 452337 56201 -172944 -229284 14237 56330 8059 -92241 128175 -283412
10868 -107534 91531 31378 -6061 34907 -217721 -117408 127776 140949 -119996 125049 -166184
10856 -134560 -174186 -79678 -214276 -143272 37064 168560 55356 93574 210157 -199726 -296
10844 10094 275989 -140142 78015 16331 -27539 -169011 -130148 -361312 -273035 50696 120122
10833 120122 65485 80650 101412 -96970 -59411 74723 8784 17826 -257382 -65073 -383688
10822 -383688 -121475 166345 231656 15338 -25496 -177415 174765 381861 141947 -436879
10811 -146728 12813 1105 -18507 155469 -276669 -369820 -20043 101656 -92970 -25746 78550
10799 62205 -12607 -89952 2810 12399 -118030 -67182 185689 -159789 120225 -76499 -361520
10788 -361520 -34660 -168993 -160655 92331 28487 27973 -149192 -13140 -247141 214318 399998
10777 399998 -6779 -69253 -198571 100008 -157623 -79055 -61757 274913 250991 287908 154163
10766 154163 44031 -2483 24850 115901 360461 60665 -81073 130739 -39089 63434 -486570
10754 -25697 -2964 -176149 -143330 -144704 -320096 -46709 14859 -49768 408241 -139804 -105474
10743 -105474 168187 -351778 228385 -190597 72287 179123 -321954 -238270 -238273 45170 49623
10732 49623 -239311 33816 168839 56844 140950 -4847 -184936 133025 268958 -122551 -130996
10721 -130996 63098 111784 -115882 206979 -169146 -406060 -137855 -250413 10686 83977
10711 83977 -90530 83771 -54422 -13453 -279374 -3628 104021 -88750 132353 99699 -356848
10699 17279 168510 -236212 123721 -100519 -47409 99705 -172563 58232 149967 -65471 21266
10687 270230 24872 41208 29906 -228237 6174 -145995 -130197 -49819 -47424 -192500 -372409
10676 -372409 30991 -184066 -81239 -80884 -227515 -91824 -11398 -78599 -125067 -263598 -238604
10665 -238604 22565 145769 102448 355546 153603 134727 -101406 -408499 -40490 -109556
10655 -109556 -240556 -133180 -185636 -79046 34644 44179 -324199 112596 -142093 27967 -102595
10643 -280759 83130 -183075 245856 327242 -167775 158016 -174259 -412423 -91634 -53152
10633 -53152 -456051 114430 87330 -59961 31135 19298 -51281 -2568 135399 -483209 -7521
10621 -159702 -120630 -207586 -110795 84106 -310422 145046 -85298 -205308 119508 83653 163401
10610 163401 -157497 161020 255042 38130 171016 -73453 158567 82797 -32400 233443
10599 15989 -36365 1566 67348 49866 -191911 -277761 -150229 78661 7043 -232873 370682
10587 -78115 -103224 -101828 63378 77524 -65492 -239422 -58846 -225512 -317768 -148549 -294562
10576 -294562 -81001 -365850 -52417 59184 222473 -86688 -17010 -211721 268382 65463 -223254
10564 50951 62876 -93240 -12151 152443 -198385 73551 -207643 16900 356718 -182820 -109435
10553 -109435 -56125 114530 -80535 -215913 69999 -187184 143681 -129961 -139656 52143 180846
10542 180846 -165995 -34559 52977 -296610 219577 65701 -99594 -279628 -151725 -8895 80498
10530 289896 -24011 -235078 -113842 119214 -220063 79370 234315 -35771 138086 160126
10520 160126 -49346 -167454 -65653 191533 120902 -190222 -176879 -12276 207611 -69289 -171113
10509 -171113 -233165 51405 -548632 252658 -80530 -4692 -80382 -237136 -49643 -241255 -288950
10498 -288950 -25962 -18703 -157297 47410 67048 187276 137593 -71559 72378 -188416 195168
10486 53015 -329250 141892 539476 149530 305723 317281 367895 -68158 -185709 162333
10475 312164 -1529 21260 -207244 -28012 -100683 -75101 93306 352776 463543 -313155 229435
10463 33304 -113680 -66965 -15455 54532 1024 -45186 -11101 -6622 69776 -157869 -92385 102117
10450 -107996 -101642 -93822 -29778 -131190 165116 20771 14982 46542 182197 -58957 -103246
10439 -103246 259814 164956 -7181 -15385 42982 -78622 84610 -179428 310083 -126220 314727
10427 120433 117879 80236 -23931 -102241 315899 -60161 -44083 -209091 -32027 -158067 27500
10415 -51271 190390 -256129 127621 -273827 -413984 262416 -300764 -138641 -136089 -80549
10405 -80549 364631 -322697 141291 83067 23885 -73192 -78999 -214060 222308 400191 66472
10393 9371 116109 104591 -11973 -160376 74233 -245308 141496 -109163 -348638 101494
10382 321606 -239814 317324 306342 125381 -255517 249594 -25795 161867 217578 275620
10372 275620 207661 495562 566692 329624 204052 532729 379773 405793 537147 452150
10362 452150 430565 96452 189025 -228351 186282 35196 46912 282046 135429 180179 164408
10351 164408 227661 554574 833895 266915 125546 370978 371537 489975 470523 336543
10341 336543 340225 103457 57982 325858 162124 145125 93478 138424 634787 -59740 29460
10329 -130142 126525 102818 264265 -3922 228751 40459 240445 252763 288151 268886 114733
10317 61610 262532 243307 54892 248112 -109935 45910 -27639 -290820 -198095 106243 398075
10306 398075 -378987 75349 -6997 56145 -283023 -164580 -303537 8299 -303885 -58119 -20889
10294 -64984 -199233 -742 -22224 -259373 83432 -162771 105973 36790 -154263 -161560 -78250
10282 -60200 -134832 321458 -203907 -347411 -40521 -183539 97375 -158708 -156824 -109062 281654
10270 415349 -9093 235307 -212098 -342620 113322 86612 71455 332091 281798 532161
10260 532161 265358 164887 261869 301066 253628 -181660 137950 152325 -184218 -58772
10249 9584 145779 -268380 -27089 54345 -5645 -139403 -7922 -271609 -41234 -52320 -94430
10238 -94430 4253 131718 -186606 5851 182475 -44930 197666 40664 -280148 -38550 92715
10226 107028 28661 -91922 -98882 -50863 153393 -92014 -36439 -277696 277059 46795 104935
10215 104935 295246 -251394 -147689 16442 -85375 137448 -275055 170084 -294716 -177243
10205 -177243 -27105 76601 -110533 58059 -197724 95882 -126281 -261717 -146099 -239387
10195 -239387 70522 -62139 -470259 -238729 155660 187556 186029 -279243 39970 -44790 -44593
10184 -44593 -2595 24978 -104670 -215411 1191 -106189 48042 -153243 -100718 -225913 -65384
10172 -91818 -311215 190567 -177127 -214720 -134489 -161141 -232641 -236438 -262175 -48730 -62950
10161 -62950 39496 -311496 -92298 56238 -39775 168887 -30641 -283770 -142600 48615 -72641
10149 35619 297641 387347 541 274951 -358576 -30829 168087 -187186 61196 14589 -114371
10137 204498 -11585 -88476 -147171 165386 -15077 -113350 -10810 215717 37033 86513 -201959
10125 177802 2869 -148001 -908 -458810 308525 50230 39009 -144279 -417151 111485 -66404
10113 -3720 -194238 -81895 8418 -20638 100261 125235 154005 137419 -84303 -87136 69706 13416
10100 142622 41388 -76856 254154 -32478 43313 -407903 -168812 -123970 507529 -61983 -113227
10089 -113227 129827 -139136 -96848 -114984 -96941 180190 -67637 92075 115597 -272006 45492
10077 113549 35700 -253390 -38297 -78320 -118930 -131562 -71201 -323304 196184 24659 210513
10066 210513 -6194 66185 95946 -100087 279994 246011 101214 109938 11180 -66400 52554
10054 -171108 -98559 -296229 -67143 309193 369296 32086 -208560 -124426 -4613 -102923 151411
10042 -18700 -223602 -88515 -192297 -157628 -30501 274932 52185 -278561 -69781 254277 30820
10030 -425002 -130010 -155398 -123324 -180345 -39992 -1884 -230420 -97928 110034 5048 -17020
10018 -236802 -54123 -130615 -78101 -119383 -507245 -723 -115232 22331 123345 -267261 -25801
10006 -129215 -101190 -301973 -243823 -59391 -215127 -954 -460611 -57934 -61349 -104052 -87147
9995 -87147 -391624 187912 3738 -516 207489 -156307 -41627 6043 -50562 116460 -186593
9983 -24670 -490274 -231619 -76473 -360502 -196425 -2065 -467283 16084 25195 199608 48448
9971 -122652 94970 -8072 447836 143223 45464 -177523 261953 -268228 73649 2313 -16018
9959 44258 -102553 -259104 124965 -161623 -154734 -140322 -40643 11971 260716 185465 -413511
9947 -45102 -254536 -23009 93630 -127467 68756 -410932 190345 49841 -217683 -157043 -125487
9936 -125487 17569 -135057 -87077 149483 78706 -366160 -222557 -295334 -321808 -155539 82095
9924 -110026 -42465 130595 58670 -203044 -138042 -115025 -116103 42354 -40925 -29112 -255272
9913 -255272 -169891 -17957 -216208 -69649 -235753 -132886 -70280 2201 -112500 -307185 251595
9901 32743 -62884 -108761 137321 -143452 -228372 -152802 -59191 70601 -163220 -394988 200596
9889 31631 101760 1597 -140606 -99065 -80117 -360823 -273471 -34369 -233479 -244995 -59983
9877 265879 -138767 173445 -80457 -215205 -145702 36005 146240 -140256 -84904 -153817 61183
9865 -27955 182916 41709 51919 -232193 -208437 -112374 -125091 -219649 -328316 163338 -227226
9853 -380475 -50613 135470 264452 5423 -44682 -54808 29264 83315 -94948 204805 -90383
9841 140469 -260033 232346 -131558 -78499 -224115 -115551 -348393 40162 -312537 -157720
9831 -157720 23324 -114815 -35760 -54841 -142758 -207461 179752 -118704 40805 -298649 384212
9819 -109879 294215 18218 -318238 128584 42404 87474 -9700 78899 -19632 -233473 -99694
9807 76381 -192966 -16435 -45598 147830 -171515 -184817 -144734 98993 -134948 -107869 -49970
9795 306781 21361 -191050 -544 -17029 123115 -299982 -26495 13869 -188451 -290254 -222502
9784 -222502 -141682 -68183 23920 68576 -9698 -287911 116121 120734 -144707 -188365 -220528
9773 -220528 66654 -29414 -115181 15889 -194884 -345275 -117106 -34740 -42160 -147210 68452
9761 175708 369466 -47448 154920 -330647 -208212 10637 -216331 -58774 -121954 -23829 -148746
9750 -148746 -104901 287772 12830 -302195 -31889 -142673 -45919 117698 286194 -17926 63740
9738 -104392 -170113 -109574 -100219 222816 -37307 -266274 -297010 -27282 124068 85997 -102829
9726 -53558 173488 -169815 23113 -294940 -54609 -94807 -178941 59143 63381 194652 -252205
9714 -35853 -172054 -17145 83108 35088 -120033 140148 25827 -248323 -10415 354841 -241581
9702 86565 207167 54707 -75902 -289031 -21549 -547382 12576 -243559 -36101 100481 33321
9690 -140898 -194553 77130 29634 -59670 38812 -273127 -64612 61583 -47075 34986 -132180
9678 37472 9674 -101376 20720 83890 -62649 -192352 -271448 20361 -230635 20080 -30296
9666 -526437 156338 -124781 -18124 59378 66456 -167461 -44216 18066 -16781 97879 -286682
9654 -53848 265972 -19998 23816 22852 -31291 8049 -76260 -60374 -123480 20865 -310931 97521
9641 -136886 -181434 -222084 -201188 161210 -755 -647 -120327 -234694 -264663 -249353 -112476 -61611
9629 -61611 27252 -363217 -300033 -138677 191787 -164331 -8680 139788 -257738 -85120 80146
9617 34366 59692 -88208 -210339 -166974 -160455 -229513 -530577 235062 65507 6339 -25956 -18243
9605 -18243 -150543 1827 -12059 -197400 -63612 -405731 155044 -143436 336939 -323551 -9756
9593 96385 -286001 -79224 -60463 -96110 264769 -22915 -387099 -62820 -100287 214668 -524803
9581 -46059 3593 -272309 -107236 112268 -21968 -52425 -154222 -9193 136394 -35613 306108
9569 294098 381950 227485 206829 39212 204831 -101737 -283917 -51460 -327301 170841
9558 92026 -630638 11974 -33632 -552986 -373425 105473 -241902 -239682 -34309 153962 -161077
9546 -68028 3133 -46679 113514 -31177 -48771 94844 -217956 16618 175944 -205941 4362
9534 -206963 313137 -13169 162705 -415771 -19948 -76589 15745 -243310 -538317 -19568 77872
9522 217395 180735 -27613 -25670 139186 -264070 6056 -243271 151170 154911 -241540 -329836
9511 -329836 212346 41682 -128129 62695 3819 -10295 9203 37014 -133448 -323394 186725
9499 96775 234492 -452856 -371561 -241729 117160 -34213 -154928 -43864 33363 -121184 135810
9487 414735 -353369 -129445 -22706 233719 -95619 -156904 126319 -63496 -47436 -216119 -208670
9476 -208670 66113 -217457 80771 56509 -5932 -315239 -179575 89640 -126355 131850 -143935
9464 -151829 232957 6134 17006 18349 -4193 -108120 -4130 16680 46845 99222 101020 -424218
9451 -245824 -125777 -147612 206825 -173374 -237656 -40092 -61336 258816 359318 -65916 -87920
9440 -87920 41997 28229 -30470 -385080 -48966 251810 -15224 -235592 -53003 19214 -126059
9428 57041 6610 156894 59954 -319527 -259789 88804 125811 17746 206201 -178161 -256838
9417 -256838 83585 -78567 213834 57034 -41811 -26759 -163060 -259869 -162459 70982 -114702
9405 -92779 -68874 119645 -14801 58022 -119115 -47174 -338902 179437 -43282 2208 -36482
9393 171809 -60208 -222622 163856 -398211 35569 -315855 -172570 112584 146661 -59989
9382 -23428 -23582 48679 -107634 -58177 -395660 -106705 225330 -6639 -37282 -225462 -233644 6024
9369 66074 -149422 -18051 64676 -244436 14342 -268103 -150173 -208309 138429 -4495 -10381
9358 -10381 -111883 248198 -47684 41842 -70530 31951 -177519 -201534 79184 -200903 7357
9346 -15594 -54443 74691 -89979 429073 -211613 -127099 -188423 -141183 307064 174977 -334538
9334 -350702 50020 46446 -167606 -303658 94644 -304252 -59747 -243800 159719 66072 -44510
9322 38752 -150735 15527 -93006 -13845 -279161 -189355 103300 28883 108598 22772 75081
9311 75081 -39909 10269 24071 156395 -192626 -84292 86464 149429 -244876 132836 -12748
9299 -150227 210521 299475 -10256 -433131 -176094 109202 171648 -163461 55350 -78603 94093
9287 83679 -347635 -314354 111771 96225 -114211 -165767 -8438 116426 48226 -218689 34682
9275 -97584 164961 -173775 -3616 156153 -193739 -146670 15875 51774 -75617 41549 -37409
9263 -110468 -47393 349414 -39083 -26813 -225225 -507068 -378972 -72245 -17870 80794 -344462
9251 187503 -70322 -98326 51113 3739 -134609 6966 -48718 32115 232868 -163679 83704
9239 -218827 -175926 203521 -425596 -165216 81005 -233170 140024 137983 108554 -146708 2311
9227 37918 -258555 48387 -46206 -144389 67540 -124545 -272898 44676 -233370 50787 63629
9216 63629 -15646 -97109 284834 -59267 24793 -80976 -89996 75887 119881 -87693 33186 184474
9204 184474 -205345 122328 79606 -96642 -156671 -165679 -446103 -42407 -215739 -208277 -101541
9192 -401588 -239220 -183932 146719 -220249 22791 301883 -228277 -115822 9537 -182091
9181 25640 271040 188479 -371088 88781 68960 -20127 -363949 -123283 61733 -57492 140423
9169 -62684 70741 34136 183749 -252594 -90220 -236954 -384826 -35658 -58692 57821 -232423
9157 -275131 -42884 -140356 95379 -88387 195593 2501 -19404 51677 110101 -345117 -158133
9145 155139 -159980 -114424 39218 -43192 -117256 -118999 -102304 -33647 113159 -126903 -150216
9134 -150216 -125325 2062 -186595 -219373 115256 -9670 65787 533 -379775 -65219 -140109 -158559
9122 -158559 63164 58085 155006 236951 3041 321608 198339 -247282 -230281 -188296 -216316
9111 -216316 -150522 -70781 -13309 -169130 176081 179546 -750 134472 145800 190013 -22248 -100097
9099 -100097 -85956 -165762 32939 -306690 -43056 -122467 -261778 122491 -55158 -85883 -250898
9088 -250898 -30582 -71439 182814 -99396 -74580 317081 94413 105457 -98681 -65785 73081
9076 77647 -207083 -118283 -196654 245119 -122267 -14759 -54656 6873 -340293 58711 25792
9064 30389 272 38842 -375371 197353 -449845 -82261 -37951 -301952 -109911 -146709 -156926
9053 -156926 -22105 -38719 193809 -111048 -45707 48251 -396707 -211775 121874 -134052
9042 -119649 -58741 -105108 29108 -20705 20362 -106277 72120 -151732 -191638 -2719 -208315
9031 -208315 -109245 -38119 -210118 8564 -130883 -58398 216814 5771 -264331 -188604 84612
9019 241578 -125949 -128370 -118055 226727 -141929 -379388 -214860 44415 126039 -226075 -43787
9007 35493 -246340 -107765 -8269 -119667 -11968 -19578 266437 -12477 -368725 163253 -340729
8995 -182113 32874 -3950 54455 121889 44376 -13456 47742 35675 -96732 7351 15850 -304167
8982 -83379 -63396 135488 -184873 -20585 269970 -446715 19440 -9650 -47098 166989 -86161
8970 -119399 -186221 187334 227456 192210 -43953 -62297 -187704 46292 -221142 -251350 -26854
8958 -173683 -78491 152485 62862 -460063 -23059 -168939 -310633 95133 72937 -277141 -134490
8946 78742 187564 -213199 -145724 -274461 -306729 -120810 -262892 -26189 272467 202419 -65828
8934 -133941 145224 -20267 60633 -189714 -9803 -111698 100185 -174752 -55834 112131 534160
8923 534160 346001 1686043 1214454 286910 -25450 101328 -161251 -210676 -104447 217464
8912 154295 -160108 -194910 -100673 -115056 262353 -74840 -215758 -181478 -177170 118070 200728
8901 200728 -57050 212979 -52168 -110034 -363540 -14195 -13559 130164 -99824 -88018 -143421
8890 -143421 125420 -9897 -203137 -222642 70581 78553 -202835 -46493 46082 73140 -221749
8878 -216208 -124970 -46516 -118444 92933 266437 136607 40609 128654 -57309 238053 377170
8867 377170 85693 102658 30729 45698 -184936 130266 61818 -324031 -91082 268651 -59576
8855 78173 -248759 72935 1604 76112 29927 148742 123416 -196245 132677 -96624 -342210
8844 -342210 125226 97511 -540440 280196 -48721 -235320 -8335 149140 -4908 75015 276240
8833 276240 239834 -257862 -299090 47851 29211 192992 114992 342585 56518 -315617 -60780
8821 -22259 -34037 -153557 -32198 -191135 277432 42468 -19784 -253078 131095 -281399 -150084
8810 -150084 -235899 -14214 -163104 -132049 -48759 -335836 -182609 -69954 279479 -228971 79977
8798 -155458 -31423 -233972 61247 -139723 -203911 83194 379402 82325 -12504 -308021 -53775
8786 85988 25273 -106249 -71692 -194015 148485 249469 219284 47593 110679 -101820 -192651
8775 -192651 -175692 -337106 69171 18755 -327824 -285482 93397 -77640 102712 62872 -6123
8763 219270 122367 71780 -69952 307900 -204414 125208 217953 54748 43906 -167606 -440961
8752 -440961 -83438 -372689 -219996 9519 111635 -284211 -90477 -53340 -128498 -91323 -223022
8741 -223022 13131 53319 -172581 234755 -38580 217172 201574 -600498 139182 78396 -107110
8729 -182102 26924 34145 161062 241212 -81522 84884 -288843 2602 -21926 -214610 16121
8717 60573 -112719 16577 -144051 -37881 -302787 68832 -177861 -164978 21729 -160001 -80377
8706 -80377 -162577 60406 23893 10450 -331579 -381572 24893 -89166 51329 14051 7138 -193181
8693 111062 33980 -297776 -305326 -110716 72515 -109413 91709 -239105 145986 -36835 -248330
8682 -248330 -125901 -377058 -282763 51807 21366 171518 -49211 113070 -77928 88407 30926
8670 137073 -197235 11022 124918 -236305 -181147 -71402 45893 -244525 -298620 117905 79191
8659 79191 41886 -143721 -249769 -135854 -278269 248029 4883 -574685 -227057 -220448 746
8647 27920 -59903 -33608 -150647 -98207 8731 -214451 -109725 -8053 -250823 179508 -439802
8635 65998 -183499 -89825 -481823 -53749 -266484 -263521 -218771 -145132 -21908 -128586 -103352
8624 -103352 82090 -26808 -121418 251565 102838 5212 139476 -68432 183985 20409 431818
8613 431818 -46594 68148 -96155 82192 59552 -263232 -70233 -142490 215146 -71831 94003
8601 125897 122043 306404 -39140 -386932 -6986 61297 -80661 117134 -48727 302359 43796
8589 107461 55720 63657 11969 -140138 49014 -234389 -108348 -87166 -188633 40382 -16465
8577 -276735 194361 -82557 -268749 420782 -107320 -152162 -219727 53792 -228386 326635
8566 363228 216960 -100069 -268344 -455 -204805 -261665 -161497 6742 5844 106697 -82513
8554 -178706 -234349 226330 -111347 103668 39915 225155 -23878 -355939 320369 138752
8543 -147373 154397 150125 -101528 85770 -44434 192454 84715 27970 -78150 277774 -558386
8531 -36580 52204 97157 150927 -115611 101504 -216672 160517 237682 -181656 49206 -105637
8519 -263283 160890 -146080 -22394 89918 -45120 -264604 -97245 72423 -192483 87295 -261307
8507 -11638 -68225 -3189 91156 -24973 -106493 -144860 -199306 -114512 -152236 -247092 32285 -66602
8494 129827 -936 -48834 -264754 -72536 191201 -236724 52659 112723 8303 -159509 30748
8482 -56372 8224 -189170 -171159 224972 -261489 123934 37948 -86900 -340526 -252980 -432324
8471 -432324 38008 -241554 237229 55325 59760 -46172 -126124 81244 -198637 -17972 -393733
8460 -393733 -49864 -40802 -322091 -248418 258203 -90398 67485 301049 159285 -42494 -193151
8449 -193151 121243 -140503 -130780 213156 355507 -384756 -159109 -43231 -170120 -234144
8439 -234144 -160332 -157695 -168243 14999 -200827 -78105 20748 -203724 22874 -178445 -2132
8427 -285219 -202670 60859 -178632 67770 15708 34743 -21681 128409 -118115 58224 -153095
8415 21300 -47260 -114323 19493 166958 239664 -65722 -239664 130221 -186527 -10510 216621
8403 -8481 32671 -286353 -101581 -52401 169212 -229705 6664 -165842 3795 6713 -67441 -300423
8391 -300423 -317290 -191254 -66287 -126389 110551 -90156 -312065 -63471 66494 -313665 -31684
8379 16748 -235491 -239642 -188980 216327 -25442 229460 177485 27989 -108971 96501 -115512
8367 144014 -119544 -123249 -166326 -120343 146966 244260 -7788 90335 -171606 -404321 -196815
8355 -143164 -112795 11942 -32219 -232154 -328217 -172297 174023 87136 -210069 -122975 -167180
8344 -167180 -343549 -154281 -154511 50966 -256155 212732 -36374 -229691 -126359 -146257 -588009
8333 -588009 302368 -25884 103651 -122124 -141147 61735 -159213 -93005 -9089 55673 139776
8322 139776 135242 -64682 -2354 162842 -346288 -242631 -18791 72681 -230780 -454064 -146474
8310 -339247 -166688 -182743 86213 41431 47017 -272749 -69882 -122143 288752 205927 -4403
8298 143388 -89604 165729 -193184 -239454 213957 55286 -265077 -134817 162167 35343
8287 17153 129786 -36271 -170521 -44314 -128187 -29141 -54652 -35582 -149186 40889 142055
8276 142055 -56559 -130295 -50162 -167864 -350763 -99535 52781 -24164 -20062 -137069 214321
8264 80497 -121462 142500 48403 -128695 104543 -13914 -267026 224263 126806 -230595
8253 45681 186403 1924 320344 12323 293098 -208470 153066 -39611 -263476 208478 -89324
8241 42869 -241866 -8635 -55298 -149662 -135277 -454937 13197 -122772 -243484 29307 -308403
8229 -78447 250773 -160848 74739 123593 31462 33501 -1212 346774 28948 574 -298567 -470045
8217 -470045 -69790 -19389 -78752 183251 -314413 -21196 229390 -31273 95238 16139 -53589
8205 -42326 14877 -30867 -91093 158986 -123478 116395 109296 -153905 -165189 -38669 147303
8193 -280556 113317 484238 89262 152977 -164597 -234650 -17836 -74294 -235800 -34099 -185997
8182 -185997 -257612 -3480 -152236 -164509 -100564 -286483 -174085 143267 -183526 146821 -188053
8170 -162648 -52366 -96306 17729 5298 72537 -131579 -26195 81544 228166 -59175 -123441
8159 -123441 -229854 104554 168485 70200 -239668 -308874 -49997 204694 84186 -44345 -75946
8148 -75946 -411159 176046 23460 -268894 -139067 -74456 -270673 -230756 137732 103138 -228717
8136 182133 26934 -238872 171050 99571 225409 -451966 -280174 106659 -184021 -108389
8126 -108389 218510 103779 -151947 -63884 -460013 -151785 84737 -116456 -60197 178286
8115 -289774 -26490 -209878 100697 -278236 84980 399197 -101935 -79221 49056 -154847
8104 -33586 -4286 244814 -308831 45520 -311792 4918 -98184 -387651 -194658 140448 -84493
8092 -96573 -47491 -88834 -151478 45844 143232 337310 -399488 119541 64144 -21366 72586
8080 -108615 -87737 -377766 -80779 -219717 48632 73555 71019 91090 -212374 -39070 69525
8068 90073 -291175 -50040 -125207 -81978 -71164 -353077 189635 20845 -10324 80972 -7407
8056 -117648 147361 -130515 31935 -78519 -289014 -33983 127704 -149080 41832 10543 -37123
8044 -119063 -111968 -280570 -3169 81998 -151792 -248653 109035 16151 132881 110436 276933
8033 276933 -121956 -84871 -178799 -106322 -60238 97144 -77500 -172883 -134720 207184 69345
8021 -125078 58617 66598 222538 297682 268413 -242117 153756 148713 -205176 -95551 -93232
8010 -93232 50296 -155329 4048 9683 509900 82320 42112 -105848 -284416 -73182 -233716
7999 -233716 -258764 86937 291974 -58655 -158650 -162578 -23213 -22842 -135884 11901 -289036 114496
7986 -28425 22062 81148 -76691 -207576 -27133 -176082 -20140 45821 22092 5231 183268
7975 183268 94771 164484 -115763 -108429 -25232 -35479 77831 -17514 -118821 142166 43381
7963 -287272 -223710 122564 48100 122620 18878 -178891 -99018 -271311 217522 -169304 -120533
7952 -120533 -154296 -91389 108375 -34970 33062 -13755 -146317 40850 -56398 -35711 -166313
7941 -166313 -152981 -109380 -119041 97433 -38536 -259838 48538 100603 -49385 2621 -2123 -108367
7929 -108367 137962 -94202 -284314 100208 -266315 -146865 -243747 -316540 118386 -61082
7918 -25423 55661 92583 -12361 5191 -211608 156293 238557 181182 -191533 -253950 282830
7906 -187505 -6895 14372 -150821 11036 -342171 192382 132287 -123380 168919 107672 57859
7895 57859 244385 54573 54964 491566 67197 -246877 109378 109571 -36819 100931 -139262
7883 -20328 209307 70876 -52431 24125 121876 -72074 -199150 221206 -465093 153536 -199576
7871 -353952 -242837 -291618 -261194 101087 -69509 -395349 -26606 -23657 -24933 -252006 -183597
7860 -183597 -156079 -86023 -23647 231856 -257159 -21519 -298315 152073 42175 -418151 32172
7848 -285745 166925 -141385 86075 -258377 32444 -110633 19804 -100476 274042 4887 163208
7837 163208 211725 48302 83741 -192929 132689 -189957 174623 -63416 -458763 83090 -186066
7825 -171965 3390 15065 198294 -163538 -3043 -26890 3227 -36747 23409 83590 -217285 -68014
7812 79912 180149 33139 202026 -414835 -229494 76235 -97357 36279 -279515 280594 -180827
7800 228465 112565 31533 -39244 48060 -132086 209577 -216668 -48571 160252 -84871 84382
7788 -156807 -96717 -126109 109730 229592 -102213 159783 -172471 300638 -269848 22973
7777 -368209 -147833 -23782 171608 -95190 -226789 -344541 -218301 -40507 192506 20572
7766 120152 -5993 -271793 270233 117095 3972 -185588 -249776 150256 105748 -227499 39873
7754 -23621 -115620 82215 -96525 -80750 -338545 -31943 193876 -100828 -91075 -109203 8970 -44614
7741 240314 -113663 -228135 237225 185398 -86516 74878 4377 -22223 92576 -99367 118178
7729 -108116 -165460 673 -89909 -301737 -56516 -179728 -158244 -219279 -94725 -189365 138694
7717 7526 -43067 135004 158438 -176506 -179349 18270 -78491 -64142 122696 59443 255155
7706 255155 -172351 9269 -353831 -101138 290177 -95324 -334714 -276721 96018 -45881 39420
7694 59213 -162012 -364541 151991 -87590 -136714 -13849 -111294 -83060 150317 128770 -92161
7682 262598 -128389 109102 -180044 -139857 -230737 38984 117483 52825 -28166 -402676 -187009
7670 72115 183376 -383364 -46900 177497 -185156 173895 -251120 -232712 -144760 -7299 139042
7658 -142434 -159937 -215114 71677 250738 -111074 1806 248344 130564 -68538 127131 -52095
7646 -321255 145711 -270088 7108 -60093 -281896 26507 372888 -36395 53911 -158114 -53720
7634 -362781 137058 -102396 305685 73461 275932 -46712 -33273 248345 103202 -169699
7623 204131 -419101 283174 211916 -25826 82711 5584 -99768 -234358 -354658 3997 -238793
7611 76195 15061 15324 -116804 2011 65566 -74021 58922 -130250 172612 286726 -59238 189668
7598 -11404 251571 -317379 220279 50814 -14897 -95825 121659 -176719 -44465 -131372 -234354
7587 -234354 273706 -270262 -175335 -94213 -205257 142408 -232116 -84750 -11729 -100653 112661
7575 -32911 63997 139059 155716 154077 -50540 -100412 -93096 -329034 186895 137681 -128826 25048
7562 -162626 -78095 -54015 163331 -66022 -393472 -211458 -163098 -209250 -77954 -52412 -8354
7550 -214397 -4929 184793 -242012 -33947 -154462 173452 -231729 -56579 148252 -33298 -363559
7539 -363559 -248323 13594 -260174 147597 -189906 -160835 51230 -267619 22020 74477 -5968
7527 121598 90810 -369210 -252367 163769 -158724 46499 166276 113941 219065 -175083
7516 -159836 189774 -9864 70075 365248 119967 -372130 -62035 -53873 -23915 57270 -45684
7504 -42118 90848 -337218 -25184 -163526 -10596 -45762 26496 143084 -30270 -186256 -183678
7493 -183678 -418128 271143 -164515 186539 10395 -28598 -185828 -138257 21657 -10509 -292473
7482 -292473 -192617 -493589 -95663 206614 144442 229245 46716 109996 -223691 -174756 211910
7470 -23168 -152577 55991 -68028 21238 54266 -17637 -221379 -179806 -31861 89112 -81187
7458 -268285 -216739 -290631 125312 284333 -198253 -96806 -80749 -459875 363880 42681 14475
7446 -128391 112038 -227402 10938 -166793 82880 120475 -147264 -143832 -312838 49040 48875
7435 48875 -464884 51239 -247080 21270 -161898 -97557 274520 65157 148080 -9112 -89836
7424 -89836 -100553 203010 -163795 -167329 60757 -19145 142486 -177119 -70982 -12983 -128560
7413 -128560 40755 -389196 9746 -440083 -213664 -51270 -86043 -166854 -148188 -273962 -92639
7401 -84826 -24064 -155022 -22288 123792 22183 -146137 420668 -63029 -11500 90519 -205462
7389 17591 -230963 -371376 85782 -260550 -125656 9512 -98779 132097 109741 -221385 -241687
7378 -241687 248185 191289 -944 -251979 -89469 -4496 -89828 -54965 -130155 -14153 -79544 133471
7365 -76657 -311723 311693 92930 210459 -82170 168953 -78769 461217 -79563 -65812 92978
7353 33829 185270 -175362 44142 -195472 -398945 282409 -103095 -154016 -219950 40505 -252914
7341 14372 -79393 -40522 -58052 -276155 25517 -92509 187320 -22602 73358 -256850 -59705
7329 -64695 -164645 54227 348438 -169389 -206738 -272823 205332 -177337 19594 81551 319985
7318 319985 -139216 138150 81017 3205 312 -35652 -278299 -221871 95072 -330803 -125012
7306 -89294 169753 -24982 40105 190084 100763 -267651 -209926 -367219 54280 121237 -138147
7294 -427465 115740 67556 64029 89045 -363290 -114232 -159425 -37459 -64319 58961 -41102
7282 -55962 73446 116434 -95647 -5122 -10909 -102004 -223253 -1668 30302 -215035 -130840 258475
7269 135759 1769 17019 -97282 -230616 229523 -128759 13346 73200 -115670 -47815 72554
7257 -41377 50655 43265 -21612 86523 116243 -103940 113901 193095 -231687 -46888 5282 148535
7245 148535 215619 30971 93653 -223213 311527 -331820 -46487 -235487 -47129 -177333 -356127
7234 -356127 59905 28153 -2886 303521 15187 27113 -159207 -48632 15012 -81052 -120602
7223 -120602 -101397 11835 -29063 156193 -197925 -244823 133587 -166100 274387 -2515 -198745
7212 -198745 326284 -64675 -203184 -122056 -23296 93396 -26931 -102462 109292 101045 169777
7201 169777 -179210 5943 -195091 -76937 -30009 -301456 75241 -1427 -99059 -134705 -94766
7190 -94766 -40830 -201365 -265980 35770 -150269 105623 -60898 360828 -75880 159006 -58446
7178 -52746 117737 -301799 -400517 217229 205917 105132 -283696 27068 30288 137585 136749
7167 136749 40289 148216 33400 -178340 -294027 78763 -75843 240135 -22525 313035 85328
7155 -210226 152388 386363 -15062 284966 -150190 11217 111582 -81360 -81044 74068 136214
7144 136214 130490 -155499 214463 -167613 -300560 12584 -104544 -279535 150523 -95789
7133 63196 -212573 210233 31280 352554 -33288 -151277 -532213 -48510 -235330 41361 172478
7122 172478 13152 47727 146361 235326 15083 -65820 -286311 -113519 -68859 -124949 -139591
7111 -139591 -481907 13939 19545 -133274 -87155 -29174 66766 -64266 275865 177153 168981
7100 168981 -71835 -2100 -34816 168543 279780 4309 -174999 -287031 55303 -70834 -15717
7088 -277890 -155210 -180812 -137280 198804 83471 -50272 100122 242644 -371119 -34123 -147957
7077 -147957 202696 22703 -241566 -130691 -331209 -33626 143409 41010 80849 154007 212381
7066 212381 192579 156183 266728 -153659 34730 37510 -487 251417 217996 -425690 -217178
7055 -217178 -245271 -547458 52667 -97959 120353 -259526 -166806 76261 -227717 77868 -101746
7043 24667 -144305 -51570 -192403 -206612 -195069 -362684 -304517 200261 -28857 -35173 130238
7031 -126754 157960 -33284 -50244 254885 -58655 3455 -48258 42050 26911 210190 -20884
7019 -111391 -141914 -151682 -31309 -108063 -5997 284991 -9887 -30994 -40598 29662 227721 -585983
7006 -221229 167619 73335 211752 -31515 158022 -224635 -31877 79653 -221281 -35800 91607
6994 -118516 4614 -164666 140382 -617484 -33539 76511 134754 124912 -78872 -122035 -124727 -72107
6982 -72107 64369 -98463 127201 -295136 -179240 -260235 63069 174828 -302791 -205079 419419
6970 210822 6550 -58449 -80838 95867 -81885 20090 -156656 -182 -37481 -86690 -144298 13023
6957 15121 102275 62594 350304 219590 263980 -177150 -197919 -137845 362621 -244403 74003
6945 -103097 -11022 62158 39224 53487 153883 -22968 -24443 77369 -117582 -313539 76889
6933 101944 64899 108184 -219954 116415 191837 149176 10265 336884 85003 150751 146000
6922 146000 39530 -11694 199348 -280025 148158 52627 -19535 -161890 -9146 195375 -182828
6910 60359 -90838 -79594 -67687 65668 102491 -156377 -99794 27236 -138391 -100553 -221956
6899 -221956 -181489 -35820 61955 -343648 -158704 -26380 -315895 -16365 96497 -4028 -176293
6888 -176293 -204219 95024 -329224 362295 -78472 96063 234974 -82072 -25337 -27255 100705
6876 241846 41956 108356 107706 -67569 189607 -50265 -153795 34177 -155921 -179946 96092
6864 39631 144344 56234 -103668 -97276 -8703 10441 -107536 86947 40695 -218208 195311
6852 -157841 -37622 -44385 -156105 -342604 73904 -80787 -192588 175471 -85584 -65060 12468
6840 -232244 -127054 -124678 -400659 121545 11225 -269907 100441 237270 -222554 -269278
6830 -269278 -149025 -67792 -67211 213717 220861 -80899 210762 -192364 176937 5452 -346920
6818 133203 104237 50564 -21218 -4236 6926 -166331 -70383 -46766 -68395 -141563 -56284 -122647
6806 -122647 -236098 -215237 -118187 66143 -50840 -2573 -167905 88590 -42980 239190 -3486
6794 -263263 -141407 -174827 278025 -56961 116860 -189959 188744 -215006 135607 133507
6784 133507 -257658 144048 157188 225102 -203404 -4116 -65545 65390 -31013 -63622 197550
6772 -142925 -107900 224203 -18167 -239870 -34679 140986 -7049 -164411 -291512 211601 -331072
6760 -145115 -86061 26922 -35355 -33705 -229011 -14180 -211486 -103041 -201223 -264444 222102
6748 127742 151802 -187449 -59968 -341933 -232480 311636 -7986 -27882 -30741 -226497 170155
6736 21638 -60528 -98067 4314 92725 -109791 -510277 73499 43816 -50969 -8384 -99250 -496
6723 -6703 -266271 74403 -217718 -120351 -289416 362977 258716 -152105 116850 -85685 -186649
6712 -186649 -290354 68404 -250674 217249 128109 -264578 1627 84364 3252 -294791 -39000
6700 -103685 84263 -164991 215449 -117285 284756 232952 -143611 -66237 194988 -183967
6689 -74499 46178 -91757 97101 -201898 -159543 -146255 130974 -18949 18107 -215406 196572
6677 -353257 -49399 55838 38846 -251036 -122606 288839 139855 -114729 42069 -59348 247848
6665 29588 105236 -183538 -50076 -382328 -100896 -48340 -56744 64601 -72442 -10672 -298487
6654 -298487 12552 -70398 -302146 49976 -11749 171379 -453151 292090 -129651 215519
6643 52206 -117553 -352031 -45771 172998 87516 -89378 -96620 -248344 -25643 123689 -140280
6631 20120 222185 -16665 80872 -72423 134081 -85542 14369 -458373 77235 213948 150324
6620 150324 -81355 -81642 177998 312418 -153963 -131358 -20380 -249392 85596 -38046 167713
6608 -6811 -137530 236397 -255488 142439 -85484 -68166 249424 210556 -229406 -193894 146171
6596 14396 -225176 -2476 -198884 120052 76864 148068 -122107 -75940 -186608 -35409 258673
6584 -528547 -90947 -275225 322100 -107524 95855 104899 -45691 -191652 19167 128974 131314
6573 131314 71762 5522 392823 -374930 11385 6902 -6543 217075 441350 247016 57426
6561 -76914 -79332 -15879 178822 94154 15989 34370 -50021 -378304 -285547 61833 208035
6550 208035 181405 -254701 100379 -86314 12112 -34937 41392 -12365 42718 -27460 139841
6538 -134667 162602 -344845 -161339 -62835 -183668 -153910 -142569 16381 218741 -181328
6527 -168346 139910 231417 46498 -207053 -360696 281739 -158537 95405 190070 124862 -97988
6515 -239395 -60660 -226743 -319488 -133766 50641 -57093 -194290 -109170 -176680 111806 -47734
6503 144617 -71686 -334247 -163222 -187711 100201 212621 -156543 310737 12143 35639
6493 35639 290477 -93130 249889 29043 173644 -181960 59275 80627 208638 -134868 18159
6481 312889 795 256358 160842 104296 -75152 254914 67009 -168151 216582 -150741 -11798
6469 -175858 286846 49045 67978 341347 -88837 59305 223891 162584 61612 -247434 -220866
6458 -220866 -285254 4931 -68542 226556 -9148 102368 -80776 139275 -112103 -7523 -232490
6447 -232490 -228259 132435 436553 -110757 312371 6040 71905 -151420 -113219 183303 -31892
6435 -76454 157739 -171886 100879 -45282 123092 -112086 95068 -83066 -117117 -308609 -5465
6423 -60754 -58227 -3344 -3246 255296 -282757 -132968 200095 -131413 -346274 185026 -311453
6411 147291 50915 21705 117732 107267 -74155 -272771 -128971 -172594 -88792 6877 95409
6400 95409 -275747 183258 48557 60788 -76833 2416 -72630 -75024 72622 30800 129620 42677
6387 -124430 -19647 -59848 811 -128850 -226740 306548 155980 -308541 -60864 114349 -19665
6375 78032 -84237 -129451 208923 -205952 -89945 -239159 -332993 32743 -188523 15652 66759
6364 66759 -70595 -136701 42890 223956 -63713 115408 -46937 -27047 61131 136348 -13730
6352 17721 270702 15793 92752 177367 -119120 -6538 -35730 -150270 -81358 -278943 231012
6340 59047 -22110 -128943 -175598 -14744 -192101 2148 73864 199713 -58644 139793 215092
6329 215092 37134 114434 -146538 -353478 -46441 302269 156610 25317 -17836 -60644 -304445
6318 -304445 28372 155337 268154 -124161 62495 230247 -159861 -188906 -140628 42326 -148014
6306 254515 -281793 37693 52505 -69279 -262425 145750 345522 162958 68855 72167 -120613
6294 -52768 -26146 143653 48357 12487 -141130 304133 54825 -283451 -28064 114595 115850
6283 115850 -42824 368886 19300 59297 -391261 -118154 -161050 -2014 27965 -1461 -109429
6272 -109429 -165096 343414 81662 -94736 -117090 -13569 -2415 364388 4545 -182334 -144594
6261 -144594 34333 108646 -56329 -273 42775 284573 -141915 148580 -121583 -138437 -182020
6250 -182020 193415 54952 49192 -82307 -4413 -244257 -116991 197698 98943 -404639 251939
6238 -334142 57848 -91678 -17643 -259784 -15306 100772 -392542 -328945 105443 -169380 -146638
6227 -146638 -482215 -214505 -136669 -131278 -17764 147299 -4797 34663 125820 -220784 116747
6215 165468 206380 -4057 260071 219002 200978 -21138 65674 -3969 166878 -98092 -220988
6204 -220988 54679 276123 -294301 -119946 9751 -56209 -57291 5592 -2979 54033 156661 52817
6191 180975 -151081 34734 -113362 -71399 37906 -106880 232605 -315322 -141971 47672
6180 203163 296769 253157 -5072 -61693 -72414 -296421 -18449 -160034 -65426 57201 -278058
6168 -250191 -37234 -74992 -112432 200645 -303662 -96071 -33945 518087 -390821 18860 249844
6157 249844 123433 -195327 61338 -169182 134459 -11417 52198 197346 247959 -25949 -83593
6146 -83593 53490 -327118 -184583 -36218 -74898 -296914 -8545 47143 139686 -293642 6654
6134 -147221 -120643 -47363 -40047 9372 46515 15535 -57207 -67121 -20608 -198005 -82939 -136126
6122 -136126 288587 -27126 -222204 -139194 -220007 283089 -134094 -251962 188408 -185076
6111 -66801 41442 11714 -114283 87875 -15266 24122 -203035 -121041 105647 8407 15074 -115797
6098 -89862 22680 -165578 170770 157468 176489 -153913 5642 10941 133972 76491 -62469
6086 -317344 -74680 -379138 -302059 -16024 -47206 390476 21527 -63117 -240963 50259 -411665
6074 283408 249254 -40062 4552 -226032 47285 187205 -123763 -111151 220360 85893 -134881
6062 63345 200403 -171134 -225586 -229548 -46001 306452 84520 -64220 -117605 217970 156917
6051 156917 -92488 -75471 129852 -63550 56495 -21134 -171344 -73022 -57318 -70900 72668
6039 -241777 -13576 30141 242326 116511 -195211 -42469 221920 114056 -28502 70944 230735
6028 230735 366630 3180 -280957 -60107 181749 197656 -199147 121076 -347054 -43849 204792
6016 -179632 39374 -64495 -196146 111868 193080 137427 -29203 150095 59425 -219145 105644
6004 -3476 -65126 332142 -117547 -61041 -223822 -200350 35388 -82310 -271485 -128686 -45447
5992 24417 87403 -89571 -306678 171845 -211709 -75748 -311477 -30451 -327523 286728 148281
5981 148281 130860 15172 -53984 198861 -193415 -47598 125921 145982 77956 -305745 45862
5969 64158 -90817 196253 -182372 19685 -85210 81803 -153291 279631 -154323 -193495 49663
5957 -166814 -70745 139403 167024 53785 106541 116332 -24603 -92157 116328 58431 -105865
5945 -118528 -86737 -46590 39936 -25917 -195378 -55931 -39814 -96386 145087 174277 -122552
5933 122425 43704 -149545 -112673 -95762 184877 -111955 -69382 242281 14066 119724 18022
5921 266073 283893 -243597 -30113 264598 9182 235402 99937 207548 -120076 12273 105266
5910 105266 -365055 51069 -99025 89808 61540 -371831 214676 136605 -148093 66845 -194850
5898 192175 177282 -272837 -216447 25731 122666 117039 4255 -73737 81928 173565 -231763 107946
5885 -127291 97578 147338 -1734 -252730 3370 -43337 121015 169532 95289 -67758 -243795
5874 -243795 66947 -61401 -22484 -11061 -276161 -258905 199299 -169078 1822 196023 104440
5863 104440 80726 9073 -121027 -106032 -71429 137024 9648 -106215 -73125 133747 61650
5851 -21470 -160594 18782 -63010 -38120 -132687 -219031 -18421 63439 -75426 -65303 78453 -79812
5838 80814 2898 -209411 -74328 118821 293354 146746 177027 -54822 -201775 -294716 49567
5826 59930 129873 -269464 18844 -85283 182901 148556 -168922 -83085 274838 67607 193474
5815 193474 -184974 147040 -228398 409942 -17393 117943 9049 207706 -145214 244214
5804 202123 -255649 206757 83030 -551654 55316 58633 -45913 201287 -70391 -134418 -233062
5793 -233062 181612 177747 -152956 33707 241937 422133 57850 -48430 -78880 -39096 15021
5781 70490 -34574 -238360 -145402 129524 -110446 199084 -204536 2815 217116 -68042 115413
5769 145463 -31817 -12332 -157040 -59772 -218633 44420 10250 -420 67977 -197458 -275520
5758 -275520 5448 194697 12408 -142535 16623 129455 -169198 -19134 93683 -296124 155218
5746 -133505 100221 457983 117238 54717 -34027 -253231 -31404 -239907 135965 -142370
5735 71830 -22545 -49804 -1900 -11197 -6599 55883 -16942 45140 109894 -33050 222175 314159
5723 314159 -76897 -61387 183622 72398 -81728 -145619 124938 -200466 -10103 41323 -138339
5711 -183606 -67284 -175696 -124408 16353 -209422 -11045 61609 366010 175825 231121 45868
5699 -118643 144625 -394714 123291 96172 350577 -83218 -13491 126434 97793 -232362
5688 -242010 133276 -81214 228055 -134725 -112072 52382 73138 -133806 -228901 277199 -11755
5676 36473 6718 283039 -88104 -18981 -57159 -168052 -67381 -41768 -24170 -128131 -21695
5664 10955 250415 -1342 66246 116998 -10298 222911 -70237 403247 -137734 19415 -127481
5652 -153844 -6381 -129637 -135970 95797 -84467 -142067 -88851 53051 -242887 12833 109264 -82902
5639 33706 62833 -113541 -126053 -113201 -38219 85407 34002 22394 -173504 228901 -69530
5627 52305 -235508 -167905 103505 -153429 69166 -37407 158248 -383781 -125269 -154827 249604
5615 -14242 39335 229047 3665 151119 310312 -34704 17603 113288 51189 -143200 79937
5603 105335 363353 192479 168540 68783 26680 -36329 -74001 82116 77261 -289545 39557
5591 -71617 97968 134360 7238 -113145 -128900 -40894 -77844 29080 -16866 85536 35217 -74866
5578 118329 54109 -51756 -223783 -35397 -228401 -42482 157422 -119105 152465 94975 -16098
5566 -113016 171471 33399 -242668 16007 41126 -102998 102041 24316 37172 -37512 32628
5554 -104688 -93211 -131188 71609 -19383 -13591 138050 -197386 38414 58794 -156375 69055
5542 267139 -48083 162598 137732 22186 34745 -212855 -192005 -152501 -202060 90195 -99111
5530 60386 -237405 96277 -32582 13314 35067 -162378 -345380 13319 -92328 119872 130544
5519 130544 -102725 69050 224550 -121500 -118958 82357 177600 195682 12682 -158574 -19735
5507 136977 -104771 134244 -175108 -226549 -88668 93746 42742 -216502 69992 49118 -92980
5495 -109170 -204527 -15539 -202911 -73441 -10327 -186164 -126694 281287 144098 -54761 -68098
5484 -68098 163545 11914 -250353 50776 -19789 -192830 115560 -276923 10252 37819 41379
5473 41379 -54964 -325663 26948 6394 -60611 -123788 -23257 51123 -55215 109122 632 602054
5461 602054 202652 29865 102895 -60648 -80487 104864 178422 -144210 -96725 -63743 210378
5449 46117 345777 200432 -38386 -15338 -234640 22361 92757 -10772 -112403 64005 -304186
5437 -336309 115820 261653 291759 123959 210786 -30199 -101041 27124 -102563 85979 148525
5426 148525 -56853 206120 278817 -97129 -162551 206577 76119 -367173 393775 74200 100013
5415 100013 19483 119029 -148583 -100772 389303 -60241 -325091 -235626 -98532 95141 245832
5404 245832 -129024 90364 111919 172449 -224796 -28995 306947 -112585 170972 -41786 -154237
5393 -154237 -84839 237166 -332083 -82719 108507 -5475 -26181 -108723 -53832 154278 221752
5382 221752 207215 116450 -83503 81445 103491 208192 -104186 99471 199361 -387 -86468 -51363
5370 -51363 -286518 -88638 124034 -156136 -380927 80293 61066 -417408 -26381 -62683 -2355
5358 -122127 119382 85069 84064 -194461 -239202 31702 332881 394192 141868 -343379 -27085
5346 -125827 63256 168573 47358 30549 410051 232361 106041 165757 185050 305075 155288
5335 155288 -137001 -224833 323853 133394 -57999 -249240 153844 315526 -28482 -98067
5325 -98067 -78401 -118254 -24776 16445 -121727 13649 344249 -245259 148784 40897 131369
5314 131369 40158 8896 -88467 -218932 -145030 -108323 -24350 -42101 134183 128098 -25417 -261159
5302 -261159 61925 -66821 -79614 -153099 17092 43441 -103492 -173690 -105497 -190014 197489
5290 216339 155644 229169 249031 89954 282262 -40981 -113698 196195 -188089 -77687 68870
5278 72550 105542 87778 -288135 -112107 9270 118189 93039 -313705 162325 -261243 186614
5266 12670 -107361 151894 -8470 -71442 29325 -192569 77494 -297201 154252 283475 -40932
5254 -67114 -44351 -16714 -69889 -82536 155769 166683 46116 64475 -115296 78516 -92587
5242 -464074 -4794 -165353 150623 90768 -63003 22101 -230004 301255 -167336 129553 85067
5231 85067 505710 26991 36569 -45739 -238996 -235989 -54213 193490 -45601 -93115 204488
5219 -74071 57594 -9243 -40981 -9947 -333595 169211 146 -73872 -193825 -16591 -337549 186265
5206 -193544 -839 16348 -66859 -46255 145618 -234028 -346661 -261403 162508 -74919 -37921
5195 -37921 32331 145469 261216 265625 -308358 5740 -76792 63473 48429 -198594 236067
5183 -147678 -178022 -259460 33419 271947 72039 16089 115094 -126396 183244 -20327 -178245
5172 -178245 -37262 64530 58018 125851 129198 24405 -240824 -28843 -191041 302855 42906
5160 -27047 102865 335582 337975 -60868 19877 265419 -160235 -37324 -137524 443378 -209790
5148 -185291 -70480 -126624 185714 150940 -126059 79356 -221188 -69855 182949 2891 226310
5137 226310 106296 -59617 3656 246708 196263 -74111 -198639 111604 -65663 181250 67559
5125 -75725 135919 49962 205337 -102591 333822 -199984 -45506 35384 89861 44968 103631
5114 103631 -186531 -94093 3653 -99748 -126615 -181835 -5222 -227123 -116291 82865 -143669
5102 -201164 -101588 31741 -6268 -2904 -37907 -153269 2122 149914 -182045 123538 230973
5091 230973 -100685 52855 91727 -245630 -121113 -65255 -160200 221002 68114 -289055 -106703
5079 -147439 239714 -23208 403536 80787 -259640 -151313 272664 -146894 -124118 -16867
5068 -225566 58870 65303 268238 -25522 34647 358793 -186897 245250 -163665 31209 141549
5057 141549 -154202 177933 -178659 11707 -120863 36399 -205367 191421 -42482 310239
5046 67161 216873 -305606 -147121 41377 100802 26691 -191180 -110842 207138 158301 -6532
5034 99724 128907 -27500 -115345 30188 -3302 -48135 79033 65597 168879 -24686 -84465 227631
5021 -41464 44126 -208545 76856 -1820 117282 -17511 -129577 107497 -17708 246484 -166665
5009 215960 177738 164163 116867 -97424 -205358 25641 28266 -119148 -160790 -269051 -385684
4998 -385684 188513 83019 29783 -132663 -62061 56895 -169491 -69647 256108 100526 32072
4986 -188818 -176338 -91322 -27033 241245 241188 -81400 390212 163201 -130314 -216786 332565
4974 -45440 196446 115504 39070 27789 -127392 -165961 113142 61144 193453 57613 10068
4962 -84470 -65666 26269 -247611 210543 3931 -64331 103539 56244 -141606 -89566 -145373
4951 -145373 140864 -83740 189658 -47509 370932 152958 76893 321894 -222126 9344 -360939
4939 -397361 58965 -58154 190298 -129558 208541 312715 6121 32918 -154609 -95903 15428
4927 -300616 -1507 -120952 285633 114792 302766 -6883 -269086 268984 -248921 60276 254470
4916 254470 43188 144063 12026 47968 -231760 -76394 -60474 -166743 48275 -160437 -89434
4905 -89434 121777 18131 82568 47145 -22136 -147240 -245300 104308 -251638 117464 255925
4894 255925 102098 205029 5450 -228937 166025 -12635 96834 -172540 218356 -443413
4883 -113767 -55126 56117 -45848 -527102 48653 54987 435525 261472 -72425 31385 148385
4872 148385 225850 20258 2883 -147279 -151193 15819 182926 -31746 -65980 -167543 -381931
4861 -381931 197277 -3947 68121 87929 123715 -99290 -56182 -12211 -117496 -177151 4094 111242
4849 111242 219503 -210272 -2851 225130 -54297 -105908 -136920 -108285 -132975 63110 -406854
4837 55325 65785 -25404 -116494 121220 18662 -146041 74938 -262240 -207264 -77165 298082
4825 96379 -74165 163921 -71910 -99051 22077 35449 -279263 -112558 180515 -249488 11235
4813 -103900 290333 141361 -305139 26245 -74186 -296715 -11907 213121 264585 175493 -42422
4801 -175750 -329628 136040 239915 150972 -94129 142430 298758 -199370 42913 106998
4791 106998 159071 97122 145903 15092 -19036 95330 -266725 135391 66642 31185 -143371
4779 -415063 96944 -45756 186838 98470 -255729 66163 -242226 112689 -34912 -25941 -28532
4768 -28532 -39176 -96231 -126385 -85503 -30625 -122501 24168 -32405 72905 -232519 241594
4756 42609 -128566 193485 184901 311685 151181 -42314 556706 116039 210548 56124 -373300
4744 79810 -57749 -89670 230061 -239087 -198287 -17890 249785 -350986 -117634 15246 -44729
4732 47097 56550 316306 171706 28932 141208 277437 -237431 65365 -328353 -51785 -196995
4721 -196995 198054 37855 -76514 54228 -41342 -6346 25044 -114981 -55447 44714 40658 -123998
4708 15434 58066 -59083 307945 -119368 -183141 -164105 -93934 -73579 -481707 24666 119076
4697 119076 200149 62086 79555 -102936 339000 -41546 -28048 186260 61108 53693 4888
4685 3903 -219521 45676 232525 111547 -66086 -214752 -30201 118911 -104744 -77347 126402
4673 132762 382154 112201 6509 -186367 -8934 -89988 45025 252912 -39260 124106 -66556
4661 -93818 -72810 -175176 -143082 -155078 142876 -128280 245777 -243952 193294 13157 263121
4650 263121 -26400 -3839 -424334 -141459 -324063 184443 85352 -187835 -37976 -47863 18468
4638 48097 231639 -40748 455193 140949 -330909 7120 -29881 259815 63487 -51769 83650
4626 13408 43708 -219406 -150262 56916 -164992 170692 -149184 -44429 41276 276002 -341
4614 21163 -170289 13279 44033 -104050 -4373 -40752 50907 216039 102351 -109357 -143698
4603 -143698 -122243 -119924 -63564 -15293 -28736 150180 -68536 159817 -92534 -240018 -2006
4591 70940 73712 -223156 146880 -48468 -169307 -104967 228192 280492 -142794 -63238 150372
4579 -244625 127652 249465 55759 -27157 152421 -131158 -4769 -29813 -208737 118735 -92856
4567 383940 219671 114648 65989 -30025 -48944 73613 106278 147794 197985 -267233 -248
4555 116294 51706 109331 -194485 -80099 -130616 -35466 45996 107737 -61975 182071 -324441
4543 344564 -102327 -46597 42306 -370423 293 96264 13381 259209 15373 -166327 328852
4531 13902 62483 -217418 -259433 -182780 -181305 189098 110287 196327 43058 -153390 -83227
4520 -83227 -36408 -135706 53343 171873 -203733 29599 69962 5374 -85579 -192605 -94527
4508 -206608 -132440 -18539 35902 -100304 364027 -63 -35934 -183959 -120050 213101 88926
4496 -141117 257081 136316 68678 -299733 187814 26976 -137884 70630 176113 -24392
4485 -493 -79541 -60536 -199798 108647 5122 338957 51090 315262 5731 228650 91353 -202942
4472 93626 -102675 131176 -76536 -215797 82788 -229133 -37146 32657 78931 -279183 -28893
4460 -243389 189661 -24216 283487 44209 -62076 -91993 124475 -251209 120360 -30934 -18716
$$ [...]
##END NTUPLES=NMR SPECTRUM
##END=
