##TITLE=AC1720_SALAH15006_9207540_TxWVUnM79i
##JCAMPDX= 6.0         $$ Bruker NMR JCAMP-DX V2.0
##DATA TYPE= NMR SPECTRUM
##DATA CLASS= NTUPLES
##ORIGIN= BRUKER
##OWNER= Administrator
$$ 1.72 TOPSPIN		Version 2.1
$$ 2015-06-01 16:22:15.139 -0700  Administrator@X
$$ Compression mode = diff/dup
##.OBSERVE FREQUENCY= 400.02188249412
##.OBSERVE NUCLEUS= ^1H
##.ACQUISITION MODE= SIMULTANEOUS (DQD)
##.ACQUISITION SCHEME= undefined
##.AVERAGES= 64
##.DIGITISER RES= 22
##SPECTROMETER/DATA SYSTEM= spect
##.PULSE SEQUENCE= noesygpps1d.comp
##.SOLVENT NAME= COFFEE_meoh
##.SHIFT REFERENCE= INTERNAL, COFFEE_meoh, 1, 14.96074
##AUDIT TRAIL= $$ (NUMBER, WHEN, WHO, WHERE, PROCESS, VERSION, WHAT)
$$ ##TITLE= Audit trail, TOPSPIN		Version 2.1
$$ ##JCAMPDX= 5.01
$$ ##ORIGIN= Bruker BioSpin GmbH
$$ ##OWNER= Administrator
$$ $$ E:\/data/COFFEE/nmr/AC1720_SALAH15006_9207540_TxWVUnM79i/12/pdata/1/auditp.txt
$$ ##AUDIT TRAIL=  $$ (NUMBER, WHEN, WHO, WHERE, PROCESS, VERSION, WHAT)
(   1,<2015-06-01 16:22:09.733 -0700>,<Administrator>,<X>,<go>,<TOPSPIN 2.1>,
      <created by zg
	started at 2015-06-01 16:10:39.420 -0700,
	POWCHK enabled, PULCHK disabled,
       configuration hash MD5:
       21 0F 79 D6 B3 7B B4 F6 88 20 88 DB 03 48 BD 9F
       data hash MD5: 64K
       66 02 14 DE D9 85 70 6A 6E BE B9 2C 99 9D BE 59>)
(   2,<2015-06-01 16:22:13.123 -0700>,<Administrator>,<X>,<proc1d>,<TOPSPIN 2.1>,
      <Start of raw data processing
       efp LB = 0.3 FT_mod = 6 PKNL = 1 PHC0 = 0 PHC1 = 0 SI = 128K 
       data hash MD5: 128K
       66 E2 21 55 37 66 BF AB 8F 98 53 55 68 60 94 B3>)
(   3,<2015-06-01 16:22:13.998 -0700>,<Administrator>,<X>,<proc1d>,<TOPSPIN 2.1>,
      <pk PHC0 = -84.25964 PHC1 = 0 
       data hash MD5: 128K
       B3 FF A5 E4 5A B4 52 93 CB 37 EB 7A C0 C5 5B 75>)
(   4,<2015-06-01 16:22:14.373 -0700>,<Administrator>,<X>,<proc1d>,<TOPSPIN 2.1>,
      <abs ABSG = 1 
       data hash MD5: 128K
       C1 7A AD AD 5C F0 0E 3B 63 7B CA 26 0A 52 6A 84>)
(   5,<2015-06-01 16:22:14.467 -0700>,<Administrator>,<X>,<proc1d>,<TOPSPIN 2.1>,
      <abs ABSG = 2 
       data hash MD5: 128K
       CF EC 1A E4 54 9E 95 9E 59 94 A6 D1 4B FE E1 ED>)
(   6,<2015-06-01 16:22:14.545 -0700>,<Administrator>,<X>,<proc1d>,<TOPSPIN 2.1>,
      <abs ABSG = 3 
       data hash MD5: 128K
       C0 98 7C 29 2E 08 26 18 21 89 F9 08 13 B6 59 E3>)
(   7,<2015-06-01 16:22:14.623 -0700>,<Administrator>,<X>,<proc1d>,<TOPSPIN 2.1>,
      <abs ABSG = 4 
       data hash MD5: 128K
       F0 DE 9E 29 69 2D F8 85 96 56 65 3B A6 E6 58 CF>)
(   8,<2015-06-01 16:22:14.701 -0700>,<Administrator>,<X>,<proc1d>,<TOPSPIN 2.1>,
      <abs ABSG = 5 
       data hash MD5: 128K
       FE 2F 7F 9A F4 A3 47 1F 99 41 52 94 4E 6E D7 7C>)
$$ ##END=
$$ 
$$ $$ hash MD5
$$ $$ 5B B9 F1 80 51 DF DA 71 63 89 3B C2 CB 02 C4 A0
##$RELAX= 
##$RELAX= 
##$RELAX= 
##$RELAX= 
##$RELAX= 
##$RELAX= 
##$RELAX= 
##$RELAX= 
$$ Bruker specific parameters
$$ --------------------------
##$DU= <E:\>
##$EXPNO= 12
$$ [...]
##$TP07= 0
##$TPNAME0= <>
##$TPNAME1= <>
##$TPNAME2= <>
##$TPNAME3= <>
##$TPNAME4= <>
##$TPNAME5= <>
##$TPNAME6= <>
##$TPNAME7= <>
##$TPOAL= (0..7)
0.5 0.5 0.5 0.5 0.5 0.5 0.5 0.5
##$TPOFFS= (0..7)
0 0 0 0 0 0 0 0
##$TUNHIN= 0
##$TUNHOUT= 0
##$TUNXOUT= 0
##$USERA1= <user>
##$USERA2= <user>
##$USERA3= <user>
##$USERA4= <user>
##$USERA5= <user>
##$V9= 5
##$VALIST= <valist>
##$VCLIST= <CCCCCCCCCCCCCCC>
##$VD= 0
##$VDLIST= <DDDDDDDDDDDDDDD>
##$VPLIST= <PPPPPPPPPPPPPPP>
##$VTLIST= <TTTTTTTTTTTTTTT>
##$WBST= 2048
##$WBSW= 25
##$XGAIN= (0..3)
0 0 0 0
##$XL= 0
##$YL= 0
##$YMAX_a= 8418002
##$YMIN_a= -14772019
##$ZGOPTNS= <>
##$ZL1= 120
##$ZL2= 120
##$ZL3= 120
##$ZL4= 120
##$ABSF1= 14.96074
##$ABSF2= -5.597442
##$ABSG= 5
##$ABSL= 3
##$ALPHA= 0
##$AQORDER= 0
##$ASSFAC= 0
##$ASSFACI= 0
##$ASSFACX= 0
##$ASSWID= 0
##$AUNMP= <proc_prof1d_extract.lims>
##$AXLEFT= 0
##$AXNAME= <>
##$AXNUC= <1H>
##$AXRIGHT= 0
##$AXTYPE= 0
##$AXUNIT= <>
##$AZFE= 0.1
##$AZFW= 0.1
##$BCFW= 0
##$BC_mod= 0
##$BYTORDP= 0
##$COROFFS= 0
##$CY= 15
##$DATMOD= 1
##$DC= 0
##$DFILT= <>
##$DTYPP= 0
##$F1P= 0
##$F2P= 0
##$FCOR= 0.5
##$FTSIZE= 131072
##$FT_mod= 6
##$GAMMA= 0
##$GB= 0
##$INTBC= 1
##$INTSCL= 1
##$ISEN= 128
##$LB= 0.3
##$LEV0= 0
##$LPBIN= 0
##$MAXI= 10000
##$MC2= 0
##$MEAN= 0
##$ME_mod= 0
##$MI= 0
##$NCOEF= 0
##$NC_proc= -2
##$NLEV= 6
##$NOISF1= 0
##$NOISF2= 0
##$NSP= 0
##$NTH_PI= 0
##$NZP= 0
##$OFFSET= 14.96074
##$PC= 1
##$PHC0= -84.25964
##$PHC1= 0
##$PH_mod= 1
##$PKNL= yes
##$PPARMOD= 0
##$PPDIAG= 0
##$PPIPTYP= 0
##$PPMPNUM= 2147483647
##$PPRESOL= 1
##$PSCAL= 4
##$PSIGN= 0
##$PYNMP= <proc.py>
##$REVERSE= no
##$SF= 400.020009742611
##$SI= 131072
##$SIGF1= 0
##$SIGF2= 0
##$SINO= 400
##$SIOLD= 131072
##$SPECTYP= <>
##$SREGLST= <1H.CDCl3>
##$SSB= 0
##$STSI= 131072
##$STSR= 0
##$SW_p= 8223.68421052631
##$SYMM= 0
##$S_DEV= 0
##$TDeff= 65536
##$TDoff= 0
##$TI= <>
##$TILT= no
##$TM1= 0
##$TM2= 0
##$TOPLEV= 0
##$USERP1= <user>
##$USERP2= <user>
##$USERP3= <user>
##$USERP4= <user>
##$USERP5= <user>
##$WDW= 1
##$XDIM= 131072
##$YMAX_p= 375525207
##$YMIN_p= -11394
##$CURPLOT= <Network HP LaserJet P1505>
##$CURPRIN= <$Network HP LaserJet P1505>
##$DFORMAT= <normdp>
##$LAYOUT= <+/1D_H.xwp>
##$LFORMAT= <normlp>
##$PFORMAT= <normpl>
##$SURQMSG= 1
$$ End of Bruker specific parameters
$$ ---------------------------------
##NTUPLES= NMR SPECTRUM
##VAR_NAME=  FREQUENCY,     SPECTRUM/REAL,   SPECTRUM/IMAG
##SYMBOL=    X,             R,               I
##VAR_TYPE=  INDEPENDENT,   DEPENDENT,       DEPENDENT
##VAR_FORM=  AFFN,          ASDF,            ASDF
##VAR_DIM=   131072,        131072,          131072
##UNITS=     HZ,            ARBITRARY UNITS, ARBITRARY UNITS
##FACTOR=    0.0627417313425164, 1,          1
##FIRST=     8223.62146879497, 773,          -59433
##LAST=      0,             2208,            -59947
##MIN=       0,             -11394,          0
##MAX=       8223.62146879497, 375525207,    0
$$ Real data points
##PAGE= N=1
##DATA TABLE= (X++(R..R)), XYDATA
$$ [...]
61353D48111L580M029N016O094O796P180P386P138O180M942M141L825L371K469
$$ 448111 451691 455720 460736 466830 473626 480806 488192 495330 501510 506452 510593 514418 517789 520258
61339E20258J590J285J473J637J478J191J235J822K484K317J010o31j562j749
$$ 520258 521848 523133 524606 526243 527721 528912 530147 531969 534453 536770 537780 537149 535587 533838
61325E33838j910k202j978r49K01O94N69L94O12J469K958M556N548N924O405P269
$$ 533838 531928 529726 527748 526799 527000 527694 528263 528657 529269 530738 533696 538252 543800 549724 556129 563398
61309E63398P908P964Q148R228J0858J2164J2940J3338J2905J0972P819M504J571
$$ 563398 571306 579270 587418 596646 607504 619668 632608 645946 658851 669823 677642 682146 683717
61296F83717j163l651n361o205o813p575q141q207q207q709r552j0024r667q607
$$ 683717 682554 678903 673542 667337 660524 652949 644808 636601 628394 619685 610133 600109 590442 581835
61282E81835p286o104n165m229l075j957j317j005k59J256K736L133K504K005
$$ 581835 574549 568445 563280 559051 555976 554019 552702 551697 551438 552694 555430 558563 561067 563072
61268E63072K428L294L644L342L082L309L724M097M912O628Q650R740R445Q474
$$ 563072 565500 568794 572438 575780 578862 582171 585895 589992 594904 601532 610182 619922 629367 637841
61254F37841P548O592N322L982K979K217J338M21j27j53O3J47j63r79k017k615
$$ 637841 645389 651981 657303 661285 664264 666481 667819 668240 668113 667960 668023 668170 668007 667028 665011 662396
61238F62396k364j674j366j788k525k925k623j741q19l89m15k72N70J989L506
$$ 662396 660032 658358 656992 655204 652679 649754 647131 645390 644571 644182 643767 643495 644065 646054 649560
61223F49560M750N429N286M484L722L563L877M272M718N327N833N900N649N363
$$ 649560 654310 659739 665025 669509 673231 676794 680671 684943 689661 694988 700821 706721 712370 717733
61209G17733M882L891K659J859J650J514J034L98J03N22J761L645N769P839R839
$$ 717733 722615 726506 729165 731024 732674 734188 735222 735620 735723 736245 738006 741651 747420 755259 765098
61194G65098J1735J3282J4307J4876J4825J3583J0969P793N132L225J639J73j022
$$ 765098 776833 790115 804422 819298 834123 847706 858675 866468 871600 874825 876464 876637 875615
61181H75615j921k575k838k778l138m591o674q204q618q251p550o880o846p817
$$ 875615 873694 871119 868281 865503 862365 857774 851100 842896 834278 826027 818477 811597 804751 796934
61167G96934r081r532r223r284j0156j0906j0703r955r462r262q899q262p511
$$ 796934 787853 778321 769098 759814 749658 738752 728049 718094 708632 699370 690471 682209 674698
61154F74698o639n565m312k814r21J137K765L711M221M293L292Q48k369n160o794
$$ 674698 668059 662494 658182 655368 654447 655584 658349 662060 666281 670574 673866 674714 672345 667185 660391
61139F60391p227o801o068n514n103m320k915j228L73J908L359M364M792N228
$$ 660391 653164 646363 640295 634781 629678 625358 622443 621215 621588 623496 626855 631219 636011 641239
61125F41239O356Q008R387J0082J0530J1385J2800J4451J6086J7826J9736K1353
$$ 641239 647595 655603 664990 675072 685602 696987 709787 724238 740324 758150 777886 799239
61113G99239K2059K1982K2008K2511K2701K1781K0239J9147J8566J7593J5847
$$ 799239 821298 843280 865288 887799 910500 932281 952520 971667 990233 1007826 1023673
61102A023673J3844J1825R341O230L032L3l230o996j0622j3373j5327j6938j8253
$$ 1023673 1037517 1049342 1058683 1064913 1067945 1067978 1064748 1057752 1047130 1033757 1018430 1001492 983239
61089I83239j9019j9206j8999j8581j8154j7812j7363j6638j5953j5679j5442
$$ 983239 964220 945014 926015 907434 889280 871468 854105 837467 821514 805835 790393
61078G90393j4540j3058j1729j0649r242p565o415n795m654k701j135p94p69J32
$$ 790393 775853 762795 751066 740417 731175 723610 717195 711400 706746 704045 702910 702116 701347 701479
61064G01479J608K669L353M289N284N621N423N598O643Q338J0343J2232J3359
$$ 701479 703087 705756 709109 713398 718682 724303 729726 735324 741967 750305 760648 772880 786239
61051G86239J3524J3515J4231J5600J7035J8484K0151K1703K2678K3352K4377
$$ 786239 799763 813278 827509 843109 860144 878628 898779 920482 943160 966512 990889
61040I90889K5798K7234K8609L0019L1289L2423L3977L6174L8276L9718M1241
$$ 990889 1016687 1043921 1072530 1102549 1133838 1166261 1200238 1236412 1274688 1314406 1355647
61029A355647M3794M6946M9532N1314N2787N3887N4254N4462N5648N8355O2864
$$ 1355647 1399441 1446387 1495919 1547233 1600020 1653907 1708161 1762623 1818271 1876626 1939490
61018A939490O9996Q0020R1319J01866J11622J21929J33451J47013J65785J93669
$$ 1939490 2009486 2089506 2180825 2282691 2394313 2516242 2649693 2796706 2962491 3156160
61008C156160K31659K78484L34418M00660M75134N54210O40291P42697Q69544
$$ 3156160 3387819 3666303 4000721 4401381 4876515 5430725 6071016 6813713 7683257
60999G683257J026732J228246J489980J787044K013293K013121J690919J103970
$$ 7683257 8709989 9938235 11428215 13215259 15228552 17241673 18932592 20036562
60991B0036562M40431j00853m11535m76932l25863j8554L20368N06860L88079
$$ 20036562 20476993 20376140 19964605 19487673 19161810 19143256 19463624 19970484 20358563
60982B0358563m9812o65409j255907j672541j868350j873155j748005j555469
$$ 20358563 20308751 19643342 18387435 16714894 14846544 12973389 11225384 9669915
60974I669915j345019j145696r67743q12242o78805n66068m70594l89117l20775
$$ 9669915 8324896 7179200 6211457 5399215 4720410 4154342 3683748 3294631 2973856
60965B973856k65611k22218j88158j61465j40558j23592j09016r6191q4844p4640
$$ 2973856 2708245 2486027 2297869 2136404 1995846 1872254 1763238 1667047 1582203 1507563
60955A507563o5605n7940n0935m3261l5051k8488k5355k4821k4669k3862k2812
$$ 1507563 1441958 1384018 1333083 1289822 1254771 1226283 1200928 1176107 1151438 1127576 1104764
60944A104764k1773k0381j8541j6666j5007j3444j1989j0847j0034r365q757q118
$$ 1104764 1082991 1062610 1044069 1027403 1012396 998952 986963 976116 966082 956717 947960 939842
60932I39842p211o010m926m206l390j888J51K078L600M909O182P506R059J0835
$$ 939842 932631 926621 921695 917489 914099 912211 912362 914440 918040 922949 929131 936637 945696 956531
60918I56531J2400J3417J4135J4836J5201J4893J4394J4381J4496J3715J1871
$$ 956531 968931 982348 996483 1011319 1026520 1041413 1055807 1070188 1084684 1098399 1110270
60907A110270R812P993N898L109M0k809n518q252j0770j2861j4642j6119j7088
$$ 1110270 1120082 1128075 1133973 1137082 1137122 1134313 1128795 1120543 1109773 1096912 1082270 1066151 1049063
60894A049063j7849j9190k1077k2135k1210j8945j7029j6331j6485j6910j7291
$$ 1049063 1031214 1012024 990947 968812 947602 928657 911628 895297 878812 861902 844611
60883H44611j7279j6647j5755j5183j4926j4575j4126j3897j3682j2779j1068
$$ 844611 827332 810685 794930 779747 764821 750246 736120 722223 708541 695762 684694
60872F84694r367q425q114p842p293o555n897n622n788n942n547m707m036l696
$$ 684694 675327 666902 658788 650946 643653 637098 631201 625579 619791 613849 608302 603595 599559 595863
60858E95863l259k672k658l704n171o041o135o023o011n839n327m688m206l983
$$ 595863 592604 589932 587274 583570 578399 572358 566223 560200 554189 548350 543023 538335 534129 530146
60844E30146m064m410m733m684m291l900l680l517l467l860m708n365n168m277
$$ 530146 526082 521672 516939 512255 507964 504064 500384 496867 493400 489540 484832 479467 474299 470022
60830D70022l482l176k990k448j656j078q57p21l90J97R61J691K038J861J545
$$ 470022 466540 463364 460374 457926 456270 455192 454335 453614 453224 453421 454382 456073 458111 459972 461517
60815D61517J642K122K378K026J342P50L33P9J06M03O54O91P21P47K87q35j895
$$ 461517 463159 465281 467659 469685 471027 471777 472110 472189 472295 472698 473352 474043 474764 475511 475798 474963 473068
60798D73068k072j560j159j040p42k75l38j241k356k917k866k639k581k813l282
$$ 473068 470996 469436 468277 467237 466495 466220 465882 464641 462285 459368 456502 453863 451282 448469 445187
60783D45187l699l709l315k951l012l504m091m306l877l095k644k729k706j996
$$ 445187 441488 437779 434464 431513 428501 424997 420906 416600 412723 409628 406984 404255 401549 399553
60769C99553r47j87M08J292K148K301J977J993K264J901R35N84J356K211K210
$$ 399553 398606 398419 398827 400119 402267 404568 406545 408538 410802 412703 413638 414222 415578 417789 419999
60754D19999J783J625J509J093R44J654K686L168L175L255L281K840K225J912
$$ 419999 421782 423407 424916 426009 426953 428607 431293 434461 437636 440891 444172 447012 449237 451149
60740D51149J443L0k026l583m254m687n289n700n629n339n057m620l957l325k901
$$ 451149 452592 452622 450596 447013 442759 438072 432783 427083 421454 416115 411058 406438 402481 399156 396255
60725C96255k585k308k162k164k294k624l049l095k468j581j005o64j48L77L44
$$ 396255 393670 391362 389200 387036 384742 382118 379069 375974 373506 371925 370920 370256 370108 370485 370829
60710C70829k54q00r13p22l79R0L84J03o02j110j118q27l80K55Q28R31P03Q16
$$ 370829 370575 369775 368862 368140 367761 367851 368235 368338 367736 366626 365508 364681 364301 364556 365384 366315 367018 367834
60692C67834J542K361K698K588K395K291K186J997J802J890K512L401L883L778
$$ 367834 369376 371737 374435 377023 379418 381709 383895 385892 387694 389584 392096 395497 399380 403158
60678D03158L809M598N650N996N515M824M188L490L070L437M123L922K559J121
$$ 403158 406967 411565 417215 423211 428726 433550 437738 441228 444298 447735 451858 455780 458339 459460
60664D59460M56J53m09r98j190j289j724k223k343k434l134m157m427l467j963
$$ 459460 459916 460069 459660 458662 457472 456183 454459 452236 449893 447459 444325 440168 435741 432274 430311
60649D30311q26k13K59P28R06O02P9k83n75j299k610l938m615m586m244l812l292
$$ 430311 429485 429272 429531 430259 431165 431767 431846 431563 430988 429689 427079 423141 418526 413940 409696 405884 402592
60632D02592k815k522k219j653j050q25q46n87K9N57Q51J263J906K378K416K171
$$ 402592 399777 397255 395036 393383 392333 391508 390662 390075 390104 390661 391512 392775 394681 397059 399475 401646
60616D01646J669O49p28j646j637j203j016r25l57O74J557J888J783J418P92j
$$ 401646 403315 403964 403236 401590 399953 398750 397734 396809 396452 397126 398683 400571 402354 403772 404564 404563
60600D04563n75n50Q1R46J580J789J725J684J848K196K487K275J242k12j071p03
$$ 404563 403988 403438 403519 404465 406045 407834 409559 411243 413091 415287 417774 420049 421291 421079 420008 419305
60584D19305L53J051J016O99N83P64J255J992K617K714K421K305K621L224M108
$$ 419305 419658 420709 421725 422424 423007 423771 425026 427018 429635 432349 434770 437075 439696 442920 447028
60569D47028N422O909P977Q535R158J0184J1116J1216J0283Q597O439L980J382
$$ 447028 452450 459359 467336 475871 485029 495213 506329 517545 527828 536425 542864 546844 548226
60556E48226j183l460n070n759n619m879l655k203j044l36N60K228M204N569O289
$$ 548226 547043 543583 538513 532754 527135 522256 518601 516398 515354 515018 515578 517806 522010 527579 533868
60541E33868P151Q471R864J1233J2953J4801J5739J5159J3509J1378Q726N470
$$ 533868 541019 549490 559354 570587 583540 598341 614080 629239 642748 654126 662852 668322
60529F68322K079q93l340n342o856p866q336p960o576m921m087m135m112l550
$$ 668322 670401 669508 666168 660826 653970 646104 637768 629808 623232 618311 614224 610089 605977 602427
60515F02427k913k324j157N94J727J454P02R22K302M003N501O884Q373J0237J2794
$$ 602427 599514 597190 596033 596627 598354 599808 600510 601432 603734 607737 613238 620122 628495 638732 651526
60500F51526J5920J9129K2494K6760L1906L6502L9297M0650M1552M1960M1065
$$ 651526 667446 686575 709069 735829 767735 804237 843534 884184 925736 967696 1008761
60489A008761L8581L4706K9228K1729J2402J829r667k1584l2502m0776m5929m8600
$$ 1008761 1047342 1082048 1111276 1133005 1145407 1147236 1137569 1115985 1083483 1042707 996778 948178
60477I48178m9408m8530m6182m2709l8342l3496k9042k5590k2762j9817j6725
$$ 948178 898770 850240 804058 761349 723007 689511 660469 634879 612117 592300 575575
60466E75575j4029j1968j0384r216q418p690o874o308o180n977n215m275l776
$$ 575575 561546 549578 539194 529978 521560 513870 506996 500688 494508 488531 483316 479041 475265
60453D75265l619l378l135l117k991k483k132k506l039k742j685p39j77K89M78
$$ 475265 471646 468268 465133 462016 459025 456542 454410 451904 448865 446123 444438 443699 443522 443811 444289
60438D44289ko23m07M80Q53K41o31j138j339j151l02P60R89K30n15n40j81J48
$$ 444289 444287 443664 443257 443737 444590 444831 444200 443062 441723 440572 440270 441030 442019 442249 441734 441194 441013 441161
60420D41161N38Q50N47k45m98L06J440K078K319K542K634K394K004J527P33j67
$$ 441161 441699 442549 443096 442851 442353 442659 444099 446177 448496 451038 453672 456066 458070 459597 460330 460163
60404D60163m02J84P33O72N92J109J747J766J459J640K280K640K423K035J872
$$ 460163 459761 459945 460678 461350 461942 463051 464798 466564 468023 469663 471943 474583 477006 479041 480913
60389D80913K039K556L235L574L248K604K174K025J972K065K293K214J519P43
$$ 480913 482952 485508 488743 492317 495565 498169 500343 502368 504340 506405 508698 510912 512431 513174
60375E13174P21J474K185K258J869J571J746K331K756K325J044k07o84o44p09
$$ 513174 513895 515369 517554 519812 521681 523252 524998 527329 530085 532410 533454 533247 532563 531919 531210
60360E31210q08m62K12O67R52J657K732L326L124K939L469M181M146L467L059
$$ 531210 530402 529940 530152 530819 531771 533428 536160 539486 542610 545549 549018 553199 557345 560812 563871
60345E63871L301L627L424K622J344m13k398l895m324l846l069k406j970j918
$$ 563871 567172 570799 574223 576845 578189 577776 575378 571483 567159 563313 560244 557838 555868 553950
60331E53950k432l288l867l814l486l540m136m706m559l612k461j725j428j158
$$ 553950 551518 548230 544363 540549 537063 533523 529387 524681 520122 516510 514049 512324 510896 509738
60317E09738p43l89j36M44J623K955L755M028M409N268O368P454Q656J0214J2169
$$ 509738 508995 508606 508470 508914 510537 513492 517247 521275 525684 530952 537320 544774 553430 563644 575813
60302E75813J4355J6246J6819J5258J1985Q434N465K512j411o365j1378j5181
$$ 575813 590168 606414 623233 638491 650476 658910 664375 666887 665476 659111 647733 632552
60290F32552j6710j5612j2734r717p617o297n342m767m423l601k097r60j183k150
$$ 632552 615842 600230 587496 577779 570162 563865 558523 553756 549333 545732 543635 542675 541492 539342
60276E39342k479k012j773k218k708k832k996l465l798l712l578l643l448k553
$$ 539342 536863 534851 533078 530860 528152 525320 522324 518859 515061 511349 507771 504128 500680 498127
60262D98127j276k41L39N31K53n04j313j643j452j100p48j68P57J606J738J124
$$ 498127 496851 496610 496949 497480 497733 497229 495916 494273 492821 491721 490973 490805 491562 493168 494906 496030
60246D96030N80Q72J665J933J376P91P58P54J46o12o29Q4Q18J378K139K960L124
$$ 496030 496610 497482 499147 501080 502456 503247 504005 504759 504905 504293 503664 503748 504566 505944 508083 511043 514167
60229E14167K423J568J276J604K270L005L518L637L616L794M008L921L765M059
$$ 514167 516590 518158 519434 521038 523308 526313 529831 533468 537084 540878 544886 548807 552572 556631
60215E56631M703N085N123N370N999O543O764P076P723Q282Q229P594O788O264
$$ 556631 561334 566419 571542 576912 582911 589454 596218 603294 611017 619299 627528 635122 641910 648174
60201F48174O327O817O987O303N210M513M091L166J736O87L81J69l84q81j062
$$ 648174 654501 661318 668305 674608 679818 684331 688422 691588 693324 694011 694392 694561 694177 693296 692234
60186F92234j423k269l047l306l515m237n120n400m988m419m079m048m296m567
$$ 692234 690811 688542 685495 682189 678674 674437 669317 663917 658929 654510 650431 646383 642087 637520
60172F37520m388l591k626k057k013k274k530k414j810j174j129j560j765j548
$$ 637520 633132 629541 626915 624858 622845 620571 618041 615627 613817 612643 611514 609954 608189 606641
60158F06641j392j402r84M8R61J205J222J602K100K182J903J604J304R76R38J358
$$ 606641 605249 603847 602863 602911 603872 605077 606299 607901 610001 612183 614086 615690 616994 617970 618908 620266
60142F20266J797J826J615J499J446J546K361M064N720O254N784N308N304N347
$$ 620266 622063 623889 625504 627003 628449 629995 632356 636420 642140 648394 654178 659486 664790 670137
60128F70137M973M230L396K652K049J546J108R12J185J752K159K368K801L420
$$ 670137 675110 679340 682736 685388 687437 688983 690091 691003 692188 693940 696099 698467 701268 704688
60114G04688L481K557J323O79O70P32N70K24l43j127j928k611l268l787l806l412
$$ 704688 708169 710726 712049 712728 713398 714130 714700 714924 714581 713454 711526 708915 705647 701860 698054 694642
60098F94642l267l630l892l627l335l510l632k987j901j254j144r94o61n42o77
$$ 694642 691375 687745 683853 680226 676891 673381 669749 666762 664861 663607 662463 661469 660808 660266 659589
60083F59589n96q9N18Q45P35J63o45j157j098q97j196k109l337m654n820o438
$$ 659589 658993 658904 659422 660267 661002 661165 660520 659363 658265 657368 656172 654063 650726 646072 640252 633814
60067F33814o413o189o080n811n243m946n307n629n010l702k740k494k504k451
$$ 633814 627401 621212 615132 609321 604078 599132 593825 588196 583186 579484 576744 574250 571746 569295
60053E69295k329j894q95K15P51R39J601K752L449L265K942L242M001M640M990
$$ 569295 566966 565072 564177 564392 565143 566082 567683 570435 573884 577149 580091 583333 587334 591974 596964
60038E96964N142N093M916M843M843M436L275J663K32p21j419k284l549n009o199
$$ 596964 602106 607199 612115 616958 621801 626237 629512 631175 631407 630686 629267 626983 623434 618425 612226
60023F12226o832p032p020o783o252n548m838m178l684l529l546l275k747k679
$$ 612226 605394 598362 591342 584559 578307 572759 567921 563743 560059 556530 552984 549709 546962 544283
60009E44283l446m319m354l652l005k697k390j973j621j210m72L39O51N44P08
$$ 544283 540837 536518 532164 528512 525507 522810 520420 518447 516826 515616 515144 515483 516134 516678 517386
59994E17386J395K085K359K422K649L086L567L889L780L183K611K688L309L703
$$ 517386 518781 520866 523225 525647 528296 531382 534949 538838 542618 545801 548412 551100 554409 558112
59980E58112L345K372J081l13j429j821j623j554k064k888l578m020m166l782
$$ 558112 561457 563829 564910 564597 563168 561347 559724 558170 556106 553218 549640 545620 541454 537672
59966E37672k808j653p54k0Q77J752J919J058j08m05M89J640J974J497J023R69
$$ 537672 534864 533211 532457 532437 533314 535066 536985 538043 537935 537530 538019 539659 541633 543130 544153 545122
59950E45122J137J483K260L123L093J887N88L17Q71J304J305J178R10J81q36j518
$$ 545122 546259 547742 550002 553125 556218 558105 558693 559010 559881 561185 562490 563668 564578 564759 563923 562405
59934E62405j529j019j98P17J314J317J076J188J796K606L448M326N133N694N954
$$ 562405 560876 559857 559659 560376 561690 563007 564083 565271 567067 569673 573121 577447 582580 588274 594228
59919E94228N854N403N053N457O528P353P451P288P075O044L821J509K73l65j535
$$ 594228 600082 605485 610538 615995 622523 629876 637327 644615 651690 657734 661555 663064 663337 662972 661437
59904F61437l008l609l247k946l124l239l113l204l465l218k355j432n29P97K302
$$ 661437 658429 654820 651573 648627 645503 642264 639151 635947 632482 629264 626909 625477 624948 625745 628047
59889F28047L120L276L785M939N738N484M812M555M602M505M295M171M098M139
$$ 628047 631167 634443 638228 643167 648905 654389 659201 663756 668358 672863 677158 681329 685427 689566
59875F89566M506M910M635L513K066N54j159k649l020k400k166l067m203m549
$$ 689566 694072 698982 703617 707130 709196 709750 708591 705942 702922 700522 698356 695289 691086 686537
59861F86537m447m653m935m704m221m003l540j876O69K538K841K397K574L707
$$ 686537 682090 677437 672502 667798 663577 659574 656034 654158 654827 657365 660206 662603 665177 668884
59847F68884N054N940O435O781O527M797J630j490k956k572j274K40J742K661
$$ 668884 673938 679878 686313 693094 699621 704418 706048 704558 701602 699030 697756 697996 699738 702399
59833G02399K156J93k282m366n722o109n425m378m073m617m979m557l881l461
$$ 702399 704555 704748 702466 698100 692378 686269 680844 676466 672393 667776 662797 658240 654359 650898
59819F50898l008k315j882j927j718p14M13P20M17L84P61Q80K76r08k346l679
$$ 650898 647890 645575 643693 641766 640048 639334 639747 640467 640884 641268 642029 642909 643185 642277 639931 636252
59803F36252m408m212l396k659k454k746l114k985k130j051n55p78j118j144j035
$$ 636252 631844 627632 624236 621577 619123 616377 613263 610278 608148 607097 606542 605764 604646 603502 602467
59788F02467r54p15k55J60M58Q43J147Q58R0k21M39J398J765J525J251J290J656
$$ 602467 601513 600798 600543 600703 601161 602004 603151 604009 604099 603878 604317 605715 607480 609005 610256 611546 613202
59771F13202K173K388J942J288J354K179K742K482K057K084K165J895J824K468
$$ 613202 615375 617763 619705 620993 622347 624526 627268 629750 631807 633891 636056 637951 639775 642243
59757F42243L185L149K783L131M238N252N758O038O156N877N369N096M958M348
$$ 642243 645428 648577 651360 654491 658729 663981 669739 675777 681933 687810 693179 698275 703233 707581
59743G07581L145J945J310J287J717K421K973K832J882O00l47n80j51N18R41R52
$$ 707581 710726 712671 713981 715268 716985 719406 722379 725211 727093 727693 727346 726766 726615 727133 728074 729026
59727G29026P31M04k2l51k42L06Q77J227J440J416Q69K0l75m0L88K93j53n45q56
$$ 729026 729757 730161 730139 729788 729546 729852 730729 731956 733396 734812 735681 735701 735326 735286 735674 735967 735814 735269 734413
59708G34413r98m83Q14K128K681K667K733K918K789K310J946K048K546L130L434
$$ 734413 733415 732932 733746 735874 738555 741222 743955 746873 749662 751972 753918 755966 758512 761642 765076
59693G65076L353L273L555L717K833R37p80j481j559j598j482j160j316k331l379
$$ 765076 768429 771702 775257 778974 781807 782744 781964 780483 778924 777326 775844 774684 773368 771037 767658
59678G67658l450k740k168k146k608l635n085o178o365o156o223o243n556m413
$$ 767658 764208 761468 759300 757154 754546 750911 745826 739648 733283 727127 720904 714661 709105 704692
59664G04692l524k830j840p90l27k73J23R42J626K119K837L658L987L893M086
$$ 704692 701168 698338 696498 695708 695381 695108 695231 696173 697799 699918 702755 706413 710400 714293 718379
59649G18379M661M877M321L412K464J136q58l083m747n354m976m324m449n790
$$ 718379 723040 727917 732238 735650 738114 739250 738392 735309 730562 725208 720232 715908 711459 705669
59635G05669p482q133p259n577m065l238l109l257l028k309j941k743m309n404
$$ 705669 698187 690054 682795 677218 673153 669915 666806 663549 660521 658212 656271 653528 649219 643815
59621F43815n424m813m160l618l184k899k739k730l060l565l454k177l13R66J268
$$ 643815 638391 633578 629418 625800 622616 619717 616978 614248 611188 607623 604169 601992 601679 602645 603913
59606F03913J134J075J107J100R49N34M1N6P74J450J325O77K50P1k26l40L42J515
$$ 603913 605047 606122 607229 608329 609278 609812 609853 609909 610683 612133 613458 614135 614385 614456 614230 613890 614232 615747
59588F15747K205K099J689J174L04p29j377j727k368l130l146k347j755j940k222
$$ 615747 617952 620051 621740 622914 623218 622489 621112 619385 617017 613887 610741 608394 606639 604699 602477
59573F02477j932j433j334j534j635j682j817j829j528j151q71m23L20Q88Q32
$$ 602477 600545 599112 597778 596244 594609 592927 591110 589281 587753 586602 585731 585308 585628 586516 587348
59558E87348M74N12J103J766K069K060K068K293K570K491J884J203J259K449M325
$$ 587348 587822 588334 589437 591203 593272 595332 597400 599693 602263 604754 606638 607841 609100 611549 615874
59543F15874N908O548O499O684P769R613J1952J5142J9180K2023K0397J3266L607
$$ 615874 621782 628330 634829 641513 649282 658895 670847 685989 705169 727192 747589 760855 764462
59530G64462m240q301r282q285n932l245j433n11N68K127L212L110K230J169p5
$$ 764462 760222 751921 742639 734354 728422 725177 723744 723233 723801 725928 729140 732250 734480 735649 735574
59515G35574j485k606l273m007n224o644p886q903r512r156p739o072n011m553
$$ 735574 734089 731483 728210 724203 718979 712335 704449 695546 686034 676878 669139 663067 658056 653503
59501F53503m206l831l667l795l991l928l365k305j097j86K91N16O45P58R85J396
$$ 653503 649297 645466 641799 638004 634013 630085 626720 624415 623318 623132 623423 623939 624584 625342 626327 627723
59485F27723J825K102K333K666L048L468M072M715M851M375M026M320M614M043
$$ 627723 629548 631650 633983 636649 639697 643165 647237 651952 656803 661178 665204 669524 674138 678181
59471F78181K886K066J734J365R38Q59R08M47l27m74K68J197J904K765M026N311
$$ 678181 681067 683133 684867 686232 687170 688029 688937 689384 689057 688583 688851 690048 691952 694717 698743 704054
59455G04054O291O960P203O888O453O512O840O669N947N333M887L908K261O12
$$ 704054 710345 717305 724508 731396 737849 744361 751201 757870 763817 769150 774037 777945 780206 780818
59441G80818q64k879n578p794q397p625o515n687n112m519l666k633j937j852
$$ 780818 779954 777075 771497 763703 755306 747681 741166 735479 730367 725848 722182 719549 717612 715760
59427G15760j701o28J125K583L556M738O396Q098R818J2013J4404J5908J6103
$$ 715760 714059 713431 714556 717139 720695 725433 731829 739927 749745 761758 776162 792070 808173
59414H08173J5777J5910J7116J9824K3348K4769K0716J1039n80j0202j6294j8786
$$ 808173 823950 839860 856976 876800 900148 924917 945633 956672 956092 945890 929596 910810
59402I10810j7789j4362j0472o603j113O380J2296J1968M614o025j5301k0646
$$ 910810 893021 878659 868187 861584 860471 866851 879147 891115 895729 889704 874403 853757
59390H53757k1833k0262j7963j6003j3854j0933q009o137n020l704k263j375p65
$$ 853757 831924 811662 793699 777696 763842 752909 744900 738763 733743 730039 727776 726401 725636
59377G25636M09J935K813K948L258M041M627M696M734M958M920M477M211M549
$$ 725636 726045 727980 730793 733741 736999 741040 745667 750363 755097 760055 764975 769452 773663 778212
59363G78212N219N833O295O568O693P079Q053R096R358R071R499J1153J2928J3529
$$ 778212 783431 789264 795559 802127 808820 815899 823952 833048 842406 851477 860976 872129 885057 898586
59349H98586J3075J2751J3238J4175J4899J5150J4974J4392J3362J2015J0642
$$ 898586 911661 924412 937650 951825 966724 981874 996848 1011240 1024602 1036617 1047259
59338A047259R326P671N160J863j439l999n836p518r430j1365j2799j3385j3235
$$ 1047259 1056585 1064256 1069416 1071279 1069840 1065841 1060005 1052487 1043057 1031692 1018893 1005508 992273
59325I92273j2784j2362j2005j1665j1341j0847r796q219o821o142n763n011m084
$$ 992273 979489 967127 955122 943457 932116 921269 911473 903254 896433 890291 884528 879517 875433
59312H75433l657l555k885j514l41K00Q34K235M045N628O988Q455J0072J1780
$$ 875433 871776 868221 865336 863822 863481 863681 864515 866750 870795 876423 883411 891866 901938 913718
59298I13718J3545J4761J4125J0691M738k534r540j4543j6349j5407j3505j1975
$$ 913718 927263 942024 956149 966840 971578 969044 959504 944961 928612 913205 899700 887725
59286H87725j0781r598q706q176p240n340l112j506m90N78J818K939L971N174
$$ 887725 876944 867346 858640 850464 843224 837884 834772 833266 832776 833354 835172 838111 842082 847256
59272H47256O498P733Q918J0055J0844J1075J0874J0194Q664O354M064K320P14
$$ 847256 853754 861487 870405 880460 891304 902379 913253 923447 932111 938465 942529 944849 945563
59259I45563j277l494n549p397q854r380q866q048p541p201o870o850o987o351
$$ 945563 944286 940792 935243 927846 918992 909612 900746 892698 885157 877956 871086 864236 857249 850898
59245H50898m651k954k091j332J52J538J472L01l12L19J340J960K321K763L262
$$ 850898 846247 843293 841202 839870 840022 841560 843032 843333 843021 843340 844680 846640 848961 851724 854986
59230H54986L652L673K895J334j67q48j105j839l075m089m607m903m890m138k798
$$ 854986 858638 862311 865206 866540 866373 865525 864420 862581 859506 855417 850810 845907 841017 836879 834081
59215H34081j685j310j419j514j386j109q68o90j80J077K672L554L388K944K803
$$ 834081 832396 831086 829667 828153 826767 825658 824790 824100 823920 824997 827669 831223 834611 837555 840358
59200H40358K622K225K330L236L888L356K424K365K939K988K413K079K140K003
$$ 840358 842980 845205 847535 850771 854659 858015 860439 862804 865743 868731 871144 873223 875363 877366
59186H77366J708J828K072J520L87J08J280K702L062K522K109K200K309J956J308
$$ 877366 879074 880902 882974 884494 884881 884989 886269 888971 892033 894555 896664 898864 901173 903129 904437
59171I04437R61J245J845K302K825M030N791P124P566P706P895P458O019M553
$$ 904437 905398 906643 908488 910790 913615 917645 923436 930560 938126 945832 953727 961185 967204 971757
59157I71757L990L671K473P22m32r49j761l107m345n178n748n799n027m078l885
$$ 971757 975747 979418 981891 982613 982181 981232 979471 976364 972019 966841 961093 955294 950267 946189 942304
59142I42304m248m284m015m173m720m991n102n694o365n973m624l743l905m075
$$ 942304 938056 933772 929757 925584 920864 915873 910771 905077 898712 892739 888115 884372 880467 876392
59128H76392l399k351j560q76j22L49N13J067K378L962N426P013Q638R412Q824
$$ 876392 872993 870642 869082 868206 868084 868433 868946 870013 872391 876353 881779 888792 897430 906842 915666
59113I15666P686P229P746Q581Q977Q518P239N699M677M469M728M999N042M641
$$ 915666 923352 930581 938327 946908 955885 964403 971642 977341 982018 986487 991215 996214 1001256 1005897
59099A005897L572J842k56k236l398l202k118j512k037k686k212r64l34q28j737
$$ 1005897 1009469 1011311 1011055 1008819 1005421 1002219 1000101 998589 996552 993866 991654 990690 990356 989528 987791
59084I87791k352k487k126j649k060l887o105p309p555p814q062p398n941m938
$$ 987791 985439 982952 980826 979177 977117 973230 967125 959816 952261 944447 936385 928987 923046 918108
59070I18108m872m937m590m230m070l711l172l067l401l344k607j911j733j715
$$ 918108 913236 908299 903709 899479 895409 891698 888526 885459 882058 878714 876107 874196 872463 870748
59056H70748j630j803k212k238j756j466j721j906j415l96O69J422J537J024N86
$$ 870748 869118 867315 865103 862865 861109 859643 857922 856016 854601 854205 854874 856296 857833 858857 859443
59041H59443Q71J404J320Q35Q21J131Q89L05N19J530K084J942K388L959N437N944
$$ 859443 860314 861718 863038 863873 864694 865825 866714 867019 867538 869068 871152 873094 875482 879441 884878 890822
59025H90822O298P322Q401Q878R477J0943J2482J2857J2205J1417J0505Q821O441
$$ 890822 897120 904442 912843 921721 931198 942141 954623 967480 979685 991102 1001607 1010428 1016869
59012A016869M145K298O80q26k109l095l606l259k039n40P42J925L198M260M784
$$ 1016869 1021014 1023312 1023992 1023166 1021057 1017962 1014356 1011097 1009058 1008518 1009260 1011185 1014383 1018643 1023427
58997A023427M882M824M628M281L808L031J810N85m0k87r70k103k773k614k397
$$ 1023427 1028309 1033133 1037761 1042042 1045850 1048881 1050691 1051276 1051236 1050949 1049979 1047876 1045103 1042489 1040092
58982A040092k722l060k602j353Q3J217J870K320L351N404P647Q834R097R762
$$ 1040092 1037370 1034310 1031708 1030355 1030438 1031655 1033525 1035845 1039196 1044600 1052247 1061081 1070178 1079940
58968A079940J1215J2253J1942J0912J0207J0015J0053J0162R887Q502O138L934
$$ 1079940 1091155 1103408 1115350 1126262 1136469 1146484 1156537 1166699 1176586 1185088 1191226 1195160
58956A195160K516J250n67k789n206q035j0932j2695j2808j2306j2249j2266j1587
$$ 1195160 1197676 1198926 1198359 1195570 1190364 1182329 1171397 1158702 1145894 1133588 1121339 1109073 1097486
58943A097486j0545r987r817r198p839o210m804l831l371l256l069k651k232j913
$$ 1097486 1086941 1076954 1067137 1057939 1050100 1043890 1039086 1035255 1031884 1028628 1025559 1022908 1020676 1018763
58929A018763j455q01j86L81J074J632J606J291J427J907J839J139P77J131J324
$$ 1018763 1017308 1016507 1016321 1016702 1017776 1019408 1021014 1022305 1023732 1025639 1027478 1028617 1029394 1030525 1031849
58914A031849Q08L18N77J164J503J926K877L894M336M499N207O742Q687J0393
$$ 1031849 1032657 1032975 1033552 1034716 1036219 1038145 1041022 1044916 1049252 1053751 1058958 1065700 1074387 1084780
58900A084780J1294J1295J1064J1351J1948J2083J1732J1499J1349J0780J0326
$$ 1084780 1096074 1107369 1118433 1129784 1141732 1153815 1165547 1177046 1188395 1199175 1209501
58889A209501J1277J3566J5523J6233J6614J7453J7910J6918J4728J2140R352
$$ 1209501 1220778 1234344 1249867 1266100 1282714 1300167 1318077 1334995 1349723 1361863 1371215
58878A371215O423L774J326j680n163p688q379q340r152j0835j2157j2179j0844
$$ 1371215 1377638 1381412 1382738 1381058 1375895 1368207 1359828 1351488 1342336 1331501 1319344 1307165 1296321
58865A296321q866p482p507q154p931o849o409p107p657p315p097p820q618q621
$$ 1296321 1287455 1279973 1272466 1264312 1256381 1249532 1243123 1236016 1228359 1221044 1213947 1206127 1197509 1188888
58851A188888q445q772q922q119o934o144n452m523m013m345m658m309m152n011
$$ 1188888 1180443 1171671 1162749 1154630 1147696 1141552 1136100 1131577 1127564 1123219 1118561 1114252 1110100 1105089
58837A105089o075o264n971o038o037n147l764k798k178j363n67j68K79J226K153
$$ 1105089 1099014 1092750 1086779 1080741 1074704 1069557 1065793 1062995 1060817 1059454 1058887 1058719 1058998 1060224 1062377
58822A062377K521K818L603M431M789N067N554N541M612L661L531L761L800M106
$$ 1062377 1064898 1067716 1071319 1075750 1080539 1085606 1091160 1096701 1101313 1104974 1108505 1112266 1116066 1120172
58808A120172M819M764L260J568J027J013L62n26p69q95j764k710k738k543l337
$$ 1120172 1124991 1129755 1133015 1134583 1135610 1136623 1136985 1136459 1135690 1134795 1133031 1130321 1127583 1125040 1121703
58793A121703m538m633l735l230l414l324k568j621o36O02J879K925M058N316
$$ 1121703 1117165 1112532 1108797 1105567 1102153 1098829 1096261 1094640 1094004 1094606 1096485 1099410 1103468 1108784
58779A108784N852N380N181O227P400P196O041N101L956J492j685l838m578m871
$$ 1108784 1114636 1120016 1125197 1131424 1138824 1146020 1152061 1157162 1161118 1162610 1160925 1157087 1152509 1147638
58765A147638n153n223n384n904n890m514k729k053k211j857r42m79m68N7J215
$$ 1147638 1142485 1137262 1131878 1125974 1120084 1115570 1112841 1110788 1108577 1106720 1105778 1105299 1104831 1104888 1106103
58750A106103K221K862L432L815L936M469N595O055N089M187M961O421O604N882
$$ 1106103 1108324 1111186 1114618 1118433 1122369 1126838 1132433 1138488 1143577 1147764 1152725 1159146 1165750 1171632
58736A171632O103P253P629O939O578O936O893O067N298M799L907K788K419K729
$$ 1171632 1177735 1184988 1192617 1199556 1206134 1213070 1219963 1226030 1231328 1236127 1240034 1242822 1245241 1247970
58722A247970K601J780J044O57L04L37J345K700L320L513M299N329N395M605M040
$$ 1247970 1250571 1252351 1253395 1254052 1254356 1254693 1256038 1258738 1262058 1265571 1269870 1275199 1280594 1285199 1289239
58707A289239L619K351L91j216k551m466o578p710q084q956j0246j0734j0325
$$ 1289239 1292858 1295209 1295600 1294384 1291833 1287367 1280789 1273079 1264995 1256039 1245793 1235059 1224734
58694A224734j0061j0029r392q261p365o246m096k002j854l139l436k131j045
$$ 1224734 1214673 1204644 1195252 1186991 1179626 1173380 1169284 1167282 1165428 1162289 1158853 1156722 1155677
58681A155677j184j505j227r71j019o95N0M54O47J558K938L544L415L891N201
$$ 1155677 1154493 1152988 1151761 1150790 1149771 1149076 1149126 1149580 1150227 1151785 1154723 1158267 1161682 1165573 1170774
58666A170774O208O707P768R565J0996J1585J1689J0807P981L999Q27j205l288
$$ 1170774 1176982 1183689 1191457 1201022 1212018 1223603 1235292 1246099 1254080 1258079 1258906 1257701 1254413
58653A254413n208n269l476k004j973k250k100k354l242l501k575j489p90K06
$$ 1254413 1249205 1243936 1240460 1238456 1236483 1234233 1232133 1229779 1226537 1223036 1220461 1218972 1218182 1218388
58639A218388J475J802J035P07J662L024M067N046N751N369M213L542L271K137
$$ 1218388 1219863 1221665 1222700 1223407 1225069 1228093 1232160 1237206 1242957 1248326 1252539 1256081 1259352 1261489
58625A261489M07o3J045J942J828J938K852L426L350M058O034P631P758P503P855
$$ 1261489 1261896 1261833 1262878 1264820 1266648 1268586 1271438 1274864 1278214 1282272 1288306 1295937 1303695 1311198 1319053
58610A319053Q115P624P026O669N754M147L131L320L716L588L432L293K278N04
$$ 1319053 1327168 1334792 1341818 1348487 1354241 1358388 1361519 1364839 1368555 1372143 1375575 1378868 1381146 1381650
58596A381650n01j42M86P79J460K643L348L605M740O797Q038P905Q070R643J1493
$$ 1381650 1381149 1381007 1381493 1382272 1383732 1386375 1389723 1393328 1398068 1404865 1412903 1420808 1428878 1438521 1450014
58581A450014J2404J2698J2808J2341J1478J1223J1487J0925R352Q236Q250Q549
$$ 1450014 1462418 1475116 1487924 1500265 1511743 1522966 1534453 1545378 1554730 1562966 1571216 1579765
58569A579765Q872J0025J1819J3073J4010J6111J9165K1366K2605K4633K7374
$$ 1579765 1588637 1598662 1610481 1623554 1637564 1653675 1672840 1694206 1716811 1741444 1768818
58558A768818K8450K7077K5066K3092J9487J3886Q586M831J262k615m834m547
$$ 1768818 1797268 1824345 1849411 1872503 1891990 1905876 1914462 1919293 1920555 1917940 1913106 1908559
58546A908559l763l743l032r79J03j538m480p093j0064j3931j7103j8596j9792
$$ 1908559 1904796 1901053 1898021 1897042 1897145 1895607 1891127 1884034 1873970 1860039 1842936 1824340 1804548
58533A804548k1385k1495j9050j6114j4539j3116j0392p486n695m046j643J93
$$ 1804548 1783163 1761668 1742618 1726504 1711965 1698849 1688457 1680971 1675276 1671230 1669587 1669780
58521A669780N29R38K602L931L421K325K091J847Q59O43K082L073J901L51O74
$$ 1669780 1670309 1671247 1673849 1677780 1681201 1683526 1685617 1687464 1688323 1688966 1691048 1694121 1696022 1696373 1697047
58506A697047J861J820R53O94P02K57M01J948L379L251K705L239M089M196M476
$$ 1697047 1698908 1700728 1701681 1702375 1703077 1703334 1703735 1705683 1709062 1712313 1715018 1718257 1722346 1726542 1731018
58491A731018N703O488N834N381O632Q253Q682Q992J0571J2393J3211J4129J6313
$$ 1731018 1736721 1743209 1749043 1754424 1761056 1769309 1777991 1786983 1797554 1809947 1823158 1837287 1853600
58478A853600J8526J9409J9953K1112K1454J9630J6718J3707R465L729r36k886
$$ 1853600 1872126 1891535 1911488 1932600 1954054 1973684 1990402 2004109 2013574 2017303 2016367 2013481
58466B013481m113o394p949o970n210m558l276O02N130P541Q767J1009J3488J4554
$$ 2013481 2009368 2002974 1995025 1988055 1982845 1978287 1975011 1975613 1980743 1988284 1997051 2008060 2021548 2036102
58452B036102J5338J7263J8420J6502J3023J0541Q068L362k366o264q341j0107
$$ 2036102 2051440 2068703 2087123 2103625 2116648 2127189 2135257 2138619 2136253 2129989 2121648 2111541
58440B111541j0771q908n981m281l107p99J586K398K947N004P044P051O722Q598
$$ 2111541 2100770 2091862 2085881 2081600 2078493 2077694 2079280 2081678 2084625 2089629 2096673 2103724 2110446 2119044
58426B119044J1334J2210J2138J3621J5813J6196J5166J4448J2938Q866M224K200
$$ 2119044 2130378 2142588 2154726 2168347 2184160 2200356 2215522 2229970 2242908 2251774 2255998 2258198
58414B258198J925M14j984k794k324k621l139k163r19j557k676j558Q52J835K028
$$ 2258198 2260123 2260537 2258553 2255759 2253435 2250814 2247675 2245512 2244593 2243036 2240360 2238802 2239654 2241489 2243517
58399B243517L774O164O746O461P854R979J0224R502J0428J1953J1160Q912Q323
$$ 2243517 2247291 2253455 2260201 2266662 2274516 2284495 2294719 2304221 2314649 2326602 2337762 2346674 2354997
58386B354997R048Q518P450Q516J0777J1064R813J0076J1724J2040J1084J1103
$$ 2354997 2364045 2372563 2380013 2388529 2399306 2410370 2420183 2430259 2441983 2454023 2465107 2476210
58374B476210J1763J1195J0595J2331J4888J5123J4132J5218J7550J7801J6585
$$ 2476210 2487973 2499168 2509763 2522094 2536982 2552105 2566237 2581455 2599005 2616806 2633391
58363B633391J7200J9214J9578J8827J9926K2073K2054K0561K0692K1364J8953
$$ 2633391 2650591 2669805 2689383 2708210 2728136 2750209 2772263 2792824 2813516 2834880 2853833
58352B853833J4473J2261J2341J1045Q493Q301J0380J1167J0715J2368J5629J6553
$$ 2853833 2868306 2880567 2892908 2903953 2912446 2920747 2931127 2942294 2953009 2965377 2981006 2997559
58340B997559J5230J5730J8476J9772J9107J9926K2798K4632K4958K6329K8381
$$ 2997559 3012789 3028519 3046995 3066767 3085874 3105800 3128598 3153230 3178188 3204517 3232898
58329C232898K8205K6524K6672K7776K5949K1913K0092K0503J9143J6143J5618
$$ 3232898 3261103 3287627 3314299 3342075 3368024 3389937 3410029 3430532 3449675 3465818 3481436
58318C481436J7465J7402J5346J5691J8817K0404J9712K0490K3211K4397K4189
$$ 3481436 3498901 3516303 3531649 3547340 3566157 3586561 3606273 3626763 3649974 3674371 3698560
58307C698560K6406L0568L2076L0795L1248L3834L4337L2606L3037L5864L6684
$$ 3698560 3724966 3755534 3787610 3818405 3849653 3883487 3917824 3950430 3983467 4019331 4056015
58296D056015L5163L5500L7805L8058L6861L8936M3653M5675M5234M7716N2812
$$ 4056015 4091178 4126678 4164483 4202541 4239402 4278338 4321991 4367666 4412900 4460616 4513428
58285D513428N4705N3593N5845O1816O4753O3251O3198O5621O4227N7345N0897
$$ 4513428 4568133 4621726 4677571 4739387 4804140 4867391 4930589 4996210 5060437 5117782 5168679
58274E168679M7290M2728L7734L8523M5275N0700N2796N7443O6017P2477P5229
$$ 5168679 5215969 5258697 5296431 5334954 5380229 5430929 5483725 5541168 5607185 5679662 5754891
58263E754891P9675Q6585R0403R1399R6445J05321J09801J08766J10252J15855
$$ 5754891 5834566 5921151 6011554 6102953 6199398 6304719 6414520 6523286 6633538 6749393
58253F749393J17873J15016J15708J22188J26719J27427J32078J42119J49149
$$ 6749393 6867266 6982282 7097990 7220178 7346897 7474324 7606402 7748521 7897670
58244G897670J51536J57964J70089J78843J82481J90505K04841K15644K20963
$$ 7897670 8049206 8207170 8377259 8556102 8738583 8929088 9133929 9349573 9570536
58235I570536K31265K48868K62985K71238K85237L08215L28766L43731L64802
$$ 9570536 9801801 10050669 10313654 10584892 10870129 11178344 11507110 11850841 12215643
58226A2215643L94921M21662M42191M70264N09790N47059N78456O18966O73317
$$ 12215643 12610564 13032226 13474417 13944681 14454471 15001530 15579986 16198952 16872269
58217A6872269P27083P77034Q40222R21522J004246J085396J186160J313962J450851
$$ 16872269 17599352 18376386 19216608 20138130 21142376 22227772 23413932 24727894 26178745
58208B6178745J594372J770413J989463K233451K504471K840161L261438L758092
$$ 26178745 27773117 29543530 31532993 33766444 36270915 39111076 42372514 46130606
58200D6130606M348997N096427O030814P123889Q366045R796866J1427844J3230836
$$ 46130606 50479603 55576030 61606844 68730733 77096778 86893644 98321488 111552324
58192A11552324J5253167J7640462K0495361K3844086K7741630L2013872L5508879
$$ 111552324 126805491 144445953 164941314 188785400 216527030 248540902 284049781
58185B84049781L5849948L0686248J9690128N249102r005119k0354914k7889063
$$ 284049781 319899729 350585977 370276105 375525207 366520088 346165174 318276111
58178C18276111l1914110l3104374l2186635k9905352k6898561k3596862k0293702
$$ 318276111 286362001 253257627 221070992 191165640 164267079 140670217 120376515
58171A20376515j7224678j4524112j2195321j0197629q520666p147366o014992
$$ 120376515 103151837 88627725 76432404 66234775 57714109 50566743 44551751
58164D4551751n062653m273346l635374l106899k651501k269497j963994j710707
$$ 44551751 39489098 35215752 31580378 28473479 25821978 23552481 21588487 19877780
58156A9877780j487334j299687j153606j031068r16687q19434p46597o82841o15283
$$ 19877780 18390446 17090759 15937153 14906085 13989398 13169964 12423367 11740526 11125243
58147A1125243n54079n08805m68219m21935l79441l49647l22751k89880k60657
$$ 11125243 10571164 10062359 9594140 9172205 8792764 8443117 8120366 7830486 7569829
58138G569829k44488k33083k17466k04297j99893j95209j81887j67341j59596
$$ 7569829 7325341 7092258 6874792 6670495 6470602 6275393 6093506 5926165 5766569
58129E766569j52460j39342j26834j21238j15918j04883r5069r2659r0737q2689
$$ 5766569 5614109 5474767 5347933 5226695 5110777 5005894 4910825 4818166 4727429 4644740
58119D644740p4758p3177p1777o4359n6998n6062n5841m9906m3479m2888m3511
$$ 4644740 4569982 4496805 4425028 4360669 4303671 4247609 4191768 4141862 4098383 4055495 4011984
58108D011984l9607l5699l7029l8718l5418l2101l4535l8255l7482l5996l8858
$$ 4011984 3972377 3936678 3899649 3860931 3825513 3793412 3758877 3720622 3683140 3647144 3608286
58097C608286m2158m1126l9703m2022m2919l7030k9163k5505k2544j4846o227
$$ 3608286 3566128 3525002 3485299 3443277 3400358 3363328 3334165 3308660 3286116 3271270 3265043
58086C265043k853k281N61L137J033k484k296r96l212o170n228l246n238q754
$$ 3265043 3262190 3259909 3260470 3263607 3264640 3262156 3259860 3258864 3255652 3249482 3244254 3241008 3235770 3227016
58072C227016q590o272o262p295n865l815m426n344l182p19j827l736k030J067
$$ 3227016 3218426 3212154 3205892 3198597 3192732 3188917 3184491 3179147 3175965 3175246 3173419 3169683 3167653 3168720
58058C168720J027o68j67R89o94l318l092j447j558j597J383M670M247K320L291
$$ 3168720 3169747 3169079 3168912 3169901 3169207 3165889 3162797 3161350 3159792 3158195 3159578 3164248 3168495 3170815 3174106
58043C174106N729N511L677L887N080L817J289J123K603K624J956L177M792L575
$$ 3174106 3179835 3185346 3189023 3192910 3197990 3201807 3203096 3204219 3206822 3209446 3211402 3214579 3219371 3222946
58029C222946O51n96m22j056j699o32L96o72j498P49L776L989K930M063O184O018
$$ 3222946 3223597 3223001 3222579 3221523 3219824 3219192 3219588 3218916 3217418 3218167 3221943 3225932 3228862 3232925 3239109 3245127
58013C245127M678N400P244P110N794O226P713P584O540O915P732O789N545O605
$$ 3245127 3249805 3255205 3262449 3269559 3275353 3281579 3289292 3296876 3303416 3310331 3318063 3324852 3330397 3337002
57999C337002Q593Q733Q177R442J1054J0237Q531R055J0498R631P617P942R924
$$ 3337002 3345595 3354328 3362505 3371947 3383001 3393238 3401769 3410824 3421322 3430953 3438570 3446512 3456436
57986C456436J0193Q874Q578Q915P678N933O244P405O470M543M900O849P157O175
$$ 3456436 3466629 3475503 3484081 3492996 3500674 3506607 3512851 3520256 3526726 3531269 3536169 3543018 3550175 3556350
57972C556350O785Q487Q379P050P641R790J0234Q855Q624R939J0340R578R787
$$ 3556350 3563135 3571622 3580001 3587051 3594692 3604482 3614716 3623571 3632195 3642134 3652474 3662052 3671839
57959C671839J0881J0788R892J0394J1640J0880Q394P158P747Q148Q112R117J0514
$$ 3671839 3682720 3693508 3703400 3713794 3725434 3736314 3744708 3751866 3759613 3767761 3775873 3784990 3795504
57946C795504J0286R221R795J1601J2310J2384J4096J6638J7155J6053J6326J8108
$$ 3795504 3805790 3815011 3824806 3836407 3848717 3861101 3875197 3891835 3908990 3925043 3941369 3959477
57934C959477J8915J8779J9954K1770K1140J8229J6395J6205J4746J1386R068
$$ 3959477 3978392 3997171 4017125 4038895 4060035 4078264 4094659 4110864 4125610 4136996 4146064
57923D146064Q959Q726P175O079O276O182N303N327O611P339O972P067P980Q287
$$ 4146064 4155023 4163749 4170924 4177003 4183279 4189461 4194764 4200091 4206702 4214041 4221013 4228080 4236060 4244347
57909D244347Q059R027J1077J2063J1561J1363J1889J1657J0566J0160J0391R709
$$ 4244347 4252406 4261433 4272510 4284573 4296134 4307497 4319386 4331043 4341609 4351769 4362160 4371869
57897D371869Q479Q664R904R808Q375Q276J0278J2247J3146J4207J5605J5747
$$ 4371869 4380348 4389012 4398916 4408724 4417099 4425375 4435653 4447900 4461046 4475253 4490858 4506605
57885D506605J4561J3953J4389J4376J3733J3861J4503J3892J2393J2267J3490
$$ 4506605 4521166 4535119 4549508 4563884 4577617 4591478 4605981 4619873 4632266 4644533 4658023
57874D658023J3690J2590J2493J3848J4453J3679J3450J4164J3881J2495J2524
$$ 4658023 4671713 4684303 4696796 4710644 4725097 4738776 4752226 4766390 4780271 4792766 4805290
57863D805290J4520J5767J4965J4237J5004J5744J5514J5878J7467J8224J7095
$$ 4805290 4819810 4835577 4850542 4864779 4879783 4895527 4911041 4926919 4944386 4962610 4979705
57852D979705J6138J6874J7671J6848J5510J5187J5239J4594J3744J3202J2199
$$ 4979705 4995843 5012717 5030388 5047236 5062746 5077933 5093172 5107766 5121510 5134712 5146911
57841E146911J0525R556J0029J0828J1149J1737J2943J3728J3624J3578J3999
$$ 5146911 5157436 5166992 5177021 5187849 5198998 5210735 5223678 5237406 5251030 5264608 5278607
57830E278607J4177J4207J5071J6279J6083J4721J4541J6190J7567J7499J7428
$$ 5278607 5292784 5306991 5322062 5338341 5354424 5369145 5383686 5399876 5417443 5434942 5452370
57819E452370J8291J8759J8006J7368J7788J8113J7383J6380J5616J4181J1903
$$ 5452370 5470661 5489420 5507426 5524794 5542582 5560695 5578078 5594458 5610074 5624255 5636158
57808E636158J0297J0149J0375J0272J0660J1859J2896J3608J5036J6931J7562
$$ 5636158 5646455 5656604 5666979 5677251 5687911 5699770 5712666 5726274 5741310 5758241 5775803
57797E775803J6854J6933J8536J9800J9689J9688K0707K1392K0963K0915K2087
$$ 5775803 5792657 5809590 5828126 5847926 5867615 5887303 5908010 5929402 5950365 5971280 5993367
57786E993367K2848K2003K0947K1024K1166K0104J8750J8497J9083J9755K0665
$$ 5993367 6016215 6038218 6059165 6080189 6101355 6121459 6140209 6158706 6177789 6197544 6218209
57775F218209K1664K1719K0845K0553K1257K1351K0090J8923J8691J8021J6059
$$ 6218209 6239873 6261592 6282437 6302990 6324247 6345598 6365688 6384611 6403302 6421323 6437382
57764F437382J4387J4463J5385J5775J5798J5823J5347J4737J5615J7996J9386
$$ 6437382 6451769 6466232 6481617 6497392 6513190 6529013 6544360 6559097 6574712 6592708 6612094
57753F612094J8536J7591J8676K0726K1793K2206K3135K4021K3860K3356K3579
$$ 6612094 6630630 6648221 6666897 6687623 6709416 6731622 6754757 6778778 6802638 6825994 6849573
57742F849573K3919K3348K2425K2175K2252K1891K1395K1202K0831K0098J9957
$$ 6849573 6873492 6896840 6919265 6941440 6963692 6985583 7006978 7028180 7049011 7069109 7089066
57731G089066K0797K1467K1147K0624K0629K0694K0732K1703K3495K4259K3189
$$ 7089066 7109863 7131330 7152477 7173101 7193730 7214424 7235156 7256859 7280354 7304613 7327802
57720G327802K1884K1568K1221J9975J9029J9452K0223K0301K0463K1299K1614
$$ 7327802 7349686 7371254 7392475 7412450 7431479 7450931 7471154 7491455 7511918 7533217 7554831
57709G554831K0722K0163K1019K1692K0637J9219J9451K0753K1427K1692K2692
$$ 7554831 7575553 7595716 7616735 7638427 7659064 7678283 7697734 7718487 7739914 7761606 7784298
57698G784298K3986K4494K4714K5661K6724K6778K6287K6264K6218K5203K3875
$$ 7784298 7808284 7832778 7857492 7883153 7909877 7936655 7962942 7989206 8015424 8040627 8064502
57687H064502K3540K4103K4709K5415K6600K7816K8674K9728L1119L1916L2160
$$ 8064502 8088042 8112145 8136854 8162269 8188869 8216685 8245359 8275087 8306206 8338122 8370282
57676H370282L3780L7720M2026M4766M6999N0804N6025O1405O7382P5094Q3340
$$ 8370282 8404062 8441782 8483808 8528574 8575573 8626377 8682402 8743807 8811189 8886283 8969623
57665H969623Q8534Q6896P5702N4457K7143J619j5866k4832k8027k6897k1864
$$ 8969623 9058157 9145053 9220755 9275212 9302355 9303974 9288108 9263276 9235249 9208352 9186488
57654I186488j4865q270k237M109R909J3561J5627J8016K0944K3151K4457K5674
$$ 9186488 9171623 9163353 9161116 9165225 9175134 9188695 9204322 9222338 9243282 9266433 9290890 9316564
57642I316564K6657K6799K6848K7950K9485L0087L0129L0942L2258L2750L2515
$$ 9316564 9343221 9370020 9396868 9424818 9454303 9484390 9514519 9545461 9577719 9610469 9642984
57631I642984L2719L3214L2849L1776L1197L1109L0435K9159K8344K8233K8131
$$ 9642984 9675703 9708917 9741766 9773542 9804739 9835848 9866283 9895442 9923786 9952019 9980150
57620I980150K7983K8294K8828K9011K9150K9699K9956K9182K8274K8535K9472
$$ 9980150 10008133 10036427 10065255 10094266 10123416 10153115 10183071 10212253 10240527 10269062 10298534
57609A0298534K9745K9509K9838L0509L0396K9639K9386K9808L0166L0362L0695
$$ 10298534 10328279 10357788 10387626 10418135 10448531 10478170 10507556 10537364 10567530 10597892 10628587
57598A0628587L0677K9829K9015K9175K9530K8895K7923K8025K8888K9176K8920
$$ 10628587 10659264 10689093 10718108 10747283 10776813 10805708 10833631 10861656 10890544 10919720 10948640
57587A0948640K9050K9285K8806K8314K9060L0407L0754L0405L1000L2481L3173
$$ 10948640 10977690 11006975 11035781 11064095 11093155 11123562 11154316 11184721 11215721 11248202 11281375
57576A1281375L2764L2633L3191L3334L2727L2389L2690L2818L2561L2759L3722
$$ 11281375 11314139 11346772 11379963 11413297 11446024 11478413 11511103 11543921 11576482 11609241 11642963
57565A1642963L4786L5506L5868L5521L4429L3848L4925L6722L7408L7013L7005
$$ 11642963 11677749 11713255 11749123 11784644 11819073 11852921 11887846 11924568 11961976 11998989 12035994
57554A2035994L7661L8026L8109L8847M0014M0372L9863L9548L9492L8806L7704
$$ 12035994 12073655 12111681 12149790 12188637 12228651 12269023 12308886 12348434 12387926 12426732 12464436
57543A2464436L7345L7681L7584L7125L7566L8993M0111M0470M0820M1146M0505
$$ 12464436 12501781 12539462 12577046 12614171 12651737 12690730 12730841 12771311 12812131 12853277 12893782
57532A2893782L9079L8245L8393L8563L8453L8791L9524L9584L8829L8352L8621
$$ 12893782 12932861 12971106 13009499 13048062 13086515 13125306 13164830 13204414 13243243 13281595 13320216
57521A3320216L9059L9494M0244M0763M0162L9056L8970L9911M0562M0743M1407
$$ 13320216 13359275 13398769 13439013 13479776 13519938 13558994 13597964 13637875 13678437 13719180 13760587
57510A3760587M2175M1413L9102L7296L7235L8076L8867L9535L9636L8488L7016
$$ 13760587 13802762 13844175 13883277 13920573 13957808 13995884 14034751 14074286 14113922 14152410 14189426
57499A4189426L7160L8747L9310L7700L5644L4843L4845L4818L5173L6245L7154
$$ 14189426 14226586 14265333 14304643 14342343 14377987 14412830 14447675 14482493 14517666 14553911 14591065
57488A4591065L7293L7316L7695L7839L7520L7552L8155L8314L7611L7104L7420
$$ 14591065 14628358 14665674 14703369 14741208 14778728 14816280 14854435 14892749 14930360 14967464 15004884
57477A5004884L7606L6849L5877L5579L5622L5428L5297L5621L6057L6278L6546
$$ 15004884 15042490 15079339 15115216 15150795 15186417 15221845 15257142 15292763 15328820 15365098 15401644
57466A5401644L6968L7179L7158L7315L7480L7104L6559L6829L7763L8242L8256
$$ 15401644 15438612 15475791 15512949 15550264 15587744 15624848 15661407 15698236 15735999 15774241 15812497
57455A5812497L9004M0529M1274M0547L9611L9557L9847L9788L9773M0123M0254
$$ 15812497 15851501 15892030 15933304 15973851 16013462 16053019 16092866 16132654 16172427 16212550 16252804
57444A6252804L9871L9657L9997M0361M0497M0903M1570M1671M1080M0680M0716
$$ 16252804 16292675 16332332 16372329 16412690 16453187 16494090 16535660 16577331 16618411 16659091 16699807
57433A6699807M0427L9687L9362L9570L9376L8694L8583L9064L8766L7447L6759
$$ 16699807 16740234 16779921 16819283 16858853 16898229 16936923 16975506 17014570 17053336 17090783 17127542
57422A7127542L7483L8142L7531L6593L6441L6442L5780L5169L5421L5781L5324
$$ 17127542 17165025 17203167 17240698 17277291 17313732 17350174 17385954 17421123 17456544 17492325 17527649
57411A7527649L4599L4464L4506L4087L3702L3840L3710L2536L1105L0548L0535
$$ 17527649 17562248 17596712 17631218 17665305 17699007 17732847 17766557 17799093 17830198 17860746 17891281
57400A7891281L0109K9432K9368K9931L0343L0100K9111K7449K5740K4949K5091
$$ 17891281 17921390 17950822 17980190 18010121 18040464 18070564 18099675 18127124 18152864 18177813 18202904
57389A8202904K5025K4199K3482K3626K4068K4168K4310K4813K4813K3499K1498
$$ 18202904 18227929 18252128 18275610 18299236 18323304 18347472 18371782 18396595 18421408 18444907 18466405
57378A8466405J9975J9067J8155J7084J6235J5914J6197J6804J6860J5675J3908
$$ 18466405 18486380 18505447 18523602 18540686 18556921 18572835 18589032 18605836 18622696 18638371 18652279
57367A8652279J2933J2921J2798J2190J1840J1883J1480J0635J0487J1187J1364
$$ 18652279 18665212 18678133 18690931 18703121 18714961 18726844 18738324 18748959 18759446 18770633 18781997
57356A8781997J0452R641R581R199P838O646O508O483N700N004N215N451M837
$$ 18781997 18792449 18802090 18811671 18820870 18828708 18835354 18841862 18848345 18854045 18859049 18864264 18869715 18874552
57343A8874552M326M984N928N726M636L700K757J141o05j458j560j676j814j788
$$ 18874552 18878878 18883862 18889790 18895516 18900152 18903852 18906609 18907750 18907145 18905687 18904127 18902451 18900637 18898849
57329A8898849k238l626n052n474n302n488n944o125o282o798p206p105p191q044
$$ 18898849 18896611 18892985 18887933 18882459 18877157 18871669 18865725 18859600 18853318 18846520 18839314 18832209 18825018 18816974
57315A8816974q934r078r169j0217j1841j3082j4021j5234j6560j7716j9155k0998
$$ 18816974 18808040 18798962 18789793 18779576 18767735 18754653 18740632 18725398 18708838 18691122 18671967 18650969
57303A8650969k2170k2024k1750k2628k3933k4212k3712k3708k4294k4648k4844
$$ 18650969 18628799 18606775 18585025 18562397 18538464 18514252 18490540 18466832 18442538 18417890 18393046
57292A8393046k5534k6264k5951k4824k4260k4840k5806k6340k6259k5733k5367
$$ 18393046 18367512 18341248 18315297 18290473 18266213 18241373 18215567 18189227 18162968 18137235 18111868
57281A8111868k6093k8119l0347l1787l2796l4188l5950l7815m0055m2673m4810
$$ 18111868 18085775 18057656 18027309 17995522 17962726 17928538 17892588 17854773 17814718 17772045 17727235
57270A7727235m6136m7743n0342n2764n3672n3708n4381n5715n6698n7219n7870
$$ 17727235 17681099 17633356 17583014 17530250 17476578 17422870 17368489 17312774 17256076 17198857 17140987
57259A7140987n8490n8530n8178n7708n6481n4072n1672n0638n0344m9062m6419
$$ 17140987 17082497 17023967 16965789 16908081 16851600 16797528 16745856 16695218 16644874 16595812 16549393
57248A6549393m3475m0955l8936l7668l7094l6153l4076l1763l0439k9673k8312
$$ 16549393 16505918 16464963 16426027 16388359 16351265 16315112 16281036 16249273 16218834 16189161 16160849
57237A6160849k6627k5774k5824k6024k6435k7530k8670k8865k8654k9436l1200
$$ 16160849 16134222 16108448 16082624 16056600 16030165 16002635 15973965 15945100 15916446 15887010 15855810
57226A5855810l2662l3307l3725l4099l4059l3827l3997l4368l4349l4149l4255
$$ 15855810 15823148 15789841 15756116 15722017 15687958 15654131 15620134 15585766 15551417 15517268 15483013
57215A5483013l4147l3051l1515l0765l0823l0675k9878k8745k7471k6379k6280
$$ 15483013 15448866 15415815 15384300 15353535 15322712 15292037 15262159 15233414 15205943 15179564 15153284
57204A5153284k7267k8061k8003k8614l1438l5441l8564m0844m3721m7191n0154
$$ 15153284 15126017 15097956 15069953 15041339 15009901 14974460 14935896 14895052 14851331 14804140 14753986
57193A4753986n2905n6570o0421o2422o2428o2338o3026o3638o4013o5329o7813
$$ 14753986 14701081 14644511 14584090 14521668 14459240 14396902 14333876 14270238 14206225 14140896 14073083
57182A4073083p0159p1795p3643p6130p8459q0488q3435q7980r3327r8773j04660
$$ 14073083 14002924 13931129 13857486 13781356 13702897 13622409 13538974 13450994 13357667 13258894 13154234
57171A3154234j11167j17535j22997j27341j30348j31894j32728j33785j34736
$$ 13154234 13043067 12925532 12802535 12675194 12544846 12412952 12280224 12146439 12011703
57162A2011703j34465j32827j30518j27453j22980j17522j12231j07064j00930
$$ 12011703 11877238 11744411 11613893 11486440 11363460 11245938 11133707 11026643 10925713
57153A0925713r3637q5982p8016o9057n9434n0420m2533l5540k9863k6053k3231
$$ 10925713 10832076 10746094 10668078 10599021 10539587 10489167 10446634 10411094 10381231 10355178 10331947
57142A0331947k0119j7325j6331j6872j8053k1815l1915m9059p0126r2744j17206
$$ 10331947 10311828 10294503 10278172 10261300 10243247 10221432 10189517 10140458 10070332 9977588 9860382
57131I860382j42622j64556j78632j84233j82884j75358j62497j47016j32073
$$ 9860382 9717760 9553204 9374572 9190339 9007455 8832097 8669600 8522584 8390511
57122H390511j18881j07258r7367q9513q3264p8079p4071p1296o9295o7948o7447
$$ 8390511 8271630 8164372 8067005 7977492 7894228 7816149 7742078 7670782 7601487 7533539 7466092
57111G466092o6576o2429n2750l7329j6432J0545M3813Q2128J24342J71016K23891
$$ 7466092 7399516 7337087 7284337 7247008 7230576 7241121 7284934 7367062 7491404 7662420 7886311
57100G886311K85234L58903M50865N67390P13349Q92380J106867J356617J638734
$$ 7886311 8171545 8530448 8981313 9548703 10262052 11154432 12261299 13617916 15256650
57091A5256650J949676K285988K642158L008716L372264L713809M004462M204446
$$ 15256650 17206326 19492314 22134472 25143188 28515452 32229261 36233723 40438169
57083D0438169M269891M162601L856188L340166K627068J759706Q08824j42843
$$ 40438169 44708060 48870661 52726849 56067015 58694083 60453789 61262613 61119770
57075F1119770j022334j781670k399981k875659l217259l439088l559897l599701
$$ 61119770 60097436 58315766 55915785 53040126 49822867 46383779 42823882 39224181
57067C9224181l574481l493549l361887l184119k966799k719221k453428k182542
$$ 39224181 35649700 32156151 28794264 25610145 22643346 19924125 17470697 15288155
57059A5288155j917975j668137j439127j234889j056375r02040p69799o57731
$$ 15288155 13370180 11702043 10262916 9028027 7971652 7069612 6299813 5642082
57051E642082n63199m83171m15861l60476l15085k76477k42694k13855j89903
$$ 5642082 5078883 4595712 4179851 3819375 3504290 3227813 2985119 2771264 2581361
57042B581361j69334j50928j34877j21234j08883r6903q5455p4595o3908n3842
$$ 2581361 2412027 2261099 2126222 2004988 1896105 1799202 1713747 1639152 1575244 1521402
57032A521402m5337l7492k7834j5568j928J3581L3355N5125O8155O0457K9866
$$ 1521402 1476065 1438573 1410739 1395171 1393243 1406824 1440179 1495304 1563459 1623916 1653782
57021A653782j3928n7185q9844j07636j11306j05252r4856q3565p2569o2491n3951
$$ 1653782 1639854 1582669 1492825 1385189 1273883 1168631 1073775 990210 917641 855150 801199
57010H01199m6853m0592l5044l0437k6542k3002k0116j8393j7658j7443j7705
$$ 801199 754346 713754 678710 648273 621731 598729 578613 560220 542562 525119 507414
56999E07414j8375j8779j8415j7800j7637j7704j7278j6114j4347j2128r928q332
$$ 507414 489039 470260 451845 434045 416408 398704 381426 365312 350965 338837 328909 320577
56987C20577o877m080N89N757R791J2210J2698J0234M555k522q582j2714j5193
$$ 320577 313700 309620 310209 315966 325757 337967 350665 360899 365454 362932 354350 341636 326443
56974C26443j6144j5693j4501j3022j0949q275n868m072j946J000L621N024O346
$$ 326443 310299 294606 280105 267083 256134 247859 241991 237919 235973 236973 240594 245618 251964
56961B51964R089J2774J5978J8688K1760K4495K4522K0078J1432N32r744j6661
$$ 251964 261053 273827 289805 308493 330253 354748 379270 399348 410780 411312 401568 384907
56949C84907j9358j9305j8393j7145j5384j3412j1475r041n823k555K34L240O997
$$ 384907 365549 346244 327851 310706 295322 281910 270435 261394 255571 253016 253250 256490 263487
56936B63487J0635J3213J5272J7802K0748K3596K6099K6994K3548J4310J499j0947
$$ 263487 274122 287335 302607 320409 341157 364753 390852 417846 441394 455704 457203 446256
56924D46256k0687k7082k9649k8670k6256k4522k3203k0939j8062j6024j4787
$$ 446256 425569 398487 368838 340168 313912 289390 266187 245248 227186 211162 196375
56913A96375j3042j0627q601p167n548l807k844k658k352j784j597j646j070J91
$$ 196375 183333 172706 164105 156938 151390 147583 144739 142081 139729 137945 136348 134702 133632 133823
56899A33823J399K377L472M389M568M438M864N653O061O378P527R454J1488J3812
$$ 133823 135222 137599 141071 145460 150028 154466 159330 164983 171044 177422 184949 194403 205891 219703
56885B19703J6751J8925J7960J3254O613J62m993q316r629r453q436o536l801
$$ 219703 236454 255379 273339 286593 293206 293368 288375 280059 270430 260977 252541 246005 242204
56872B42204j268J94J352L481O430R265J2139J5696J9329K1977K4270K7859L2792
$$ 242204 240936 241130 242482 245963 252393 261658 273797 289493 308822 330799 355069 382928 415720
56859D15720L7167L8937L6431K8071J4055j939j5063k3496k8521l1006l0350k6786
$$ 415720 452887 491824 528255 556326 570381 568442 553379 529883 501362 470356 440006 413220
56847D13220k2024j7020j1292m913R68O040J1158J6402K0851K4854L0316L7996
$$ 413220 391196 374176 362884 357971 358939 364979 376137 392539 413390 438244 468560 506556
56835E06556M6501N4525O1677O5948O2740M8582K5006k331k7424m6235n6993o0126
$$ 506556 553057 607582 669259 735207 797947 846529 871535 869204 841780 795545 738552 678426
56823F78426n7738n2302m5676l9067l2805k6190j8589j0833m408O68N854J1810
$$ 678426 620688 568386 522710 483643 450838 424648 406059 395226 390818 391486 397340 409150
56811D09150J7714K3122K9002L6103M3323M8042M7270L8652K1996N09k0547l7008
$$ 409150 426864 449986 478988 515091 558414 606456 653726 692378 714374 714883 694336 657328
56799F57328m7239n1211m9836m5232l9816l4480k8764k2781j7534j3219q941m502
$$ 657328 610089 558878 509042 463810 423994 389514 360750 337969 320435 307216 298275 293773
56787B93773q53J747M472Q250J2676J7125K1421K4739K5112K0992J2586J416j0473
$$ 293773 292920 294667 299139 307389 320065 337190 358611 383350 408462 429454 442040 443456 432983
56774D32983k0753k7598l0860l1609l0504k7665k3971k0813j8319j5398j1974
$$ 432983 412230 384632 353772 322163 291659 263994 240023 219210 200891 185493 173519
56763A73519r534q887q895q154o731n461m641m045l438k594j544r05j144j620
$$ 173519 163985 155098 146203 138049 131318 125857 121216 117171 113733 111139 109595 108690 107546 105926
56749A05926j400p73o32p20p8R15Q29m08j318j239j027j066o09L48N88k03o65
$$ 105926 104526 103753 103121 102401 102323 103238 104067 103659 102341 101102 100075 99009 98400 98748 99336 99133 98468
56732I8468OQ12Q10O17R99J452J260P35N12N83P82J145J306P08j23O8J242J752
$$ 98468 98474 99286 100096 100713 101712 103164 104424 105159 105671 106254 107036 108181 109487 110195 110072 110140 111382 113134
56714A13134P61n81r73n56j9N43J065J117P57P05J099J294J209J450J828J312
$$ 113134 113895 113314 112341 111785 111766 112309 113374 114491 115248 115953 117052 118346 119555 121005 122833 124145
56698A24145p6r48o76j81j22M5N41O00R8Q6Q74J312Q24M43Q87J266Q11K34K75
$$ 124145 124069 123121 122445 122264 122142 122187 122728 123328 123426 123512 124386 125698 126522 126965 127852 129118 129929 130163 130438
56679A30438L80k9l80j28K11J53J10K82R3n33o94j26K32L4K01J036J476J140J225
$$ 130438 130818 130789 130409 130281 130492 130645 130755 131037 131130 130597 129903 129777 130009 130043 130244 131280 132756 133896 135121
56660A35121K211K618J473J36J78J005J252J097J514K349K744K521J955J072J92
$$ 135121 137332 139950 141423 141559 141737 142742 143994 145091 146605 148954 151698 154219 156174 157246 157438
56645A57438P1O38Q40M83O58J514J490q6j519j279k15K44L22O96P48j47j054r69
$$ 157438 157509 158147 158987 159470 160128 161642 163132 163046 161527 160248 160033 160277 160599 161295 162043 161896 160842 159873
56627A59873o04r10j242p74m37j457l109l771l304k636j934r40k41n18j219j410
$$ 159873 159269 158359 157117 156343 155906 154449 151340 147569 144265 141629 139695 138755 138514 137996 136777 135367
56611A35367j177q76r4J266J984J211M4p6N14O93N93R43J395J186O83O34P34L88
$$ 135367 134190 133314 133220 134486 136470 137681 137725 137649 138163 138856 139449 140392 141787 142973 143656 144290 145024 145412
56593A45412J6J83L95J28K0O29J143Q41N85J292K068J653N88J71K93J22r9K81
$$ 145412 145428 145611 146006 146134 146154 146783 147926 148767 149352 150644 152712 154365 154953 155124 155417 155539 155440 155721
56575A55721O80K54l77l6J097K119L013M035M471L787L041L436M405M853N268
$$ 155721 156401 156655 156278 156242 157339 159458 162471 166506 170977 174764 177805 181241 185646 190499 195767
56560A95767O754Q908J0525J1418J1694J0289O442J766j318k516l219l853l851
$$ 195767 202521 211429 221954 233372 245066 255355 261797 263563 262245 259729 256510 252657 248806
56547B48806l489l568l762l291k744l210m096l822k334j057p02q36j211j805k000
$$ 248806 245317 241749 237987 234696 231952 228742 224646 220824 218490 217433 216731 215895 214684 212879 210879
56532B10879j353o74q07j071m92L23L10m5K49N85j42j129p56N37P88m01j470j422
$$ 210879 209526 208852 208045 206974 206482 206805 207115 207070 207319 207904 207762 206633 205877 206414 207202 206801 205331 203909
56514B03909p67j40K19j02j129j780j224l85m63q58l28P19J020O98N97L19q89
$$ 203909 203142 203002 203221 203119 201990 200210 198986 198601 198138 197280 196952 197671 198691 199389 199986 200305 199416
56497A99416k056j700m03J45k6L58J130J046L43M22J253J474Q78N15N93M56L19
$$ 199416 197360 195660 195257 195402 195376 195734 196864 197910 198253 198675 199928 201402 202280 202795 203388 203844 204163
56480B04163Q17J265N82m99m34M95Q63P95J372K036J380J26L21J802K447J849
$$ 204163 204980 206245 206827 206328 205894 206389 207252 208047 209419 211455 212835 212961 213282 215084 217531 219380
56464B19380J702K392K252P13o68r53r50j033l27J223K258K187J907J858J384
$$ 219380 221082 223474 225726 226439 225771 224818 223868 222835 222508 223731 225989 228176 230083 231941 233325
56449B33325M84J39N26P84P81J198J709J165k25r58o43l57n22m49l6P4K8M75Q95
$$ 233325 233809 233948 234474 235258 236039 237237 238946 240111 239886 238928 238285 237928 237406 236957 236921 236995 237023 237498 238393
56430B38393L01o60m90N88J097J051J700K811K847J715Q03M11k67q38j66J052
$$ 238393 238694 238034 237544 238132 239229 240280 241980 244791 247638 249353 250156 250567 250300 249462 249296 250348
56414B50348J068K52M93J592J504K23M6J514K517K068J674K142K173J166M96R40
$$ 250348 251416 251668 252161 253753 255257 255480 255526 257040 259557 261625 263299 265441 267614 268780 269276 270216
56398B70216J472J517J771K186J685N61M01J147J041l8k22Q11J175M02L68J700
$$ 270216 271688 273205 274976 277162 278847 279408 279809 280956 281997 281959 281737 282548 283723 284125 284493 286193
56382B86193K467J749J256K106K954K739K378K424J813M06o8J042K074J989J839
$$ 286193 288660 290409 291665 293771 296725 299464 301842 304266 306079 306485 306417 307459 309533 311522 313361
56367C13361K122J572o6r02j1J027J100J294K212K431J316O39J634K944L092K645
$$ 313361 315483 317055 316989 316087 316076 317103 318203 319497 321709 324140 325456 326095 327729 330673 333765 336410
56351C36410K408J910J123J242K330K641J561O88Q46P72N7L51K175L507L216K970
$$ 336410 338818 340728 341851 343093 345423 348064 349625 350313 351159 351931 351988 352339 354514 358021 361237 364207
56335C64207L980M780M217L831N069O654O804N852M831L692K556K457L323L471
$$ 364207 368187 372967 377184 381015 386084 392738 399542 405394 410225 413917 416473 418930 422253 425724
56321D25724K440J759J842J116n66r27P29J900J137N00J666K989K757K182K602
$$ 425724 428164 429923 431765 432881 432315 431388 432117 434017 435154 435654 437320 440309 443066 445248 447850
56306D47850K810J803J312K826M713N012M576M922N390M929M375M617M813M547
$$ 447850 450660 452463 453775 456601 461314 466326 470902 475824 481214 486143 490518 495135 499948 504495
56292E04495N135O879P768O946O412P239P460O061N525P500R472Q962P676Q166
$$ 504495 509630 516509 524277 531223 537635 544874 552334 558395 563920 571420 580892 589854 597530 605696
56278F05696R444R551R577J1244J3153J3173J2311J2650J3641J3897J4428J6579
$$ 605696 615140 624691 634268 645512 658665 671838 684149 696799 710440 724337 738765 755344
56266G55344J8960J9889K0695K3111K5723K6560K7067K9772L4001L7597M0988
$$ 755344 774304 794193 814888 837999 863722 890282 917349 947121 981122 1018719 1059707
56255A059707M5838N1524N6620O2164O9806P8365Q5703R2450J00332J08548J15257
$$ 1059707 1105545 1157069 1213689 1275853 1345659 1424024 1509727 1602177 1702509 1811057 1926314
56244A926314J20989J27015J31893J33148J30947J26749J19883J08904R4710P8935
$$ 1926314 2047303 2174318 2306211 2439359 2570306 2697055 2816938 2925842 3020552 3099487
56234C099487O0810L9072J5455p069k8030m8149o6114q0098r0970j00571j08270
$$ 3099487 3160297 3199369 3214824 3207755 3179725 3131576 3065462 2985364 2894394 2793823 2685553
56223B685553j12522j14107j14583j13331j09446j04692j01064r7269r1178q3890
$$ 2685553 2573031 2458924 2344341 2231010 2121564 2016872 1915808 1818539 1727361 1643471
56213A643471p7764p2300o5806n9268n4673n1115m6482m1439l7994l5613l2498
$$ 1643471 1565707 1493407 1427601 1368333 1313660 1262545 1216063 1174624 1136630 1101017 1068519
56202A068519k9110k6806k4674k1305j7932j6127j4480j1313q517q475r368p938
$$ 1068519 1039409 1012603 987929 966624 948692 932565 918085 906772 898255 889780 880412 872474
56190H72474m975l563l629k839j328r85j383p60L25M05N51K301L981L341J936
$$ 872474 867499 863936 860307 857468 856140 855155 853772 853012 853337 853742 854293 856594 860575 863916 865852
56175H65852K559M304M668M394N536O863O253N422P073R393Q976P229Q110J1056
$$ 865852 868411 872715 877383 881777 887313 894176 900429 905851 912924 922317 931293 938522 946632 957688
56161I57688J2177J1187J1231J2839J3816J4325J6423J9294K0356K0314K1883
$$ 957688 969865 981052 992283 1005122 1018938 1033263 1049686 1068980 1089336 1109650 1131533
56150A131533K4569K6083K7628L2136L8461M3150M6842N3103O1948P0517P9009
$$ 1131533 1156102 1182185 1209813 1241949 1280410 1323560 1370402 1423505 1485453 1555970 1634979
56139A634979Q9678J00831J08069J10694J10708J06614R5145P8581O3562N2778
$$ 1634979 1724657 1825488 1933557 2044251 2154959 2261573 2356718 2435299 2498861 2551639
56129B551639M4230L8004L6507L7821L5950K8538J8352P221n049j5763k0517k0192
$$ 2551639 2595869 2633873 2670380 2708201 2744151 2772689 2791041 2798262 2793213 2777450 2756933 2736741
56117B736741k0690k5235l2705m3120n7866p4213q6390r2781r6005r6108r0480
$$ 2736741 2716051 2690816 2658111 2614991 2557125 2482912 2396522 2303741 2207736 2111628 2021148
56106B021148q0492p0997o2848n2830m1226l2258k6589k0679j4117j0219q720
$$ 2021148 1940656 1869659 1806811 1753981 1712755 1680497 1653908 1633229 1619112 1608893 1600173
56095A600173n435j07K892K713L450O331P903P314P999J0748J2218J1706J2445
$$ 1600173 1594738 1594631 1597523 1600236 1603686 1610017 1617920 1625234 1633233 1643981 1656199 1667905 1680350
56082A680350J5005J6314J6151J7522K0000J9975J8050J8582K1409K1988K0114
$$ 1680350 1695355 1711669 1727820 1745342 1765342 1785317 1803367 1821949 1843358 1865346 1885460
56071A885460K0211K2445K2347J9985K0528K4569K6966K6522K7592L0772L1438
$$ 1885460 1905671 1928116 1950463 1970448 1990976 2015545 2042511 2069033 2096625 2127397 2158835
56060B158835K9155K8951L1546L1950K9599K9895L3642L5070L2704L2045L4918
$$ 2158835 2187990 2216941 2248487 2280437 2310036 2339931 2373573 2408643 2441347 2473392 2508310
56049B508310L6392L5035L5857M0152M2688M2108M3747M8997N2266N1712N2413
$$ 2508310 2544702 2579737 2615594 2655746 2698434 2740542 2784289 2833286 2885552 2937264 2989677
56038B989677N5661N5772N0898M6372M4221M0279L4732L3961L8690M1975M2179
$$ 2989677 3045338 3101110 3152008 3198380 3242601 3282880 3317612 3351573 3390263 3432238 3474417
56027C474417M5735N3772N8983N9447O2338O9772P4560P4525P7122Q4931R0664
$$ 3474417 3520152 3573924 3632907 3692354 3754692 3824464 3899024 3973549 4050671 4135602 4226266
56016D226266R1723R5306J03605J08739J08184J10254J18135J23838J24294J27630
$$ 4226266 4317989 4413295 4516900 4625639 4733823 4844077 4962212 5086050 5210344 5337974
56006E337974J36892J43728J45155J49880J60822J68705J70611J76785J90873
$$ 5337974 5474866 5618594 5763749 5913629 6074451 6243156 6413767 6590552 6781425
55997F781425K02130K06072K13563K29903K44783K53134K65492K86894L06442
$$ 6781425 6983555 7189627 7403190 7633093 7877876 8131010 8396502 8683396 8989838
55988H989838L19246L37047L65171L91386M10184M34638M71008N06250N34801
$$ 8989838 9309084 9646131 10011302 10402688 10812872 11247510 11718518 12224768 12759569
55979A2759569N71735O24236O77354P24269P81755Q58152R36820J010591J100115
$$ 12759569 13331304 13955540 14632894 15357163 16138918 16997070 17933890 18944481 20044596
55970B0044596J217218J344750J475572J634357J836072K063226K312425K620533
$$ 20044596 21261814 22606564 24082136 25716493 27552565 29615791 31928216 34548749
55962C4548749L014977L486629M046233M752666N642743O689505P874118R232540
$$ 34548749 37563726 41050355 45096588 49849254 55491997 62181502 70055620 79288160
55954G9288160J0782232J2489772J4383363J6606772J9286274K2464855K6223024
$$ 79288160 90070392 102560164 116943527 133550299 152836573 175301428 201524452
55947B01524452L0517490L4442136L5744721L1777336K1540855O872032q528204
$$ 201524452 232041942 266484078 302228799 334006135 355546990 362419022 353890818
55940C53890818k1265369k9655285l3647793l4083508l2126336k8923050k5324033
$$ 353890818 332625449 302970164 269322371 235238863 203112527 174189477 148865444
55933A48865444k1781880j8498913j5594279j3114683j1013257r223517p724848
$$ 148865444 127083564 108584651 92990372 79875689 68862432 59638915 51914067
55926E1914067o501040n493418m643025l935450l364568k892668k483253k136646
$$ 51914067 45413027 39919609 35276584 31341134 27976566 25083898 22600645 20463999
55918B0463999j858795j627135j418100j237820j096019r76929q63261p63272
$$ 20463999 18605204 16978069 15559969 14322149 13226130 12249201 11385940 10622668
55910A0622668o88082o25781n62327n05797m66642m34572l97167l62034l39382
$$ 10622668 9934586 9308805 8746478 8240681 7774039 7339467 6942300 6580266 6240884
55901F240884l20726k95124k69508k53668k40953k22260k03824j93674j84909
$$ 6240884 5920158 5625034 5355526 5101858 4860905 4638645 4434821 4241147 4056238
55892D056238j69256j53322j45299j39062j26941j15030j10583j07046r6625q5392
$$ 4056238 3886982 3733660 3588361 3449299 3322358 3207328 3096745 2989699 2893074 2807682
55882B807682q1325p9399p3016o8377p2704p9118p7901p2658p1281p0651o4545
$$ 2807682 2726357 2646958 2573942 2505565 2432861 2353743 2275842 2203184 2131903 2061252 1996707
55871A996707n7509n6862n8838n6089n1326n0872n2059m9261m5420m5738m6782
$$ 1996707 1939198 1882336 1823498 1767409 1716083 1665211 1613152 1563891 1518471 1472733 1425951
55860A425951m3295l9152m0345m3746m3636m2731m5780m8688m5061l7669l2869
$$ 1425951 1382656 1343504 1303159 1259413 1215777 1173046 1127266 1078578 1033517 995848 962979
55849I62979k9369k2923j6421j4761j5011j1873p980q750j1839j1616r527j0355
$$ 962979 933610 910687 894266 879505 864494 852621 844641 835891 824052 812436 802909 792554
55837G92554j2482j1440r051r812j2007j1293r274r933j1363r636o945p549r341
$$ 792554 780072 768632 759581 749769 737762 726469 717195 707262 695899 686263 679318 671769 662428
55824F62428p894n168n856q570q917p958r381j1599j0722q319q379r528q040n492
$$ 662428 654534 649366 643510 634940 626023 618065 608684 597085 586363 578044 569665 560137 552097 546605
55810E46605n712p064n465k241j444k114p09J543J244L3J691M573M435K374K420
$$ 546605 540893 533829 528364 526123 524679 522565 521856 523399 524643 524676 526367 530940 535375 537749 540169
55795E40169L635K137j118k142j591l210o349p268o351o843p930o320l342l422
$$ 540169 543804 545941 544823 542681 541090 537880 531531 524263 517912 511069 503139 496819 493477 490055
55781D90055o480q693r651j1990j4897j4894j2401j1027j0886q948n450l600l395
$$ 490055 483575 474882 465231 453241 438344 423450 411049 400022 389136 380188 374738 371138 367743
55768C67743j902O66J190k94o57M21K06j548k238j520j569k439k160j225k016
$$ 367743 365841 366507 367697 367403 366746 367167 367373 365825 363587 362067 360498 358059 355899 354674 352658
55753C52658m109m837m180m410n504n533m901n522o609n958m515m878o210n622
$$ 352658 348549 343712 339532 335122 329618 324085 319184 313662 307053 301095 296580 291702 285492 279870
55739B79870l679l433m790m933l675l267l552k392m67m65j938k016q38j167k961
$$ 279870 276191 272758 267968 263035 259360 256093 252541 250149 249682 249217 247279 245263 244425 243258 240297
55724B40297l408k239j933k702k311q80q66k175k095l02P43N24Q79J704R25j062
$$ 240297 236889 234650 232717 230015 227704 226824 225958 223783 221688 221386 222129 222653 223532 225236 226161 225099
55708B25099j621o74o12j404n86J616K085J62j480j804k555l841l469j463o37
$$ 225099 223478 222804 222192 220788 220202 221818 223903 224065 222585 220781 218226 214385 210916 209453 208816
55693B08816j645j907n13K04q45j663j069m84n84MJ487K014J174R53K196L425
$$ 208816 207171 205264 204751 204955 204110 202447 201378 200894 200310 200314 201801 203815 204989 205942 208138 211563
55677B11563L897M547N234M549K949K555L305K938J283P34J768J955L82q50n86
$$ 211563 215460 220007 225241 229790 232739 235294 238599 241537 242820 243554 245322 247277 247659 246809 246223
55662B46223l42q87p50N68J313O67M7O3n38j872k228j452j684l511m634l691k289
$$ 246223 245881 244994 244244 244812 246125 246792 246839 246902 246364 244492 242264 240812 239128 235617 230983 227292 225003
55645B25003j967k146k354l423n127n579m357l526m246n071m774m180m040l665
$$ 225003 223036 220890 218536 215113 209986 204407 200050 196524 192278 187207 182433 178253 174213 170548
55631A70548k841k559k793k085k80Q11L81k54k95o25j524j853j307r98j150q09
$$ 170548 167707 165148 162355 160270 159990 160801 161182 160928 160633 160008 158484 156631 155324 154326 153176 152367
55615A52367k93j098k844l320k212j638k252k179p55M3p96j523r33l77r10j318
$$ 152367 152074 150976 148132 144812 142600 140962 138710 136531 135776 135819 135023 133500 132567 132190 131280 129962
55599A29962p11l31j100j820j440q30q10o39K20R31J088J447J896J114p32j532
$$ 129962 129251 128920 127820 126000 124560 123730 122920 122281 122501 123432 124520 125967 127863 128977 128245 126713
55583A26713n25N18M63N10J453K088J771J920L265M165L410K424K876M205N088
$$ 126713 126188 126706 127169 127679 129132 131220 132991 134911 138176 142341 145751 148175 151051 155256 160344
55568A60344N411N299M148K130P25M74Oj563l221m091m766n510n373m242l542
$$ 160344 165755 171054 175202 177332 178057 178531 178537 176974 173753 169662 164896 159386 154013 149771 146229
55553A46229l746l386j753k54J14L46J148J432N21l45j63K87L35O92J470J330
$$ 146229 142483 139097 137344 137090 137204 137550 138698 140130 140651 140306 140143 140430 140765 141457 142927 144257
55537A44257j3p02L02J410J179O26J076J779J507O40J6o12j432j671j208j286
$$ 144257 144244 143542 143844 145254 146433 147059 148135 149914 151421 152061 152077 151465 150033 148362 147154 145868
55521A45868k359l086k718k443l072l536l041k573k816k732j714r87j381j827
$$ 145868 143509 140423 137705 135262 132190 128654 125613 123040 120224 117492 115778 114791 113410 111583
55507A11583j578j611k323k210n82P54L52n76o17n31j204j522n94J47o35j626
$$ 111583 110005 108394 106071 103861 103279 104033 104385 103809 103192 102661 101457 99935 99341 99488 98853 97227
55491I7227j107J23M20J40M11P31J91m25n7M79L4o15k12O48Q17Q01J490K051J294
$$ 97227 96120 96243 96663 96803 97214 97945 98136 97711 97654 98133 98167 97552 97340 97988 98805 99606 101096 103147 104441
55472A04441q7q09j187j923k084o45J172J449M41l12o77j501k422k353j454n95
$$ 104441 104354 103545 102358 100435 98351 97706 98878 100327 100768 100456 99779 98278 95856 93503 92049 91454
55456I1454L11J598K364J645K61l44k75m57p47n79m57j007j519j197p74j101j340
$$ 91454 91765 93363 95727 97372 97633 97289 97014 96557 95810 95231 94774 93767 92248 91051 90277 89176 87836
55439H7836m15R29J471J612K074J862o2k202k233m71P76O94L96M64M02K34M38
$$ 87836 87421 88350 89821 91433 93507 95369 95307 93105 90872 90401 91177 91871 92267 92731 93133 93367 93805
55422I3805N87j0p20n07J22m0o88o18jP0k58j5M36j26j359j580l92Q00J001O17
$$ 93805 94392 94382 93662 93155 93277 93237 92549 91931 91930 92000 91742 91727 92163 92037 90678 89098 88706 89506 90507 91124
55402I1124K53R0L75J128J448N54p88j198o64k11q2K49O64O00K49J98J99l30j034
$$ 91124 91377 91467 91842 92970 94418 94972 94184 92986 92322 92111 92029 92278 92942 93542 93791 93989 94188 93858 92824
55383I2824j217j114j172q12N24J797J574K53n59m05p3J59O10R56N76j27k82r1
$$ 92824 91607 90493 89321 88509 89033 90830 92404 92657 92098 91693 91620 91779 92389 93345 93921 93794 93512 93421
55365I3421m20j207j699j770j665j109j5O88L77jM19O39m31j503n57J787K959
$$ 93421 93001 91794 90095 88325 86660 85551 85536 86224 86601 86600 87019 87658 87227 85724 85167 86954 89913
55348H9913K160R75M90J62l97o41m69n10q35r28q98j151j111J5J366J241l01j474
$$ 89913 92073 93048 93538 93700 93303 92662 92193 91683 90848 89920 89022 87871 86760 86775 88141 89382 89081 87607
55330H7607j408r09n69p7M68L44k59k14O88J338J086N28K70J60O1J61L67L56K60
$$ 87607 86199 85290 84721 84644 85112 85456 85197 84983 85671 87009 88095 88623 88893 89053 89114 89275 89642 89998 90258
55311I0258L60L44j38o14n61m40p07n44Q62K442K475J164J90Q0j8k71N1Q46J118
$$ 90258 90618 90962 90824 90210 89649 89209 88502 87958 88820 91262 93737 94901 95091 95171 95153 94882 94933 95779 96897
55292I6897P18L54j3r54j862j431M9P71P3q02p87k29L12P97J025O02j27m16m14
$$ 96897 97615 97969 97956 97002 95140 93709 93758 94529 94602 93800 93013 92784 93096 93893 94918 95520 95393 94977 94563
55273I4563p84j226q90j1M51N43R75J368P57l51n03K01K48n93r51m05j46o12o43
$$ 94563 93779 92553 91663 91652 92103 92646 93621 94989 95746 95395 94892 95093 95341 94748 93797 93392 93246 92634 91991
55254I1991L39J257J188N59n0o67r52k40R62J122p0j243j510j471j547j155j09
$$ 91991 92330 93587 94775 95334 95284 94617 93665 93425 94387 95509 95439 94196 92686 91215 89668 88513 88404
55237H8404P87J148J456J624Q01q46j837j479o56p4N57J081N98o34q97L86J520
$$ 88404 89191 90339 91795 93419 94220 93374 91537 90058 89402 89328 89885 90966 91564 90930 90033 90419 91939
55220I1939J059j44n92k97o7O1M07O66M46J2k62m11k86M61J376J312J68p62o92
$$ 91939 92998 92854 92262 91965 91898 91959 92366 93032 93478 93490 93228 92817 92531 92992 94368 95680 95848 95086 94394
55201I4394l38m15n31l45m23j033j274m54O87J039N96J33J17O02J368J742J104
$$ 94394 94056 93641 93110 92765 92342 91309 90035 89581 90268 91307 91903 92036 92153 92755 94123 95865 96969
55184I6969r8p20n27l61n76n80k33k02n55m22L40O59P5l06M29J532J717Q14l94
$$ 96969 96871 96151 95624 95263 94687 94107 93874 93672 93117 92695 93035 93694 93769 93463 93892 95424 97141 97955 97561
55165I7561j105p69N93J934J984Q24l40r51j384j504o68O39R32l2q31o62k97k64
$$ 97561 96456 95687 96280 98214 100198 101022 100682 99731 98347 96843 96175 96814 97746 97714 96883 96221 95924 95660
55147I5660N1P72R17K59l1M75N83k47o82J89J161R50K46J89M03J15j44L39Q54
$$ 95660 95711 96483 97400 97659 97628 98103 98686 98439 97757 97946 99107 100057 100303 100492 100895 101010 100866 101205 102059
55128A02059M55l04l55O0Q4j73k08m13j295k148j916q37N2M53P36R48R48R74J064
$$ 102059 102514 102210 101855 101915 101999 101826 101618 101205 99910 97762 95846 95009 95061 95514 96250 97198 98146 99120 100184
55109A00184O54l92j127q12p5J92K28O68J237J256P76K87m8r7M76J394J584O64
$$ 100184 100838 100446 99319 98507 98432 98624 98852 99520 100757 102013 102789 103076 103028 102931 103407 104801 106385 107049
55091A07049l79o81o43p54n59K20P58M85K10O78J181Q29J23n7N0m4J68J080J663
$$ 107049 106670 105989 105346 104592 104033 104253 105011 105496 105706 106384 107565 108394 108517 108460 108510 108466 108634 109714 111377
55072A11377Q50n71j047m96j1O8J65K23j33n80n85m34n93o48j01M36K30j71J10
$$ 111377 112227 111656 110609 110113 110102 110170 110335 110558 110425 109845 109260 108826 108233 107585 107484 107920 108150 107979 108089
55053A08089O15L06n72r51p76q03j010p06ML53L05M62P82O99L31K92M98L34j17
$$ 108089 108704 109010 108438 107487 106711 105908 104898 104192 104196 104549 104854 105316 106098 106797 107128 107420 107918 108252 108135
55034A08135k28k2nl6M84J373J758J376P60L04n3l12m83r06j685k190j890j229
$$ 108135 107907 107885 107880 107844 108328 109701 111459 112835 113595 113899 113846 113534 113051 112145 110460 108270 106380 105151
55016A05151p84j96J001K061J792L07j149j781j643r25R5O84M15j1K69R13R64
$$ 105151 104367 104171 105172 107233 109025 109332 108183 106402 104759 103834 103929 104613 105028 105017 105286 106199 107163
54999A07163L97o2k46m85o23k63L19N57N69P34P98M36J74N50R45N46j18J7P15
$$ 107163 107560 107498 107252 106767 106144 105881 106200 106757 107326 108060 108858 109294 109468 110018 110963 111509 111391 111408 112123
54980A12123R21O07N54O43O5q83r29J19J007R72O44P60J170J437J372Q36p9p25
$$ 112123 113044 113651 114205 114848 114913 114030 113101 113220 114227 115199 115843 116603 117773 119210 120582 121418 121339 120614
54962A20614o54n06j099j892j637l29P98J083R59P14J76l36j71L96L82k69n55
$$ 120614 119960 119454 118355 116463 114826 114497 115295 116378 117337 118051 118227 117891 117720 118116 118498 118229 117674
54945A17674r7L95N35P96J296J335O18j07j80J43L46L70L70M43P76J343J554J004
$$ 117674 117577 117972 118507 119303 120599 121934 122552 122445 122265 122408 122754 123124 123494 123937 124713 126056 127610 128614
54927A28614L75N92J325J547J368J884L159L971L892M087N375O842P134O126M523
$$ 128614 128989 129581 130906 132453 133821 135705 138864 142835 146727 150814 156189 163031 170165 176291 180814
54912A80814K664O04j304k641l472m147m849n494n798n456m603l915l769l603
$$ 180814 183478 184082 182778 180137 176665 172518 167669 162175 156377 150921 146318 142403 138634 135031
54898A35031k771j633r80p42l75j43o62j375r18P19J861J412K02m15k30K39Q31
$$ 135031 132260 130627 129647 128905 128530 128387 127725 126350 125432 126151 128012 129424 129626 129211 128981 129220 130051
54881A30051J671K555L054K994K664K733L833N761P236P271O385N710N211L867
$$ 130051 131722 134277 137331 140325 142989 145722 149555 155316 162552 169823 176208 181918 187129 190996
54867A90996J421j262l537n470o916p322o715n807m954m004l187l063l368l126
$$ 190996 192417 191155 187618 182148 175232 167910 161195 155388 150434 146430 143243 140180 136812 133686
54853A33686k116j184q64q66j030j621k350k333j460o29l19p5K04j61j207j762
$$ 133686 131570 130386 129522 128656 127626 126005 123655 121322 119862 119233 118914 118839 119043 118882 117675 115913
54837A15913j096m7K59n1j99%K21L48M24L22N7o8M0J61K75N37O66K05m62m01L49
$$ 115913 114817 114770 115029 114978 114779 114779 115000 115348 115772 116094 116151 116083 116123 116284 116559 117096 117762 117967 117505 117104 117453
54816A17453O03k27j295j680j545j406j233r29p82q31n95L2M21L03L32R73J666
$$ 117453 118056 117829 116534 114854 113309 111903 110670 109741 108959 108128 107533 107565 107986 108289 108621 109594 111260
54799A11260J708J255Q18M78K11K40N23N32P8l22l20k10j67J33O46O78O5k79L44
$$ 111260 112968 114223 115041 115519 115730 115970 116493 117025 117103 116781 116461 116251 116084 116217 116863 117541 117606 117327 117671
54780A17671J407K089K321K301J858J104P98J245J714J721J986L093M198M316
$$ 117671 119078 121167 123488 125789 127647 128751 129549 130794 132508 134229 136215 139308 143506 147822
54766A47822M081M765O065O453N564M756N040N668N223L315O89j712l395m369
$$ 147822 151903 156668 162733 169186 174750 179506 184546 190214 195437 198752 199441 197729 194334 189965
54752A89965m961n498o087o643o997o831n885m414l162k571k232j533n59Pk04
$$ 189965 185004 179506 173419 166776 159779 152948 147063 142649 139487 136916 134684 133151 132592 132599 132395
54737A32395p88j040o62K5N35P95J163J774K239K241K121K369K805K915K721K702
$$ 132395 131607 130567 129905 129930 130465 131260 132423 134197 136436 138677 140798 143167 145972 148887 151608 154310
54721A54310K993L396L986M881N491N012L657K434J587L15j734l752m931n381
$$ 154310 157303 160699 164685 169566 175057 180069 183726 186160 187747 188062 186328 182576 177645 172264
54707A72264n519n348m870m414m094l592k858k277j884j207k63J61l17j062j363
$$ 172264 166745 161397 156527 152113 148019 144427 141569 139292 137408 136201 135938 136099 135782 134720 133357
54692A33357j240q93k60M11M04m23j238j428j353j449j407j006p94j128j299n79
$$ 133357 132117 131224 130964 131375 131779 131356 130118 128690 127337 125888 124481 123475 122681 121553 120254 119675
54676A19675M76P14j7q66j251j329j365j345j174q06k31L65O56N80M44M85N97
$$ 119675 120151 120865 120848 119982 118731 117402 116037 114692 113518 112712 112481 112846 113502 114082 114526 115011 115608
54659A15608O35O09N12M00N32R63J156P02J44K11M98J10o21m98M08O28k35o90
$$ 115608 116243 116852 117364 117764 118296 119259 120415 121117 121261 121472 121970 122080 121459 120961 121369 121997 121762 121072
54641A21072K35J319J002k93j007o32J02N25M80j2o25p93n06m10o96p32k79l8
$$ 121072 121307 122626 123628 123335 122328 121696 121798 122323 122803 122791 122166 121373 120867 120457 119761 119029 118750 118712
54623A18712l06k84M56R97N73n7Q9N51L16m19p26m99k54M2O95J303J175M68j02
$$ 118712 118406 118122 118578 119575 120148 120091 120180 120731 121047 120628 119902 119403 119149 119191 119886 121189 122364 122832 122730
54604A22730k80k19J28O97R53O64M48P28Q87L39l10k12L38M97J71k79q98j601
$$ 122730 122450 122231 122359 123056 124009 124673 125121 125849 126736 127075 126765 126553 126891 127388 127559 127280 126382 124781
54586A24781j603n68L89J55o33o32J25O23P22J037J398J024L2o62p82o92l38N41
$$ 124781 123178 122610 122999 123154 122521 121889 122014 122637 123359 124396 125794 126818 126850 126188 125406 124714 124376 124917
54568A24917J340J181L70q0j24m74r39o45K16L76m57j077o27L18Q75R32P43M37
$$ 124917 126257 127438 127808 127728 127604 127130 126191 125546 125762 126138 125681 124604 123977 124295 125170 126102 126845 127282
54550A27282K44M04O37N26L96R07J867K389K203J833J491R15K15j61k93o08q67
$$ 127282 127526 127930 128567 129093 129489 130396 132263 134652 136855 138688 140179 141094 141309 141148 140855 140247 139380
54533A39380m04O15J303J361J216Q98K2j115j649j500j391j443j036k43l5p53
$$ 139380 138976 139591 140894 142255 143471 144369 144391 143276 141627 140127 138736 137293 136257 136014 135979 135226
54517A35226j498j487r21k24M83Q60M32m34o78p0M63L40O6J43K73J82J43K52J11
$$ 135226 133728 132241 131320 131096 131579 132439 132871 132437 131759 131689 132152 132492 132558 132701 132974 133156 133299 133551 133662
54498A33662k87l15K12O33N77N30P85Q37L70p7n8L0k36n64n59l37l3N20J143J181
$$ 133662 133375 133060 133272 133905 134482 135012 135797 136634 137004 136927 136869 136899 136663 136099 135540 135203 135170 135690 136833 138014
54478A38014N30l9j33l20q81j050l32L66L5p98q07K33J378J962K072J806J121
$$ 138014 138544 138505 138372 138052 137171 136121 135789 136155 136190 135392 134585 134818 136196 138158 140230 142036 143157
54461A43157L74J41M09O04M76L48L99L20j33o78q44n72k44k46n89r32r18n35p5
$$ 143157 143531 143672 144081 144685 145161 145509 145908 146228 146095 145417 144573 144001 143757 143511 142922 141990 141072 140537 140462
54442A40462J63J15o4j42o8q5l98p06m16M65J135R96M01rk01m14m09J42Q98J223
$$ 140462 140625 140740 140676 140534 140466 140381 139983 139277 138861 139326 140461 141457 141858 141849 141648 141234 140825 140967 141865 143088
54422A43088J111R87Q89O67O49J105J335M13j280k369k312j794j264m19O48J089
$$ 143088 144199 145186 146075 146742 147391 148496 149831 150244 148964 146595 144283 142489 141225 140806 141454 142543
54406A42543O28J83M97J153J442J386J254R01K66j22J71Q41J401J827K221K309
$$ 142543 143171 143354 143851 145004 146446 147832 149086 149987 150253 150131 150302 151143 152544 154371 156592 158901
54390A58901J807Q57k35j226j711j305l69J21k57q88j161j215j269j042m19M6
$$ 158901 160708 161565 161330 160104 158393 157088 156719 156840 156583 155695 154534 153319 152050 151008 150589 150635
54374A50635o4k49J53Q91J239J119J074J315J511J433J289J311J360J128N62P3
$$ 150635 150571 150322 150475 151366 152605 153724 154798 156113 157624 159057 160346 161657 163017 164145 164707 164780
54358A64780K05J021J954K435K451K246J869J438J416J941K240J547L37l01k92
$$ 164780 164985 166006 167960 170395 172846 175092 176961 178399 179815 181756 183996 185543 185880 185579 185287
54343A85287n05j162j562j504j677k290k569k075j510j502j636j343r46j039j522
$$ 185287 184782 183620 182058 180554 178877 176587 174018 171943 170433 168931 167295 165952 165006 163967 162445
54328A62445j932k087j959j472q83o89p98n51M2J04o14j042l76N50M90m03j007
$$ 162445 160513 158426 156467 154995 154112 153423 152625 152074 152116 152220 151606 150564 150188 150738 151228 150825 149818
54311A49818q76n14l03j66o8j01j43m1L9p1j35J86Q19J373J492R39j51j010q65
$$ 149818 148942 148428 148125 147959 147891 147790 147647 147606 147645 147574 147439 147625 148444 149817 151309 152248 152097 151087 150222
54292A50222p2J73m32q22k91L06po97n43M51J151R50L44M1K92R53J600J711J282
$$ 150222 150150 150323 149891 149069 148778 149084 149077 148380 147837 148288 149439 150389 150733 150774 151066 152019 153619 155330 156612
54273A56612R11Q74N51m98j498j325j45P27N07l07q15o62r2M32N62L54K01L16
$$ 156612 157523 158397 158948 158450 156952 155627 155482 156209 156716 156409 155594 154932 154840 155272 155834 156188 156389 156705
54255A56705N08N94O72O95M03m8PO79J029L45o98r02k34K29j79j027j535j360
$$ 156705 157213 157807 158479 159174 159577 159529 159536 160215 161244 161589 160891 159989 159755 159984 159805 158778 157243 155883
54237A55883o58Q7K97j98r43j381j381j052m24K76N21J20l36k17K91N43L77J95
$$ 155883 155225 155312 155609 155411 154468 153087 151706 150654 150230 150506 151027 151147 150811 150594 150885 151428 151805 152000
54219A52000L09P06J248J730J862J598J235J008Q01M17j70r97k006k668k312j119
$$ 152000 152309 153015 154263 155993 157855 159453 160688 161696 162497 162914 162744 161747 159741 157073 154761 153642
54203A53642j50q2n10p97q62p67l65J66K36j34q0P33J395J174P55J067J662J438
$$ 153642 153492 153410 152900 152103 151241 150474 150109 150275 150511 150377 150297 151030 152425 153599 154354 155421 157083 158521
54185A58521L48o89j191j359j235o69Q9O46J070J543J748J361P76N01K59m65j330
$$ 158521 158869 158180 156989 155630 154395 153726 153815 154461 155531 157074 158822 160183 160959 161460 161719 161254 159924
54168A59924j569j161o95l95j87l39j075j749j527o26L9K85P13J471J992J959
$$ 159924 158355 157194 156499 156104 155917 155578 154503 152754 151227 150601 150640 150925 151638 153109 155101 157060
54152A57060J666J379J151J144J309R92k61j660j961j194n94q00j145q90j69N63
$$ 157060 158726 160105 161256 162400 163709 164701 164440 162780 160819 159625 159031 158231 157086 156196 156027 156590
54136A56590J144J477J400J026P16N79M16J95Qk55o24o43Q3J061J451J245J092
$$ 156590 157734 159211 160611 161637 162353 162932 163348 163543 163551 163296 162672 162029 162112 163173 164624 165869 166961
54119A66961J116P89O2l46K2P78J363J600J499J095O56M91M81K72j25l86m48m96
$$ 166961 168077 168866 168928 168582 168604 169382 170745 172345 173844 174939 175595 176086 176567 176839 176714 176328 175880 175384
54101A75384n76o99j106j800k152j654p34j24K40Q39J477J587J340J384J592J227
$$ 175384 174808 174109 173003 171203 169051 167397 166663 166539 166779 167618 169095 170682 172022 173406 174998 176225
54085A76225L48p0M34J255J753J927J931J786J741K119K670K814K535K344K448
$$ 176225 176573 176503 176937 178192 179945 181872 183803 185589 187330 189449 192119 194933 197468 199812 202260
54070B02260K751L446M668N778O015N635N267M410K057j254l626m237m085l980
$$ 202260 205011 208457 213125 218903 224918 230553 235820 240230 242287 241033 237407 233170 229085 225105
54056B25105l419k081q54m43k12N42J272J153N54N10J270K224K833L015K995L256
$$ 225105 221686 219605 218751 218308 218096 218638 219910 221063 221617 222127 223397 225621 228454 231469 234464 237720
54040B37720M128N098N242M624M458N415O706P343P384P347P251P025O947O922
$$ 237720 241848 246946 252188 256812 261270 266685 273391 280734 288118 295465 302716 309741 316688 323610
54026C23610O109M218K453K112K786K977K145J074M65J04m93j407k402l211l691
$$ 323610 329719 333937 336390 338502 341288 344265 346410 347484 347949 348053 347560 346153 343751 340540 336849
54011C36849l992m476n249n981o380o531o492o078n313m671m417m163l514k764
$$ 336849 332857 328381 323132 317151 310771 304240 297748 291670 286357 281686 277269 273106 269592 266828
53997B66828k427k405k208j696j171p96m06J76P79R46L09q66j711j683j321j542
$$ 266828 264401 261996 259788 258092 256921 256125 255719 255895 256674 257620 257929 257063 255352 253669 252348 250806
53981B50806k339k911k992l131l495l430k629j796j598j766j782j733j803j598
$$ 250806 248467 245556 242564 239433 235938 232508 229879 228083 226485 224719 222937 221204 219401 217803
53967B17803p23M36J175J345J253J107J038J288J808K113J950J670J601J548J332
$$ 217803 217080 217516 218691 220036 221289 222396 223434 224722 226530 228643 230593 232263 233864 235412 236744
53952B36744J278J668K223K656L139L827M431M799N223N676N447M298L283L519
$$ 236744 238022 239690 241913 244569 247708 251535 255966 260765 265988 271664 277111 281409 284692 288211
53938B88211M649N425N466N465N919O515O737O372N460M347L657L733M271M870
$$ 288211 292860 298285 303751 309216 315135 321650 328387 334759 340219 344566 348223 351956 356227 361097
53924C61097N676O973Q587J0258J2144J4206J5491J4866J2401R256O423M272L086
$$ 361097 366773 373746 382333 392591 404735 418941 434432 449298 461699 470955 477378 481650 484736
53911D84736L116L970M658M500L569K252Q46m53j619k871m260n301n447m912m550
$$ 484736 487852 491822 496480 500980 504549 506801 507647 507194 505575 502704 498444 493143 487696 482784 478234
53896D78234m895n714o476o931p246p803q828r967j0459j0001r183q778q885r057
$$ 478234 473339 467625 461149 454218 446972 439169 430341 420374 409915 399914 390731 381953 373068 364011
53882C64011q969q499p530o169m988m551m819n323n752n960n712m971m232m047
$$ 364011 355042 346543 339013 332844 327856 323305 318486 313163 307411 301451 295739 290768 286536 282489
53868B82489m338m571m412l884l094k227j661j634j948k310k705l110l183k665
$$ 282489 278151 273580 269168 265284 262190 259963 258302 256668 254720 252410 249705 246595 243412 240747
53854B40747j866j308j131j222j539j889j841j327r35j042j086l79P51J371J182
$$ 240747 238881 237573 236442 235220 233681 231792 229951 228624 227689 226647 225561 225182 225933 227304 228486
53839B28486O21Ko01q74n50n4j05o53r90q31n63m56l62k37j83RO81J564J944J683
$$ 228486 229107 229109 228508 227634 227084 227030 226925 226272 225282 224451 223888 223432 223070 222833 222650 222659 223340 224904 226848 228531
53819B28531J364J367J476J517J646J825J708J342J313J919K830L725M632N431
$$ 228531 229895 231262 232738 234255 235901 237726 239434 240776 242089 244008 246838 250563 255195 260626
53805B60626N702N546N769O777P768P756O913O214O030N819N181M482M170M051
$$ 260626 266328 271874 277643 284420 292188 299944 306857 313071 319101 324920 330101 334583 338753 342804
53791C42804L644L056K925L413L642K612N34j264j861j682j741k405l379m398
$$ 342804 346448 349504 352429 355842 359484 362096 362630 361366 359505 357823 356082 353677 350298 345900
53777C45900n307n777n654n468n845o525o694o266n967o027n737m734l817l803
$$ 345900 340593 334816 329162 323694 317849 311324 304630 298364 292397 286370 280633 275899 272082 268279
53763B68279m202l919k932k289k578l171l241k756k217j872j675j619j679j560
$$ 268279 264077 260158 257226 254937 252359 249188 245947 243191 240974 239102 237427 235808 234129 232569
53749B32569j000k72P2n0j48L5J35j96o84r02r41j082j089n38L07O67L61O7K84
$$ 232569 231569 231297 231369 231319 231171 231206 231341 231145 230461 229559 228618 227536 226447 225909 226216 226883 227244 227311 227595
53730B27595P33J046J331J681J764J416J063J062J053N73j00l47r7K42N09Q55
$$ 227595 228328 229374 230705 232386 234150 235566 236629 237691 238744 239317 239217 238870 238773 239015 239524 240379
53714B40379J252J550J841K236K415K011J364J297K036K903L163K851K586K816
$$ 240379 241631 243181 245022 247258 249673 251684 253048 254345 256381 259284 262447 265298 267884 270700
53700B70700L323L450K806J799J232J402J932K488L074L443L008J802P97O36O60
$$ 270700 274023 277473 280279 282078 283310 284712 286644 289132 292206 295649 298657 300459 301256 301892 302552
53685C02552l1j068j420j051q93j238j368q97m56o40j077j058n89k84n38j100
$$ 302552 302521 301453 300033 298982 298089 296851 295483 294586 294130 293490 292413 291355 290766 290482 289944 288844
53669B88844j398j107m95j64l10n19m37l24m91n94p2Q97J565J520R38J31n46n58
$$ 288844 287446 286339 285844 285680 285370 284851 284414 284090 283599 283005 282933 283830 285395 286915 287853 287984 287438 286880
53651B86880K85J255J437R10M96M73M08K17L85R58J255R26N05N45R01J204J425
$$ 286880 287165 288420 289857 290767 291263 291736 292144 292361 292746 293704 294959 295885 296390 296935 297836 299040 300465
53634C00465J534J322R20R51J639K336K352J792J191Q05O96J072J944K806L167
$$ 300465 301999 303321 304241 305192 306831 309167 311519 313311 314502 315307 316003 317075 319019 321825 324992
53619C24992L205L443M006M520M646M382L978L756L944M427M862N104N288N427
$$ 324992 328197 331640 335646 340166 344812 349194 353172 356928 360872 365299 370161 375265 380553 385980
53605C85980N344N120N174N605N817N187L863K503J465O27j38p55j229j751k320
$$ 385980 391324 396444 401618 407223 413040 418227 422090 424593 426058 426685 426547 425792 424563 422812 420492
53590D20492k531j980r18k43o22j692k408k248j758j698k074k347k285k075j787
$$ 420492 417961 415981 415063 414820 414198 412506 410098 407850 406092 404394 402320 399973 397688 395613 393826
53575C93826j321q41o95q84j049j064j112j139p78K5P50R85R29R89J183J243J076
$$ 393826 392505 391664 390969 390085 389036 387972 386860 385721 384943 384968 385718 386703 387632 388621 389804 391047 392123
53558C92123Q45P25Q23J193J781K401K857L045K951K640K219J804J505J445J618
$$ 392123 392968 393693 394516 395709 397490 399891 402748 405793 408744 411384 413603 415407 416912 418357 419975
53543D19975J769J709J732K359L469M302M460M434M738N169N437N872O865Q049
$$ 419975 421744 423453 425185 427544 431013 435315 439775 444209 448947 454116 459553 465425 472290 480339
53529D80339Q853R426J0184J0895J1103J1151J1716J2520J2589J1823J1219J1472
$$ 480339 489192 498618 508802 519697 530800 541951 553667 566187 578776 590599 601818 613290
53517F13290J2320J3372J4621J5886J6744J7315J8312J9907K1368K2122K2426
$$ 613290 625610 638982 653603 669489 686233 703548 721860 741767 763135 785257 807683
53506H07683K2720K3027K3301K3665K3954K3649K2595K1236J9980J8918J8200
$$ 807683 830403 853430 876731 900396 924350 947999 970594 991830 1011810 1030728 1048928
53495A048928J7943J7699J6830J5566J4788J4748J4881J5088J5933J7271J7915
$$ 1048928 1066871 1084570 1101400 1116966 1131754 1146502 1161383 1176471 1192404 1209675 1227590
53484A227590J7262J6181J5617J5355J4882J4405J4166J3648J2425J1034J0036
$$ 1227590 1244852 1261033 1276650 1292005 1306887 1321292 1335458 1349106 1361531 1372565 1382601
53473A382601Q931O970M397J916m68l116n802q115j0320j2781j4869j5572j4911
$$ 1382601 1391532 1398502 1402899 1404815 1404347 1401231 1395429 1387314 1376994 1364213 1349344 1333772 1318861
53460A318861j3902j3219j2882j2980j3742j4866j5724j6297j7146j8394j9421
$$ 1318861 1304959 1291740 1278858 1265878 1252136 1237270 1221546 1205249 1188103 1169709 1150288
53449A150288j9689j9306j8643j7874j6952j5788j4472j3386j2799j2160j0478
$$ 1150288 1130599 1111293 1092650 1074776 1057824 1042036 1027564 1014178 1001379 989219 978741
53438I78741p775n433m459m103l104j663r38r51l35J673M129N614N757N270N107
$$ 978741 970966 965533 961074 956971 953867 952204 951266 950315 949980 951653 955782 961396 967153 972423 977530
53423I77530N891P617R646J1336J2711J4202J5844J7291J8522J9882K1454K2950
$$ 977530 983421 991038 1000684 1012020 1024731 1038933 1054777 1072068 1090590 1110472 1131926 1154876
53411A154876K4324K5905K7834K9848L1666L3155L4153L4661L5189L6293L7844
$$ 1154876 1179200 1205105 1232939 1262787 1294453 1327608 1361761 1396422 1431611 1467904 1505748
53400A505748L9266M0559M2299M4572M6578M7641M8040M8472M9184M9957N0598
$$ 1505748 1545014 1585573 1627872 1672444 1719022 1766663 1814703 1863175 1912359 1962316 2012914
53389B012914N0970N0796M9800M8039M5897M3757M1756L9737L7489L5023L2514
$$ 2012914 2063884 2114680 2164480 2212519 2258416 2302173 2343929 2383666 2421155 2456178 2488692
53378B488692K9921K6869K3110J8887J4637J0579O815L419Mm344j0083j6463k2404
$$ 2488692 2518613 2545482 2568592 2587479 2602116 2612695 2619510 2622929 2622933 2618589 2608506 2592043 2569639
53365B569639k7874l3554l9208m3442m5371m5807m6227m7179m8127m8478m8143
$$ 2569639 2541765 2508211 2469003 2425561 2380190 2334383 2288156 2240977 2192850 2144372 2096229
53354B096229m7250m5846m3944m1691l9413l7542l6442l6242l6840l7902l8889
$$ 2096229 2048979 2003133 1959189 1917498 1878085 1840543 1804101 1767859 1731019 1693117 1654228
53343A654228l9222l8720l7703l6491l4976l2974l0780k8924k7495k6104k4449
$$ 1654228 1615006 1576286 1538583 1502092 1467116 1434142 1403362 1374438 1346943 1320839 1296390
53332A296390k2535k0402j8097j5979j4580j4049j4053j4273j4627j4923j4776
$$ 1296390 1273855 1253453 1235356 1219377 1204797 1190748 1176695 1162422 1147795 1132872 1118096
53321A118096j4040j3002j1913j0686r266p991p220o724n805m086j888K21K051
$$ 1118096 1104056 1091054 1079141 1068455 1059189 1051198 1043978 1037254 1031449 1027363 1025475 1025696 1027747
53308A027747L765N379O615P384Q050Q932R815J0397J1008J2294J4211J6079J7698
$$ 1027747 1031512 1036891 1043506 1050890 1058940 1067872 1077687 1088084 1099092 1111386 1125597 1141676 1159374
53295A159374J9594K1823K3442K3833K3784K4366K5292K5404K4481K3372K2445
$$ 1159374 1178968 1200791 1224233 1248066 1271850 1296216 1321508 1346912 1371393 1394765 1417210
53284A417210K1027J8736J6308J4586J3327J1642R174O303L444O19k322n364q277
$$ 1417210 1438237 1456973 1473281 1487867 1501194 1512836 1522010 1528313 1531757 1532376 1530054 1524690 1516413
53271A516413j0773j2728j4288j5712j7156j8667k0187k1512k2389k2898k3464
$$ 1516413 1505640 1492912 1478624 1462912 1445756 1427089 1406902 1385390 1363001 1340103 1316639
53260A316639k4230k4732k4543k4084k4218k5190k6333k6843k6436k5342k4088
$$ 1316639 1292409 1267677 1243134 1219050 1194832 1169642 1143309 1116466 1090030 1064688 1040600
53249A040600k3286k3199k3463k3519k3251k2928k2617k2167k1663k1398k1372
$$ 1040600 1017314 994115 970652 947133 923882 900954 878337 856170 834507 813109 791737
53238G91737k1267k0913k0408j9752j8809j7593j6218j4547j2484j0482r266q905
$$ 791737 770470 749557 729149 709397 690588 672995 656777 642230 629746 619264 609998 601093
53226F01093q776q543q581r121r673r720r622j0184j1515j2771j3121j2632j2056
$$ 601093 592317 583774 575193 566072 556399 546679 537057 526873 515358 502587 489466 476834 464778
53213D64778j1890j1793j1056r548p953o990o662o552o555o871p333p328o551
$$ 464778 452888 441095 430039 420491 412538 405548 398886 392334 385779 378908 371575 364247 357696
53200C57696n454m796m886n451n983o129n833n272m647m077l636l368l204l011
$$ 357696 352242 347446 342560 337109 331126 324997 319164 313892 309245 305168 301532 298164 294960 291949
53186B91949k830k823k946k916k614k201j714j052m79n56j223j597j196p35j026
$$ 291949 289119 286296 283350 280434 277820 275619 273905 272853 272374 271818 270595 268998 267802 267067 266041
53171B66041j634j523o83j06k93p35q75p29m59q8J90R8j78j89rj73p49j112q30
$$ 266041 264407 262884 262201 262095 261802 261067 260192 259463 259004 258916 259106 259204 259026 258837 258828 258655 257906 256794 255964
53152B55964j91K89L40j30r81j623j478p60k71l67o94r75j289j472j052p7P19
$$ 255964 255773 256062 256402 256272 255291 253668 252190 251430 251159 250792 250098 249123 247834 246362 245310 245233 245952
53135B45952Q41N65L49L48O37J272J847J688P62k68r78j439j371j73J784K893
$$ 245952 246793 247358 247707 248055 248692 249964 251811 253499 254261 253993 253015 251576 250205 250032 251816 254709
53119B54709K125L84o84o37k22J9J97M47O18N53J78n08j211j446j247j299j931
$$ 254709 256834 257218 256534 255897 255675 255694 255891 256338 256956 257509 257687 257179 255968 254522 253275 251976 250045
53102B50045k377j729k46R18J083N07k52q15r37n81j18R1J69M72Q84R18L89l38
$$ 250045 247668 245939 245693 246611 247694 248201 247949 247134 246197 245616 245498 245589 245758 246230 247114 248032 248421 248083
53084B48083q78j132j110p98l68j81m31q34q72l56K94M74J00k81k14R3K08J66
$$ 248083 247205 246073 244963 244165 243797 243616 243185 242351 241479 241123 241417 241891 241991 241710 241496 241589 241797 241963
53066B41963K23J55m68j403j806j340n07J84O61Q09M12j05J67J283K113J895J258
$$ 241963 242186 242341 241873 240470 238664 237324 236817 237001 237662 238471 238883 238778 238945 240228 242341 244236 245494
53049B45494J051J004M53l33o09m35m49o66o00l54n58j208j545j194o27l64l71
$$ 245494 246545 247549 248002 247669 247060 246625 246176 245510 244910 244556 243998 242790 241245 240051 239424 239060 238689
53032B38689l85k53J62Q14J205Q58J30j17K78N43J96k38n1N90Q83M06m10p77l14
$$ 238689 238304 238051 238213 239027 240232 241090 241220 241103 241381 241924 242120 241882 241831 242421 243304 243710 243300 242523 242209
53013B42209N37R49O33K13L65Q41Q58K84j75l0M14O92P98Q58P20K76j17nN20R05
$$ 242209 242746 243695 244328 244541 244906 245747 246605 246889 246714 246684 247098 247790 248588 249446 250166 250442 250325 250320 250840 251745
52993B51745P58K20k36k17K66Q10J045J048J188J511J643J336Q55O11O93R62J327
$$ 251745 252503 252723 252487 252270 252536 253346 254391 255439 256627 258138 259781 261117 261972 262583 263276 264238 265565
52976B65565J687J816J606J288J105R47O73O08J203K136K349J353J5m19J65Q02
$$ 265565 267252 269068 270674 271962 273067 274014 274687 275295 276498 278634 280983 282336 282351 281932 282097 282899
52960B82899Q43N90M06jr28j860k007j432j040j418k287l016l235k820j881q97
$$ 282899 283742 284332 284738 284737 283809 281949 279942 278510 277470 276052 273765 270749 267514 264694 262813 261916
52944B61916m73o06o28j05N34N79K4m66m45j81j36k88k22J42K88j80q18q15k08
$$ 261916 261443 260837 260209 260104 260638 261217 261241 260775 260330 260149 260013 259725 259503 259645 259933 259753 258935 258120 257912
52925B57912N0n15j109p95J33O54M88K03R4q3l40l46k00l85q48j004p96p96r85
$$ 257912 257962 257447 256338 255543 255676 256330 256818 257021 257115 257032 256692 256346 256146 255761 254913 253909 253113 252317 251332
52906B51332n30P77J797J488K69p48j125j051o16M0M05J99j86m15q18j553j908
$$ 251332 250802 251579 253376 254864 255133 254385 253260 252209 251593 251633 252038 252237 252051 251636 250818 249265 247357
52889B47357j260j95L24M12Q18J416J321L56o21r23o32k8O79R72M01n51p78K4
$$ 247357 246097 245902 246226 246638 247456 248872 250193 250549 249928 249005 248373 248345 249024 249996 250397 249846 249068 249092
52871B49092J012J467J637K041K608K893K627J705K04j285j805r84L91J088N96
$$ 249092 250104 251571 253208 255249 257857 260750 263377 265082 265286 264001 262196 261212 261603 262691 263287
52856B63287n23j290j185n80l42q97j803k415k678k887k987k683k133j877k016
$$ 263287 262764 261474 260289 259709 259367 258470 256667 254252 251574 248687 245700 243017 240884 239007 236991
52841B36991k046j664j215j080j127j023q29q94j273j508j080q6P05P35M97R74
$$ 236991 234945 233281 232066 230986 229859 228836 228007 227113 225840 224332 223252 223166 223871 224606 225103 226077
52825B26077K145K727J820J54r37j157j010n69L91J311J214K40l51M4N90M96J61
$$ 226077 228222 230949 232769 232923 231986 230829 229819 229250 229641 230952 232166 232406 232055 232099 232689 233185 233346
52808B33346L21Q88J354J634J772J361P8j490k330k215j809j677j742j634j146
$$ 233346 233667 234555 235909 237543 239315 240676 240754 239264 236934 234719 232910 231233 229491 227857 226711
52793B26711k47Q54J606J408K58j035j533j045k70k7l42n11J8R67J648J764J607
$$ 226711 226464 227318 228924 230332 230590 229555 228022 226977 226707 226680 226338 225827 225845 226812 228460 230224 231831
52776B31831J545J674J833J755J225L77l20o16q18j284j744j641j003m36k84k51
$$ 231831 233376 235050 236883 238638 239863 240240 239920 239304 238486 237202 235458 233817 232814 232378 232094 231843
52760B31843RL75M78J19n62j078q88j5P24O07m4k87J78Q25J305J851K478K599
$$ 231843 231852 232227 232705 232824 232262 231184 230296 230281 231005 231612 231568 231281 231459 232284 233589 235440 237918 240517
52742B40517J860Q53N13J103K165L114L570L373K640J773J201J166J623K171K201
$$ 240517 242377 243230 243743 244846 247011 250125 253695 257068 259708 261481 262682 263848 265471 267642 269843
52727B69843J448L38n59j230j960k566k588k108j650j264n78J50L3j037j858j421
$$ 269843 271291 271629 271070 269840 267880 265314 262726 260618 258968 257704 257126 257276 257309 256272 254414 252993
52711B52993k77K98m3n58n91k19J08N9l16n72k11O24J187R89L28l14q04j054p05
$$ 252993 252716 253014 252971 252413 251822 251603 251711 251770 251454 250882 250671 251295 252482 253471 253799 253485 252681 251627 250922
52692B50922L08J331J685J433J003M10m55j191j208n89K5L04M06L93R8m30q74
$$ 250922 251230 252561 254246 255679 256682 257092 256637 255446 254238 253649 253674 253978 254384 254777 254875 254445 253571
52675B53571j058j018p05j38L22L10Qk22n69j417k276k002m02J187J459P03J74
$$ 253571 252513 251495 250790 250652 250974 251284 251292 251070 250501 249084 246808 244806 244404 245591 247050 247753 247927
52658B47927M08Q91J181J538K268L078L398L072K459J960J627J132J24j275k385
$$ 247927 248335 249226 250407 251945 254213 257291 260689 263761 266220 268180 269807 270939 271063 269788 267403
52643B67403k592k054j492j268j075o22k21l42q89j339j386j008j89R17J686J547
$$ 267403 264811 262757 261265 259997 258922 258300 258079 257737 256848 255509 254123 253115 252926 253843 255529 257076
52627B57076Q09L39L85L65m9m12l77l64q39j467j589j087l04M46Q24M16o12j244
$$ 257076 257885 258224 258609 258974 258925 258513 258136 257772 256933 255466 253877 252790 252486 252932 253756 254172 253560 252316
52609B52316p28M22J174J354J441J453R95K22k09j72j69l30k02L85J054J547J939
$$ 252316 251588 252010 253184 254538 255979 257432 258427 258649 258440 258268 258099 257769 257567 257952 259006 260553 262492
52592B62492K047J460L50m84n98k51K42P90J035N13m65r05l69N73J333J863K038
$$ 262492 264539 265999 266349 265865 265267 265016 265258 266048 267083 267596 267131 266226 265857 266430 267763 269626 271664
52575B71664J456L30l78k18J54P5k74n93j091j715j710p52K10J85m50o57k96o2
$$ 271664 273120 273450 273072 272854 273008 273083 272809 272216 271125 269410 267700 266948 267158 267343 266893 266236 265940 265878
52557B65878k41n47p91r07o27J16O94M72k58p15o82m47n8N28Q76N21j98m83j53
$$ 265878 265637 265090 264299 263392 262765 262881 263575 264047 263789 263074 262392 261945 261887 262415 263291 263812 263614 263131 262978
52538B62978L62Q33J234J223N42k54l55Q3K43QJ6L54L42j18j55O31J342J035J00
$$ 262978 263340 264173 265407 266630 267172 266918 266563 266646 266889 266897 266913 267267 267609 267491 267336 267967 269309 270344 270444
52519B70444l74k4O39J149J447J568J548J574J814K180K506K846L249L394K855
$$ 270444 270070 270046 270685 271834 273281 274849 276397 277971 279785 281965 284471 287317 290566 293960 296815
52504B96815J694M40n91j588k704l521l444k584j767j508j400q78k13j15n58p46
$$ 296815 298509 298949 298358 296770 294066 290545 287101 284517 282750 281242 279842 278964 278751 278636 278078 277332
52488B77332l83j10m39r63j120r77o92M6J292K121J697O41K68O78P93K46J3P67
$$ 277332 276949 276839 276400 275437 274317 273340 272648 272694 273986 276107 277804 278445 278713 279391 280184 280430 280443 281210
52470B81210J758J962J447R53P30O06P66J616L001M203M645M233L045J318l50
$$ 281210 282968 284930 286377 287330 288060 288666 289432 291048 294049 298252 302897 307130 310175 311493 311143
52455C11143j264j359j286j672k509l408m132m578m513l760k614j667j128o70
$$ 311143 309879 308520 307234 305562 303053 299645 295513 290935 286422 282662 280048 278381 277253 276583
52441B76583r0K60M5l78l36K36P49P48L05l27r44j232r02j60M33P10J015J476
$$ 276583 276493 276753 276798 276420 276084 276320 277069 277817 278122 277795 276851 275619 274717 274557 274990 275700 276715 278191
52423B78191J790J859K009K254K059J312Q09J121J594J288M83L74J439K891L778
$$ 278191 279981 281840 283849 286103 288162 289474 290283 291404 292998 294286 294769 295143 296582 299473 303251
52408C03251L981M117M881O448Q168Q944Q251O578M562K196n95l111m435m586
$$ 303251 307232 311349 316230 322678 330846 339790 348041 354619 359181 361377 360782 357671 353236 348650
52394C48650m363m173l844l457l461l768l577k404p47N63J212J458J628J837J899
$$ 348650 344287 340114 336270 332813 329352 325584 322007 319603 318856 319419 320631 322089 323717 325554 327453
52379C27453J554R67P46J201J873K262K675L625M759N245N076N045N404N414M535
$$ 327453 329007 329974 330720 331921 333794 336056 338731 342356 347115 352360 357436 362481 367885 373299 377834
52364C77834L159J880P96j15o47p91r40j211j136m15M86R79J156J432J721J587
$$ 377834 380993 382873 383669 383554 382907 382116 381176 379965 378829 378414 378900 379879 381035 382467 384188 385775
52348C85775J063Q10J322K282K902K891K892L715N161O041N627M583M105M556
$$ 385775 386838 387648 388970 391252 394154 397045 399937 403652 408813 414854 420481 425064 429169 433725
52334D33725N581O989Q718J0198J0830J1069J1949J3487J4601J4820J4986J5837
$$ 433725 439306 446295 455013 465211 476041 487110 499059 512546 527147 541967 556953 572790
52322E72790J7000J7869J8519J8985J8647J7256J5905J5828J6723J7215J6812
$$ 572790 589790 607659 626178 645163 663810 681066 696971 712799 729522 746737 763549
52311G63549J6318J6396J6628J6269J5273J4238J3683J3593J3476J2788J1480
$$ 763549 779867 796263 812891 829160 844433 858671 872354 885947 899423 912211 923691
52300I23691J0075R124Q684Q440Q094P366N865L378K88k604m724o055o930p619
$$ 923691 933766 942890 951574 960014 968108 975474 981339 984717 985005 982401 977677 971622 964692 957073
52286I57073q113q181p643o632n435m152k728j317k11O82J907L758N731O997P242
$$ 957073 948960 940779 933136 926504 921069 916917 914189 912872 912661 913343 915250 919008 924739 931736 938978
52271I38978O974P064Q087R889J1671J2723J3060J3179J3240J2942J2219J1534
$$ 938978 945952 953016 961103 970992 982663 995386 1008446 1021625 1034865 1047807 1060026 1071560
52259A071560J1265J1288J1429J1845J2520J2857J2311J1283J0734J0872J0736
$$ 1071560 1082825 1094113 1105542 1117387 1129907 1142764 1155075 1166358 1177092 1187964 1198700
52248A198700R366P013M789L157J323j494m599o333o155n328n160n385n048m263
$$ 1198700 1208066 1215079 1219868 1223025 1224348 1222854 1218255 1211922 1205767 1200439 1195279 1189894 1184846 1180583
52234A180583l926m105l984l329k756k406j621l21N67N87M96R34J380J312J347
$$ 1180583 1176657 1172552 1168568 1165239 1162483 1160077 1158456 1158135 1158702 1159289 1159785 1160719 1162099 1163411 1164758
52219A164758K204L401M077M468N363O578P186P037O867P012P155P276P747Q382
$$ 1164758 1166962 1170363 1174440 1178908 1184271 1190849 1198035 1205072 1211939 1218951 1226106 1233382 1241129 1249511
52205A249511Q406P687P036O952O869O196N412N508O657Q014Q707Q647Q328Q073
$$ 1249511 1257917 1265604 1272640 1279592 1286461 1292657 1298069 1303577 1310234 1318248 1326955 1335602 1343930 1352003
52191A352003P646O661N236M026L421L074K384J181l70k182m145n864p049p994
$$ 1352003 1359649 1366310 1371546 1375572 1378993 1382067 1384451 1385632 1385262 1383080 1378935 1373071 1366022 1358028
52177A358028r165j0399j1099j1126j0954j0873j0547r574q067o486n165m143
$$ 1358028 1348863 1338464 1327365 1316239 1305285 1294412 1283865 1274291 1266224 1259738 1254573 1250430
52165A250430l253k287j191r2R22J878K598K617J801P63K18P5l83j450k653l358
$$ 1250430 1247177 1244890 1243699 1243607 1244529 1246407 1249005 1251622 1253423 1254186 1254404 1254479 1254096 1252646 1249993 1246635
52149A246635l281k460j199j51R1l30o84n42k77n57j630l130m307m426l316j585
$$ 1246635 1243354 1240894 1239695 1239544 1239635 1239305 1238621 1238079 1237802 1237245 1235615 1232485 1228178 1223752 1220436 1218851
52133A218851l1J110K113L140M205N586P745J0614J3513J5899J7852J9658K1340
$$ 1218851 1218820 1219930 1222043 1225183 1229388 1234974 1242719 1253333 1266846 1282745 1300597 1320255 1341595
52120A341595K2700K3581K3903K3758K3507K3388K3095K2163K0815J9775J9098
$$ 1341595 1364295 1387876 1411779 1435537 1459044 1482432 1505527 1527690 1548505 1568280 1587378
52109A587378J7928J5753J3288J1498J0292Q874P092N718N327N575N642N004L675
$$ 1587378 1605306 1621059 1634347 1645845 1656137 1665011 1672103 1677821 1683148 1688723 1694365 1699369 1703044
52096A703044K004M35q85k379m723q007j1412j3835j4870j5035j5091j5243j5058
$$ 1703044 1705048 1705483 1704598 1702219 1697496 1689489 1678077 1664242 1649372 1634337 1619246 1604003 1588945
52083A588945j4049j2229j0014p787n675l701j889j89J518L226M850O503Q469
$$ 1588945 1574896 1562667 1552653 1544866 1539191 1535490 1533601 1533412 1534930 1538156 1543006 1549509 1557978
52070A557978J0698J2534J3347J3265J3043J3180J3511J3647J3450J2861J1674
$$ 1557978 1568676 1581210 1594557 1607822 1620865 1634045 1647556 1661203 1674653 1687514 1699188
52059A699188R847P868O414N648N115M370L340K007J50k325n035p408r309j1113
$$ 1699188 1709035 1716903 1723317 1728965 1734080 1738450 1741790 1743797 1743947 1741622 1736587 1729179 1719870 1708757
52045A708757j3249j5839j8663k1165k2643k2812k2247k1887k2001k1943k1041
$$ 1708757 1695508 1679669 1661006 1639841 1617198 1594386 1572139 1550252 1528251 1506308 1485267
52034A485267j9401j7637j6024j4279j2102r772q019p366p509p549o979o356o657
$$ 1485267 1465866 1448229 1432205 1417926 1405824 1396052 1388033 1380667 1373158 1365609 1358630 1352274 1345617
52021A345617q011r450j0013r727r343r428r967j0620j1088j1313j1507j1893
$$ 1345617 1337606 1328156 1318143 1308416 1299073 1289645 1279678 1269058 1257970 1246657 1235150 1223257
52009A223257j2400j2841j3477j4923j7268j9634k1058k1577k2065k3017k3986
$$ 1223257 1210857 1198016 1184539 1169616 1152348 1132714 1111656 1090079 1068014 1044997 1021011
51998A021011k4255k3735k2956k2246k1203j9188j6359j3875j2804j3002j3466
$$ 1021011 996756 973021 950065 927819 906616 887428 871069 857194 844390 831388 817922
51987H17922j3626j3734j4013j4150j3947j3789j4008j4270j4132j3824j3931
$$ 817922 804296 790562 776549 762399 748452 734663 720655 706385 692253 678429 664498
51976F64498j4479j4875j4624j3676j2197j0423q664p040n311l240r84J079K778
$$ 664498 650019 635144 620520 606844 594647 584224 575560 568520 563209 559969 558985 560064 562842
51963E62842M060M793N019N145N425N456M699L291J806L60j432l610n556o642
$$ 562842 566902 571695 576714 581859 587284 592740 597439 600730 602536 602896 601464 597854 592298 585656
51949E85656o753o101m905l408j822k13J383K813L999N203O700Q333R754J0952
$$ 585656 578903 572802 567897 564489 562667 562454 563837 566650 570649 575852 582552 590885 600639 611591
51935F11591J2073J2773J2367J0674Q231N534K593o27l762o362q336r907j1305
$$ 611591 623664 636437 648804 659478 667709 673243 675836 675209 671447 665085 656749 646842 635537
51922F35537j2635j3803j4423j4089j2859j1283r807q318o443m160j954k98R69
$$ 635537 622902 609099 594676 580587 567728 556445 546638 538320 531877 527717 525763 525465 526434
51909E26434K629N239Q357J0838J1916J1554R730O147J153l606o350o777o028
$$ 526434 529063 534302 542659 553497 565413 576967 586697 592844 593997 590391 584041 577264 571236
51896E71236n317n278o363q807j2011j4607j5586j4990j3525j1865j0352q868
$$ 571236 565919 560641 554278 545471 533460 518853 503267 488277 474752 462887 452535 443667
51884D43667o961m472k006k98P29J745K940L916M541N191O021O734P162P351O940
$$ 443667 436706 432234 430228 429930 430659 432404 435344 439260 443801 448992 455013 461747 468909 476260 483200
51869D83200N325K687J14j587k548l042k964k465k293k853l568l709l234k325
$$ 483200 488525 491212 491326 489739 487191 484149 481185 478720 476427 473574 470006 466297 463063 460738
51855D60738q36J131K736L291L125K845K241Q03j145k743l779m677n452n670n348
$$ 460738 459902 461033 463769 467060 470185 473030 475271 476074 474929 472186 468407 463730 458278 452608 447260
51840D47260n064n019m825m374m075l982l373j740L28J705J945J544J185J027
$$ 447260 442196 437177 432352 427978 423903 419921 416548 414808 415136 416841 418786 420330 421515 422542
51826D22542P56J59m51n06k9J04r12k690l946l919l005j953r42J34R95J170P78
$$ 422542 423298 423457 423006 422500 422471 422575 421663 418973 415027 411108 408103 406150 405208 405342 406337 407507 408285
51809D08285N37R10J532J728J308O33O4l91q42j261j585j768j628r00K30R52O19
$$ 408285 408822 409732 411264 412992 414300 414933 414997 414606 413764 412503 410918 409150 407522 406622 406852 407804 408423
51792D08423m16j225j549j962k708l067k294p72L59M59j60q20j047o76O9O53O88
$$ 408423 408007 406782 405233 403271 400563 397496 395202 394430 394789 395248 395088 394268 393221 392545 392614 393267 393955
51775C93955L85K87N95J101J711K611L842N112O169P178Q409R689J0395J0027
$$ 393955 394340 394627 395222 396323 398034 400645 404487 409599 415768 422946 431355 441044 451439 461466
51761D61466Q728P107N516L628R51k269n034o615p285p729q059p848o996o025
$$ 461466 470194 477301 482817 486445 487396 485127 480093 473478 466193 458464 450405 442557 435561 429536
51747D29536n401m940m186l173k557k817l541l600k267oK069L483M777O469Q173
$$ 429536 424135 419195 415009 411836 409279 406462 402921 399321 397054 397048 399117 402600 407377 413846 422019
51732D22019R054Q746P401N261K782Q63K07N21J030J650K688L419K226j199m824
$$ 422019 431073 439819 447220 452481 455263 456126 456333 456854 457884 459534 462222 465641 467867 466668 461844
51717D61844o394n910m999m386l380j748o64j184k741l925m122l725l118k203
$$ 461844 455450 449540 444541 440155 436775 435027 434363 433179 430438 426513 422391 418666 415548 413345
51703D13345q36Q20K342L121K614Q90j191k678l293l209k440j006N43J452J607
$$ 413345 412509 413329 415671 418792 421406 422296 421105 418427 415134 411925 409485 408479 409022 410474 412081
51688D12081J492J297O93m60j821l069m106m643m234l057j956j360p48L41J461
$$ 412081 413573 414870 415563 415103 413282 410213 406107 401464 397230 394173 392217 390857 390109 390450 391911
51673C91911J996K130K379K649K621K702L668N447P131Q233R083R801R659P846
$$ 391911 393907 396037 398416 401065 403686 406388 410056 415503 422634 430867 439950 449751 459410 467256
51659D67256M451L56l443o239p710p885o933m966k257N66K903M662N879O052M543
$$ 467256 471707 472063 468620 462381 454671 446786 439853 434887 432630 433196 436099 440761 446640 452692 457235
51644D57235J639j420l665n105o100o699o915p026p225p377p346p184o728n553
$$ 457235 458874 457454 453789 448684 442584 435885 428970 421944 414719 407342 399996 392812 386084 380531
51630C80531l712j993j018m57M04J636K664K984K489J337M9n57j35N60M45n24
$$ 380531 376819 374826 373808 373351 373755 375391 378055 381039 383528 384865 384914 384357 384222 384782 385227 384703
51614C84703j263r89r5N76R14J396K016K014R30n08j040l45O46J004R55J360K464
$$ 384703 383440 382451 382356 382932 383846 385242 387258 389272 390202 389694 388654 388309 388955 389959 390914 392274 394738
51597C94738L707M664N584O784P976Q469P832O086L457K89k818n025n726n168
$$ 394738 398445 403109 408693 415477 423453 431922 439754 445840 449297 449586 446768 441743 436017 430849
51583D30849m369m099l972k987r52J183K681L966N783P987R893J1236J2080J2274
$$ 430849 426480 422381 418409 415422 414470 415653 418334 422300 428083 436070 445963 457199 469279 481553
51569D81553J1966J2205J3817J5917J6745J5963J4870J4394J4317J4696J6520
$$ 481553 493519 505724 519541 535458 552203 568166 583036 597430 611747 626443 642963
51558F42963K0169K4497K8251L1236L3154L2526K8107K0747J2620N038k019q677
$$ 642963 663132 687629 715880 747116 780270 812796 840903 861650 874270 879308 877289 868612
51546H68612j4685j9919k4428k7936l0122l1179l1491l0940k9277k6858k4316
$$ 868612 853927 834008 809580 781644 751522 720343 688852 657912 628635 601777 577461
51535E77461k1687j8685j5643j3347j2044j1267j0613r948r009p546n858m560
$$ 577461 555774 537089 521446 508099 496055 484788 474175 464227 455218 447672 441814 437254
51523D37254l823l424l354l616l624k729j359p00j035j349p96K60J184K135L506
$$ 437254 433431 430007 426653 423037 419413 416684 415325 414625 413590 412241 411445 411705 412889 415024 418530
51508D18530M808N003L759J770j43j763l162m144m291l522k354j504j260j379
$$ 418530 423338 428341 432100 433870 433727 431964 428802 424658 420367 416845 414491 412987 411727 410348
51494D10348j521j608j738j924k110k255k305k168j819j342q68o45r92j883k713
$$ 410348 408827 407219 405481 403557 401447 399192 396887 394719 392900 391558 390690 390045 389053 387170 384457
51479C84457k922k794l034l587l626k913k313k498k953k853k281j848j667j491
$$ 384457 381535 378741 375707 372120 368494 365581 363268 360770 357817 354964 352683 350835 349168 347677
51465C47677j387j545j679j366p15j50K24N45Q10J077J559K014J652L59o22j31
$$ 347677 346290 344745 343066 341700 340985 340835 341059 341604 342414 343491 345050 347064 348716 349075 348453 348322
51449C48322J385K710L636M784O072O790P023P737R325J1084J2154J1976R987
$$ 348322 349707 352417 356053 360837 366909 373699 380722 388459 397784 408868 421022 432998 442985
51436D42985O065J446j970l421l528k902j782j054j970m320o280o705o365o232
$$ 442985 449050 450496 448526 445105 441577 438675 436893 435839 433869 429549 423269 416564 410199 403967
51422D03967n883m610l018k208k141j960j447j029n72N94K481M071M462L839L123
$$ 403967 398084 393474 390456 388248 386107 384147 382700 381671 381099 381693 384174 388245 392707 396546 399669
51407C99669K987L309L459L045K293J562P54l26j166r24K89J248J151O47R24K231
$$ 399669 402656 405965 409424 412469 414762 416324 417078 416752 415586 414662 414951 416199 417350 417997 418921 421152
51391D21152L822M965N577O121P174Q898J0871J2708J4781J7760K1499K5157K8462
$$ 421152 424974 429939 435516 441637 448811 457709 468580 481288 496069 513829 535328 560485 588947
51378E88947L1905L5514L8527M0735M2942M5206M5557M1673L3397K2739J1839
$$ 588947 620852 656366 694893 735628 778570 823776 869333 911006 944403 967142 978981
51367I78981J813o916j4349k1023k7492l3516l8262m1225m2471m2149m0454l7952
$$ 978981 980794 973878 959529 938506 911014 877498 839236 798011 755540 713391 672937 634985
51355F34985l5295l2586k9463k5826k2021j8402j5215j2761j1229j0279r239p752
$$ 634985 599690 567104 537641 511815 489794 471392 456177 443416 432187 421908 412669 404917
51343D04917o007m432l414l134l345l511l373l173l106k864k170j338q79q59j158
$$ 404917 398910 394478 391064 387930 384585 381074 377701 374528 371422 368558 366388 365050 364171 363312 362154
51328C62154j900l061l925l768k878k148j770j150q8P39P90L92J15J8j48l46k96
$$ 362154 360254 357193 353268 349500 346622 344474 342704 341554 341466 342205 342995 343387 343502 343520 343372 343026 342730
51311C42730J72J081K400L828M706M483L276J817Q63O85R99J253J021J89j041
$$ 342730 342902 343983 346383 350211 354917 359400 362676 364493 365356 366041 367040 368293 369314 369503 368462
51296C68462k265k990k985k603k506k846k988k350j293o98q26j078q83l21L07
$$ 368462 366197 363207 360222 357619 355113 352267 349279 346929 345636 344938 344112 343034 342151 341830 342137
51281C42137J118K388L928N043N173M354L050J750Q05L76L26K20k22o50l76O79
$$ 342137 343255 345643 349571 354614 359787 364141 367191 368941 369746 370122 370448 370668 370446 369796 369420 370099
51265C70099J728K122K252K905L895M037K651M58j299k168k519k663k465j773
$$ 370099 371827 373949 376201 379106 383001 387038 389689 390147 388848 386680 384161 381498 379033 377260
51251C77260q60l44o81j754k903l491l359k707j698n13M12O50K61l33q99j399
$$ 377260 376400 376056 375375 373621 370718 367227 363868 361161 359463 358950 359362 360012 360273 359940 359041 357642
51235C57642j633j488j389j790k290k074j276r10j226j255m69K52R9k33L34J488
$$ 357642 356009 354521 353132 351342 349052 346978 345702 344792 343566 342311 341842 342094 342193 341960 342294 343782
51219C43782K036J728J329J167Q37L73N17J509K597L069L109L245L504L554L321
$$ 343782 345818 347546 348875 350042 350879 351252 351769 353278 355875 358944 362053 365298 368802 372356 375677
51204C75677L058K997L111L049K363J014l58r91q73p12j021j556j782j603j369
$$ 375677 378735 381732 384843 387892 390255 391269 390911 389920 389047 388335 387314 385758 383976 382373 381004
51189C81004j380j505j424j076p31n51l19J16L82N9m94m91J11N14L36J96O22J160
$$ 381004 379624 378119 376695 375619 374888 374337 374018 374134 374516 374575 374081 373590 373701 374215 374551 374747 375369 376529
51171C76529J157P49M94N17O77R66J187Q41N8l8J177K603K745J749R85R57R65
$$ 376529 377686 378435 378929 379446 380123 381089 382276 383117 383175 383137 384314 386917 389662 391411 392396 393353 394318
51154C94318O76O09R04Q76J55p37j265j490j440q48J13O99N72J84j47o76j401
$$ 394318 394994 395603 396507 397383 397538 396801 395536 394046 392606 391758 391871 392570 393142 393326 393179 392503 391102
51137C91102j664j212q04j140j758j765j129n83n46p84r03o07K64J498K446K598
$$ 391102 389438 388226 387422 386282 384524 382759 381630 381047 380501 379717 378814 378207 378471 379969 382415 385013
51121C85013K102J479J141J381K342L584M095L389K291K027K656L080K566J654
$$ 385013 387115 388594 389735 391116 393458 397042 401137 404526 406817 408844 411500 414580 417146 418800
51107D18800J313J735K314K562K585K624K573K162J461Q32L50l09j301k210k489
$$ 418800 420113 421848 424162 426724 429309 431933 434506 436668 438129 438961 439311 439002 437701 435491 433002
51092D33002k051j129O8J250J846J510O65K7k97o64j006q24j09M49M09J58K52
$$ 433002 430951 429822 429890 431140 432986 434496 435161 435188 434891 434227 433221 432397 432288 432737 433146 433304 433556
51075D33556P27J314J907K511L069L666M437N147N245M648M072M249N142O235
$$ 433556 434283 435597 437504 440015 443084 446750 451187 456334 461579 466227 470299 474548 479690 485925
51061D85925P340Q829J1163J4243J6990J7693J5393J1084P052M870M564N799Q666
$$ 485925 493265 502094 513257 527500 544490 562183 577576 588660 595712 600582 605146 610945 619611
51048F19611J2620J5585J5499J2616R246P087N678L619M66l194o729r728j1513
$$ 619611 632231 647816 663315 675931 685177 692264 697942 701561 702027 698833 692104 682376 670863
51035F70863j1309r342p244o835q518j1141j3320j4469j4603j3756j2059r940
$$ 670863 659554 650212 642968 636133 627615 616474 603154 588685 574082 560326 548267 538327
51023E38327p758n411k775l35J181J749K115K887L983N050N951O766P636Q626
$$ 538327 530569 525158 522383 522048 523229 524978 527093 529980 533963 539013 544964 551730 559366 567992
51009E67992R497R672Q908P831P286P306P329P256P502P989Q085P811Q096R355
$$ 567992 577489 587161 596069 603900 611186 618492 625821 633077 640579 648568 656653 664464 672560 681915
50995F81915J0666J1000J0515R940R289Q107O567N432N004M834M507M138M098
$$ 681915 692581 703581 714096 724036 733325 741432 747999 753431 758435 763269 767776 771914 776012
50982G76012M601N678P204Q903J0403J1277J1103R915Q700Q869J0865J3745J6462
$$ 776012 780613 786291 793495 802398 812801 824078 835181 845096 853796 862665 873530 887275 903737
50969I03737J9079K2230K5884K9402L2545L5713L9226M2921M6466M9665N2401
$$ 903737 922816 945046 970930 1000332 1032877 1068590 1107816 1150737 1197203 1246868 1299269
50958A299269N4566N6003N6401N5490N3614N1687N0178M8484M5813M2331L8858
$$ 1299269 1353835 1409838 1466239 1521729 1575343 1627030 1677208 1725692 1771505 1813836 1852694
50947A852694L5776L2890L0283K8498K7896K8396K9833L1884L3588L3647L1540
$$ 1852694 1888470 1921360 1951643 1980141 2008037 2036433 2066266 2098150 2131738 2165385 2196925
50936B196925K7962K3905J9709J5110R862M017k233q751j5559k2764l0264l7727
$$ 2196925 2224887 2248792 2268501 2283611 2293473 2297490 2295257 2286506 2270947 2248183 2217919 2180192
50924B180192m4998n2324n9706o6360p1228p4041p5316p5403p4102p1325o7503
$$ 2180192 2135194 2082870 2023164 1956804 1885576 1811535 1736219 1660816 1586714 1515389 1447886
50913A447886o3138n8394n3381m8396m3591l8839l4124k9806k6246k3466k1364
$$ 1447886 1384748 1326354 1272973 1224577 1180986 1142147 1108023 1078217 1051971 1028505 1007141
50902A007141j9852j8558j6883j4738j2848j1813j1149r847p748n785m795m634
$$ 1007141 987289 968731 951848 937110 924262 912449 901300 891453 883705 877920 873125 868491
50890H68491m563m057l017j589j55P58R76J020J607K807L978M576M736M984N646
$$ 868491 863928 859871 856854 855265 855110 855868 856844 857864 859471 862278 866256 870832 875568 880552 886198
50875H86198O694P945R143J0013J0528J1052J1965J3204J4391J5401J6539J8140
$$ 886198 892892 900837 909980 919993 930521 941573 953538 966742 981133 996534 1013073 1031213
50863A031213K0247K2674K5134K7285K8982L0634L3016L6572M1046M5894N0836
$$ 1031213 1051460 1074134 1099268 1126553 1155535 1186169 1219185 1255757 1296803 1342697 1393533
50852A393533N5913O1259O7040P3367Q0057Q6614R2682R8359J03862J09045J13478
$$ 1393533 1449446 1510705 1577745 1651112 1731169 1817783 1910465 2008824 2112686 2221731 2335209
50841B335209J16963J19648J21539J22013J19983J14709J06507R6567Q6004P5285
$$ 2335209 2452172 2571820 2693359 2815372 2935355 3050064 3156571 3253138 3339142 3414427
50831C414427O4673N4863M6646M0142L5016L1559L0808L3240L7928M3488M9430
$$ 3414427 3479100 3533963 3580609 3620751 3655767 3687326 3718134 3751374 3789302 3832790 3882220
50820C882220N5960O2649O7856O9554O6385N7910M4215K5623K837k2660m8777
$$ 3882220 3938180 4000829 4068685 4138239 4204624 4262534 4306749 4332372 4335209 4312549 4263772
50809D263772p3782r7207j19384j40108j58201j72369j81897j86441j85894j80917
$$ 4263772 4189990 4092783 3973399 3833291 3675090 3502721 3320824 3134383 2948489 2767572
50799B767572j72832j62503j49898j35395j20709j07551r5775q3944p1556n9699
$$ 2767572 2594740 2432237 2282339 2146944 2026235 1918684 1822909 1738965 1667409 1607710
50789A607710m9482m0805l2996k5865j9739j4954j1662r732q729q207q098q434
$$ 1607710 1558228 1517423 1484427 1458562 1438823 1423869 1412207 1402475 1393746 1385539 1377441 1369007
50777A369007q893r110r289r841j0584j0991j1289j2251j3799j4834j4959j5279
$$ 1369007 1360114 1351004 1341715 1331874 1321290 1310299 1299010 1286759 1272960 1258126 1243167 1227888
50765A227888j6735j8503j9106j8526j8009j8024j7626j6039j3761j1661r801
$$ 1227888 1211153 1192650 1173544 1155018 1137009 1118985 1101359 1085320 1071559 1059898 1050097
50754A050097p723n432l405j839l65J462L753O242Q524J0339J1943J4043J7124
$$ 1050097 1042374 1036942 1033537 1031698 1031333 1032795 1036548 1042790 1051314 1061653 1073596 1087639 1104763
50741A104763K0891K4649K8162L1771L5715L9795M3819M7874N1815N4968N6868
$$ 1104763 1125654 1150303 1178465 1210236 1245951 1285746 1329565 1377439 1429254 1484222 1541090
50730A541090N8054N9418O0912O1558O0846N9406N8024N6596N4597N2085M9598
$$ 1541090 1599144 1658562 1719474 1781032 1841878 1901284 1959308 2015904 2070501 2122586 2172184
50719B172184M7163M3969L9072L2117K3556J4547O559O20l151n079n092k748J959
$$ 2172184 2219347 2263316 2302388 2334505 2358061 2372608 2379167 2379787 2376636 2371557 2366465 2363717 2365676
50706B365676Q240J5128K2065K8609L3984L7347L8555L8141L6259L1870K3410
$$ 2365676 2373916 2389044 2411109 2439718 2473702 2511049 2549604 2587745 2624004 2655874 2679284
50695B679284J0391n945k3738m1850n9713p6253q9794r9128j04105j05090j02503
$$ 2679284 2689675 2683730 2659992 2618142 2558429 2482176 2392382 2293254 2189149 2084059 1981556
50684A981556r7114r0089q2205p3511o4121n4726m5888l7311k8561j9996j2262
$$ 1981556 1884442 1794353 1712148 1638637 1574516 1519790 1473902 1436591 1408030 1388034 1375772
50673A375772n302J312P367J2268J6089J9445K2241K3516K2735K0516J7855J5358
$$ 1375772 1370470 1371782 1379149 1391417 1407506 1426951 1449192 1472708 1495443 1515959 1533814 1549172
50661A549172J3371J2171J1622J1224J0803J0686J1024J1471J1743J1943J2156
$$ 1549172 1562543 1574714 1586336 1597560 1608363 1619049 1630073 1641544 1653287 1665230 1677386
50650A677386J2294J2586J3592J5417J7583J9968K3156K7335L1538L4735L7157
$$ 1677386 1689680 1702266 1715858 1731275 1748858 1768826 1791982 1819317 1850855 1885590 1922747
50639A922747L9727M2578M4944M6301M6749M6300M4648M1861L8608L5328L1775
$$ 1922747 1962474 2005052 2049996 2096297 2143046 2189346 2233994 2275855 2314463 2349791 2381566
50628B381566K7925K5085K5191K8428L1488K8824J6618l793k6366m4392n4462
$$ 2381566 2409491 2434576 2459767 2488195 2519683 2548507 2565125 2561332 2534966 2490574 2436112
50617B436112n7092n4544m8706m0691l1484k2353j4580q821m717j387J460L017
$$ 2436112 2379020 2324476 2275770 2235079 2203595 2181242 2166662 2157841 2153124 2151737 2153197 2156214
50605B156214K128j509p195j4036k1629k9916l8692m7389n5109o0933o4362o5581
$$ 2156214 2158342 2156833 2149638 2135602 2113973 2084057 2045365 1997976 1942867 1881934 1817572 1751991
50593A751991o5147o3445o0602n6884n2842m8914m5089m1087l6749l2167k7567
$$ 1751991 1686844 1623399 1562797 1505913 1453071 1404157 1359068 1317981 1281232 1249065 1221498
50582A221498k3321j9956j7876j6920j6348j5395j3838j1893r681p088m152j297
$$ 1221498 1198177 1178221 1160345 1143425 1127077 1111682 1097844 1085951 1076270 1069182 1065030 1063733
50570A063733J138L352N737Q155J0009J1076J1887J3084J4705J6338J7795J9263
$$ 1063733 1064871 1068223 1073960 1082115 1092124 1103200 1115087 1128171 1142876 1159214 1177009 1196272
50558A196272K0970K2922K5006K7104K9123L0991L2581L3540L3376L1932K9720
$$ 1196272 1217242 1240164 1265170 1292274 1321397 1352388 1384969 1418509 1451885 1483817 1513537
50547A513537K7555K5835K4414K3106K2114K1842K2552K4406K7569L2009L7224
$$ 1513537 1541092 1566927 1591341 1614447 1636561 1658403 1680955 1705361 1732930 1764939 1802163
50536A802163M2505M7592N2868N8764O5100P1199P6590Q1441Q6259R1387R6760
$$ 1802163 1844668 1892260 1945128 2003892 2068992 2140191 2216781 2298222 2384481 2475868 2572628
50525B572628J02054J06828J10610J12898J13247J11399J07358J01259R3075Q2606
$$ 2572628 2674682 2781510 2892120 3005018 3118265 3229664 3337022 3438281 3531356 3613962
50515C613962O9812N4978L8447K0393J213j8082l6319n2988o8174q1643r2501
$$ 3613962 3683774 3738752 3777199 3797592 3798805 3780723 3744404 3691416 3623242 3541599 3449098
50504C449098r9923j03710j03943j00576r3713q3874p1594n7131m0995k4407q692
$$ 3449098 3349175 3245465 3141522 3040946 2947233 2863359 2791765 2734634 2693639 2669232 2660540
50493B660540N568J8306K9177L7480M2608M3922M0341L0725J5052n097k7237m8975
$$ 2660540 2666108 2684414 2713591 2751071 2793679 2837601 2877942 2908667 2923719 2918622 2891385 2842410
50481B842410o8645q5423r8954j08733j14183j15560j14235j11410j06988j00470
$$ 2842410 2773765 2688342 2589388 2480655 2366472 2250912 2136677 2025267 1918279 1817809
50471A817809r2544q4742p7619p0458o2873n5574m9172m3311l7580l2334k7875
$$ 1817809 1725265 1640523 1562904 1492446 1429573 1373999 1324827 1281516 1243936 1211602 1183727
50460A183727k3588j8774j3808r554o061k710N57L064M502N357O143O828P215
$$ 1183727 1160139 1141365 1127557 1118003 1111942 1109232 1109789 1112853 1117355 1122712 1128855 1135683 1142898
50447A142898P447P752Q115Q494R235J0886J3471J6040J7140J5926J2898R429
$$ 1142898 1150345 1158097 1166212 1174706 1183941 1194827 1208298 1224338 1241478 1257404 1270302 1279731
50435A279731O566M488L026K284K509L537M772N719O389P202Q591J0688J3261
$$ 1279731 1286297 1290785 1293811 1296095 1298604 1302141 1306913 1312632 1319021 1326223 1334814 1345502 1358763
50422A358763J5884J8151J9817K1008K2288K4258K6882K9554L2050L4977L8842
$$ 1358763 1374647 1392798 1412615 1433623 1455911 1480169 1507051 1536605 1568655 1603632 1642474
50411A642474M3127M6923N0156N3269N5889N6851N5747N3511N1052M8107M3903
$$ 1642474 1685601 1732524 1782680 1835949 1891838 1948689 2004436 2057947 2108999 2157106 2201009
50400B201009L8317L1815K4819J7542R978J612q294j9651l1264m1957n1486n9784
$$ 2201009 2239326 2271141 2295960 2313502 2323480 2325092 2316798 2297147 2265883 2223926 2172440 2112656
50388B112656o6084o9470o9936o8082o4148n8118n0533m2385l4193k5809j7048
$$ 2112656 2046572 1977102 1907166 1839084 1774936 1716818 1666285 1623900 1589707 1563898 1546850
50377A546850q100O18Q453J4574J8478K0324K0359J8247J3488O239k777j2889
$$ 1546850 1538750 1539368 1547821 1562395 1580873 1601197 1621556 1639803 1653291 1659530 1656753 1643864
50365A643864k3371l2987m0503m5687m9211n1481n2264n1396m9297m6494m3247
$$ 1643864 1620493 1587506 1547003 1501316 1452105 1400624 1348360 1296964 1247667 1201173 1157926
50354A157926l9840l6754l4346l2554l1002k9159k6458k2681j8303j4153j0664
$$ 1157926 1118086 1081332 1046986 1014432 983430 954271 927813 905132 886829 872676 862012
50343H62012p666m843k086N50L001N331P832J0720J3620J5779J6991J7738J7928
$$ 862012 854346 849503 847417 847967 850968 856299 864131 874851 888471 904250 921241 938979 956907
50330I56907J6290J1900N872N10k970m872n539m787k952j176n0J079K886M893
$$ 956907 973197 985097 990969 991479 988509 983637 978098 973311 970359 969183 969133 970212 973098 977991
50316I77991O050N975N114M128L495L263K988K337J755J987K866L438L457L701
$$ 977991 984041 990016 995130 999258 1002753 1006016 1009004 1011341 1013096 1015083 1017949 1021387 1024844 1028545
50302A028545M554N272N279N149N606O426P149Q034R384J0740J1736J2975J4908
$$ 1028545 1033099 1038371 1043650 1048799 1054405 1060831 1067980 1076014 1085398 1096138 1107874 1120849 1135757
50289A135757J6611J7137J7448J9361K3110K7852L4190M3258N2334N3990M2309
$$ 1135757 1152368 1169505 1186953 1206314 1229424 1257276 1291466 1334724 1387058 1441048 1483357
50278A483357J9433n724k4911l5521l9260l8517l4895k9698k4107j8928j4639
$$ 1483357 1502790 1497066 1472155 1436634 1397374 1358857 1323962 1294264 1270157 1251229 1236590
50267A236590j1591r820q983q760r080r698r985r511q627p887p183n975m346l111
$$ 1236590 1224999 1215179 1206196 1197436 1188356 1178658 1168673 1159162 1150535 1142648 1135465 1129490 1125144 1122033
50253A122033k555j776J94K994N328O707Q026J0340J3611J7107K0358K3243K5477
$$ 1122033 1119478 1117702 1117896 1120890 1126218 1132925 1140951 1151291 1164902 1182009 1202367 1225610 1251087
50240A251087K6768K7384K7853K8024K7088K4799K2025J9691J7688J5412J2945
$$ 1251087 1277855 1305239 1333092 1361116 1388204 1413003 1435028 1454719 1472407 1487819 1500764
50229A500764J0828Q831N735O25o185j3750k1381k8582l4591l8666m0685m1035
$$ 1500764 1511592 1520423 1526158 1526783 1520598 1506848 1485467 1456885 1422294 1383628 1342943 1301908
50217A301908m0019l7724l4345l0211k5545k0591j6060j3110j2665j4794j8593
$$ 1301908 1261889 1224165 1189820 1159609 1134064 1113473 1097413 1084303 1071638 1056844 1038251
50206A038251k2542k5151k5776k4836k3110k0889j8103j5051j2406j0486r020
$$ 1038251 1015709 990558 964782 939946 916836 895947 877844 862793 850387 839901 830881
50195H30881p769o892o485o276o015n763n559n272n075n576o951q315q553p633
$$ 830881 823112 816220 809735 803459 797444 791681 786122 780850 775775 770199 763248 754933 746380 738747
50181G38747o601o365o893p491p431o434m981m100m422n391n748m868l295j994
$$ 738747 732146 725781 718888 711397 703966 697532 692551 688451 684029 678638 672890 668022 664727 662733
50167F62733j424j323j053j13J355K530K681K031J580K004L061M092M782N281
$$ 662733 661309 659986 658933 658820 660175 662705 665386 667417 668997 671001 674062 678154 682936 688217
50153F88217N867O713P782Q817R464R488Q808P461N720M175L345L159L070K768
$$ 688217 694084 700797 708579 717396 726860 736348 745156 752617 758337 762512 765857 769016 772086 774854
50139G74854K529K868M056O050Q644J1557J4576J7674K0861K3945K6730K9432
$$ 774854 777383 780251 784307 790357 799001 810558 825134 842808 863669 887614 914344 943776
50127I43776L2591L6405M0407M3941M6624M8268M8674M7807M6046M3998M2113
$$ 943776 976367 1012772 1053179 1097120 1143744 1192012 1240686 1288493 1334539 1378537 1420650
50116A420650M0644L9770L9488L9307L8264L5360L0045K2407J2989K480q431j9053
$$ 1420650 1461294 1501064 1540552 1579859 1618123 1653483 1683528 1705935 1718924 1721404 1712973 1693920
50104A693920k8707l6913m3442m8079n0501n0660m9161m6950m4539m1768l8332
$$ 1693920 1665213 1628300 1584858 1536779 1486278 1435618 1386457 1339507 1294968 1253200 1214868
50093A214868l4215k9622k4780k0061j5989j2914j0731r012p267n105k404M35
$$ 1214868 1180653 1151031 1126251 1106190 1090201 1077287 1066556 1057544 1050277 1045172 1042768 1043203
50081A043203K710M102M998N870O560O556N920N406N480N568M742K973J202R2
$$ 1043203 1045913 1050015 1055013 1060883 1067443 1073999 1079919 1085325 1090805 1096373 1101115 1104088 1105290 1105382
50067A105382p95k213m078n633o630p627q973j0193j0714j0668j0411r793q531
$$ 1105382 1104587 1102374 1098296 1092663 1086033 1078406 1069433 1059240 1048526 1037858 1027447 1017654 1009123
50054A009123p055o127n712m958l456j804o67J34J193K679M319N912P441Q857
$$ 1009123 1002068 995941 990229 985271 981815 980011 979344 979478 980671 983350 987669 993581 1001022 1009879
50040A009879J0091J1157J2038J2555J2627J2425J2177J1918J1541J0912R807
$$ 1009879 1019970 1031127 1043165 1055720 1068347 1080772 1092949 1104867 1116408 1127320 1137127
50029A137127Q023N751L588J948O76n97j948l303m760o326p591q050p719p069
$$ 1137127 1145150 1150901 1154489 1156437 1157113 1156516 1154568 1151265 1146505 1140179 1132588 1124538 1116819 1109750
50015A109750o431n867n560n754o177n957m361j439K264O277J0259J3805J6583
$$ 1109750 1103319 1097452 1091892 1086138 1079961 1074004 1069643 1068204 1070468 1076745 1087004 1100809 1117392
50002A117392J8609K0114K1148K1603K1567K1380K1315K1439K1743K2064K1739
$$ 1117392 1136001 1156115 1177263 1198866 1220433 1241813 1263128 1284567 1306310 1328374 1350113
49991A350113J9682J5208Q603P31p766j6633k5552l3921m1059m6387m9442n0121
$$ 1350113 1369795 1385003 1393606 1394337 1386571 1369938 1344386 1310465 1269406 1223019 1173577 1123456
49979A123456m8892m6506m3417l9742l5673l1568k7584k3625j9831j6658j4310
$$ 1123456 1074564 1028058 984641 944899 909226 877658 850074 826449 806618 789960 775650
49968G75650j2468j0825r483q667q336q360q623q743q082o424m307k358p11O17
$$ 775650 763182 752357 742874 734207 725871 717511 708888 700145 692063 685639 681332 678974 678263 678880
49954F78880J409J779K462L879N420O402P214Q488R566R067O899M489K842J556
$$ 678880 680289 682068 684530 688409 693829 700231 707445 715933 725499 734566 741465 745954 748796 750352
49940G50352J47q90j027q30j316k816n169q321j1904j4740j5790j5331j4418j3351
$$ 750352 750499 749609 748582 747752 746436 743620 738451 730130 718226 703486 687696 672365 657947 644596
49926F44596j1662r479p860p429p456o817n356l794k540j325R4J356J938J935
$$ 644596 632934 623455 615595 608166 600710 593893 588537 584743 582203 580878 580972 582328 584266 586201
49912E86201J974K458L187L803M319M981N827O692P467Q087Q396Q456Q835J0038
$$ 586201 588175 590633 593820 597623 601942 606923 612750 619442 626909 634996 643392 651848 660683 670721
49898F70721J1613J2329J1474R579P573N703L637J383n30j716k488l521n211p404
$$ 670721 682334 694663 706137 715716 723289 728992 732629 734012 733482 731766 729278 725757 720546 713142
49884G13142r648j1507j2648j2833j2171j1295j0875j0849j0466r369q135p305
$$ 713142 703494 691987 679339 666506 654335 643040 632165 621316 610850 601481 593346 586041
49872E86041o466m992l303k424k421k251j303q5Q96J909L250M529N381O160P221
$$ 586041 579575 574583 571280 568856 566435 564184 562881 562796 563692 565601 568851 573380 578761 584921 592142
49857E92142Q159Q539Q850R874J1420J2445J2310J1188R395P102M706K790J578
$$ 592142 600301 608840 617690 627564 638984 651429 663739 674927 684322 691424 696130 698920 700498
$$ [...]
##END NTUPLES=NMR SPECTRUM
##END=
