##TITLE=AC1722_BRAAN15008_9207452_GE9plOlOXp
##JCAMPDX= 6.0         $$ Bruker NMR JCAMP-DX V2.0
##DATA TYPE= NMR SPECTRUM
##DATA CLASS= NTUPLES
##ORIGIN= BRUKER
##OWNER= Administrator
$$ 1.72 TOPSPIN		Version 2.1
$$ 2015-06-01 15:32:41.592 -0700  Administrator@X
$$ Compression mode = diff/dup
##.OBSERVE FREQUENCY= 400.02188249412
##.OBSERVE NUCLEUS= ^1H
##.ACQUISITION MODE= SIMULTANEOUS (DQD)
##.ACQUISITION SCHEME= undefined
##.AVERAGES= 8
##.DIGITISER RES= 22
##SPECTROMETER/DATA SYSTEM= spect
##.PULSE SEQUENCE= zg30
##.SOLVENT NAME= COFFEE_meoh
##.SHIFT REFERENCE= INTERNAL, COFFEE_meoh, 1, 14.98509
##AUDIT TRAIL= $$ (NUMBER, WHEN, WHO, WHERE, PROCESS, VERSION, WHAT)
$$ ##TITLE= Audit trail, TOPSPIN		Version 2.1
$$ ##JCAMPDX= 5.01
$$ ##ORIGIN= Bruker BioSpin GmbH
$$ ##OWNER= Administrator
$$ $$ E:\/data/COFFEE/nmr/AC1722_BRAAN15008_9207452_GE9plOlOXp/10/pdata/1/auditp.txt
$$ ##AUDIT TRAIL=  $$ (NUMBER, WHEN, WHO, WHERE, PROCESS, VERSION, WHAT)
(   1,<2015-06-01 15:32:34.170 -0700>,<Administrator>,<X>,<go>,<TOPSPIN 2.1>,
      <created by zg
	started at 2015-06-01 15:31:27.889 -0700,
	POWCHK enabled, PULCHK disabled,
       configuration hash MD5:
       21 0F 79 D6 B3 7B B4 F6 88 20 88 DB 03 48 BD 9F
       data hash MD5: 64K
       EE F0 E2 BE 04 C3 BA 0A A3 B4 2D 08 0B 80 12 7F>)
(   2,<2015-06-01 15:32:37.561 -0700>,<Administrator>,<X>,<proc1d>,<TOPSPIN 2.1>,
      <Start of raw data processing
       efp LB = 0 FT_mod = 6 PKNL = 1 PHC0 = 0 PHC1 = 0 SI = 32K 
       data hash MD5: 32K
       82 AA AC 60 0D B1 3E 32 BD 99 B2 72 2A 96 88 E6>)
(   3,<2015-06-01 15:32:37.842 -0700>,<Administrator>,<X>,<proc1d>,<TOPSPIN 2.1>,
      <pk PHC0 = 91.23596 PHC1 = 0 
       data hash MD5: 32K
       92 89 DA E4 38 B0 C4 37 06 17 3B FB 09 08 CF 1A>)
(   4,<2015-06-01 15:32:37.951 -0700>,<Administrator>,<X>,<proc1d>,<TOPSPIN 2.1>,
      <abs ABSG = 1 
       data hash MD5: 32K
       52 A2 DE 40 16 B1 CA 7D E4 66 E9 7F 8F 91 3B 9E>)
(   5,<2015-06-01 15:32:38.014 -0700>,<Administrator>,<X>,<proc1d>,<TOPSPIN 2.1>,
      <abs ABSG = 2 
       data hash MD5: 32K
       B7 5B 8D 47 44 28 50 3C 67 FF D4 CC AF F9 EE E7>)
(   6,<2015-06-01 15:32:38.061 -0700>,<Administrator>,<X>,<proc1d>,<TOPSPIN 2.1>,
      <abs ABSG = 3 
       data hash MD5: 32K
       19 A0 E1 5C 72 0A F6 9D BD C0 D1 8F A3 B9 9C 19>)
(   7,<2015-06-01 15:32:38.123 -0700>,<Administrator>,<X>,<proc1d>,<TOPSPIN 2.1>,
      <abs ABSG = 4 
       data hash MD5: 32K
       A2 E7 30 67 CA AE 3B 10 E2 6F BB 1B 3E 3E E1 34>)
(   8,<2015-06-01 15:32:38.186 -0700>,<Administrator>,<X>,<proc1d>,<TOPSPIN 2.1>,
      <abs ABSG = 5 
       data hash MD5: 32K
       1A 5F 29 96 4F 14 CA FF 2F 47 F3 8D A5 F3 61 0A>)
$$ ##END=
$$ 
$$ $$ hash MD5
$$ $$ 75 5F E0 33 0E B2 72 3A 9C 14 53 D2 FF 25 C2 4A
##$RELAX= 
##$RELAX= 
##$RELAX= 
##$RELAX= 
##$RELAX= 
##$RELAX= 
##$RELAX= 
$$ Bruker specific parameters
$$ --------------------------
##$DU= <E:\>
##$EXPNO= 10
##$NAME= <AC1722_BRAAN15008_9207452_GE9plOlOXp>
$$ [...]
##$TP= (0..7)
150 150 150 150 150 150 150 150
##$TP07= 0
##$TPNAME0= <>
##$TPNAME1= <>
##$TPNAME2= <>
##$TPNAME3= <>
##$TPNAME4= <>
##$TPNAME5= <>
##$TPNAME6= <>
##$TPNAME7= <>
##$TPOAL= (0..7)
0.5 0.5 0.5 0.5 0.5 0.5 0.5 0.5
##$TPOFFS= (0..7)
0 0 0 0 0 0 0 0
##$TUNHIN= 0
##$TUNHOUT= 0
##$TUNXOUT= 0
##$USERA1= <user>
##$USERA2= <user>
##$USERA3= <user>
##$USERA4= <user>
##$USERA5= <user>
##$V9= 5
##$VALIST= <valist>
##$VCLIST= <CCCCCCCCCCCCCCC>
##$VD= 0
##$VDLIST= <DDDDDDDDDDDDDDD>
##$VPLIST= <PPPPPPPPPPPPPPP>
##$VTLIST= <TTTTTTTTTTTTTTT>
##$WBST= 2048
##$WBSW= 25
##$XGAIN= (0..3)
0 0 0 0
##$XL= 0
##$YL= 0
##$YMAX_a= 599568
##$YMIN_a= -512871
##$ZGOPTNS= <>
##$ZL1= 120
##$ZL2= 120
##$ZL3= 120
##$ZL4= 120
##$ABSF1= 14.98509
##$ABSF2= -5.573092
##$ABSG= 5
##$ABSL= 3
##$ALPHA= 0
##$AQORDER= 0
##$ASSFAC= 0
##$ASSFACI= 0
##$ASSFACX= 0
##$ASSWID= 0
##$AUNMP= <proc_prof1d_extract_pilot.lims>
##$AXLEFT= 0
##$AXNAME= <>
##$AXNUC= <1H>
##$AXRIGHT= 0
##$AXTYPE= 0
##$AXUNIT= <>
##$AZFE= 0.1
##$AZFW= 0.1
##$BCFW= 0
##$BC_mod= 0
##$BYTORDP= 0
##$COROFFS= 0
##$CY= 15
##$DATMOD= 1
##$DC= 0
##$DFILT= <>
##$DTYPP= 0
##$F1P= 0
##$F2P= 0
##$FCOR= 0.5
##$FTSIZE= 32768
##$FT_mod= 6
##$GAMMA= 0
##$GB= 0
##$INTBC= 1
##$INTSCL= 1
##$ISEN= 128
##$LB= 0
##$LEV0= 0
##$LPBIN= 0
##$MAXI= 10000
##$MC2= 0
##$MEAN= 0
##$ME_mod= 0
##$MI= 0
##$NCOEF= 0
##$NC_proc= -8
##$NLEV= 6
##$NOISF1= 0
##$NOISF2= 0
##$NSP= 0
##$NTH_PI= 0
##$NZP= 0
##$OFFSET= 14.98509
##$PC= 1
##$PHC0= 91.23596
##$PHC1= 0
##$PH_mod= 1
##$PKNL= yes
##$PPARMOD= 0
##$PPDIAG= 0
##$PPIPTYP= 0
##$PPMPNUM= 2147483647
##$PPRESOL= 1
##$PSCAL= 4
##$PSIGN= 0
##$PYNMP= <proc.py>
##$REVERSE= no
##$SF= 400.02
##$SI= 32768
##$SIGF1= 0
##$SIGF2= 0
##$SINO= 400
##$SIOLD= 32768
##$SPECTYP= <>
##$SREGLST= <1H.CDCl3>
##$SSB= 0
##$STSI= 32768
##$STSR= 0
##$SW_p= 8223.68421052631
##$SYMM= 0
##$S_DEV= 0
##$TDeff= 65536
##$TDoff= 0
##$TI= <>
##$TILT= no
##$TM1= 0
##$TM2= 0
##$TOPLEV= 0
##$USERP1= <user>
##$USERP2= <user>
##$USERP3= <user>
##$USERP4= <user>
##$USERP5= <user>
##$WDW= 1
##$XDIM= 32768
##$YMAX_p= 432604309
##$YMIN_p= -601496
##$CURPLOT= <Network HP LaserJet P1505>
##$CURPRIN= <$Network HP LaserJet P1505>
##$DFORMAT= <normdp>
##$LAYOUT= <+/1D_H.xwp>
##$LFORMAT= <normlp>
##$PFORMAT= <normpl>
##$SURQMSG= 1
$$ End of Bruker specific parameters
$$ ---------------------------------
##NTUPLES= NMR SPECTRUM
##VAR_NAME=  FREQUENCY,     SPECTRUM/REAL,   SPECTRUM/IMAG
##SYMBOL=    X,             R,               I
##VAR_TYPE=  INDEPENDENT,   DEPENDENT,       DEPENDENT
##VAR_FORM=  AFFN,          ASDF,            ASDF
##VAR_DIM=   32768,         32768,           32768
##UNITS=     HZ,            ARBITRARY UNITS, ARBITRARY UNITS
##FACTOR=    0.250966925370066, 1,           1
##FIRST=     8223.43324360094, -51498,       63654
##LAST=      0,             -7415,           118823
##MIN=       0,             -601496,         0
##MAX=       8223.43324360094, 432604309,    0
$$ Real data points
##PAGE= N=1
##DATA TABLE= (X++(R..R)), XYDATA
$$ [...]
19579E9036a01814A8536a78996A15833K17569b24309l8456a14607I1776f0689
19568a61446e6551j48894C64367b42377C0352b35387A24271a37574b9697a0123
19557c6750j96036k5468A43183a54965q4280A1371K12041a47207J9245j20k3143
19546a51225B72393A35527D6023Q2294i7188A05110J72403H6858a35876o6284
19536b02160C78958A5986b52686J14533k89240J63122J08828o8776A6633a28633
19525a41436B30397a39816R529E1123J24498d2687o3925B12454b54252j46975
19515d01227g6217k85160A18302B7754G709K45394I067J35093l5083c88039f1174
19503A82472q0761a24204o1822M4567j00767A59664i0760l5706k8762N3946f156
$$ plain form
19579 59036 -101814 18536 -178996 115833 333402 -224309 -262765 -114607 91776 -60689
19568 -161446 -56551 -205445 364367 -242377 30352 -235387 124271 -137574 -29697 -10123
19557 -36750 -232786 -258254 143183 -154965 -239245 11371 223412 -147207 -127962 -128082 -151225
19546 -151225 272393 135527 46023 128317 -97188 105110 277513 86858 -135876 -202160
19536 -202160 378958 15986 -252686 -138153 -427393 -264271 -155443 -224219 16633 -128633
19525 -141436 230397 -139816 -130287 51123 175621 -42687 -106612 212454 -254252 -401227
19515 -401227 -76217 -361377 118302 27754 7709 253103 9067 144160 109077 -388039 -61174
19503 182472 101711 -124204 -186026 -141459 -242226 159664 -90760 -126466 -155228 -101282 -6156
19491b619m9550a3548j86508A06860B228O4750k9344f4317j97575P3327R1245
19480i7320B6145d1221A7558J05965E5231c2761A82619b48660a10324k36942e1330
19468d59154A9469a46719C1022a46526B0456i4462p4339b4246k2772k77323g1691
19456d14246b7731I0895J14253j9018l6001a65228A36256J482i5167K8771j16152
19445a82548l3049F9490b44385j34875L9630F5981e09757D6637f5798l42402J80643
19434b27557H1356a071o9118r1588j38488B4258a18851d2983A04265a28945d4679
19422D9055b21040a01821M7843H962d8510I2248K62915A25479e8552q3213D79819
19410b41178f3625l9164A28708N1568b03541f283A51147a61261A31159n9012d7409
$$ plain form
19491 -2619 -52169 -13548 -200056 106860 2228 66978 37634 -64317 -261892 -188565 -97320
19480 -97320 26145 -41221 17558 123523 55231 -32761 182619 -248660 -110324 -347266 -51330
19468 -459154 19469 -146719 31022 -146526 20456 -94462 -168801 -24246 -47018 -324341 -71691
19456 -414246 -27731 90895 205148 186130 150129 -165228 136256 137738 -95167 -66396 -182548
19445 -182548 -215597 69490 -244385 -379260 -339630 65981 -509757 46637 -65798 -408200 -227557
19434 -227557 81356 -1071 -70189 -161777 -300265 24258 -118851 -42983 104265 -128945 -44679
19422 49055 -221040 -101821 -53978 8962 -48510 92248 355163 125479 -58552 -141765 479819
19410 -241178 -63625 -102789 128708 180276 -203541 -6283 151147 -161261 131159 72147 -47409
19398E5657b13264J01683L9449j65785j37516G1821k4252b74930D3498M5838i4751
19386A68553a36849e1711j61850r2726A32018c14079Q8365q8906a22513b3487
19375a61071A93169m8778n9409b24181B88J6944a54464k45089a92426b5242C0924
19363a07227B42148b39725n4145d6886p454j94973o2706O6599M1868a2278G3236
19351b93155a16885p5078r2661J13625c5m8334o3627j42332L4006J08288A20420
19339D5786a77726I6849c8065j52158N0852F705a44254j03957B16043b16197C5544
19327b07379g6866L5584j15390C5639b01215l2163f5241j63062h0024m090b9064
19315B13497A3035K1094e2497F0002b86979A58856a10639C7467P0455d0101A1788
$$ plain form
19398 55657 -213264 -111581 -72132 -237917 -375433 71821 47569 -274930 43498 89336 -94751
19386 168553 -136849 -51711 -213561 -306287 132018 -314079 -225714 -314620 -122513 -23487
19375 -161071 193169 144391 84982 -224181 288 17232 -154464 -399553 -192426 -25242 30924
19363 -107227 242148 -239725 -293870 -46886 -54340 -249313 -312019 -245420 -203552 -12278 73236
19351 -293155 -116885 -191963 -284624 -170999 -35 -48369 -111996 -254328 -220322 -112034 120420
19339 45786 -177726 96849 -38065 -190223 -139371 6705 -144254 -248211 216043 -216197 35544
19327 -207379 -76866 -41282 -156672 35639 -201215 -233378 -65241 -228303 -80024 -84114 -29064
19315 213497 13035 34129 -52497 60002 -286979 158856 -110639 37467 107922 -40101 11788
19303e5057a6837l54695b1316Q020j99886m4067D7673a7954r4901A74351h6571
19291B38612j1253O304a93807b4983q500F9293c49982R1877J1553q9753a64721
19279e6746A48948J4393b76911j13623J04301J03475N9878d729j29812k03205
19269c37746a48975D488N4469b04992F1546L9603i3639A8258d56659a96423J8425
19258a77998A9615e8545j28576F946J68883A1081a36991j40615d1057g581j4419
19247b2000o6332k038B9332a04369B4541h0771B1339c8765q3441q0389J8646I4214
19234a54191j67088A6365L30837a32942A23641b19737g5006A00070a92805I4238
19223C4345c89150B8255R2362c45866J70515I1971C2170H079J9397k470c82688
$$ plain form
19303 -55057 -16837 -371532 -21316 -13296 -213182 -257249 47673 -17954 -112855 174351 -86571
19291 238612 227359 233663 -193807 -24983 -33483 69293 -349982 -258105 -246552 -336305 -164721
19279 -56746 148948 163341 -276911 -390534 -286233 -182758 -122880 -4729 -134541 -337746
19269 -337746 -148975 4488 58957 -204992 61546 101149 -93639 18258 -456659 -196423 -177998
19258 -177998 19615 -58545 -187121 6946 175829 11081 -136991 -277606 -41057 -7581 -22000
19247 -22000 -88332 -90370 29332 -104369 24541 -80771 21339 -38765 -122206 -202595 -183949 94214
19234 -154191 -321279 16365 347202 -132942 123641 -219737 -75006 100070 -192805 94238
19223 34345 -389150 28255 120617 -345866 -175351 91971 32170 8079 27476 25006 -382688
19211c71372B30718g0431j34323G4265b52210A53335h4862n4115j16684d2992
19200a17154M4843j8645C377a35919j90414J44268C315a78552q5701H5247c38190
19188A44799f1156H6969c3691J2550k61587a31031e2750q8783o9580c3674F3791
19176f8307K9957A58927c92222e06j44886E7873b12576P5972Q343a5966j29215
19165a45181k59600a05899k10395f4456j45396a5400k28654M3535e914q1835a6825
19153a91657o3696J21134B06147a24982A39378J4286A3674b02597D4291a1935
19142a63949O2623D3816R1634g087j17071e2300j18672B51417K9432a92965q1802
19131b74767b1206m27382P2985J48946L8074I0067O9441c51569N4059g1884B29696
$$ plain form
19211 -371372 230718 -70431 -204754 74265 -252210 153335 -84862 -138977 -255661 -42992
19200 -117154 -72311 -90956 3377 -135919 -326333 -182065 3315 -178552 -264253 85247 -338190
19188 144799 -61156 86969 -33691 -21141 -282728 -131031 -52750 -141533 -211113 -33674 63791
19176 -68307 -38350 158927 -392222 -506 -145392 57873 -212576 -136604 -128261 -15966 -145181
19165 -145181 -404781 -105899 -316294 -64456 -209852 -15400 -244054 -200519 -5914 -87749 -16825
19153 -191657 -255353 -134219 206147 -124982 139378 153664 13674 -202597 44291 -11935
19142 -163949 -101326 43816 135450 -7087 -124158 -52300 -170972 251417 280849 -192965 -274767
19131 -274767 -21206 -448588 -375603 -226657 -188583 90067 159508 -351569 -297510 -71884 229696
19119b09544A55357a85267G1591k2793d2304A4998Q9360d9068A8243J11581e6940
19107b36356a16127p4592B4291A0431a21911n8587F8478c32691A47253A3949P3735
19096H7684B6644f0699G0725P7864a82764B57348b1510n34288B10778b71913l9474
19085c11387B35165a82102h8028k8304E1154K20699C50a17968C0646d06882a46036
19073B04709b37729j86841Q3678a38249F3725J4163d7054A33826E256L3103e5971
19061A7727M8027b41370A51262a60651A18473b12848A1831a66682k20528a67669
19050c35776Q1045O2281A54902a68570b1516q6594A19646Q1328b26863M2158c6486
19038a31600m8282b3055k11499A23411b57581j17585E28945A97477g2891b7667
$$ plain form
19119 -209544 155357 -185267 71591 48798 -42304 14998 104358 -49068 18243 129824 -56940
19107 -236356 -116127 -190719 24291 10431 -121911 -180498 68478 -332691 147253 13949 87684
19096 87684 26644 -60699 70725 148589 -182764 257348 -21510 -555798 210778 -271913 -311387
19085 -311387 235165 -182102 -88028 -116332 51154 271853 350 -117968 30646 -406882 -146036
19073 204709 -237729 -424570 -340892 -138249 63725 77888 -47054 133826 5256 38359 -55971
19061 17727 65754 -241370 151262 -160651 118473 -212848 11831 -166682 -387210 -167669
19050 -335776 -254731 -192450 154902 -168570 -21516 -108110 119646 200974 -226863 -184705 -36486
19038 -131600 -179882 -23055 -234554 123411 -257581 -375166 528945 197477 -72891 -27667
19027c71885f178A36025f3646A68956B5540a37487C3529i8017C4199J51393R7732
19016B83324j39449p0235a13648A78481b17684b2411E4108p931a404m7730A44931
19004B05093n3853a63331K3152q2818R2874d1866j667n0002A19374b49569A61191
18992H8537a09031r4317F8327J69941I4498l1625b1421P200j81885A75588b07035
18980I0157B3710K01292l9160f0528A2945a67517j19440J22347R810P5783j4884
18969i3901L175B38467i3727k3482C23435F2614J53685a90171Q0779B8070J73206
18958B01276F1120b16063r5717b4444D1320a0268o100j4818j33314g7451E0023
18946d6025A48626c0898A3465K26144b1410j75307B4355Q7420B5816L9381L4185
$$ plain form
19027 -371885 -6178 136025 -63646 168956 25540 -137487 33529 -98017 34199 185592 283324
19016 283324 143875 73640 -113648 178481 -217684 -22411 54108 46177 -1404 -49134 144931
19004 205093 151240 -163331 -140179 -222997 -130123 -41866 -43533 -93535 119374 -249569 161191
18992 88537 -109031 -203348 68327 238268 94498 62873 -21421 -14221 -196106 175588 -207035
18980 90157 23710 225002 185842 -60528 12945 -167517 -286957 -164610 -154800 -79017 -93901
18969 -93901 -90726 238467 -93727 -117209 323435 62614 216299 -190171 -109392 28070 201276
18958 201276 61120 -216063 -311780 -24444 41320 -10268 -16368 -31186 -164500 -77451 50023
18946 -46025 148626 -30898 13465 239609 -21410 -196717 24355 111775 25816 65197 99382
18935I9382l6755b82809A72293a53040d8156O73k08723A43257b22473d505r4927
18924i9432k6975p1517a6331j51127B11478b57990G7535A249d60266a00985m3352
18913a44337k12964B22839c05179o6799f9348n7054G3519c34550C06024a13853
18902h3653J5518j8904A41999c32708G3318b2086j98631k852h1276b577E0416
18890I704b34127g0253j26792A04055g8270A24795c44997k56499d8352A07727
18879B55121a35327A56665G2812h0137J2337m4067K8200G2091c85193I2353k7509
18868F4844a37206j50483a08673B62383a45906B4340j462E284a31779M6210A70755
18856B11730A4083b20492B4540d1002B73107c8319F348e4931G1082J87552B1670
$$ plain form
18935 99382 62627 -282809 172293 -153040 -48156 -47483 -256206 143257 -222473 -4505 -99432
18924 -99432 -126407 -197924 -16331 -167458 211478 -257990 77535 1249 -460266 -100985 -144337
18913 -144337 -357301 222839 -305179 -371978 -69348 -126402 73519 -334550 306024 -113853
18902 -83653 -68135 -87039 141999 -332708 73318 -22086 -220717 -223569 -81276 -2577 50416
18890 9704 -234127 -70253 -197045 104055 -78270 124795 -344997 -601496 -48352 107727
18879 255121 -135327 156665 72812 -80137 -67800 -111867 -83667 72091 -385193 92353 64844
18868 64844 -137206 -287689 -108673 262383 -145906 24340 22878 5284 -131779 -85569 170755
18856 211730 14083 -220492 24540 -41002 273107 -38319 6348 -54931 71082 258634 21670
18844e0264B1778b94166d8127A1910b17856e6822m5142c9246q5819l7517A16174
18832B19290a23798j44156h0127A04603l4662j7879j8006K32614i7248D1104h2135
18820f4159l03702G4611A757J55921b07481A5225K48976a2606k3100F8064L77859
18809D45923d2218D54383F3865K43719c4882o0510A86409a65177J8095k894d8319
18797a97347B09828d9945F3784b56484J9691i7044B07403M6273d9604I417g3036
18785H9928c76996d4906A00505d297A5605O3423N8540D7526k1054J17540n4456
18774H9556A9651f0537j10435d5415A40241i7296a1775j02578n3332A00696a9823
18762c55557E8546i6791j5852b7766j8613R372l36992C7714a53573M1015L6560
$$ plain form
18844 -50264 21778 -294166 -48127 11910 -217856 -56822 -101964 -39246 -125065 -162582 116174
18832 219290 -123798 -267954 -80127 104603 69941 52062 34056 266670 -97248 41104 -82135
18820 -64159 -367861 74611 1757 157678 -207481 15225 264201 -12606 -35706 68064 445923
18809 445923 -42218 454383 63865 307584 -34882 -95392 186409 -165177 -147082 -149976 -48319
18797 -197347 209828 -49945 63784 -256484 -236793 -97044 207403 253676 -49604 9417 -73036
18785 89928 -376996 -44906 100505 -4297 15605 79028 137568 47526 26472 144012 89556
18774 89556 19651 -60537 -170972 -45415 140241 -97296 -11775 -114353 -167685 100696 -19823
18762 -355557 58546 -96791 -112643 -27766 -46379 -37007 -373999 37714 -153573 -112558 -75998
18751g5998j43015e2686m5008E9367e4037j40527E4389J06967J80805A04944a33330
18739b95303J33787f3992r3032l5109l1684j07329a25679e7856j52649B4004K89834
18728C13838a01026L4416n624K1566p3095m9660C4919a73229A43336A4476d41488
18716a36800A72682a78430l63151h2957a7843I4369i8989K1400J2049M222B0987
18704c48101i113A51342K19499j82872J65191g7038j94511B09569b58550p0021
18694c28571A74502d0844A821b21852p4625A46623o3735a62569A04188a94860
18683d9788B15018i2893j23169j21435a00156q7291A04594L7688i3247o7375l5220
18672a95842I7636b68661Q1244A27060j3501a42597O4611q5338L1730A00645a98551
$$ plain form
18751 -75998 -219013 -52686 -97694 59367 -54037 -194564 54389 161356 342161 104944 -133330
18739 -295303 -161516 -63992 -157024 -192133 -223817 -331146 -125679 -57856 -210505 24004 313838
18728 313838 -101026 -66610 -72234 -50668 -123763 -173423 34919 -173229 143336 14476 -441488
18716 -136800 172682 -178430 -541581 -82957 -17843 94369 -98989 -77589 -65540 -61318 20987
18704 -348101 -9113 151342 370841 187969 353160 -77038 -271549 209569 -258550 -328571
18694 -328571 174502 -40844 1821 -221852 -296477 146623 82888 -162569 104188 -194860
18683 -49788 215018 -92893 -216062 -337497 -100156 -187447 104594 142282 -93247 -160622 -195842
18672 -195842 97636 -268661 -187417 127060 113559 -142597 -77986 -163324 -131594 100645 -198551
18660A06132J24905a52962A81188a15435r2488j04295d1334k5203k18532A81850
18649c1890r883A84677J28160f745j26118F7258c86135N6322I1333K47344d67779
18637C4359O4317a0457D1151a17316B08025E5664e024j80569j0826n4638R2786
18626a58271k9210h8750B36769c18556I2811K2733a18187m6867d1946l44847A23603
18614A8159L15068F8030k2442b4684l08942h7263k2594J300A78762Q5310c44082
18602E4893d85108g2119k37094l4656B12184a31166j30049a21372p7821H225a2107
18590i2836j45010E1937f4145j18395P2265c1450A78718l039F3218a10661k363
18579a13024E4883b73958d5847n6097k40056C5534a2414j5214E7861b20156P2507
$$ plain form
18660 106132 231037 -152962 181188 -115435 -207923 -312218 -41334 -66537 -285069 181850
18649 -31890 -41773 184677 312837 -6745 -132863 67258 -386135 -329813 91333 338677 -467779
18637 34359 98676 -10457 41151 -117316 208025 55664 -5024 -185593 -196419 -251057 -158271
18626 -158271 -187481 -88750 236769 -318556 92811 115544 -118187 -165054 -41946 -386793 123603
18614 18159 333227 68030 45588 -24684 -333626 -87263 -109857 -108557 178762 264072 -344082
18602 54893 -485108 -72119 -309213 -343869 212184 -131166 -261215 -121372 -199193 8225 -12107
18590 -92836 -237846 51937 -64145 -182540 -110275 -31450 178718 175679 63218 -110661 -113024
18579 -113024 54883 -273958 -45847 -101944 -342000 35534 -12414 -27628 57861 -220156 -147649
18568a47649A07500J3820d23112D7837b92341h8730l9325A09484a64254c940j75497
18557a79437k36313f7333q0943l4969C5085b5743n8562D00b6322a567q5944j25938
18545b13449J5726b7949k1965j31340o4755J11087M8164q3395f3267D2978c09110
18533b71957B63792I3613R630b1544A08919b8491A04024k579G065d74468A1866
18521a47213f6404G0232C2231i1473F9680h0353k88644o4961d7679E5311a97019
18509A31852F548a7136j13984j40062A14530k3436b98184J18462e7474C17520
18498a89989G0032a74903h383a702l2947k67141E8100J46367b31839e2902j09062
18487a61964B12048c14621B16524e216I4655J11791O4375I9698j0491J80757B5518
$$ plain form
18568 -147649 107500 121320 -423112 47837 -292341 -88730 -128055 109484 -164254 -3940 -179437
18557 -179437 -415750 -67333 -148276 -183245 35085 -25743 -84305 400 -26322 -1567 -87511 -213449
18545 -213449 -197723 -27949 -49914 -181254 -246009 -134922 -86758 -170153 -63267 42978 -309110
18533 -271957 263792 93613 103243 -21544 108919 -28491 104024 101445 7065 -474468 11866
18521 -147213 -66404 70232 32231 -91473 69680 -80353 -368997 -433958 -47679 55311 -197019
18509 131852 6548 -17136 -131120 -271182 114530 91094 -298184 -179722 -57474 317520
18498 -189989 70032 -174903 -8383 -1702 -34649 -301790 58100 204467 -231839 -52902 -161964
18487 -161964 212048 -314621 216524 -5216 94655 206446 270821 99698 89207 269964 25518
18475b3890D9199i6435F8579M0574k5681J0626K43325A20456b72085F6156a33912
18463A85562a48211L7089p5604D834b69350B20168a6269A64455d33512B82241
18452a15785B54693c84388B29903B2910K58573a97935r0581J07163Q8619j55016
18442b47750J08031c6909k76627J13013A14228g1114j61213g2255j25391j29027
18432c26673e9475a6933k63478a03756j52517h1139L1996C4156a08571l61317
18422d69888i2834K7932j12160B19662B9920d2340Q803A64379c24929f0031j03493
18411a63524A31179l36c91082A05101f8568a9062r4201E5729Q0190e9892E0020
18399C36765A46620c3842G836c46131O1302J18726a9081r9929p9664N2007J1486
$$ plain form
18475 -23890 49199 -96435 68579 109153 83472 94098 337423 120456 -272085 66156 -133912
18463 185562 -148211 -111122 -186726 4834 -269350 220168 -16269 164455 -433512 282241
18452 -115785 254693 -384388 229903 22910 281483 -197935 -288516 -181353 -92734 -247750
18442 -247750 -139719 -36909 -313536 -200523 114228 -71114 -232327 -72255 -197646 -326673
18432 -326673 -59475 -16933 -280411 -103756 -256273 -81139 -49143 34156 -108571 -469888
18422 -469888 -92834 -64902 -177062 219662 29920 -42340 -33537 164379 -324929 -60031 -163524
18411 -163524 131179 130843 -391082 105101 -68568 -19062 -113263 55729 135919 -59892 50020
18399 336765 146620 -33842 7836 -346131 -284829 -166103 -19081 -119010 -198674 -146667 -135181
18388a35181A16196a10345J876I9209a88146j02769e6508k72829a53720b6155
18377a43151B7831b96709h3450H2787d83255A02018a53598B892e5511o8452B51982
18365a92045A13443a0398B85988a31559G7175i7239A56659B2192h2602o8560M242
18354a46920r1641c5796j38331G3029a15011A43015B4738R1797B3764b03066A50285
18342a91313j6467P7816F6641J68358e0379p5379j01074O5583k64605b2499A95540
18330a61559K9032A92115a41620C0659c85407A24099J69301h1676E0129a203k80249
18319b81452R088r3832a57562n7746l7333D9339b29089f1471l6907A9314h0424
18307A2731J05326O7544C3830c09638N6838f9449A32346B833b3888G2915a35290
$$ plain form
18388 -135181 116196 -110345 -108469 99209 -188146 -290915 -56508 -329337 -153720 -26155
18377 -143151 27831 -296709 -83450 82787 -483255 102018 -153598 2892 -55511 -123963 251982
18365 -192045 113443 -10398 285988 -131559 77175 -97239 156659 22192 -82602 -151162 -146920
18354 -146920 -238561 -35796 -174127 73029 -115011 143015 24738 116535 23764 -203066 150285
18342 -191313 -207780 -129964 66641 234999 -50379 -125758 -226832 -161249 -425854 -22499 195540
18330 -161559 -132527 192115 -141620 30659 -385407 124099 293400 -81676 50129 -1203 -281452
18319 -281452 -272364 -366196 -157562 -215308 -252641 49339 -229089 -61471 -98378 19314 -80424
18307 12731 118057 185601 33830 -309638 -252800 -69449 132346 2833 -23888 72915 -135290
18295B7275J9876K08835A22214l8714a22485E9345c7623j51720D3446I231L25037
18284C34268j3374a24548E4975a28490q7930o4604C81017a87136b0203j02942
18274a23145D5522K20633f1905A21850O0043p2342K1592h7415a5057A19186c2677
18262A5997K5235J5715b48024m2105H4109h7540L8873j49866G1634K43098g7755
18250b6103I4889a04436q2202N5918M3683l0350c0643A07846c00366H3534P1164
18239A54698m9449c5629k07713e9251p728j5740G258b02302Q5537l9432f306D0964
18226g8904H1948a37483N6883b1131k73984I665a25570C79767j46120a19474L7714
18215h1760C66919a18191D0610N9405b47034R1500B35403F369K15618N5659a47440
$$ plain form
18295 27275 47151 255986 122214 83500 -122485 59345 -37623 -189343 43446 9231 334268
18284 334268 320894 -124548 54975 -128490 -216420 -281024 381017 -187136 -20203 -123145
18274 -123145 45522 266155 -61905 121850 181893 109551 131143 -87415 -15057 119186 -32677
18262 15997 41232 56947 -248024 -290129 84109 -87540 -48667 -198533 71634 314732 -77755
18250 -26103 94889 -104436 -186638 -130720 -87037 -117387 -30643 107846 -300366 83534 154698
18239 154698 105249 -35629 -243342 -59251 -66979 -82719 7258 -202302 -116765 -156197 -6306 40964
18226 -78904 81948 -137483 -80600 -21131 -295115 9665 -125570 379767 233647 -119474 -81760
18215 -81760 366919 -118191 40610 100015 -247034 -155534 235403 6369 221987 277646 -147440
18203b18796I5276K74244d8588j7846k98525C9626e0403l66336A94879n5673a87767
18191A24312A2421a31494J9086D0034a98022k6975j05067E0471b10726B8486a41680
18179c83919B82594H9828m4652j525c0622j16211J0716m4920k09265i8873A58921
18167c9579B92792C7892c3946n0843j82448B31736j9706d2654l0844I3508a17750
18155a8630B39034b63916a6588j42343d8038H3682a17819E7946a35030m2539k31902
18144d09471j55578i7247j10873N6160B4753e1914l01984A46920a05978m4884
18134a50862D7997N3076d3384j87514A80706D6656a30753J0717k9301j1291B28326
18122a943k78989J38336F5286j6498b40719A91200c12003a7784j71939q0752A75916
$$ plain form
18203 -218796 95276 369520 -48588 -66434 -364959 39626 -50403 -416739 194879 139206 -187767
18191 124312 12421 -131494 -112408 40034 -198022 -224997 -330064 50471 -210726 28486 -141680
18179 -383919 282594 89828 45176 43651 -30622 -146833 -136117 -181037 -390302 -98873 158921
18167 -39579 292792 37892 -33946 -84789 -267237 231736 212030 -42654 -73498 93508 -117750
18155 -18630 239034 -263916 -16588 -158931 -48038 83682 -117819 57946 -135030 -177569 -409471
18144 -409471 -565049 -97247 -208120 -151960 24753 -51914 -353898 146920 -105978 -150862
18134 -150862 47997 101073 -43384 -230898 180706 46656 -130753 -120036 -149337 -160628 228326
18122 -1943 -280932 -142596 65286 48788 -240719 191200 -312003 -17784 -189723 -270475 175916
18110g1131I3913k5592a19590A19848l6841a04509P047q6238B1087d63252A3180
18098A13240a02469J1497j31457B5352j0996a02990l4774a4024D97598A62034
18087A70240a04203L3959k8041B3021K63455c00242j06821d6931A1872O5589c0529
18075d4348a9192l74416A13299c6344k16567J03254D3428K924P1690a39737j71194
18064c10931J31038n5530Q4990j72458G8277e2605j97183A95249J52630a14430
18053E8943K3493R7971E7471a01454A82988c9859j51917O1006e3462j12560b4895
18041A21488O5205a27254a7244B01518b6588A54938l6780a74351A2893a11399
18030a50156K5615C81629G4681J99295c68252J17215B05159a78004I3485g8736
$$ plain form
18110 -71131 93913 68321 -119590 119848 83007 -104509 -97462 -183700 21087 -463252 13180
18098 113240 -102469 -90972 -222429 25352 14356 -102990 -137764 -14024 497598 162034
18087 170240 -104203 -70244 -98285 23021 286476 -300242 -407063 -46931 11872 77461 -30529
18075 -44348 -19192 -393608 113299 -36344 -252911 -149657 43428 46352 118042 -139737 -310931
18064 -310931 -179893 -235423 -150433 -322891 78277 -52605 -249788 195249 347879 -114430
18053 58943 82436 180407 57471 -101454 182988 -39859 -191776 -130770 -53462 -166022 -24895
18041 121488 186693 -127254 -17244 201518 -26588 154938 118158 -174351 12893 -111399
18030 -150156 -124541 381629 74681 273976 -368252 -251037 205159 -178004 93485 -78736
18019G5173J23021a6271j77589E2054a73233k10872c255B42220b4187j02216A05603
18007G9995Q9022i5257C23208J27317i4884l1433l3330A71656b6467A9292c5122
17995a11677j64712G0930h1633l47054d5437j13328j80033a02917j6957H6651
17984a90562F7190b26464B66986k6506b62862e5494B96281I9354k5168H406N1393
17973E9799a1108l4492n2713A44732L12869b47180I2769R2469H7039a11433N612
17962a05821F3737d88978A40690a8316j3182B76987e8469k07025J03426d4386
17951i1438H9320b16165A3930e7616J005k24081A5554J70657G6122d8762k28103
17940b76865C0114b28594C387J26242O745a99370a5228F048M14279b32636A89629
$$ plain form
18019 75173 198194 -16271 -193860 52054 -173233 -384105 -3255 242220 -24187 -126403 105603
18007 79995 169017 -95257 323208 450525 -94884 -126317 -159647 171656 -26467 19292 -35122
17995 -111677 -276389 70930 -81633 -428687 -45437 -158765 -338798 -102917 -119874 86651
17984 -190562 67190 -226464 266986 240480 -262862 -55494 296281 99354 74186 8406 59799
17973 59799 -11108 -45600 -98313 144732 457601 -247180 92769 185238 87039 -111433 -105821
17962 -105821 63737 -488978 140690 -18316 -31498 276987 -58469 -265494 -162068 -44386
17951 -91438 89320 -216165 13930 -57616 -56611 -280692 15554 186211 76122 -48762 -276865
17940 -276865 30114 -228594 3387 129629 136374 -199370 -15228 6048 420327 -232636 189629
17928A56627L9701b19559f0357j07498D8404K5689J63064F283K88144l5977B8380
17916B92775b46800j54088a12170k56975a03048A45957a30951K8584H9698M2790
17906A32488F2379B1880Q6195d8514a8020A59370d6273o3326j8172d7998C8597
17894B25510c0706m1617A7592b55503d1758m9762e041a811m86201B015b6302A22540
17881H2070g301j09539Q534n0512g4237C2053P5437k9481a23648A10849c80325
17869C09267j32820F7609k1614L26020C6933L13377F8633k174h2597A80503e3045
17857a59002A7591J55127a77193C6864b02436L2231e6593A66639d4493R206j28395
17846a63682L3084O3044k1202K6481H6939a46891B06806h9462h547B38635H5386
$$ plain form
17928 156627 196328 -219559 -60357 -167855 48404 74093 237157 6283 294427 258450 28380
17916 292775 -246800 -400888 -112170 -369145 -103048 145957 -130951 -102367 89698 132488
17906 132488 62379 21880 108075 -48514 -18020 159370 -46273 -109599 -127771 -47998 38597
17894 225510 -30706 -72323 17592 -255503 -41758 -91520 -5041 -1811 -488012 2015 -26302 122540
17881 82070 -7301 -116840 -108306 -158818 -74237 32053 107490 78009 -123648 110849 -380325
17869 309267 176447 67609 45995 372015 36933 350310 68633 66459 -82597 180503 -53045
17857 -159002 17591 172718 -177193 36864 -202436 -170205 -56593 166639 -44493 -35287 -163682
17846 -163682 -130598 -67554 -88756 -62275 86939 -146891 206806 -89462 -8547 238635 85386
17834a27144B2126L83283c01288A30082g0309j51781j86114c8743B32149D4807
17823A38618F7103b69967O9034B29270e99D3975a64815d6449B19007b85949C01477
17811A44757b6192j7294k22021B87815b58264A22079n0607D90a22482A17057e9750
17799C0725R9238i3965A14849b61433g302A0381b14046a2965A18071a19037G4666
17787c6197A4710b57442J19607N5790j125a5414B26866b7398D39618b2562p2948
17776i5510A7050J08740a2911B2386b736A6597J585M0998P2968P5318b74993H3118
17763B5251a09227M9225D22752G5183d42723A03449a04783j37493r3404i1270
17752a47102m424l7252k52641A60185j8113c95536A09671b84263g5640A7899K11594
$$ plain form
17834 -127144 22126 405409 -301288 130082 -70309 -222090 -408204 -38743 232149 44807
17823 138618 67103 -269967 -200933 229270 -599 43975 -164815 -46449 219007 -285949 301477
17811 144757 -26192 -43486 -265507 287815 -258264 122079 71472 490 -122482 117057 -59750
17799 30725 129963 -93965 114849 -261433 -7302 10381 -214046 -12965 118071 -119037 74666
17787 -36197 14710 -257442 -137835 -82045 -83170 -15414 226866 -27398 439618 -22562 -95510
17776 -95510 17050 125790 -12911 22386 -2736 16597 18182 59180 132148 207466 -274993 83118
17763 25251 -109227 -60002 422752 75183 -442723 103449 -104783 -242276 -335680 -91270
17752 -147102 -151526 -188778 -441419 160185 142072 -395536 109671 -284263 -75640 17899 229493
17741B29493a473A80184a49681M5381b7906p6946n1663A47514b07180L6334N3869
17730a16977I6200a17954k08412N4467B69146a45768j23408J12739B4051J86694
17720B10745a35319A73063D8588K31872e8637F8575O0746n869b47491B84821A9793
17708A94054h437k28428a0472B08816o4863K21872j79259g8651A8874a77803b6424
17696A31675b15345j5973g3683A49901o0253B3258L5812Q3333b8617l25818E0822
17684a39342n956H2262b00695d214F06a57097q0330b8918k08807b0954H6132J37674
17672B23806e4037j94309J24129N5232b4663N676E3104A7938L12447f7678A08709
17660b1633p5398A0633K08225a46920F5513e4263j45518A34444o3079n484b30052
$$ plain form
17741 229493 -1473 180184 -149681 -104300 -27906 -104852 -156515 147514 -207180 -170846 -116977
17730 -116977 96200 -117954 -326366 -271899 269146 -145768 -269176 -156437 24051 210745
17720 210745 -135319 173063 48588 280460 -58637 68575 129321 123452 -247491 284821 19793
17708 194054 -8437 -236865 -10472 208816 143953 365825 186566 -78651 18874 -177803 -26424
17696 131675 -215345 -231318 -73683 149901 89648 23258 59070 142403 -28617 -354435 50822
17684 -139342 -145298 82262 -200695 -4214 606 -157097 -237427 -28918 -237725 -20954 86132 223806
17672 223806 -54037 -248346 -124217 -68985 -24663 -18987 53104 17938 330385 -67678 108709
17660 -21633 -97031 10633 218858 -146920 65513 -54263 -199781 134444 71365 65881 -230052
17648F7637K29011j2386A1521b85530g1710A41164R642f8760A15821b1694N38
17637b1156n0572D1342a06388A25717b66177A16328a18011D6671a4021B58401
17626a42771p5005c1609n0257A37218F238h0227p525L1502B54644A3966K04192
17615B18158B6972f7548o9371N2608k6506m1153B51911b0722c01j2481A79399
17603a9591B77669c764A61173a5512B37997b59266a15220j9537h746k89674C23679
17591B8506c1443E8979J68487o3028E1227A2540b42150F5814a69757a6356I2811
17579H1355g942A60186G0132J17330r0486e8103B71938K05448D8697a66793C4284
17567a688b3B77180A6810M36h6107K4295A41386a56455B83007I4916e8556A9376
$$ plain form
17648 67637 296648 284262 11521 -285530 -71710 141164 150806 -68760 115821 -21694 -21156
17637 -21156 -71728 41342 -106388 125717 -266177 116328 -118011 46671 -14021 258401
17626 -142771 -217776 -31609 -81866 137218 6238 -80227 -87752 -56250 254644 13966 218158
17615 218158 26972 -67548 -136919 -84311 -110817 -151970 251911 -20722 -301 -12782 179399
17603 -19591 277669 -3764 161173 -15512 237997 -259266 -115220 -134757 -8746 -298420 323679
17591 28506 -31443 58979 227466 164438 51227 12540 -242150 65814 -169757 -16356 92811
17579 81355 -7942 160186 70132 187462 96976 -58103 271938 477386 48697 -166793 34284
17567 -1688 -23 277180 16810 17246 -86107 -61812 141386 -156455 283007 94916 -58556 19376
17554a68846j56516b5471G5195a5741O44D10335b8101j49998B28343A12644a40550
17542f5329B7421A3261k140a13830B41857I3419Q0256a45412L1930c9160E8312
17530b57578J09958O5028r033E5666a5508E2302F001J46716f285E04559A3052
17518B23953a67821c0052E0229a556B21094J2020b02198A40450m1611N2381M3183
17507A94403b09679A16990D4398J2379Q0220P6849H1568N7657e4185B0047a01651
17495C11854d8442C5293N5707L11423a11711b9339B62434a82781b9861D0100K51973
17484B92073E4994J64750j9297b94012F071K2687J18426E8988J4538P4885a71621
17472B78322A04929j9118B7453L60483A55451k4689C2534a44360C85137B167K83714
$$ plain form
17554 -168846 -325362 -25471 75195 -15741 -15097 410335 -28101 -178099 228343 112644 -140550
17542 -65329 27421 13261 11121 -113830 241857 93419 173675 -145412 -113482 -39160 58312
17530 -257578 -147620 -82592 -91625 55666 -15508 52302 6001 152717 -6285 504559 13052
17518 223953 -167821 -30052 50229 -1556 221094 233114 -202198 140450 98839 151220 194403
17507 194403 -209679 116990 44398 56777 136997 213846 81568 139225 -54185 20047 -101651
17495 311854 -48442 35293 91000 402423 -111711 -29339 262434 -182781 -29861 40100 292073
17484 292073 54994 219744 200447 -294012 6071 28758 147184 58988 73526 148411 -171621
17472 278322 104929 85811 27453 387936 155451 130762 32534 -144360 385137 2167 285881
17461B85881F7629k6737d9506B28228M6347o9289p2484M2314P2477r6834J50250
17450C01009J28379j10166q5941R7402A56479N3569j02278A8494N7441J02635
17440A78570j5608L16462j32893E9835K35153E3412J71531B8418E361a4520E3289
17428E90683k63116A62701J2763L03937j67835r082A26886K52191n3875J9946
17418C45148a1417C24765L53250B88516J08028j04454A26838a1133B22785L51833
17408E74618A35503Q0827Q9483k8212G6821a11665A88885c70516B20888H7553
17397B33223J37308A82394E8544K289a42999I0808e9356H1281L88844H0378M6440
17386A26818e467H3587J87728A11571C7367J15345a06980A90863m8989R6859A04661
$$ plain form
17461 285881 67629 40892 -49506 228228 274575 205286 132802 175116 247593 150759 301009
17450 301009 429388 319222 233281 330683 156479 210048 107770 18494 75935 178570
17440 178570 162962 479424 346531 59835 294988 53412 224943 28418 5361 -14520 53289
17428 590683 327567 162701 175464 479401 311566 302484 126886 379077 325202 345148
17418 345148 -11417 324765 678015 288516 396544 292090 126838 -11133 222785 574618
17408 574618 135503 216330 305813 277601 76821 -111665 188885 -370516 220888 87553
17397 233223 370531 182394 58544 60833 -142999 90808 -59356 81281 470125 80378 126818
17386 126818 -5467 83587 271315 111571 37367 152712 -106980 190863 141874 238733 104661
17374B79966M9039F3693N8825L94569B05086J66563d6203B09052J04296B3009
17363B92528B7687O2844J16386H251c0307B60402a08644p100Q950C19158D1869
17351C44383a4867I2867J38262r1449a15973j94493A27616A4108K88387A37508
17340A03534a51754A12061J88187F9984d1256r5429F935L28837e8556A65457c16587
17328C94742A30952a13257H1279J51887k6099d4198A60387a40765E0639L78474
17318D29113A48056K27999c8315G4801M57853a5656D22919c2874G4144K81342
17308C55486A00720C4496i4617B12754K0201I8729K12740E2106K34073r2407a5755
17296B7848J68836k2207a63693G5310A2145J4671J76717H6114a75366A17902d5082
$$ plain form
17374 279966 329005 63693 122518 517087 205086 371649 -46203 209052 313348 23009
17363 292528 27687 90531 206917 8251 -30307 260402 -108644 -115744 -106794 319158 41869
17351 344383 -14867 92867 231129 139680 -115973 -310466 127616 14108 302495 137508
17340 103534 -151754 112061 300248 69984 -41256 -136685 6935 335772 -58556 165457 -316587
17328 394742 130952 -113257 81279 233166 207067 -44198 160387 -140765 50639 429113
17318 429113 148056 376055 -38315 74801 532654 -15656 422919 -32874 74144 355486
17308 355486 100720 34496 -94617 212754 232955 98729 311469 52106 286179 193772 -15755
17296 27848 196684 174477 -163693 75310 12145 26816 203533 86114 -175366 117902 -45082
17284B15005G2205i8408B579K85646J25478d976I9319l3892K46669a00547B94311
17272A12974g17B49644b93393A97702P5762m3647A09561d2028B72774q2833O3114
17261B53055m6040P5555N6137I7254L6954J68492m8314P486c3526r72C59858j24932
17249B34926a25557A4769a7668B6311j0104d02319G3452J17601N6496B0843J81839
17238B02682b8971B70076m9650g3049A03712b3047A50136J85872j18468o685g3103
17226I9817J65837B2665P2765e517I3105K34691j22971d531E87965a15200D83889
17214B58191Q0667r3728K33762j37913J63749A13134i285C70959A16160M36824
17204E52984a62809D80334E8009K65849n0337a75001A50309b7325G312K67288
$$ plain form
17284 215005 72205 -98408 2579 288225 413703 -4976 99319 65427 312096 -100547 294311
17272 112974 -717 249644 -293393 197702 273464 229817 109561 -42028 272774 189941 253055
17261 253055 207015 282570 338707 97254 134208 302700 254386 261872 -33526 -34498 359858 234926
17249 234926 -125557 14769 -17668 26311 16207 -402319 73452 191053 247549 20843 202682
17238 202682 -28971 270076 220426 -73049 103712 -23047 150136 336008 217540 210855 -73103
17226 99817 265654 22665 95430 -5517 93105 327796 204825 -4531 587965 -115200 483889
17214 258191 338858 245130 478892 340979 504728 113134 -9285 370959 116160 552984
17204 552984 -162809 480334 58009 323858 273521 -175001 150309 -27325 7312 274600
17194B74600I9768K91774j80667O1213p7727L5544c4374A17937L2565a69544B8633
17182G1239C4508J51871n0584J70028J22106B6237M12442K05248j06061o9216
17172D68650j8128j5715j81507J44211A08435J35903m3918J17489F8561d299A14957
17160B90609j08456m4475K78862p6089I9867L04336j18946n0418p190f0865D22106
17148B44394r2548K19134J43219E3514K22192N28944C91122N8839p862o819Q7684
17137E22964j11694r7840P3264a6054B29668K21498K04481k70351R2612n8409
17127D19499j39531q718n221K72334k18445r9081J64915k727d985C02301j44338
17116A57963K71117j56421J1859K278k0874J17189k7741j70247k215J39617k1848
$$ plain form
17194 274600 99768 391542 210875 272088 194361 229905 -34374 117937 150502 -169544 28633
17182 71239 34508 186379 135795 305823 427929 26237 438679 643927 537866 468650
17172 468650 450522 434807 253300 397511 108435 244338 200420 317909 68561 -4299 114957
17160 290609 182153 137678 416540 340451 99867 404203 285257 234839 227649 -60865 422106
17148 244394 151846 370980 514199 53514 275706 804650 391122 449961 442099 435280 522964
17137 522964 411270 313430 386694 -16054 229668 451166 655647 385296 477908 419499
17127 419499 279968 271250 266029 538363 319918 220837 385752 383025 -4985 302301 157963
17116 157963 429080 272659 284518 286796 265922 383111 355370 185123 182908 322525 300677
17105C00677p1615J46293j77259d2154B06458E4881M8393K13348H4356M17654
17095E02010n3959r9231J73083F0114K90924j25284M39678B46742J5918K32105
17085D94765B00005L32418K3080A87873Q8320K67782B21506J90302J46676j31280
17075D27204J10724n411B40394N3773J91286n6971J10591J6866O9080B72475P4648
17064C47123l222J37542j29854p5985R9207K8677j67186J00389J35078J5478P9991
17053E67238j60969m9395j0633J73570j62894R7447j89542R4407N2609J03070
17043E14908k04326J33875J31974m3121l9180J27394j99869L469J39964M9875
17033F14963j26732L9605l045L75386l51485k03422M15967B95913L95653j43342
$$ plain form
17105 300677 229062 375355 198096 -42154 206458 54881 103274 316622 84356 502010
17095 502010 448051 348820 521903 60114 351038 225754 665432 246742 262660 494765
17085 494765 200005 532423 555503 187873 276193 543975 221506 411808 558484 427204
17075 427204 537928 532517 240394 294167 485453 428482 539073 555939 625019 272475 347123
17064 347123 343901 481443 351589 275604 374811 403488 236302 336691 471769 487247 567238
17053 567238 406269 356874 346241 519811 356917 454364 264822 359229 411838 514908
17043 514908 310582 444457 576431 533310 494130 621524 421655 425124 565088 614963
17033 614963 488231 527836 524791 900177 548692 345270 761237 295913 691566 548224
17023E48224K62286j95291L20848m64170L20689k30680K2160k16515M79966B79259
17012E89100O9475J45071l61131J81594n4691J64684m6815L1501k49806J182K95578
17001G65742j81993j64234L59435j49784j1079J90648j29996K3369R3495j15936
16991F79667J47177j67258o0464J7999K47983l54515L40195l17780K10103K39693
16981I82800j95800K01942m07741M95969j94609J43571j52022k8790j0170Q4885
16971I20035j19250k1043J56595R3498k66560J96776j72007j5113K02038K42293
16961A217262l07075P352R2848k50618L85846k83939J99943k68915K30400Q4555
16951A107659l85619O67639l08142M1431q3753K50911n04138N99457o44865M59095
$$ plain form
17023 548224 810510 615219 936067 471897 792586 561906 584066 367551 847517 279259
17012 589100 658575 803646 442515 624109 569418 734102 687287 718788 468982 470164 765742
17001 765742 583749 419515 778950 629166 618087 808735 678739 702108 795603 679667
16991 679667 826844 659586 599122 617121 865104 510589 850784 533004 743107 982800
16981 982800 787000 988942 581201 1077170 882561 1026132 874110 845320 835150 920035
16971 920035 800785 779742 936337 1029835 763275 960051 788044 772931 974969 1217262
16961 1217262 910187 917539 1010387 759769 1145615 861676 1061619 792704 1023104 1107659
16951 1107659 722040 1389679 1081537 1122968 1039215 1290126 785988 1385445 740580 1199675
16941A199675K35919m9640o29225K01421o5488N11937o9346j59719j07687j61045
16931I06802K36321j81043N24202N3490k53539J67600j75424p0204P5179k12271
16921A071113L61611l25609J53255L57050J44665l05247l8550J42476j2033M9406
16911A598137l54762L31540J69997k68118K9701K80997l53580M11975J8239o58868
16901A205258M57874q8180j43061K39147l12224M08785j12590K27625j25891o3270
16891A693473K89617j48047k47862m496L15227m5717J25010l17875K48042M69614
16881B376986m02778j39733O1322L69005M9447l26869K48174L08259l6237j86291
16871B321285J77230j30625p7101j84264J25999M54150l62537K54810o2738O8729
$$ plain form
16941 1199675 1435594 1385954 756729 958150 892662 1404599 1335253 1175534 1067847 906802
16931 906802 1143123 962080 1486282 1539772 1286233 1453833 1278409 1208205 1283384 1071113
16921 1071113 1432724 1107115 1260370 1617420 1762085 1456838 1418288 1560764 1548731 1598137
16911 1598137 1243375 1574915 1744912 1476794 1506495 1787492 1433912 1845887 1864126 1205258
16901 1205258 1663132 1574952 1431891 1671038 1358814 1767599 1655009 1882634 1756743 1693473
16891 1693473 1983090 1835043 1587181 1582685 1897912 1852195 1977205 1659330 1907372 2376986
16881 2376986 1974208 1834475 1895797 2264802 2314249 1987380 2235554 2543813 2507576 2321285
16871 2321285 2498515 2367890 2290789 2106525 2232524 2686674 2324137 2578947 2516209 2584938
16861B584938k62656J13755J63041M59267k75515K45176R7903j72178J99779j97063
16851B956447J65215j50076K08388Q8154P722R0557J01751K2858L6310q3356J73490
16840C617460R5426J5557J09784O6538J36683J25270j71037K02574r6755K39803
16830D341303l01991M91278L320L64763j13278L35454m38429N94776j46007k9466
16820E101723K71376m0072K82450O4570k5002m2015J63571k15670O35694J36131
16810F332756L9879J35621j35191L69921L88376j15212L72910K78455L6404K45092
16800G949011L18177P9107J66957J08441L03402L61948k20768N46679k13152N33102
16790I932904J72024M25042M95777M0524J26547L83821N65681J84778N42986j8407
$$ plain form
16861 2584938 2322282 2436037 2599078 3058345 2782830 3028006 3125909 2953731 3153510 2956447
16851 2956447 3121662 2971586 3179974 3268128 3275850 3366407 3468158 3491016 3527326 3443970 3617460
16840 3617460 3712886 3728443 3838227 3904765 4041448 4166718 3995681 4198255 4101500 4341303
16830 4341303 4039312 4530590 4533910 4898673 4785395 5120849 4682420 5277196 5131189 5101723
16820 5101723 5373099 5333027 5615477 5680047 5655045 5613030 5776601 5560931 6196625 6332756
16810 6332756 6372635 6508256 6373065 6742986 7131362 7016150 7389060 7667515 7703919 7949011
16800 7949011 8267188 8346295 8513252 8621693 8925095 9287043 9066275 9612954 9399802 9932904
16790 9932904 10104928 10529970 11025747 11066271 11192818 11576639 12142320 12327098 12870084 12851677
16780A2851677P72328M43317M22001K86276N23717M05410O41628N25150M58338
16771A7329842M87426N52789O96628J039318L46771P87231J009496Q10844J009951
16762B4070296R84409O85830J311663J183299Q59260J432451J216106J393462
16754C3136776J672758J404107K201797J321379J914430K452081K119917J940669
16746D8163914K802933K555460L087746L325465K560959L670845L684653M093749
16738G3945724M233133M186431M953759N083180N405344N219295N634344N930252
16730A14591462O016228O515896O275557O157245O677108N399481N599987N082595
16722A62315559L833739L690922K632594J708396K18600l38904k026249k587144
$$ plain form
16780 12851677 13624005 14067322 14489323 14775599 15299316 15704726 16346354 16871504 17329842
16771 17329842 17817268 18370057 19066685 20106003 20452774 21240005 22249501 23060345 24070296
16762 24070296 25054705 25740535 27052198 28235497 29094757 30527208 31743314 33136776
16754 33136776 34809534 36213641 38415438 39736817 41651247 44103328 46223245 48163914
16746 48163914 50966847 53522307 56610053 59935518 62496477 66167322 69851975 73945724
16738 73945724 78178857 82365288 87319047 92402227 97807571 103026866 108661210 114591462
16730 114591462 120607690 127123586 133399143 139556388 146233496 151632977 157232964 162315559
16722 162315559 166149298 169840220 172472814 174181210 174399810 174060906 172034657 169447513
16714A69447513l558975m908393m713326n578408o116634o695708o141575o608757
16706A25125737o354826o314350o033560n797759n823198n231004m938694n023932
16698G9608414m046825m161345l982013l834636l445779k994057l441675k589124
16690E1112960k561152k369634k677523j983795j708909k289655j528702j745899
16682C4247691j435430j419517j374574j488664j019796j026260j221198r78105
16674B4284147q43580j022134n79361j095074p78294p05895o45248o13827r68687
16665A7032047m07209m88586n70258o00479j61696n21080m26598o82113k93564
16656A2880464k86451k40503m40402n36014j02678l02317n08972j63919o32759
$$ plain form
16714 169447513 165888538 160980145 156266819 150688411 144571777 137876069 131734494 125125737
16706 125125737 118770911 112456561 106423001 100625242 94802044 89571040 84632346 79608414
16698 79608414 75561589 71400244 67418231 63583595 60137816 57143759 53702084 51112960
16690 51112960 48551808 46182174 43504651 41520856 39811947 37522292 35993590 34247691
16682 34247691 32812261 31392744 30018170 28529506 27509710 26483450 25262252 24284147
16674 24284147 23440567 22418433 21839072 20743998 19965704 19259809 18614561 18000734 17032047
16665 17032047 16624838 16136252 15565994 14965515 14803819 14282739 13856141 13174028 12880464
16656 12880464 12594013 12353510 11913108 11377094 11274416 10972099 10463127 10299208 9666449
16647I666449J62189l72117n00876P714m76765j75313k43266J13661m06479m05065
16637G370132M0634l7542m43264j28885J26035m54417J20162O629n44277J47523
16627F202730m69767O597m87666L63906R2114o65551L73960o55333R6492J94835
16617E052317J11319k44352k29887m2094o3234r7156k25240K2251k8184k84085
16607C971655m012N7394l79111K6532J44653j25346O460o6941p8904p8147q0889
16596C393344j81373L5335o7030J59896o26336L94642k22797j80642K52138m7676
16586B909501m06139K01958K8398p6974k24829M10824j58008n04872L17364J16296
16576B613519k82735J17833q0965J25360k06242o766J09985j81295K9204O8105
$$ plain form
16647 9666449 9828638 9456521 8955645 8963359 8486594 8311281 8068015 8181676 7775197 7370132
16637 7370132 7410766 7373224 6929960 6801075 6927110 6472693 6592855 6599484 6055207 6202730
16627 6202730 5732963 5739560 5251894 5615800 5707914 5042363 5416323 4760990 4857482 5052317
16617 5052317 5163636 4919284 4689397 4647303 4584069 4486913 4261673 4283924 4255740 3971655
16607 3971655 3967643 4025037 3645926 3672458 3817111 3691765 3698225 3631284 3552380 3474233 3393344
16596 3393344 3211971 3247306 3180276 3340172 2713836 3108478 2885681 2705039 2957177 2909501
16586 2909501 2503362 2705320 2733718 2656744 2431915 2842739 2684731 2179859 2497223 2613519
16576 2613519 2330784 2448617 2367652 2493012 2286770 2280004 2389989 2208694 2237898 2306003
16566B306003j07586k41289j23974q8512K76862L29185l79499J17601j30581k1084
16556A937126j27306K63559j72332k09003J30461M2035j51901m119J03395p3962
16546A737953n3854n6644J60273k39251k1774j43019Q2148J10623k24885K92987
16536A644557r1198k39356Q3529M11259k64561j53k87747l7297O8286L34031n4201
16525A567149k95314k33728J90616P5435l82653J99214J67582J56805j9870n71192
16515H54044K46984L04836j05965J94460k40272j16052O8508q8170L5744J8908
16505A173025j19436J22125L24860l49848j12655J8398j36525N1150J99684j26152
16495A044626L11344m61818R1105N0249r1578l7312J17340K5338l24016P9126
$$ plain form
16566 2306003 2198417 1957128 1833154 1744642 2021504 2350689 1971190 2088791 1958210 1937126
16556 1937126 1809820 2073379 1901047 1692044 1822505 1864540 1712639 1708520 1811915 1737953
16546 1737953 1684099 1627455 1787728 1548477 1526703 1383684 1465832 1576455 1351570 1644557
16536 1644557 1553359 1314003 1397532 1808791 1544230 1544077 1256330 1219033 1287319 1621350 1567149
16525 1567149 1271835 1038107 1228723 1304158 921505 1120719 1288301 1445106 1425236 854044
16515 854044 1101028 1405864 1299899 1494359 1254087 1138035 1206543 1118373 1154117 1173025
16505 1173025 1053589 1175714 1500574 1150726 1038071 1056469 919944 971094 1170778 1044626
16495 1044626 1355970 894152 985257 1035506 943928 906616 1023956 1049294 725278 804404
16485H04404L04682m2654J29687j68991k01561l11485L18223l9378r0517N653
16475G08063K40144k91632K20268k43888j2937K35303k47109j37095J42766J59167
16465G73050Q4908D04534L60016J21147K71168l11438k19063J57246K49762k1759
16455A011613l59978R6197j12928L626l2819l7274P5830J59635k59142j29800
16445D14960K79572k46764L15388k70819J07722J99776B64932M42800L5840k60701
16435D82871K94561B99380L29345J93741j61973j28604j22075j55881J36806L41186
16425G31925k24150O1707J2375m2073l3143j97098O2661M79158k69279J5620J4271
16414F11974K9847A67475O35968k76742K53804C32143L15471o3497n6636j1091
$$ plain form
16485 804404 1109086 1066432 1196119 1027128 825567 514082 832305 792927 702410 708063
16475 708063 948207 656575 876843 632955 620018 855321 608212 471117 613883 773050
16465 773050 857958 404534 764550 885697 1156865 845427 626364 783610 1033372 1011613
16455 1011613 651635 747832 634904 638530 605711 568437 644267 803902 544760 414960
16445 414960 694532 447768 763156 492337 600059 799835 264932 707732 743572 482871
16435 482871 777432 299380 628725 822466 660493 531889 409814 253933 390739 731925
16425 731925 507775 569482 581857 539784 506641 309543 372204 851362 582083 597703 611974
16414 611974 641821 167475 803443 526701 780505 332143 647614 584117 527481 516390
16404E16390n1556j87516j6200J52995m567p2706P1803K53168B90646K13903j90338
16393C14211M35626B52174L40691j10354A43842K26933j00671P4199a6832D21431
16382C58495L18494C28603K0558L25972B77663J66476A64327L96144N6910A31905
16371C03231n6197O2915L4359j0312J09167F3105k6263P9653J46765K13468J2009
16360D88737m9576k03442D8271K73468K54951j66895n8100r4561K00460B17164
16349B36487p6937J37008j7401a260D64514B06856J01303k2878J40825B11030
16338B51412A07882K30609l7506J26169j24364j14337R6686n2654J15727j16598
16328B31614J19095j70345O3987R6879C8536K46058o5131d2907C01524j38432
$$ plain form
16404 516390 464834 277318 261118 414113 409546 336840 408643 661811 290646 504549 314211
16393 314211 749837 252174 592865 482511 143842 370775 270104 344303 -16832 421431
16382 358495 676989 328603 349161 675133 277663 444139 164327 560471 617381 131905
16371 303231 247034 309949 344308 333996 443163 63105 36842 116495 263260 476728 488737
16360 488737 439161 235719 48271 321739 576690 409795 351695 257134 457594 217164
16349 236487 159550 296558 279157 -1260 464514 206856 308159 285281 426106 211030
16338 251412 107882 338491 300985 427154 302790 188453 285139 232485 348212 231614
16328 231614 350709 180364 244351 341230 38536 284594 219463 -42907 301524 163092
16318A63092J71375j44470K26696J14726k13169J83913A79498M2896D0072K45262
16308B85334j9455l7303K49370e2243C34345L8990j39890r2108A7589K2831c7835
16296E38502b1402A3944L06885N2404n053A44186O1661J56382D923K34947C8358
16284E04758q8368j23073j04392Q5692F7386b7537A53569J46445e5450A63252
16273A44181m083L17540A25476L1673l5249N9618J52739a93780Q2667A62707F8586
16261A01005J52201M7709K8722F0264a93617B56001q9653p3062L56296A90286
16250C40341B7194K43565n3452e1607C33444r3407D2186J18654b8410B74683j04674
16239A70009K7791I114K59209O286j8085k7179E466L4681O0803I296K28081a3037
$$ plain form
16318 163092 334467 189997 416693 531419 318250 502163 179498 222394 40072 285334
16308 285334 265879 228576 477946 -52243 334345 373335 233445 141337 17589 40420 -37835
16296 538502 -21402 13944 320829 373233 368180 144186 205847 362229 4923 239870 38358
16284 504758 416390 293317 188925 274617 67386 -27537 153569 300014 -55450 163252
16273 144181 140098 457638 125476 157149 121900 181518 334257 -193780 -111113 162707 68586
16261 101005 253206 300915 329637 60264 -193617 256001 166348 93286 449582 190286
16250 340341 27194 270759 217307 -51607 333444 240037 42186 160840 -28410 274683 170009
16239 170009 197800 9114 268323 274609 256524 229345 5466 40147 100950 9296 237377 -13037
16226a07955G0074L94403A12401m9197a88128G6114P3118c03542A05102j1042
16216I4060K38794B8054J94157F1921K51922A54643E0833B0270R6810J54828j6159
16205B55749r6499G5400J95920h1252A33037a07378A14376J89458a23031B42753
16194A82168J55170J9509H7067a65140B04722H6986a74061O6320A6835J49667
16184A66502a59633M8636B74446J63526D9796J70806q2970m1144l0681J22121
16174A87928o125J66361h3309B47638j3279C2313c5646g220B25889G6974C2828
16162B43199a8850B12313J91051J6771j5830a47627D03654j96047J14453C5190
16151B09004e6115j28138j00420D51898b173k0682A22561J3301F4370J08897P508
$$ plain form
16226 -107955 70074 464477 112401 63204 -188128 76114 149232 -303542 105102 94060
16216 94060 332854 28054 222211 61921 313843 154643 50833 20270 117080 271908 255749
16205 255749 159250 75400 271320 -81252 133037 -107378 114376 303834 -123031 242753
16194 182168 337338 356847 87067 -165140 204722 86986 -174061 -107741 16835 166502
16184 166502 -159633 -110997 274446 437972 49796 220602 137632 96488 65807 187928
16174 187928 181803 348164 -83309 247638 234359 32313 -35646 -7220 225889 76974 32828
16162 243199 -18850 212313 403364 420135 404305 -147627 403654 207607 322060 35190
16151 209004 -56115 -184253 -284673 451898 -2173 -22855 122561 135862 64370 173267 180775
16140A80775k1538m1616a41917d7681A60831m117j0408B4540K58004f4789B04447
16128A62334N0671a06208A52944n746D4424J05682o9042a19212p3559e5074A98038
16116B35597p4157K7171a45473j04292H3085N7576K35421g9116B99136c2249B2827
16104A29483M6928K91606A19893P0582J52315A1036P4674f3149j74571R1495j26293
16093b72518a11669B5787J05939n794f9880C5135J07422a30044D2587b45883c4334
16081c3071m5088p9884e6003A4886c2723k42733A6040J44780f1773B42206a03275
16069G4477C010K7357L1911b172j69488p4262D16399f9617L3395B93327D6761
16057i0005j48093C66607b8137p4137m1096A23939l5440d54l5740q3970A21004
$$ plain form
16140 180775 159237 117621 -141917 -47681 160831 156714 146306 24540 282544 -64789 204447
16128 162334 213005 -106208 152944 147198 44424 150106 81064 -119212 -192771 -55074 198038
16116 235597 161440 188611 -145473 -249765 83085 140661 376082 -79116 299136 -32249 22827
16104 129483 176411 468017 119893 190475 342790 11036 85710 -63149 -237720 -146225 -272518
16093 -272518 -111669 25787 131726 125932 -69880 35135 142557 -130044 42587 -245883 -34334
16081 -33071 -78159 -158043 -56003 14886 -32723 -275456 16040 160820 -61773 242206 -103275
16069 74477 3010 30367 62278 -2172 -171660 -245922 416399 -69617 -36222 293327 46761
16057 -90005 -238098 366607 -28137 -102274 -143370 123939 88499 -454 -36194 -120164 121004
16045d047j01065G4793J73125F5601B5J44373F0668J67731a98092A89242C2365
16033f4361B17888c4272o6875a136j98614e488q1469o332Q091l8294n5545h6634
16020h7410j95357J31933A9472h2704A08188M1756a17429k32610H5714d42588
16009B35553e8792a2387o2325A48783k9997a13846F505c0739E714J97932A1288
15997d8490H2677b5860B09890a97840a1057A42123i2911B16749i9585A70081G7756
15985C4170Q8811K88869K0291p0536j24652K33391D8558j0451L10185a44144K0364
15974a23780k35229A93263b76492G1991a87161E1126N839a57389D4641L83536
15964D28177j16719j23829L2479a01D38313a18722k0653c5976H3078O8917a85014
$$ plain form
16045 -4047 -105112 74793 247918 65601 25 144398 60668 228399 -198092 189242 32365
16033 -64361 217888 -34272 -101147 -1136 -199750 -5488 -86957 -93289 -85198 -123492 -179037 -86634
16020 -87410 -282767 -150834 19472 -82704 108188 149944 -117429 -350039 85714 -442588
16009 235553 -58792 -12387 -74712 148783 118786 -113846 6505 -30739 5714 203646 11288
15997 -48490 82677 -25860 209890 -197840 -11057 142123 -92911 216749 -99585 170081 77756
15985 34170 122981 411850 432141 361605 236953 470344 48558 38107 348292 -144144 -123780
15974 -123780 -359009 193263 -276492 71991 -187161 51126 56965 -157389 44641 428177
15964 428177 311458 187629 220108 -101 438313 -118722 -139375 -35976 83078 151995 -185014
15952D1202J02911a34034D6123a16574l9758l8840n4955D9408H029a64335A33388
15940B37869f6690n9459C02238b49737A31637N6779n6089g0298j22325l6890b4386
15928F7734b38652C4609P8007K48092c96804I7200J28967q949c48200E5901a9786
15916B03454a23380e6877K7525l38652A2171e3956o0725M327j08739H8401P6174
15905A64575J20977b35747B19267a00200B35377I8901K55901A55820e3535B72655
15894f4760A10644b43648K1562e3597d037A33124P3892b31179f0552p2658B98203
15882B74873c31425a964k07441r464m6598F3631b39187R6204k211B37828B3166
15870c24444A66379h4446m3684j98949b6468G2955f8916j59320N3986k3400H9060
$$ plain form
15952 41202 144113 -134034 46123 -116574 -156332 -195172 -250127 49408 8029 -164335 133388
15940 237869 -66690 -126149 302238 -249737 131637 188416 132327 -70298 -192623 -229513 -24386
15928 67734 -238652 34609 112616 360708 -396804 97200 226167 217218 -348200 55901 -19786
15916 203454 -123380 -56877 -29352 -368004 12171 -53956 -114681 -110354 -219093 88401 164575
15905 164575 285552 -235747 219267 -100200 235377 98901 354802 155820 -53535 272655
15894 -64760 110644 -243648 -222086 -53597 -4037 133124 207016 -231179 -60552 -133210 298203
15882 274873 -331425 -1964 -209405 -218869 -265467 63631 -239187 -142983 -145194 237828 23166
15870 -324444 166379 -84446 -128130 -327079 -26468 72955 -68916 -228236 -174250 -197650 89060
15858i6054c5955j41009M9483Q143l21436J24523A91339k0104q5613O1605J01925
15847B49152B8170L00909j42848p6540M2311h5506j57595d1752k70488g4818B13110
15835a5671k09450I8438R7445a1341E4130b15872a7271k2923J7841k33199A3622
15823g0338A00487c29718n055Q1854C45271b92023f6283H5765a80316H5714a15013
15811E1885H473a45487c6275A56578a50224o49G1893e5215j29350C6560a54052
15799b3062m3060A03258c03939a3883p3016j2981D1804f1304A01617H375L561
15788A1936b7714A35664J31303l0545C069d8578A17954Q628B298a40154N5425
15777h4729g814E3627b54980A05611l6576a25416o1119l8163j21613I9757L1255
$$ plain form
15858 -96054 -35955 -176964 -127481 -119338 -440774 -316251 191339 171235 85622 147227 249152
15847 249152 28170 329079 186231 109691 152002 -85506 -243101 -41752 -312240 -74818 213110
15835 -15671 -225121 98438 195883 -11341 54130 -215872 -17271 -40194 -22353 -255552 13622
15823 -70338 100487 -329718 -334773 -252919 345271 -292023 -66283 85765 -180316 85714 -115013
15811 51885 8473 -145487 -36275 156578 -150224 -150873 71893 -55215 -184565 36560 -154052
15799 -23062 -66122 103258 -303939 -13883 -86899 -99880 41804 -61304 101617 8375 11936
15788 11936 -27714 135664 266967 236422 3069 -48578 117954 126582 2298 -140154 -84729
15777 -84729 -7814 53627 -254980 105611 69035 -125416 -186535 -224698 -346311 99757 131012
15766A31012b35044K1706d6148m11704a21258L8132B06388b10526a02501L3779
15756f8722B99796h0379C14728a24905j29192n1277a7839C391d644E7511K20998
15745B78509o6249N3824a36645a2195k62981A53920c6189A9506K78757j21762
15735A76501Q5456b04187E8726a0490l02674L2718A05329J07325b92061B36367
15724a39904K2961j70625a17404r5510A01869c91377g4171j32122b0946J166C4956
15712B68428r3892c12519m9137a54659k05210D503b05669I845a6295F2374J70102
15701B32476l067q8420B7734h1718m8954E5456K30426B0447J86198B6640J7807
15690D4447i5330D768b4171k0963B6351b2604o1039H5644i3415l7375c4842j57638
$$ plain form
15766 131012 -235044 -213338 -46148 -457852 -121258 -83126 206388 -210526 -102501 -68722
15756 -68722 299796 -80379 314728 -124905 -254097 -305374 -17839 3391 -4644 57511 278509
15745 278509 212260 266084 -136645 -12195 -275176 153920 -36189 19506 298263 176501
15735 176501 261957 -204187 58726 -10490 -313164 -280446 105329 212654 -292061 236367
15724 -139904 -116943 -287568 -117404 -212914 101869 -391377 -74171 -206293 -20946 -19780 34956
15712 268428 174536 -312519 -361656 -154659 -359869 4503 -205669 9845 -16295 62374 232476
15701 232476 229409 140989 27734 -81718 -130672 55456 285882 20447 206645 26640 44447
15690 44447 -95330 4768 -24171 -45134 26351 -22604 -83643 85644 -93415 -130790 -34842 -192480
15678a92480P2000K8034j4258J1081j4788D74611k08527c8820I5577R8008f1444
15666i3728B90909c2621D282a71762g3735l01418h4697I5583f2443A60178n0648
15655A09530C4990f454j21368j89541D9636i9795A03808a31585a2271j01541b346
15643a86556d2947k2442A14018m802c8040l05720A03464G030c33347a02422F289
15631B4263L7239c4340p3057n5539j01156d9126A56997K9500m0744F1289A1893
15619b47444C3695Q2480A7288e9379J910K7903k7582l0812j92579F9133e71A70764
15606F3996l1940a35783d6015j37324A83240K0830d5815F5433b29801a0745j97463
15595b08208k1900B0466g560D4638a69411A0985c12204K8028c6128N11C637a4398
$$ plain form
15678 -192480 -120480 -92446 -106704 -95623 -110411 474611 266084 -38820 95577 193585 -61444
15666 -93728 290909 -32621 4282 -171762 -73735 -375153 -84697 95583 -62443 160178 109530
15655 109530 34990 -6454 -127822 -317363 49636 -99795 103808 -131585 -12271 -113812 -2346
15643 -186556 -42947 -65389 114018 109216 -38040 -343760 103464 7030 -333347 -102422 6289
15631 24263 61502 -34340 -107397 -162936 -264092 -49126 156997 186497 145753 61289 11893
15619 -247444 33695 116175 17288 -59379 -57469 -29566 -57148 -87960 -280539 69133 -571 170764
15606 63996 32056 -135783 -46015 -183339 183240 204070 -45815 65433 -229801 -10745 -208208
15595 -208208 -230108 20466 -7560 44638 -169411 10985 -312204 -284176 -36128 -35617 3637 -14398
15582f1369C3542a83849A63510b8304r0568F4025J4279h9274m5889g510l9490
15571d7000B31408a04329l5648B34737i644A7129a44888B2476a58467A03503c5103
15559d12440I4172a58967A0043b3065D8476Q9940A6029K9244A3380K24302b59566
15547F1814a97730Q5199j44794c9022A76620c4602a5251G9942A5945P8281d3427
15535h2299D4425E466J70254a63257c8725J2265j83698H2832J1870c68726B094
15523a83505j48686A85761a59522P0453A19019a16080J5789b8582B62889I9983
15512F4353a4817k89353H8961J56515A7360a04141A1766J2028K6143J4235g2125
15500a06943F8742a64724A51485b20058C66604h8354D5227a49994J6293a8712
$$ plain form
15582 -61369 33542 -183849 163510 -28304 -118872 64025 78304 -89274 -135163 -7510 -47000
15571 -47000 231408 -104329 -139977 234737 -9644 17129 -144888 22476 -158467 103503 -35103
15559 -412440 94172 -158967 10043 -23065 48476 138416 16029 45273 13380 237682 -259566
15547 61814 -197730 -112531 -257325 -39022 176620 -34602 -15251 79942 15945 94226 -43427
15535 -82299 44425 5466 175720 -163257 -38725 -26460 -210158 82832 94702 -368726 2094
15523 -183505 -332191 185761 -159522 -89069 119019 -116080 -100291 -28582 262889 99983
15512 64353 -14817 -304170 88961 245476 17360 -104141 11766 23794 49937 64172 -72125
15500 -106943 68742 -164724 151485 -220058 366604 -88354 45227 -149994 -133701 -18712
15489a03026B50707g0091B36163b2974r3840D7734R8934b54572a1731B31477g2430
15477a38631B09445F9304P8818a12160b2983B0935g717j51775j29215A46098b07100
15465C358J43921O391e9417j3128j66272F1308d4322j02103M1957j28795D6752
15453B19076e0298B49892d31j67602e5797F438d2154b564A91361a15476L6456
15442g9020D7984a35325A84423q6259C5072J14010e599n4941l2275A87132c693
15430c1458A88250a40943c2840A59736f1745B25536I0301M1624a81522j0974d8266
15418h1401B78607b65132b8305e008j52765j4283I4103j2079h8489m3461B35847
15406a53656L8365I0825B7042a57872A73035j0632j4243a14049q8173K2509A94272
$$ plain form
15489 -103026 250707 -70091 236163 -22974 -116814 47734 146668 -254572 -11731 231477 -72430
15477 -138631 209445 69304 148122 -112160 -22983 20935 -7717 -159492 -288707 146098 -207100
15465 3358 147279 153670 -59417 -72545 -238817 61308 -44322 -146425 -104468 -233263 46752
15453 219076 -50298 249892 -431 -168033 -55797 6438 -42154 -2564 191361 -115476 -79020
15442 -79020 47984 -135325 184423 98164 35072 149082 -5599 -60540 -92815 187132 -3693
15430 -31458 188250 -140943 -32840 159736 -61745 225536 90301 131925 -181522 -192496 -48266
15418 -81401 278607 -265132 -28305 -5008 -157773 -172056 94103 82024 -88489 -131950 235847
15406 -153656 -115291 90825 27042 -157872 173035 162403 148160 -114049 -202222 -179713 194272
15394A20133k1728a56595D9802K07207A3903J91377a84200A36628g5482A16609
15383G2342p09g4932m0707B4023a32338j67176d1979A47075g3032A99020i7657
15371A24474j9638n2279f2026D12161h3026M0713A39586b5993m7630I1712j8609
15360G3103P1575b54294a11953C3372a97247A8976O1740b3914k0269E5393i4456
15348A04703g9561B34430A8986K927L06426c6232J4561I2425A0598a96396B2166
15336b11458E8897K0113r331h7831A21068A9055J98359L7779F4410E708J03632
15325A09340c89478a04495d5111j7006m7572A38423b57538A1237f5478k1900r5001
15314a82379o3917E0679J98537D7319a56223r4135g5643B52594A0073i9036j21345
$$ plain form
15394 120133 98405 -156595 49802 257009 13903 205280 -184200 136628 -75482 116609
15383 72342 71633 -74932 -115639 24023 -132338 -299514 -41979 147075 -73032 199020 -97657
15371 124474 104836 52557 -62026 412161 -83026 -42313 139586 -25993 -73623 91712 73103
15360 73103 144678 -254294 -111953 33372 -197247 18976 80716 -23914 -44183 55393 -94456
15348 104703 -79561 234430 18986 21913 328339 -36232 -21671 92425 10598 -196396 22166
15336 -211458 58897 79010 69679 -87831 121068 19055 217414 255193 64410 5708 109340
15325 109340 -389478 -104495 -45111 -62117 -109689 138423 -257538 11237 -65478 -87378 -182379
15314 -182379 -246296 50679 249216 47319 -156223 -250358 -75643 252594 10073 -99036 -220381
15303b20381J05258A79746p7159J06109b4942A83073b65827a18553b636o2420
15293f5056B53614i8534A36272b69349A84552f642l5074E7991A6000c5876o5510
15282a01386L0122L4564j28034E405i9890A33547K11746j48540A710a00607l6928
15271a37535A27180l5458m3223J85229e3522H181L18220b21756A22827e3514m230
15260e7744n4744C10550j06735I6447J2467P16Q0596a15694A85464r2496c1935
15248E30449N4967N88647N82488l17969K60737m37453n95008l09654E8626a51007
15237B7616K31965I8112b34719H4610i1126j59068A90277M3053b10161A53957
15226A83770F6661e7596B38747b4747A71474c8337a3999G547c6296l35541f01
$$ plain form
15303 -220381 -115123 179746 102587 208696 -24942 183073 -265827 -118553 -2636 -65056
15293 -65056 253614 -98534 136272 -269349 184552 -6642 -41716 57991 16000 -35876 -101386
15282 -101386 -71264 -36700 -164734 5405 -99890 133547 345293 196753 1710 -100607 -137535
15271 -137535 127180 91722 48499 233728 -53522 8181 326401 -221756 122827 -53514 -57744
15260 -57744 -112488 310550 203815 96447 108914 109630 190226 -115694 185464 92968 -31935
15248 530449 585416 1174063 1756551 1438582 1699319 1261866 666858 357204 58626 -151007
15237 27616 259581 98112 -234719 84610 -91126 -250194 190277 233330 -210161 153957
15226 183770 66661 -57596 238747 -24747 171474 -38337 -13999 7547 -36296 -371837 -601
15214B45028a74030A28026J23990m5130A1816K75637a77800A32727E0475J70082
15204B20557D5524a09676D05710E4698M6253m712e3780c395B02451G102K22414
15193B29516a37977d2820q1844C03138A21512J03759P2863A29864a04644F0453
15182G3762a98990A16044N8103q274a52570L2904A26453K42719a18852k3142C41894
15170d7143k20029A89475a61969f2606j2513C9953M01113b0770p9680E118O9167
15159G4285K1045k8544N4496J5952b10739n2064A98503Q5714b0255A36981J2331
15148A49312A9816f4553r5499C859L43099a40639H7202K12610a45104A98636D7591
15136B16392F986a28350M1584H2469J42811a70788h885E3119J2957c19317A39202
$$ plain form
15214 245028 -174030 128026 252016 206886 11816 287453 -177800 132727 50475 220557
15204 220557 45524 -109676 405710 54698 100951 96239 -53780 -3395 202451 7102 229516
15193 229516 -137977 -42820 -124664 303138 121512 225271 298134 129864 -104644 60453
15182 73762 -198990 116044 174147 165873 -152570 -119666 126453 369172 -118852 -141994 341894
15170 -47143 -267172 189475 -161969 -62606 -75119 39953 441066 -20770 -100450 5118 74285
15159 74285 95330 66786 121282 137234 -210739 -262803 198503 284217 -20255 136981 149312
15148 149312 19816 -64553 -160052 3859 346958 -140639 87202 299812 -145104 198636 47591
15136 216392 6986 -128350 -86766 82469 225280 -170788 -8885 53119 66076 -319317 139202
15124C47509d12380A32335K53049I1125K35156c9818B13965a70474P9425A24805
15113B87179r049k8584J58129A06965l3433f4378B20081A01219d5485H8275L6111
15102A24386Q7931g5361A18490A2625b35904a15696A67919a41219j10207E7857
15091C07501r2848Q5655j14336E1030J92908F3607d3288J9235B39414o0207J32335
15080C11542A05354K17376f0347n2920C38614b70335A38043L18418j94167N7083
15070C19377I7715J7516J31911b56920M7557i617n2801B6772K11212J6653k9165
15059B25472d9362G7106K32580m9401E4958K52404M109I4465R4002a7756A50035
15047G4472Q8183N8852I7164K23874j17444H2583H982b4487F5979M0655n2054
$$ plain form
15124 347509 -412380 132335 385384 91125 326281 -39818 213965 -170474 -91049 124805
15113 287179 278130 249546 407675 106965 73532 -64378 220081 101219 -45485 88275 124386
15102 124386 212317 -75361 118490 12625 -235904 -115696 167919 -141219 -251426 57857
15091 307501 214653 300308 185972 51030 243938 63607 -43288 -24053 239414 179207 311542
15080 311542 105354 322730 -60347 -113267 338614 -270335 138043 456461 262294 319377
15070 319377 97715 115231 247142 -256920 -209363 -9617 -62418 26772 237984 254637 225472
15059 225472 -49362 77106 309686 260285 54958 307362 311471 94465 188467 -17756 150035
15047 74472 162655 221507 97164 321038 203594 82583 8982 -24487 65979 106634 54580
15036E4580J48552Q0832F0979a15748B19809c8746B91053I2337L40725D964P4858
15025G9822J90949J84727k06638A14954E2421J59163K95798A77435j3432b57163
15014A86557C6841K44270P2064J1537r6458A24508P0897J79860a45431c1261C0466
15002B39521q1253D931O0089h984I6100J23768m3392K68740D2860K1544K48072
14991C12476L2965j35720m5578b7093E6161N3272a83196H0713K96077L8338B00292
14979I1294l1789K76967J50804B36516F6131K00012E7147K59969F5792h791B25577
14967A34088m0125M5057i5319C09900k300a34706C30962j22486N777d1110k6765
14956f7875B38580K2430E2866N8700J89267j07523G7153K13536j31262K37948
$$ plain form
15036 54580 203132 283964 60979 -115748 219809 -38746 291053 92337 433062 4964 79822
15025 79822 270771 455498 248860 114954 52421 211584 507382 177435 164003 -257163
15014 186557 36841 281111 353175 364712 268254 124508 195405 375265 -145431 -31261 30466
15002 239521 158268 4931 65020 -8984 96100 219868 176476 445216 42860 64404 312476
14991 312476 345441 209721 164143 -27093 56161 109433 -183196 80713 376790 415128 200292
14979 91294 59505 336472 487276 236516 66131 266143 57147 317116 65792 -8791 225577
14967 134088 93963 139020 -95319 309900 307600 -134706 330962 208476 214253 -41110 -67875
14956 -67875 238580 261010 52866 111566 300833 193310 77153 290689 159427 397375
14946C97375A09098L14511I2388M59957G7677M48363F2216J92273n0862p8136
14936A25491n1840J37481a83774B85977O4574M2371j63370q7890P0516R0677A24879
14924B80763K17742j45854Q5333A53120J2893K02088D9605N8411J72875K3490
14914C04381J20380j28303j8727B169J29476J39978q7791K10874A6471N61440
14904E77911j6576A26057a55501D50076E3430K54036P874J00139E3075K74769
14894C27844J10105o2536A32383L00446n3010r452L6557K00454k7035A86693a08423
14882I1095K23620J12347c4848I1939M62772B37017J22663m6286A10684N60074
14872F70758k57338A78930j2138a60876I4191c1039D00256j36021L10260j18903
$$ plain form
14946 397375 109098 423609 92388 552345 77677 526040 62216 254489 203627 125491
14936 125491 73651 211132 -183774 285977 350551 392922 229552 141662 212178 302855 124879
14924 280763 498505 352651 437984 153120 166013 368101 49605 108016 280891 304381
14914 304381 424761 296458 277731 2169 131645 271623 183832 394706 16471 577911
14904 577911 561335 126057 -155501 450076 53430 307466 315340 415479 53075 327844
14894 327844 437949 375413 132383 432829 379819 370367 406924 607378 580343 186693 -108423
14882 91095 314715 427062 -34848 91939 554711 237017 359680 313394 110684 670758
14872 670758 413420 178930 166792 -160876 94191 -31039 400256 264235 574495 455592
14862D55592J02034r9088Q099j94632J74064j57434k4038K94304j73481K9951
14852D15371J56126N352r1303A50029K79565j16045R9498J00049I6350M01850
14842D98200k31670L27113q9591n2041A14499K9651K4258p3327K84471O7348j16110
14831C30790p681r0957J94716J33053m738A56607N12893B67053J54408r0151K83434
14820F14744j69927J54522p3586J54356n5530Q6436k24706j38431k9947K10224
14810E28155M4406j39663P4148p5582K70757k57155L5379j35981j0960q343L32291
14799F57452B24700G5750L66058L7150p1740o1444j42927l932K76254K09081k03632
14788D80618N8360J00618n9145j9217k47680R1968J69499k37417L89924k46916
$$ plain form
14862 455592 557626 458538 466637 272005 446069 288635 264597 558901 385420 415371
14852 415371 571497 576849 485546 150029 429594 313549 413047 513096 96350 498200
14842 498200 266530 593643 504052 452011 114499 144150 168408 95081 379552 446900 330790
14831 330790 323109 232152 426868 559921 555183 156607 669500 267053 421461 331310 614744
14820 614744 444817 599339 525753 680109 624579 711015 486309 347878 317931 528155
14810 528155 572561 432898 507046 431464 702221 445066 480445 344464 333504 325161 657452
14799 657452 224700 75750 441808 478958 407218 345774 202847 198915 475169 684250 480618
14788 480618 538978 639596 580451 561234 313554 405522 575021 337604 727528 480612
14778D80612K9155m7227L41280k72902M30656C62818n6574L27878B03474K95394
14768D98868K35420A89404L07906L4232Q3392l06756O8660n9385K75055L4000
14758F26508R9786k7531M0070C58089Q6143L41755q0662k66581j04386K35747
14748E70105J57263L4011L3610B86883J17864M24014k97888J69178L13826D15045
14737G30690j38816J70155C25172N99233k95272K61749k03448j07846J06329q3202
14727F02715L35184k62062J86269j79557J61376j93871o5561J76710Q3116m9354
14717G94965J19905l05687K87498l11829j39695M48533j10770j77242J72653r9743
14707F78588j08984O4263L71263k05586K803J03059Q901l04075L96837M4437o3630
$$ plain form
14778 480612 509767 462540 803820 530918 961574 362818 306244 634122 203474 498868
14768 498868 734288 189404 497310 531542 614934 308178 376838 317453 592508 626508
14758 626508 726294 698763 738833 358089 444232 785987 705325 438744 334358 570105
14748 570105 727368 761379 794989 286883 404747 828761 530873 700051 1013877 415045
14737 730690 591874 762029 325172 924405 629133 890882 687434 579588 685917 602715
14727 602715 937899 675837 862106 682549 843925 650054 584493 761203 844319 794965
14717 794965 914870 609183 896681 584852 445157 893690 782920 605678 778331 678588
14707 678588 569604 633867 1005130 799544 802347 905406 914307 610232 1007069 1051506 987876
14696I87876r1911k01578k97020M61666j5408k11676j18554M02013l27264L57956
14686I46100J58221j75326j69495L47697j31716L5255Q9517k25241p8407P6111
14676H72716l8442L4660j71503K03551j97004J59963k41857K49759j8989m6198
14666H06656M91839j84415l30901J89683k24871N32584j39077J7589j18375J53599
14656A194311k70223j19179L19619j77690J54942j59014J90322N8895j39174K27178
14646A279987k92561p6149K02735k07519K39903Q8401J61326k48519L7082K33812
14636A418498n21865M81882m15028J789L05153m8783P7479J1260Q9505n1070l06263
14625A042557K34260R7088P1127m35749J22436L57095k59214J85176J51629k12092
$$ plain form
14696 987876 895965 694387 397367 859033 843625 631949 513395 915408 588144 946100
14686 946100 1104321 928995 759500 1107197 975481 1010736 1100253 875012 796605 872716
14676 872716 834274 868934 697431 900982 703978 863941 622084 871843 852854 806656
14666 806656 1298495 1114080 783179 972862 747991 1280575 1141498 1159087 1040712 1194311
14656 1194311 924088 804909 1124528 946838 1101780 942766 1133088 1191983 1052809 1279987
14646 1279987 987426 911277 1114012 906493 1146396 1234797 1396123 1147604 1184686 1418498
14636 1418498 896633 1378515 963487 965276 1270429 1221646 1299125 1310385 1399890 1348820 1042557
14625 1042557 1276817 1373905 1445032 1009283 1131719 1488814 1229600 1414776 1566405 1354313
14615A354313J06362k62007K84556k17270O6810L1876o7976O8968K5442L34894
14605A725968k75935J70430L2643N5397k97986o2290M93857l89181J43852j44660
14595A452095J73079J39771N0550k24126K68993l5060k67019M72329n12432q9291
14585A428889J03982J18872j3412M40027R95n67069K55453o7919J87529j76550
14575A710797R300K86091j84559P6480K80416j68521P9030k04589O26165k61797
14565B248813m8625J56487m3182K9849R1741K16194k82652J58163J22910J42022
14555B791720N30300O8529K14710L09161O00186J109830K367367N212940J0397353
14546B3602096J3926294j16327A6983943G908208j533603k642922j465955l84859
$$ plain form
14615 1354313 1460675 1198668 1483224 1265954 1332764 1364640 1296664 1365632 1391074 1725968
14605 1725968 1450033 1620463 1653106 1708503 1410517 1348227 1842084 1452903 1596755 1452095
14595 1452095 1625174 1764945 1815495 1591369 1860362 1825302 1558283 2030612 1518180 1428889
14585 1428889 1532871 1651743 1638331 2078358 2079353 1512284 1767737 1699818 1887347 1710797
14575 1710797 1720097 2006188 1821629 1898109 2178525 2010004 2089034 1884445 2510610 2248813
14565 2248813 2200188 2356675 2313493 2343342 2435083 2651277 2368625 2526788 2649698 2791720
14555 2791720 3322020 3390549 3605259 3914420 4514606 5624436 7991803 13204743 23602096
14546 23602096 37528390 37412063 16983943 7908208 6374605 3731683 2265728 1880869
14538A880869Q8423j06537j45109K92876j85972Q8703J35315J81256k00531j53314
14528A875979J91485Q7094J4154K32015l89165Q6983J15450r059k97370L23463
14518B231029K07478n7154J61681q7001o7003L98972n3375l51181J61797K55522
14508B800765j03666L9173j28353J79900k13697p8776L50489K68071n82628M23012
14498B954290Q5944m0026q1296j20557J30373j62862J85250J02844N84739k18153
14488C420546l61922L76545j01546K01674o7640j21233J63450l32651L42716L4176
14478C554115j87615j58791M39800J74094K8659j08667K77382k01730L41087L9483
14468D197817j97752j79470M69117l76806N89261l03868J36181J68658n5909J62802
$$ plain form
14538 1880869 1969292 1862755 1717646 2010522 1824550 1913253 2048568 2229824 2029293 1875979
14528 1875979 2067464 2154558 2168712 2400727 2011562 2098545 2213995 2204936 1907566 2231029
14518 2231029 2438507 2381353 2543034 2456033 2389030 2788002 2734627 2383446 2545243 2800765
14508 2800765 2697099 2736272 2607919 2787819 2574122 2495346 2845835 3113906 2531278 2954290
14498 2954290 3040234 3000208 2918912 2798355 2928728 2765866 2951116 3053960 3638699 3420546
14488 3420546 3058624 3435169 3333623 3535297 3467657 3346424 3509874 3177223 3519939 3554115
14478 3554115 3366500 3207709 3647509 3821603 3850262 3741595 4018977 3817247 4158334 4197817
14468 4197817 4000065 3820595 4289712 3912906 4502167 4198299 4334480 4503138 4447229 4610031
14458D610031m5157r197J10373l25208M10437M02771j14170k3476J30591o9238
14448E077757j52614R9359K27618r1693M3296M25272l02842K56753J03237J41286
14438E827429L9681K27651m3348J85980j74969Q1197m4332L07483K3349L42533
14428F772654k11725n9410L18700j59271K72357k5645L8419N15141l24652M66768
14418G603336j45238O18597j45211K99421R8161m3337N3548J40132L270J78939
14408H661618K08883K93245l73346L27353K97298J49838p0067M03828L89653o2986
14398A0225317O8980R7987K56912L68722k15888K44782N8716M69238R2969L52400
14388A2020135p6267O50678K2425J84526K86243J25973K96613L52685L55891J82894
$$ plain form
14458 4610031 4564874 4555677 4666050 4340842 4751279 5154050 5039880 5016404 5146995 5077757
14448 5077757 4925143 5024502 5252120 5160427 5203723 5628995 5326153 5582906 5686143 5827429
14438 5827429 5867110 6094761 6051413 6237393 6062424 6143621 6099289 6406772 6430121 6772654
14428 6772654 6560929 6501519 6820219 6660948 6933305 6907660 6946079 7461220 7136568 7603336
14418 7603336 7458098 8076695 7931484 8230905 8329066 8285729 8339277 8479409 8482679 8661618
14408 8661618 8870501 9163746 8790400 9117753 9415051 9564889 9494822 9898650 10288303 10225317
14398 10225317 10294297 10392284 10649196 11017918 10802030 11046812 11105528 11574766 11667735 12020135
14388 12020135 11943868 12594546 12616971 12801497 13087740 13213713 13510326 13863011 14218902 14401796
14378A4401796K78497K66894K74884J95959o7390N63038P82680O6169M73325J19627
14368A7355479L50031M06916L23386J28854M67855N52606L12536M17055Q13616
14359B1128334K38623L72125P45633M41444L47546N34210Q03258L08884Q66886
14350B5786943M12687N16464R51636P86311K92595J406927M56320R94023N31476
14341C2135382R97215Q32938P45893J404322P04118R85552J328449J084371J035904
14332D1254144J540200J124862J119168J968498J399451J383265J391192J931278
14324E3112058J702262K150260J836632J783526K306922K266914K419379K700941
14316G0278894K269918K926755K855931L417359L091792L273357L790288L890212
$$ plain form
14378 14401796 14680293 14947187 15222071 15418030 15350640 15913678 16696358 16762527 17235852 17355479
14368 17355479 17705510 18112426 18435812 18564666 19032521 19585127 19897663 20314718 21128334
14359 21128334 21366957 21739082 22484715 22926159 23273705 23807915 24611173 24920057 25786943
14350 25786943 26199630 26716094 27667730 28454041 28746636 30153563 30609883 31603906 32135382
14341 32135382 33132597 33965535 34711428 36115750 36819868 37805420 39133869 40218240 41254144
14332 41254144 42794344 43919206 45038374 47006872 48406323 49789588 51180780 53112058
14324 53112058 54814320 56964580 58801212 60584738 62891660 65158574 67577953 70278894
14316 70278894 72548812 75475567 78331498 81748857 84840649 88114006 91904294 95794506
14308I5794506L908523M387631M529459M993234N206181N168552N826293O027330
14300A35841709O480878O782429P472623P592134Q053559Q579915R220320R494820
14292A99518387J0356987J0221298J1087566J1183360J1978653J2645344J2960509
14285B79952104J3056964J3531988J3892947J3796715J4082993J4153544J3156497
14278C75623752J3122582J1979026J1170720R617284P662124L362841O5980p19815
14270D31884494m75520J045278j409220k761014o711001r452324j1059538j2379293
14262C88681862j3732032j4153525j4659860j4968396j4667800j4651312j4527084
14255B87321853j3820151j3496992j1874984j1873480j2009390j1352617j0533086
$$ plain form
14308 95794506 99703029 104090660 108620119 113613353 118819534 123988086 129814379 135841709
14300 135841709 142322587 149105016 156577639 164169773 172223332 180803247 190023567 199518387
14292 199518387 209875374 220096672 231184238 242367598 254346251 266991595 279952104
14285 279952104 293009068 306541056 320434003 334230718 348313711 362467255 375623752
14278 375623752 388746334 400725360 411896080 421513364 429175488 432538329 432604309 431884494
14270 431884494 431408974 432454252 431045032 428284018 421573017 412120693 401061155 388681862
14262 388681862 374949830 360796305 346136445 331168049 316500249 301848937 287321853
14255 287321853 273501702 260004710 248129726 236256246 224246856 212894239 202361153
14248B02361153j0038854r603629q963961p796981q061117p220735p427745o226200
14240A37021931o396750o198136n149786n223497m912663m551085m475197m509204
14232I5605613l519524k928115l760652l915973k437748l358457l047281k449680
14224G0188183k821077k325583k204217k046116k195094j955544j903303j612045
14216E3125204j692453j724418j242700j674868j334805j594179j416486r25520
14208D1519775j065464j288296p97751j029541j441733r63404m82717j182991
14200C3267878p37467j141944p26603m82212j056477j021769j93847p39788q98351
14191B6269420m79612o14737n89098j096360r0288o61949o6938j217867p1727
$$ plain form
14248 202361153 192322299 182718670 173754709 165957728 157896611 150675876 143248131 137021931
14240 137021931 130625181 124427045 119277259 114053762 109141099 104590014 100114817 95605613
14232 95605613 92086089 89157974 85397322 81481349 79043601 75685144 72637863 70188183
14224 70188183 67367106 65041523 62837306 60791190 58596096 56640552 54737249 53125204
14216 53125204 51432751 49708333 48465633 46790765 45455960 43861781 42445295 41519775
14208 41519775 40454311 39166015 38368264 37338723 35896990 34933586 34450869 33267878
14200 33267878 32530411 31388467 30661864 30179652 29123175 28101406 27907559 27167771 26269420
14191 26269420 25789808 25175071 24585973 23489613 23399325 22737376 22670438 21452571 21380844
14182B1380844n22332l47386l31278n95550l84940m47828j54918n74423l33158
14173A7689031m42916P3683m51984j87901n86104o08722Q4588n67167j91328j94189
14163A4616991m98830l5151k97246L02163n15363m29714k34057L2691n83239j84718
14153A2173527J45524m20249k39123m76496J33740j04978p4271n00500J23337
14144A0760511j02799o04516j17482R4860k60988l92702q0428J72518m78920L63634
14134I353688m9039k27660j18029j18186k90515j0227p0371k50447k68351N1237
14124H002100o7828j57063k82749j8332p48k61540K3148n6369J2J00515l48781
14113F932365j36752L7039l26602N74615n33828j87308k04670O8592J0584r4068
$$ plain form
14182 21380844 20858512 20511126 20179848 19584298 19199358 18751530 18596612 18022189 17689031
14173 17689031 17246115 17319798 16867814 16679913 16093809 15485087 15569675 15002508 14811180 14616991
14163 14616991 14118161 14083010 13785764 14087927 13572564 13142850 12908793 12941484 12358245 12173527
14153 12173527 12319051 11898802 11659679 11183183 11316923 11211945 11137674 10637174 10760511
14144 10760511 10657712 10053196 9935714 10030574 9769586 9376884 9296456 9468974 8990054 9353688
14134 9353688 9304649 9076989 8958960 8840774 8550259 8540032 8469661 8219214 7950863 8002100
14124 8002100 7934272 7777209 7494460 7476128 7475380 7213840 7236988 7180619 7180631 7281146 6932365
14113 6932365 6795613 6832652 6506050 7080665 6546837 6359529 6154859 6223451 6234035 6139967
14103F139967j20873j35789k07753M40739m63632J8584k77934j4226l43564M12955
14093E448474L82547n80422K05493k59877Q4028k53987J95819k86518O9582J83296
14083E188435m05750L22479k41996l21578J82001K4836l32238j63982J69229j25251
14073D296185j09779K93222j41118n7715M0004j36649j7100o2868K57470j43146
14063D218506k90814O5898l88571L29513j46102O02942n15168J79124n98766L56032
14053C812594j61055k90025R3795J50590n22217J70458Q4020r033J24835k31582
14043C222380m9440L38773k64709m20675M35772L360k15832k08477L33809j67503
14033C007458O2730M26064n11662K60487k50828r0839K0700m92956K09844J53289
$$ plain form
14103 6139967 6019094 5883305 5675552 6116291 5652659 5671243 5393309 5379083 5035519 5448474
14093 5448474 5831021 5250599 5456092 5196215 5280243 5026256 5222075 4935557 5005139 5188435
14083 5188435 4782685 5105164 4863168 4541590 4723591 4748427 4416189 4252207 4421436 4296185
14073 4296185 4186406 4479628 4338510 4280795 4320799 4184150 4167050 4104182 4361652 4218506
14063 4218506 3927692 3993590 3605019 3934532 3788430 4391372 3876204 4055328 3456562 3812594
14053 3812594 3651539 3361514 3455309 3605899 3083682 3254140 3338160 3329127 3453962 3222380
14043 3222380 3172940 3511713 3247004 2826329 3262101 3265461 3049629 2841152 3174961 3007458
14033 3007458 3070188 3496252 2984590 3245077 2994249 2903410 2924110 2431154 2640998 2794287
14023B794287J02207k86302n0612o2224j76675K68787J1464M3569r4643j72969
14013B376889j38735L77525o6790j16101p4974q5654k3637M6332R2243J8573j87442
14002B218229P1183J42681k18441n1867n7767j36318Q0601J14146k12250R7799
13992B047996K41325J39454L07450J364544L733553R368936J6064872P145061
13984D0413191j6987323A1037328m030387j869653p48148l19181q89309n5016
13976C125634k8135k53716K27277l95105k72333P9091O3615j39455l72825L21328
13966B355376k71723J42163k19538k06729L52072l6008j27916K20996n6218k87662
13956A864813N1787Q8230l71547L33149k21753J64642j89620k3118j66927N37521
$$ plain form
14023 2794287 2896494 2610192 2559580 2497356 2320681 2589468 2600932 2644501 2549858 2376889
14013 2376889 2238154 2615679 2548889 2432788 2357814 2272160 2248523 2294855 2387098 2405671 2218229
14002 2218229 2289412 2432093 2213652 2161785 2104018 1967700 2048301 2162447 1950197 2047996
13992 2047996 2289321 2428775 2736225 4100769 7834322 17203258 33268130 40413191
13984 40413191 23425868 11037328 7006941 5137288 4389140 4069959 3180650 3125634
13976 3125634 3097499 2843783 3071060 2675955 2403622 2482713 2546328 2406873 2034048 2355376
13966 2355376 2083653 2225816 2006278 1799549 2151621 2115613 1987697 2208693 2152475 1864813
13956 1864813 1916600 2004830 1633283 1966432 1744679 1909321 1719701 1696583 1529656 2067177
13946B067177l66484N7569M6545l8264m2446k97602J55469p7168M46042j89177
13936A761661k63727j37699Q8260L71808j52614k37126R2929J01916l05204L19485
13926A639689k43592M17653m00478J17477j95068O9378K49171k42086j12360L81906
13916A681690m36984M5038n5275J28850j9394L77981o4484m78411K87292k68386
13906A197917j46168K7603K66105j1514q317J46769j89785J54555q9830P6810
13896A424145o2027j86865k54517O14870j59688n2075J51992Q347p0619l97644
13886A015919q1765J62486K06336l27381J12835J78846r2254P3888P6456j89563
13876A135803m05970K93164O8981L8118k52889L49028K14262k20120N5135m17141
$$ plain form
13946 2067177 1700693 1758262 1804807 1766543 1724097 1426495 1581964 1504796 1950838 1761661
13936 1761661 1497934 1360235 1448495 1820303 1667689 1430563 1523492 1625408 1320204 1639689
13926 1639689 1396097 1813750 1413272 1530749 1335681 1405059 1654230 1412144 1299784 1681690
13916 1681690 1244706 1289744 1234469 1363319 1343925 1721906 1657422 1179011 1466303 1197917
13906 1197917 1051749 1079352 1345457 1333943 1325626 1472395 1282610 1437165 1347335 1424145
13896 1424145 1362118 1175253 920736 1535606 1375918 1323843 1475835 1484182 1413563 1015919
13886 1015919 934154 1096640 1302976 975595 1088430 1267276 1175022 1248910 1325366 1135803
13876 1135803 729833 1022997 1091978 1130096 877207 1226235 1440497 1220377 1275512 858371
13866H58371J8855Q3302K0474j55808N13249n8542r5259N1172k91078L53459l10826
13855I87369J80932j85819k21530P2320K25594j89541n6557J18796o5227m805
13845H61532K02650j00109q444K12401l20055K8209k228L91122o25474L79146
13835A018750l8754m6483p2323K81546q9832j39414k58082l2813L57036l49421
13825F30210k1754M75815k86367K52928m25180N1537L02081K8275k91021J36426
13815H52950j65776p3214O83475n52656L35658l76046J92274r5610J55935l1476
13805I25514m45890K21600M0730K56781m48479M70292l65458R8000k1638p4127
13795F57325K2547j89853K04038j40270K45990J31356L40125l86120j08205p3518
$$ plain form
13866 858371 877226 960528 981002 825194 1338443 1279901 1184642 1235814 944736 1298195 987369
13855 987369 1168301 982482 760952 833272 1058866 869325 812768 931564 866337 861532
13845 861532 1064182 964073 955629 1168030 847975 876184 873956 1265078 639604 1018750
13835 1018750 979996 933513 861190 1142736 1052904 913490 655408 622595 979631 630210
13825 630210 608456 1084271 797904 1050832 625652 677189 979270 1007545 716524 852950
13815 852950 687174 613960 1297435 744779 1080437 704391 896665 801055 956990 925514
13805 925514 479624 701224 741954 998735 550256 1020548 655090 753090 731452 657325
13795 657325 679872 490019 694057 553787 799777 931133 1271258 885138 776933 703415
13785G03415R291J8647J547j73956O9023K3392j7836N6785R7574O020k93389K84262
13773G84775R3990P7935k88402k6200j44699J25143j48421J26207K56919k62201
13763E95046j32381O5024K31132j40649k6636j53246J65757K23506j33418l1075
13753F63060l23341J75382P172M12991k4757l15320K09643k2061k16062M1956
13743F08663K76680q4893k20199O1826j1206C10938M58653k28611j4961j5277
13733E10742L01009j51413B68848N75804C72666M57037l94762O0762J64018p3906
13723E85815k36691N36084m10236M47395j70764R2203q1501k15852m2970J72936
13713F76419B68454L21760m6364j37582J06411Q7032j49703R7404k24901K99506
$$ plain form
13785 703415 712706 731353 732900 558944 627967 651359 633523 690308 787882 793902 500513 784775
13773 784775 878765 956700 668298 642098 497399 622542 474121 600328 857247 595046
13763 595046 462665 527689 758821 618172 591536 438290 604047 827553 694135 663060
13753 663060 339719 515101 522273 935264 910507 595187 804830 782769 566707 608663
13743 608663 885343 800450 580251 642077 630871 310938 769591 540980 526019 510742
13733 510742 811751 660338 268848 844652 372666 829703 434941 495703 659721 585815
13723 585815 349124 885208 474972 922367 751603 843806 762305 546453 503483 676419
13713 676419 268454 590214 543850 406268 512679 599711 450008 547412 322511 622017
13703F22017K8843o5800B83750J84489J16062O179B75552k7169L81395n8950k9285
13692E41543j53618j15223Q4978K45950B33039J62053r1645J36308K84670j98890
13682E25535j2715l5720J10426A70313L57507j17980C587Q41215C57958n4543
13672C03415J72533K54908C07407L67462n6165j53737O1383m9934Q3526k78761
13662B81181J96637j74499K70048k82199K32975p75q8532J73552n1127j52426
13652D04835R7200J33947A79723J51506J27310j57450L65411j35533j70998N8116
13642D18085P3766r796J15978k36499J39019A87521K90954j15037m0387r9280
13632B23771Q5407K36843B49207l3416J7258J92192k3576L706A59782K95031R2443
$$ plain form
13703 622017 650860 585060 283750 468239 584301 590480 275552 248383 629778 570828 541543
13692 541543 387925 272702 357680 603630 233039 395092 303447 439755 724425 525535
13682 525535 512820 477100 587526 170313 527820 409840 3587 844802 357958 303415
13672 303415 475948 730856 307407 674869 618704 464967 526350 476416 559942 281181
13662 281181 477818 303319 573367 291168 524143 523368 434836 608388 557261 404835
13652 404835 502035 635982 179723 331229 458539 301089 666500 530967 359969 418085
13642 418085 491851 482055 598033 361534 500553 187521 478475 363438 323051 223771
13632 223771 309178 546021 249207 215791 233049 425241 401665 405371 159782 454813 547256
13621E47256m2592j85706j35999M43278B80727r4859K15007A78086M6535I6756
13610B41166H6121L05484L07806o3484j79838j27765P6676o001Q4593j05696A84664
13598A39274C6505J84542J26000j34364J41851J53964o965Q5221A48495K59888
13588D08383K41256B32022N6244m4509M3971J69537m6447a21132D49580k18181
13578B31399J78906m6969J06351d0629E66304k8109B01353r3356L65953j66497
13568C07453l8093K3004A19651M89509k05234b2795B58607J17971L5186K79240
13558F91004k03589j10302q0049J91034A99382P3443F6614Q895L1432M23867A58063
13546C33998j52630J28253A33220N3568J57072K505n0320J13055m5417L01338
$$ plain form
13621 547256 504664 318958 182959 626237 280727 185868 400875 178086 224621 96756
13610 241166 86121 391605 699411 635927 456089 328324 405000 398999 483592 377896 184664
13598 139274 36505 221047 347047 212683 354534 508498 501533 586754 148495 408383
13588 408383 649639 232022 288266 243757 287728 457265 410818 -121132 449580 231399
13578 231399 410305 363336 469687 -40629 566304 538195 201353 107997 473950 307453
13568 307453 269360 292364 119651 609160 403926 -22795 258607 376578 411764 691004
13558 691004 487415 377113 297064 488098 199382 272825 66614 75509 106941 530808 158063
13546 333998 181368 309621 133220 186788 343860 346365 296045 409100 363683 665021
13536F65021j68441A15454e231B30674K0447H8804M7515o991L8735K39367a993
13524A27430A5308M54508A09111J68927J66176p191j61523L06516k40757k7369
13514C13890I4630K302L43764m6206c3996E08154j63031l6313H7975J57521J2302
13503B57798K00824k25399J80488j38843j16853E9669B7390O097R5816K40508
13493C69811H3450K15378C8114L32390j47671D2241K15782j09176a61272A42707
13482B88802L8891A52976D6081K61682D4170J47241Q1850M0072n9872R67J91525
13471D45953a08225B13132J06151D0259K05623J3728M0329J25755m3819K927H2879
13459A67968O3067K28125A57223D7845K08535J42117J19727F1113M65119k06379
$$ plain form
13536 665021 496580 115454 -5231 230674 251121 88804 136319 129328 168063 407430 -1993
13524 127430 15308 469816 109111 278038 444214 437023 275500 582016 341259 313890
13514 313890 94630 96932 440696 394490 -33996 508154 345123 308810 87975 245496 257798
13503 257798 458622 233223 413711 274868 158015 59669 27390 33487 129303 369811
13493 369811 83450 298828 38114 370504 222833 42241 258023 148847 -161272 142707
13482 288802 327693 152976 46081 307763 44170 191411 273261 313333 253461 254428 445953
13471 445953 -108225 213132 319283 40259 245882 259610 299939 425694 381875 384802 82879
13459 167968 231035 459160 157223 47845 256380 398497 518224 61113 526232 319853
13449C19853j10241o2933K20712B1952K88732k8620J29244A24394K55655Q3882
13439D63931B12958L43608B09990F5606K2129a0670B32447J56402j03764D5387
13428B97895J88774j60578j0019j07759O6396q3200M0333Q4752b3824A06425O8151
13417A74576j3872K78649A136L4292a23438B08896o8842i311C25148j19806L22226
13406E27568A49333K59769A55380a66862F4511J59093Q7291p4282L41474B73002
13395B07463C4524J44331l2560b7019F2959J36556O6882a63774A85555K68888
13385D54443A68770D5594L99558j72314g2361B47262J00792A14682e4201C56476
13374B63090q7282H6715m1881J66616j6195N9922C8466K84122i9462B73699N3292
$$ plain form
13449 319853 209612 146679 367391 21952 310684 282064 411308 124394 380049 463931
13439 463931 212958 556566 209990 65606 87735 -10670 232447 388849 285085 45387
13428 297895 486669 326091 316072 208313 274709 191509 231842 316594 -23824 106425 174576
13417 174576 160704 439353 1136 35428 -123438 208896 140054 -9311 325148 205342 527568
13406 527568 149333 409102 155380 -166862 64511 223604 310895 236613 578087 273002
13395 207463 34524 178855 146295 -27019 62959 199515 266397 -163774 185555 454443
13385 454443 168770 45594 445152 272838 -72361 247262 348054 114682 -54201 356476
13374 263090 175808 86715 44834 211450 195255 255177 38466 322588 -99462 273699 326991
13363C26991j32338L5408A12058K34903D6133P8423M58454a0732D8747K01959
13353B50706j12379Q9133J75329k0653R9251A74686K25011k5398j07284M6765
13343C13780J13444l428A33563J18147J62538a6606C41715q0998K39500B28505
13332B39868n5144p523G2838i8921E58886J75557l05334A75505K38815E1872K60700
13321C12572l5789d7336C77586H4061K52771R6417A5079J62259Q833O4574I146
13309i2874D2390P4589J81259a1134D53610n4920C0726J28740F5571M1510N8269
13298A65350J3617j9796a19730A98894c0946B92034q6454a08521A14172c1808
13287A90328b5680F8896c8033A55725k8228a05759A7421J3243K32233o8389L9481
$$ plain form
13363 326991 194653 230061 112058 346961 46133 124556 583010 -10732 48747 250706
13353 250706 138327 227460 402789 382136 481387 174686 399697 374299 267015 313780
13343 313780 427224 423796 133563 251710 414248 -16606 341715 260717 500217 228505
13332 239868 184724 177201 72838 -98921 558886 734443 429109 175505 414320 51872 312572
13321 312572 276783 -47336 377586 84061 336832 433249 15079 177338 186171 250745 9146
13309 -92874 42390 116979 298238 -11134 453610 398690 30726 159466 65571 107081 165350
13298 165350 178967 159171 -119730 198894 -30946 292034 205580 -108521 114172 -31808
13287 190328 -25680 68896 -38033 155725 127497 -105759 17421 30664 262897 194508 233989
13276B33989J09797D6669e3552n7855B72686N6220j07945j09523O4448P3725E2784
13264A77263a576C17388j05504p3486K3624m4556J86332k5880l3103E6841R5051
13253A51892b1850j1900j5845a3354A02753a46944H5471J9512K35156j15477R2578
13242C17240b2515A22870o560P949m1303J20923L32324a5192A96720P051l9808
13231A63963J15816j6016c9868B07893q1187N5877R2371j03960E1048K26915j04992
13220A72971b05721B37654E632K02272m1220Q1589B8774d1164B2646J67690o9423
13209A20913C1903L61797I249a58631c5234j22728g8082j10334I7878J23172O0567
13198B81617A33739R9140o7715J18389h9377B32866a5028j3332D8615J8904e1591
$$ plain form
13276 233989 343786 46669 -53552 -111407 272686 328906 220961 111438 175886 249611 52784
13264 177263 -1576 317388 211884 138398 162022 117466 303798 277918 244815 56841 151892
13253 151892 -21850 -33750 -49595 -13354 102753 -146944 85471 104983 340139 224662 317240
13242 317240 -22515 122870 116310 124259 82956 203879 536203 -15192 196720 203771 163963
13231 163963 279779 263763 -39868 207893 126706 182583 274954 170994 51048 277963 172971
13220 172971 -205721 237654 5632 207904 166684 248273 28774 -41164 22646 190336 120913
13209 120913 31903 393700 9249 -158631 -35234 -157962 -78082 -188416 97878 221050 281617
13198 281617 133739 232879 165164 283553 -89377 232866 -15028 -28360 48615 67519 -51591
13186i0618C38051f9338n9055M9902j00746H0507J87564a63648B8757f8789E73933
13174a33516B88512c6077n07099d9049B05803b3089F2697b0063C0244I336J59326
13163A68662B056b16065c0353B99357G8458l628J5895i0999G1430K00402H7974
13151C0037K71479p9087A07451J70022j38160b4616A56983i5539d5274A25640
13140E6839B7361L01726q4465j14058c2227D7230g8077A24291J45369d62607B86028
13128A19451c3161B54761J00377j57792Q5046D6K57158k9537n6184g4057A6912
13116I5649O7321h1646F3422b62129k3603D0702P047P3693a03572r8257c446j85132
13104a88578A87000C8062g7542B35367l3256F9746a9865A28297K08742a6496C41361
$$ plain form
13186 -90618 338051 -69338 -128393 -78491 -179237 80507 268071 -163648 28757 -68789 573933
13174 -133516 288512 -36077 -543176 -49049 205803 -23089 62697 -20063 30244 9336 168662
13163 168662 2056 -216065 -30353 299357 78458 74830 90725 -90999 71430 271832 87974
13151 30037 301516 222429 107451 277473 139313 -24616 156983 -95539 -45274 125640
13140 56839 27361 329087 244622 130564 -32227 47230 -78077 124291 269660 -462607 286028
13128 119451 -33161 254761 355138 197346 282392 46 257204 227667 171483 -74057 16912
13116 95649 162970 -81646 63422 -262129 -285732 40702 47749 121442 -103572 -201829 -3446 -188578
13104 -188578 187000 38062 -77542 235367 202111 69746 -19865 128297 337039 -16496 341361
13092A60914l7883d4974A76502G4262M7966l2285A180b22175A9938K20125p0872
13081A69191A9809K22802j19568D261d0935B35505j00082i7076B31769k2298H6756
13069e4247I7132J45820H0304J14277g1594k35099B67527o7886n2715k9057i4783
13057c9386q3923A26407a524j30493C36822A48468a38678A39698Q7408q3818k6224
13046A17064K60198G9458j7079L3227d3408A73656p5446l3563o250c3755k552
13035c6307A80074A4849J72160J12694F6641R4830R6498R7269H7869K03572a23144
13023A31503A7431c6962k6364D16964a81763b0202A7144b5578C17253A44787P3375
13012B18162R8196q9748D0742K31605g1608A38093K87334j11535I2505K84435
$$ plain form
13092 160914 123031 -44974 176502 74262 122228 89943 1180 -222175 19938 240063 169191
13081 169191 19809 242611 123043 4261 -40935 235505 135423 -97076 231769 209471 86756
13069 -54247 97132 242952 80304 194581 -71594 -306693 267527 199641 146926 117869 -94783
13057 -39386 -123309 126407 -1524 -132017 336822 148468 -138678 139698 227106 143288 117064
13046 117064 377262 79458 62379 95606 -43408 173656 98210 64647 58397 -33755 -36307
13035 -36307 180074 14849 187009 299703 66641 161471 257969 355238 87869 291441 -123144
13023 131503 17431 -36962 -63326 416964 -181763 -20202 17144 -25578 317253 144787 218162
13012 218162 316358 226610 40742 272347 -71608 138093 425427 313892 92505 376940
13002C76940j52556m3720J34126j14828q8519g122o2100C23353A33433D9489P7473
12991A26962b57925G3365l0002J0951b0017c554I8820i3028r380N0332D04571
12979a47112B55640n9833J94099A25136B4349J07426d9951A25480a52807e5687
12968A92140j2695A7692M5572J05837o8197d5906a8620A29285d0528p3373C42169
12956A94326J7450a50026E49098d21962c1551A30932d2861j95189i0156K9724
12946f0432r933A16043l9647i171B5257N03346a44883N7300A32082a21637A31399
12934A17252a52206G1128e3387G3503a9024e789B54133p2126n5551J27389G854
12922A43827k1850e1830Nl2858A0730a6591p284o142K275A41078a74613M5325
$$ plain form
13002 376940 224384 180664 314790 199962 111443 -7122 -69222 323353 133433 49489 126962
12991 126962 -257925 73365 43363 54314 -20017 -3554 98820 -93028 -102408 -52076 404571
12979 -147112 255640 195807 389906 125136 24349 131775 -49951 125480 -152807 -55687
12968 192140 179445 17692 63264 169101 100904 -45906 -18620 129285 -40528 -113901 342169
12956 194326 211776 -150026 549098 -421962 -31551 130932 -42861 -238050 -90156 -60432
12946 -60432 -70365 116043 76396 -9171 25257 528603 -144883 -87583 132082 -121637 131399
12934 117252 -152206 71128 -53387 73503 -19024 -5789 254133 182007 126456 253845 7854
12922 143827 121977 -51830 -51825 -84683 10730 -16591 -23875 -30017 -27742 141078 -174613 -129288
12910a29288A57610m9269c09067D0193d5055A5666O9381b26670n3765C14922A07187
12898A15200b60248B04207J098b47299A45362D2469j9390f9733A75132q0299c51906
12886b4673A15052m5310J31K23168O8970R4747a39355d3254G2120J30593g3138
12874C67306m4813c08071A48094o0155J78928C3311b9777A02420a3894l2204C8051
12862c63651F6359e1972k27133H4111l9414g5332j8697A96291F3824L30093e490
12850B54193D4535K7458J55157p3301F4341c832A05885J42824R183a81723A14091
12838D5985k1563d2103g61A12806R7412f4588F3506D458J19907d44946A75472
12826A60667a56991j74410B3667D899a14985C4761Q129N0945P5990m8019D5772
$$ plain form
12910 -129288 157610 108341 -309067 40193 -45055 15666 85047 -226670 -280435 314922 107187
12898 115200 -260248 204207 205305 -247299 145362 42469 23079 -69733 175132 94833 -351906
12886 -24673 115052 69742 69873 293041 362011 456758 -139355 -43254 72120 202713 -73138
12874 367306 322493 -308071 148094 87939 266867 33311 -29777 102420 -13894 -46098 38051
12862 -363651 66359 -51972 -279105 84111 44697 -75332 -94029 196291 63824 393917 -5490
12850 254193 44535 71993 227150 153849 64341 -3832 105885 248709 257892 -181723 114091
12838 45985 24422 -42103 -761 112806 210218 -64588 63506 4458 124365 -444946 175472
12826 160667 -156991 -331401 23667 4899 -114985 34761 42890 93835 169825 121806 45772
12814B12034I6018b21400C546a58318B5737b36665H6598R8069b48649d9831j91834
12803b41665C55638I7223i1866J8271L1743a7236d14A4922a07079M0845I9852
12791a87603B33815a02080A2485c9185B04198m9215J97784G3769J10519i6559
12780C79665G210a81253A56769b02k65487G1052L374n96j6073P6313A6266G634
12767E7282a67259A66033E7323K61622H0945b14878B29038K12877j77272a88875
12756b19166A04020K3801i4663k6217A07851K6378a10981A6089J79103g910A39279
12744b16090B08287E8979a36567n4746A52966b00462A50013a16236c2698B25794
12733C5774Q2525E4243R8035Q4585E2491g7800j92072I8536K49694m4289g7242
$$ plain form
12814 212034 96018 -221400 3546 -158318 25737 -236665 86598 184667 -248649 -49831 -241665
12803 -241665 355638 97223 -91866 -73595 -41852 -17236 -414 14922 -107079 -66234 99852
12791 -187603 233815 -102080 12485 -39185 204198 154983 352767 73769 184288 -96559
12780 379665 7210 -181253 156769 -202 -265689 71052 74426 73830 57757 134070 16266 7634
12767 57282 -167259 166033 57323 318945 80945 -214878 229038 441915 264643 -188875
12756 -219166 104020 127821 -94663 -120880 107851 134229 -110981 16089 195192 -7910 139279
12744 -216090 208287 58979 -136567 -191313 152966 -200462 150013 -116236 -32698 225794
12733 35774 118299 54243 152278 236863 52491 -77800 -269872 98536 348230 303941 -77242
12721H9233a66410d6157D6861b32496a00507C597c19065a27527C3003P7406K63609
12710C74018a76115A67158p975Q1543J7947A29203K13971R6704j04217n9036m6761
12699B29864k0502J18593g1937k830I1174C6008a73316A61743P705m0037d10806
12687B5488a9927C41746g7360A71082o4820g001B64534H8811Q4233a5324A62498
12675C04626g0085r0275D34454a53019A73984F8219d0319I3313a39992j09404
12665b49396A38K17094K55097I0909L5648a46619F5538L24775H9096h3813j51511
12654b35324j42729f9779j8265C78759j74525L6297p4599a41008B19359K7743
12644B47102a02636j43285a0729n8992B02026P689J06153h7815p8442A00037e1642
$$ plain form
12721 89233 -166410 -46157 46861 -232496 -100507 3597 -319065 -127527 33003 110409 374018
12710 374018 -176115 167158 159183 240726 258673 129203 343174 439878 335661 276625 229864
12699 229864 209362 327955 -71937 -74767 91174 36008 -173316 161743 169448 129411 -410806
12687 25488 -19927 341746 -77360 171082 106262 -7001 264534 88811 173044 -15324 162498
12675 304626 -70085 -160360 434454 -153019 173984 68219 -40319 93313 -139992 -249396
12665 -249396 138 217232 472329 90909 126557 -146619 65538 390313 89096 -83813 -235324
12654 -235324 -378053 -69779 -88044 378759 204234 240531 165932 -141008 219359 247102
12644 247102 -102636 -245921 -10729 -69721 202026 209715 315868 -87815 -166257 100037 -51642
12632A24962a75916B04382L6339L8685a60853B5730K67589A26518b2719l69470
12622c92189h2869I8130e0291C0016M16566H9539c6254B90361a37200D2507M6797
12611H9304e6661Q037I8299b34386h1129F9687g6274I5894Q7605a7811m4471a7887
12598a35066A18176K51797j39742J6710I4008i8250B4568a16546j02354A46706
12587b17448L9251B67411G7697K02886J6161A24390e5529F4904J99709j13851
12577A50762a19983F0765K54326j34012k8156b2231A03301a37402f0473q5447
12567a45920a4204H5160h531B06254l7325A6993K61168N8504E9366J6445a51055
12555A16005b61174B78947c38560D6332j5403a8328A4401K77729i7518B23713
$$ plain form
12632 124962 -175916 204382 240721 279406 -160853 25730 293319 126518 -22719 -392189
12622 -392189 -82869 98130 -50291 30016 446582 89539 -36254 290361 -137200 42507 89304
12611 89304 -56661 -48624 98299 -234386 -81129 69687 -76274 95894 183499 -17811 -62282 -17887
12598 -135066 118176 369973 230231 246941 94008 -98250 24568 -116546 -218900 146706
12587 -217448 -178197 267411 77697 280583 296744 124390 -55529 64904 264613 150762
12577 150762 -119983 60765 315091 181079 152923 -22231 103301 -137402 -60473 -145920
12567 -145920 -14204 85160 -8531 206254 168929 16993 278161 336665 59366 75811 -151055
12555 116005 -261174 278947 -338560 46332 30929 -18328 14401 292130 -97518 223713
12544b49598C00723b03119B09759L5346a18836G6405P9118g6084A18741i7440
12533A38722J32268c9456o9584b9862l81282A98238I5469f0375m6808B22682c47671
12521a19642A5681K11738g4107b7667A56077a07266E0593e4331C12755j39529
12511A73226J84757j08283a32491C45677a54916A59969G3088G80L29450o0674
12501B69556D200J05149c7983k21353C42009j39219D6911K6495m584J15307g8890
12489a57197A62723b36017A65028b05418F6485d8447j41965b4717E0880a14097
12478b3809j68898B62027D9117j2741J19661P4817G6075d523j24758m11b4635
12466E9129K15007b28807C3487K22298F4422d1421A02930N0009a7713l0599C10735
$$ plain form
12544 -249598 300723 -203119 209759 245105 -118836 76405 155523 -76084 118741 -97440
12533 138722 270990 -39456 -109040 -29862 -411144 198238 95469 -60375 -107183 222682 -347671
12521 -119642 15681 227419 -74107 -27667 156077 -107266 50593 -54331 312755 173226
12511 173226 357983 249700 -132491 345677 -154916 159969 73088 780 330230 269556
12501 269556 4200 109349 -37983 -259336 342009 202790 46911 73406 68822 184129 -78890
12489 -157197 162723 -236017 165028 -205418 66485 -48447 -190412 -24717 50880 -114097
12478 -23809 -192707 262027 49117 36376 156037 230854 76075 -4523 -129281 -129692 -24635
12466 59129 274136 -228807 33487 255785 64422 -41421 102930 152939 -17713 -48312 310735
12454a2904k5789l61913G2465J0583L24316a48731R898G8537a87712L0967A36226
12442H1333F533K41582b0907I2283J04631N5743G465b6386k50535Q6224a6948
12430A2658a34608A22175c96818a66009F8941b37228j40392B94377G9208a69336
12419b0712j14783b563A22862D3623a21592F4329a6208A91125a12274B75063H031
12407b2397j65788i2946j133B00338q1082b55715J12775A43465C0380Q037h9954
12395B7944a89536I7519b7863D3609Q0892J47203J385A13278c9997D5977i4651
12383B0259F208i8045F3838A6169M4068a80936H3447j0913C672J04341a50205
12371D5783b60291J20804A04870c17473A03382J27985i3996D8742a70606p4199
$$ plain form
12454 -12904 -38693 -400606 72465 83048 407364 -148731 -138833 78537 -187712 -156745 136226
12442 81333 6533 248115 -20907 92283 196914 252657 7465 -26386 -276921 -190697 -16948
12430 12658 -134608 122175 -396818 -166009 68941 -237228 -377620 294377 79208 -169336
12419 -20712 -135495 -2563 122862 43623 -121592 64329 -16208 191125 -112274 275063 8031
12407 -22397 -188185 -92946 -94079 200338 119256 -255715 -142940 143465 30380 38417 -89954
12395 27944 -189536 97519 -27863 43609 124501 271704 273089 113278 -39997 45977 -94651
12383 20259 6208 -98045 63838 16169 60237 -180936 83447 72534 3672 108013 -150205
12371 45783 -260291 -139487 104870 -317473 103382 231367 -93996 48742 -170606 -244805
12361b44805A28020m4420K65414d9469B19346P8741A28586h3703j682F8433b06582
12349A42118b27267h0670B9116M0341K18522a42806H6485D320c67528E3592J14084
12338A67676e1014B25891r0520j2049L441a5602E3184L18444d9102E1016J14978
12327A65994h0437H7519a15604E8223A9300a00506B82234a95638M9770A01164
12316d5512A59683K98065d6731g66r1834A94017a49396D6786d6054j81488A98196
12304b41664c9835m4824k66852i5499I6797f4200j04589o1675r7815J56361C5374
12292A200L3467O9136a02931m2053C32297D842J75192H8253C658L89560f4781
12280A02356J61029e8517C49802m3166p8628I3791c7686H7098L71321F0785O5680
$$ plain form
12361 -244805 128020 83600 349014 -49469 219346 298087 128586 -83703 -85385 68433 -206582
12349 142118 -227267 -80670 29116 69457 287979 -142806 86485 4320 -367528 53592 167676
12338 167676 -51014 225891 135371 123322 126763 -15602 53184 371628 -49102 51016 165994
12327 165994 -80437 87519 -115604 58223 19300 -100506 282234 -195638 -145868 101164
12316 -45512 159683 457748 -46731 -766 -92600 194017 -149396 46786 -46054 -227542 198196
12304 -241664 -39835 -84659 -351511 -95499 96797 -64200 -168789 -230464 -328279 -171918 35374
12292 1200 34667 103803 -102931 -144984 332297 4842 180034 88253 3658 393218 -64781
12280 102356 263385 -58517 349802 306636 228008 93791 -37686 87098 458419 60785 126465
12269A26465K60043B1936J29698j567a33817C6555a43662A5217b63720I7158K1322
12258A18480M5989i6236A77259a27709A63140a36489D89467A23235i3860I0662
12247H3235a02644C31311a22213j2008B9526K15005c20623B55821m1539b49234
12236C59915A79193a32100B3706M20358A37686J03587m9542K2256n5727J92748
12226C51008o3228j899m7024K27035A57312g4532I9906J95893J41257j86637M0833
12215B91252I4923D7198M49032I2857d8038F4844J6214M2627B9380f3779a284
12203C12447j53025J69456L2241r1001r5550n4613C6885K65337j3026H3542L7312
12192A20854K12484j31067K4384O2493j43747b81106B6004L31788A67080m477
$$ plain form
12269 126465 386508 21936 151634 150067 -133817 36555 -143662 15217 -263720 97158 118480
12258 118480 164469 -96236 177259 -127709 163140 -136489 489467 123235 -93860 90662
12247 83235 -102644 331311 -122213 -134221 29526 244531 -320623 255821 214282 -249234
12236 359915 179193 -132100 23706 444064 137686 241273 191731 213987 158260 351008
12226 351008 287780 285881 238857 465892 157312 -74532 99906 295799 437056 250419 291252
12215 291252 94923 47198 496230 92857 -48038 64844 81058 123685 29380 -63779 -1284
12203 312447 159422 328878 361119 270118 174568 119955 36885 302222 289196 83542 120854
12192 120854 333338 202271 226655 289148 145401 -281106 26004 357792 167080 162603
12182A62603L5400C6344J17902n0779e3385k41347A62195a97128B04304b0383
12171B52259a94151G60468A04409a12079C54497L4364j64137G1612k6281j6875
12161B8456O4214K5565L4623a5206k9347D8469d3824B12162L296a59891C48544
12149A41750C2807e1318C73734h6570k0387B5207Q4817C9672Q0816C5787P0246
12138A06033a42798A22035H835b37519B40580C9196M9514K5046J02082j07637
12128A08201L35590C3299K4750K69325B6138a39623A65483D460b37087D3414c40265
12116H2530J8876b9074A13859J78445b9090o6479G0193b41745c2115A04383P3770
12105A78153K542l5437A9640J3674a66054C05010q8048c85015f4948n8482a5444
$$ plain form
12182 162603 198003 36344 154246 103467 -53385 -294732 162195 -197128 204304 -20383
12171 252259 -194151 760468 104409 -112079 354497 388861 224724 71612 45331 28456
12161 28456 92670 118235 152858 -15206 -44553 48469 -43824 212162 215458 -159891 348544
12149 141750 32807 -51318 373734 -86570 -106957 25207 110024 39672 120488 35787 106033
12138 106033 -142798 122035 8835 -237519 240580 39196 88710 113756 215838 108201
12128 108201 443791 33299 58049 327374 26138 -139623 165483 4460 -237087 43414 -340265
12116 82530 101406 -29074 113859 292304 -29090 -95569 70193 -241745 -32115 104383 178153
12105 178153 180695 145258 19640 33314 -166054 305010 216962 -385015 -64948 -123430 -15444
12093A59397a50393e8867b7796A02179A860J59511a738j60628C2784b09959A0836
12081A86568a14555Q335B13625f4458A50663K7207a20568A61683b80116A86006
12070a1352C5479a81908h3403A29034K28060E3611d9592j07863l2892L7868B32656
12058B87608A42214A8802J9551b2917C21443n560A31735k0744K70077A23900o995
12047A16905O54744R6977Q16189F32775A18671k2719N4111d5688H8811L7141D1014
12035a04779I0081B4965a76742N9511g019m8948D5755a17477j14713B31930a3836
12023c53735A49320e28727D15687i0630B07562A6921g3365H4683M12113G1537
12012A22940J60320b3364A02182i3347G4355b46542A15387K1673C5261c9009j92710
$$ plain form
12093 159397 -150393 -58867 -27796 102179 1860 161371 -1738 -162366 32784 -209959 10836
12081 186568 -114555 -106220 213625 -64458 150663 177870 -120568 161683 -280116 186006
12070 -11352 35479 -181908 -83403 129034 357094 53611 -49592 -157455 -190347 -152479 232656
12058 287608 142214 18802 38353 -22917 321443 315883 131735 110991 381068 123900 116905
12047 116905 771649 868626 1684815 632775 118671 95952 150063 -45688 88811 125952 41014
12035 -104779 90081 24965 -176742 -117231 -7019 -55967 45755 -117477 -232190 231930 -13836
12023 -353735 149320 -528727 415687 -90630 207562 16921 -73365 84683 496796 71537
12012 122940 283260 -23364 102182 -93347 74355 -246542 115387 137060 35261 -39009 -231719
12001b31719k4129a6640k7497C7182f9576G2063a6790j13196A7380g9195m6149
11990a25344e9901d619l19346b5180l45962a56016F3596J32613e8254j02783A30173
11978B45963f7385j07379O40m0385A53062c9248i826j43747l401o1261A69675
11966h8602A29986a83164B56250j26855N2328J27067j37398F4015c7658A53847
11955c16174A06319A4835O4159b72907A19408M1950b72376A948a74664B11401
11944A34018a70635B33833a6189I3474a65771I3247B8396L342b57031h8589A48153
11932a72750F9564g6218A48075P6751H0039L0584a20935k146J955J61H890a76322
11919A0214K79391a30680m4519H2523J60484a28285A4972e2539k24991A76355
$$ plain form
12001 -231719 -255848 -16640 -44137 37182 -69576 72063 -16790 -129986 17380 -79195 -125344
11990 -125344 -59901 -4619 -323965 -25180 -371142 -156016 63596 196209 -58254 -161037 130173
11978 245963 -67385 -174764 -174124 -214509 153062 -39248 -9826 -153573 -156974 -218235 169675
11966 -88602 129986 -183164 256250 129395 181723 308790 171392 64015 -37658 153847
11955 -316174 106319 14835 78994 -272907 119408 161358 -272376 1948 -174664 211401
11944 134018 -170635 233833 -16189 93474 -165771 93247 28396 31738 -257031 -88589 148153
11932 -172750 69564 -76218 148075 224826 80039 110623 -120935 -123081 -121126 -120965 8890 -176322
11919 10214 289605 -130680 -175199 82523 243007 -128285 14972 -52539 -277530 176355
11908b14353D0709h7123n8825A41557f2493D2015L8163q726a37015j81904A41615
11896c74306A34309C9907f0312j96491c2307A96375K0517a43780a3381A80316
11885b0436C68411a78967j0762R4392j5281j17408g3924I7301b30842k70742b07611
11873E3843a86900B31704C766a76195l5701B88935j01217J36763i4151j23407
11863b17558F6088K70497F5611R5677d05446E8161b1425j5831B4907d0215k73341
11852c13556I2207l4378K01284a94755A04946J63187A3255b64345A44211c6321
11841a18205B82137A00104c5816k1402b7682G8215g3183B97565b13573A06116
11830b0596B43525B7334a6678k03130c1875p7973A17399j1182l8052e0169A17054
$$ plain form
11908 -214353 40709 -87123 -145948 141557 -62493 42015 80178 71452 -137015 -318919 141615
11896 -374306 134309 39907 -60312 -256803 -32307 196375 216892 -143780 -13381 180316
11885 -20436 368411 -178967 -189729 -95337 -110618 -228026 -73924 97301 -230842 -501584 -207611
11873 53843 -186900 231704 3766 -176195 -211896 288935 187718 324481 -94151 -217558
11863 -217558 66088 336585 65611 161288 -405446 58161 -21425 -37256 24907 -40215 -313556
11852 -313556 92207 57829 259113 -194755 104946 268133 13255 -264345 144211 -36321
11841 -118205 282137 100104 -35816 -57218 -27682 78215 -73183 297565 -213573 106116
11830 -20596 243525 27334 -16678 -219808 -31875 -109848 117399 106217 68165 -50169 117054
11818A04165b78025f9391B67735j30889i2541F8037O2999h1068j14481I3209C9221
11806h788n951p242k15596A03545a1955k8005A09716C2304b15153j86353G2711
11794b64530E4984K9837b77984b9865D28310j08768c69875i5246d237B34428O2193
11783B96621o4901c1225j33632A76629L836o7420f5442A39300b50517d0699j25271
11772a65970O7131E8496Q1602E0217A4276a39469c5265l4456A7318J53919O7889
11761B39126a9702E26899d9678C0027a36549A08828b10404C2063b29102B55071
11750a30650j49158a21455A80971a50897r0809O1798A61325a64924c9069j05294
11740a44363d248q7G2589O404a25589G7469J94689a64861Q0330E2680J53177b6403
$$ plain form
11818 104165 -278025 -69391 267735 136846 -92541 68037 131036 -81068 -195549 93209 39221
11806 -8788 -14739 -21981 -237577 103545 -11955 -39960 109716 32304 -215153 -401506 72711
11794 -264530 54984 84821 -277984 -29865 428310 319542 -369875 -95246 -4237 234428 296621
11783 296621 231720 -31225 -164857 176629 180465 113045 -65442 139300 -250517 -40699 -165970
11772 -165970 -98839 58496 140098 50217 14276 -139469 -35265 -69721 17318 171237 239126
11761 239126 -19702 526899 -49678 30027 -136549 108828 -210404 32063 -229102 255071
11750 -130650 -279808 -121455 180971 -150897 -241706 -179908 161325 -164924 -39069 -144363
11740 -144363 -4248 -4335 72589 78993 -125589 77469 272158 -164861 -84531 52680 205857 -26403
11727H6212a0159C06196b9664B41888b68148B3304b75105B76697a63647A80774
11716B32950C5913K87771j47159m6133d39033A27344J17488q1408L6073C5575
11705E4945J28771L1227l3713d2181E6896h385F1994O7233A5154K01708c4758
11693E6502g5768K7299H5156J3954a56782j16859a3729A08213B0419K77219h306
11681A89858E8777k0976a3586k4163I3709a0395B5411J37495J73856H7710b39819
11669A30750e0835F7454f2616k02363L2289J09396m5547B98916a35286k52876
11659c88162f0321A5343a33191B39104C5615N2259K878B1497J85709a4404r765
11648b4169q9135A11098L53638b37914Q3004N4015C10371A00394g054Q96G6791
$$ plain form
11727 86212 -10159 306196 -29664 241888 -268148 23304 -275105 276697 -163647 180774
11716 232950 35913 323684 176525 130392 -439033 127344 244832 163424 199497 35575
11705 54945 183716 214943 181230 -42181 56896 -8385 61994 129227 15154 216862 -34758
11693 56502 -75768 -48469 85156 99110 -156782 -273641 -13729 108213 20419 297638 -8306
11681 189858 58777 37801 -13586 -37749 93709 -10395 25411 162906 336762 87710 -239819
11669 130750 -50835 67454 -62616 -264979 -232690 -123294 -168841 298916 -135286 -388162
11659 -388162 -60321 15343 -133191 239104 35615 87874 90752 21497 207206 -14404 -24169
11648 -24169 -113304 111098 464736 -237914 -154910 -100895 310371 100394 -7054 -6158 76791
11636g6884C01029G3762L1136l8796N8443m0034l6381J58248J40067C8570a08976
11624b0118A24962J2477i7651E7810e8931F1647J1457a92989h7358H0903K25740
11613C06643D5604N2363j0081a49899B00553o5513E3813K1760a88190R2195M1353
11602e4642F4731j7142M40437A56259a07932j37385h0745F1678b9732J4405L069
11591a2258A13624h2300F7261L82902j98379H7913N2262M73218A30751A3220N8344
11580G1564J70295B4786J60661n0782D7258R7372a44693A68062a4729H2931J47177
11569B30108P667a0264B8940K42618j07002l5697d5280l6855K0910A45087A9816
11557E2826A4253b19885G0976c17462A27238b08318A22185K0406h8017B00741
$$ plain form
11636 -76884 301029 73762 104898 66102 124545 84511 48130 206378 346445 38570 -108976
11624 -20118 124962 137439 -97651 57810 -58931 61647 73104 -192989 -87358 80903 306643
11613 306643 45604 97967 87886 -149899 200553 135040 53813 75573 -188190 -95995 -54642
11602 -54642 64731 47589 488026 156259 -107932 -245317 -80745 61678 -29732 -15327 -12258
11591 -12258 113624 -82300 67261 450163 251784 87913 140175 613393 130751 13220 71564
11580 71564 241859 24786 185447 134665 47258 144630 -144693 168062 -14729 82931 230108
11569 230108 237775 -10264 28940 271558 164556 128859 -45280 -82135 -61225 145087 19816
11557 52826 14253 -219885 70976 -317462 127238 -208318 122185 142591 -88017 200741
11546I6466a65665D1337a03739A61516J170M6489F5658L34670A97395q0276K24097
11535C41216A17502K01853j55127K569M3045h8746J5262A31522a20390A50428
11524A17782J65238E3027K21549a24339B97511G109J27725D3396L58745A50103
11513i60n4380B11441P818g3764J8609A2268K00959Q9876d7067q5814M0429B29497
11500B93625O2203m374H8187B9482J71538O36M0452j0414G3214J80593L303j07168
11488A49942a19222D46777j86558e5852k8128J4525B97036a18654q3393A18602
11477B31303D5770c7894C93483a50004B86167C4555I181a540C83055g5610G3631
11465D797a13618b4024C02171G0834J36538b045G0502L1555i4383B40289l4408
$$ plain form
11546 96466 -165665 41337 -103739 161516 162686 209175 65658 400328 197395 117119 341216
11535 341216 117502 319355 164228 166797 209842 -88746 -73484 131522 -120390 150428
11524 117782 283020 53027 274576 -124339 297511 7109 134834 43396 402141 150103
11513 -960 -55340 211441 219259 -73764 -55155 12268 213227 303103 -47067 -132881 -92452 229497
11500 293625 355828 351454 88187 29482 201020 201656 242108 231694 73214 253807 257110 149942
11488 149942 -119222 446777 260219 -55852 -83980 -69455 297036 -118654 -202047 118602
11477 231303 45770 -37894 393483 -150004 286167 34555 9181 -1540 383055 -75610 73631
11465 4797 -113618 -24024 302171 70834 207372 -2045 70502 102057 -94383 240289 205881
11454B05881L0173a55139A32008l1447N5346a75067j5180G1407N7982J97058A22937
11442B26911g5850A7651K20597A8185J20753n8887J38046i8697A48499L6553a8435
11430F3331h759C05712m4797a69493I3566Q9503n7203l4435k5604f5737a9473
11418a28521M3838A37886E2313K00502k1574e827I1247J24326p7348J50392a9249
11406B62457j27629R6589a51151E2218I518a95654C05857k3323c1280I0329m4203
11395D6126K0703M2603f2021C24881a34571q2493A5048J46983j7518L0249b59181
11383g5999J7071B34282a3555C936K8595J010l650g4511E1921o51F08b4520B67148
11369a20233c6305l3247D7719c05617A72195b03868h3407A72766a24202A4633
$$ plain form
11454 205881 236054 -155139 132008 100561 155907 -175067 -190247 71407 129389 326447 122937
11442 226911 -75850 17651 238248 18185 138938 80051 218097 -98697 148499 185052 -18435
11430 63331 -8759 305712 260915 -169493 93566 183069 125866 91431 65827 -65737 -19473
11418 -128521 -84683 137886 52313 252815 231241 -5827 91247 215573 138225 288617 -19249
11406 262457 134828 231417 -151151 52218 9518 -195654 305857 282534 -31280 90329 46126
11395 46126 66829 109432 -62021 324881 -134571 -217064 15048 162031 144513 174762 -259181
11383 -75999 -58928 234282 -13555 3936 32531 33541 29891 -74511 51921 51270 608 -24520 267148
11369 -120233 -36305 -69552 47719 -305617 172195 -203868 -83407 172766 -124202 14633
11358A68453c10155A43574b53017J25232B49397b3752k79744R5957d2889B23820
11347a91985N8227C86334b3m9015k1011q8782E7703M3136g9106F0780a64629i617
11334B69388a7021m76403a73089r5422h8830A55709a3694B53103D3354i7448J442
11323i6006F6332R606i7098A59302o2696a54925B2478b32605m772B03790L8622
11312B42412B2911b19659B51187a85822O2272C71321E5390J46863g4787A0682
11301E4727a74763P1088G813Q454a17317E0598f6605A64254k4451C1577b7354
11289a58517q0655N5632C5220a45455j6877a1402e304l36401B52450O0135d52316
11277C00818j05981n3463J16480N8368A1126d7056A012L02732b39342L1495g8267
$$ plain form
11358 168453 -310155 143574 -253017 -127785 249397 -23752 -303496 -207539 -42889 223820
11347 -191985 -133758 386334 -23 -49038 -70049 -158831 57703 100839 -79106 60780 -164629 -9617
11334 269388 -17021 -493424 -173089 -268511 -88830 155709 -13694 253103 43354 -97448 -96006
11323 -96006 66332 75938 -97098 159302 96606 -154925 22478 -232605 -237377 203790 242412
11312 242412 22911 -219659 251187 -185822 -123550 371321 55390 202253 -74787 10682
11301 54727 -174763 -103675 7813 16267 -117317 50598 -66605 164254 139803 31577 -27354
11289 -158517 -239172 -183540 35220 -145455 -162332 -11402 -5304 -341705 252450 312585 -452316
11277 300818 194837 141374 257854 316222 11126 -47056 1012 303744 -239342 -207847 -78267
11265h3695l70341a53513E5618d5638F809b2707A39814C9612h3185j27518M5673
11254a65030A53811a8703j30070f9165A20909a05967A43504a32305B40280a11582
11243B33776d5834k79917F6963R9559h9775A78816a49929e9383J6181A44391c589
11231b13248B7352N3080A4649K9433a44291O7070j49407A2076a84191I7344b33263
11219A06427A3877L4703A6111C251e0814B03807b23929b5666k02458k92878B86427
11207a11658j465m0893p6045c9388r1887A60101G7015a70603c7738j21969B23133
11195b09184g4244p5827f1922j17121A19845J14079h6744E3530J94317G8318J4659
11184I2977J57421a49604E4288J81025b01207E9629K21296a02648D5815F752M2269
$$ plain form
11265 -83695 -454036 -153513 55618 -45638 6809 -22707 139814 39612 -83185 -210703 -165030
11254 -165030 153811 -18703 -148773 -69165 120909 -105967 143504 -132305 240280 -111582
11243 233776 -45834 -325751 66963 166522 -89775 178816 -149929 -59383 -43202 144391 -3589
11231 -213248 27352 80432 14649 44082 -144291 -77221 -226628 12076 -184191 97344 -233263
11219 106427 13877 48580 16111 3251 -50814 203807 -223929 -25666 -228124 -521002 286427
11207 -111658 -113123 -154016 -230061 -39388 -131275 160101 77015 -170603 -37738 -159707 223133
11195 -209184 -74244 -150071 -61922 -179043 119845 233924 -86744 53530 247847 78318 92977
11184 92977 250398 -149604 54288 235313 -201207 59629 280925 -102648 45815 6752 49021
11173D9021a73011B18127a00501n4173j95368B36842P9971E3492J76932p8898
11163A51526o4540K5410J29170i6973j84854A73946G2476J38801p4047a54531
11152a55837D0300a50117L6497A53674D6234d27763F7056a4333I5778h6755n300
11141i2055j55498E3829P2299J75595D0732J24934c7707j66693D06417j97410
11131B09007g2113m6056a5966C4583a8224k14775l8358c4243B23895J2075p1865
11120A64105g1006A92115g4268B2266b1180Q664j38902C55941A03101b2160R281
11109a2879e548A02797a39067C77568D3109K99926J20430j48633L1752j58665
11099A87919H2040r423b5004E4946J32805L1755Q8968n1837r7115E5229a40379
$$ plain form
11173 49021 -173011 218127 -100501 -154674 -350042 236842 316813 53492 230424 151526
11163 151526 86986 112396 241566 -96973 -281827 173946 72476 211277 137230 -154531
11152 -155837 40300 -150117 -113620 153674 46234 -427763 67056 -14333 95778 -86755 -92055
11141 -92055 -247553 53829 126128 301723 40732 165666 -37707 -204400 406417 209007
11131 209007 -72113 -118169 -15966 34583 -18224 -232999 -271357 -34243 223895 235970 164105
11120 164105 -71006 192115 -74268 22266 -21180 -12516 -151418 355941 103101 -22160 -12879
11109 -12879 -5548 102797 -139067 377568 43109 343035 463465 314832 346584 187919
11099 187919 82040 72617 -25004 54946 187751 219506 308474 256637 159522 55229 -140379
11087D64762k06577L6164m5754f7811E30301k46958g7086C52754n8915k8149J61917
11076D27607j21318D8595K51699r5538l8134n3096J43638l0989L00018j5551K7061
11065E37703j51852E3005M69468k28169M40060k43447J73691k24389q3695J49535
11055E06059K10709O4309j39324j57182N2505K76876M15859n00082M0429L17157
11045A087315j56047j74211N2707K21006k76171K05183j18084k63133J5152J91659
11035G85376l47576L69974M4456k22141J05848K11891l7193k34532k01526M32490
11025I07067k68437N9564P8255n109C79745K04215J62223j48369q220O0238J13737
11014G63569L58794m32880J63516k54857q6829J43008K68649L9747j51887K5183
$$ plain form
11087 464762 258185 294349 248595 -67811 530301 283343 -77086 352754 293839 265690 427607
11076 427607 306289 48595 300294 204756 166622 113526 257164 226175 526193 510642 537703
11065 537703 385851 53005 522473 294304 734364 490917 664608 440219 356524 506059
11055 506059 716768 781077 641753 484571 537076 813952 1229811 729729 770158 1087315
11045 1087315 931268 757057 809764 1030770 754599 959782 841698 578565 593717 785376
11035 785376 437800 807774 852230 630089 735937 947828 910635 676103 474577 907067
11025 907067 638630 698194 776449 771340 379745 583960 746183 597814 589594 649832 763569
11014 763569 1122363 689483 852999 598142 511313 654321 922970 962717 810830 836013
11004H36013k94443j57792K11607J8722A84244M69988k7470J82171k39123J39719
10994G09529L02842l18050K9697J48842J58235M1313l67562J61463R0179r5792
10984H60696K49178r8273K26252j301q2558J44057M07471l9951J83461K47879
10974B096911J50186N18962j25863N13239j21916J84158q1865r8114l86268J10420
10964B759850l31340m5953m06621K50176P8551k20878J27275J25690Q5463k31250
10954B190963l69524j1158Q7466m94242k03235r9335l93336J57182C44533p203
10944C37330K28202N6243p3131j85650j724M4224J95209B51468O71I6363J8055
10933A14418e3012B25126n6631J59457d9739H049a08670E06036A77749a24316
$$ plain form
11004 836013 541570 383778 595385 614107 184244 654232 626762 808933 569810 709529
10994 709529 1012371 694321 724018 872860 1031095 1072408 704846 866309 956488 860696
10984 860696 1109874 1011601 1237853 1236552 1153994 1298051 1705522 1665571 1849032 2096911
10974 2096911 2247097 2766059 2640196 3153435 3031519 3215677 3133812 3035698 2649430 2759850
10964 2759850 2428510 2382557 1975936 2226112 2304663 2083785 2211060 2336750 2422213 2190963
10954 2190963 1821439 1810281 1897747 1403505 1200270 1100935 707599 864781 344533 337330
10944 337330 565532 621775 548644 362994 361270 405494 600703 251468 252139 96363 114418
10933 114418 -53012 225126 168495 327952 -49739 8049 -108670 506036 177749 -124316
10922D2858J50049l5152G3914K25555A10469a04314D0680f1413A79494K9363a97636
10910B93330i0828j46278A40629b14738G7254d0311B29887n0566A6080J03055
10900A19135n5806b2372G7588f7637F4625f8640j1791j41970B4246K90012j31431
10889A82827e0070A51281O6368F2915a95274Q9052o3953O5285k18008b940k01564
10878b04504Q8653E8489g2192j65381I8020b35702f4903K4484A86297p0646D5941
10866B26324H6603l0067a03584L6483l70310P0937b1598C25693b82231A38088
10855E6490c9434A8477a35251A60573a94111a4310C20338c03391d4718r1959I2236
10843a31327A67300o1584m8677b64638C0549b27020J10914a5405A80723e7142
$$ plain form
10922 42858 192907 157755 73914 299469 110469 -104314 40680 -61413 179494 208857 -197636
10910 293330 -90828 -237106 140629 -214738 77254 -40311 229887 179321 16080 119135
10900 119135 63329 -22372 77588 -67637 64625 -68640 -80431 -222401 24246 314258 182827
10889 182827 -50070 151281 217649 62915 -195274 -106222 -170175 -104890 -322898 -2940 -204504
10878 -204504 -115851 58489 -72192 -237573 98020 -235702 -64903 -40419 186297 115651 45941
10866 226324 86603 56536 -103584 -67101 -437411 -366474 -21598 325693 -282231 138088
10855 56490 -39434 18477 -135251 160573 -194111 -14310 320338 -303391 -44718 -136677 92236
10843 -131327 167300 105716 57039 -264638 30549 -227020 -116106 -15405 180723 -57142
10832F04K12656e6477B98058b6042k00385H2534K7944c0021C5363a04150A87498
10820i2073j49746e5473A93925Q0951a88868d2105B02395d4727B7498b42605o8278
10809c10883B0869a01538P20c6542A78469g2841K519A65413C5368L2332N5864
10798A23564a22506a4258j10816p571A46064D7406A723a75892A07634f3411C83075
10786b69576G0097c1278n4100A77570a06970A41581g7050G5012a80828a2057n5763
10775f7820r4990D6169i1321A06956E800K57236A1234a46278B103c68670a54007
10763a28767K7002j37667J19266d3703D1855A6506J36005d67616e8050B19042
10752i7025D4122B1773K24882b27626C25002i9230C8021e9730B00860a09264r5098
$$ plain form
10832 604 213260 -56477 298058 -26042 -226427 82534 110478 -30021 35363 -104150 187498
10820 -92073 -241819 -55473 193925 274876 -188868 -42105 202395 -44727 27498 -242605 -310883
10809 -310883 20869 -101538 -100818 -36542 178469 -72841 -70322 165413 35368 67700 123564
10798 123564 -122506 -14258 -125074 -132645 146064 47406 1723 -175892 107634 -63411 383075
10786 -269576 70097 -31278 -85378 177570 -106970 141581 -77050 75012 -180828 -12057 -67820
10775 -67820 -162810 46169 -91321 106956 5800 263036 11234 -146278 2103 -368670 -154007
10763 -128767 -101765 -239432 -120166 -43703 41855 16506 152511 -467616 -58050 219042
10752 -97025 44122 21773 246655 -227626 325002 -99230 38021 -59730 200860 -109264 -204362
10741b04362N4283q1461B28664C4175h8366I8014l8309J07779a7890j28101I7983
10729B02620o4095b33284H749Q6993g0254k14824A06439K9673E2590g5361G9742
10717F6303f8998E0247a59402B43590a55572A51344I03b46804A34445d01709a13631
10705I1265b892o8787l447B50767g7963l1737E9839a26686G7369J29765a75625
10693D82114b37516A0758i2105j74631B2095e3148h270B1941c3924j00666e2806
10681B86069a81007B22696b12094a8009p0662A37546n3283E216J57541c73291
10670a66842A43352n7166l674l4986j4411M0337a5867m8734j86792j06319D0985
10658d11337A29081a43453O8031j66406m3426B2708J4906N7318a83201j56216
$$ plain form
10741 -204362 -150079 -231540 228664 34175 -88366 98014 59705 167484 -17890 -145991 97983
10729 202620 138525 -233284 8749 95742 -70254 -285078 106439 136112 52590 -75361 79742
10717 66303 -68998 50247 -159402 243590 -155572 151344 903 -246804 134445 -401709 -113631
10705 91265 -2892 -71679 -75126 250767 -77963 -109700 59839 -126686 77369 207134 -175625
10693 482114 -237516 10758 -92105 -266736 22095 -53148 -8270 21941 -33924 -134590 -52806
10681 286069 -181007 222696 -212094 -18009 -88671 137546 84263 5216 162757 -373291
10670 -166842 143352 86186 82512 47526 33115 73452 -15867 -64601 -251393 -357712 40985
10658 -411337 129081 -143453 -75422 -241828 -285254 22708 37614 94932 -183201 -339417
10648c39417A16970b7030j67195M2213e8239p9386l4681A29690c4139A43920f751
10636A28P9234Q2367f7330o7572B7208b16674B16266a51497o5566j3857A84315
10624b24428N0770g8671e732k92996d8105j85193N0433d408A06447a345k62699
10613b64044D5938b29962M0656j59431a51897H708c16182E330a39114J7824e7698
10601F2452R1620b81489a34293F4624c25635a05896q450A69346h1784A07352A1592
10589c8263l3502K0579j34330j33340g0687b0863G346c1199D3271J64145a83834
10577a74324j00535c7858A0501L08621a32960f0755K0358j71478B95106a75308
10566b18421E7828i5948j6369q8947F6926O018a89589P9766B68135b0722F9942
$$ plain form
10648 -339417 116970 -27030 -194225 -152012 -58239 -137625 -172306 129690 -34139 143920 -6751
10636 128 79362 161729 -67330 -134902 27208 -216674 216266 -151497 -217063 -230920 184315
10624 -224428 -173658 -78671 -5732 -298728 -48105 -233298 -182865 -4408 106447 -1345 -264044
10613 -264044 45938 -229962 -189306 -348737 -151897 8708 -316182 5330 -139114 -121290 -57698
10601 62452 154072 -281489 -134293 64624 -325635 -105896 -114346 169346 -81784 107352 11592
10589 -38263 -71765 -51186 -185516 -318856 -70687 -20863 7346 -31199 43271 207416 -183834
10577 -174324 -274859 -37858 10501 319122 -132960 -60755 -40397 -211875 295106 -175308
10566 -218421 57828 -95948 -112317 -201264 66926 72944 -189589 -109823 268135 -20722 69942
10554a4236k962k10387E0114H743J4465J05454e2922A29856O3852K2373a47232
10542B77905I6121b65768N5448B08132c21386A80602c73671F3030h5612B74048
10531f3229r161a7904o9161c6073a2979o1117o9060B84236a07493l08A7493a92969
10518c05645A48500d5894m7490G5160P586h2621H0737B4634L04126b11965b5846
10506c80391I0677D0750K9115c38979A05578i5751j87197J9423Q3540E2846c8977
10494a5557A4150j513K68401f507H5407A6213a00145G21J69199g2710A06049k0714
10482H5335h6121C44888M2826n2962j08160K72935Q4730k20336A37261o999h755
10470f3285G3060f6304A88737o8570k2075j4210e3181l26446a14260B92286A439
$$ plain form
10554 -14236 -17198 -227585 50114 8743 23208 128662 -52922 129856 193708 216081 -147232
10542 277905 96121 -265768 -210320 208132 -321386 180602 -373671 63030 -85612 274048
10531 -63229 -72390 -17904 -87065 -36073 -12979 -74096 -143156 284236 -107493 -107801 17493 -192969
10518 -305645 148500 -45894 -93384 75160 82746 -82621 80737 24634 328760 -211965 -25846
10506 -380391 90677 40750 69865 -338979 105578 -95751 -282948 -263525 -179985 52846 -38977
10494 -15557 14150 12637 281038 -6507 85407 16213 -100145 721 169920 -72710 106049 85335
10482 85335 -86121 344888 387714 334752 226592 499527 584257 363921 137261 130262 -8755
10470 -63285 73060 -66304 188737 120167 98092 83882 -53181 -379627 -114260 292286 1439
10458h0099A95184a27484C94699a02158K9765j43482R0514A2650b63744j0910
10448b74654N8097B19512d9276I3093J32829a30273B04273b66910q4917G6447
10437B04441d43737A57278D0682M7969N6410f9728H7812A03a64554G5369j4709
10426F0660J11565J99793A19214R352J8816K18745f6531B0947J89130E7108P8417
10415A35525a5401j82362A93319q0741B8690j2570a87473e9499k565B410b28195
10403C12027b09624k1A44956d3229F2415a93508b3135A13879a9096B0645L5956
10392E6601J70676A04288m1550A5165R6708P6158J14950D7909a89485D6440a19862
10380a22240B25013A11128R2375L040J56053P5932A15948N5805n0236L7664J1164
$$ plain form
10458 -80099 195184 -127484 394699 -102158 -72393 -215875 -125361 12650 -263744 -274654
10448 -274654 -216557 219512 -49276 93093 225922 -130273 204273 -266910 -351827 76447
10437 204441 -443737 157278 40682 88651 145061 -69728 87812 103 -164554 75369 60660
10426 60660 172225 372018 119214 128566 147382 366127 -66531 20947 210077 57108 135525
10415 135525 -15401 -197763 193319 112578 28690 16120 -187473 -59499 -62064 2410 -228195
10403 312027 -209624 -209645 144956 -43229 62415 -193508 -23135 113879 -19096 20645 56601
10392 56601 227277 104288 62738 15165 111873 188031 302981 47909 -189485 46440 -119862
10380 -122240 225013 111128 203503 206543 362596 438528 115948 171753 121517 159181 170345
10369A70345J78983J61728J5591Q7926k21617L20094c2007E40955k16063J87826
10359E12718B16198k4287D1346K11645a58120B19689K22687A07908O45830j77281
10349E76457J07448E5887K99830J10362m3256J06982j19159p823l5681A29123
10338E2817J54263j2621K40414A30672J25343K9143R7860a18013b4562a593A84250
10326b8226J0726n4326H9561R0238J42623m636a7382A79983o2536J59770C8421
10314B46683b0942B16564g4899A99925a89269C71112f5143E2723I669a227j7177
10303a8404F8496A922K15351a51567f8420k7908l7375E9271j5357J87021a54704
10291A70156B8537h5025A5364J41394a48014A32331g4068j72250l8694L4433C8658
$$ plain form
10369 170345 349328 511056 526647 614573 392956 713050 -32007 540955 324892 512718
10359 512718 216198 191911 41346 252991 -158120 219689 442376 107908 753738 576457
10349 576457 683905 55887 355717 466079 422823 529805 410646 402823 367142 129123
10338 52817 207080 194459 434873 130672 256015 285158 383018 -118013 -24562 -1593 184250
10326 -28226 -17500 -71826 89561 179799 322422 317786 -17382 179983 117447 277217 38421
10314 246683 -20942 216564 -74899 199925 -189269 371112 -65143 52723 9669 -1227 -18404
10303 -18404 68496 1922 217273 -151567 -68420 -96328 -133703 59271 43914 230935 -154704
10291 170156 28537 -85025 15364 156758 -148014 132331 -74068 -246318 -285012 -250579 38658
10279b08404J02737o1294O3167A53519a91080A19990O6823G5566J4439R3180e9207
10267C14542C3475a5038C11676b09340I0444k7279d9523C00410J38414j04486
10257C34338k042J31741K04128B44394K38344A38209C0656a18175M1708B17580
10246a16098c8153B5266K2228M42052A86b66475A85671a19403l6215e6942E8995
10234I2765a0782F1076J81618F9686a39819K083I8088a32068m6791m5939n8329
10223b83127J40816O1837A75510c33328a34751O6881p4531m4651C5428h0156c7358
10211b27010i0071c8736k3718j94956f5487C5264a54339B21339b7987D1810c27113
10199b90519C3495F694K614J10897C697J91769a60954A90625h0425A1937b21540
$$ plain form
10279 -208404 -105667 -166961 -103794 153519 -191080 119990 186813 75566 90005 183185 -59207
10267 314542 33475 -15038 311676 -209340 90444 63165 -49523 300410 438824 334338
10257 334338 332296 464037 668165 244394 482738 138209 30656 -118175 -76467 217580
10246 -116098 -38153 25266 47494 489546 186 -266475 185671 -119403 -155618 -56942 58995
10234 92765 -10782 61076 242694 69686 -139819 -137736 98088 -132068 -178859 -224798 -283127
10223 -283127 -142311 -80474 175510 -333328 -134751 -67870 -142401 -187052 35428 -80156 -37358
10211 -227010 -90071 -38736 -62454 -257410 -65487 35264 -154339 221339 -27987 41810 -327113
10199 -290519 33495 6694 9308 120205 3697 195466 -160954 190625 -80425 11937 -221540
10187d28204a52939A07982d27735i748A2440P5456c03054a41981j43705H8244
10176b06733P3669F4148a16899e5315A43854h5750C3624b29518c5985l12287C24767
10164a5400k9511k47838P5748A12075a39759B38006b46430G4458C5427n954L88
10153B9861a02880j46936F0947b5063j19043E293b40784N1104f0470O683H565
10141e4778A61705i3500k22383a4305l0407j22935N2236H9584c5866A56186c1714
10129I1506a27796o2713B38989M4054a03535A3959a95064R7491G6846O5540n9516
10118H2870e4115j60986C7116c53096A481K27929G2987e4790A431K7723b78803
10106a53652a7645l6810p8103j98083a29559A4178B885b04350B02425c39756c8066
$$ plain form
10187 -428204 -152939 107982 -427735 -9748 12440 87896 -303054 -141981 -285686 88244
10176 -206733 -133064 64148 -116899 -55315 143854 -85750 33624 -229518 -35985 -348272 324767
10164 -15400 -44911 -292749 -217001 112075 -139759 238006 -246430 74458 35427 29473 29861
10153 29861 -102880 -249816 60947 -25063 -144106 5293 -240784 -189680 -60470 -53787 8565
10141 -54778 161705 -93500 -315883 -14305 -44712 -167647 -115411 89584 -35866 156186 -31714
10129 91506 -127796 -190509 238989 283043 -103535 13959 -195064 -97573 76846 142386 82870
10118 82870 -54115 -215101 37116 -353096 1481 229410 72987 -54790 1431 29154 -278803
10106 -153652 -17645 -54455 -132558 -330641 -129559 14178 2885 -204350 202425 -339756 -38066
10094a73778d4423E0619e6291D8674c57138g6137j73390J13635A23929C1024b7209
10082C27922g1282I0786a94886E7204a2880k47722b3198o3396B75788b04593I1277
10070d07209a43851i085b453l8398C3779J03602o3421c5008B3253J55123p7145
10059A01231b34074f9441C3478h2917A73625h5182b9215l892A588a96389A61268
10047B07026i0325r2767J9600o3429K1399n9523M5137G6951A6269J75100a96489
10035H5295a80806C00897a47203d8721j32965C17179A54800m2169e5705C06937
10024B61431g5478B9786J21064M17a55320L1135A15556J48269c34553A21317b58802
10012a16208o4376P73G9461J4547f6512j81696c34j20099a1279k85367A07869
$$ plain form
10094 -173778 -44423 50619 -56291 48674 -357138 -76137 -249527 -135892 123929 31024 -27209
10082 327922 -71282 90786 -194886 57204 -12880 -260602 -23198 -86594 275788 -204593 91277
10070 -407209 -143851 -9085 -2453 -40851 33779 137381 73960 -35008 23253 178376 101231
10059 101231 -234074 -69441 33478 -82917 173625 -85182 -29215 -33107 1588 -196389 161268
10047 207026 -90325 -183092 -163492 -226921 -205522 -265045 -219908 76951 16269 191369 -196489
10035 85295 -180806 300897 -147203 -48721 -181686 317179 154800 112631 -55705 306937
10024 261431 -75478 29786 150850 151267 -155320 -124185 115556 263825 -334553 121317 -258802
10012 -116208 -180584 -179811 79461 94008 -66512 -248208 -334 -120433 -11279 -296646 107869
10000a90138M3384O3231l11866c4922j38464P3052j33568b1320A17209J551a78285
9988b56806E0112c09806a17022j28626N868F4950a99626A98848c9273k59912A8575
9976a44666I0525h7622B49096b11773M5455c1639j00214k03445A42534a94848
9965c8756a8996p5074D29948g9665r6774A36270b69451B0278J43143g0365A53979
9953b45285e948l2508r0106B33046B736a05630K5155A95367a66441i286j82679
9942a91965B350a02626a8208j72156B28977b46264a21803A21437e09005A27692
9931e7043j34418j94161a13388p9375g6916j03532A90741N8859a93641Q4698k80710
9920c89653d2130J840k87730a51816n7372B28614b93852e7989k52147a07969J1555
$$ plain form
10000 -190138 -146754 -83523 -395389 -34922 -173386 -100334 -233902 -21320 117209 118760 -178285
9988 -256806 50112 -309806 -117022 -245648 -239780 64950 -199626 198848 -39273 -299185 18575
9976 -144666 90525 -87622 249096 -211773 -166318 -31639 -131853 -335298 142534 -194848
9965 -38756 -18996 -94070 429948 -79665 -176439 136270 -269451 20278 163421 -70365 153979
9953 -245285 -5948 -38456 -128562 233046 2736 -105630 -80475 195367 -166441 -9286 -191965
9942 -191965 2350 -102626 -18208 -190364 228977 -246264 -121803 121437 -509005 127692
9931 -57043 -191461 -385622 -113388 -192763 -76916 -180448 190741 249600 -193641 -108943 -389653
9920 -389653 -42130 -40290 -328020 -151816 -209188 228614 -293852 -57989 -310136 -107969 -96414
9909i6414f844k00205h9192b0621C517a63002H7697a57769d7976D3659a40467
9897d58715B7070R715c24998R714d3528j33566B34035e0645k4697j90061A0592
9885H1661c49639B0607g7301K0029P691j27068A23791K3372a36299G4543b2989
9873D06137B755c55503k28849A70681A3596J37831F8927A1306g5330E1909i254
9861a95863d6209o0638j32525a08787B11234f1606j27147M8906f244k07501J00625
9850a13120H1158g2435n9872A42830c8297o7824q7868A95098e2313D4918b376
9838b88083a00393k09748J20148n0470B97627a81406b9023l47006J73639L9985
9828a62405E7434c7734j26971J6454B362a04180A32232a38802N1164l543A33112
$$ plain form
9909 -96414 -6844 -207049 -89192 -20621 3517 -163002 87697 -157769 -47976 43659 -140467
9897 -458715 27070 36785 -324998 -315284 -43528 -177094 234035 -50645 -75342 -265403 10592
9885 81661 -349639 20607 -77301 -57272 -49581 -176649 123791 147163 -136299 74543 -22989
9873 406137 2755 -355503 -584352 170681 13596 151427 68927 11306 -75330 51909 -9254
9861 -195863 -46209 -106847 -239372 -108787 211234 -61606 -188753 -139847 -6244 -213745 -113120
9850 -113120 81158 -72435 -132307 142830 -38297 -106121 -193989 195098 -52313 44918 -2376
9838 -288083 -100393 -310141 -189993 -240463 297627 -181406 -29023 -376029 -202390 -162405
9828 -162405 57434 -37734 -164705 -148251 2362 -104180 132232 -138802 -87638 -91181 133112
9816D9737a24871j10776d7438B0255b56197b2107A69783b45669c0676o9774r1037
9805a91487h3372k57012G0679d6177j60333K3163E39892b49837a23435k11741
9795c35176d8751j55403a00428k20733A26726b0073B10823b75858C55144B2821
9784C46434i860A46420B3765L6231c34765M9241f8248q8133n2769q5165g2550
9772a4060J953o9314A70485A5292P1492c33720B85446a9336q7943c2691a3039
9760a11767L2948K1422j32973l0179Q668F4199O8484b99584N6175h8704j19142
9749b07846B78612C1682J6849N1316D6995Q5066b68507R9184F3745N538j2754
9738E6529P9632e3868q7158l5357j851A10436c60396a31757e5003o3373j00250
$$ plain form
9816 49737 -124871 -235647 -47438 20255 -256197 -22107 169783 -245669 -30676 -100450 -191487
9805 -191487 -83372 -340384 70679 -46177 -206510 -183347 539892 -249837 -123435 -335176
9795 -335176 -48751 -204154 -100428 -321161 126726 -20073 210823 -275858 355144 22821
9784 346434 -9860 146420 23765 59996 -334765 -285524 -68248 -156381 -209150 -294315 -72550
9772 -14060 -12107 -81421 170485 15292 86784 -333720 285446 -19336 -107279 -32691 -13039
9760 -111767 -78819 -57397 -190370 -220549 -211881 64199 132683 -299584 -243409 -88704 -207846
9749 -207846 278612 31682 48531 99847 46995 132061 -268507 -169323 63745 69283 56529
9738 56529 136161 -53868 -141026 -176383 -178234 110436 -360396 -131757 -55003 -118376 -218626
9727b18626Q444F8998a37415C1175j1328K11435b28004c5648F5485C2395d2807
9715a30239B03046a09163b6619l17895a09939E4084a04373G846d5525j05667p760
9704a58952e2280k05009J14286B13274o8539B7128h1285L5827l05048n1016C93152
9692H0650i4298C51150m2012a09033p7723b1203l07574J13879k5518I1392H028
9680b42311j12186P4283C9482k112Q4662E7929K01198q3933b67156h5818C4635
9668d68980F8571a35277l8007o2789b156k50774a11869M5647j55874A1025i5021
9656A52875b36640J08130j9498K2174C32119a34868j13010d7340l20627a33467
9645b13196K6102g9317K2809k55527d6891E7003d8469l84412R8866J31366i5737
$$ plain form
9727 -218626 -210182 68998 -137415 31175 19847 231282 -228004 -35648 65485 32395 -42807
9715 -130239 203046 -109163 -26619 -344514 -109939 54084 -104373 7846 -45525 -151192 -158952
9704 -158952 -52280 -257289 -143003 213274 144735 27128 -81285 -45458 -350506 -401522 393152
9692 80650 -94298 351150 309138 -109033 -186756 -21203 -328777 -214898 -240416 91392 8028
9680 -242311 -354497 -280214 39482 37370 122032 57929 259127 175194 -267156 -85818 34635
9668 -468980 68571 -135277 -173284 -236073 -2156 -252930 -111869 -66222 -222096 11025 -95021
9656 152875 -236640 -128510 -148008 -125834 332119 -134868 -247878 -47340 -367967 -133467
9645 -213196 -187094 -79317 -56508 -312035 -46891 57003 -48469 -432881 -334015 -202649 -95737
9633f7465A0603f3990D3405B0012J71352a46314r3140G4339a97834B51746b47438
9621h8973D6670b24586e4787Q770k61477n0493H7359b03744A6344e17692a19557
9609A97702d2837l72177D3911J57106o0989c24467A09417a46024C4495K0257J02697
9598A57449a12928N5144F7231a04572l0915A83278b475J204C5105b37126A41359
9586C74368K8171b32895C6187a06295A01747A4881i8717K3898Q984j43002j6435
9575b25272f8197A00331B6824a01495A6950a5778j95980b652j36924M5822k37068
9564c30822a29636I3682a75501f6718p4659p3693C4774K23851L7036b02810B02740
9552a68737A36032b62993B0916J59740G646a63840D7161K31575c37967A0546b60467
$$ plain form
9633 -67465 10603 -63990 43405 20012 191364 -146314 -239454 74339 -197834 251746 -247438
9621 -88973 46670 -224586 -54787 -46017 -307494 -357987 87359 -203744 16344 -517692 -119557
9609 197702 -42837 -415014 43911 201017 140028 -324467 109417 -146024 34495 54752 157449
9598 157449 -112928 -57784 67231 -104572 -135487 183278 -2475 -1271 35105 -237126 141359
9586 374368 402539 -232895 36187 -106295 101747 14881 -98717 -74819 -65835 -208837 -225272
9575 -225272 -68197 100331 26824 -101495 16950 -15778 -211758 -2652 -139576 -93754 -330822
9564 -330822 -129636 93682 -175501 -66718 -141377 -215070 34774 258625 295661 -202810 202740
9552 -168737 136032 -262993 20916 180656 7646 -163840 47161 278736 -337967 10546 -260467
9540a32802B19201G616a43091A53155b12612M6818C5595e7430m1633P714a6333
9528I5871c8503l9854j27196j1950R5791I3838o673B3739g5147e095j28608O1641
9516g2062q8698A56534M3188a56406C4323h5278B61027d5725j93688A72150L8752
9505B10902A04579J85609e7219B5444a82935A56944E0274e2860n1320E0948P8113
9494A29061e1787D9373J5813h9412N473K0749m7044j63119L1600d1166k18988
9483b60154I4135a13729j30809l67H114a04918A05668b12020a2653j41792A50709
9471a5436j29933A01369b55818d9927j41876G8206d3875m01625a23268M7310o626
9460h2584c0700D4927a6539G5564a43099C8240e11253B22296G5374K24001o7691
$$ plain form
9540 -132802 219201 7616 -143091 153155 -212612 -165794 35595 -57430 -99063 -91349 -16333
9528 95871 -38503 -78357 -205553 -217503 -121712 93838 87165 23739 -75147 -5095 -133703 -72062
9516 -72062 -160760 156534 199722 -156406 34323 -85278 261027 -45725 -239413 172150 210902
9505 210902 104579 290188 -57219 25444 -182935 156944 50274 -52860 -104180 50948 129061
9494 129061 -51787 49373 65186 -89412 -83939 -63190 -110234 -273353 -241753 -41166 -260154
9483 -260154 94135 -113729 -244538 -244905 8114 -104918 105668 -212020 -12653 -154445 150709
9471 -15436 -145369 101369 -255818 -49927 -191803 78206 -43875 -445500 -123268 -75958 -82584
9460 -82584 -30700 44927 -16539 75564 -143099 38240 -511253 222296 75374 299375 231684
9449B31684a2846d990l3925j0296m14903b23367a10022b3959B17544a14656o6810
9438a81466A2291J33571D5263d9016J6356F6349c27903a14340A5097a88732A6253
9426a57622E1594K0541c74790a22170N7571k30339j76167C5929b4509k99480B11151
9414c1618j15563I47a11302B8117c9987j38122A38489a12184M6160j53979A70638
9402b30984h4067A44704b04406O1560B6705a61138O4759c025k67550J07613H136
9390A98422b58355A08828L4281j0180b18058f0159j84327e5380h176F6785e15264
9378a34506j68175J01422b8799r2719j80121c7866F4966h0709B1859K35417A02072
9366b02685C8523b82116a25499f105k04409A10176j8990J85486a39454b3450C93900
$$ plain form
9449 231684 -12846 -4990 -38915 -49211 -464114 -223367 -110022 -23959 217544 -114656 -181466
9438 -181466 12291 145862 45263 -49016 -32660 66349 -327903 -114340 15097 -188732 16253
9426 -157622 51594 72135 -374790 -122170 -64599 -294938 -471105 35929 -24509 -323989 211151
9414 -31618 -147181 947 -111302 28117 -39987 -178109 138489 -112184 -66024 -220003 170638
9402 -230984 -84067 144704 -204406 -142846 26705 -161138 -96379 -3025 -270575 -162962 8136
9390 198422 -258355 108828 143109 132929 -218058 -60159 -244486 -55380 -8176 66785 -515264
9378 -134506 -302681 -201259 -28799 -121518 -301639 -37866 64966 -80709 21859 257276 102072
9366 -202685 38523 -282116 -125499 -6105 -210514 110176 91186 276672 -139454 -23450 393900
9354F448b8967j4532A44351J4330a67642C7459b43800k6619D639b29943L5631
9343a94312e7014B9334h5082J456o5631F9668a64974B35687a2346j4885j24262
9332a51493j210f4083b2727j57426P1216A1088a48648K15A7630b15001c6831A31272
9319D7105b42318J09181j07058a19893r8173C22015c305E0222a61382a8203H3563
9307D1731a6544j24754l6944j62515e6881p1286J0372b2795I7687e6885D729h1335
9294b95157e5464B7059J08031E1958f4795k9467j52286E1459b43191A02219b76660
9282B05435b9448k68981Q1905g9196b8800A31734l717a00935A64555a2742j39955
9271a52697I6589j2309i005J135j8626D5225J20572f2753A03330h5225C8149L7239
$$ plain form
9354 6448 -28967 -43499 144351 158681 -167642 37459 -243800 -270419 4639 -229943 -194312
9343 -194312 -57014 29334 -85082 -83626 -149257 69668 -164974 235687 -12346 -27231 -151493
9332 -151493 -152703 -64083 -22727 -180153 -108937 11088 -148648 -148433 17630 -215001 -36831 131272
9319 47105 -242318 -133137 -240195 -119893 -218066 322015 -3305 50222 -161382 -18203 83563
9307 41731 -16544 -141298 -178242 -340757 -56881 -128167 -117795 -22795 97687 -56885 4729 -81335
9294 -295157 -55464 27059 135090 51958 -64795 -94262 -246548 51459 -243191 102219 -276660
9282 205435 -29448 -298429 -216524 -79196 -28800 131734 128017 -100935 164555 -12742 -152697
9271 -152697 96589 84280 -9005 -7870 -26496 45225 165797 -62753 103330 -85225 38149 75388
9259G5388Q72J7634a72928K3597A8057c18386A22811a837m6495B097R534a92281
9246a11475C0574b65226m6010H1135l1641a50855r8767J603h7832o5483A38722
9234B09380F897L01084a98587P5173J4446k48994G5681g4995a0964p439m5051
9223f3454k00651c8314k53266g1381a1573D8912b64262H5727a40671A46022f7716
9211a48993l0099D5718d6329j20750E8044d35710E4149h0854I1650b17660A41303
9199b09573A39538A2517f6115b8454F3222b88791A61646M3573h865k7084B44636
9187i8612k75713a52364m0217n0165A56604a77290F9151c33591a21886A77687
9176I7490J38568r5874a5087n0771b6126B42743h4703p3738C40008B7254h4520
$$ plain form
9259 75388 76260 93894 -172928 -149331 18057 -318386 122811 -1837 -48332 2097 11631 -192281
9246 -111475 30574 -265226 -311236 81135 49494 -150855 -249622 -248019 -87832 -153315 138722
9234 209380 6897 307981 -198587 -123414 -108968 -357962 75681 -74995 -10964 -18403 -63454
9223 -63454 -264105 -38314 -291580 -71381 -11573 48912 -264262 85727 -140671 146022 -67716
9211 -148993 -179092 45718 -46329 -167079 58044 -435710 54149 -80854 91650 -217660 141303
9199 -209573 139538 12517 -66115 -28454 63222 -288791 161646 205219 -8865 -35949 244636
9187 -98612 -374325 -152364 -192581 -242746 156604 -177290 69151 -333591 -121886 177687
9176 97490 236058 140184 -15087 -65858 -26126 242743 -84703 -158441 340008 27254 -84520
9164a43355I5526b4363A0285a31217e4373K6391A66506a4565B8757Q2928e2483
9152H9415K32610G2281D658a617G8262b60792F4846b17958A41886a39586M9698
9141h9888D7815a76420c4951B41820b33000A50364a30575C57355i3603A29015
9130a55183k0985d3534l58272f1138A64009L476c07187B5178a05821A1040a12106
9118a72623k2002C0761Q3005a70022K1599j43546N9041C7666e8657k42159d3222
9106G5934a55860A11787d6402K1265A7193b79918O6847B62238f5210A4739c71452
9094F57K19923b31050G0620b71051O5419o3664a08346o3793B16538F319c04586
9082B20138l1734c8832l04228G1723b59726d7842o6465r2660j01419B8586a531
$$ plain form
9164 -143355 95526 -24363 10285 -131217 -54373 -27982 166506 -14565 28757 111685 -52483
9152 89415 322025 72281 4658 -1617 78262 -260792 64846 -217958 141886 -139586 -89888
9141 -89888 47815 -176420 -34951 241820 -233000 150364 -130575 357355 -93603 129015
9130 -155183 -176168 -43534 -401806 -61138 164009 167485 -307187 25178 -105821 11040 -112106
9118 -172623 -194625 30761 113766 -170022 -148423 -291969 -232928 37666 -58657 -300816 -43222
9106 75934 -155860 111787 -46402 -25137 17193 -279918 -213071 262238 -65210 14739 -371452
9094 657 220580 -231050 70620 -271051 -205632 -269296 -108346 -172139 216538 6319 -304586
9082 220138 188404 -38832 -343060 71723 -259726 -47842 -114307 -206967 -308386 28586 -1531
9070g3184J3456A53772c06455J42215I1675a28058n3765B23460a31994j69590
9060c01584e5122j31916A22325E9428i2714r5612C06946a80368C8837a69721B19996
9048E7743L9153m1550a36425l117H2228a68596H023g3306E7049f3973B4407J95656
9036B20063b54477d4623r3238D7134a85126P8750M4528K1239k26536J20608F4972
9024a44745b3408k46369B23573D6768b08279d0927B41481i6548j08335l1878F3527
9012H3487l1766a12116I1791A4852a0583E0878b28726M0792A93304A4026K92380
9001C06406q7899N108A05708B2142J8691a18233k75127g5087q481L709L6005J8343
8989b5511j5754j33423A20482m5934e3957m49437B2739J15302c88158e8172A52947
$$ plain form
9070 -73184 -59728 153772 -306455 -164240 91675 -128058 -181823 223460 -131994 -301584
9060 -301584 -55122 -187038 122325 59428 -92714 -188326 306946 -180368 38837 -169721 219996
9048 57743 96896 55346 -136425 -139542 82228 -168596 8023 -73306 57049 -63973 24407 220063
9036 220063 -254477 -44623 -137861 47134 -185126 -106376 -61848 -40609 -267145 -146537 64972
9024 -144745 -23408 -269777 223573 46768 -208279 -40927 241481 -96548 -204883 -236761 63527
9012 83487 51721 -112116 91791 14852 -10583 50878 -228726 -187934 193304 14026 306406
9001 306406 218507 223615 105708 22142 40833 -118233 -393360 -75087 -83568 -79859 -43854 -25511
8989 -25511 -41265 -174688 120482 74548 -53957 -503394 22739 138041 -388158 -58172 152947
8977b43009m961a13573e6583j4711F8373J56852l6586c0818p9494a2296r6239
8966a08535J0291J8415k41E4492A6116d3165J8170F29P2886m264b40674m1977
8954b82651e584j9398C0897c5265A05669b19764A6662g6141E227Q3474c172p7303
8942h0475B2399L6701a02093k90366e3532k11647a7156A1206P1467i999I4133
8930B05749e9142k28147E5357a71827a3303m3588B22568L07693P49611r3126B71763
8918b0710L481B16618a8998A660f6821E3368a81217N8984E7139d35758d9030b0133
8905a80487C7001j4464c65196C3693a82209k3140f2930a4206A46285F2190c11160
8893h8106A3357c0940p4081e1831C2687a17928k11414g8292j19417C04748a89528
$$ plain form
8977 -243009 -247970 -113573 -56583 -71294 68373 225225 188639 -30818 -110312 -12296 -108535
8966 -108535 -98244 -79829 -80070 54492 16116 -43165 -24995 629 73515 69251 -240674 -282651
8954 -282651 -5584 -24982 30897 -35265 105669 -219764 16662 -76141 5227 88701 -3172 -80475
8942 -80475 22399 59100 -102093 -392459 -53532 -265179 -17156 11206 82673 -9999 94133
8930 205749 -59142 -287289 55357 -171827 -13303 -56891 222568 530261 1279872 1186746 271763
8918 -20710 -17229 216618 -18998 1660 -66821 53368 -181217 -122233 57139 -435758 -49030 -20133
8905 -180487 37001 22537 -365196 33693 -182209 -205349 -62930 -14206 146285 62190 -311160
8893 -88106 13357 -30940 -105021 -51831 32687 -117928 -329342 -78292 -197709 304748 -189528
8881a82994Q3590a9124p3335j76892J08623A9085b10632b4653r5757r7458E1048
8869A66517h4089M739k68878f5561G5771d4500a0399p992l78299B03324C5255
8857a21614E2482e8772j30778A06059h7892B08960C4851g2693p5673A00071a91559
8845a63341O530D4259g5315H0835K09781a86817F2140a72855l23447h2494r6512
$$ plain form
8881 -182994 -99404 -19124 -92459 -269351 -160728 19085 -210632 -24653 -120410 -217868 51048
8869 166517 -84089 -79350 -348228 -65561 75771 -44500 -10399 -18391 -396690 203324 35255
8857 -121614 52482 -58772 -189550 106059 -87892 208960 34851 -72693 -148366 100071 -191559
8845 -163341 -156811 44259 -75315 80835 290616 -186817 62140 -172855 -496302 -82494 -179006
$$ [...]
##END NTUPLES=NMR SPECTRUM
##END=
