##TITLE=AC1722_BRAAN15008_9207452_GE9plOlOXp
##JCAMPDX= 6.0         $$ Bruker NMR JCAMP-DX V2.0
##DATA TYPE= NMR SPECTRUM
##DATA CLASS= NTUPLES
##ORIGIN= BRUKER
##OWNER= Administrator
$$ 1.72 TOPSPIN		Version 2.1
$$ 2015-06-01 15:45:45.608 -0700  Administrator@X
$$ Compression mode = diff/dup
##.OBSERVE FREQUENCY= 400.02188249412
##.OBSERVE NUCLEUS= ^1H
##.ACQUISITION MODE= SIMULTANEOUS (DQD)
##.ACQUISITION SCHEME= undefined
##.AVERAGES= 64
##.DIGITISER RES= 22
##SPECTROMETER/DATA SYSTEM= spect
##.PULSE SEQUENCE= noesygpps1d.comp
##.SOLVENT NAME= COFFEE_meoh
##.SHIFT REFERENCE= INTERNAL, COFFEE_meoh, 1, 14.96094
##AUDIT TRAIL= $$ (NUMBER, WHEN, WHO, WHERE, PROCESS, VERSION, WHAT)
$$ ##TITLE= Audit trail, TOPSPIN		Version 2.1
$$ ##JCAMPDX= 5.01
$$ ##ORIGIN= Bruker BioSpin GmbH
$$ ##OWNER= Administrator
$$ $$ E:\/data/COFFEE/nmr/AC1722_BRAAN15008_9207452_GE9plOlOXp/12/pdata/1/auditp.txt
$$ ##AUDIT TRAIL=  $$ (NUMBER, WHEN, WHO, WHERE, PROCESS, VERSION, WHAT)
(   1,<2015-06-01 15:45:40.217 -0700>,<Administrator>,<X>,<go>,<TOPSPIN 2.1>,
      <created by zg
	started at 2015-06-01 15:34:10.280 -0700,
	POWCHK enabled, PULCHK disabled,
       configuration hash MD5:
       21 0F 79 D6 B3 7B B4 F6 88 20 88 DB 03 48 BD 9F
       data hash MD5: 64K
       AD F1 4D F7 16 93 BE 84 80 5C 13 C0 F6 1D F1 7E>)
(   2,<2015-06-01 15:45:43.576 -0700>,<Administrator>,<X>,<proc1d>,<TOPSPIN 2.1>,
      <Start of raw data processing
       efp LB = 0.3 FT_mod = 6 PKNL = 1 PHC0 = 0 PHC1 = 0 SI = 128K 
       data hash MD5: 128K
       13 42 B4 BB 3F A7 2E 83 5C E9 E4 D8 F8 F8 7F 5F>)
(   3,<2015-06-01 15:45:44.436 -0700>,<Administrator>,<X>,<proc1d>,<TOPSPIN 2.1>,
      <pk PHC0 = -86.73706 PHC1 = 0 
       data hash MD5: 128K
       04 D9 48 BC 47 B9 12 DF E2 76 2E 12 BF AE 65 DF>)
(   4,<2015-06-01 15:45:44.811 -0700>,<Administrator>,<X>,<proc1d>,<TOPSPIN 2.1>,
      <abs ABSG = 1 
       data hash MD5: 128K
       43 BF 67 45 FB D3 C4 8D 4C 27 29 E2 A8 0C 73 03>)
(   5,<2015-06-01 15:45:44.920 -0700>,<Administrator>,<X>,<proc1d>,<TOPSPIN 2.1>,
      <abs ABSG = 2 
       data hash MD5: 128K
       A4 58 EC 42 03 EE C8 63 BE A7 1E 2E 31 9C 95 E4>)
(   6,<2015-06-01 15:45:44.998 -0700>,<Administrator>,<X>,<proc1d>,<TOPSPIN 2.1>,
      <abs ABSG = 3 
       data hash MD5: 128K
       F3 30 0B 98 69 8F B8 B0 13 86 C4 35 D2 F8 67 4B>)
(   7,<2015-06-01 15:45:45.076 -0700>,<Administrator>,<X>,<proc1d>,<TOPSPIN 2.1>,
      <abs ABSG = 4 
       data hash MD5: 128K
       B0 1E 17 1F F1 6D E1 A0 05 71 07 30 B5 53 DD B9>)
(   8,<2015-06-01 15:45:45.201 -0700>,<Administrator>,<X>,<proc1d>,<TOPSPIN 2.1>,
      <abs ABSG = 5 
       data hash MD5: 128K
       6F C5 54 93 E1 76 D3 10 F7 B3 A6 2F 30 FA 62 D5>)
$$ ##END=
$$ 
$$ $$ hash MD5
$$ $$ 9D 31 57 D2 15 97 52 EC 49 A3 19 AE B2 F9 56 25
##$RELAX= 
##$RELAX= 
##$RELAX= 
##$RELAX= 
##$RELAX= 
##$RELAX= 
##$RELAX= 
##$RELAX= 
$$ Bruker specific parameters
$$ --------------------------
##$DU= <E:\>
##$EXPNO= 12
$$ [...]
##$TP07= 0
##$TPNAME0= <>
##$TPNAME1= <>
##$TPNAME2= <>
##$TPNAME3= <>
##$TPNAME4= <>
##$TPNAME5= <>
##$TPNAME6= <>
##$TPNAME7= <>
##$TPOAL= (0..7)
0.5 0.5 0.5 0.5 0.5 0.5 0.5 0.5
##$TPOFFS= (0..7)
0 0 0 0 0 0 0 0
##$TUNHIN= 0
##$TUNHOUT= 0
##$TUNXOUT= 0
##$USERA1= <user>
##$USERA2= <user>
##$USERA3= <user>
##$USERA4= <user>
##$USERA5= <user>
##$V9= 5
##$VALIST= <valist>
##$VCLIST= <CCCCCCCCCCCCCCC>
##$VD= 0
##$VDLIST= <DDDDDDDDDDDDDDD>
##$VPLIST= <PPPPPPPPPPPPPPP>
##$VTLIST= <TTTTTTTTTTTTTTT>
##$WBST= 2048
##$WBSW= 25
##$XGAIN= (0..3)
0 0 0 0
##$XL= 0
##$YL= 0
##$YMAX_a= 6876379
##$YMIN_a= -13272293
##$ZGOPTNS= <>
##$ZL1= 120
##$ZL2= 120
##$ZL3= 120
##$ZL4= 120
##$ABSF1= 14.96094
##$ABSF2= -5.597241
##$ABSG= 5
##$ABSL= 3
##$ALPHA= 0
##$AQORDER= 0
##$ASSFAC= 0
##$ASSFACI= 0
##$ASSFACX= 0
##$ASSWID= 0
##$AUNMP= <proc_prof1d_extract.lims>
##$AXLEFT= 0
##$AXNAME= <>
##$AXNUC= <1H>
##$AXRIGHT= 0
##$AXTYPE= 0
##$AXUNIT= <>
##$AZFE= 0.1
##$AZFW= 0.1
##$BCFW= 0
##$BC_mod= 0
##$BYTORDP= 0
##$COROFFS= 0
##$CY= 15
##$DATMOD= 1
##$DC= 0
##$DFILT= <>
##$DTYPP= 0
##$F1P= 0
##$F2P= 0
##$FCOR= 0.5
##$FTSIZE= 131072
##$FT_mod= 6
##$GAMMA= 0
##$GB= 0
##$INTBC= 1
##$INTSCL= 1
##$ISEN= 128
##$LB= 0.3
##$LEV0= 0
##$LPBIN= 0
##$MAXI= 10000
##$MC2= 0
##$MEAN= 0
##$ME_mod= 0
##$MI= 0
##$NCOEF= 0
##$NC_proc= -2
##$NLEV= 6
##$NOISF1= 0
##$NOISF2= 0
##$NSP= 0
##$NTH_PI= 0
##$NZP= 0
##$OFFSET= 14.96094
##$PC= 1
##$PHC0= -86.73706
##$PHC1= 0
##$PH_mod= 1
##$PKNL= yes
##$PPARMOD= 0
##$PPDIAG= 0
##$PPIPTYP= 0
##$PPMPNUM= 2147483647
##$PPRESOL= 1
##$PSCAL= 4
##$PSIGN= 0
##$PYNMP= <proc.py>
##$REVERSE= no
##$SF= 400.020009659772
##$SI= 131072
##$SIGF1= 0
##$SIGF2= 0
##$SINO= 400
##$SIOLD= 131072
##$SPECTYP= <>
##$SREGLST= <1H.CDCl3>
##$SSB= 0
##$STSI= 131072
##$STSR= 0
##$SW_p= 8223.68421052631
##$SYMM= 0
##$S_DEV= 0
##$TDeff= 65536
##$TDoff= 0
##$TI= <>
##$TILT= no
##$TM1= 0
##$TM2= 0
##$TOPLEV= 0
##$USERP1= <user>
##$USERP2= <user>
##$USERP3= <user>
##$USERP4= <user>
##$USERP5= <user>
##$WDW= 1
##$XDIM= 131072
##$YMAX_p= 376675810
##$YMIN_p= -10892
##$CURPLOT= <Network HP LaserJet P1505>
##$CURPRIN= <$Network HP LaserJet P1505>
##$DFORMAT= <normdp>
##$LAYOUT= <+/1D_H.xwp>
##$LFORMAT= <normlp>
##$PFORMAT= <normpl>
##$SURQMSG= 1
$$ End of Bruker specific parameters
$$ ---------------------------------
##NTUPLES= NMR SPECTRUM
##VAR_NAME=  FREQUENCY,     SPECTRUM/REAL,   SPECTRUM/IMAG
##SYMBOL=    X,             R,               I
##VAR_TYPE=  INDEPENDENT,   DEPENDENT,       DEPENDENT
##VAR_FORM=  AFFN,          ASDF,            ASDF
##VAR_DIM=   131072,        131072,          131072
##UNITS=     HZ,            ARBITRARY UNITS, ARBITRARY UNITS
##FACTOR=    0.0627417313425164, 1,          1
##FIRST=     8223.62146879497, 2243,         -62900
##LAST=      0,             3860,            -62919
##MIN=       0,             -10892,          0
##MAX=       8223.62146879497, 376675810,    0
$$ Real data points
##PAGE= N=1
##DATA TABLE= (X++(R..R)), XYDATA
$$ [...]
67778 73549 74106 74428 74299 74090 74456 75645 77264 78829 80329 82010 83778 85165 85898 86128 86103 86000 86138
67761 86138 86883 88095 89121 89669 90383 92094 94736 97364 99128 99812 99484 98175 96066 93756 92058 91497
67745 91497 91954 92782 93383 93744 94250 94931 95159 94342 92667 90817 89197 87788 86593 85710 84989 84108 83050
67728 83050 82113 81333 80352 79070 78037 77878 78527 79311 79657 79488 79010 78360 77555 76697 76113 76110 76527 76701 76092
67709 76092 74854 73548 72428 71346 70301 69613 69450 69566 69709 69956 70460 71148 71911 72804 73797 74530 74638
67692 74638 74124 73200 71970 70595 69537 69221 69536 70029 70537 71208 71951 72370 72362 72310 72430 72390 71992 71796 72487
67673 72487 73757 74532 74392 74131 74544 75203 75048 73896 72663 72121 72130 72211 72171 71810 70689 68888 67573 68013
67655 68013 70057 72245 73466 73859 74026 74089 73914 73693 73724 73898 73891 73726 73781 74281 75104 76004 76755 77157 77149 76895
67635 76895 76579 76192 75740 75466 75623 76115 76684 77365 78353 79459 80156 80281 80318 80717 81284 81573 81650 82062 83082
67616 83082 84375 85441 86069 86247 85990 85557 85534 86235 87059 86916 85496 83720 82674 82376 81996 81092 80093 79587
67598 79587 79572 79634 79502 79205 78897 78732 78692 78414 77415 75734 74100 73187 72845 72380 71494 70622 70283 70418 70514 70206
67578 70206 69625 69175 69102 69287 69412 69285 68977 68753 68896 69518 70388 71048 71296 71478 71987 72543 72375 71260 69986
67559 69986 69580 70328 71714 72953 73351 72566 71025 69850 69877 70824 71724 72029 71838 71260 70147 68566 67066
67542 67066 66269 66432 67441 68939 70414 71459 72041 72315 72276 71860 71311 70950 70625 69861 68669 67701 67415 67531
67524 67531 67558 67433 67334 67233 66987 66639 66326 66098 66069 66413 66927 66950 66133 65029 64443 64397 64289 63940 63857 64326 64833
67503 64833 64689 63920 63205 63155 63859 65003 66161 67055 67727 68463 69439 70470 71140 71171 70596 69701 68919 68641 68897
67484 68897 69262 69278 69071 69318 70395 71733 72307 71755 70693 69843 69246 68576 67895 67655 68040 68783 69633 70579
67466 70579 71502 72041 72055 71846 71677 71364 70728 70177 70388 71457 72766 73694 74105 74093 73696 73112 72915 73647 75226
67447 75226 76938 78086 78486 78329 77791 76979 76151 75668 75630 75761 75825 75956 76334 76720 76673 76138 75406 74542 73383
67428 73383 72200 71800 72585 73879 74631 74548 74153 73952 73989 74092 74087 73813 73259 72649 72105 71368 70225 69056 68440
67409 68440 68292 67972 67321 66991 67580 68933 70595 72386 74113 75139 74844 73488 72120 71579 71771 71977 71683
67392 71683 71063 70762 71217 72229 73233 73894 74212 74168 73641 72776 72054 71789 71905 72399 73656 75889 78478 80295
67374 80295 80634 79599 77779 75891 74562 74041 74069 74323 74823 75644 76378 76404 75664 74749 74108 73606 72988 72375
67356 72375 72068 72189 72716 73634 74828 75992 76860 77398 77671 77710 77605 77514 77426 77174 76843 76885 77605 78725 79714
67337 79714 80356 80763 81029 81197 81378 81566 81469 80933 80402 80522 81227 81698 81403 80754 80471 80617 80643 80224 79687 79568
67317 79568 80024 80772 81436 81815 81869 81634 81264 81077 81360 82009 82542 82583 82297 82169 82477 83166 84125 85216 86093
67298 86093 86419 86422 86877 88221 89946 91145 91468 91252 90935 90719 90708 90944 91205 91073 90325 89108 87733 86577
67280 86577 86127 86742 88197 89716 90642 90882 90655 90130 89573 89517 90330 91663 92656 92778 92315 92064 92679 94245
67262 94245 96210 97693 98096 97512 96502 95477 94481 93520 92858 92860 93583 94579 95113 94741 93900 93745 95046 97172
67244 97172 98590 98497 97615 97157 97443 97917 98176 98329 98392 98042 97229 96571 96694 97413 97921 97669 96790 95749 94913
67225 94913 94529 94814 95837 97365 98956 100224 101069 101660 102201 102697 102994 103092 103291 103906 104885 105882 106697 107448
67207 107448 108253 108924 109179 109085 109073 109475 110180 110867 111463 112137 112812 112944 112096 110665 109687 109712 110154 110072 109518 109675
67187 109675 111495 114473 117036 118071 117821 117312 117221 117477 117783 118079 118354 118316 117674 116748 116448 117417 119384 121535
67169 121535 123306 124572 125300 125433 125082 124477 123721 122916 122471 122807 123622 123993 123515 122918 123183 124373 125821
67152 125821 127180 128700 130480 132028 132777 132748 132555 132895 134035 135548 136599 136729 136390 136413 137006 137633 137845
67135 137845 137849 138099 138745 139698 140875 142101 143026 143482 143785 144403 145412 146485 147326 147911 148420 149142 150379 152177
67117 152177 154196 156001 157470 158778 160021 161077 161811 162221 162297 161889 160944 159879 159489 160242 161708 162995
67101 162995 163831 164876 166706 168864 170447 171400 172546 174296 176078 177248 177942 178685 179668 180848 182299
67086 182299 183968 185483 186654 187839 189338 190840 191990 193080 194530 196076 197240 198308 199948 201996
67072 201996 203588 204476 205315 206509 207725 208813 210242 212143 213797 214680 215320 216449 217907 219112 220144
67057 220144 221522 223216 224692 225828 227127 228942 231030 232900 234245 235124 236094 237975 241059 244648 247785
67042 247785 250257 252453 254482 256118 257498 259168 261282 263432 265472 267922 271193 274819 277863 279850
67028 279850 281029 281950 283063 284654 286915 290003 293935 298306 302213 304873 306440 307947 310335 313668
67014 313668 317316 320647 323455 326008 328825 332272 336259 340479 344817 349291 353652 357491 360836 364240
67000 364240 368091 372175 376118 379923 383844 387984 392333 397012 402206 407956 414146 420571 426872 432662
66986 432662 437880 442840 447766 452579 457283 462210 467514 472749 477405 481743 486687 492873 500129 507836
66972 507836 515493 522933 530340 538082 546345 554865 563231 571398 579674 588213 596834 605377 613945 622675
66958 622675 631490 640313 649367 659033 669389 680059 690665 701349 712642 724774 737349 749940
66946 749940 762799 776531 791126 805844 820205 834563 849426 864732 880212 896004 912308
66935 912308 928780 944964 961128 977983 995737 1014235 1033929 1055657 1079069 1102276 1123838
66924 1123838 1144566 1166581 1190873 1216509 1242077 1267131 1292087 1317371 1343038 1368956 1394985
66913 1394985 1421035 1447106 1473300 1499802 1526883 1554864 1583914 1613809 1644009 1674061 1703937
66902 1703937 1733965 1764416 1795178 1825852 1856145 1886029 1915417 1943903 1971159 1997534 2023861
66891 2023861 2050487 2076759 2101669 2124825 2146604 2167562 2187911 2207365 2225233 2240805 2254017
66880 2254017 2265651 2276560 2286663 2294975 2300643 2303641 2304370 2302929 2299081 2292785 2284420 2274409 2262789
66867 2262789 2249278 2233727 2216415 2197818 2178121 2157013 2134023 2109092 2082781 2055930 2028995
66856 2028995 2001703 1973368 1943624 1912836 1881815 1851210 1821191 1791566 1761944 1731881 1701113
66845 1701113 1669754 1638204 1606910 1576286 1546621 1517761 1489003 1459732 1430085 1400637 1371496
66834 1371496 1342260 1312938 1284254 1256759 1230231 1204326 1179229 1155182 1131858 1108826 1086269
66823 1086269 1064541 1043321 1022012 1000782 980389 960957 941773 922465 903591 885746 868751
66812 868751 852116 835791 819984 804682 789803 775492 761807 748339 734599 720635 706901
66801 706901 693640 680723 668028 655604 643463 631499 619731 608426 597827 587783 577719
66790 577719 567112 556076 545394 535825 527479 519961 512846 505667 497733 488612 478870 469715 461751
66777 461751 454577 447710 441262 435344 429473 423134 416525 410193 404211 398232 392115 386042 380199 374785
66763 374785 370066 365928 361619 356539 351091 346185 342017 337943 333452 328635 323709 318790 314232 310525
66749 310525 307577 304552 300699 296022 291060 286438 282711 280068 277974 275546 272569 269711 267524 265672
66735 265672 263429 260525 257107 253277 249145 245128 241760 239239 237380 235810 234006 231442 228037 224350
66721 224350 221024 218143 215357 212415 209373 206408 203740 201584 199945 198548 197121 195595 193923 191999
66707 191999 189974 188303 187140 185981 184331 182469 181046 180102 179012 177365 175391 173458 171660 170036
66693 170036 168775 167919 167055 165540 163065 160063 157605 156660 157190 158098 158365 158057 157854 157861 157472 156346 154821
66676 154821 153209 151324 148990 146510 144289 142437 141031 140274 139975 139388 138152 137018 136928 137563 137581 136292
66660 136292 134378 132751 131414 129865 128095 126668 126025 126197 127023 128202 129205 129544 129224 128623 127891 126803
66644 126803 125312 123865 122906 122269 121416 120131 118728 117566 116668 115842 114945 113921 112760 111553 110465 109616
66628 109616 109072 108925 109181 109503 109336 108474 107289 106262 105456 104712 104121 103951 104147 104298 104130 103715 103150 102349
66610 102349 101348 100589 100625 101581 103005 104204 104688 104388 103575 102510 101205 99617 98039 97045 96883 97069 96772
66593 96772 95599 93935 92527 91820 91615 91359 90745 90020 89636 89674 89787 89710 89591 89697 90004 90296 90547 90949 91491
66574 91491 91732 91188 89931 88635 87895 87588 87118 86255 85431 85018 84746 84172 83486 83267 83523 83617 83290 83111 83550
66555 83550 84138 84117 83585 83412 84069 85074 85656 85551 85027 84396 83705 82808 81745 80982 81109 82118 83262 83866
66537 83866 84009 83998 83480 81752 78998 76532 75541 75985 77034 78089 78985 79493 79271 78370 77394 76935 76994 77073
66519 77073 76775 76219 75799 75648 75537 75354 75381 75794 76134 75749 74761 74019 73941 73959 73497 72979 73317 74667 76275
66500 76275 77440 78003 77940 77122 75766 74651 74478 75210 76277 77183 77639 77342 76095 74208 72489 71689 72035
66483 72035 73293 75013 76625 77514 77382 76588 75956 76009 76477 76668 76320 75857 75741 75792 75425 74483 73549 73282 73612
66464 73612 73863 73585 73042 72775 72900 73099 73234 73600 74365 75017 74782 73573 72136 71176 70697 70418 70452 71109 72236
66445 72236 73280 73999 74575 74940 74540 73148 71509 70637 70652 70772 70462 70096 70351 71314 72434 73165 73421 73495
66427 73495 73697 74051 74229 73853 72921 71869 71115 70679 70361 70137 70174 70495 70899 71234 71525 71755 71746 71404 70913 70520
66407 70520 70257 70149 70604 72192 74820 77313 78221 77145 75141 73686 73312 73397 73173 72651 72417 72741 73234
66390 73234 73322 72793 71829 70807 70221 70488 71464 72299 72162 71174 70279 70167 70629 71079 71322 71547 71850 72157 72487
66371 72487 72949 73464 73827 74037 74271 74479 74338 73738 73041 72618 72363 71938 71395 71200 71635 72462 73239 73730 73878
66352 73878 73593 72822 71799 70980 70667 70762 70935 70984 71012 71251 71738 72194 72327 72188 72081 72001 71422 69929 67986
66333 67986 66699 66717 67628 68613 69363 70077 70825 71354 71512 71450 71335 71125 70692 69914 68630 66886 65355 65048
66315 65048 66261 68083 69322 69745 70016 70569 71129 71372 71531 72021 72795 73424 73707 73865 74153 74529 74781 74823
66297 74823 74733 74561 74229 73729 73334 73453 74114 74726 74558 73481 72067 70956 70311 69970 69846 69965 70232 70418
66279 70418 70380 70133 69710 69112 68483 68147 68304 68708 68794 68232 67335 66797 66999 67622 68048 68071 68068 68439 69019 69231 68843
66258 68843 68384 68676 69883 71134 71258 69972 68226 67310 67677 68747 69680 70108 70135 69982 69846 69917 70316 71019
66240 71019 71928 72937 73854 74403 74500 74431 74534 74730 74581 73866 72975 72601 73074 74068 74939 75327 75446 75785 76536
66221 76536 77362 77801 77798 77680 77609 77307 76515 75567 75234 75881 77049 78044 78791 79787 81234 82617 83353 83569 83916
66202 83916 84730 85728 86482 86859 86935 86819 86655 86537 86275 85520 84299 83158 82556 82347 82117 81838 81847 82263 82766
66183 82766 82953 82718 82277 82030 82306 83050 83815 84243 84469 84800 85139 85086 84577 84065 84003 84513 85528 86822 87777
66164 87777 87631 86359 85058 85007 86382 88184 89348 89708 89876 90401 91131 91371 90694 89548 88884 89153 89845
66147 89845 90118 89599 88458 87045 85799 85249 85685 86834 88181 89516 90847 91921 92387 92500 93062 94373
66131 94373 95637 95804 94754 93265 92052 91286 90932 91009 91386 91786 92222 93128 94774 96740 98248 98908 98870
66114 98870 98422 97753 97071 96581 96249 95902 95664 96017 97184 98723 100016 100994 102091 103580 105251 106723 107772
66097 107772 108344 108506 108539 108834 109554 110499 111300 111632 111284 110344 109398 109220 110019 111129 111674 111398 110702 109988 109272
66078 109272 108395 107377 106463 105935 105947 106518 107583 108974 110267 110854 110423 109421 108742 108809 109165 109158 108767 108486
66060 108486 108580 108851 109110 109507 110237 111125 111732 111846 111742 111855 112239 112534 112520 112500 112856 113397 113600 113470 113574 114069
66040 114069 114304 113856 113430 114033 115531 116711 116729 115910 115157 115205 116429 118668 121028 122485 122970 123438 124580
66023 124580 126006 126986 127491 128029 128862 129909 131175 132704 134205 135148 135309 134980 134733 135110 136318 137983
66007 137983 139416 140399 141513 143352 145688 147859 149782 152050 155025 158385 161668 164828 168051 171311
65993 171311 174356 176980 179216 181351 183744 186450 189035 190938 191962 192232 191741 190241 187603 184043 179989
65978 179989 175912 172192 168876 165622 162172 158775 155813 153131 150238 147150 144450 142397 140507 138287
65964 138287 135889 133763 132154 131266 131447 132640 134009 134653 134533 134245 134090 133935 133848 134254 135387 137068 139060
65947 139060 141229 143286 144835 145834 146706 147837 149340 151371 154211 157780 161400 164372 166555 168152 169257
65932 169257 169980 170758 172016 173552 174704 175269 175886 177314 179563 181979 184070 185944 187994 190405 193161
65917 193161 196330 200086 204367 208718 212626 215976 219052 222128 225149 227778 229626 230467 230361 229617 228605
65902 228605 227601 226834 226517 226597 226591 225935 224542 222783 220856 218495 215447 211957 208519 205237 201681 197338
65886 197338 192090 186345 180861 176308 172776 169699 166424 162861 159504 156851 154913 153296 151571 149568
65872 149568 147399 145330 143668 142723 142708 143505 144623 145633 146631 147966 149467 150333 150049 149071 148315 148204 148532
65855 148532 148978 149305 149272 148888 148691 149215 150183 150744 150616 150408 150665 151164 151482 151727 152235 152885 153255 153267 153240 153439
65835 153439 153956 154933 156509 158534 160677 162787 164901 166966 168919 171018 173791 177543 182117 187155 192373
65820 192373 197551 202471 206902 210568 213207 214845 215859 216494 216401 215051 212542 209603 206745 203850 200697
65805 200697 197432 194295 191314 188591 186529 185286 184252 182577 180185 177823 176084 174825 173644 172508
65791 172508 171641 171141 171026 171452 172463 173621 174341 174709 175654 178095 182129 187231 192980 199250 205920 212866
65775 212866 220269 228502 237470 246318 253940 259641 263231 264776 264388 262020 257375 250360 241817 233318
65761 233318 225844 219070 212436 206532 202729 201585 202427 204555 208153 213783 221610 231421 242883 255431
65747 255431 268404 281669 295693 310623 325635 339613 352123 363261 372782 379956 384201 385436
65735 385436 383763 379130 371320 360151 345843 329455 312671 296773 281860 267332 252935 239009
65723 239009 225993 214190 203933 195437 188411 182227 176541 171408 166797 162434 158212 154371 151155
65710 151155 148603 146753 145697 145280 145093 144969 145180 145955 146997 147707 147744 147273 146786 146736 147187 147802 148296 148834
65692 148834 149681 150605 151095 151215 151769 153406 155968 158910 161946 165054 168264 171764 175858 180519 185350
65677 185350 190288 195937 202810 210681 219262 229159 241401 256171 272675 290199 308539 327312 345619
65664 345619 362742 378655 393515 407112 419091 429243 437197 442390 444912 446071 447425 449313 450885
65651 450885 451473 451306 450830 450077 449066 448284 448202 448517 448365 447106 444458 439962 432885 422904 410447 396131
65635 396131 380136 362488 343741 324955 306906 289583 272535 255607 239299 224474 211763
65624 211763 201117 191998 184014 177224 171711 167064 162689 158549 155184 152880 151207 149553 147795 146181
65610 146181 144807 143559 142395 141310 140117 138690 137439 137113 137898 138989 139383 139038 138927 139838 141328 142125
65594 142125 141581 140430 139942 140562 141751 143052 144809 147571 151178 154892 158317 161824 166065 171363 177666
65579 177666 184934 193388 203427 215284 228790 243552 259345 276125 293552 310790 326990 341805
65567 341805 355202 366987 376793 384400 389646 392188 391694 388197 381824 372343 359577 344280 327922
65554 327922 311384 294456 276955 259696 243834 229711 217033 205808 196399 188736 182219 176505
65542 176505 171779 168111 165086 162313 159889 158090 156982 156570 156978 158152 159698 161353 163305 165650 167796
65527 167796 168941 169022 168565 167648 165673 162436 158837 155969 153850 151643 149001 146588 145150 144543 143930 142697
65511 142697 140920 139163 138065 137941 138511 139091 139291 139484 140278 141556 142408 142167 141272 140800 141298 142308 143029
65494 143029 143180 143137 143466 144516 146410 149188 152804 157037 161529 165998 170388 174805 179296 183634 187265
65479 187265 189519 190057 189284 188208 187670 187638 187353 186146 183982 181193 177972 174307 170314 166336 162724 159700
65463 159700 157401 155846 154703 153374 151521 149469 147844 146862 146218 145676 145433 145670 145990 145760 144987 144467
65447 144467 144856 145844 146571 146703 146746 147298 148327 149385 150322 151491 153248 155415 157416 158902 160119 161600
65431 161600 163568 165784 167907 169783 171237 171886 171497 170438 169432 168780 168121 167031 165529 163875 162238
65416 162238 160827 159975 159632 159036 157565 155893 155585 157243 159584 160902 161054 161339 162533 163809 163889 162729
65400 162729 161617 161809 163481 165937 168434 170776 173377 176814 181131 185466 188585 189898 189832 189101 187877
65385 187877 185893 183210 180469 178267 176565 174916 173090 171263 169630 168207 167122 166812 167605 169140 170545
65370 170545 171306 171744 172454 173506 174506 175351 176580 178848 182299 186610 191466 196805 202692 209118 215905
65355 215905 222782 229553 236227 242878 249394 255548 261330 266906 272090 276079 278091 278165 277045 275300 272808
65340 272808 269197 264537 259454 254634 250220 245643 240081 233232 225661 218323 211841 206316 201662 197829
65326 197829 194738 192272 190324 188693 186987 184919 182692 180780 179278 177824 176171 174507 173051 171688
65312 171688 170293 169091 168438 168409 168846 169585 170329 170534 169876 168832 168404 169135 170584 171809 172200 171811 171137
65295 171137 170746 171036 172135 173867 175743 177125 177627 177420 176937 176237 174912 172770 170285 168085 166247 164460
65279 164460 162698 161244 160117 159014 157997 157736 158759 160642 162270 162833 162438 161878 161920 162746 163904 164843
65263 164843 165539 166525 168275 170684 173226 175392 176873 177482 177183 176192 174831 173270 171507 169559 167506
65248 167506 165291 162717 159798 157017 154974 153725 152675 151318 149857 148840 148255 147420 145929 144331 143552
65233 143552 143898 144999 146513 148338 150159 151414 151985 152461 153311 154103 154063 153219 152442 152281 152262 151607 150276
65216 150276 148961 148244 148164 148518 149160 149859 150298 150522 151151 152679 154611 155714 155286 153881 152577 151811 151184
65199 151184 150235 149002 147913 147402 147724 148861 150484 152077 153148 153380 152810 152064 152194 153850 156574 159256
65183 159256 161307 163067 164998 166906 168251 168907 169209 169381 169335 169036 168765 168791 168947 168741 167906 166731 165705
65166 165705 164936 164095 162984 161870 161129 160808 160816 161326 162511 164018 165174 165781 166231 166763 167172 167495 168394 170443
65148 170443 173418 176786 180564 185149 190508 196200 202169 208924 216710 224907 232491 238935 244572 250241
65134 250241 256630 263791 271169 278113 284297 289602 293931 297372 300377 303311 305898 307414 307421 306036 303628
65119 303628 300591 297314 293868 289702 284084 276913 268688 259763 250216 240557 231814 224496 217992 211448
65105 211448 204807 198520 192695 187202 182349 178691 176142 173904 171396 168789 166510 164703 163361 162607
65091 162607 162483 162723 163033 163490 164478 166253 168689 171347 173732 175586 176983 178074 178774 178905 178659 178617 179103
65074 179103 179782 180134 180217 180617 181683 183111 184327 185024 185182 184855 184197 183549 183159 182820 182071 180875 179846
65057 179846 179588 179953 180192 179802 178984 178337 178256 178709 179334 179641 179292 178312 176980 175455 173647 171552 169540
65040 169540 168098 167337 166876 166226 165177 163865 162554 161377 160280 159221 158299 157489 156339 154320 151713
65025 151713 149757 149511 150679 151963 152520 152695 153246 154375 155728 157034 158328 159671 161020 162404 163932
65010 163932 165548 166961 167999 168973 170539 173198 176923 181259 185661 189741 193320 196433 199212 201611
64996 201611 203243 203685 203010 201820 200661 199600 198551 197721 197446 197734 198357 199375 201161 203843 206996 209988
64980 209988 212291 213420 212985 211147 208737 206544 204581 202276 199280 195872 192612 189889 187727 185824
64966 185824 183818 181729 180095 179437 179606 179899 179801 179337 178708 177952 177090 176307 175765 175436 175304 175479 175878 175975
64948 175975 175312 174186 173471 173609 174078 174055 173416 172819 172882 173581 174498 175411 176364 177243 177600 177130 176178 175512 175577
64929 175577 176170 176944 177887 179035 179914 179735 178264 176163 174315 173083 172367 172074 172164 172433 172697 173140 174085
64912 174085 175386 176525 177480 179050 181964 185967 190162 194066 197934 202168 206926 212376 218838 226376
64898 226376 234468 242373 249700 256518 263010 269172 274774 279553 283554 287278 291273 295423 298899 301015
64884 301015 301959 302367 302284 300993 297882 293173 287609 281695 275512 269139 262959 257496 253118 249960 247984
64869 247984 247010 246738 246877 247277 247838 248238 247900 246385 243813 240711 237376 233526 228677 222746 216201 209757
64853 209757 204104 199747 196782 194736 192909 191017 189354 188207 187323 186110 184276 182046 179880 178165
64839 178165 177089 176539 176114 175522 175028 175238 176343 177866 179307 180739 182466 184355 185967 187259 188663
64824 188663 190404 192206 193910 195953 198876 202585 206484 210229 214017 218228 223152 229106 236457 245307
64810 245307 255242 265494 275324 284279 292191 298910 303969 306629 306465 303825 299478 293852 286881 278620
64796 278620 269708 261144 253750 247858 243290 239520 236089 232992 230560 228970 228069 227653 227626 227801 227833 227544
64780 227544 227130 226969 227441 228912 231572 235179 239317 244009 249667 256264 263119 269867 277164 285831 295611
64765 295611 305385 314427 322829 330761 337970 344132 349189 353222 356412 359235 362203 365219 367559 368726
64751 368726 368975 368820 368325 367117 364806 361107 355785 348801 340426 331057 321057 310876 301134 292368
64737 292368 284801 278476 273443 269654 266855 264755 263256 262340 261836 261470 261077 260639 260182 259781 259611 259843
64721 259843 260512 261623 263408 266366 270899 276856 283448 289714 295122 299639 303240 305584 306292 305316 302775
64706 302775 298649 292946 286039 278459 270414 261962 253605 246216 240227 235279 230834 226789 223336 220604
64692 220604 218623 217334 216439 215591 214953 215196 216630 218638 220318 221538 223106 225985 230543 236373 242694
64677 242694 249099 255977 263974 273010 282302 291398 300590 309933 318480 324995 328990 330523 329473 325782
64663 325782 320075 313214 305344 296149 286048 276329 267900 260652 254327 249401 246632 246053 246857 248158
64649 248158 249676 251746 254756 258507 262159 265068 267719 271572 277883 286771 297366 308661 320247
64636 320247 332455 345797 360142 374513 387730 398987 407718 413426 416112 416368 414413 409464 400905
64623 400905 389736 377821 365771 352762 338602 324671 312233 300955 290042 279967 271923 265997
64611 265997 261021 256113 251396 247127 243018 238804 234920 232129 230638 229786 228578 226549 224164 222363
64597 222363 221671 221863 222453 223137 223689 223925 224132 225097 227299 230417 234085 238728 244974 252483 260104 267196
64581 267196 274097 281265 288646 296077 303667 311323 318308 323778 327580 330200 332014 332833 332186 329838 326028
64566 326028 321262 315922 310108 303894 297577 291596 286241 281629 277809 274700 272076 269911 268675 268940
64552 268940 270612 272830 274705 275898 276497 276702 276813 277273 278360 279875 281311 282339 283082 283868 284791 285503
64536 285503 285496 284580 282995 281021 278634 275694 272298 268740 265142 261370 257345 253319 249843 247469 246416
64521 246416 246411 246905 247422 247582 246956 245388 243600 242890 243798 245502 247050 248725 251461 255195 258807 261745
64505 261745 264841 269218 275176 282563 291455 301712 312326 321933 329879 336270 341097 343903 344371 342782
64491 342782 339701 335451 330064 323643 316690 310055 304526 300421 297631 296023 295591 296175 297260 298168 298309
64476 298309 297246 294845 291555 288300 285821 284200 283075 282100 281045 279717 278091 276436 275169 274690 275404
64461 275404 277561 280818 284197 286779 288318 289023 289007 288290 287125 285935 284951 284197 283737 283718 284216 285245 286790
64444 286790 288644 290538 292679 295841 300486 306063 311760 317794 325287 334849 345982 358053 371255
64431 371255 386292 403627 423472 446198 472357 502466 537068 576875 622686 675375 736068
64420 736068 805993 885822 975337 1073950 1181056 1295246 1413209 1530093 1641364 1744336
64410 1744336 1837994 1921672 1994071 2053324 2097584 2125413 2135678 2127444 2100338 2055228 1994378
64399 1994378 1920677 1836543 1743398 1641984 1533192 1418912 1302376 1187604 1078244 976794
64389 976794 884675 802577 730456 667550 612898 565883 526039 492533 464284 440502 420668
64378 420668 404013 389629 377250 367288 359686 353250 346646 339728 333272 327617 322248 316696 311137
64365 311137 305822 300483 294685 288462 282280 276601 271723 267844 264952 262857 261606 261669 263404 266449 270014
64350 270014 273718 277824 282672 288186 293925 299267 303494 306055 306937 306585 305351 303185 299929 295671 290737
64335 290737 285511 280388 275666 271419 267621 264476 262340 261287 261066 261579 263003 265220 267516 269237 270450
64320 270450 271607 272827 273981 275213 276783 278477 279758 280539 281287 282265 283132 283454 283089 281829 279144 274713
64304 274713 268985 262861 256976 251538 246616 242251 238380 234953 232082 229877 228125 226417 224548 222687
64290 222687 221166 220269 220209 221181 223400 227018 231875 237329 242657 247712 252991 258899 265317 272105 279596
64275 279596 288114 297231 306066 314233 321958 329241 335421 339744 341911 341992 340308 337667 335203 333539 332364
64260 332364 331134 329950 329359 329515 329945 329999 329098 326669 322330 316281 309162 301442 293246 284803 276658 269196
64244 269196 262284 255645 249421 244076 239842 236574 234132 232590 231931 231751 231497 231022 230763 231349 233104 235924
64228 235924 239409 242934 245722 247248 247739 248067 248925 250219 251410 252286 253031 253621 253583 252532 250665 248494
64212 248494 246288 244039 241804 239745 237858 235971 234146 232869 232669 233633 235388 237398 239205 240583 241796
64197 241796 243689 247136 252158 257791 263070 268022 273486 280179 288353 298206 309977 323374 337372
64184 337372 350973 363798 375511 385091 391275 393630 392582 388493 381344 371446 359785 347382 334773
64171 334773 322387 310899 300748 291624 282893 274360 266368 259403 253873 249986 247445 245558 244007
64158 244007 243226 243597 244631 245517 246224 247394 249285 251571 254199 257612 261928 266552 270938 275122 279137
64143 279137 282468 284610 285765 286505 286970 286934 286392 285603 284657 283459 282101 280820 279594 278155 276416 274589
64127 274589 272877 271425 270624 271112 273156 276287 279828 283684 288364 294161 300592 306846 312726 318896 326128
64112 326128 334567 343837 353547 363258 372170 379435 384954 389387 393203 396104 397716 398477 399468 401548 404938
64097 404938 409440 414696 420276 425775 430798 434748 436950 437211 436037 433955 430899 426617 421378 415803
64083 415803 410160 404331 398333 392321 386089 379218 371848 364890 359297 355456 353301 352593 352977 354151 356082
64068 356082 358729 361634 364337 367281 371652 378010 385639 393551 401545 409840 418180 425975 433007 439370
64054 439370 444845 448896 451213 451848 450854 448241 444251 439295 433651 427558 421511 416082 411458 407536 404478
64039 404478 402775 402735 404166 406513 409011 410841 411674 412092 413032 414703 416479 417861 418994 420117 421131
64024 421131 422043 423279 425076 426994 428575 430138 432220 434332 434896 432593 427445 420526 413032 405709 398826
64009 398826 392401 386530 381492 377491 374473 372382 371359 371277 371302 370538 369155 368286 368643 369886 371567 373955
63993 373955 377348 381212 384878 388744 393840 400256 406902 413014 419015 425511 432152 438179 443646 449449
63979 449449 456295 464163 472639 481338 490056 498909 508321 518568 529461 540810 553052 566954 582779
63966 582779 600215 619046 639304 660675 682480 704647 728228 754569 784319 817639 854959
63955 854959 896991 944209 996985 1056317 1123962 1201738 1291039 1393179 1509961 1643680 1796572
63944 1796572 1970134 2164733 2379824 2614683 2868745 3140987 3429067 3729417 4038147
63935 4038147 4351447 4665002 4973358 5269899 5547107 5796903 6011556 6185111 6314058
63926 6314058 6396550 6431337 6417729 6356167 6248148 6095729 5901793 5670983 5409842 5125670
63916 5125670 4825339 4515136 4201127 3889079 3584057 3290258 3011067 2749063 2506136
63907 2506136 2283847 2083520 1905674 1749447 1612927 1494199 1391943 1305048 1231920 1170457
63897 1170457 1118688 1075292 1039346 1009574 984081 961121 940134 921637 905949 892361 879898
63886 879898 868516 858994 851759 846483 842966 841818 843851 849188 857429 868527 883061 901703 924767
63873 924767 952358 984669 1021950 1064301 1111646 1163941 1221302 1283798 1351036 1422124 1496255
63862 1496255 1573179 1652775 1734189 1815862 1896542 1975686 2052464 2124822 2190228 2247233 2295740
63851 2295740 2335741 2366306 2386025 2394011 2390238 2375197 2349501 2313655 2268060 2213296 2150447 2081002
63839 2081002 2006340 1927421 1844986 1759898 1673216 1586125 1499819 1415338 1333466 1254901 1180410
63828 1180410 1110589 1045562 985239 929780 879441 833905 792194 753434 717386 684113 653585
63817 653585 625800 600849 578461 557797 538123 519438 502088 486034 471047 457396 445682
63806 445682 435898 427201 418828 410799 403506 396947 390726 384621 378857 373904 370184 367841 366509 365338
63792 365338 363576 361311 359475 358882 359263 359427 358379 356042 352828 348838 343873 338058 331946 325941 320064
63777 320064 314479 309736 306087 302910 299371 295569 292490 290764 289890 288834 287081 284894 282871 281484
63763 281484 280859 280669 280204 278819 276466 273771 271489 269839 268431 266877 265369 264471 264384 264692 264930 265100
63747 265100 265434 265880 266238 266708 267888 270109 272978 275725 277817 279233 280316 281485 282951 284625 286324
63732 286324 288094 290220 292905 296057 299479 303211 307625 313064 319350 325740 331577 336979 342586 348564
63718 348564 354258 359067 363233 367307 371131 373921 375249 375359 374532 372772 370244 367396 364345 360663 356176
63703 356176 351606 348006 345803 344798 344859 346079 348284 350799 352927 354543 356178 358555 361983 366058 369945
63688 369945 372933 374722 375394 375415 375538 376187 376784 376208 374212 372059 371305 372249 373905 375224 375851 375955 375948 376405
63670 376405 377736 379775 382011 384257 386731 389465 392056 394141 395708 396734 396854 395719 393429 390325
63656 390325 386475 381680 376007 370040 364488 359603 355116 350762 346777 343669 341502 339650 337571 335662
63642 335662 335003 336188 338720 341637 344459 347333 350515 354006 357684 361573 365842 370533 375329 379742
63628 379742 383632 387439 391713 396528 401656 407225 413798 421643 430365 439570 449618 461299 474859
63615 474859 489677 504958 520541 537034 555335 575963 598634 622441 646636 671218 696630
63604 696630 722823 748834 773329 795381 814564 830475 842457 849948 852977 852251 848738 843250 836404
63591 836404 828832 821195 813923 806918 799443 790274 778188 762677 744321 724279 703419 682151 661030
63578 661030 640984 622631 605791 590165 576272 565091 556848 550750 546060 542909 541725 542299 543875
63565 543875 545935 548448 551397 554477 557433 560511 564369 569493 575718 582455 589501 597562 607717 620363
63551 620363 635030 651369 670004 692088 718282 748443 782082 818671 857578 898072 939192
63540 939192 979016 1014017 1039960 1054175 1057040 1051267 1040077 1026183 1011791 998584 987355 977990
63528 977990 969971 962694 955224 946108 933803 917392 896844 872590 845017 814463 781698 748231
63516 748231 715842 685636 657582 631099 606021 582839 562047 543528 526729 511318 497390
63505 497390 485024 473846 463265 453124 443903 436136 429692 423780 417674 411345 405402 400527 397010
63492 397010 394665 393033 391656 390292 389041 388365 388871 390822 393777 396867 399634 402471 406036 410449 415351
63477 415351 420595 426327 432285 437591 441595 444584 447264 449739 451423 451793 450863 448942 446285 443063 439414
63462 439414 435511 431683 428340 425575 422984 420248 417811 416560 416788 417824 418741 419131 419148 419274 420242 422812
63446 422812 427247 433149 439983 447556 455845 464622 473666 483254 494219 507541 523998 544012 567533
63433 567533 594183 623762 656499 692329 729683 765282 795455 817851 832064 839012 840100 837010
63421 837010 831927 827482 826086 829192 837126 849609 866388 887382 912221 939659 967549 993590
63409 993590 1016213 1034711 1048636 1057454 1061003 1059916 1055155 1047307 1036820 1024853 1013146 1002652
63397 1002652 992626 981318 967299 949890 928797 904005 875981 845527 813349 780077 746696
63386 746696 714557 684702 657375 632333 609527 589302 572019 557602 545521 535257 526719 520185
63374 520185 515828 513472 512911 514332 518171 524498 532694 541894 551812 563113 576920 593843 613433
63361 613433 634640 656791 680055 705080 732348 761882 793251 825695 858456 891197 923960
63350 923960 956480 987561 1015298 1037917 1054419 1064658 1069102 1068554 1063972 1056526 1047652 1038635 1029879
63337 1029879 1020762 1010449 998619 985140 969343 950170 927166 900932 872535 842825 812507
63326 812507 782595 754378 728945 706868 688351 673526 662544 655388 651677 650706 651497 652589 651811
63313 651811 646649 635243 617191 593609 566727 539331 513917 491774 472897 456888 443625 432891
63301 432891 423912 415928 408935 403312 398909 395123 391645 388458 385197 381420 377568 374718 373081 371528
63287 371528 369079 366131 363661 361858 360245 358588 356902 354932 352480 350121 348822 348858 349747 351190 353317
63272 353317 355900 358069 359203 359624 360093 361014 362408 364295 366682 369360 372031 374581 377066 379587 382303
63257 382303 385367 388692 392022 395397 399283 403998 409234 414470 419680 425286 431475 437973 444505 451117
63243 451117 457990 465236 473057 481858 491988 503525 516421 530718 546494 563750 582538 603012
63231 603012 625147 648530 672678 697480 723028 749124 775356 801742 828811 856800 885059
63220 885059 912598 939056 964857 990566 1016443 1042581 1069021 1095558 1121572 1146160 1168331
63209 1168331 1187109 1201618 1211103 1214761 1211694 1201357 1184098 1161008 1133196 1101458 1066694 1030245
63197 1030245 993548 957713 923664 892456 865127 842240 823787 809466 798971 792215 789555 791613
63185 791613 798539 809507 823302 839477 858575 881083 906514 933808 962383 992374 1023759 1055601
63173 1055601 1086368 1114942 1141217 1165880 1189816 1213652 1237398 1260262 1280888 1297991 1310750
63162 1310750 1318514 1320389 1315511 1303690 1285427 1261181 1230963 1194829 1153554 1108625 1061753 1014503
63150 1014503 968121 923382 880653 840299 802910 768958 738380 710735 685730 663383 643750
63139 643750 626727 612086 599528 588729 579524 571995 566216 561923 558550 555510 552398 549199 546553
63126 546553 545562 546822 549658 552744 555510 558529 562433 566905 571078 574536 577538 580411 583134 585541
63112 585541 587653 589683 591863 594300 596952 599632 602071 604020 605355 606168 606657 606900 606791 606337 605877 605789
63096 605789 605976 605913 605302 604537 604431 605597 608114 611578 615392 619101 622549 625656 628149 629743 630571 631144
63080 631144 631822 632657 633862 635976 639290 643468 648141 653628 660563 668946 678022 687118 696247 705865 716452
63065 716452 728385 741803 756393 771658 787650 805191 825139 847645 872359 899174 928462
63054 928462 960674 996067 1034807 1077095 1123048 1172585 1225511 1281617 1340578 1401743 1464116
63043 1464116 1526748 1589357 1652488 1716839 1782299 1847820 1912291 1975344 2037209 2098119 2158194
63032 2158194 2217675 2276733 2334890 2390776 2442434 2487690 2524341 2550521 2565054 2567229 2556225
63021 2556225 2531268 2492639 2442110 2381910 2313536 2238063 2157470 2074962 1993798 1916214 1843674
63010 1843674 1777651 1719638 1670560 1630577 1599514 1577232 1563638 1558649 1562260 1574396 1594515 1621426
62998 1621426 1653692 1690212 1730370 1773701 1819542 1867069 1915644 1965052 2015381 2066606 2118246
62987 2118246 2169411 2219150 2266719 2311452 2352471 2388618 2418653 2441385 2455572 2459865 2453000 2434024
62975 2434024 2402370 2357972 2301602 2235009 2160349 2079413 1993574 1904528 1814620 1726126 1640405
62964 1640405 1558039 1479606 1405913 1337516 1274489 1216822 1164717 1118161 1076364 1037950 1001766
62953 1001766 967371 934712 903542 873421 844283 816755 791669 769254 748975 730080 712077
62942 712077 694695 677830 661814 647394 635051 624392 614546 605071 596133 587921 580314 573193 566690
62929 566690 560976 556067 551934 548546 545716 543152 540739 538555 536574 534665 532984 531979 531788 531890 531548
62914 531548 530440 528701 526643 524569 522668 520893 519081 517225 515359 513164 510151 506445 502950 500434
62900 500434 498818 497624 496696 496067 495582 495136 495011 495340 495498 494629 492709 490533 488680 487076 485565 484281
62884 484281 483303 482437 481563 480907 480791 481341 482482 483971 485414 486519 487309 487853 487902 487146 485717 484012 482103
62867 482103 479816 477307 475011 472952 470710 468219 466032 464516 463335 462047 460816 460174 460341 461091 462109
62852 462109 463279 464779 466957 469796 472574 474464 475546 476667 478207 479601 480343 480720 481111 481162 480282 478572
62836 478572 476691 475156 474246 474241 475154 476474 477698 478854 480044 480897 481189 481671 483383 486286 489422 492398
62820 492398 495800 499915 503958 507100 509623 512521 516304 520714 525358 530124 535045 540077 545101 550014
62806 550014 554825 559684 564791 570279 576279 582951 590319 598224 606809 616839 629095 643406 658680
62793 658680 673972 689190 704810 721425 739729 760413 783792 809910 839262 873010 912158
62782 912158 956869 1006900 1062382 1123764 1191279 1264945 1344898 1431136 1522900 1618727 1717272
62771 1717272 1817734 1919320 2020413 2118415 2210365 2293654 2366179 2425874 2470347 2497332 2505634
62760 2505634 2495440 2467661 2423327 2363862 2291530 2209013 2118614 2022287 1922405 1821855 1723038
62749 1723038 1627052 1534131 1444755 1360064 1281238 1208753 1142324 1081451 1025895 975643 930521
62738 930521 889988 853415 820546 791582 766769 745877 728117 712580 698785 686763 676580
62727 676580 667901 660225 653485 648173 644753 643180 643104 644334 646859 650609 655532 661797 669573 678584 688309
62712 688309 698799 711031 726236 744995 767181 792546 821047 852675 887380 925403 967454
62701 967454 1014363 1066615 1124379 1187826 1257121 1332012 1411748 1495685 1583888 1676935 1775004
62690 1775004 1877080 1980792 2082739 2179110 2266537 2342680 2405949 2454630 2486533 2499759 2493702
62679 2493702 2469072 2427036 2368702 2295502 2209798 2114751 2013545 1908800 1802649 1697138
62669 1697138 1594258 1495622 1402256 1314883 1234196 1160648 1094092 1033972 979909 931779 889098
62658 889098 850756 815700 783682 754984 729565 706895 686541 668423 652353 637675 623665
62647 623665 610065 597076 584994 574044 564381 555995 548681 542271 536868 532707 529790 527828 526469
62634 526469 525517 524876 524354 523529 521824 518874 514880 510518 506415 502813 499794 497532 496077 495058 494039
62619 494039 493146 492995 493911 495591 497629 500006 502778 505683 508534 511825 516314 521991 527978 533719 539825
62604 539825 547349 556580 567031 578487 591474 606566 623786 643010 664637 689448 717895 749897
62592 749897 785300 824122 866241 911196 958487 1007781 1058433 1108884 1156859 1200268 1237793
62581 1237793 1268653 1292131 1307533 1314414 1312653 1302320 1283628 1256984 1223079 1183000 1138376 1091201
62569 1091201 1043303 995930 949915 906032 864859 826334 789861 755106 722562 693204 667734
62558 667734 646190 628052 612458 598518 585725 574161 564163 555765 548532 541831 535184 528498 522147
62545 522147 516751 512693 509877 508069 507255 507441 508260 509189 510157 511579 513696 516240 518876 521630 524623
62530 524623 527651 530388 532978 536248 541258 548638 558209 569233 581181 594370 609719 627891 648901
62517 648901 672596 699201 729235 763172 801368 843990 890689 940590 993012 1048013 1105831
62506 1105831 1165805 1226151 1284724 1339676 1389511 1433040 1469455 1498123 1518176 1528617 1529046 1520201
62494 1520201 1503767 1481800 1456296 1428919 1400906 1373328 1347443 1324593 1305778 1291514 1282079
62483 1282079 1277583 1277763 1282023 1289694 1299886 1310973 1320669 1326838 1328057 1323426 1312485 1295547 1273423
62470 1273423 1246228 1212901 1172583 1126278 1076513 1025544 974540 924297 875747 829442 785240
62459 785240 743049 703523 667644 635940 608436 585072 565726 550029 537510 527814 520413 514337
62447 514337 508682 503461 499550 497633 497523 498615 500664 503709 507458 511252 514802 518624 523297 528375
62433 528375 532429 534325 534209 532996 531156 528410 524508 519760 514554 508757 501991 494404 486826 480091
62419 480091 474444 469592 465155 460929 456826 452809 449003 445809 443629 442358 441265 439683 437751 436280
62405 436280 435851 436337 437324 438664 440439 442600 444848 446712 447754 448109 449004 452171 458197 465752 472965
62390 472965 479374 485970 493614 502221 511457 521262 531335 540902 549644 558306 567768 577893 587878 597395
62376 597395 606672 615673 623986 631511 638538 645048 650654 655479 660384 665990 672078 678478 686047 696106
62362 696106 709143 724751 742735 763677 788444 817662 851748 890909 934868 982953 1034490
62351 1034490 1088695 1144060 1198406 1249926 1297756 1341213 1379023 1409980 1434088 1452302 1465102
62340 1465102 1472016 1472648 1467546 1457665 1443406 1424610 1401269 1373875 1343204 1310110 1275428 1239778
62328 1239778 1203447 1166602 1129541 1092585 1055859 1019367 983230 947648 912732 878597 845521
62317 845521 813790 783460 754500 727143 701826 678794 658028 639544 623513 610040 599015
62306 599015 590210 583287 577704 572905 568713 565382 563253 562512 563230 565329 568502 572479 577410 583587 590650
62291 590650 597493 603235 607955 612221 616227 619698 622319 623844 624021 622880 620926 618564 615419 610780
62277 610780 604753 598501 593184 589052 585684 582709 580073 578008 577021 577700 580268 584547 590535 598783 609906
62262 609906 623945 640599 659957 682607 709052 739429 773928 813110 857443 906554 959122
62251 959122 1013534 1068596 1123584 1177597 1228857 1274690 1312444 1340670 1359491 1369813 1372212 1366650
62239 1366650 1353072 1331928 1303931 1269564 1229201 1183690 1134443 1082806 1029646 975848 923029
62228 923029 873255 827884 786924 749711 716021 686276 660720 638750 619301 601805 586499
62217 586499 573631 562602 552211 541736 531513 522309 514452 507770 502083 497303 493179 489406 486095
62204 486095 483719 482412 481726 481289 481465 482989 486085 490254 494829 499436 503951 508414 513122 518586 525181
62189 525181 532941 541751 551580 562367 573741 585080 595927 606320 616654 627207 637753 647580
62177 647580 655878 662209 666694 669819 672118 674074 676325 679826 685679 694749 707466 723974 744369
62164 744369 768729 797005 828960 864155 901839 940824 979581 1016586 1050571 1080492 1105347
62153 1105347 1124226 1136617 1142633 1142809 1137640 1127407 1112452 1093461 1071210 1046131 1018385 988334
62141 988334 956694 924239 891767 860460 831826 806867 785619 767840 753777 743737 737175 732949
62129 732949 730523 730165 731847 734699 738048 742390 748766 757467 767922 779626 792541 806571 821216
62116 821216 835961 850721 865699 880931 896063 910425 923331 934400 943543 950535 954758 955750
62104 955750 953990 950920 948129 946760 947669 951655 959106 969442 981299 993399 1005281 1017217 1029637
62091 1029637 1042749 1056607 1071253 1086606 1102303 1117814 1132756 1146940 1160224 1172575 1184321
62080 1184321 1196058 1208156 1220525 1233028 1245910 1259612 1274338 1289984 1306301 1322825 1338797
62069 1338797 1353450 1366433 1377776 1387687 1396651 1405548 1415140 1425430 1435944 1446722 1458565 1472079
62057 1472079 1486853 1501850 1516268 1529646 1541345 1550422 1556110 1558200 1556896 1552437 1544786 1533401
62045 1533401 1517267 1495378 1467394 1433820 1395558 1353464 1308390 1261415 1213637 1165709 1117888
62034 1117888 1070715 1025377 983070 944093 907948 874377 843871 816999 793631 773140 755098
62023 755098 739369 725644 713300 701734 690601 679764 669308 659510 650472 641880 633475 625689
62011 625689 619353 614748 611414 609014 607844 608208 609751 611865 614506 618196 623376 630033 637846 646306
61997 646306 654707 662269 668328 672420 674406 674689 674009 672716 670345 666213 660250 652972 644735 635458 625078
61982 625078 613957 602762 592183 582748 574599 567355 560446 553666 547226 541267 535668 530454 526054
61969 526054 522838 520520 518320 515703 512771 509949 507540 505702 504564 504098 503925 503599 503170 503164 503854 504857
61953 504857 505771 506949 509108 512295 515870 519573 524005 529779 536893 545296 555466 567791 581845 597013
61939 597013 613523 632027 652363 673564 695075 717057 739334 760932 781057 799787 817331
61928 817331 833222 846766 857810 866535 872909 876826 878377 877447 873569 866866 858766 850898 843407 835247
61914 835247 826210 817914 812465 810843 812895 818266 826760 838102 851887 867722 885044 902801 919602
61901 919602 934236 946021 954677 960017 961808 959940 954694 946713 936582 924542 910769 895831 880588
61888 880588 865697 851431 837903 825129 812892 800907 789221 778096 767359 756261 744170
61877 744170 731114 717445 703299 688793 674489 661253 649622 639546 630723 622972 616351 611082
61865 611082 607332 604983 603779 603881 606103 611304 619590 630277 642585 656201 671341 688561 708432
61852 708432 731127 756279 783470 812806 844725 879171 915138 951120 985775 1018144 1047501
61841 1047501 1073219 1094717 1111436 1122894 1128831 1129273 1124544 1115373 1103012 1089051 1074936 1061640
61829 1061640 1049820 1040244 1033928 1031720 1033719 1039243 1047511 1058208 1071093 1085068 1098035 1107813 1112954
61816 1112954 1112588 1106059 1093109 1074123 1049784 1020743 987968 953049 917528 882128 847155 813434
61804 813434 782128 753765 728229 705697 686705 671070 657601 645294 634131 624361 615783 608249
61792 608249 602152 597656 593998 590316 586749 583907 581662 579344 576911 574926 573348 571307 568355 565117
61778 565117 562355 559965 557335 554271 551159 548438 546224 544289 542321 540467 539615 540750 543865 547849
61764 547849 551626 555073 558762 563247 568876 575868 584156 593310 602836 612412 621697 630209 637597 643750
61750 643750 648410 651042 651424 650131 648019 645402 642090 638110 633938 630023 626370 622636 618440 613686
61736 613686 608840 604804 602197 600755 599690 598574 597615 597105 597067 597564 598982 601647 605291 609184 612818
61721 612818 616284 619922 623755 627497 631094 634972 639406 643751 646751 647771 647341 646176 644073 640359
61707 640359 635211 629821 625069 620639 615759 610357 605024 600125 595487 590896 586467 582457 579028 576281
61693 576281 574178 572329 570167 567536 564966 563115 562067 561345 560507 559457 558246 556805 555060 553184 551630
61678 551630 550898 551209 552308 553595 554540 554956 554802 553949 552451 551020 550738 552037 554251 556494 558705 561441
61662 561441 564845 568374 571582 574678 578077 581784 585524 589235 593099 597238 601649 606363 611388 616442
61648 616442 620984 624610 627393 629889 632891 637031 642357 648185 653478 657474 659992 661173 661129 659980 658109
61633 658109 656176 654656 653419 651857 649477 646338 642913 639646 636664 633727 630371 626294 621845 617962
61619 617962 615326 613641 612016 610070 608230 606876 605601 603600 600513 596530 591821 586233 579583 572011
61605 572011 563984 556054 548629 541817 535430 529209 523094 517244 511850 506937 502374 498110 494375 491473
61591 491473 489240 486939 484031 480992 478929 478227 477974 476911 474653 471725 468789 466240 464335 463194 462622
61576 462622 462148 461247 459422 456380 452500 448906 446593 445424 444359 442575 440013 436937 433583 430422 428186
61561 428186 427211 427027 426904 426572 426148 425615 424865 424164 424089 424851 425925 426561 426510 426079 425558 424865 423869 422815 422164
61542 422164 422031 422085 422131 422461 423408 424775 426091 427356 429128 431787 435018 438111 440549 442175 442989 442956 441926
61525 441926 439726 436477 432775 429293 426156 423000 419759 417013 415367 414685 414280 413650 412775 411777 410635
61510 410635 409322 408016 407082 406847 407309 408010 408345 408142 407853 408009 408574 409055 409157 409116 409318 409793 410158 410029
61492 410029 409444 408881 408819 409210 409490 409241 408694 408407 408456 408192 406924 404726 402445 400883 400094 399584 399146 399284
61474 399284 400567 402696 404540 405282 405207 405172 405533 405934 405970 405639 405067 404239 403158 402017 401016 400183 399495 398992
61456 398992 398582 397969 397026 396152 395999 396799 398160 399539 400762 402035 403554 405246 406843 408176 409358 410686
61440 410686 412404 414586 417230 420370 424048 428275 432952 437681 441652 444084 445030 445515 446525 447946 448868
61425 448868 448910 448808 449560 451362 453656 455886 457899 459771 461620 463495 465146 465999 465667 464499 463288 462370
61409 462370 461233 459111 455755 451604 447422 443822 440862 437990 434624 430901 427617 425260 423415 421361
61395 421361 419033 417034 415840 415367 415303 415490 415876 416364 416878 417407 417881 418195 418468 419176 420794 423359 426428
61378 426428 429437 432031 434133 435857 437395 438923 440554 442384 444569 447263 450402 453553 456165 458042
61364 458042 459559 461241 463144 464774 465668 465942 466231 467207 469267 472536 476951 482320 488445 495305 503056
61349 503056 511847 521615 532079 542919 553892 564713 574852 583620 590629 596080 600374 603491 605033
61336 605033 604940 603879 602642 601356 599533 596809 593370 589645 585750 581343 576037 569984 564032 559129 555496
61321 555496 552575 549869 547576 546230 546014 546741 548309 550708 553678 556844 560329 564856 571067 578945 588056
61306 588056 598189 609592 622717 637755 654284 671233 687315 701515 713120 721405 725680 725759
61294 725759 722151 715645 706966 696924 686528 676479 666641 656421 645744 635413 626363 618851 612546
61281 612546 607218 602995 599984 598017 596973 597090 598635 601398 604847 608776 613420 618825 624439 629608
61267 629608 634246 638807 643757 649329 655673 662955 671335 681014 692234 705058 719239 734365 749902
61254 749902 764964 778330 789050 796896 801946 804055 803175 799936 795252 789325 781595 771849 760924
61241 760924 750095 740110 731023 722663 715091 708776 704366 701991 700780 699434 697447 695474 694419 694558
61227 694558 695697 697742 700791 705003 710592 717680 725833 734015 741322 747630 753300 758477 762974 766680
61213 766680 769790 772716 775990 780049 784825 789627 793719 797004 800008 803241 806797 810634 815113 821171
61199 821171 829823 841381 855229 870592 887493 906643 928378 952059 976690 1001636 1026434 1050142
61187 1050142 1071340 1088811 1102128 1111701 1118391 1122889 1125332 1125592 1123877 1120699 1116166 1109755 1101093
61174 1101093 1090591 1078953 1066368 1052631 1037776 1022064 1005454 987613 968518 948583 928089
61163 928089 906908 885078 863363 842867 824088 806670 790223 775177 762543 752870 745860 741089
61151 741089 738606 738348 739483 741103 743476 747727 754035 760884 766342 769429 769864 767288 761536 753328 744060
61136 744060 735045 727246 721308 717315 714878 713990 715546 720465 728599 739056 751311 765402 781246
61123 781246 798471 816968 837102 859394 884344 912238 942613 974148 1005728 1037375 1069595
61112 1069595 1102119 1134168 1165696 1197269 1228596 1258194 1284818 1308357 1328950 1346103 1359301
61101 1359301 1368826 1375218 1378263 1377028 1370606 1358356 1339782 1314862 1284559 1250598 1214634 1177726
61089 1177726 1140425 1103078 1066067 1029903 995049 961666 929713 899403 871345 846034 823295
61078 823295 802421 782821 764559 748288 734673 723766 714984 707767 702085 698119 695609 693857 692317
61065 692317 690939 690003 689934 691185 693895 697696 702109 707098 712916 719573 726907 735139 744889 756577 770138
61050 770138 785361 802147 820483 840526 862649 887030 913286 940888 969736 999772 1030309
61039 1030309 1060545 1090672 1121683 1153911 1186540 1218691 1250181 1280922 1310435 1338483 1365651
61028 1365651 1392833 1420491 1448713 1477564 1507188 1538026 1570998 1606845 1645176 1684906 1725833
61017 1725833 1768932 1814947 1863842 1916301 1974776 2042214 2120521 2211074 2315940 2437484 2577402
61006 2577402 2737508 2921738 3137100 3393242 3701820 4075809 4528605 5074093 5728244
60997 5728244 6510368 7442633 8548922 9852728 11370715 13102751 15026573 17100149
60989 17100149 19258925 21396340 23346418 24909822 25934650 26400037 26430167 26224475 25965117
60980 25965117 25768060 25679464 25672845 25632148 25361401 24656517 23407049 21651557 19547802
60971 19547802 17293259 15059122 12965919 11086153 9452822 8068353 6915461 5967180
60963 5967180 5192898 4562020 4047333 3626662 3281744 2996734 2758352 2556331 2382672
60954 2382672 2230908 2096406 1976481 1869311 1773072 1686296 1608196 1538050 1474891 1418181
60944 1418181 1367815 1322695 1280080 1237283 1193634 1150030 1107113 1064771 1023077 982695 944312
60933 944312 908362 875287 845412 818405 793348 769487 746687 725298 705862 688835 674159
60922 674159 661087 648669 636444 624516 613161 602593 592913 584000 575586 567620 560410 554252 549205
60909 549205 545370 542977 541820 541037 539938 538757 538075 537731 536882 535002 532265 528998 525348 521537 517925
60894 517925 514693 511789 509277 507389 506222 505638 505435 505301 504743 503546 502335 502095 503005 504148 504589 504278
60878 504278 503685 502933 501711 499817 497463 495159 493490 492824 492966 493172 492732 491588 490392 490014 490960 492958
60862 492958 495026 496137 496018 495223 494428 493970 494153 495482 498143 501424 504161 505695 506054 505305 503362 500657
60846 500657 498495 498214 500005 502813 505343 506948 507612 507463 506505 504679 501997 498591 494763 490981 487784
60831 487784 485625 484757 485180 486631 488669 490844 492902 494901 497167 500108 503922 508389 512946 517008 520279
60816 520279 522771 524595 525806 526389 526310 525565 524304 522922 521875 521283 520781 519908 518577 517005 515192 512712
60800 512712 509142 504595 499669 494958 490700 486734 482632 477924 472479 466690 461124 456017 451307 447104
60786 447104 443712 441095 438729 436236 433844 431879 430150 428305 426560 425454 424926 424265 423077 421742 420743
60771 420743 420124 419945 420701 422738 425560 428330 430970 434254 438797 444408 450508 456780 463175 469495 475290
60756 475290 480230 484483 488652 493238 498242 503398 508733 514519 520595 526132 530401 533573 536433 539454
60742 539454 542460 545022 546797 547481 546865 545089 542660 540039 537211 533654 528856 523042 517387 513170 510527
60727 510527 508346 505487 501703 497183 491887 485966 480345 475940 472412 468461 463372 457598 451866 446533
60713 446533 441987 438807 437048 435895 434471 432628 430736 429190 428400 428679 429703 430571 430810 430910 431421 432090
60697 432090 432509 433173 435083 438457 442564 446839 451447 456633 462106 467334 472043 476217 479922 483336 486631
60682 486631 489585 491564 492178 491871 491618 492045 492988 493886 494413 494597 494408 493477 491345 487932 483641 479132 475167
60665 475167 472498 471462 471629 472236 473117 474761 477214 479340 479725 478184 475934 474291 473619 473562 473901 474883
60649 474883 476825 479614 482698 485661 488755 492623 497396 502284 506316 509212 511221 512368 512488 512027 512195
60634 512195 513963 517205 521174 525549 530673 536830 543718 550832 558159 566301 575875 586888 598757 610797
60620 610797 622554 633688 643886 653214 662474 672743 684369 696624 708592 720254 732372 745360
60608 745360 758677 771500 783701 795883 808563 821700 834950 848008 860616 872588 884094
60597 884094 895648 907514 919252 930130 939904 948960 957709 966057 973374 978749 981402 981167 978591
60584 978591 974330 968526 961002 951869 941513 930052 917329 903510 889207 874857 860457 846109
60572 846109 832430 820079 809198 799562 790996 783428 776898 771807 768854 768365 769896 772727 776468 780865
60558 780865 785312 788992 791273 791615 789308 783857 775568 765360 754101 742455 731179 721010 712232
60545 712232 704862 699329 696456 696576 699152 703565 709936 718781 730045 742916 756474 770111 783184
60532 783184 794632 803293 808534 810229 808107 801636 790989 777899 764938 753706 744035 735069 726764
60519 726764 719997 715490 713010 711582 710214 708432 706370 704525 703422 703482 704978 707805 711343 714930 718648
60504 718648 723399 730105 739133 750562 764550 781208 800482 822526 847998 877763 912531 952821
60492 952821 998735 1049364 1102877 1157595 1212554 1266516 1316818 1359856 1392538 1412832 1419339 1411243
60480 1411243 1388764 1353126 1306104 1249986 1187777 1122736 1057644 994862 936693 884829 839392
60469 839392 799352 764034 733591 707933 686001 666523 648920 633132 619028 606353 594890
60458 594890 584358 574477 565311 557217 550286 544218 538864 534389 530692 527150 523327 519531 516332 513866
60444 513866 511891 510168 508482 506628 504783 503555 503289 503532 503529 502978 502008 500733 499307 498223 497979 498468
60428 498468 499060 499326 499334 499261 499077 498758 498567 498896 499858 501127 502218 502934 503490 504188 505116 506310 508002 510397
60410 510397 513200 515700 517332 517928 517502 516232 514743 513921 514164 515088 516121 517092 518131 519375 520973 523033
60394 523033 525364 527540 529374 530997 532421 533537 534719 536769 539823 542866 544905 546189 547683 549724
60380 549724 551915 554029 556217 558348 559986 561145 562417 564079 565574 566175 565802 564980 564299 564170 564786 565972
60364 565972 567155 567711 567375 566350 565136 564222 563764 563491 563071 562593 562547 563269 564524 565695 566368 566730 567397
60347 567397 568742 570452 571931 573226 575246 578843 583900 589560 595081 600168 604736 608808 612585 616157
60333 616157 619140 620988 621611 621247 619745 616497 611283 604808 598146 591959 586383 581313 576567 572067 568142
60318 568142 565379 563919 563133 562292 561361 560874 561238 562536 564818 568119 572246 576981 582534 589387 597680
60303 597680 607233 618303 631737 647943 666064 684607 702627 719747 735247 747874 756633 761117
60291 761117 760882 755182 743929 728557 711405 694326 678194 663392 650176 638601 628633 620398
60279 620398 614025 609272 605702 603168 601698 600909 600013 598491 596317 593497 589950 585960 582169 578798 575342
60264 575342 571338 566991 562705 558435 553954 549405 545101 541071 537238 533833 531168 529149 527488 526239
60250 526239 525756 526144 527098 528122 528610 528030 526495 524940 524207 524083 523806 523377 523658 525125 527217 529159 530851
60233 530851 532657 534871 537754 541641 546513 551731 556629 561226 566022 571267 576823 582629 588842 595512
60219 595512 602456 609543 616756 623838 630273 635903 641382 647590 654659 661906 668805 675572 682571 689513
60205 689513 695720 701050 706114 711505 717160 722532 727085 730569 733153 735331 737379 738867 739155 738410 737554
60190 737554 736903 735486 732157 726936 720796 714561 708627 703360 698973 695092 691174 687322 684100 681557
60176 681557 679091 676367 673700 671344 669024 666463 663864 661507 659285 657036 655049 653833 653582 654100 655088
60161 655088 656180 656888 656856 656193 655401 654945 654956 655253 655543 655617 655466 655223 655093 655394 656587 658986 662390 666150
60143 666150 669708 673088 676882 681740 687753 694279 700546 706490 712699 719454 726209 732371 738126 743959
60129 743959 749602 754087 756821 758078 758488 758598 758877 759532 760145 760055 759216 758274 757773 757822 758494 759847 761316
60112 761316 761869 761164 759956 758992 758081 756696 754842 752675 749796 745743 740969 736578 733050 729782 725964
60097 725964 721543 717291 714187 712692 712375 712296 711963 711774 712397 714007 716398 719542 723520 728064 732559 736523
60081 736523 739837 742606 745051 747357 749334 750380 750038 748307 745134 739930 732148 722182 711161 699999
60067 699999 689177 679281 670994 664363 658647 653179 647947 643111 638442 633715 629377 626398 625367 625918
60053 625918 627053 628031 628941 630453 632965 636177 639610 643297 647602 652529 657710 663119 669255 676369 683858
60038 683858 690761 696670 701879 706688 710771 713278 713524 711636 708481 704828 700651 695455 689202 682506
60024 682506 675842 668929 661167 652410 643060 633614 624377 615483 606908 598501 590263 582547 575777 570004
60010 570004 564969 560628 557313 555202 553817 552323 550346 548304 546844 546139 545943 546204 547213 549075 551365
59995 551365 553643 556124 559546 564385 570526 577642 585538 593960 602409 610400 617855 625064 632250 639120
59981 639120 644812 648339 649345 648442 646644 644480 641883 638827 635599 632244 628243 623156 617364 611748
59967 611748 606780 602404 598666 595886 593976 592111 589516 586429 583914 582757 582826 583502 584381 585389 586401
59952 586401 587114 587335 587225 587110 587182 587501 588178 589258 590362 590748 589997 588539 587284 586686 586368 585655 584293
59935 584293 582600 581112 580217 579964 580014 579883 579437 579166 579777 581467 583662 585493 586450 586724 587151 588820 592335
59918 592335 597186 602003 605768 608741 612014 616210 620943 625530 629814 633973 637774 640478 641560 641275
59904 641275 640355 639304 638120 636642 634912 633177 631652 630401 629425 628766 628556 629029 630472 633057 636723
59889 636723 641260 646496 652300 658430 664560 670525 676431 682486 688865 695741 703146 710657 717467 723105
59875 723105 727884 732349 736450 739684 741845 743083 743167 741379 737462 732145 726260 719709 711823 702563 692777
59860 692777 683251 674079 665139 656742 649469 643498 638404 633596 628870 624512 620985 618561 617285 617303 619081
59845 619081 623105 629324 637071 645644 654876 664997 675943 686952 696906 704967 710803 714319 715542
59832 715542 714992 713895 713614 714675 716467 717815 717574 714722 708451 698645 686125 672143 657660 643265
59818 643265 629465 616707 605175 594897 586031 578764 573035 568646 565518 563497 562010 560439 558824
59805 558824 557667 556974 556143 555085 554731 555753 557240 557443 555758 553203 550964 549233 547714 546520 545931
59790 545931 545663 545046 543880 542665 541978 541997 542602 543514 544213 544153 543326 542428 542177 542571 543041 543257 543550 544471 546158
59771 546158 548279 550584 553384 557311 562559 568487 574162 579201 583881 588481 592916 597163 601606 606633
59757 606633 612087 617540 623000 628991 635896 643527 651331 658774 665525 671631 677537 683662 689815 695299
59743 695299 699650 702988 705574 707343 708056 707677 706447 704826 703547 703385 704548 706424 708166 709432 710356
59728 710356 711011 711217 710861 710201 709792 710134 711265 712678 713863 714997 716752 719291 721885 723878 725665 728205
59712 728205 731852 736250 741235 747062 753646 760233 766241 771981 778186 785144 792646 800484 808546 816533
59698 816533 824040 830931 837374 843411 848808 853406 857404 861133 864607 867455 869187 869416 867988 865146
59684 865146 861639 858347 855582 852802 849237 844725 839705 834453 828736 822358 815702 809371 803467 797541
59670 797541 791229 784666 778335 772795 768521 765702 764045 762960 762056 761410 761371 762216 763939 766141 768174
59655 768174 769752 771452 774256 778410 782995 786863 789661 791532 792115 790523 786412 780498 773668 766009
59641 766009 757170 747349 737276 727267 716989 706420 696439 687999 681141 675338 670480 666777 663794
59628 663794 660438 656174 651585 647270 642763 637137 630413 623706 618041 613544 609808 606513 603465 600350
59614 600350 596838 592909 588943 585457 582684 580355 577970 575412 573294 572575 573786 576611 580077 583091
59600 583091 585009 585881 586162 586134 585676 584578 582852 580695 578460 576780 576326 577118 578335 579183 579733 580506 581476
59583 581476 581984 581534 580174 578111 575455 572405 569185 565673 561510 556760 552081 548045 544644 541677 539245
59568 539245 537493 536103 534450 532285 529986 528117 526902 526206 525925 526241 527407 529322 531475 533345 534740
59553 534740 535682 536263 536750 537569 538901 540522 542374 545033 549207 554936 561726 569292 577688 586864 596808
59538 596808 608113 621710 637854 655965 675517 696248 716995 735060 747612 753756 754955 753759
59526 753759 752426 752384 754231 757981 763374 769864 776345 781331 783826 783869 782005 778486 773215 766133 757248
59511 757248 746513 734076 720543 706666 692900 679519 666872 655149 644162 633815 624661 617425
59499 617425 612050 607737 603935 600778 598468 596793 595515 594797 594890 595659 596774 598265 600599 604146 608659
59484 608659 613251 616942 619404 621250 623438 626376 629751 633223 636957 641286 646098 650916 655451 659742
59470 659742 663727 667058 669509 671304 672741 673751 674188 674503 675597 677870 680919 684491 689365 696721 706838
59455 706838 718887 731942 745645 759869 774358 788955 803645 818002 830966 841617 849913 856205
59443 856205 860178 860645 856450 847341 834041 817790 799935 781730 764325 748678 735240 723743
59431 723743 713617 704740 697522 692164 688217 685168 683200 683005 685061 689408 696013 704979 716383 730132
59417 730132 745990 763586 782482 802271 822413 841914 859634 875162 888922 900817 909014 910730
59405 910730 904293 890216 870627 848403 826789 808802 796234 789215 786839 787900 790854 793446 792874
59392 792874 786594 773337 753831 730640 706852 684585 664652 647397 633242 622247 613699 606663
59380 606663 600845 596594 594130 593035 592522 592030 591525 591316 591599 592239 593006 593922 595176 596779 598623 600924
59364 600924 604240 608900 614614 620809 627183 633803 640946 649047 658663 670218 683813 699342 716624
59351 716624 735322 754992 775508 797267 820676 845504 870958 896328 921221 945167 967382
59340 967382 987110 1003969 1017762 1028058 1034173 1035621 1032474 1025307 1014838 1001607 985941 968152
59328 968152 948728 928245 907124 885624 864170 843585 824820 808416 794268 781879 770765
59317 770765 760638 751430 743304 736566 731465 727977 725771 724313 723103 722019 721469 722038 723811 726272
59303 726272 729005 732285 736696 742344 748827 755907 763771 772616 782410 793218 805380 819134 834321
59290 834321 850554 867248 883074 895728 902819 903210 897538 887739 876276 865457 856819 850949 847984
59277 847984 848213 852084 859837 871418 886611 904925 925475 947343 970022 993221 1016365 1038590
59265 1038590 1059114 1077139 1091481 1100896 1105013 1104547 1100340 1092550 1081007 1066025 1048492 1029406
59253 1029406 1009653 990131 971685 954779 939335 924993 911542 899220 888617 880167 873701 868646
59241 868646 864716 862189 861338 861770 862593 863153 863449 863817 864375 864738 864169 861989 857974 852270 844898 835502
59225 835502 823837 810434 796350 782177 767580 752060 735969 720402 706223 693531 682095
59214 682095 671923 663196 655927 649898 644808 640319 636175 632469 629626 627916 627150 627039 627516 628382 629029
59199 629029 629127 629445 631286 635008 639702 644427 649135 654101 659130 663816 668196 672727 677838 683822 690716
59184 690716 697950 704467 709680 714008 718149 722171 725775 728994 732113 735230 738533 742744 748563 755882
59170 755882 764233 773804 785179 798134 811603 824967 838527 852423 865845 877807 888058 896685
59158 896685 903270 907078 907901 906210 902493 896839 889235 880080 870297 860854 852131 843848 835746 828100
59144 828100 821290 815108 808993 802870 797258 792509 788474 784940 781875 779145 776591 774566 773793 774440 775878
59129 775878 777661 780219 784218 789740 796585 804939 815232 827615 842079 858795 877857 898879 921314
59116 921314 945016 970059 996113 1022414 1048193 1072748 1095239 1114817 1131053 1144001 1153983 1161442
59104 1161442 1166702 1169518 1169135 1165224 1158486 1149877 1139606 1127576 1114583 1102100 1090724 1079687 1068339
59091 1068339 1057386 1048078 1040624 1034107 1027695 1021208 1014491 1006942 997999 987765 976780 965309 953169
59078 953169 940190 926564 912616 898409 883802 868934 854551 841684 830905 821833 813389 804613
59066 804613 795269 785756 776571 767998 760133 752842 745613 737803 729294 720723 712814 705674 699016 692834
59052 692834 687374 682595 678168 674096 670778 668241 665812 662937 659977 657826 656943 657171 658277 660220 662825
59037 662825 665595 668057 670144 672163 674488 677390 681112 685982 692368 700467 710183 721285 733648 747229
59023 747229 761899 777438 793646 810177 826256 840837 853190 863136 870645 875523 877734 877824 876703
59010 876703 875011 872879 870266 867433 865015 863722 863922 865559 868454 872608 878036 884424 891198 897953
58996 897953 904537 910657 915711 919190 921046 921475 920562 918278 914625 909582 903051 895102 886185 876882 867509
58981 867509 858208 849471 842359 838026 836935 838639 842361 847748 854941 864036 874867 887471 902304
58968 902304 919543 938415 957767 977258 997457 1018734 1040507 1061636 1080980 1097378 1109653
58957 1109653 1117111 1119764 1117773 1110877 1098656 1081245 1059617 1035319 1009957 984621 959634 935061
58945 935061 911528 890201 871826 856207 842777 831286 821657 813631 806973 801760 798008 795189 792469
58932 792469 789343 785760 781771 777328 772344 766780 760804 754962 749917 745761 741833 737530 733138 729578
58918 729578 727454 726570 726246 725870 725227 724538 724241 724759 726492 729860 735001 741442 748463 755858 764037 773387
58902 773387 784063 796461 811273 828710 848133 868748 890246 912488 935138 958055 981633
58891 981633 1006277 1031929 1058454 1086056 1114750 1143775 1172022 1198731 1223256 1244515 1261299
58880 1261299 1272971 1279361 1280262 1275534 1265461 1250392 1230303 1205354 1176818 1146750 1116709 1087289
58868 1087289 1058805 1031859 1007116 984982 965527 948361 932636 917637 903386 890320 878486
58857 878486 867491 857176 847763 839285 831407 824007 817488 812238 807962 803745 798635 792125 784217 775220
58843 775220 765544 755720 746381 737833 729633 721035 712046 703597 696480 690552 685283 680556 676454 672759
58829 672759 669293 666483 665021 665048 666046 667410 668821 670382 672608 675887 679719 683040 685600 688308 691724
58814 691724 695105 697695 700025 702814 705348 706350 706091 706173 707291 708501 708766 708024 706525 704314 701674
58799 701674 699069 696330 692789 688534 684580 681526 678941 676443 674441 673414 673338 674323 676983 681571 687438
58784 687438 693881 700952 708913 717475 726152 734888 743780 752540 760610 767474 772566 775237 775128 772271
58770 772271 766820 759229 750686 742537 734897 726648 717215 707628 699345 692768 687529 683557 681030 679737
58756 679737 679350 680111 682495 686285 690550 694589 698498 702891 708427 715558 724405 734872 746948 760747
58742 760747 776180 792903 810746 829859 850151 870813 890626 908644 924513 938431 950885
58731 950885 962138 971745 978735 982318 982272 978790 972328 963489 952584 939371 923790 906910 890561
58718 890561 875925 863033 851553 841362 832330 824348 817733 812831 809067 805237 800935 796717 792527
58705 792527 787035 779251 769864 760144 750221 739353 727347 714740 701782 688105 673415 658083
58693 658083 643099 629704 618737 609970 602389 595382 589314 584674 581104 577615 573350 567928 561629
58680 561629 555635 551408 549311 548228 546950 545424 544311 544057 544989 547611 552022 557489 563325 569891 578106
58665 578106 588320 600175 613074 626123 638017 647712 655008 660027 662506 662145 659218 654269 647632
58652 647632 639847 631975 624755 617862 610752 603805 597836 592797 587917 582935 578370 574668 571808 569724
58638 569724 568517 568306 569297 571721 575141 578220 579860 580273 580271 579943 578865 577274 575940 574965 573713 572023
58622 572023 570665 570479 571768 574609 579031 584708 591130 598259 606530 616088 626454 636963 647095 656508
58608 656508 665174 673386 681094 687465 691717 694176 695823 696963 697173 696472 695649 695274 695192 695226 695705 697092
58592 697092 699687 703966 710604 719884 731468 744934 760145 776997 795273 814886 835698 856862
58580 856862 876747 893825 907410 917475 924175 927786 928834 928035 926203 924233 923051 923525 926398 932089
58566 932089 940494 951283 964620 981236 1001468 1024558 1049312 1075004 1101129 1126564 1149605 1168714
58554 1168714 1182825 1191297 1194284 1192981 1188857 1182672 1174670 1165385 1155584 1145509 1134824 1123181 1110238
58541 1110238 1095302 1077703 1057502 1035212 1010919 984481 956643 929236 904009 881674 862050
58530 862050 844586 828692 814152 801370 790888 782663 776196 771169 767472 764792 762791 761611 761608 762660
58516 762660 764232 765978 767692 768856 769003 768483 768209 768635 769561 770798 772275 773549 774096 774275 775220 777498
58500 777498 780410 782840 784356 785318 786330 787734 789345 790726 791940 793737 796589 799989 803387 807393
58486 807393 813159 820789 829406 838796 849937 863687 879801 897533 916372 935853 955232 973629
58474 973629 990066 1003210 1011655 1014638 1012089 1004116 991134 974559 956590 938970 922330 906820
58462 906820 892879 881280 872903 868413 867780 870219 875115 882750 893486 906438 919777 932199 943238
58449 943238 952212 957864 959315 956720 950816 942432 932495 921831 910808 899656 889083 880051 873116
58436 873116 868570 866858 868020 871007 874546 878534 883675 889981 896829 904447 914010 926026 939653 953818
58422 953818 967887 980948 991550 998662 1002154 1002061 998215 990948 981298 970179 958074 945679 934049
58409 934049 923734 914487 906045 898511 891782 885315 878715 872147 866255 862161 861119 863292 867204 871315
58395 871315 875702 881022 886442 890261 892350 894150 896115 896969 895850 893477 890724 887684 884794 883240
58381 883240 883395 884231 885030 886356 888605 891089 893647 897794 904996 914748 925508 936740 948958 962392
58367 962392 976666 991402 1006411 1021613 1037213 1053530 1070364 1087030 1103148 1118638 1132896
58356 1132896 1144899 1154295 1161410 1166104 1167840 1167096 1165425 1163807 1162132 1160571 1160094 1161242 1163763 1167864
58342 1167864 1174422 1183513 1194175 1206052 1219693 1234793 1249889 1264619 1280473 1298340 1316866 1334281
58330 1334281 1350268 1364888 1377261 1386708 1393930 1399695 1403371 1404047 1402188 1399138 1395914 1393419 1392748 1394232
58316 1394232 1397072 1400737 1405806 1412703 1420812 1429682 1439910 1452000 1465481 1479946 1495726 1512773
58304 1512773 1530184 1547703 1566414 1587083 1608995 1631032 1652542 1672665 1690538 1706929 1723860
58293 1723860 1741755 1758858 1774406 1790303 1808381 1827893 1847078 1865419 1882992 1899428 1915039
58282 1915039 1931368 1949219 1967698 1986418 2006880 2030454 2056955 2086561 2121190 2162412 2209881
58271 2209881 2263178 2323099 2389565 2460297 2533210 2608101 2684576 2760657 2835263 2909799 2985512
58260 2985512 3061436 3136553 3211422 3285802 3357375 3425010 3490791 3556792 3622650 3688520 3757392
58249 3757392 3831821 3911138 3994574 4084207 4181943 4286572 4396958 4515230 4643480 4780127
58239 4780127 4922992 5073376 5233642 5403426 5581748 5770279 5971076 6183726 6408066
58230 6408066 6646858 6902429 7173855 7460933 7767484 8097187 8450048 8826974 9233657
58221 9233657 9675499 10152980 10666863 11223693 11831189 12492954 13213297 14002751 14873441
58212 14873441 15834243 16896723 18080845 19409284 20902999 22590050 24513249 26723521
58204 26723521 29275693 32241803 35723216 39844084 44745866 50599938 57612447 66001771
58196 66001771 75985421 87811266 101794739 118304667 137706162 160291482 186177632
58189 186177632 215160227 246595152 279338888 311627608 340855490 363592994 376307658
58182 376307658 376675810 364635279 342380957 313385123 281233473 248909652 218562864
58175 218562864 191513603 168358688 149123783 133385429 120355140 109047789 98589090
58168 98589090 88493647 78703105 69399664 60796950 53043118 46208919 40294969 35246149
58160 35246149 30976292 27386372 24370566 21825680 19665360 17822489 16240175 14869451
58152 14869451 13674830 12631910 11717224 10906308 10180485 9527547 8935407 8391631 7888927
58143 7888927 7424579 6994480 6593437 6220565 5878126 5565111 5277400 5013559 4774599
58134 4774599 4558266 4359165 4174577 4004872 3848002 3698718 3553674 3412905 3276087
58125 3276087 3141938 3011748 2889194 2775787 2669858 2570179 2477076 2389895 2306981 2228475
58115 2228475 2155928 2088956 2025379 1964693 1908343 1856528 1807659 1761036 1717187 1675572 1634746
58104 1634746 1594840 1557334 1522519 1489710 1459595 1433673 1411539 1391224 1371812 1353151 1333604
58093 1333604 1311163 1286567 1262394 1239093 1214780 1188906 1163241 1138948 1115401 1092230 1069943
58082 1069943 1048088 1025180 1000928 976465 952108 926946 900854 874912 849733 825338 802612
58071 802612 782811 765574 749486 734535 721886 711338 701329 691517 683055 676099 669372 662496
58059 662496 656451 651239 645334 638082 630587 623559 616157 607694 598778 590077 581509 573292 566358 561083
58045 561083 556826 553023 549535 545824 541184 535965 531164 526800 522133 517374 513425 509876 505153 498901
58031 498901 492395 486234 479473 471592 463612 456511 450036 443736 437815 432326 426828 421472 417257 414693
58017 414693 413222 412294 411929 411947 411859 411849 412704 414494 416439 418229 420259 422433 424117 425503 427656 430937
58001 430937 434722 438932 444393 451269 458590 465856 473753 482762 492277 501553 510287 517705 522349 523435
57987 523435 521436 516949 510122 501614 492828 484545 476289 467521 458506 449636 440986 432864 425659 418836
57973 418836 411352 403494 396961 392574 389206 385612 381974 378884 376045 373015 370229 368287 367005 365978
57959 365978 365337 365193 365023 364396 363703 363513 363752 364073 364472 365083 365971 367446 369913 372996 375645 377541 379634
57942 379634 382851 387072 391846 397285 403651 410705 418049 425576 433184 440638 448101 456084 464475 472170
57928 472170 478007 481508 482563 481190 477833 473070 466767 458334 448103 437477 427310 417098 406243
57915 406243 395222 384904 375595 367321 360289 354419 349013 343449 337674 331742 325548 319391 313966 309387
57901 309387 304846 299633 293822 287778 281884 277001 274141 273211 273074 273297 274794 278177 282600 287021 291597
57886 291597 296985 303145 309718 316749 324079 330693 335586 338831 341038 342330 342610 342257 341757 341055 339925
57871 339925 338427 336453 333502 329672 326218 324290 323643 323377 323342 323947 325129 326514 328303 331049 334813
57856 334813 339323 344770 351564 359387 367159 373981 379633 384288 388277 391998 395587 398680 400765 401585
57842 401585 401104 399457 397158 394853 392605 389920 386747 383818 381614 379693 377536 375436 373967 373178 372897
57827 372897 373292 374469 376002 377493 379129 381088 382873 383939 384481 384939 385127 384582 383399 382035 380513
57812 380513 378433 375509 371601 366510 360329 353636 346822 339506 331096 321549 311136 299963 288275
57799 288275 276798 266164 256439 247793 241052 236734 233914 231009 227614 224823 223741 224294 225539 226695
57785 226695 227823 229719 233065 237594 242455 247439 253225 260176 267688 275186 283011 291655 300730 309363
57771 309363 317009 323279 327602 329884 330863 331016 329695 326221 321217 315807 310014 303127 295351 287853 281248
57756 281248 275218 269679 265235 262195 260007 258027 256247 255065 254818 255662 257512 259973 262608 265147 267303
57741 267303 268768 269767 271086 272973 274542 274939 274570 274342 274210 273545 272592 272349 273032 273802 274219 275023 277164
57724 277164 280745 285122 289465 293099 295840 298139 300431 302425 303496 303595 303161 302362 301116 299668 298310
57709 298310 296670 294170 291151 288616 286807 284942 282548 280111 278081 276140 273943 271938 270915 271142
57695 271142 272298 273928 275691 277450 279313 281383 283504 285620 288307 292435 298248 305291 313294 322714
57681 322714 334384 349162 367997 391876 421582 457889 501981 555330 619302 695444 786014
57670 786014 893409 1018683 1160750 1316677 1481662 1647888 1803202 1931150 2013495 2035460
57660 2035460 1991811 1889674 1745416 1577994 1403797 1235040 1079932 943028 825989 728665
57650 728665 649541 585764 534043 492049 458477 431842 410083 391580 375803 362676 352001
57639 352001 343666 337603 333154 329167 325100 321387 318354 315485 312258 309138 307120 306602 307112 307823 307988
57624 307988 307147 305281 302671 299557 296129 292721 289512 286101 282033 277747 274283 271870 269648 267011
57610 267011 264455 262616 261236 259687 257951 256459 255318 254314 253370 252577 252025 251945 252641 253889 254721 254280
57594 254280 252618 250345 247786 244869 241504 237642 233177 228235 223369 219122 215548 212425 209734 207606
57580 207606 205984 204603 203204 201549 199405 196696 193493 189746 185294 180328 175533 171524 168328 165581
57566 165581 162987 160423 157898 155601 153716 152026 150066 147900 146344 146091 146884 147893 148662 149373 150441
57551 150441 152223 154934 158402 161950 164886 167126 169119 171155 172954 174029 174264 174036 173771 173499 173001
57536 173001 172364 172100 172539 173395 174227 175105 176389 177955 179152 179581 179556 179744 180580 182012 183515 184510 185069
57519 185069 186035 188018 190528 192600 194047 195447 197091 198757 200479 202649 205217 207594 209555 211446
57505 211446 213314 214651 215325 215891 216522 216443 215029 212788 210623 208678 206544 204091 201423 198500 195474
57490 195474 193056 191830 191420 190919 189957 188810 187751 186889 186476 186706 187205 187198 186249 184582 182721 181119 179993
57473 179993 179207 178386 177304 175996 174421 172423 170294 168904 168801 169493 170109 170524 171363 173044 175337 177777
57457 177777 180049 181942 183333 184355 185405 186914 189108 191810 194444 196482 198007 199581 201474 203428
57443 203428 205297 207379 209745 211724 212590 212523 212396 212821 213833 215317 217229 219391 221481 223315 224986
57428 224986 226774 229006 231797 234697 236877 237939 238370 238942 239837 240628 240957 240937 240999 241551 242633 243780 244379
57411 244379 244342 244258 244783 246157 248364 251302 254522 257192 258782 259613 260474 261868 263821 266210 268925 271887
57395 271887 275079 278470 281843 284922 287718 290484 293361 296408 299959 304382 309471 314632 319774 325335
57381 325335 331300 336981 342012 346773 351424 355383 358325 360901 363779 366690 369208 371791 375150 379064
57367 379064 382737 385982 389206 392521 395742 399002 402553 406135 409285 412096 414973 417892 420683 423739
57353 423739 427611 432140 436913 442334 449160 457016 464522 471065 477426 484325 491297 497545 503110 508627
57339 508627 514434 520457 526617 532905 539261 545683 552258 558976 565736 572596 579723 587044 594299 601501
57325 601501 608942 616647 624185 631204 637882 644756 652254 660443 669006 677472 685665 693898 702628 712050
57311 712050 722147 732762 743355 753144 762056 771162 781500 792664 803265 812659 821496 830615 840219
57298 840219 850286 860992 872374 884080 895832 907764 920021 932388 944545 956506 968637
57287 968637 981367 994876 1008901 1022968 1037001 1051442 1066488 1081610 1096349 1111203 1126965
57276 1126965 1143393 1159470 1175025 1191177 1208835 1227490 1245905 1263513 1280770 1298543 1317430
57265 1317430 1337360 1357648 1377723 1397865 1418721 1440080 1460753 1479969 1498421 1517477 1537755
57254 1537755 1558797 1579907 1600911 1622212 1644328 1667373 1690956 1714680 1738620 1763101 1788164
57243 1788164 1813618 1839478 1865830 1892330 1918352 1943788 1969201 1995099 2021467 2048112 2074986
57232 2074986 2102014 2129037 2156090 2183308 2210439 2236931 2262719 2288535 2315124 2342525 2370344
57221 2370344 2398409 2426839 2455748 2485269 2515750 2547688 2581338 2616464 2652507 2689086 2726348
57210 2726348 2764596 2803519 2842184 2880009 2917280 2954307 2990616 3025641 3059693 3093341 3126098
57199 3126098 3156880 3185795 3214370 3243659 3273085 3301608 3329234 3356735 3384545 3412610 3440977
57188 3440977 3469904 3499557 3530014 3561456 3594065 3627863 3662777 3698691 3735399 3772799 3811207
57177 3811207 3851114 3892563 3935155 3978837 4024383 4073056 4125984 4183574 4244762 4306767 4366269
57166 4366269 4421229 4471390 4517173 4558777 4596468 4630979 4663266 4694283 4725075 4756412 4788108
57155 4788108 4819340 4849955 4880816 4912521 4944398 4975240 5004510 5032359 5058923 5084122 5107842
57144 5107842 5129830 5149613 5166726 5180741 5190892 5196081 5195580 5189503 5178493 5163409 5145436 5126008
57132 5126008 5106374 5087651 5071479 5060022 5054951 5056759 5065175 5079684 5099341 5122646 5148033 5174283
57120 5174283 5200461 5226191 5252357 5281126 5315032 5356441 5407825 5471573 5548916 5639632 5743421
57109 5743421 5861497 5996942 6154465 6340383 6562375 6828808 7148879 7534201 8000396
57100 8000396 8567436 9259212 10103078 11129091 12368636 13852859 15611252 17670805 20056884
57091 20056884 22795795 25915724 29442649 33392613 37764689 42536340 47660838 53068211
57083 53068211 58668827 64350244 69959536 75283521 80054843 83995033 86870233 88524463
57075 88524463 88881126 87931262 85726033 82373600 78033695 72908372 67229485 61241112
57067 61241112 55177603 49243711 43602570 38371258 33621311 29383607 25656992 22417642
57059 22417642 19626690 17236659 15197355 13459970 11978907 10713015 9627095 8692225
57051 8692225 7884260 7182458 6569573 6032051 5559064 5141389 4771190 4442027 4148396
57042 4148396 3885501 3649519 3437414 3246209 3073037 2916021 2774220 2646326 2530155
57033 2530155 2423828 2326697 2238674 2159387 2088549 2026558 1974144 1931949 1900942 1882737 1878971
57022 1878971 1890773 1919031 1964358 2026020 2101062 2184358 2267937 2339205 2381487 2379765 2328339
57011 2328339 2233571 2109504 1971001 1829852 1694556 1571085 1462918 1370901 1293863 1229782
57001 1229782 1176615 1132525 1095804 1064877 1038373 1015144 994392 975851 959656 945823 934006
56990 934006 923834 915212 908040 901972 896778 892632 889490 886376 881763 874475 863638 848067 826647
56977 826647 799619 768828 736492 704247 673443 645494 621357 601104 584438 571344 561959 556250
56965 556250 554204 556016 561667 570506 581655 594739 609986 627635 647201 666937 683786 694261
56953 694261 695977 688598 673496 652735 628344 602087 575459 549890 526876 507688 492828 482028
56941 482028 474955 471720 472585 477398 485582 496692 510905 528846 550800 576040 603005 629916 654684
56928 654684 674124 684268 682433 668999 646622 618058 585375 550820 517088 486226 458862 434733
56916 434733 413375 394169 376476 360228 345964 334086 324447 316814 311161 307254 304447 302162 300217
56903 300217 298516 296921 295586 294910 294935 295321 296081 297779 300815 305118 310828 318557 328542 340128 352584
56888 352584 365893 380246 395170 409699 422951 433949 441246 443432 440073 431951 420605 407900
56876 407900 395617 384920 376258 369913 366323 365654 367569 371838 378883 389344 403444 421200 442933
56863 442933 469084 499614 533845 570641 608262 644092 674688 696230 705424 700935 684453 659870
56851 659870 631025 600424 570041 542295 519456 502595 491814 487158 488765 496513 510263 530285
56839 530285 557027 590735 631666 680112 735441 795297 856152 914031 964027 999877 1015726
56828 1015726 1008992 981295 936968 881445 820587 759827 702891 651639 607300 571248 544353
56817 544353 526309 516168 513246 517240 527978 545427 569617 600093 635613 674588 715409 755775
56805 755775 791731 817908 829195 822715 798827 760770 713392 661718 610051 561656 518726 482387
56793 482387 452826 429580 411937 399362 391737 389146 391389 397877 408122 422076 439732 460496
56781 460496 483167 506234 527684 544612 553700 552697 541577 522259 497327 469023 439177 409565
56769 409565 381875 357122 335289 315818 298511 283773 271988 262970 256108 250750 246269 242089
56757 242089 237956 234055 230583 227376 224182 221136 218618 216684 214931 212956 210770 208747 207273 206487
56743 206487 206277 206480 207010 207685 208106 207937 207343 206771 206308 205592 204466 203337 202704 202690 203207 204198 205488 206776
56725 206776 208056 209701 211822 213927 215557 216929 218516 220285 221749 222580 222779 222517 222184 222360 223261 224427
56709 224427 225368 226234 227412 228743 229702 230137 230205 229766 228589 227092 226135 225901 225656 224830 223751 223028 222664
56692 222664 222167 221169 219617 217593 215272 212924 210748 208860 207513 207055 207435 208009 208165 208025 208180 208763
56676 208763 209133 208704 207855 207645 208596 210058 210949 210922 210500 210269 210358 210681 211250 212079 213117 214353 215671 216522
56658 216522 216241 214900 213408 212531 212265 212487 213595 215935 218966 221685 223694 225236 226391 226936 227023 227313
56642 227313 228244 229589 230925 232128 233213 233992 234185 233812 233378 233587 234687 236009 236359 235184 233166 231435
56626 231435 230373 229475 228222 226639 225115 224041 223663 223955 224616 225403 226415 227812 229350 230541 231262 231951
56610 231951 233119 234860 236832 238583 239945 241216 242847 244794 246413 247182 247356 247678 248550 249689 250478
56595 250478 250466 249715 248840 248596 249218 250315 251411 252293 252757 252466 251329 249694 247942 246243 244836 244079 243929
56578 243929 243924 243935 244361 245222 245799 245716 245711 246670 248493 250638 253127 256130 259165 261813 264865 269594 276101 283435
56560 283435 291215 299957 309813 320128 330386 340445 349589 356398 360081 361205 360786 359456 357789 356583
56546 356583 356189 356102 355611 354509 352908 350923 348741 346451 343646 339762 335050 330543 326859 323627 320344
56531 320344 317062 313879 310417 306364 302013 297794 293719 289728 286186 283531 281687 280167 278477 276203
56517 276203 273090 269329 265531 262113 258986 255995 253298 251109 249394 247999 246765 245431 243832 242249
56503 242249 241106 240214 238871 236870 234829 233314 232248 231447 231087 231203 231290 230942 230534 230764 231814 233320
56487 233320 234891 236272 237297 237998 238540 238783 238231 236741 235000 233989 234133 235189 236698 238296 239849
56472 239849 241497 243376 245201 246462 247124 247734 248673 249716 250540 251242 252062 252946 253709 254346 254955 255569 256233
56455 256233 256997 257772 258483 259364 260638 261937 262589 262594 262682 263234 263755 263677 263037 262054 260691 259074 257774 257125
56437 257125 256681 255864 254770 253893 253359 252901 252314 251583 250803 250254 250294 250903 251606 252028 252175 252055 251567 250967 250914
56418 250914 251690 252902 254190 255693 257452 259074 260430 262015 264027 265681 266130 265603 264922 264294 263369 262186
56402 262186 261308 261135 261668 262870 264621 266446 267843 268899 270123 271685 273242 274467 275402 276284 277316
56387 277316 278576 279945 281200 282337 283595 285023 286262 287013 287415 287768 288161 288587 289105 289633 289934 290026 290252
56370 290252 290681 290887 290627 290389 290825 291988 293439 294805 295884 296528 296783 296901 296987 296955 296996 297644 299081 300803
56352 300803 302241 303333 304216 304909 305576 306584 307913 308980 309400 309472 309648 310083 310960 312556 314570 316095
56336 316095 316825 317589 319209 321462 323785 326250 329138 332194 335114 338211 341786 345324 348145 350402 352670
56321 352670 354975 356997 358762 360343 361297 361251 360636 360077 359454 358403 357264 356614 356321 356047 356297 357842 360385
56304 360385 362896 365100 367551 370410 373346 376565 380735 385737 390524 394422 397659 400449 402595 404268
56290 404268 406198 408686 411220 413541 416361 420525 425962 431876 437611 443065 448601 454800 461962 469700
56276 469700 477309 484621 492131 500300 509154 518607 528804 539999 552352 565861 580344 595581 611669
56263 611669 629012 647786 667832 689427 713681 741614 773205 807916 845865 887869 934691
56252 934691 986943 1045458 1110970 1183495 1262617 1348273 1440612 1539210 1643043 1751051 1862130
56241 1862130 1974649 2086480 2195348 2298758 2393895 2478132 2549325 2605228 2643254 2661627
56231 2661627 2660379 2640547 2602975 2548867 2480865 2402310 2315605 2222334 2124696 2025464 1926470
56220 1926470 1828281 1731568 1637811 1548462 1464297 1385781 1313307 1246829 1185866 1129933 1078509
56209 1078509 1030810 986301 945256 908036 874119 842674 813773 788063 765453 745195 727005
56198 727005 710988 696632 683148 670784 660519 652351 645163 638472 633039 629380 626851 624615 622522
56185 622522 620591 618617 616735 615542 615215 615225 615171 615119 614895 613931 612185 610486 609634 609794 610911 612994 615782
56168 615782 618790 621848 625017 628153 631356 635616 641910 649702 657502 664963 673238 683061 693801 704868
56154 704868 716862 730754 746833 765018 785397 807966 832556 859466 889654 924149 963932
56143 963932 1010383 1064907 1128037 1199829 1281338 1374711 1481578 1602133 1735739 1881127 2035492
56132 2035492 2194192 2351666 2502049 2639412 2759158 2860088 2944395 3015400 3075955 3128489
56122 3128489 3174524 3213094 3240692 3253744 3250803 3232492 3200562 3157556 3106182 3047833 2981594
56111 2981594 2904608 2813109 2703875 2576338 2433832 2282220 2127502 1975383 1831972 1702500
56101 1702500 1588918 1490231 1405415 1334523 1276932 1230469 1192997 1163406 1140552 1122700 1108678
56090 1108678 1098280 1091031 1085824 1082193 1080599 1081026 1082553 1084617 1087382 1090692 1094206 1098767 1105908 1115669
56076 1115669 1126628 1138394 1152197 1168540 1186276 1204683 1224507 1246183 1268888 1292221 1317051
56065 1317051 1343760 1371282 1398642 1425686 1451538 1474256 1492985 1508756 1522266 1532692 1539627
56054 1539627 1544368 1548348 1551925 1555470 1559792 1564646 1568787 1572272 1576771 1582894 1589407 1595900 1603811 1613820
56040 1613820 1624656 1635616 1647862 1662114 1677711 1695261 1717559 1746405 1781049 1821153 1868309
56029 1868309 1922753 1981391 2041126 2101562 2162519 2221872 2278372 2334060 2391334 2449852 2508631
56018 2508631 2568812 2631875 2697309 2764473 2834564 2908501 2985101 3063597 3145643 3232685 3323853
56007 3323853 3418578 3518515 3624618 3735302 3849971 3971142 4100430 4235692 4375121 4520827
55997 4520827 4675284 4837708 5007373 5186938 5378748 5581302 5793364 6018241 6259949
55988 6259949 6518388 6792442 7084424 7397358 7731489 8087919 8471993 8888506 9337480
55979 9337480 9819508 10341199 10910413 11530660 12205788 12945743 13762055 14662771 15658416
55970 15658416 16768171 18014083 19415524 20997563 22799981 24871681 27265000 30047002
55962 30047002 33312333 37178811 41781781 47285559 53890266 61812158 71267764 82498508
55954 82498508 95808245 111560212 130132732 151856607 176913911 205188436 236138815
55947 236138815 268736451 301357564 331557104 356005409 371059688 373986443 364112385
55940 364112385 343064921 313994934 280443444 245538235 211676212 180477408 152840363
55933 152840363 129071571 109064029 92462859 78792495 67558236 58315170 50687717
55926 50687717 44360018 39072697 34625346 30864299 27662899 24916247 22545603 20492471
55918 20492471 18705937 17140742 15762920 14547238 13469235 12505576 11639626 10859620
55910 10859620 10152756 9506803 8915339 8375217 7880243 7422609 6998684 6607897 6247287
55901 6247287 5912226 5601182 5314806 5051246 4806759 4579807 4370320 4176008 3993524
55892 3993524 3822309 3663427 3515614 3376189 3244868 3123021 3010024 2903820 2804220 2712360
55882 2712360 2627691 2548644 2475365 2408754 2347743 2290549 2237560 2189876 2145827 2101931 2056378
55871 2056378 2008684 1957068 1899642 1837658 1774432 1711466 1648589 1587315 1530807 1480509 1435663
55860 1435663 1396204 1363442 1337675 1317406 1301010 1287094 1273410 1257659 1239415 1219453 1197504
55849 1197504 1172654 1145490 1117615 1089264 1059557 1028928 999116 970773 943116 915964 890164
55838 890164 865960 842801 820841 800875 782759 765625 749694 736204 725435 716354 708295 701520
55826 701520 696055 691368 687136 683066 678111 671253 662903 654211 645284 635449 625010 615208 606608 599000
55812 599000 592601 587853 584185 580546 577162 575409 575964 578321 581876 586108 589950 592568 594665 597608
55798 597608 601342 604477 606119 606077 603634 597991 589989 581589 573372 564220 553766 543501 534928 528111
55784 528111 522675 518906 517043 516450 516156 515503 513917 510831 506290 501068 496091 492256 490609 491766 495111
55769 495111 499344 503752 508155 511874 513849 513692 511636 507546 501128 493056 484725 476787 468939 461184
55755 461184 454118 447944 442340 437456 433834 431015 427332 421443 413228 403001 390885 377351 363454
55742 363454 350087 337667 326763 318172 312044 307578 303898 300611 297468 294231 291038 288221 285613
55729 285613 282713 279578 276814 274607 272527 270363 268321 266303 263785 260706 257726 255371 253513 251885
55715 251885 250483 249277 248108 247024 246295 245976 245963 246393 247479 249010 250471 251582 252190 251921 250591 248727
55699 248727 247061 245760 244770 244380 244543 244107 241936 238576 235714 234153 233481 233573 234981 237627 240440 242727
55683 242727 244930 247727 251309 255821 261504 268053 274662 281013 287410 293803 299588 304579 309201 313417
55669 313417 316457 317915 318169 317373 315030 311079 306546 302555 299370 296830 294969 293704 292595 291415 290467
55654 290467 289992 289812 289777 289871 289608 288025 284604 279638 273528 266499 259209 252659 247006 241278 234869 228602
55638 228602 223706 220309 217607 215056 212785 211027 209645 208182 206276 204170 202674 202199 202031 201114 199346
55623 199346 197317 195043 192007 188475 185544 183620 181941 179958 178070 176592 175135 173622 172773 172793 172533
55608 172533 170894 168281 165804 163757 161860 160410 160049 160661 161379 161606 161403 161065 160856 160954 161144 160857 159928
55591 159928 158975 158559 158412 157981 157343 156958 156871 156743 156437 155989 155192 153822 152202 151084 150998 151945 153534 155191
55573 155191 156528 157760 159442 161555 163375 164569 165879 168149 171092 173657 175353 176528 177527 178226 178426
55558 178426 178180 177586 176602 175252 173834 172811 172402 172245 171587 170094 168381 167408 167412 167883 168544 169734 171721
55541 171721 174253 177005 179832 182314 183768 184209 184740 186415 189069 191694 193560 194466 194326 193150 191361
55526 191361 189631 188360 187445 186388 184501 181381 177394 173374 169678 165925 161840 157807 154292 151228
55512 151228 148401 146002 144323 143293 142768 142929 143858 144956 145259 144254 142105 139314 136493 134210 132696
55497 132696 131747 131097 130705 130567 130578 130726 131158 131903 132823 133908 135166 136205 136489 136229 136333 137185 138032 137941
55479 137941 136821 135147 133317 131778 131188 131741 132694 133139 132968 132674 132541 132555 132771 133189 133459 133167 132334 131308
55461 131308 130329 129498 128935 128699 128697 128824 128971 128812 128058 127049 126602 127062 127955 128749 129417 130020 130355 130304 130052
55442 130052 129683 129160 128848 129309 130217 130367 129217 127676 126822 126667 126742 127046 127645 128103 128191 128522 129623 130868
55424 130868 131231 130664 129941 129615 129832 130671 131823 132386 131828 130802 130281 130327 130443 130595 130961 131204 130938 130526
55406 130526 130464 130381 129636 128497 127715 127318 126887 126699 127425 128884 130240 131255 132257 132988 132697 131394 129951
55389 129951 128905 128183 127930 128468 129368 129675 129241 128824 128801 128800 128744 129148 130084 130912 131305 131642 132072 132185 131876 131589
55369 131589 131390 130770 129777 129367 130120 131436 132433 132877 132828 132264 131547 131411 131939 132312 132043 131661 131634 131510 130863
55350 130863 130251 130362 130792 130633 129897 129455 129744 130281 130364 129626 128041 125968 124213 123572 124190 125550 126954
55333 126954 127857 128003 127570 127052 126750 126463 125895 125211 124960 125474 126444 127084 126817 125884 125131 125030 125199 125189 125320
55314 125320 126143 127353 128026 127859 127420 127184 127100 127161 127556 128057 128067 127549 127189 127320 127410 126970 126284 125880 125891 126266
55294 126266 126936 127448 127175 126301 125891 126530 127559 128143 128367 128706 129144 129570 130423 132087 134052 135395 135844
55277 135844 135730 135282 134613 134070 133938 133982 133872 133710 133601 133085 131710 129953 128800 128522 128532 128363 128192 128358
55259 128358 128897 129620 130329 130952 131678 132796 134176 135230 135702 136061 136735 137394 137614 137800 138687 140182 141477
55242 141477 142135 142306 142008 141022 139606 138470 137890 137481 137011 136703 136533 135947 134742 133600 133199 133211 132772 131714
55224 131714 130723 130303 130166 129809 129262 128983 129210 129807 130713 132129 133966 135390 135418 134040 132371 131488 131396 131363
55206 131363 131024 130759 131104 132129 133457 134701 135729 136593 137298 137717 137788 137641 137420 137105 136727 136622 137129 138054
55188 138054 138834 139256 139583 139927 139946 139358 138337 137223 136199 135434 135109 135068 134868 134377 133966 133898 134034 134346 135153
55169 135153 136466 137696 138440 139044 139866 140591 140901 141269 142239 143299 143405 142444 141370 140928 140999 141175 141248 141085
55151 141085 140790 141045 142577 145021 146908 147046 145518 143291 141341 140275 140115 140148 139506 138224 137295 137448
55135 137448 138314 139165 139960 141116 142493 143237 142725 141314 139950 139224 138872 138184 136806 135064 133593 132808
55119 132808 132810 133548 134793 136104 137124 137896 138690 139622 140674 141915 143314 144451 144859 144683 144569 144820 145056
55102 145056 144870 144428 144253 144686 145723 147124 148472 149401 150012 150827 152117 153484 154352 154677 154821 154845 154373
55085 154373 153280 152172 151862 152463 153283 153591 153253 152546 151705 150928 150586 150928 151623 152029 152037 152194 152817 153436 153464
55066 153464 153051 152789 152830 152773 152347 151707 151071 150475 149961 149668 149570 149371 148811 147906 146844 145759 144724 143868 143429
55047 143429 143607 144276 144861 144736 143858 142821 142221 142163 142426 142788 143074 143282 143855 145370 147609 149390 149797 149249
55029 149249 148860 149035 149306 149286 149122 149043 149130 149499 150094 150284 149278 147193 145172 144273 144572 145428 146161 146396 146250
55010 146250 146386 147472 149351 151059 151833 151780 151468 151257 151234 151443 151901 152535 153230 153752 153707 152959 152141 152309 153872
54991 153872 156153 158090 159073 159060 158381 157670 157537 157988 158430 158473 158440 158822 159562 160197 160474 160481 160307 159893 159234 158556
54971 158556 158312 158957 160565 162574 164171 165019 165453 165899 166416 166893 167418 168205 169314 170619 171925 173073
54955 173073 174060 175049 176063 176762 176848 176597 176563 176727 176500 175732 175167 175558 176764 178100 179168 179913 180257 180243
54937 180243 180391 181376 183306 185680 188067 190581 193761 198244 204491 212547 222048 232593 244114 256787
54923 256787 270725 285927 302400 320012 338199 355912 371830 384638 393266 397089 395921 389839
54911 389839 379183 364706 347542 328960 310300 292950 277862 264902 253163 242192 232558 224920
54899 224920 219034 214192 210278 207741 206628 206272 206029 205876 206207 207409 209759 213363 218045 223496 229667
54884 229667 236868 245445 255607 267500 281118 295981 311288 326589 342095 358011 373600 387080
54872 387080 396433 400246 398026 390117 377539 361715 344057 325672 307354 289699 273103 257773
54860 257773 243949 232097 222599 215213 209142 203762 199015 194882 190875 186502 182037 178283 175600 173656
54846 173656 172110 170940 169956 168638 166854 165282 164618 164669 164680 164403 164355 165077 166555 168346 169875 170550 169998
54829 169998 168469 166829 165878 165668 165572 165057 164262 163788 163975 164606 165266 165695 165679 164975 163759 162904 163202 164354
54811 164354 165298 165623 166036 167186 168641 169453 169287 168496 167448 166362 165600 165548 166207 167301 168723 170516 172487
54794 172487 174248 175667 176919 178112 179201 180309 181705 183307 184543 184997 185012 185434 186809 189033 191724
54779 191724 194712 198007 201470 204909 208623 213546 220533 229598 240180 252003 265270 280089 296239
54766 296239 313568 331983 350723 368112 382401 392596 398260 399035 394814 386097 373773 358784
54754 358784 342283 325576 309377 293502 277848 263375 251390 242121 234686 228368 223182 219232
54742 219232 216293 214224 213113 212795 212801 212993 213742 215241 217177 219376 222282 226362 231508 237458 244544 253520
54726 253520 264734 277822 292190 307495 323571 339996 355720 369165 378898 384296 385412 382253
54714 382253 374642 362992 348757 333587 318146 302238 286007 270488 256750 244915 234419 224983
54702 224983 216828 209962 203866 198232 193564 190501 188745 187256 185522 183988 183046 182263 181029 179457 178086
54687 178086 177034 176037 175128 174680 174774 175009 174910 174181 172707 170784 169274 168977 169759 170687 171067 170944 170662 170426
54669 170426 170364 170529 170660 170329 169448 168318 167182 166101 165241 164795 164598 164320 164121 164515 165510 166517 167257 168044
54651 168044 168899 169214 168824 168761 170125 172584 174668 175369 174847 173747 172489 171240 170067 168986 168125 167816
54635 167816 168262 169177 170018 170439 170397 170026 169677 169803 170408 170878 170693 170100 169654 169385 168970 168540 168661 169492 170532
54616 170532 171329 171998 172861 173965 175037 175653 175455 174571 173771 173761 174314 174612 174434 174397 174865 175334 175317 175182 175495
54597 175495 175956 175737 174713 173628 173018 172638 172138 171747 171922 172670 173544 174101 174112 173541 172684 172206 172560 173316
54579 173316 173435 172423 170942 170077 170205 170810 171168 170888 169924 168603 167688 167923 169210 170549 171080 170969 170922
54562 170922 171080 170891 170043 169034 168631 169087 170148 171532 173039 174238 174494 173570 172146 171439 172076 173356
54546 173356 173829 172766 170985 170115 171067 173313 175607 177213 178391 179844 181826 183853 185264 186014 186731
54531 186731 187915 189322 190384 191110 192171 194036 196352 198364 199747 200794 201942 203334 204743 205675 205563
54516 205563 204135 201709 199057 196881 195425 194529 193907 193299 192441 191046 188996 186613 184627 183640 183538 183627
54500 183627 183428 183151 183207 183537 183786 183981 184487 185239 185563 185091 184413 184379 185003 185528 185456 184980 184434 183855 183272 182916
54480 182916 182884 182931 182881 182967 183450 184172 184809 185356 185993 186642 187120 187619 188541 189812 190856 191381 191709 192097 192181 191560
54460 191560 190643 190279 190569 190657 189930 189006 189027 190205 191545 192097 191958 191837 192030 192248 192248 192093 191806 191282 190628
54441 190628 190165 189887 189351 188326 187191 186336 185572 184553 183462 182728 182316 181864 181433 181506 182268 183406 184686
54424 184686 186133 187562 188531 189016 189641 190967 192903 195070 197242 199146 200238 200185 199316 198238 197208 196175
54408 196175 195178 194315 193585 193154 193557 195121 197244 198721 198879 198143 197539 197884 199378 201578 203698 205200
54392 205200 206192 207125 208177 209177 209978 210616 211050 211135 210905 210663 210609 210570 210212 209457 208537 207676 206799 205680 204409
54373 204409 203567 203666 204449 205143 205430 205728 206329 206779 206570 206007 205743 205750 205436 204702 204162 204271 204911 205954 207528
54354 207528 209432 210906 211383 211046 210271 209018 207221 205302 203705 202199 200369 198584 197721 197860 197989 197322
54338 197322 196345 196117 196923 198153 199294 200422 201601 202366 202124 200893 199242 197669 196345 195474 195432 196314
54322 196314 197592 198539 198900 198940 198953 199066 199419 200135 200962 201295 200843 200095 199823 200213 200685 200561 199680 198326 196781
54303 196781 195158 193628 192587 192437 193152 194207 195002 195356 195521 195822 196424 197315 198343 199253 199924 200600 201670
54286 201670 203101 204318 204860 205016 205592 207082 209239 211391 212994 213878 214226 214467 215088 216355 218225 220568
54270 220568 223412 226826 230550 233910 236287 237684 238730 240051 241750 243464 244800 245565 245622 244771 242873
54255 242873 240073 236795 233569 230841 228860 227589 226674 225544 223739 221243 218530 216239 214787 214219 214260
54240 214260 214385 213994 212804 211135 209638 208688 208219 208064 208180 208413 208422 208080 207685 207539 207535 207479 207569 208119 208907 209274
54220 209274 208921 208232 207724 207510 207390 207174 206743 206066 205292 204637 204064 203250 201951 200290 198635 197370 196762
54203 196762 196792 197065 197161 197111 197239 197503 197405 196719 195913 195565 195713 196029 196374 196812 197298 197711 198064 198373 198486 198356
54183 198356 198324 198733 199346 199545 199084 198340 197814 197738 198180 199097 200126 200619 200159 198925 197495 196376 195732 195368
54165 195368 194912 194245 193756 194005 195047 196364 197537 198657 199881 200892 201178 200748 200179 199955 200011 200017 199850 199641
54147 199641 199471 199217 198751 198207 198021 198634 200051 201706 202887 203382 203644 204227 205101 205685 205570 205039 204747 204964
54129 204964 205320 205309 204890 204537 204776 205747 207166 208642 210007 211333 212645 213728 214394 214909 215906 217727 220011
54112 220011 222123 223856 225446 226924 227807 227654 226780 226111 226260 226907 227211 226707 225618 224319 222811 220955
54096 220955 219028 217663 217188 217272 217370 217266 217010 216551 215750 214668 213574 212612 211731 210985 210656 210913 211491 211954
54078 211954 212262 212881 214241 216130 217775 218573 218679 218822 219589 220983 222649 224334 226021 227726 229326 230575
54062 230575 231235 231272 231055 231228 232183 233647 234974 235850 236553 237451 238450 239174 239612 240338 241952 244421 247107
54045 247107 249472 251590 253970 257032 260864 265304 270070 274915 279997 286061 293855 303223 313143 322856
54031 322856 332641 343161 354354 365452 375937 385898 395376 403897 410939 416559 421237 425250 428449
54018 428449 430576 431653 432084 432455 433070 433545 433023 430938 427549 423535 419127 413837 407109 399089 390615
54003 390615 382404 374433 366220 357675 349374 341885 335135 328722 322628 317185 312426 307964 303615 299691
53989 299691 296468 293764 291286 289058 287139 285263 283140 280880 278761 276699 274435 272062 269962 268203
53975 268203 266438 264442 262430 260834 260080 260526 262149 264205 265637 266014 265778 265528 265454 265576 265994 266602 267036
53958 267036 267294 268095 270085 272981 275954 278664 281360 284058 286304 287922 289492 291826 295235 299485 304169
53943 304169 308958 313720 318652 324161 330515 337672 345470 353793 362457 371208 379922 388682 397544 406387
53929 406387 415084 423619 431899 439609 446391 452069 456690 460549 464221 468332 473154 478673 485085 492880
53915 492880 502208 512610 523764 536214 550867 567916 586730 606735 627886 650214 673369 696760
53903 696760 719816 741909 762268 779964 793678 801464 801319 792507 776286 755178 731580 707046
53891 707046 682444 658357 635300 613718 593777 575191 557455 540350 523959 508146 492434
53880 492434 476735 461878 448873 437713 427426 417368 407958 399922 393193 386961 380567 373927 367181
53867 367181 360418 353918 348224 343611 339583 335264 330243 324809 319367 314021 308865 304281 300593 297613
53853 297613 294859 292189 289936 288469 287826 287685 287446 286445 284509 282304 280825 280416 280545 280550 280294 280018 279891
53836 279891 279867 279732 279235 278378 277581 277283 277362 277335 277072 276815 276515 275818 274897 274529 274967 275500 275717 276450 278563
53817 278563 281329 283061 283259 283110 283876 285616 287660 289485 290899 292048 293606 296417 300675 305895 311818
53802 311818 318730 326612 334662 342128 349169 356430 364185 372322 380766 389438 398045 406320 414253 421667
53788 421667 427903 432397 435391 437606 439375 440526 441001 441097 441070 440858 440168 438506 435235 430023 423257 415730
53772 415730 407927 399843 391386 382604 373640 364878 357063 350774 345707 340905 335798 330617 325683 320807
53758 320807 315731 310783 306657 303690 301619 299981 298438 296751 294748 292450 290138 288186 286779 285817
53744 285817 285113 284626 284398 284232 283647 282370 280743 279423 278770 278729 279198 280130 281313 282493 283809 285738 288431
53727 288431 291458 294479 297833 302153 307679 314334 322260 331812 343071 355804 369961 385856 403723
53714 403723 423361 444234 465528 485770 502612 513376 516091 510260 497070 479131 459667 441287
53702 441287 425089 410864 398161 387071 378076 371436 366921 364029 362273 361334 361108 361596 362602 363603
53688 363603 364173 364528 365332 366736 367890 367774 366394 364754 363611 362684 361302 359491 358005 357396 357451 357577
53672 357577 357433 357030 356451 355759 355130 354866 355123 355701 356191 356377 356451 356730 357159 357147 356053 353858 351229 348892
53654 348892 346984 345070 342709 339927 337265 335455 334981 335691 336770 337267 336831 335960 335536 336118 337571 339215
53638 339215 340325 340724 341034 342148 344302 346771 348667 349855 350865 352062 353314 354453 355650 357180 359143
53623 359143 361546 364301 366934 368709 369504 370338 372517 376301 380739 384814 388327 391631 395011 398631 402744
53608 402744 407561 412964 418598 424185 429574 434576 439015 443012 446973 451111 455074 458177 460066 461084
53594 461084 461941 463101 464538 466043 467578 469254 471155 473364 476117 479701 484155 489185 494400 499475
53580 499475 504061 507710 510013 510797 510159 508450 506204 503836 501228 497652 492366 485390 477632 470215 463726
53565 463726 458046 452823 447908 443301 438873 434435 430141 426568 424157 422687 421540 420417 419572 419376 419902
53550 419902 420965 422292 423542 424448 425059 425705 426602 427702 428990 430639 432738 435143 437858 441263 445621
53535 445621 450530 455327 459970 465114 471215 477955 484689 491200 497795 504912 512908 522135 532926 545369
53521 545369 559143 573611 588104 602263 616236 630547 645654 661569 677962 694763 712608
53510 712608 732484 754736 778577 802825 827117 852040 878038 904587 930707 955908 980254
53499 980254 1003808 1026620 1049138 1071994 1095153 1117813 1139419 1160393 1181553 1203111 1224580
53488 1224580 1245475 1265802 1285992 1306632 1328081 1350035 1371537 1391754 1410692 1428982 1447104
53477 1447104 1465170 1483300 1501676 1520081 1537757 1553992 1568696 1582249 1594893 1606320 1615724
53466 1615724 1622195 1625267 1625115 1622124 1616265 1607224 1595122 1580754 1564973 1548183 1530571 1512378 1493587
53453 1493587 1473783 1452807 1431327 1410103 1388865 1366577 1342943 1319030 1296156 1274611 1253741
53442 1253741 1232948 1212320 1192635 1175039 1160393 1148495 1138161 1128446 1119638 1112685 1107861 1104438
53430 1104438 1101526 1098753 1096158 1093981 1092736 1093084 1095352 1099370 1104903 1111972 1120652 1130835 1142388 1155303
53416 1155303 1169533 1184931 1201579 1219946 1240410 1262720 1286231 1310621 1336100 1362905 1390875
53405 1390875 1419746 1449767 1481690 1516025 1552486 1590432 1629855 1671513 1715943 1762781 1811416
53394 1811416 1861945 1914855 1969981 2026493 2083911 2142359 2201618 2260697 2318765 2375890 2432360
53383 2432360 2487794 2541493 2593244 2643188 2691220 2737056 2780551 2821382 2858687 2891647 2920188
53372 2920188 2944529 2964388 2979421 2990185 2997732 3002202 3002574 2997730 2986985 2969669 2945351 2914746
53360 2914746 2879362 2839852 2795659 2746799 2695016 2642324 2589149 2534854 2479598 2424741 2371624
53349 2371624 2320814 2272418 2226323 2182021 2138700 2095660 2052444 2008756 1964626 1920402 1876298
53338 1876298 1832203 1788374 1745880 1705817 1668344 1633063 1600021 1569582 1541586 1515472 1491206
53327 1491206 1469235 1449393 1430649 1412157 1393861 1375832 1357678 1339064 1320358 1302281 1285243
53316 1285243 1269316 1254653 1241571 1230244 1220464 1211655 1203277 1195425 1188929 1184567 1182334 1181776 1182771
53303 1182771 1185350 1189045 1193236 1198195 1204956 1213989 1224843 1237385 1252456 1270659 1291218 1312776
53291 1312776 1334912 1358162 1382902 1408872 1435633 1462866 1490248 1517438 1544135 1569886 1594097
53280 1594097 1616489 1637236 1656324 1673097 1686817 1697311 1704725 1709140 1710929 1710999 1709946 1707309 1702313
53267 1702313 1695027 1685958 1674849 1660909 1644152 1625481 1605300 1583109 1558806 1533413 1507832 1481637
53255 1481637 1453846 1424458 1394561 1365135 1336388 1308108 1280163 1252589 1225514 1199048 1173148
53244 1173148 1147670 1122607 1098017 1073659 1049092 1024382 1000345 977662 955969 934197 911700
53233 911700 888725 865950 844047 823700 805597 790080 776858 765189 754295 743681 733169
53222 733169 722667 711890 700380 687886 674636 661099 647476 633494 618715 603031 586939
53211 586939 571309 556753 543218 530327 518095 507032 497443 488903 480680 472468 464472 456861 449466
53198 449466 441958 434154 426133 418188 410603 403364 396151 388805 381722 375575 370632 366586 363061 360038
53184 360038 357674 355893 354284 352384 349946 347045 343973 341046 338405 336029 333972 332488 331780 331621 331399
53169 331399 330740 330043 330111 331206 332619 333357 333104 332337 331685 331470 331691 332029 331886 330911 329661 329263 330090 331170
53151 331170 331363 330835 330797 331910 333603 335056 336230 337511 338793 339531 339685 340047 341429 343809 346488 348867
53135 348867 350785 352241 353217 353816 354232 354337 353619 351822 349475 347428 345948 344710 343564 342809 342506 342040
53119 342040 340756 338779 336855 335473 334429 333215 331602 329881 328555 327745 326865 325188 322823 320709 319396
53104 319396 318229 316236 313499 311039 309405 308023 306081 303519 300985 299186 298511 298923 299904 300726 300988
53089 300988 300801 300435 300027 299697 299563 299478 299074 298290 297582 297306 297215 296867 296312 295949 295896 295921 295955 296211 296725 297149
53069 297149 297138 296717 296127 295543 295015 294506 293886 293070 292257 291787 291643 291286 290205 288490 286695 285289 284463 284343
53051 284343 284986 286118 287200 287952 288685 289897 291662 293537 295035 295999 296541 296800 296855 296776 296675 296739 297207 298209
53033 298209 299564 300846 301763 302441 303226 304218 305121 305604 305768 306118 307098 308698 310561 312337 313814 314748 314926
53016 314926 314581 314524 315490 317264 318740 318918 317714 315802 313974 312772 312334 312279 311964 311245 310877 311730 313680
52999 313680 315686 317023 317972 319123 320388 321095 320835 319891 318925 318518 318989 320360 322380 324695 327065 329414
52983 329414 331717 333875 335639 336623 336597 335863 335274 335639 337107 339171 341160 342629 343423 343666 343742 344093 344942
52966 344942 346263 348026 350324 353201 356399 359334 361396 362384 362713 363030 363542 363827 363403 362290 360793 359034
52950 359034 357089 355379 354341 353713 352729 351201 349838 349174 348786 348079 347377 347473 348310 348849 348287 346815 345130
52933 345130 343781 343154 343434 344179 344342 343186 340985 338565 336420 334561 332923 331559 330496 329712 329145 328611
52917 328611 327917 327281 327277 328051 328885 328977 328476 328266 328823 329802 330667 331241 331534 331505 331124 330391 329248 327814 326680
52898 326680 326528 327337 328392 329171 329781 330414 330927 331247 331664 332287 332549 331730 329810 327470 325411 323929 322931
52881 322931 322043 320942 319861 319485 320052 320796 320744 319779 318504 317298 316131 315156 314799 315156 315839 316574 317484
52864 317484 318599 319626 320491 321674 323543 325600 326838 326857 326301 326098 326510 327102 327544 328162 329480 331368
52848 331368 333027 333876 334038 333706 332458 329763 325972 322131 318754 315336 311254 306676 302249 298328 294862
52833 294862 291885 289664 288402 287992 288126 288537 289186 290242 291747 293275 294084 293712 292341 290513 288634 286848
52817 286848 285237 283937 283050 282526 282260 282313 282990 284514 286644 288865 291036 293511 296435 299266 301354 302553
52801 302553 302775 301356 297692 292477 287467 283810 281212 278848 276362 273797 271328 269509 269060 269805 270408
52786 270408 269795 268396 267378 267061 266861 266483 266375 266986 268246 269770 271108 271842 271984 272239 273342 275108
52770 275108 276640 277507 278253 279674 282008 284885 287599 289412 290010 289800 289413 288904 287866 286296 284810 283873
52754 283873 283345 282993 282913 283218 283730 284355 285358 286916 288658 290001 290766 291185 291532 292031 292884 294095 295337
52737 295337 296247 296749 296964 296981 296909 296916 296986 296851 296411 296037 296150 296675 297218 297613 297981 298335 298472 298154 297127 295115
52717 295115 292216 289189 286878 285332 283987 282757 282312 282983 283959 284184 283744 283715 284705 286199 287414 288164
52701 288164 288542 288357 287545 286865 287474 289662 292539 295174 297564 300124 302662 304496 305495 306397 307826 309380
52685 309380 310100 309764 309407 310362 312864 315751 317595 317994 317667 317459 317562 317735 317839 317913 317986 318177 318825 320163
52667 320163 321910 323447 324364 324655 324594 324713 325691 327751 330189 332062 333345 334856 336992 339191 340912 342475
52651 342475 344401 346478 348168 349582 351260 353032 353780 352554 349445 345282 340884 336781 333251 330332
52637 330332 327995 326369 325522 324929 323581 320997 317877 315431 314190 313783 313741 314037 314792 315842 316863 317685
52621 317685 318241 318328 317764 316771 315983 315904 316471 317225 317774 317986 317831 317256 316254 314943 313560 312419 311846 311992
52603 311992 312726 313799 315100 316601 318075 319140 319708 320213 321177 322598 324013 325160 326369 328085 330127
52588 330127 331652 331997 331427 330863 330885 331239 331390 331248 331105 331147 331442 332299 334082 336569 338940 340607 341695
52571 341695 342487 342884 342866 343146 344686 347550 350659 352766 353307 352377 350373 347931 345781 344254 343085 341942
52555 341942 340961 340413 340033 339129 337428 335417 333644 332040 330287 328655 327952 328542 329790 330681 330728 330060 328928
52538 328928 327522 326165 325276 325058 325441 326333 327625 328962 329884 330291 330519 330868 331335 331849 332419 332935 333225
52521 333225 333454 334103 335296 336564 337554 338555 339956 341639 343393 345550 348558 352178 355733 359019 362226
52506 362226 365049 366616 366433 364721 361707 357282 351646 345606 339821 334289 329038 324738 322058 320721
52492 320721 319845 319002 318414 318258 318318 318337 318234 317954 317442 316839 316395 316163 316063 316277 317256 319240 321909 324595
52474 324595 326734 328196 329376 330953 333353 336441 339784 343139 346463 349611 352335 354597 356647 358722
52460 358722 360806 362626 363728 363639 362230 359914 357227 354225 350556 346153 341594 337689 334894 333196 332264
52445 332264 331607 330747 329454 327830 326204 325029 324686 325105 325624 325525 324759 323893 323323 322845 322043 320805 319382
52428 319382 318176 317537 317447 317433 317127 316881 317300 318131 318344 317554 316690 316757 317591 318467 319363 320746 322468 323875
52410 323875 324985 326715 329768 334041 339202 345165 351769 358699 366019 374144 382956 391432 398477 403580
52396 403580 406379 406309 403277 398198 392194 385626 378461 371308 365292 360991 358026 355668 353484 351524 350289
52381 350289 350321 351423 352563 353135 354020 356657 361252 366677 372063 377524 383226 388781 394018 399440 405241
52366 405241 410493 413988 415446 415313 413874 411363 408622 406712 405822 405206 404288 403296 402720 402677 403029 403747 404963
52349 404963 406856 409566 412966 416431 419097 420528 421033 421373 422325 424470 428045 432818 438184 443511 448420
52334 448420 452948 457598 463132 470055 478335 487748 498296 510062 522860 536431 550838 566222 582191
52321 582191 597973 613219 628183 643074 657754 672290 687272 703204 719898 736885 754149
52310 754149 772142 791238 811527 833009 855622 879175 903497 928616 954534 980874 1006988
52299 1006988 1032369 1056789 1080006 1101501 1120572 1136756 1150211 1161606 1171392 1179216 1184392 1187058
52287 1187058 1188363 1189269 1189587 1188629 1186452 1183857 1181294 1178394 1174575 1169667 1163832 1157400 1150951 1145208 1140636
52272 1140636 1137322 1135297 1134607 1135023 1136093 1137786 1140791 1145883 1153131 1162019 1172248 1184106 1198021 1213896
52258 1213896 1231018 1248627 1266549 1285167 1304736 1324837 1344703 1363880 1382275 1399652 1415531
52247 1415531 1429626 1441985 1452569 1461096 1467524 1472304 1475902 1478390 1479821 1480590 1480951 1480413 1478219 1474401
52233 1474401 1469915 1465635 1461568 1457101 1451675 1445147 1437770 1430016 1422265 1414564 1406772 1398868 1390947 1383038
52219 1383038 1375224 1367914 1361615 1356365 1351749 1347582 1344252 1342225 1341529 1341903 1343138 1345031 1347284 1349848
52205 1349848 1353207 1357973 1364184 1371215 1378292 1384955 1391174 1397408 1404538 1413355 1423908 1435392 1446782
52192 1446782 1457516 1467676 1477700 1487911 1498055 1507188 1514172 1518443 1520328 1520583 1519670 1517447 1513408
52179 1513408 1507132 1498607 1488209 1476480 1463977 1451313 1439176 1428104 1418273 1409541 1401698 1394592
52167 1394592 1388172 1382604 1378277 1375477 1374076 1373735 1374341 1376015 1378665 1381804 1384868 1387443 1389099 1389369 1388162
52152 1388162 1386000 1383583 1381228 1378943 1376920 1375690 1375741 1377092 1379203 1381204 1382409 1382809 1382953 1383169 1383052
52137 1383052 1381963 1379844 1377184 1374364 1371512 1369027 1367659 1367824 1369288 1371887 1376202 1383084 1392696 1404450
52123 1404450 1417844 1432959 1450105 1469271 1489995 1511538 1533163 1554475 1575538 1596523 1617339
52112 1617339 1637873 1658490 1679809 1701828 1723729 1744923 1765936 1787841 1810981 1834772 1858771
52101 1858771 1883382 1909215 1936007 1962532 1987407 2009720 2028924 2044505 2055951 2062913 2065249 2063048
52089 2063048 2056819 2047596 2036500 2024047 2010116 1994768 1978885 1963618 1949299 1935331 1921256 1907484
52077 1907484 1894725 1883154 1872576 1863168 1855450 1849631 1845456 1842826 1842065 1843383 1846515 1851203 1857683
52064 1857683 1866278 1876700 1888164 1900234 1913291 1928115 1945100 1963840 1983315 2002557 2021211
52053 2021211 2039343 2056628 2071971 2084246 2093282 2099789 2104337 2106691 2106211 2102601 2096193 2087728 2077941
52040 2077941 2067156 2055168 2041703 2027068 2012155 1997698 1983733 1969883 1955888 1941665 1927093
52029 1927093 1912094 1896896 1881923 1867396 1853177 1838975 1824550 1809704 1794392 1778920 1763904
52018 1763904 1749870 1736948 1724991 1713878 1703581 1694040 1685108 1676584 1668188 1659455 1649823 1638817
52006 1638817 1626011 1610808 1592490 1570768 1546212 1519889 1492509 1464049 1434282 1403489 1372551
51995 1372551 1342414 1313560 1285858 1258819 1232042 1205542 1179605 1154279 1129117 1103507 1077271
51984 1077271 1050905 1025297 1001198 978748 957390 936361 915385 894845 875264 856861 839698
51973 839698 823957 809791 797168 786210 777557 772011 769825 770617 773786 778674 784445 790356 796154
51960 796154 801737 806359 808735 808143 805030 800349 794642 787966 780283 771621 762228 752895 744805 738740
51946 738740 734701 732606 732900 736003 741477 748379 756385 765940 777169 789074 800092 809243 816608 822810
51932 822810 828079 831833 833150 831602 827387 820641 811036 798356 783180 766555 749183 731303 713243
51919 713243 695597 678831 663126 648620 635494 623750 613266 604132 596695 591232 587802 586411
51907 586411 587027 589425 593282 598420 604691 611611 618393 624386 629206 632456 633647 632474 628869 622764
51893 622764 614119 603295 591042 578016 564593 551326 539248 529449 522411 517931 515555 515081 516701
51880 516701 520700 526874 534403 542556 551397 561448 572705 584433 595902 606726 616336 623700 627989
51867 627989 629154 627574 623539 617464 610268 603022 596347 590470 585700 582408 580669 580292 581124 582972 585282
51852 585282 587246 588282 588196 586964 584632 581413 577585 573239 568314 562918 557376 551929 546606 541500 537031
51837 537031 533729 531758 530738 530158 530045 531119 534158 539215 545611 552637 560020 567681 575413 582991 590406
51822 590406 597808 605413 613519 622356 631691 640782 648890 655661 660817 663803 664048 661430 656228 648838
51808 648838 639809 629900 619691 609253 598542 588007 578437 570261 563380 557594 552795 548738 545071
51795 545071 541728 538985 537028 535739 534887 534254 533507 532296 530587 528609 526464 524112 521811 520129 519279
51780 519279 518781 518073 517172 516468 516086 515854 515856 516692 519128 523586 529920 537547 545816 554387 563188 571946 579972
51763 579972 586622 591743 595367 597035 595881 591558 584816 576956 568926 561027 553243 545550 538039 531046
51749 531046 525069 520310 516358 512723 509622 507777 507337 507583 507997 509138 511967 516642 522572 529373 537054
51734 537054 545324 553560 561658 570217 579433 588276 595232 599629 601954 603230 604457 606431 609638 614234
51720 614234 620157 626939 633280 637230 637299 633438 626907 619503 612946 608364 605730 603919 601694 598495 594214
51705 594214 588807 582726 577331 574111 573537 575045 577813 580940 583154 583197 580720 576446 571551 567265 564719
51690 564719 564352 565475 567024 568647 570328 571157 569588 565131 558807 551642 543705 535209 527561 522373 519874
51675 519874 519068 519089 519679 520683 521925 523599 526191 529939 534822 541006 548978 559196 571868 586825
51661 586825 603141 618884 631658 639586 641856 638662 630986 620264 607891 594997 582697 572163
51649 572163 564063 558195 554036 551444 550384 550155 549421 547005 542338 535367 526591 517158 508283 500310 492667
51634 492667 484904 477466 471285 466930 464268 462736 461766 461126 460975 461535 462765 464463 466509 468705 470530
51619 470530 471518 471941 472619 473862 475009 475274 474662 473733 472782 471716 470566 469583 468788 467830 466448 464748 462906
51602 462906 460918 458933 457568 457474 458644 460570 463151 467032 472744 479922 487781 496188 505680 516398
51588 516398 527471 537626 545971 551974 555263 555991 555218 554395 554444 555597 557986 562006 568175 577125 589723
51573 589723 606663 627631 651266 676301 702604 730819 761168 793021 825623 858887 893209
51562 893209 928780 965400 1003015 1042111 1083392 1127051 1172438 1218164 1262276 1302343 1335715
51551 1335715 1359934 1372910 1372938 1359019 1331464 1292064 1243427 1188234 1129034 1068262 1007956 949490
51539 949490 893933 842586 796830 757351 723825 695430 671518 651719 635653 622753 612319
51528 612319 603654 596176 589484 583352 577678 572414 567498 562830 558399 554416 551116 548351 545642 542793
51514 542793 540203 538315 536950 535509 533671 531462 528703 524885 519775 513832 507857 502492 498189 495259
51500 495259 493589 492508 491336 490092 489376 489496 489979 490169 490145 490688 492226 494081 495050 494699 493764 493186 493010
51483 493010 492415 490612 487480 483483 479279 475395 472029 469131 466738 465097 464239 463611 462461 460518 457967
51468 457967 454826 450920 446616 443016 440906 439767 438301 435916 433290 431439 430603 430273 430077 430232 431067
51453 431067 432329 433239 433308 432983 433395 435519 439675 445784 453835 463862 475545 488175 501279 515221
51439 515221 530821 548157 565824 581561 593579 601307 605173 606185 605678 604897 604335 603440 601073 596147
51425 596147 588017 576705 563132 548948 535804 524747 516174 509963 505476 501880 498840 496666 495525
51412 495525 494901 494306 494129 495183 497543 500426 503109 505374 507149 508459 509844 512142 515600 519736 524330
51397 524330 529967 537197 545637 554468 563528 573439 584747 597344 610768 624879 640255 658036 679303
51384 679303 704536 733798 767466 806452 851619 903158 960623 1023143 1089349 1157375 1225212
51373 1225212 1290893 1352118 1405994 1449463 1479983 1495751 1495725 1479795 1448803 1404164 1347684 1281921
51361 1281921 1210243 1135942 1061323 987959 917578 852169 793248 741479 696993 659584 628483
51350 628483 602408 580146 560950 544350 529874 517117 505802 495648 486343 477813 470300 464007
51338 464007 458787 454380 450838 448468 447324 446836 446052 444294 441645 438788 436358 434465 432800 431095 429295
51323 429295 427355 425058 422179 418836 415641 413419 412580 412682 412775 412373 412013 412638 414461 416693 418408 419457
51307 419457 420435 421980 424269 427029 429783 432114 433862 435182 436369 437643 439108 440760 442335 443222 442874
51292 442874 441498 440073 439343 438897 437642 435297 433040 432414 433772 436079 438087 439426 440649 442523 445310
51277 445310 448460 450950 452108 452109 451556 450682 449276 447285 445079 443043 441302 439969 439330 439555 440491 441879
51261 441879 443525 445079 446003 446022 445424 444671 443898 442973 441815 440438 438949 437763 437531 438473 439976 441260
51245 441260 442307 443723 445777 448007 449800 450983 451703 452034 451896 451207 449957 448183 445895 443048 439608
51230 439608 435759 431934 428637 426252 424964 424602 424555 424231 423751 423783 424470 424984 424572 423603 423011 423018 423168 423433
51212 423433 424435 426429 428781 430764 432346 433897 435670 437886 440886 444708 448831 452741 456510 460491
51198 460491 464635 468496 471769 474462 476614 478189 479258 480023 480600 480969 481141 481159 480966 480433 479628 478951 478871
51181 478871 479503 480475 481262 481638 481691 481414 480475 478594 475915 472733 469023 464671 460123 456272 453495 451271
51165 451271 449054 447081 445890 445358 444831 444151 443988 444997 447016 449287 451232 452813 454331 456063 458016
51150 458016 459865 461167 461748 461856 461885 462013 462223 462537 463019 463518 463652 463178 462249 461151 459887 458280 456379
51133 456379 454458 452563 450440 448006 445599 443557 441895 440675 440341 441245 443048 445111 447378 450351 454220
51118 454220 458588 463069 467597 471961 475654 478528 481175 484258 487811 491482 495072 498450 501329 503577
51104 503577 505536 507583 509529 510879 511496 511672 511789 512314 513761 515987 517804 518120 517465 517537 519079 521055
51088 521055 522271 522932 523976 525568 527122 528435 529808 531118 531576 530653 528663 526257 523879 521851 520434
51073 520434 519453 518319 516833 515615 515358 515980 517042 518686 521490 525394 529530 533432 537859 544001 552147
51058 552147 561549 571350 581236 591211 601117 610458 618517 624656 628783 631586 634215 637685 642542 648811
51044 648811 656003 663309 670198 676836 683594 690162 695589 699388 702294 705649 710235 715887 721960 727786
51030 727786 732659 735649 735663 731876 724333 714177 703005 691762 680420 668826 657540 647486 639033
51017 639033 631934 626186 622384 620994 621689 623808 627274 632598 639878 648144 655902 662255 667409 672225
51003 672225 677466 683404 689840 696296 702300 707675 712611 717457 722465 727742 733274 738896 744345 749635
50989 749635 755316 762217 770877 781377 793661 807790 823835 841807 861824 884239 909473 937765
50977 937765 969000 1002611 1037702 1073561 1110085 1147388 1184994 1221947 1257984 1294282 1332615
50966 1332615 1374031 1418686 1466646 1518249 1573671 1632633 1694765 1760023 1828560 1900214 1974082
50955 1974082 2048472 2121336 2190967 2256236 2316121 2369347 2414891 2452778 2483966 2509464 2529903
50944 2529903 2545926 2558413 2568163 2575779 2582140 2588598 2596249 2604978 2613327 2619156 2620515 2616379 2607047
50931 2607047 2593676 2577062 2556834 2531937 2501697 2466117 2425235 2378545 2325220 2264818 2197861
50920 2197861 2125845 2050595 1973420 1894953 1815882 1737616 1661931 1590092 1522702 1460297 1403620
50909 1403620 1353092 1308357 1268549 1232786 1200299 1170461 1143034 1118224 1096207 1076676 1059133
50898 1059133 1043511 1030171 1019304 1010598 1003529 997704 992829 988605 984868 981727 979435 978157 977874
50885 977874 978431 979629 981389 983859 987234 991475 996369 1001860 1008090 1015089 1022752 1031245 1041057 1052372
50871 1052372 1064671 1077418 1090896 1105902 1122669 1140633 1159395 1179399 1201499 1226246 1253969
50860 1253969 1285236 1320759 1360928 1405755 1455350 1510247 1571267 1639240 1714921 1799045 1892319
50849 1892319 1995295 2108236 2231187 2364238 2507544 2660827 2822903 2991984 3166457
50840 3166457 3345030 3526011 3706742 3883891 4053941 4213152 4357480 4483172 4587651
50831 4587651 4669799 4729701 4768480 4788201 4791510 4781265 4760703 4733760 4704745 4677571 4655400
50820 4655400 4640722 4635096 4638490 4649116 4664016 4679604 4691670 4695430 4686125 4659795 4613614 4545860
50808 4545860 4455875 4344091 4212089 4062574 3899004 3724822 3543014 3356694 3170017 2987953
50798 2987953 2814789 2653060 2503997 2368531 2247509 2141264 2049495 1971495 1906248 1852532
50788 1852532 1809280 1775749 1750958 1733116 1720096 1710570 1704280 1701087 1700076 1699718 1698580 1695659 1690386
50775 1690386 1682684 1672982 1661853 1649554 1635994 1621056 1604772 1587148 1568006 1547101 1524347 1499933
50763 1499933 1474244 1447704 1420674 1393510 1366693 1340755 1315962 1292228 1269623 1248970 1231570
50752 1231570 1218091 1208002 1200455 1195466 1193750 1195470 1199871 1206454 1215930 1229470 1247402 1269283 1295070
50739 1295070 1325446 1360912 1401252 1446202 1496171 1551911 1613756 1681512 1754803 1833238 1916432
50728 1916432 2004101 2095892 2190861 2287452 2384332 2480946 2576787 2670421 2759835 2843572 2920804
50717 2920804 2990190 3049293 3095491 3127071 3143374 3144544 3131757 3107511 3075215 3038458 3000729
50706 3000729 2965421 2935452 2912591 2897298 2889218 2887702 2891911 2900583 2911758 2922637 2929790 2929702 2919331
50693 2919331 2896368 2859297 2807480 2741190 2661537 2570494 2471041 2366970 2262141 2159776 2062364
50682 2062364 1971969 1890287 1818482 1757224 1706849 1667250 1637745 1617438 1605882 1603178 1609348 1623839
50670 1623839 1645711 1674097 1708234 1747142 1789275 1832458 1874231 1912595 1946693 1976673 2002871
50659 2002871 2025249 2043604 2058029 2068975 2077074 2083028 2087467 2090702 2092766 2093811 2094238 2094234 2093528 2092000
50645 2092000 2090419 2090191 2092470 2097869 2106997 2120721 2139656 2163661 2192063 2224266 2260030 2299195
50633 2299195 2341160 2384565 2427668 2469274 2509251 2547894 2584940 2619649 2651750 2681582 2708904
50622 2708904 2731863 2747283 2751674 2742116 2717297 2678803 2631271 2580491 2530971 2485291 2445097 2411705
50610 2411705 2385640 2366391 2353068 2344901 2340814 2339059 2337731 2335430 2330994 2322768 2308608 2286696 2256138
50597 2256138 2216886 2169416 2114563 2053435 1987333 1917855 1847019 1777023 1709638 1645822 1585903
50586 1585903 1529971 1478012 1429853 1385318 1344605 1308292 1276826 1249939 1226730 1206358 1188573
50575 1188573 1173656 1162018 1153910 1149358 1148182 1150121 1155064 1163137 1174480 1188960 1206109 1225248
50563 1225248 1245621 1266634 1288192 1310702 1334545 1359574 1385355 1411793 1439275 1468240 1498925
50552 1498925 1531564 1566481 1603853 1643614 1685618 1729462 1773882 1816756 1856250 1891941 1924561
50541 1924561 1954770 1982750 2008998 2034971 2062541 2092992 2126835 2164350 2205909 2251770 2301964
50530 2301964 2356609 2416146 2481176 2552213 2629748 2714296 2805993 2904184 3007669 3115357 3226335
50519 3226335 3339186 3451633 3561061 3665139 3761602 3847710 3920441 3977327 4016860 4038158
50509 4038158 4040658 4024235 3989359 3937000 3868670 3786663 3693964 3593757 3489146 3383449 3280396
50498 3280396 3183759 3096874 3022629 2963522 2921259 2896261 2887812 2894669 2915265 2947367 2987779 3032470
50486 3032470 3076850 3115937 3144595 3158051 3152541 3125862 3077618 3009076 2922725 2821854 2710254
50475 2710254 2591854 2470295 2348797 2230404 2117985 2013615 1917988 1830716 1751223 1679227
50465 1679227 1614560 1556947 1506051 1461378 1421999 1386654 1354349 1324754 1297968 1274142 1253497
50454 1253497 1236343 1222754 1212321 1204513 1199144 1196142 1194951 1194672 1194986 1196575 1200299 1206166 1213425 1221534
50440 1221534 1230579 1240699 1251475 1262217 1272628 1282834 1292800 1302104 1310474 1318341 1326597 1335772 1345654
50427 1345654 1355784 1366234 1377745 1390996 1405838 1421388 1437011 1453180 1471126 1491657 1514502
50416 1514502 1538964 1565043 1593657 1625859 1662197 1702916 1748334 1798628 1853382 1911712 1972784
50405 1972784 2035881 2099918 2163357 2224891 2283889 2339859 2391659 2437713 2476957 2509104 2533823
50394 2533823 2550049 2556380 2551947 2536645 2510704 2474417 2428337 2373581 2311920 2245607 2177001 2108215
50382 2108215 2041173 1977995 1920996 1871952 1831479 1799428 1775807 1760911 1754535 1755474 1761954 1772245
50370 1772245 1784637 1797115 1807473 1813769 1814457 1808120 1793459 1769865 1738013 1699622 1656473 1609705
50358 1609705 1560192 1509398 1459338 1411470 1365914 1322005 1279345 1238049 1198290 1160212 1124271
50347 1124271 1091103 1060979 1033796 1009654 988994 971988 958202 947098 938473 932164 927713 924720
50335 924720 923215 923322 924736 926829 929146 931504 933809 936074 938479 941036 943310 944836 945839 947229
50321 947229 949812 953713 958576 964180 970723 978509 987336 996344 1004701 1012484 1020530 1029264 1038112 1046347
50307 1046347 1054189 1062581 1072085 1082412 1092913 1103128 1112909 1122319 1131336 1139414 1145565 1149365 1151696
50294 1151696 1153993 1156790 1159490 1161487 1162878 1163986 1164865 1165669 1167013 1169623 1173957 1180501 1190155 1203902
50280 1203902 1222181 1244687 1270444 1297566 1322941 1342560 1352736 1351640 1340322 1322360 1302119
50269 1302119 1282870 1266215 1252759 1242653 1235523 1230663 1227726 1226759 1227171 1227256 1225429 1221771 1217716 1214335
50255 1214335 1211562 1208999 1206635 1204362 1201428 1197005 1191177 1184884 1178885 1173197 1167604 1162429 1158527 1156705
50241 1156705 1157337 1160516 1166307 1174759 1185760 1199005 1213974 1229846 1245447 1259407 1270433 1277547
50229 1277547 1280297 1278962 1274481 1268005 1260453 1252399 1244158 1235748 1226922 1217484 1207556 1197287 1186441
50216 1186441 1174558 1161553 1147840 1133802 1119453 1104707 1089752 1075056 1061178 1048557 1037123
50205 1037123 1026034 1014218 1001415 988506 976624 966209 957024 948709 940976 933579 926489 920041
50193 920041 914587 910097 906314 903112 900429 898040 895734 893577 891694 889906 888002 886277 885351 885390 885894
50178 885894 886360 886797 887476 888538 890098 892438 895747 899768 903993 908271 913035 918886 925994 934048 942847
50163 942847 952839 964920 979604 996682 1015874 1037592 1062731 1091808 1124723 1161324 1201655 1245387
50151 1245387 1291405 1338224 1384560 1429191 1470672 1507831 1540626 1570058 1597153 1622301 1645584
50140 1645584 1667135 1686741 1703354 1715398 1721490 1720498 1711112 1691946 1662476 1623715 1577874 1527483
50128 1527483 1474825 1421664 1369124 1317971 1269375 1225227 1187243 1155749 1129742 1108239 1091202
50117 1091202 1079061 1071779 1068625 1068472 1069917 1071329 1071263 1068855 1063714 1055671 1045036 1032946 1020970 1010167
50103 1010167 1000778 992776 986322 981570 978337 976175 974542 972793 970352 967201 964006 961495 959802 958700
50089 958700 958287 959069 961292 964550 968173 971873 975902 980717 986609 993482 1000942 1008712 1017039 1026555 1037707
50074 1037707 1050524 1064983 1081240 1099223 1118236 1137381 1156285 1175020 1193403 1210876 1227196
50063 1227196 1242777 1258053 1272807 1286403 1298445 1308972 1318247 1326685 1334786 1342822 1350654 1358133
50051 1358133 1365626 1373906 1383664 1395342 1409306 1425957 1445854 1469965 1499500 1535128 1576663 1624089
50039 1624089 1678524 1741373 1812435 1889597 1970492 2053722 2138273 2222701 2305655 2386761 2466322
50028 2466322 2544443 2620946 2695886 2769407 2841034 2909420 2972719 3028819 3075177 3108730 3126180
50017 3126180 3124631 3102497 3060207 2999885 2924096 2835068 2735166 2627566 2515843 2403043 2291529
50006 2291529 2183409 2080511 1983988 1894404 1812267 1738153 1672498 1615669 1568117 1529881 1499915
49995 1499915 1476319 1457302 1441586 1427952 1414981 1401484 1386907 1371132 1354116 1335787 1316051
49984 1316051 1294837 1272277 1248811 1224891 1200761 1176743 1153533 1131806 1111689 1093107 1076428
49973 1076428 1062174 1050131 1039486 1029921 1021951 1015977 1011611 1008212 1005571 1003753 1002807 1002896 1004323 1007068
49959 1007068 1010715 1015106 1020634 1027614 1035837 1045057 1055432 1067070 1079700 1093239 1108052 1123866
49947 1123866 1138777 1150230 1157026 1159893 1160224 1158924 1156357 1152600 1147481 1140768 1132494 1122765 1111333
49934 1111333 1097830 1082572 1066654 1051169 1036745 1023899 1013304 1005429 1000343 998232 999831 1006045
49922 1006045 1017270 1033274 1053558 1077782 1106137 1139405 1178292 1222342 1269808 1318862 1368592
49911 1368592 1418461 1467239 1513343 1556396 1597786 1639372 1682000 1725525 1769793 1814878 1860344
49900 1860344 1904666 1945296 1978859 2001368 2009121 2000161 1974874 1934911 1881846 1817284 1743888 1665410
49888 1665410 1585352 1505979 1428694 1354745 1285177 1220548 1161248 1107838 1060636 1019157 982425
49877 982425 949716 920565 894263 870016 847622 827457 809658 793835 779773 767872 758574 751787
49865 751787 747194 744728 744377 745852 748914 753758 760570 768974 778494 789450 802686 818277 835104
49852 835104 851909 868129 883335 896481 906513 913512 918505 922042 923545 922213 918034 911494 902660
49839 902660 891085 876587 859782 841836 823963 807144 792032 778951 768068 759548 753406 749195
49827 749195 746173 743942 742812 743418 746080 750696 757122 765458 775959 788746 803553 819696 836347
49814 836347 852935 869194 884758 898890 910931 920908 929435 936928 943151 947577 949895 949982 947682
49801 947682 942909 935900 927171 917288 906903 896819 887562 878844 869826 860107 850167 840619 831413 822181
49787 822181 813199 805460 799692 795682 792715 790406 788929 788590 789414 791059 792994 794879 796860 799414 802853
49772 802853 807107 812030 817693 824249 831740 840144 849368 858869 867449 873759 877145 877898 876815 874657
49758 874657 871878 868516 864241 858535 850822 840561 827561 812436 796490 780864 765965 751896
49746 751896 739047 727885 718501 710884 705302 701814 699608 697611 695746 694822 695136 695988 696814 697972 700017
49731 700017 702938 706637 711475 717657 724562 731382 738119 745317 753102 761251 770095 780574 793283 807923
49717 807923 823704 839792 855292 869215 880649 888814 893085 893340 890205 884570 876861 867097 855497
49704 855497 842579 828716 814150 799513 785882 774153 764677 757455 752221 748233 744550 740798 737342
49691 737342 734572 732393 730680 729782 730219 732150 735480 740222 746432 753938 762566 772599 784714 799476
49677 799476 817023 837129 859285 882746 906773 930800 954022 974683 990224 998668 1000063 996331
49665 996331 989695 981497 972615 964370 958224 954562 952463 950851 949209 946682 941167 930210 912882 890326
49651 890326 864639 837818 811594 787358 765806 747044 731257 718907 710063 703984 699643 696428
49639 696428 694169 692822 692345 692584 693039 692964 691882 689738 686483 681920 676195 670044 664225 658921 653926
49624 653926 649116 644414 639615 634598 629596 624984 621051 618187 616897 617162 618011 618254 617622 616835 616618 617067
49608 617067 617912 618942 620008 620917 621470 621536 621106 620425 620000 620197 620827 621333 621412 621321 621546 622343 623534 624648
49590 624648 625293 625486 625572 625793 626117 626532 627196 628115 629033 629935 631334 633630 636433 639043 641429 644200 647725
49573 647725 651947 657076 663709 671939 680940 689962 699427 710526 723857 738774 753973 768331 781177
49560 781177 792111 800894 807519 812213 815157 816168 814877 811413 806700 801807 797134 792571 788327 785072
49546 785072 783197 782422 782349 782961 784315 786135 788038 789886 791565 792718 793155 793362 794160 795932 798607 802355
49530 802355 807836 815597 825583 837415 850932 866260 883513 902682 923713 946578 971178 997155
49518 997155 1023668 1049264 1072178 1091036 1105504 1116352 1124918 1132430 1139590 1146531 1153040 1158792 1163449
49505 1163449 1166575 1167466 1165052 1158057 1145451 1127016 1103670 1077299 1050156 1024166 1000472 979400
49493 979400 960709 943923 928673 915006 903361 893993 886307 879044 871391 863770 857275 852494 849192
49480 849192 846921 845399 844302 843249 842209 841458 840860 839716 837682 835439 834009 833710 834297 835788 838460
49465 838460 842176 846439 851175 856804 863404 870404 877348 884330 891284 897324 901328 902877 902219 899607
49451 899607 895229 889611 883418 876761 869165 860440 851334 843117 836626 831860 828351 825812 824390 824296 825316
49436 825316 826922 828971 832068 837068 844367 853954 865964 880860 899005 920316 944387 970906 1000087
49423 1000087 1032800 1069951 1111476 1156226 1202996 1250755 1296590 1333677 1353278 1350450 1327912
49412 1327912 1293949 1256863 1221707 1191132 1167260 1151780 1144988 1145714 1152316 1163490 1178291 1195794
49400 1195794 1214958 1234766 1254519 1273994 1293282 1312323 1330559 1347010 1360750 1371398 1379141
49389 1379141 1384183 1386255 1384823 1379722 1371307 1359955 1345800 1329164 1310867 1291812 1272497 1253274
49377 1253274 1234764 1217577 1201890 1187866 1176333 1168341 1163937 1161943 1161135 1161184 1162238 1164132 1166362
49364 1166362 1168429 1169794 1169784 1168032 1164821 1160653 1155580 1149269 1141606 1132907 1123575 1113877 1104069 1094496
49350 1094496 1085516 1077484 1070810 1065857 1062718 1061187 1060971 1061877 1063784 1066428 1069215 1071325 1072223 1072093 1071539
49335 1071539 1070773 1069301 1066564 1062670 1058390 1054632 1052038 1050795 1050558 1050768 1051283 1052531 1054859 1057960 1061269
49320 1061269 1064618 1068077 1071365 1073963 1075798 1077310 1078752 1079938 1080835 1081926 1083640 1085738 1087644 1089260
49306 1089260 1091147 1093924 1097748 1102394 1107665 1113605 1120264 1127329 1134100 1140075 1145515 1151207 1157556 1164035
49292 1164035 1169688 1174055 1177470 1180506 1183317 1185604 1187158 1188242 1189320 1190441 1191167 1191225 1191086 1191645 1193416
49277 1193416 1196292 1200020 1204569 1209977 1216192 1223267 1231403 1240461 1249533 1257370 1263340 1267807 1271518 1274799
49263 1274799 1277380 1278798 1278785 1277457 1275469 1274057 1274622 1278032 1284453 1293998 1307249 1324668 1345574 1368212
49249 1368212 1390948 1412809 1432482 1447373 1454578 1452966 1443813 1429359 1411254 1390643 1369059 1348444
49237 1348444 1330221 1314816 1302232 1292785 1287024 1285115 1286654 1291158 1298468 1308501 1320772 1334393
49225 1334393 1348523 1362682 1376697 1390617 1404566 1418371 1431320 1442772 1453130 1463694 1475148
49214 1475148 1486528 1496120 1503102 1507864 1511058 1513060 1514398 1516009 1518757 1523097 1529429 1538396 1550523
49201 1550523 1565677 1583134 1602098 1622130 1643234 1665527 1688629 1711351 1732141 1749877 1764048
49190 1764048 1774403 1780885 1784036 1785005 1784918 1784447 1784117 1784723 1787268 1792648 1801498 1814101 1830364 1850214
49176 1850214 1874216 1903502 1938808 1979686 2024858 2073207 2124253 2177664 2232260 2285332 2332865
49165 2332865 2370723 2395977 2407582 2406565 2396135 2381150 2366309 2354233 2345452 2340050 2338578 2341283
49153 2341283 2347339 2355501 2365020 2375507 2386412 2397188 2407600 2417428 2426342 2434594 2443383 2453840 2465948
49140 2465948 2478983 2492647 2507100 2522242 2537896 2554543 2572982 2593159 2614055 2634819 2655333
49129 2655333 2675597 2695279 2714078 2731896 2748445 2763279 2776534 2789112 2801837 2814913 2828535
49118 2828535 2843616 2861467 2882945 2908111 2936502 2967691 3002042 3041198 3087553 3143004 3208402
49107 3208402 3284176 3370891 3468701 3576248 3689950 3804051 3911919 4008909 4095011 4173735
49097 4173735 4246499 4307306 4343741 4344681 4308288 4243416 4163421 4077938 3989347 3895815 3796742 3695178
49085 3695178 3596119 3503989 3421901 3351913 3294748 3249472 3214195 3187089 3166459 3150288 3136483
49074 3136483 3123593 3110866 3097752 3083819 3069060 3053777 3038163 3022326 3006609 2991379 2976550
49063 2976550 2961771 2947032 2932612 2918492 2904398 2890514 2877514 2865623 2854189 2842603 2831289
49052 2831289 2821237 2812681 2804661 2796048 2786722 2777576 2769347 2761707 2753770 2745473 2738056 2732903 2730212 2729174
49038 2729174 2729265 2730817 2734386 2740131 2747916 2757610 2769129 2782534 2798131 2815968 2835061 2853553 2869851
49025 2869851 2883206 2893019 2898229 2898026 2892888 2884362 2873877 2862209 2849987 2838247 2828298 2821132 2816922
49012 2816922 2814978 2814350 2814601 2815854 2818002 2820267 2821918 2823154 2824846 2827506 2830941 2834738 2838587 2842154
48998 2842154 2845185 2847865 2850647 2853600 2856240 2858117 2859152 2859288 2858307 2856329 2854138 2852591 2851857 2851460 2850840
48983 2850840 2849533 2847019 2842921 2837419 2831098 2824223 2816371 2806922 2795746 2783270 2770002 2756184 2741901
48970 2741901 2727321 2712741 2698495 2684989 2672826 2662693 2654994 2649684 2646609 2645896 2647777 2652145 2658618
48957 2658618 2667068 2677797 2691041 2706560 2723903 2742829 2763246 2784957 2807743 2831501 2856013
48946 2856013 2880650 2904658 2927706 2949897 2971376 2992381 3013653 3036235 3060597 3086334 3113030
48935 3113030 3141123 3171474 3204325 3239283 3276316 3316212 3359747 3406748 3456361 3508070 3562118
48924 3562118 3619007 3678940 3741797 3807347 3875318 3945488 4017818 4092304 4168479 4245140 4320818
48913 4320818 4394549 4466152 4535868 4603883 4670071 4733968 4794988 4852803 4907460 4958936 5006821
48902 5006821 5050766 5091234 5129341 5165792 5200290 5232128 5260939 5286646 5309055 5327988 5343645
48891 5343645 5356452 5366699 5374652 5380787 5385421 5388122 5388028 5384883 5379326 5372001 5362728 5350807 5335848
48878 5335848 5318026 5297667 5274772 5248817 5218787 5183546 5142384 5095247 5042481 4984584 4922351
48867 4922351 4857025 4789966 4722183 4654346 4587188 4521619 4458338 4397483 4338704 4281567 4225849
48856 4225849 4171632 4119210 4068911 4020893 3975039 3931123 3889114 3849252 3811794 3776804 3744387
$$ [...]
##END NTUPLES=NMR SPECTRUM
##END=
