##TITLE=AC1723_GUAAH15009_9207587_fpcR8WeXAq
##JCAMPDX= 6.0         $$ Bruker NMR JCAMP-DX V2.0
##DATA TYPE= NMR SPECTRUM
##DATA CLASS= NTUPLES
##ORIGIN= BRUKER
##OWNER= Administrator
$$ 1.72 TOPSPIN		Version 2.1
$$ 2015-06-01 20:26:39.623 -0700  Administrator@X
$$ Compression mode = diff/dup
##.OBSERVE FREQUENCY= 400.02188249412
##.OBSERVE NUCLEUS= ^1H
##.ACQUISITION MODE= SIMULTANEOUS (DQD)
##.ACQUISITION SCHEME= undefined
##.AVERAGES= 8
##.DIGITISER RES= 22
##SPECTROMETER/DATA SYSTEM= spect
##.PULSE SEQUENCE= zg30
##.SOLVENT NAME= COFFEE_meoh
##.SHIFT REFERENCE= INTERNAL, COFFEE_meoh, 1, 14.98509
##AUDIT TRAIL= $$ (NUMBER, WHEN, WHO, WHERE, PROCESS, VERSION, WHAT)
$$ ##TITLE= Audit trail, TOPSPIN		Version 2.1
$$ ##JCAMPDX= 5.01
$$ ##ORIGIN= Bruker BioSpin GmbH
$$ ##OWNER= Administrator
$$ $$ E:\/data/COFFEE/nmr/AC1723_GUAAH15009_9207587_fpcR8WeXAq/10/pdata/1/auditp.txt
$$ ##AUDIT TRAIL=  $$ (NUMBER, WHEN, WHO, WHERE, PROCESS, VERSION, WHAT)
(   1,<2015-06-01 20:26:32.420 -0700>,<Administrator>,<X>,<go>,<TOPSPIN 2.1>,
      <created by zg
	started at 2015-06-01 20:25:26.561 -0700,
	POWCHK enabled, PULCHK disabled,
       configuration hash MD5:
       21 0F 79 D6 B3 7B B4 F6 88 20 88 DB 03 48 BD 9F
       data hash MD5: 64K
       65 A4 4A B2 D9 02 EC FC 53 D5 E6 EB 84 F8 CD C4>)
(   2,<2015-06-01 20:26:35.592 -0700>,<Administrator>,<X>,<proc1d>,<TOPSPIN 2.1>,
      <Start of raw data processing
       efp LB = 0 FT_mod = 6 PKNL = 1 PHC0 = 0 PHC1 = 0 SI = 32K 
       data hash MD5: 32K
       2C 78 B8 F1 89 18 31 23 58 4B B0 33 43 D3 11 1A>)
(   3,<2015-06-01 20:26:35.873 -0700>,<Administrator>,<X>,<proc1d>,<TOPSPIN 2.1>,
      <pk PHC0 = 89.65942 PHC1 = 0 
       data hash MD5: 32K
       2E BF 64 69 1C C3 DB 87 02 CB 2D A6 A9 14 74 41>)
(   4,<2015-06-01 20:26:35.983 -0700>,<Administrator>,<X>,<proc1d>,<TOPSPIN 2.1>,
      <abs ABSG = 1 
       data hash MD5: 32K
       7E D0 CC 9E EF 20 1F A1 CF 8C 6B 93 FC 55 E6 39>)
(   5,<2015-06-01 20:26:36.045 -0700>,<Administrator>,<X>,<proc1d>,<TOPSPIN 2.1>,
      <abs ABSG = 2 
       data hash MD5: 32K
       90 02 97 D2 5E D9 F4 DB 45 96 1D 5C 72 02 53 99>)
(   6,<2015-06-01 20:26:36.108 -0700>,<Administrator>,<X>,<proc1d>,<TOPSPIN 2.1>,
      <abs ABSG = 3 
       data hash MD5: 32K
       FD 31 16 D9 2F 64 02 DD 57 BF 90 79 C1 E4 AF F2>)
(   7,<2015-06-01 20:26:36.170 -0700>,<Administrator>,<X>,<proc1d>,<TOPSPIN 2.1>,
      <abs ABSG = 4 
       data hash MD5: 32K
       C9 66 9D 0D C5 4D C0 8C D0 81 A3 BB A0 8B C6 79>)
(   8,<2015-06-01 20:26:36.233 -0700>,<Administrator>,<X>,<proc1d>,<TOPSPIN 2.1>,
      <abs ABSG = 5 
       data hash MD5: 32K
       73 5A 1E FF F4 FF 5F E7 30 58 74 14 DD 5F 28 3F>)
$$ ##END=
$$ 
$$ $$ hash MD5
$$ $$ 48 5C 42 0B 2E 6E 44 7D 8C DC 6D CA E1 52 12 E7
##$RELAX= 
##$RELAX= 
##$RELAX= 
##$RELAX= 
##$RELAX= 
##$RELAX= 
##$RELAX= 
$$ Bruker specific parameters
$$ --------------------------
##$DU= <E:\>
##$EXPNO= 10
##$NAME= <AC1723_GUAAH15009_9207587_fpcR8WeXAq>
$$ [...]
150 150 150 150 150 150 150 150
##$TP07= 0
##$TPNAME0= <>
##$TPNAME1= <>
##$TPNAME2= <>
##$TPNAME3= <>
##$TPNAME4= <>
##$TPNAME5= <>
##$TPNAME6= <>
##$TPNAME7= <>
##$TPOAL= (0..7)
0.5 0.5 0.5 0.5 0.5 0.5 0.5 0.5
##$TPOFFS= (0..7)
0 0 0 0 0 0 0 0
##$TUNHIN= 0
##$TUNHOUT= 0
##$TUNXOUT= 0
##$USERA1= <user>
##$USERA2= <user>
##$USERA3= <user>
##$USERA4= <user>
##$USERA5= <user>
##$V9= 5
##$VALIST= <valist>
##$VCLIST= <CCCCCCCCCCCCCCC>
##$VD= 0
##$VDLIST= <DDDDDDDDDDDDDDD>
##$VPLIST= <PPPPPPPPPPPPPPP>
##$VTLIST= <TTTTTTTTTTTTTTT>
##$WBST= 2048
##$WBSW= 25
##$XGAIN= (0..3)
0 0 0 0
##$XL= 0
##$YL= 0
##$YMAX_a= 558990
##$YMIN_a= -486643
##$ZGOPTNS= <>
##$ZL1= 120
##$ZL2= 120
##$ZL3= 120
##$ZL4= 120
##$ABSF1= 14.98509
##$ABSF2= -5.573092
##$ABSG= 5
##$ABSL= 3
##$ALPHA= 0
##$AQORDER= 0
##$ASSFAC= 0
##$ASSFACI= 0
##$ASSFACX= 0
##$ASSWID= 0
##$AUNMP= <proc_prof1d_extract_pilot.lims>
##$AXLEFT= 0
##$AXNAME= <>
##$AXNUC= <1H>
##$AXRIGHT= 0
##$AXTYPE= 0
##$AXUNIT= <>
##$AZFE= 0.1
##$AZFW= 0.1
##$BCFW= 0
##$BC_mod= 0
##$BYTORDP= 0
##$COROFFS= 0
##$CY= 15
##$DATMOD= 1
##$DC= 0
##$DFILT= <>
##$DTYPP= 0
##$F1P= 0
##$F2P= 0
##$FCOR= 0.5
##$FTSIZE= 32768
##$FT_mod= 6
##$GAMMA= 0
##$GB= 0
##$INTBC= 1
##$INTSCL= 1
##$ISEN= 128
##$LB= 0
##$LEV0= 0
##$LPBIN= 0
##$MAXI= 10000
##$MC2= 0
##$MEAN= 0
##$ME_mod= 0
##$MI= 0
##$NCOEF= 0
##$NC_proc= -8
##$NLEV= 6
##$NOISF1= 0
##$NOISF2= 0
##$NSP= 0
##$NTH_PI= 0
##$NZP= 0
##$OFFSET= 14.98509
##$PC= 1
##$PHC0= 89.65942
##$PHC1= 0
##$PH_mod= 1
##$PKNL= yes
##$PPARMOD= 0
##$PPDIAG= 0
##$PPIPTYP= 0
##$PPMPNUM= 2147483647
##$PPRESOL= 1
##$PSCAL= 4
##$PSIGN= 0
##$PYNMP= <proc.py>
##$REVERSE= no
##$SF= 400.02
##$SI= 32768
##$SIGF1= 0
##$SIGF2= 0
##$SINO= 400
##$SIOLD= 32768
##$SPECTYP= <>
##$SREGLST= <1H.CDCl3>
##$SSB= 0
##$STSI= 32768
##$STSR= 0
##$SW_p= 8223.68421052631
##$SYMM= 0
##$S_DEV= 0
##$TDeff= 65536
##$TDoff= 0
##$TI= <>
##$TILT= no
##$TM1= 0
##$TM2= 0
##$TOPLEV= 0
##$USERP1= <user>
##$USERP2= <user>
##$USERP3= <user>
##$USERP4= <user>
##$USERP5= <user>
##$WDW= 1
##$XDIM= 32768
##$YMAX_p= 436547239
##$YMIN_p= -671790
##$CURPLOT= <Network HP LaserJet P1505>
##$CURPRIN= <$Network HP LaserJet P1505>
##$DFORMAT= <normdp>
##$LAYOUT= <+/1D_H.xwp>
##$LFORMAT= <normlp>
##$PFORMAT= <normpl>
##$SURQMSG= 1
$$ End of Bruker specific parameters
$$ ---------------------------------
##NTUPLES= NMR SPECTRUM
##VAR_NAME=  FREQUENCY,     SPECTRUM/REAL,   SPECTRUM/IMAG
##SYMBOL=    X,             R,               I
##VAR_TYPE=  INDEPENDENT,   DEPENDENT,       DEPENDENT
##VAR_FORM=  AFFN,          ASDF,            ASDF
##VAR_DIM=   32768,         32768,           32768
##UNITS=     HZ,            ARBITRARY UNITS, ARBITRARY UNITS
##FACTOR=    0.250966925370066, 1,           1
##FIRST=     8223.43324360094, -35021,       -159240
##LAST=      0,             -30922,          36319
##MIN=       0,             -671790,         0
##MAX=       8223.43324360094, 436547239,    0
$$ Real data points
##PAGE= N=1
##DATA TABLE= (X++(R..R)), XYDATA
$$ [...]
23899 205158 170621 103187 31064 -134834 -210533 162433 12233 -149955 -118877 104770 -146581
23887 -80045 -91893 -219160 -335842 -295378 123074 156943 216229 -38412 37722 -5348 -270533
23876 -270533 -60753 157243 100351 181601 -16275 -113222 265897 16820 -35803 17858 -309826
23864 197944 -69384 -168570 -91174 20403 150245 18565 206373 -147516 160321 -170651
23853 153889 -124256 -120618 -168223 -16119 231008 -3019 -210375 -140835 -113912 -102567 -189010
23842 -189010 137072 -92865 -83280 263879 -214102 179303 -51155 39637 -277570 174332
23831 -71802 61066 -228954 396258 -225216 -353081 299381 -289381 265547 32667 126052
23821 126052 42376 36390 -332526 -239750 44268 -103963 378473 25828 300602 -295844 -31282
23809 -309175 8724 125758 5434 -392305 -149038 37997 -278801 271609 63682 -116645 -175800
23798 -175800 -151984 -95464 376353 -12504 125637 27588 -84764 -129238 -90844 92 129910
23787 129910 -178359 -54669 -127968 -79007 -170606 -127994 -121012 -8253 -143259 -47382 -184983
23776 -184983 -17939 37248 135404 122006 -190769 33546 1798 48975 -201192 -79121 58780
23764 -146260 -255741 132927 60902 -286816 22232 -98358 -146222 -8749 -109604 -120386 139188
23752 341935 -126720 -213929 83497 -379070 -37560 259641 97202 225858 3345 -198890 -9706
23740 -40009 276191 -189803 -69036 -191408 139734 177733 -166739 -304941 39545 -227925
23729 -31912 107484 -988 250951 315503 115678 -72061 -51056 -311295 -220264 -92875 102535
23717 103475 -19687 -1592 -299225 -269801 -249748 114456 222152 -50702 -20667 398537 9031
23705 172181 127405 -157567 162471 56837 41763 -56626 36588 -2979 -93259 37268 -265051
23693 110766 100605 34755 18136 120794 -142921 -57106 14297 -128412 -68751 -126893 -472225
23682 -472225 39895 -97792 -252289 -166557 187894 -88412 -143483 -180923 121334 -198889 -222359
23671 -222359 -207059 114928 194831 -198034 86161 251906 252501 159197 62095 -83800 109560
23659 -206987 196621 -180374 147730 201794 197901 109689 170336 26703 -104409 -100533 -124254
23648 -124254 -199057 55793 54476 218561 19212 -176310 32384 243417 198765 185318 322427
23637 322427 -41408 68174 303401 229545 -193828 228485 -348228 -104476 -28981 -53978
23627 -53978 -187792 -94845 101450 -104807 -333815 -26999 -104998 -22516 166765 -98404 265883
23615 -109884 -53054 25942 -117892 -161531 -8115 126730 111419 -355337 -291294 -17980 -124264
23604 -124264 -54311 226727 -25576 263812 275714 -21962 264211 -190258 113075 -57729
23593 65372 153245 147332 202309 194648 152494 -66694 -7919 -66030 -107352 -76077 287234 -390322
23580 -336259 -71809 -224999 -7602 -122158 -92056 -39061 302535 160045 -244846 -281544 -79921
23568 75909 188264 342584 -121446 26508 22156 -346658 -169848 27891 -204818 87713 -72972
23556 -212056 46624 540027 -609 -165968 10250 -448763 190380 89621 142181 -31598 81162
23544 14648 191316 -50491 -51195 -65166 117705 -216712 -168382 -268062 -144642 87959 119102
23533 119102 14132 -162324 103642 -99121 -128189 52682 127369 132273 44324 271139 19956
23521 -202349 -18636 69456 3464 -239573 57407 47464 101425 -456033 -100228 -93883 -267890
23510 -267890 -128711 -166234 96641 -24312 -411901 -184499 48717 83399 -211584 50202 139170
23499 139170 -97472 9938 -295515 -94688 -153052 51642 245229 -163961 -15191 -24003 -60297
23488 -60297 -114373 -198702 233612 96265 -154228 129938 -107360 -102970 -110006 13318 70356
23477 70356 -52607 103884 367589 1726 372798 -256927 37726 -49870 -346625 -309615 29293
23465 179948 -137817 176863 153053 -27370 -239613 25791 37987 7701 196850 128581 -12818
23453 227595 56045 -133956 69236 26510 -272027 251613 -116806 155312 170620 164718 -108051
23441 149018 26926 54000 -264045 -126185 60276 50939 249029 -160784 -25715 63126 37220
23430 37220 112879 -110877 -96563 -97751 30954 148229 -189521 262717 -141340 -272657 -193903
23419 -193903 4205 -344683 -16702 -289869 137703 -2326 -36754 143388 -109442 392406 -141883
23407 -189574 185044 100673 -53373 -252497 826 -215633 -373412 -61374 203412 67427 -32498
23395 199594 -215690 152455 -27908 -142862 125950 66864 -5142 27906 -176448 45523 -48942
23383 109431 -131663 -146519 185099 -17453 217008 61236 -64035 180344 74483 -17220 -294646
23372 -294646 -74009 524060 -243353 -186583 -199812 51197 -158295 -344329 -63896 122505
23361 -298858 237804 -41468 -213602 10935 330699 140582 90918 -12230 66916 -16038 -56715
23350 -56715 -204135 163351 -125176 -200549 115081 216680 186766 -113717 109230 -205272
23339 -79401 -159308 9455 33431 25289 346642 88189 106391 -154033 -190704 -223138 -32793 -307132
23327 -307132 -114902 -313056 -99250 -75194 -121546 -249342 214614 195625 -89919 74251 -120622
23315 58110 38037 97459 -400282 -240858 90165 48499 155211 -126854 -257211 -240 -54544
23304 -54544 48479 138646 337267 -4849 57100 36590 -222433 -85686 -101760 77631 49971
23293 49971 23882 16145 20903 -148059 -32778 124624 -21558 89701 -119287 3791 -185281
23281 -27488 -46039 -393867 121316 89817 -14917 11051 192180 -74754 -31948 -103335 308927
23269 174288 -113619 231977 216474 368290 56805 -51276 -123744 127171 -626 47060 439188
23258 439188 -41678 9528 -195789 52245 -14168 63007 193127 -322636 -75771 -235828 -158992
23247 -158992 -77965 16014 -15615 -149006 30973 -68972 -105474 24697 -142482 97254 -41144
23235 24932 131397 -117354 -342881 -61781 60416 245275 -15312 -183089 -264423 -33025 128861
23223 -383016 -66877 -271968 27323 -57047 342622 192789 121068 69417 -70324 -203913 -82278
23211 -121098 363520 -273306 -192402 -148647 292829 -5514 48117 85838 131482 54995 227286
23200 227286 -254916 14173 -63744 -208091 109507 84128 20813 139774 -6285 179695 153265
23189 153265 -67537 25848 -113228 -120016 -256121 107314 242005 110713 -12440 24340 -98951
23177 -79977 -269134 283930 46591 21910 140535 -390500 -173320 15128 -30361 -129126 -176880
23166 -176880 -239249 116071 -170107 183142 104873 -28945 -191151 180341 68308 -168144
23155 301540 -424655 216623 123687 -71107 403478 -197201 -17253 -175445 -206057 43231
23144 -141433 16162 -250775 -10143 212881 72241 -2066 261152 65222 -276603 -140003 -85689
23133 -85689 7247 -12386 19076 -37946 99013 106780 129477 247707 -118644 -159730 -157507 -250445
23121 -250445 -5537 10122 194881 -74275 129516 -450312 -235116 11985 87167 21575 -544234
23109 45399 34651 258346 -48827 -285489 197433 -21366 91501 -103376 -251199 -206972 134930
23097 -136081 -93966 -156416 99613 -60911 -20894 164853 9899 78551 141120 156178 -44008
23085 -63245 178199 -108855 -201574 -218580 174830 -112841 121482 40970 141624 21160
23074 51953 -122463 15636 -65484 265139 144092 -114573 -89381 -164628 -2941 -131885 76643
23062 41764 -205244 409557 -76173 -51460 -169011 -21703 -20832 274317 -106615 113062 158027
23051 158027 -133131 16771 -62001 -216060 320 -154959 225509 -66700 8043 -274846 -2279
23039 57120 -43306 -131412 -98923 -70599 -25878 77604 142882 -1900 17449 -52448 217544 -107665
23026 -30193 36506 37875 -119848 -315564 43143 -66197 -108601 213581 -40577 -105934 -12348
23014 80914 -208657 27491 -64418 -173565 89325 -1607 -188600 -25257 -254258 -96750 180684
23002 -271332 51479 216162 -910 74798 -392379 282683 51008 -141029 -248778 62592 -63995
22990 -2983 288972 31397 -218847 -214374 -50505 -16830 46540 355675 -42686 88255 -99296
22978 11259 212770 -79625 -161042 25951 49715 -2469 -7510 162682 80725 168715 258381 116602
22965 10026 221236 174950 -256172 197060 -117496 -284066 -185874 143410 -290670 -180084
22955 -180084 -100141 -329751 208123 -202315 62936 246880 4090 -213010 -129444 1956 217270
22944 217270 -155037 270753 -124237 -117448 -75882 -221730 141926 -140806 148076 273629
22934 273629 220385 -233888 -132768 -124132 -39504 -149409 -190271 -26189 60126 -161518 -18530
22922 278347 -120669 69554 -63438 17044 138979 136807 57223 -16075 -181101 -191318 50307
22910 -311414 187254 121118 -14503 -341149 -243075 -269997 -76026 342770 -130802 -142779 -18912
22898 -78342 -157590 49314 -114803 -176672 332583 -100843 -52890 -274667 5103 -175153 -117837
22887 -117837 -90802 -84973 27851 130566 -13958 -209477 505284 34322 -312910 20351 83126
22876 83126 147998 65685 -145016 142533 -183854 22186 52948 -210171 -54548 -161635 -111056
22865 -111056 -156855 -140153 -97188 -270308 -91980 -74754 168377 38690 -26912 75386 287
22853 19753 203707 239300 280178 159712 -91848 -234753 -111985 183490 174262 -150523 79390
22841 -71814 -108399 -211722 88191 198569 31466 -64636 -34650 89082 108225 -72394 -262313
22830 -262313 -168049 -207648 -146296 41097 -39502 169224 93298 -171214 15939 130894 42606
22818 94376 -80336 8728 47791 -88539 21659 -138868 -173520 -40063 -473877 -142818 -222010
22807 -222010 94751 -209296 14016 -118407 53993 -301335 -30965 115251 -954 -28383 -34654
22796 -34654 61895 221971 -257673 21177 -154686 -173139 -72509 154672 -427916 -151230
22785 439577 -153686 111168 -123287 53015 52159 105320 110575 -118291 -9520 149328 -139560
22773 4998 -22141 175211 201031 151151 -118113 -76753 -202333 -174640 -5910 36632 -175744
22761 -96307 48922 -107840 44135 -221314 16534 210257 -306260 -40163 49479 -86918 -103289
22750 -103289 95787 34979 -126104 59406 188012 -241976 153881 136468 197240 -204588
22739 -303750 10713 -68824 167616 68691 118516 22966 -223193 150025 -115549 -82395 -55171
22728 -55171 -265030 -20816 -124024 -239108 87505 -204150 -131598 -8104 135273 -217519 -506433
22717 -506433 -170356 14634 93025 -82906 -142864 106887 -126478 -73785 -233344 -24053 248360
22705 -246667 20593 200334 122633 -26865 31145 -346633 99609 -62212 75226 -134526 -5088
22693 -129525 -50016 -107072 -146473 -279558 -303754 -247639 -202276 -120101 244253 -250039 400066
22681 -104445 24213 -267073 43949 106149 -200179 -193244 -112154 -114382 189829 89264 212113
22670 212113 66784 86024 -196542 30714 84808 139016 -48747 9340 200164 -384918 -104112
22658 279733 -97703 30136 -205677 -47882 103510 -90345 48068 -262083 -12265 -85316 6158
22646 40847 217076 1274 -18523 -244967 -31059 -30898 -60665 -153284 -329227 261774 55236
22634 -197725 -102435 -387212 280539 132226 186474 156017 -122411 -103998 52131 86658 -350355
22622 -68618 -221220 -376879 -31512 -82129 -34713 -266082 454665 157829 -17020 -96568 -14063
22610 79588 -217747 148273 10077 -123208 -127303 -161357 -115483 220906 3703 46051 6281
22598 146716 -207798 -88513 96100 114682 -147812 -312131 -195161 304471 -127434 -83828
22588 -83828 -3626 -232487 -91468 148614 -63492 -271958 99259 -77050 165064 -134757 136281
22576 -60713 27958 42502 -110069 -10576 -58938 -15022 -8204 310370 106035 -149389 151421
22564 -14733 208422 -173470 279469 -97246 29509 146511 224681 120165 -33641 41108 79589
22553 79589 -31762 64980 -210379 -133434 49989 85560 33387 -126679 -273859 -154323 161315
22541 -282079 -207106 -61929 191419 -39400 -45404 -249763 -151985 -14672 316996 56895 56972 -259544
22528 -3318 -126173 -113556 -246162 -103850 195007 162629 -120126 -168976 34115 -251537 217128
22516 184870 -143952 377930 38875 -129640 -265574 128859 328280 -275670 48503 -195302
22505 184841 -246707 286985 231588 60254 66665 91930 -22212 -87679 -40939 146175 51813
22493 -167843 63291 193242 179594 4999 -59006 -244958 30193 -10954 73437 185302 -491758
22481 -275568 2903 -516122 117623 -113413 202558 -140916 -164899 25315 -24165 -9324 -159883
22470 -159883 -81923 -103146 -159409 -218525 133096 -220379 -64656 19952 97245 13590 -308722
22458 66721 -72992 -71621 -49803 -48492 -165975 10440 -66877 131644 23642 265382 -315118
22446 -258852 31476 39681 18319 -160497 -58157 -229754 -139196 -256803 144972 200706 217413
22435 217413 134561 -197834 -34522 297842 -37954 -53800 -5044 -64785 -284286 391667 -163621
22423 -164696 367313 21987 146188 -81234 -123473 114054 -109716 -311007 -56831 15075
22412 111035 93977 -136865 171395 -144595 129180 -49293 168154 -163258 324981 77659
22401 -44992 44391 45879 -141073 -54608 -16818 -67505 -116159 33943 12747 -45394 -35845 32470
22388 -72409 -356805 -314509 -196515 -289429 170828 64683 17786 -48697 -212340 -142861 -291682
22377 -291682 161010 163064 276650 -247847 140036 -359448 144266 -101223 -5030 129536
22366 275332 27403 -197633 -70947 106161 -4855 -11152 -210301 80041 -126467 99179 -152021
22354 300188 155420 -91029 -174876 -138001 -13405 -75345 130149 28671 34961 58222 -28507
22342 -395464 -220170 83775 -40874 -1643 53087 214334 -1830 -202575 49514 167351 -125305
22330 -11263 -78815 -133778 38584 174691 134953 272647 -176064 47148 -116824 57452 -66770
22318 -58932 200889 -22102 26627 -245304 38898 -419120 -47533 -196898 -348471 -19688 -498321
22307 -498321 -377036 162634 -165554 -39302 54256 -124366 -11836 -32785 70161 113276 233816
22296 233816 -114610 23814 -26937 -35721 -82593 66480 -17015 130631 15256 77583 86678
22285 86678 12653 -133318 277731 112862 196032 -3359 -49509 -201957 -44168 -238542 -68011
22273 212262 24467 -231529 294181 167684 -299146 -39681 -118944 31123 153105 -162899
22262 -92506 57339 -406459 -250349 -199875 138046 -193856 93628 -171117 90684 -123536
22251 -134420 -24095 -127529 -104946 -128599 -9014 -7406 -375205 24953 -113436 -13599 -5821
22239 -155878 32047 -34444 153218 -106919 74137 -295855 -135888 -16521 97721 -25862 307335
22227 57959 242482 -53188 -149027 272691 255730 -359218 -66421 -70090 44194 -25148 92702
22215 -125443 122794 -148225 57631 331068 -356327 -81626 14280 -46314 -177817 168739
22204 -116459 -88594 -109218 201822 -22540 -12509 -104224 33157 22964 -251881 -35640 -189423
22193 -189423 10634 -153971 -108774 -234088 52477 -37538 -341856 186414 109221 -102502
22182 -200251 124038 -232292 -157707 15807 -191162 122801 74886 209670 -68726 -157121
22172 -157121 138361 187992 -6604 54896 166847 -269746 177886 -21046 -17064 -198851 95627
22160 -140557 -418213 -123502 -431899 129413 -56053 -325239 190461 -186392 66787 -327457
22149 -72897 35340 27383 -86231 15549 65771 -143898 -274653 -42289 -202746 -250220 -44645
22137 188338 2148 -148333 -184267 52679 -198151 -258047 -101328 16618 27796 45059 98268
22126 98268 187818 78429 -207191 -385906 -330198 -38335 -246905 107445 -161243 -48279 155896
22114 148587 250412 -206025 -75453 -95809 -10151 127941 -242343 -224416 -216020 159740 237458
22103 237458 -190778 -221199 -8153 -163402 236579 317337 -147198 130921 -275986 41172
22092 79807 -150871 -207402 -84433 -170807 -205162 65614 54321 -62886 -242317 248074 -243004
22080 59150 -387300 -49006 66836 71711 62075 -82698 -242122 47237 172112 7343 -132752
22068 -57231 70334 -99575 165893 -367204 23625 104699 -25734 -227429 4093 -59795 -229882
22057 -229882 148966 -83924 49806 96685 53892 -92228 14589 173806 -338445 233174 198186
22046 198186 83495 -21526 -78248 175172 213819 7234 -147631 -325138 64112 -220089 1245
22034 56357 105176 -292 23041 -441858 -183387 111216 28651 187668 -74562 -138372 -39786
22022 -179706 55734 -194777 -149284 -92253 -6199 59797 -279732 135234 374164 53844 -49250
22010 -57276 354921 -257506 197360 16581 71989 184959 -151216 218029 -45994 2139 -88199
21998 95925 11670 -276387 63914 114008 -256795 48812 26398 -42408 210942 -116901 75453
21986 -151485 -137220 79586 10055 -390212 -146551 -95172 -24200 -53379 -91198 87899 -162571
21974 -37312 -27780 -137105 92936 -304009 -95702 -175501 -66458 211197 -76867 -248182 -94090
21962 339778 -163088 126406 126861 -111931 -47080 169962 280747 -29755 -177687 -150681 -60194
21950 -86611 77580 165685 -123016 -152356 -178549 -49809 -26902 315259 -136726 -323732 -73831
21938 -317241 -103131 251015 25074 -4885 -359581 6667 142069 78244 -19285 103295 -148524
21926 -61738 50875 230916 -386163 -7339 -13267 100210 82137 -44622 32030 -18547 -5233 -294719
21914 -294719 -117841 -212887 37056 -484161 -177829 -284390 -52531 -14523 291612 25216
21903 109246 -137443 -152373 205182 10751 147166 -97265 116650 -11847 -123986 -99730
21893 -99730 -390814 -169879 -61526 106299 -99320 -84459 726006 -176114 -170026 -98911 -2810
21881 -52052 -109402 77358 112384 137141 -5139 50061 -157845 104822 158166 -150513 -214431
21870 -214431 218466 79726 -48088 96463 361233 -330577 -354440 -49176 115221 206715 -49660
21858 -2119 -156751 -125056 -29553 55284 -216651 -216651 -6343 237234 97334 75085 28517 -220369
21845 137974 -296686 -106395 -245984 -30979 220479 -205583 177420 -220026 -145518 -183998
21835 -183998 -288344 179955 139748 64345 -277806 2257 100539 38684 -111852 218584 -7377
21823 -216289 -156011 130058 13369 -371708 34000 -67939 -101189 -41070 -201965 -195474 -211358
21812 -211358 -120045 48857 195035 71982 -32813 366654 1286 31869 -143603 19237 -152029
21800 163399 179738 43234 -370043 -234045 53663 128765 20407 353169 -22647 118858 -235926
21788 -76899 -240166 166112 -18175 -118881 19377 397799 312874 -197542 63310 -117602
21777 96580 78405 -329513 -123923 383816 -175000 -246581 -233384 -125047 308606 64334
21766 174478 -68507 -232066 101472 133865 -253960 9752 -202760 312574 -201623 12667
21755 -345122 -76057 166962 160589 86393 242714 -83569 -36571 70420 33404 -251126 184048
21743 -39955 -113146 -351757 31209 -250034 94135 11587 141730 84011 49872 314247 -318247
21731 127137 -42975 17552 -90119 -195584 -207492 -273236 287522 3036 30963 -192280 -115326
21720 -115326 7618 48482 -412714 171709 166301 -164925 183029 -132656 -40895 205511 -12737
21708 -104555 34536 27782 -89976 6696 251091 -113694 -308615 -226257 -311803 -234188 -258007
21697 -258007 -6786 33547 224827 138849 -116496 -184873 56570 -181801 64602 -228808 -890
21685 -86742 180069 86238 -138183 -20469 -257667 216209 129586 263434 110812 15145
21674 -465092 1494 28252 -217511 -15565 112503 82970 34149 -232065 -255902 -16395 121962
21662 -235084 -255512 4094 -183497 140326 -29008 -160331 38258 203036 113166 145102 248425
21651 248425 110413 -154165 -29484 -13402 53492 -192439 -245017 -280368 -462634 -133550
21640 177346 319479 -511470 125305 -2272 159502 -36276 -202412 -4104 -80325 -83721 185629
21628 9909 14844 216650 143530 -383657 -77501 150284 53173 8030 -27691 -13492 298126
21616 80532 -240191 -187701 136201 -165122 159111 99836 -14970 -224070 106426 104057 278488
21605 278488 -36819 -17258 198212 8011 -33271 -19362 -375282 -39149 -231912 -127976 -384069
21594 -384069 -117999 -209573 -107945 117447 168713 47919 -151760 -203906 -293899 198146
21583 -11849 29045 -13075 -68051 -46865 454610 20047 -98138 26927 -105136 297581 -40179
21571 79923 50046 -356636 98244 19640 -48557 -110087 -241570 -566941 -31046 -113422 -96955
21560 -96955 28016 -6348 174342 229291 -73853 -200357 -28942 -91525 63722 97646 44804
21548 35290 136373 -120466 118874 -314096 -517384 210706 43014 -83478 197339 48673
21537 -157871 146061 93587 -192633 58705 -83188 17363 25427 260724 -275883 355710 -231721
21525 -13117 23284 40696 59245 103129 35422 313182 60873 -68750 -220421 -287261 -209968
21514 -209968 -131863 -428704 -156169 15852 -382318 -173934 -172142 -61502 -155633 -278150 67327
21502 -143160 -123780 125626 -269965 -66568 82173 104688 -144097 -192819 78562 -3876 -190472
21491 -190472 -144200 47121 -23904 95857 -94365 112215 -60161 -364068 33856 -303578 -127818
21479 199305 243498 -251265 87954 -245767 -225713 103496 -76497 -272455 -188043 -219931 -172988
21468 -172988 -12066 47412 -139370 -52848 -230282 -16171 -23377 -11802 315283 27457 56034
21457 56034 210604 -298132 175097 -300184 -81908 -113774 213362 -299714 136773 121388
21447 121388 17444 -5043 267982 -26296 -58222 129788 139870 86641 -84186 216843 170906
21436 170906 361561 392779 70362 -38264 -208758 94840 185846 -230697 70812 138687 -176673
21424 263941 53267 134576 79389 24010 173396 -13473 190563 -50854 70961 -4864 117451
21412 -272983 124294 -221968 -243996 -139906 74491 -49381 170141 165233 -391928 254799
21401 -186886 -32651 72016 -123338 222164 54192 -441836 -179160 -87132 -50265 -212342
21391 -212342 -91171 -42043 -135019 124957 -217994 -236552 82573 -282955 -88731 50080 -296378
21379 -75820 -159589 -44773 248612 9642 -128741 -298141 134329 -13346 -35024 -372912 -43838
21367 80208 -216127 -151257 69485 111040 166158 -237666 60354 9013 147254 126034 -25452
21355 -174203 93269 218584 -275755 -84570 -134146 -159078 84690 219160 -131003 63381 204312
21344 204312 161968 36408 71008 114614 207613 -136734 -23733 -232465 60096 -209277 63190
21332 -22345 157054 117977 -243929 -258657 281372 11652 -371474 198497 156656 218568 -256463
21320 222061 27832 -159312 261463 35909 -386923 48347 -259967 -83001 -19983 -118647 -11069
21308 -223504 263871 -199807 -45318 -329583 -158131 -21005 -150552 88420 -91315 199840
21297 59183 165553 355886 49958 -142526 21756 72590 253454 -150125 100636 -96493
21286 155411 107903 142167 -45344 -35204 -478263 140933 -254506 -100376 -11320 -395494
21276 -395494 -91763 -119738 332862 -15706 -100484 -407512 113425 295278 -122264 -120994 118027
21264 -71035 114832 -170651 -180234 -21465 -179880 -40498 -48261 -17426 230544 -276338 -119868
21252 2972 -66969 64995 -95486 18455 -83663 -114342 -123672 -33696 148031 -207778 -50391 -364684
21240 -364684 114900 -181543 -149577 -217855 -176834 -142873 -11643 -239217 -361109 -183 17823
21228 82112 -18693 18903 -56898 -236479 -48010 111574 -161067 66123 28688 -3503 -372444
21217 -372444 -56823 -138875 -97822 48653 -246168 22615 165155 58747 -102005 214055 -170726
21205 -280288 449970 -72371 -30 -75764 29531 -207044 -42616 -280185 110432 -124264 -120104
21194 -120104 -91498 124145 167542 108324 -120279 -95310 223676 180042 49407 -187297 -177204
21183 -177204 106883 145218 -99522 191858 3372 -415489 -292648 -114919 404125 -133990
21172 -93676 -198974 -31502 -36096 178257 35969 -37691 118950 -153141 -14481 -170307 -36613
21160 -194068 89035 249026 -65143 -87809 217842 -6204 -155222 -76848 47636 -14476 83994
21148 -155007 -261929 185065 28056 -470964 66326 -79590 93808 -214526 285961 -241025
21137 -219081 -197876 -30118 -76323 -70824 -110925 -309239 -303034 51207 47164 -50800 -139863 -42679
21124 148050 -189699 -214218 -221660 101524 12449 66689 229588 -65832 -239767 107562 -115936
21112 4093 -165976 13897 94696 93906 333527 -52603 -239447 -335873 -221431 172933 -321531
21100 126574 125137 193464 -389985 -31293 55179 136424 56225 -124440 -79434 15471 -43356
21088 -302876 128900 -162601 -353 -34566 -167567 -19623 150154 6205 -160018 -122586 80417
21076 232181 224670 74770 274139 212088 -59133 -156119 -281239 -130799 149454 -813 158217
21064 230741 -54774 57694 120801 104031 -296764 -61307 -135818 -148689 191422 -473 40576
21052 -103602 -275950 -248028 133783 18519 -245667 185013 108377 -20879 -29379 -119343 103893
21040 130614 66661 100567 -177241 -38215 133184 -119323 246807 23482 -272243 9332 2900
21028 -200408 -192656 -100811 75449 197736 -95259 -43334 47346 4640 173913 -123609 -107899
21017 -107899 -18072 144845 38422 192131 -166978 -12369 69336 -120455 -123869 -106433 -40983
21005 -21751 -154807 19819 31840 -212543 77607 -262556 -202468 233371 81697 -195003 264002
20993 -131475 160583 32333 -164775 78487 -9927 -155058 -8355 -146658 -147971 42782 -215838
20981 -199227 -51182 135534 337038 458228 -166861 -165609 -70073 15826 -48797 78065 85677
20970 85677 -41982 -239572 175469 -7675 30046 -284038 -177885 -122157 -101474 -148116 181825
20958 25663 -35167 -151740 266959 -74602 -139607 185172 63389 75407 -121932 289922 -179646
20946 366383 -15145 -27024 -225494 -122094 10001 -328009 -76683 -134443 -73162 159512 47411
20934 -67216 -91764 48964 -218164 -357573 -144543 -147719 79965 131460 -123647 999 -94484
20922 -27128 98250 289484 -18894 -154954 -116978 103565 -64735 -51711 43460 6612 200677
20911 200677 -207343 -291370 -140927 -180122 -38243 -312322 28356 -6481 -397 -165463 -339515
20900 -339515 93885 -77715 -63202 142330 -93269 -63306 -170330 -233137 -28904 -113248 42675
20888 -33334 -87697 206155 -504886 256315 -237767 -110542 -257093 51489 -56256 219734
20877 -18486 -286886 -457202 -47532 -163698 125749 -200408 -259767 -10429 -172984 -221566
20867 -221566 -105318 -133933 121116 -361311 -67989 -240459 -92263 209035 -154309 -212368
20857 -212368 90216 72218 -5488 -256487 -260295 -77011 -170487 35119 -19498 -198370 -112551
20846 -112551 62345 -61962 28346 -24847 -287543 -91555 -101090 -240336 -100732 -143216 16378
20834 119156 -275560 -136049 -108645 -223899 -172828 -107071 152975 79531 -37616 183892
20823 413181 -326493 104308 -278566 28221 142859 394671 61729 -313246 43185 -217844
20812 204213 -176146 -76280 -155410 -110756 135941 240897 151399 272453 133044 39002
20801 -139088 47778 -292445 -112277 -37376 -86373 -536393 186290 -138865 -23845 -147376
20791 -147376 -29557 -216573 -97465 -169153 -99715 17389 -192538 -187603 -126589 -137857 29647
20779 120395 143738 25321 63945 3403 39133 -219019 -7029 64994 72916 80259 132915 -230333
20766 -136555 312461 33241 127555 131360 208873 40030 -252415 150633 5959 -51290 -21262
20754 118934 -250086 -229239 84495 168741 -183163 -153931 -68105 -29114 8360 200166 -32250
20742 -163563 38834 14762 230269 -113037 -160195 -344108 -55100 -128678 -263876 -254926 258475
20730 -88147 -49706 -134453 -102462 21284 -305841 -158998 -27524 13927 88156 91759 -149688
20718 -299270 -210482 270089 45457 103183 -324856 -86370 38325 344900 131325 -170013
20707 369471 168730 -423962 305525 -8484 -145733 165446 192204 -68738 -139386 127494
20696 136082 -4333 -124160 139170 -215427 116324 10259 92450 98855 -64051 -99263 120443
20684 -229574 57087 -339033 -93382 64584 -24328 -242916 -91006 -59011 61688 111123 204597
20673 204597 -131775 -182402 -147721 -41842 -97729 121881 -197644 235721 -43465 74521 -89674
20661 166736 29809 144310 -270760 -339050 -85921 285246 -204900 126559 87178 56444
20651 56444 75064 -248404 125573 139173 -100159 -109937 -132960 -172732 -134925 43213 57981
20640 57981 -35484 -173467 -150915 18640 -171698 24932 87304 -226591 -142051 -258667 -137007
20629 -137007 -23908 -76233 79494 -198216 -153553 -181548 -46763 -99866 -86054 267828 -31889
20617 9129 -60660 -62210 90777 214289 -295695 -126259 -57184 -37335 -142172 49800 -29192
20605 -72680 102728 19415 142921 -25144 180983 -177332 52118 256921 -17893 141022
20594 88854 -331755 61733 -396285 -522172 -93430 157199 -57873 85910 61444 52816 -77674
20582 -19436 -378384 -62985 288392 104295 -285867 4747 161296 117957 -260968 -70561 102214
20570 -169067 -196609 76644 96729 124644 -243632 -42957 1527 -149764 20856 -202116 -136692
20559 -136692 -63915 -226994 120822 -85331 76860 -73378 96108 -76677 -55690 41422 -251742
20547 -79610 114197 -49107 188195 -204873 -2898 -165099 207275 -67426 248422 -110837
20536 -276125 -207728 -113025 -312582 144594 -321679 93980 -201863 -43921 137629 136239 -112443
20524 120379 -62851 98767 40870 225578 -299925 -132567 81220 -248926 141311 -71943
20513 -73419 202895 -279732 -49656 -27786 -357398 17286 -22153 -262296 32351 -43731 -73730
20502 -73730 -119009 85046 -13330 -211698 1176 -171337 177151 -50325 -19456 -52500 129550
20490 77081 -87847 25050 115136 -61216 62891 -44541 60405 -273587 -62176 198899 -228337
20478 35281 -64549 -335221 -70241 -93324 -167115 62179 21783 -15490 -8929 -339519 189858
20466 -108428 -426287 -161341 -16620 -116450 -49291 291402 -272786 246864 190640 -16782
20455 -85589 101224 39114 72155 -128327 -97544 -204689 -231979 -173442 -487996 87587 -92321
20443 318797 115702 -77627 84173 -214095 -225003 -9909 34228 -168259 194434 -354458 -70979
20431 -106387 -302293 -25858 -111428 -114914 254152 223672 -441749 -188496 -281714 -100479 -19763
20419 -115381 174063 -152705 -199952 102629 32370 134466 154674 -25391 10472 -195879
20408 179604 -144950 36102 -335309 -208695 -63721 -140405 -111876 -135490 52149 -330189 41783
20396 -30825 -62308 -538862 123902 -446681 38257 -374614 -306918 -132720 237262 309114
20386 309114 -104313 -61832 53070 -74012 -17481 -103439 -231256 -162995 -119449 35555 -386976
20374 -36671 -241847 212792 -203564 6697 -31687 117283 -36668 341043 136749 108576 -42912
20362 -293360 -324498 -38339 -279739 24902 333463 -23952 -128153 68217 41759 60352 -21072
20350 -130576 -86018 -166051 28967 232714 -229621 29256 -18604 -259057 -17677 -218511 -130405
20339 -130405 -132966 -149779 -258007 24954 39039 120016 103375 -19950 -179498 -440228 -98789
20327 -195483 213139 23465 -256687 90461 -74025 -4729 173310 -134280 -156685 -409800 -151339
20315 -10564 9009 -262946 -61194 141880 224574 -5933 -50185 1913 -36424 -142428 -18278 -62257
20303 -62257 39664 223381 -138909 22366 -202536 -79708 85633 -149671 35861 -329823 351873
20291 305472 15758 111221 80007 132499 -95552 140290 -190395 -107990 -338790 -79604 -79108
20280 -79108 34688 -303283 120602 120730 43587 344960 -50271 4949 281487 -221783 -356472
20269 -356472 201385 239259 -48778 -75419 361248 -211803 -132652 -71786 -183485 167164
20258 -154656 -65951 94195 -146463 255531 -36486 -136599 -133915 -122269 221283 172484 101818
20247 101818 128851 -251460 -33147 35910 -184349 -219743 -47473 1897 -391408 8548 82145
20236 82145 -30255 -44865 274525 -112718 -53883 -77207 -212114 -28203 63927 166350 -272532
20224 3448 -111793 28026 67683 -244811 253247 -93428 113943 51986 110126 269351 2963
20212 -127244 -671790 73692 187728 118046 101227 25722 54062 -56033 -42025 -253785 -164859
20201 -164859 -142682 95135 -139710 93849 98143 -148284 166845 -268417 -39660 -10879 35298
20189 182379 222410 -163850 -72310 -157936 -115843 -13372 -259579 -147422 -289719 133155
20178 -361250 -196523 234526 72964 -124379 263717 -6065 87033 -7767 177237 -18630 -56200
20167 -56200 66357 7121 166823 38978 83004 -204232 -124040 -83587 -205913 -188286 89816
20155 -83889 -38423 224433 119631 66097 -41255 -301365 -47351 -120747 24344 -292745 336365
20143 -190629 -307743 -264447 14676 -142628 140409 25166 -135333 28743 185373 209434
20133 209434 218604 -23770 -204836 41500 108931 159683 185525 66835 559802 -316127 -25684
20121 -86201 88762 -12683 -371692 227302 9028 -249989 128610 -203927 2957 133843 77480
20110 77480 205319 -96908 65679 -6445 -361394 -126726 -217767 -23259 -63975 -36913 -56556
20099 -56556 -135106 -20775 -128615 24245 -129630 -19319 63671 168390 5960 -142885 -305125
20088 -305125 -243106 -215423 57673 -56388 7991 -234496 115373 301518 115289 -290033 -15439
20076 -115043 -236281 -123821 -56453 79519 -130819 -197458 -146822 -241042 -250325 -16436 -56980
20065 -56980 -78757 -18829 170974 -84759 106921 121227 143277 92768 -28924 130029 -352
20053 -181833 -236245 -109790 -144570 95436 -167100 -232223 107847 -26296 -25932 -82064 -92188
20042 -92188 -41009 -156393 -53862 -278755 176510 -404096 -16712 8643 -24177 30534 -108516
20030 84258 -194193 -129862 -96593 70506 211615 88358 106396 -1783 -85726 -78895 -442716
20019 -442716 -192836 -246900 16522 157580 -287055 102248 -223181 -57068 -74820 -3774 19738
20007 -138242 -298367 -69739 252140 34089 -16994 -9582 -33816 -61168 290081 -258889 -265467
19996 -265467 -41528 71011 28068 103711 -6899 77866 -156079 16157 178535 -45316 -198210
19985 -198210 -498518 2648 -5594 -17666 96024 83728 86405 -15912 237266 357996 -39405
19973 -290045 -138289 -276861 141683 -5632 -165145 40980 60852 -205661 -39000 -95653 61984
19961 -185092 -27747 13708 127436 409826 -196768 -64194 4303 -195893 -28240 -153427 405706
19949 31359 78511 24691 -154068 -205599 9917 38687 5868 -152554 -79690 126937 -205937
19937 -84925 31485 110888 141045 131654 185048 -278779 129623 -160535 -97074 -12079 -166365
19926 -166365 36742 -74859 51071 4503 -170121 74333 51411 -145000 72885 161580 -152890
19914 -277925 -232945 -162874 -124630 -84279 -75855 122338 -3816 -256549 -97133 -139687 81176
19902 -120220 -240658 69720 -446652 -309490 -228094 95317 -177505 11209 -117006 135650
19891 7729 -229751 66858 103132 -5979 173101 201935 -105187 51513 12192 -178116 -205094
19880 -205094 -130320 -234715 9496 288609 -10215 -51780 117018 -365816 -37865 -35428 -276389
19869 -276389 48506 -271728 -31176 42248 -10066 -127223 -276516 -73406 -189329 25564 -349653
19857 -108369 23398 19745 20116 54373 -186532 237592 -71442 -154079 -2635 -110055 92388 60112
19845 60112 54292 -62299 32059 -229836 -381398 -159686 -6596 -30050 -57958 -183022 -55800
19833 -324726 -139354 37785 61263 -26244 -56458 -61654 348426 -338008 -149385 373406 113025
19821 -241868 -319619 40890 -852 -2552 -182737 -30707 106964 143448 -38572 36674 207556
19810 207556 -75255 -170520 61707 147033 -59324 99632 -153416 240609 23221 148550 -86470
19798 83056 -121544 -124409 -68806 -162416 -212717 6479 -242373 223177 2775 -58663 -13338 -166918
19786 -166918 18069 -45193 -203339 -57863 169450 -209527 -61926 -38146 -65078 -195055 102162
19774 94665 -136304 66344 -14707 6764 -64834 126921 -267244 -188697 130979 120527 117152
19763 117152 -122451 -6281 85320 40447 14825 83681 52965 -183860 -208617 -286048 -82821
19751 -176359 -57686 -106157 -175785 -52341 -286597 252040 -118302 -42969 -254868 -37512 -100676
19740 -100676 27419 89907 -253064 280365 7285 32165 24218 -323725 63332 -346928 -70847
19728 73115 162486 -42681 -117739 47527 203287 64439 156198 61802 124720 64673 173941
19717 173941 198064 -361855 202494 -248250 -244921 -283866 -216412 70138 -170622 -17391 -176259
19706 -176259 -230418 115540 -60378 -47179 234633 -38358 -62604 -38557 65145 -121770 42488
19694 -209600 50675 -105599 51412 -179271 -81146 -234361 -137529 323010 -112429 239216
19683 118409 -73998 113949 -202887 -161597 -231486 -75706 19629 -483295 -24692 84596 -150062
19671 -77397 -60015 134687 -116340 14800 14154 -39042 -274938 92272 -349601 -313153 333787
19659 -87072 119072 167349 -267823 95685 -127839 -336900 7165 38973 -112870 -235612 176300
19647 22501 -221395 78821 157682 161723 -113305 -75358 -138517 -8221 -32137 20639 -174927
19635 -289062 -35147 -103725 15561 -177336 -94285 -115527 -46038 -1925 -62727 10644 -221710
19623 118882 -114821 18333 151186 -87166 11209 -115848 -141786 -388426 -45482 94815 -59857
19611 214373 -30871 -174012 -153483 -470452 -143356 114824 -191112 -148180 -37086 -144905
19601 -144905 249142 -331600 13620 138680 -165885 50487 -140347 -287542 34612 146757
19591 146757 -154854 -240474 75372 224613 -32348 -6422 168159 18585 -257072 -14822 -427270
19580 -427270 130285 -64054 177745 71522 -103368 11180 -29954 -311637 -14651 -229859
19570 -229859 -212703 161191 -238023 40926 -141915 -189020 -6120 14715 -110320 -140666 34152
19558 206141 -219175 76490 248718 -94963 -159433 -141236 255694 -132455 -224913 -66257 -18495
19546 -348886 -152000 157460 156649 217768 -26743 176975 -43799 356159 -87344 -15982 250572
19534 -26385 127903 -226820 -129294 99445 -224809 -124475 128284 -124246 61016 -434839
19523 -210225 151426 226248 -99923 243145 7019 -136486 299662 -202208 132357 -26919
19512 -19992 -225061 -123309 994 30701 -112655 -28436 -109837 94500 -256804 -237876 -107459
19500 -264314 41173 -287433 31966 1006 -92275 178872 200826 22435 143768 -189575 -149177
19489 -149177 -118395 -60215 -74331 -205460 -175150 100085 -91687 -37179 -108399 167871 83590
19477 -8649 55594 3199 72098 -82022 58730 -52850 145545 -88243 -69688 -135568 -387859 -70939
19464 -273137 85114 30144 -75782 19026 -340806 -50582 145654 -112598 -239890 -107739
19453 373717 5568 -118233 -73505 17950 -178049 -509302 -335660 -181944 -102099 -276959
19443 -276959 35274 167591 27583 197574 -48480 -86458 -120691 127309 -75439 49078 -213000
19431 -294458 78445 235998 -105787 -50267 -111709 331769 59723 -456760 276945 -146379
19420 -43043 -445292 91197 -144642 -155369 258183 62028 -213564 135468 -22442 -111912 -79147
19409 -79147 -276671 -185026 5529 -94233 24245 -224223 -272191 46020 226836 -71948 -160340
19398 -160340 -32488 -52965 -157154 -48501 67478 231753 -162761 -215308 -45659 -98280 -76032
19387 -76032 104665 164469 99907 -150274 59602 58575 80373 324525 -241868 -161762 80414
19375 -191204 -21576 -298913 -199448 17511 51169 -316517 53797 15254 -203338 -225982 -112096
19363 20200 -123597 124651 -282585 -186722 -102622 -218182 -222183 -172928 88820 220367 -235720
19351 -122589 90333 -298099 -82647 -76013 -10859 -48584 14454 -101818 250459 -85543 -139558
19340 -139558 -337565 -238949 106351 -248636 -44157 -46382 46367 -144691 -154405 -271814 -17222
19328 -365762 -3353 -141190 -248969 457 248526 -84345 -45271 -201972 114439 -178947 84476
19316 -40043 73297 197544 -154462 31460 -69928 110459 -48855 -41563 -126302 -26881 -345917
19305 -345917 -128388 -41088 -303296 -315181 -82936 -144012 -50050 -199530 92243 134275 19544
19293 86389 -319153 132889 153740 124687 -395135 -103838 -106912 -108072 24622 -40812 -161105
19282 -161105 159645 -108035 57584 -88722 -331227 -7508 -356049 -172977 -53368 19180 82739
19271 82739 -97022 -63249 -107520 -32562 -275075 -106981 64526 -34006 -26173 110881 -44440
19259 385975 -146692 -326341 -45124 63146 -198306 -346255 39934 120034 -169302 -180089
19249 -180089 -53326 50689 82433 -219814 -80527 17668 244230 355118 -291048 -212190 -109357
19238 -109357 5479 -75401 23128 -174807 9151 149801 -205230 14727 -5281 -151323 -193753
19227 -193753 -203206 48441 127465 120392 -25807 -331732 67342 80855 -13441 -145204 -271267
19216 -271267 -27017 -83060 9851 5344 -125310 -256221 -27765 55085 -175518 59675 -136148
19204 35708 -87078 260570 -327193 -109402 -139626 5746 -90968 34856 -70297 94870 -152298
19192 -57657 40191 -517624 -70798 242013 -92106 -200333 -278544 122983 -33087 -154798 -160026
19181 -160026 -319078 -62470 -297372 36618 -170271 -165168 -96033 9755 -206743 -41515 -226636
19170 -226636 -475480 109600 230710 -50710 -20208 59440 10339 4041 -262881 58152 247960
19159 247960 125147 -109361 -116251 165925 -265167 -30679 27820 -61594 30109 65687 -83991
19147 200127 -192634 -303253 -41962 199294 -171110 52049 -127150 -175246 -273451 45655
19136 -294057 -145057 -53874 -498666 -220802 -109332 -125197 -80764 -21770 -36714 -130348 -55047
19124 79452 -142660 282066 130676 43678 226207 -38188 79213 -177166 -48895 28410 -136625
19112 310579 -81805 -110099 -150523 -178460 -69659 -140936 11246 113762 -50435 -13047 -256643
19101 -256643 50515 -164526 -159808 95948 -83199 -75910 -109796 -209384 -60766 -128770 -68310 106983
19088 106222 152361 -565485 -283659 766 -122439 135844 -113158 60401 -305150 -56852 27673
19076 -286833 -172843 110948 -86678 278403 14595 -96226 -76831 25669 76385 39005 -122479
19064 -276218 133530 -163270 -230473 -329759 -14572 189951 -153778 111258 -454715 -149670
19053 -234223 -2632 -264297 -10907 -63768 -171361 -132760 179783 -50363 58125 -180314 60321
19041 -172886 222187 -187682 -61901 -85786 181335 -44517 -114918 5889 -255307 276355 240212
19030 240212 142993 -20359 57004 127667 42556 11676 45353 103402 -105449 73317 -22179
19018 -4105 -358670 146232 -262226 -219610 34636 36674 -56583 -136140 -8325 -134678 113692
19006 -127105 103956 -213910 -265810 -8252 -151799 -238456 125453 -136011 58561 -69057 126373
18994 173548 8778 125034 117758 152980 -230067 41925 263945 -15533 -97039 -256115 29547
18982 138945 -408578 -230830 48012 -390838 27125 -250500 48713 6253 131910 -11824 -210905
18971 -210905 -137326 -144621 -37433 57793 -100012 -138081 -137177 -219815 -119675 -189900 -69167 -20994
18958 -1788 -64574 81590 208580 -42969 -379946 -107161 -73130 -345821 62124 -392260 -126824
18946 -91078 -40288 -171777 87612 80104 -23244 -234490 52850 205503 -63930 -44484 233473
18934 -9113 123595 -286921 32624 -53676 68636 -19430 -237572 110435 -77719 -80581 37384
18922 -35300 -148211 -79700 -304866 227852 -254514 156102 67253 -37116 54971 -163174
18911 -24649 -170965 84481 -190507 81481 46393 37981 -314137 38516 -162847 165839 -2673
18899 -109500 -329040 -16168 -257985 40281 74086 111658 -177102 -263653 -151314 296703
18888 -67954 -4211 -206611 -189962 -146712 -119329 -155144 -4730 -48890 -161840 288544 47802
18876 -32749 -125019 4888 -65410 -190909 60245 -190842 -42708 -181306 -238860 117802 -87604
18864 58139 -33298 -171758 -179445 195563 -117400 -146834 222953 148160 54935 -52789 -36561
18853 -36561 -193390 214871 -32219 283202 384914 16639 -31316 -84933 -287201 -124707
18842 -56552 -122690 44903 -73641 114696 -112175 87999 48501 -164599 125258 141653 123536
18831 123536 -132706 -144378 -4412 -9683 -182150 366146 -378869 -25748 -101904 -51210 -279958
18820 -279958 168969 20227 -105924 116447 23624 455024 47838 12766 72581 11741 11083
18809 11083 115613 -253299 363960 97904 81196 -468280 -36466 13312 -33867 43198 187081
18798 187081 178702 232432 30351 14634 -124517 -71866 16065 132414 -47718 -88075 -269044
18787 -269044 -25399 -56747 -400342 -42173 -19033 -129571 161759 -84446 -47922 -56430 48230
18775 124570 -346946 12195 69945 -70358 -59172 -504601 198198 228229 139988 -114076 234875
18763 -614672 -82076 304815 -160578 8667 199012 -165803 -65732 71362 -229823 229034
18752 -51772 -195506 -238601 -218043 -133162 -220006 -133463 -358871 -245306 6410 164856 -115934
18740 91252 26007 -57150 45400 521479 -282226 177234 154634 296348 -106003 -117871 -95519
18729 -95519 -217614 -256985 -162857 -184859 72757 38018 -44565 -6774 -255359 97340 170054
18718 170054 -147489 -136035 148188 48526 -65102 10446 -10833 -196415 -49740 29758 -62423
18706 -256260 -175133 -85406 99863 -100381 62576 -169577 72701 -399670 -32644 -2284 -114053
18695 -114053 -197842 -57131 -47455 -446819 -203664 -34063 -139898 -41062 -87338 -53211 167021
18683 170263 104934 27368 239266 280196 -179960 24989 -176895 -21067 32886 -296383 -436570
18672 -436570 -52950 -355527 -145514 -99280 5688 37509 -157791 -114467 51809 -208402 129537
18660 191816 -138685 -114493 64166 -94079 158565 -367101 -277129 155525 -79948 -217748
18650 -217748 104069 -55752 265379 -139392 21968 61284 350816 195303 -191871 -84737
18639 38876 39202 255901 99060 -114913 265256 -92590 -108880 215559 -88494 -157839 -294260
18628 -294260 -371115 101952 -128425 169777 -15374 -110641 -86868 80923 142173 -77189 207669
18616 -148302 -46390 -202445 137023 8374 55706 -184258 -97619 -180050 68011 -35122 -118634
18605 -118634 186256 164947 81085 44269 -93455 133552 -62052 -169134 189154 -65323 -374719
18594 -374719 114410 -24151 -53327 -309403 41202 94998 -162651 -123375 -222486 136585 -15449
18582 -82881 -231649 -450604 -247289 199853 248548 -119589 -27098 322084 -158648 -76006
18571 173590 -93390 -276114 127454 -172153 124887 88382 -80644 -203091 -182058 -286378
18561 -286378 216431 -437481 -37849 -222270 55848 69055 224232 -124042 -72522 101789
18550 133451 328506 97423 46006 -240512 -327689 229444 -82380 205292 -253368 -15635
18539 164085 -32324 71735 15594 -76033 -230170 133434 -228343 -20109 -174947 162947
18528 231239 16586 -14021 -33405 -160287 -19686 -297557 -15092 54302 13692 35266 -97703
18516 -103667 231993 -8185 -26820 151194 35939 -87626 18525 28395 -126157 -95135 -18115
18504 103760 -19755 92866 -361523 -293454 236609 -141328 118108 167683 -46454 138427
18493 -141255 36978 -127781 171635 213414 7042 -38555 -389144 -43690 -41316 82219 102213
18482 102213 8105 -378688 -145328 -4488 -208944 -196328 -95473 -10699 151776 -305286 -281637
18471 -281637 -53626 35932 -238386 21601 -148479 -174629 -52567 -84627 106044 55182 -268519
18459 234915 179072 -273235 -119560 -134540 -246627 185818 22496 171033 -45911 -126343
18449 -126343 -97651 -542306 -7680 42861 7271 82776 -132280 41604 53191 173969 203840
18438 203840 35954 31710 -500886 -97841 -36316 -327287 -118341 42091 -113224 42939 -60544
18426 -74939 101352 233526 66715 -67407 -180894 -82056 -101947 -171050 -171862 -30530 50713
18414 212310 -455048 -397731 160560 -225949 14507 120776 -132207 113687 87158 94724
18404 94724 46213 -129453 -99261 -90064 -68104 24182 -131220 95856 -159055 -108936 -50441
18392 130792 -142997 33098 113974 -173112 256093 127084 -253741 -32716 -8748 -259248
18382 -259248 -249193 -28114 -26121 -141487 177078 118931 -117164 -91725 -162317 154122 116151
18371 116151 -8771 -140311 -1196 42640 199626 129326 98150 -26220 -25535 -8011 -393132 37846
18358 -124543 10187 9736 -214304 -112826 145557 -47737 -87088 -503617 -66952 -438501 128398
18346 91370 -147028 195140 -11133 -45065 58085 8674 324253 -148235 -212970 -52585 -297161
18335 -297161 -35591 170508 -20525 -237050 70903 -167319 -117445 48886 123815 92555 140158
18324 140158 -143590 -30216 -157922 107058 -417003 -32581 273054 70703 -170207 -164105
18314 -164105 -25708 -177351 -382944 66566 -29763 197329 -123314 -96891 12221 -109714
18303 -20485 -342348 346733 -232488 -131172 49417 14091 51505 -112086 1166 277274 199494
18292 199494 90009 200027 127135 38907 368193 -44137 -240144 -166710 51508 186734 -66813
18280 -125294 -42648 -284486 -12069 -322328 -33497 34366 -178421 -78631 208027 79598 154217
18269 154217 66249 -387416 -158151 89257 43113 271872 -59133 -52488 215706 -321074 88301
18257 970 134896 -228178 -73283 96294 -142963 -66143 229927 -68917 -2239 -93814 -103561 52962
18244 -25129 9688 -36354 -118405 -121036 -108899 200463 -13731 -240307 -213553 -272445 107175
18232 -289076 -55198 102044 -162815 85340 -12132 -278628 82276 -16940 211656 111359
18222 111359 -267049 -106259 -1691 103844 -99705 -119550 -151727 35048 -121240 295999 79572
18210 -23976 -67250 -342127 132247 -311453 340311 -147505 126207 -201410 -306293 -164242
18200 -164242 38330 144592 -57283 38902 11302 -211985 277696 -104402 -84140 33835 42291
18189 42291 45726 50102 -117369 -153407 -247749 -129558 -351456 -231286 -28863 -238132 47614
18177 282169 -104131 42805 134933 58629 102162 72721 26440 24853 -365314 -109830 -40977
18165 -160825 -299371 -127914 -227523 -31928 -10396 125336 54440 -58735 -336464 -359563 -716
18153 -92157 -403120 -180090 167324 -470620 -309689 57857 72857 -89848 431636 -59204
18142 -26015 -257479 148178 -278611 113348 -88551 75894 -216227 -241787 -94966 50596 -86525
18130 -21336 26092 16789 102079 -127307 -117202 -156092 -16856 174191 323048 245744 -324230
18118 69951 70372 -131008 -11549 244386 310456 124001 -120324 31182 -88029 157940 -23798
18106 -364588 -4019 -30577 -92269 -251978 39474 430349 -347249 154081 113996 291692 120766
18094 351163 -167817 -173327 -68539 -247117 -23691 -64374 -90664 -33528 -22712 293506 20118
18082 -235226 -316356 -227893 101494 -89333 -185989 -236402 -21565 16875 107295 13130 121584
18071 121584 64475 -299253 169286 -446245 90472 -4205 92978 -184680 66612 271162 -80364
18059 -278984 213898 217360 18917 -302644 -16802 -3333 -10556 185821 45720 90817 -198137
18047 -102186 335511 -209010 152867 -342350 -124876 63217 210760 48814 -368487 273151
18036 -129983 -588411 -191802 -193208 -80685 -324674 180307 -220115 100532 68158 -138862
18025 -25038 -215844 189616 -354147 230443 -105666 -10767 -99356 86759 312326 20776
18014 -166114 106211 322135 -407437 19524 -89379 95334 -269363 -193455 231252 111987
18003 -47436 50102 268965 194367 -157090 -108903 29263 -52023 -98595 -276946 -212491 -279830
17992 -279830 19307 -107386 30298 -59255 146037 389745 78172 -48421 -9747 -21657 114375
17980 -95796 2425 -343069 -475986 -214092 -104713 -106812 91447 -94489 -165708 -230406 -330867
17969 -330867 108038 -78765 -153730 285872 -203622 17853 -38733 70097 -209786 -11462 217937
17957 400451 -44537 229115 239226 -4587 -153629 -139607 69006 -74521 -162842 -118649 35596
17945 36823 -249745 -9119 11656 -167357 -145122 27389 -44953 131773 97406 -245091 -140453
17934 -140453 156270 56918 -221335 -218624 -120492 -66580 -80474 36951 -168385 13893 118049
17923 118049 -127288 -333748 189393 -78750 -204975 -33543 -327111 127994 -261738 -3889
17912 17842 -48698 231033 -9903 -143601 -123446 -100670 -74267 191127 111399 -19699 -294818
17901 -294818 -143844 197970 379674 -110147 -10583 190134 -147036 -156871 127972 -91509
17890 -110159 -141997 -248479 -212338 -114344 -95454 201571 -46836 -356796 234459 56032 -40051
17878 52564 -97484 -5408 -240222 208758 -213775 174106 -48556 187214 468750 10039 199953
17867 199953 -129236 202001 399937 -120813 158785 -80909 161027 25110 -216406 -260699
17857 -260699 11113 38615 83171 139198 153228 -113342 46103 -137946 -114090 82380 -34741
17845 -70189 34655 130773 -28786 134982 96788 -14725 440 -162897 94526 -80399 155475
17833 2101 193962 -98205 -291463 -222358 45960 -31346 101639 -44503 -126296 -49992 -220842
17822 -220842 35981 118210 -98736 208346 -37186 145092 -88846 46729 41140 -5199 -232816
17811 -232816 -255444 -305989 -102906 -125366 229526 205102 -123613 215312 -49352 44890 -21760
17799 28903 146658 263219 26556 -87317 34213 -160342 235636 193851 -191066 152214
17788 -235690 40006 8188 -28509 121630 -63643 57508 185753 264294 -136932 -221869 -75197
17776 -24793 80386 326883 -97308 -95896 360152 -137875 48471 -185853 -138910 -31477 312071
17764 227061 98703 82056 26449 -101346 65489 98086 51484 -6883 -392690 128201 136268
17753 136268 304159 -181007 75938 -154877 -54467 83747 -165455 5195 34181 20366 190508
17742 190508 75498 -89873 -276751 -80996 -167186 114976 -150414 65856 376667 -163420
17731 -211911 6081 61115 242351 -35512 -86880 108751 -239102 -33684 -27122 135105 304342
17720 304342 675 169173 -276189 128128 -44834 60702 -195123 -240437 -90608 -111848 94430
17708 151133 330080 -211175 -94402 152906 -400051 100734 -7488 39918 20345 24471 -218549
17696 -189729 72253 -7329 5243 125774 113912 14464 -106196 7743 131197 205252 -213611
17684 109142 79926 158131 133136 -126719 84629 214403 55274 133407 -60881 -180812 -517
17672 -162028 -36921 -28637 -292490 70180 -349593 15361 -86286 195439 -10350 -332710 131355
17660 225779 164877 234284 -139550 -124282 -184992 -348896 -225920 -257121 -25047 -43615 -240492
17649 -240492 -181842 -164307 138675 37929 -138472 -42480 104471 -470902 63409 -48915 128634
17637 -88059 -220782 -249814 251379 -11668 262639 112279 -138913 109942 -219874 -12950
17626 159341 239702 -144500 242142 103124 381286 -86945 -8962 -122792 343905 -101788
17615 -144922 161723 108421 97913 17882 281615 -56299 318499 -286609 42238 -33449 73500
17603 201622 -144243 115495 174673 -26836 230536 126791 -101192 144506 126305 72145
17593 72145 -12671 -23128 3646 249318 -145349 -454015 -287551 -85362 129514 49248 115058
17582 115058 -143932 -91178 103191 40079 147868 -105624 146519 243768 -273984 103506
17571 184424 -188978 -32588 -25152 102411 142616 -180650 -74953 100931 -77275 245420 57705
17559 -126060 -151068 -117156 145326 -107683 -51414 221941 -134997 -51311 160675 -59816
17548 -2144 168962 -181561 74906 -27695 300827 223730 39311 79218 -48023 -171295 -119442
17537 -119442 -119542 92416 -288120 -129946 189402 -246101 -64733 -165593 -80210 -46221 16297
17525 198925 162532 -189304 60322 -30142 117426 -150289 261424 404986 43061 324685
17515 324685 240835 11854 4524 -344418 177040 -115048 -40390 183639 143075 140662 36394
17503 205404 -134896 -47548 -228938 -32061 -85189 -69429 -38911 121273 384306 297667 -16160
17491 65684 113077 63695 330226 29867 15846 227037 147712 -23474 -24615 49480 -119794
17479 198096 158429 210702 -30375 191001 290625 30363 -73740 467776 190857 -18354 86864
17467 250559 219877 -52259 71020 100596 28197 -117515 233554 -45827 93431 -222481 67970
17455 291963 192012 40049 201435 204474 27730 409173 -11346 119165 438145 -65765 367592
17443 304812 -7034 -168373 269609 210789 223415 163364 178701 160621 380573 79006 454774
17432 454774 330336 481087 293492 207342 29478 319075 151004 353880 282359 206693
17422 206693 119287 -72155 -107521 50591 180224 310099 398789 -139804 158092 -8811 187989
17410 103561 229636 183396 159983 145214 119766 83842 25503 208593 185921 -93776 192122
17398 257232 68535 663215 44171 -68822 148949 -67993 230550 64345 216795 103994
17387 -28034 329146 -163631 147681 -41526 -116727 50825 357460 73513 266907 -123196
17376 51036 -25783 176471 -269713 163734 381359 68109 132974 -39595 100658 263760
17366 263760 341784 -116362 361291 5657 -113215 179621 177802 -311710 428725 -65420 -289977
17355 -289977 183931 -147130 555767 -152900 190774 -67 85283 278915 363678 540598 146867
17343 -27087 351822 25898 -33996 226383 205646 168338 -33294 -58698 -10666 125261 241927
17332 241927 316774 78425 1207 73486 79475 267493 -88678 63388 9763 113082 -77956 81788
17319 303378 50587 52350 179121 28795 218882 -14886 -68755 154089 -142937 213561 -118840
17307 87515 -64995 -223551 347430 -4759 -24531 -103304 244907 67389 128365 -33223 194937
17295 167542 267665 97825 187495 -122830 217543 33456 -266915 142930 6789 162294
17285 162294 525476 216834 -29919 -73993 282861 -151222 357188 368629 116979 50435
17274 294255 -93402 55780 140500 53050 61474 264509 178371 -19093 -85504 -15135 57353
17262 -105804 -121868 318691 155465 -83638 12932 174928 250381 225627 -144445 -52701 40290
17250 257668 233342 82361 137704 -71313 30984 -342998 138274 142290 637016 126526 148285
17239 148285 518697 216352 -124820 73493 3323 66705 -29057 340948 184863 244220 -5700
17227 68816 289952 144080 -76293 93287 446938 102374 159712 142350 50835 28791 709105
17216 709105 156778 226832 -91883 170125 54060 232269 35379 476012 302723 144109
17205 195149 309731 175768 7986 264515 360678 75150 252002 -74765 333349 384843 15067
17193 253293 334666 117828 121449 -68558 237342 108138 162390 -20317 561265 216864 391568
17182 391568 264533 452637 193089 693616 279788 322441 300280 400524 251131 80055
17171 131020 46455 377351 101353 261095 392045 195911 263237 -3484 234240 227809 45736
17159 360510 303334 415416 -66812 216615 115575 452348 593514 378276 419302 -6753
17148 240961 80012 271163 351046 -20352 34203 179579 12662 523579 291504 494683
17138 494683 171944 373884 143414 266573 464238 538256 6524 560377 164554 228420
17128 228420 389461 271654 235071 348495 23385 138723 166018 334472 142029 253301
17118 253301 278173 255249 233443 585737 90286 662158 72366 355964 59954 495791 -74531
17106 174138 378468 6918 439798 441521 186176 257823 181470 410314 436516 294234 358011
17095 358011 308378 268414 250361 106155 549257 306404 319090 401999 198973 399485
17085 399485 577696 240196 471707 344107 251263 12919 73028 451353 559246 410057
17075 410057 286386 539573 341716 426679 478480 489748 323190 274413 383632 633911
17065 633911 216103 557147 423859 85940 502902 255537 309183 386843 429443 445537
17055 445537 299693 526366 403798 214457 506050 297354 109534 387415 141204 698823
17045 698823 462908 665932 407269 546207 318103 231914 438371 401593 525704 604910
17035 604910 566533 417813 653191 427333 706556 288651 880596 341098 690991 547024
17025 547024 520786 621288 474651 323761 578085 588740 470018 465058 598468 752490
17015 752490 430888 619474 426548 541029 464812 758266 476192 688214 393824 769110
17005 769110 539733 814163 611939 862226 293625 761542 776574 414583 374258 750880
16995 750880 497805 482588 570905 729008 862564 714241 583069 626616 481046 799432
16985 799432 750140 331402 748921 647465 518612 710274 880573 650578 737518 853797
16975 853797 495551 622480 419007 739657 566315 654718 633788 940870 885986 720838
16965 720838 746018 709192 734661 852172 1116192 924092 735780 976127 1142248 827649
16955 827649 642115 894896 1021948 1042924 804167 745163 909498 1242487 872781 1164408
16945 1164408 968000 898100 868166 773830 952132 625499 831874 950010 1367321 1499622
16935 1499622 1010026 789558 1261756 967454 1114094 921327 1000326 1291755 1410051 1013308
16925 1013308 971710 951564 1107196 1074356 1104791 1466264 1018525 1500156 1172841 948061
16915 948061 1232588 1081460 1238776 1267369 1493891 1379273 1658597 1648954 1082503 1591116
16905 1591116 1747248 1444591 1131950 1663890 1725005 1607736 1758976 1950431 1771009 1525240
16895 1525240 1484587 1547811 1483693 1757716 1315182 1582729 1401636 1638889 1747429 1729759
16885 1729759 1880360 1558998 1933174 1977363 1891439 1672499 1851942 1903397 1952364 2252125
16875 2252125 1980565 2127978 1874626 1925542 2149871 1969034 1878499 2010012 2299136 2114205
16865 2114205 2233821 2394112 2104512 2276323 2407071 2458939 2460319 2457106 2478197 2535460 2888154
16854 2888154 2476141 2602237 2750249 2898507 2661964 2877747 2883633 2987229 2965747 2808187
16844 2808187 3090519 3486335 3382039 3122145 3469518 3529015 3304666 3632811 3612245 3953444
16834 3953444 3548137 3734764 3583073 4115626 3895133 4180955 4264190 4106928 4180278 4308030
16824 4308030 4035751 4565285 4821395 4673735 5046949 4745182 4925380 4898132 4831462 5315110
16814 5315110 5157274 5443882 5377661 5590261 5788366 6097410 5946775 6019469 6308264 6430341
16804 6430341 6903665 6767465 6782422 7203692 7097232 7307897 7381490 7782652 7962918 8271090
16794 8271090 8138762 8499481 8795100 8826062 9338611 9664690 9709451 10268142 10624241 10849951
16784 10849951 10944640 11424015 11475800 11913498 12154948 12505247 12924878 13709137 13624204 14287425
16774 14287425 15084381 15086861 15807967 16290875 16911553 17583833 18014824 18932655 19501259 20490703
16764 20490703 21112422 22027068 22940081 23546890 24612088 25917808 26664941 28124187 29171379
16755 29171379 30991067 31832559 33192678 34704758 36660439 38684951 40612666 42767878
16747 42767878 45090397 47553255 49731735 52370236 54982630 58436080 62040697 64803283
16739 64803283 69325458 73112701 77328341 81710515 86651880 91666340 97550970 102893887
16731 102893887 108842790 114701601 121005013 126808743 133409175 139499626 145326847 151122666
16723 151122666 156397374 160522481 164209665 167123527 168789755 169365186 168705169 167343937
16715 167343937 164637695 161377416 156783993 151644815 146172357 140031656 133335565 126980584
16707 126980584 120912484 114229744 107833037 101888140 96104061 90844256 85490429 80458749
16699 80458749 75684445 71578408 67480461 63955533 60030984 56898179 53741663 50840364
16691 50840364 48068735 45743912 43332921 41120054 39580151 36952363 35516478 33832813
16683 33832813 32155090 30950828 29415509 28143087 26795522 25882291 24836307 23821625
16675 23821625 22830814 21821570 20772325 19698165 19431018 18820171 17790697 17398099 16795086
16666 16795086 16402113 15632641 15131634 14518566 14123933 13606888 13354051 12837401 12544761
16657 12544761 12294980 11737654 11238852 10950331 10424647 10043565 9858735 9537420 9466741
16648 9466741 9093768 9044026 8632349 8488355 8158105 8052922 7960819 7555929 7586467 7417415
16638 7417415 7170490 6597109 6554330 6546961 6411431 6119670 6318698 5746510 5766932 5712206
16628 5712206 5530566 5446500 5394835 5350326 5117492 4904845 4885669 4676504 4540017 4455155
16618 4455155 4343566 4682190 4568953 4260505 3899311 4060394 4254503 3916275 3662365
16609 3662365 3608739 3503353 3717122 3822295 3469041 3544296 3379981 3643984 2891064 3000198
16599 3000198 2988480 3201519 3043004 3135519 3072890 2685874 2730847 2790111 2783870 2815173 2826469
16588 2826469 2731938 2391748 2618028 2480083 2596068 2737357 2259511 2343620 2280324 2228905
16578 2228905 2028451 2211763 2583217 2199036 2117900 2189060 1830339 2091522 2087800 1939961
16568 1939961 1880661 1930452 1777012 2019714 1755571 1751642 2008538 2015172 1556678 1662159
16558 1662159 1753765 1509220 1713651 1502975 1316690 1904249 1852918 1505357 1513997 1467413
16548 1467413 1404856 1570177 1761394 1320768 1575733 1558433 1702794 1437481 1605077 1435597
16538 1435597 1123256 1423448 1174221 1286369 1433229 1229570 1318572 1370390 1103697 1208110
16528 1208110 1176827 1296436 956799 918119 1228487 1314912 1276275 1003065 1043269 1085787
16518 1085787 1310056 963171 1151555 1073202 1141555 1143364 920549 1090022 814949 814640 920993
16507 920993 1282780 1052981 646176 890429 737746 1002154 874483 969498 1072302 802669
16497 802669 740050 665729 853046 772209 1012429 689948 440311 494869 1049303 584840
16487 584840 1081342 466277 698998 409418 729100 703795 694927 769243 903850 679293
16477 679293 560257 624676 665426 758260 853261 850243 741099 641713 782233 724451 792086
16466 792086 524144 503814 715070 543554 783372 507245 706332 599765 371625 535855
16456 535855 953592 460868 912769 578034 565248 223885 546144 543165 749298 522974
16446 522974 397513 401659 602899 895196 403582 555961 650631 609608 666559 343647
16436 343647 636845 219847 546940 352125 331495 309661 369820 599869 532353 638337
16426 638337 362158 456603 937424 527985 617183 453063 495681 553470 547534 501108 276753
16415 276753 571121 324759 393303 242378 496764 345046 353616 218808 139637 733809
16405 733809 401770 310300 470819 193122 266015 395152 213881 226733 316280 295045
16395 295045 364031 351360 308280 355658 350319 226849 447385 280942 411102 479658 555423
16384 555423 403025 514017 436129 477356 486293 283609 125206 228639 -40191 610655
16373 469863 186456 143503 597950 47169 387625 388425 297190 387090 208756 57724 111703
16362 111703 182376 239089 162101 353343 -51812 250890 271694 211495 346200 270783 130067
16350 536401 258054 340735 297936 75254 574353 300983 386484 278348 63976 434724
16340 434724 256978 402188 168805 145279 15490 332586 339690 100301 254748 268242
16330 268242 83141 243121 230024 221274 485179 104799 -10528 471964 11778 154518 73775
16318 105300 405132 271136 392028 201861 480779 559329 336609 163554 180043 401847
16308 401847 -160826 167602 329546 25889 79308 -108103 156166 334213 -125321 -170379
16298 -170379 122201 -68721 87808 408058 431101 136098 26990 261137 108586 57758
16288 57758 273429 183800 143582 267269 -64131 -300836 -3135 353106 188301 416896 351674
16277 351674 -64710 405649 -132745 383743 32455 329575 133299 145396 82591 324004
16267 324004 381413 96218 -31885 215881 99076 370669 246475 216147 312194 160531 25793
16255 247934 372102 322193 319521 29087 49535 -92131 19513 67374 167207 293730 -112997
16243 159631 246541 71956 447891 237442 65990 263575 184227 242788 -107412 146832
16232 -351372 -20571 113229 72270 -13453 -8100 84091 345629 35124 300272 136341 461953
16221 461953 229905 312622 34049 -247850 -101502 172388 167077 57265 316649 -61938 -113116
16210 -113116 144893 113651 129274 132847 26995 -104643 -123290 116366 269200 239635 -146315
16198 102643 1429 -178671 136149 -257962 300546 243895 -114679 -45565 -44511 -98114 91473
16186 97471 210197 336846 109090 204304 -18213 382112 -98064 128122 307384 -319621
16175 -251044 42626 35654 49886 -126239 -190833 -19868 94384 -346177 -119621 -75920 -51482
16164 -51482 -106136 231681 237992 120352 -13260 -72179 -163991 50026 39721 -64131 136685
16152 149374 58592 -185270 -87837 169488 310087 129558 -62901 -245722 194987 -354990
16141 -43155 -207036 -26323 -19294 265277 131573 71256 280295 169457 -28911 -12826 86020
16129 -183561 327762 92793 -188417 -42075 190573 272471 372274 15378 -381844 -156282
16118 -170110 -35742 50097 143480 53825 -135181 -167626 16759 14980 62985 -184121 19094
16106 -3793 -253369 77330 603011 -95992 343427 -169903 -205373 413494 -67108 244192 74584
16094 -263726 27056 -24875 158863 -153878 -111737 31052 -22313 107013 -219518 -81984 -284731
16083 -284731 48848 104960 -146828 202000 151564 77504 -297334 -272643 -32443 -45831 378811
16071 -106802 81691 474791 -176509 -258553 -35364 -5829 5698 66810 108128 -87947 -219692
16060 -219692 165246 172334 -120198 -110136 -103219 -131148 10254 -9373 -203063 -140864 -15571
16048 62331 296391 -45508 -474025 -37189 164593 -88050 -207900 -75515 4406 -57734 -256926
16037 -256926 82193 26248 95017 26331 -100883 58468 36081 145623 45482 100468 75223
16026 75223 -138473 -39307 80272 38445 163151 116181 93705 13892 98322 -153435 -13670
16014 -39199 -42864 -102034 -34344 -307089 -2021 -49800 -242160 -10479 -151515 56287 144829
16003 144829 26688 -38388 -51008 59361 -34811 -3605 72251 -12164 -173652 -10326 60171
15991 102120 -169383 159828 -232036 -336360 43337 124914 107791 -285969 132206 327315
15981 327315 223926 84470 -10272 11298 -19789 175056 141764 -18255 4514 31347 -43236
15969 -255095 -117777 -56837 235777 239166 -116131 83975 -29776 -184628 188690 109138 125700
15958 125700 79418 103407 46734 -141566 -280717 -111680 -67205 -218761 -215415 200100 -68434
15946 102497 -3854 130756 -164087 -354193 391337 72929 -154901 -27694 153167 -95125
15935 -47241 -330206 -175994 -162353 -102495 -98552 85151 -137126 -119645 46879 105051 200311
15924 200311 10539 -15554 -60899 -114918 163 54630 -185273 -219825 -231956 -53343 83712 -126963
15911 20810 -407698 255578 -167777 -124625 5686 118176 470 -182586 105440 86623 -294413
15899 -67509 -162011 22344 67869 -184551 -16022 65766 -233308 8127 319872 -136018 -36149
15887 -39135 -189208 -44968 191609 149917 -176555 18277 -84841 184631 180298 96374 44729
15875 18933 -53388 96131 -277608 -173467 60255 9781 -88959 117981 38450 -43584 1717
15863 -5397 -102895 -223477 -355868 -373845 -55680 -141013 37100 114390 133488 297046 -154467
15851 -188871 -70635 -85492 10493 179860 38980 -136919 90111 404301 -136317 157760
15840 218827 187379 182015 -125877 -156542 104283 118404 -72534 -316196 85911 -229237 63270
15828 -361617 317440 185100 -214809 -175842 -94289 -80554 124263 -76314 213102 -117089
15817 31292 -109475 -76860 49251 20508 -288370 -349740 301 18277 -70814 -209970 234184
15805 277383 192145 75160 -245269 -155474 -195559 -93308 -159488 -261886 -18349 -424669 -365984
15794 -365984 -143320 22156 -21692 121040 -197425 44775 -18021 -65172 85416 -67637 -315985
15783 -315985 54418 -75577 -60567 46850 319699 81324 -106464 -75054 21189 -106898 -437032
15772 -437032 112764 33786 116661 -5107 -38800 -166297 -32468 -199925 82045 175921 -298450
15760 173305 406107 213141 -4557 152848 1213 76600 137156 -139152 58201 137246 49961
15748 295863 -380982 61119 102859 148818 -23279 201470 -238120 99015 34250 -99409 -2512
15736 -375813 150428 -53011 147700 -66920 324412 171818 93264 -142408 46877 -41515
15725 -40869 -290245 -414842 -130838 509 68672 71327 161435 -59381 -11399 20794 -306962
15713 -199271 -277641 -95843 -436026 -71973 24653 -154717 88721 159165 60369 -203950 -219584
15702 -219584 46491 144117 175243 106049 -147691 -146015 -39195 182289 -121568 -105491 -1505
15690 -86216 -121202 -131685 2047 220941 90660 33640 128466 -179236 -284786 100510 -332905
15678 -218190 -127046 -91979 125872 8176 194397 78178 65589 -36322 -100808 98913 233219
15667 233219 217602 44580 -167892 -75573 935 -121879 -385367 -81397 -255587 -206044 179486
15655 -55161 -47713 86360 -59066 -116018 55025 -53620 -83260 92613 29163 -170363 19556 -11049
15642 28362 146811 170369 -220065 -121216 118064 -10610 47449 14870 118098 -142284 -6155
15630 -71159 -274047 18041 78900 -44636 -115661 -92621 96251 100390 -31773 -28044 -54287 -241070
15618 -241070 -339917 228412 210359 -85295 -234565 98238 22552 69465 46499 101389 -78185
15606 -165813 -77566 161785 119377 -168464 330303 184987 -12488 184676 59343 -117283
15595 -31986 105503 -42089 82399 161929 -152414 -52568 -282596 68031 -10281 83925 67945
15584 67945 307741 886 -104583 -89647 -359607 -238269 -18984 -267201 -305468 -3366 260597
15572 -78026 -44234 353620 -130759 -56158 -149271 251257 -228185 -179260 63038 233735 -30077
15560 -131001 70468 95905 102058 112414 -100760 -33270 3419 -342613 178989 55355 -85886
15548 -188428 -171297 25365 158157 -44757 19484 -45496 130277 -38212 -62790 60926 25147
15536 -118369 99881 62187 27030 -35170 54979 122711 -271441 227516 41532 93290 -163609
15524 172950 165532 -373401 35947 -43331 -302172 -41193 -102420 238854 39292 -271864 127456
15512 -227434 129742 -38984 98672 95106 51355 -152677 6945 -140524 278597 -112561 98100
15500 -25288 -66212 56681 102684 313360 -40549 36576 -199524 289524 -142733 -63570 -325562
15489 -325562 -65842 37006 230021 -220266 164885 92872 299620 165772 -80003 -296105
15479 -296105 -178198 -259024 -44972 167401 -204203 330755 -352717 -31424 -183536 -83743
15468 82152 45475 92574 -283949 -160694 235301 16858 66658 117305 220056 25469 -49558
15456 17192 93848 40274 66691 -214499 177257 21634 -105942 -221676 -191619 -162929 -145507
15445 -145507 60667 -112152 -98653 -152856 -132049 -165159 -138452 -79242 -49036 26608 192639
15434 192639 -127273 -101630 -197511 -26811 -162418 -33053 -16950 -170541 -32718 -20912 17
15422 -95685 15026 -348544 232089 -42832 -208217 215259 170320 -105270 -109075 153893 74068
15410 223619 45248 200310 232042 157827 -231543 182474 -254194 -325839 67659 -10764 163288
15398 175358 44217 -181018 -10827 -192288 -87283 204736 -208195 41464 29504 79725 -69409
15386 47585 -243219 -284984 -16689 -73569 124091 -53385 136819 265971 -64117 -116181 214674
15374 -229808 -271364 -71374 -48025 20418 75568 -110666 -293105 -144709 36358 130553 138480
15363 138480 -178441 77208 96845 100418 89543 -72806 -87570 -211254 156450 26935 -48230
15351 121603 14425 -169288 -312366 -201695 -173318 95481 -36681 82968 -173184 107727
15340 -107415 -220794 -266801 299529 -46027 -52411 78422 -18259 311367 154961 -3815 64689
15328 233755 100815 198759 -62381 -309039 -205721 -222305 196879 69082 -288640 -155663
15318 -155663 -168765 -219484 -253980 48885 -46319 35852 311997 67566 80466 -47695 -314835
15307 -314835 12102 -61254 -110439 -56209 102675 -298930 -312210 93854 -82664 147927 -94554
15295 23418 99431 29895 -8271 -102874 91490 205665 63619 -9710 -36931 167643 208091 -54097
15282 120411 217577 -200014 -51993 346345 -65489 186779 84264 -35110 -7525 160980 -31817
15270 263739 -96719 210360 214061 170300 197326 239867 -85617 -165555 263805 186022 272431
15259 272431 -174704 188894 108441 50702 -93181 45088 26670 5707 16568 391788 385806
15248 385806 1392882 864883 714606 1378963 565743 119383 264720 97900 357933 69699
15237 12697 -120976 354148 135423 -117137 -102046 -24409 234969 200408 -38381 50294 -161606
15225 96560 -44082 89322 60470 132805 225491 -123665 -118464 -18915 69096 37412 203365
15214 203365 -38455 128985 -106195 46942 199220 55125 866 -107110 -133139 -107429 -177511
15203 -177511 22939 435267 -203603 -171222 -193857 143861 285829 48727 -59243 -122648 221465
15191 -185278 6614 171359 133341 -23333 85720 139681 109842 33348 -162019 -16129 149916
15179 97987 370782 -70832 152548 -152325 12007 -188432 50100 35049 -141539 43761 262931
15168 262931 -187810 357189 -319226 33316 71694 -234975 54029 101607 -113073 -114122 128254
15156 42014 248855 -67966 -11446 68742 -24673 324777 72805 -217472 188947 -95089 5161
15144 146986 151895 373152 297608 161615 79321 4491 234250 -83956 209360 -96403 48224
15132 499928 132945 6290 -21436 26284 222394 -167168 -109739 -266071 -213024 89343 46046
15121 46046 -109296 -148993 -22789 174444 353636 96254 225730 325512 -221524 -33202 -175933
15110 -175933 375797 -882 -147511 46262 212043 82086 16652 -57983 -237276 -371 -201195
15099 -201195 -39180 184581 -134670 142165 242129 286406 -73377 -8499 80950 241450 135713
15088 135713 207240 146011 255459 -51640 191799 299531 182291 9512 334481 -48860 -23071
15076 176463 123408 -123200 464684 416458 131361 -27246 318587 -11055 220245 45353
15065 190514 -59688 92866 243725 56212 111614 -35099 -55839 -220236 239578 -94508 -38938
15053 193683 -142206 400592 -46536 -237197 269847 1952 306203 134721 77140 231761
15043 231761 17002 235596 200936 505052 -101647 96461 185677 -6543 183804 -148270 240447
15031 89346 196519 408711 -108864 302490 -263784 134738 114070 185549 178935 355740
15021 355740 -98125 196271 -156678 207260 199949 237422 469159 374988 63413 -23652 65815
15009 54750 135657 100833 168992 54966 287878 247449 350420 -101050 69130 119993 -279782
14997 78366 258948 -99695 75887 -257205 -108846 179570 179063 154680 298619 620052 -31260
14985 -13723 247562 159152 -116092 60549 304116 146312 351876 310357 303523 158160 12600
14973 -233718 57502 -128318 445695 170949 369423 183561 296290 135286 40124 336279
14963 336279 520524 213157 118837 85234 200597 71606 186459 -47433 138726 206362
14953 206362 141123 409969 298789 266002 300698 -3428 331665 215476 323180 108904
14942 27367 426268 173934 469384 136627 253971 425485 156734 286223 230716 -9137
14931 204094 -181264 -40364 85089 101608 308421 133990 339554 90667 347258 349676 71498
14919 389011 82725 467393 150261 308003 333313 68264 238192 125669 175155 574982
14909 574982 524266 212695 304351 296307 465628 213575 161966 327371 121710 86986 218480
14898 218480 542037 -58922 257928 272793 404105 238566 293029 293091 425424 409022 217833
14887 217833 345232 183129 442810 487416 478133 32892 366110 500101 314521 -116283
14876 415217 155051 -899 269151 451565 440133 507034 121176 168366 175196 141097 563681
14865 563681 328047 320684 417782 -18754 254060 697607 124532 231312 130759 276832
14855 276832 167079 316140 195373 561351 683015 357321 200185 419727 287880 84069
14844 182212 323876 315118 -47445 246266 441351 416858 369923 146507 336932 746926
14834 746926 120048 464745 355666 329475 321935 398432 397709 365677 250458 367647 226307
14823 226307 368289 604583 522552 403040 625680 410600 238453 343664 510368 348132
14813 348132 333313 209327 585998 562446 614174 457143 447336 596408 358661 793562
14803 793562 560384 391060 301660 448012 48399 258807 388103 386172 383347 425843 313492
14792 313492 533911 565765 336060 675548 229216 236029 416924 585022 376239 579347
14782 579347 364282 421380 391459 418225 452459 385360 440101 390032 499852 387563 653444
14771 653444 439708 436212 431213 677930 408408 285071 525910 545610 154481 499589
14761 499589 684595 639580 230362 681577 514187 471289 217770 341707 404804 176917
14750 475995 499081 332427 545330 522849 449705 345466 456886 511877 637210 753699
14740 753699 744802 573281 447903 537019 716790 792335 404289 891135 291660 382128
14730 382128 446728 639536 583350 383893 298321 912976 708888 409748 796642 746481
14720 746481 696735 769478 638790 691648 336576 461354 343452 833675 919624 791400
14710 791400 532248 814476 556235 661779 477832 1007316 737278 468350 637372 672348
14700 672348 633382 858555 673189 823217 561220 898408 789315 901834 836282 984501
14690 984501 801977 730376 720228 514337 720560 787851 1133817 870937 884702 549876
14680 549876 888813 981905 837257 570894 740249 1014492 768244 828767 842845 567508
14670 567508 993803 576710 1144707 944944 775695 874016 899184 905891 1011475 756137
14660 756137 1142810 773565 1097277 561875 818610 1058153 857620 713519 697805 944023
14650 944023 931411 1009689 800996 1186130 1120051 950406 851239 840193 969736 1269590
14640 1269590 1054740 1203352 1148852 1127709 1045615 831318 1284109 933870 809117 1105223
14630 1105223 877724 995773 1066136 1100342 1079676 1116108 1114635 902786 1251271 1028132
14620 1028132 1376981 1160144 1340947 1320058 1001354 1302201 700298 1276419 1216350 1132354
14610 1132354 1114701 1150683 1228126 1292874 1272427 1411471 1310223 1323725 1293727 1369407 1313377
14599 1313377 1346698 1167814 1212706 1230270 1362576 1621621 1659241 1283330 1641363 1444472
14589 1444472 1667092 1463518 1332611 1431217 1706898 1469565 1509912 1853366 1208065 1517938
14579 1517938 1372610 1958518 1664577 2105693 1772403 1620419 1633999 1824349 1834563 1697193
14569 1697193 1828722 1806462 1888106 1587897 1957246 1927063 2523377 2283417 2017240 2376393
14559 2376393 2399487 2358721 2419707 2930627 2994504 3395164 3365356 3621519 4476000 4884307
14549 4884307 7023589 10689012 20095058 38418843 39616358 17512667 6521323 2994279
14540 2131074 1678748 1458378 1599301 1613098 2031166 1520944 1343751 1536113 1712701 1816354
14530 1816354 1526283 1857125 1853399 1969196 1845490 1533605 2149359 1715699 2144231 1865578
14520 1865578 2329758 1917216 1806799 1934660 2219027 2420970 1983321 2136104 2042854 2268055
14510 2268055 2216690 2347810 2562705 2536661 2567458 2380925 2333514 2580680 2675048 2717071
14500 2717071 2655980 2843587 2588635 2738737 2576110 2842627 2709110 2933283 2836606 2799367
14490 2799367 3035167 2711724 3138537 3202181 3013618 2884762 3006867 3138220 3079407 2972177
14480 2972177 3167226 3260732 3568080 3190566 3329855 3292023 3276111 3459303 3528719 3597877
14470 3597877 3724234 3627642 3522216 3746336 3765140 3771700 3845236 3895238 4072724 3921561
14460 3921561 4117833 4227824 3928024 4042779 4293104 4295980 4684979 4410180 4488333 4343822
14450 4343822 4537928 4535672 4206716 4394598 4676404 4986309 4842695 5117956 4798007 4857438
14440 4857438 5250194 5018697 5478199 5200658 5223192 5217775 5593246 5537691 5925473 5745737
14430 5745737 5688162 5866569 5765428 6080390 5876686 6055360 5868781 6317855 6204047 6785202
14420 6785202 6593498 6696307 6535186 6740946 6932715 7025882 7070596 7108553 7316545 7822569
14410 7822569 7667358 7979820 8019897 7717842 7931123 8078676 8255847 8191391 8717766 8669517
14400 8669517 8796754 9105795 9011440 9075745 8983693 9422831 9828193 10080970 9917366 9962179
14390 9962179 10387585 10576184 10502343 11052250 11447775 11312700 11806657 11804088 12055352 12017932
14380 12017932 12345367 12679793 13110801 13127739 13601802 13546579 14135631 14258568 14210173 14664519
14370 14664519 14779411 15480896 15585465 16076440 16338785 16729059 16839337 17249965 17980160
14361 17980160 17951035 18619223 18884884 19348195 19871989 20302873 20491908 21257676 21547729
14352 21547729 22307034 22737086 23051714 24079935 24531233 25050465 25836394 26227859 26913919
14343 26913919 27773850 28624503 29053133 29957000 30900103 31563603 32478267 33476874 34380965
14334 34380965 35467842 36718160 37751392 38922351 40351982 41767291 43152542 44149374
14326 44149374 45799354 47482532 49167946 50847135 52596233 54742371 56641085 58606039
14318 58606039 60702706 63240885 65429652 68070172 70835069 73676862 76607336 80166739
14310 80166739 83435266 87277408 91206553 95059961 99376768 103935869 109341717 114399294
14302 114399294 119778986 125615334 132201524 138985020 145797664 153557924 161629311 170253771
14294 170253771 179198330 188552089 198522103 209334219 220623721 232489643 244672027
14287 244672027 257594173 270869141 284532351 298474011 313035994 327624463 342441229
14280 342441229 356671413 371107819 384612737 397548552 409487734 420070076 428892038
14273 428892038 434670190 436377688 436547239 435753541 434299407 431731967 427509674 419477790
14265 419477790 407686223 394365484 379933804 364577596 348971772 333038614 317395356
14258 317395356 301763490 286284462 271476927 257983664 245042315 231736134 219562022
14251 219562022 208266368 197016888 186600920 177064372 168001176 159290968 151577895
14244 151577895 144027814 137081562 130415487 124152090 118329275 112711377 108009447 103420922
14236 103420922 98587462 94235505 90128953 86184407 82780929 79863578 76591006 73122856
14228 73122856 70227988 67617956 64958154 62812534 60593777 58219892 56418403 54260820
14220 54260820 52731393 50670319 48580524 47254774 45805569 44242424 43051439 42176298
14212 42176298 40475158 39022567 37889180 37139687 35901576 35538997 34335042 32985977
14204 32985977 31917071 31373792 30290560 29878652 29325229 28419857 27276271 26543840 26076307
14195 26076307 25138393 24748643 24033282 23507033 22836717 22320797 21650023 21235005 20696105
14186 20696105 20530027 20063778 19316697 18629553 18706956 18152826 17626632 17748377 16986364
14177 16986364 16673232 16594943 16008191 15763034 15391242 15102866 14552715 14441718 14054774
14168 14054774 14070896 13567266 13499866 13158864 13081163 12583352 12523970 12181670 12148683 11815643
14158 11815643 11809233 11433761 11209184 10733552 10844978 10905544 10546471 10139613 10224785 9818076
14148 9818076 10081625 9560031 9487510 9128443 9194832 8988644 8915380 9041029 8505374 8809673
14138 8809673 8148640 8349053 8078595 8076630 7737442 8100395 7730405 7547826 7627523 7517156
14128 7517156 7342216 7139868 6722881 7125759 6888033 7157977 6686831 6399300 6624310
14119 6624310 6657242 6173560 6289459 6243583 6158144 6151471 5955877 5905985 6210148 5698158
14109 5698158 5708822 5523122 5460148 5522454 5214366 5184720 5179298 5232457 5095545 5306918 5255737
14098 5255737 5223722 4744979 4435613 4784692 4810572 4756418 4974405 4290014 4593778 4734065
14088 4734065 4415631 4389049 4209024 4333556 4465752 4298123 4159575 3907846 4030945 4113558
14078 4113558 4201955 3847621 3709959 3666506 3616636 3749230 3949141 3820608 3461785 3547539
14068 3547539 3713071 3739268 3476447 3495665 3497617 3510526 3274061 3458994 3654736 3576009
14058 3576009 3233935 3517368 3119163 3258580 3617628 3211511 3096794 3159126 3195507 2829987
14048 2829987 3025532 2836711 2676682 2824512 2876184 2633406 3004811 2861506 2855984 2655108
14038 2655108 2942580 2650935 2530131 2519012 2723717 2899267 2784765 2389653 2920378 2378504
14028 2378504 2422444 2587189 2433820 2383981 2274181 2088509 2329699 2779092 2441218 2007686
14018 2007686 2390919 2328215 1953230 2268050 1809136 2270548 1989664 2063096 2206014 2135632
14008 2135632 2170852 2202336 2092208 2144627 1920174 2122675 1935470 1960728 1900896 1908779 1664248
13997 1664248 2205798 1632783 1807476 2176550 1735958 2002195 1877608 2296065 3744700
13988 3744700 6437418 13984894 31811128 41616305 20170159 10016713 5972062 4238333
13980 4238333 3563814 3224516 3006282 2601690 2746265 2736294 2318020 2527330 1948986 1917604
13970 1917604 2048719 2184570 2200792 1782338 1769893 2123277 1968206 1624209 1665658 2129772
13960 2129772 1947621 1963587 1545797 1854882 2078252 1679506 1510964 1766938 1752521 1228726
13950 1228726 1441364 1722344 1615270 1729057 1630995 1405344 1770296 1269335 1487155 1386517
13940 1386517 1478878 1556379 1361550 1522853 1501676 1603956 1376939 1316032 1538199 1465897
13930 1465897 1303472 1158767 1774462 1400570 1224040 1340554 1476889 1378751 927941 1093520
13920 1093520 1241405 1671022 1375572 1192253 1335337 1484228 985330 1105415 1293021
13911 1293021 786444 1122021 1068759 1196045 1193691 1237978 1033684 1396328 886341 1274998
13901 1274998 1194572 936410 1176870 1112730 1142552 1052264 1227249 1198712 1011309 1205778
13891 1205778 1117581 1030004 1006547 1061651 1380345 1271441 1259223 1149223 1026824 1292823
13881 1292823 1191895 909359 753194 955156 896355 812919 780854 886754 1239698 1005778
13871 1005778 1226471 1261230 866966 1052739 1032348 1145613 1072850 984246 858159 929463
13861 929463 1189193 745963 879429 773415 943011 740104 929998 1245787 996244 734180
13851 734180 1114965 866772 928624 1078850 906462 826071 857217 674932 790806 837379
13841 837379 812485 489368 809578 877838 706245 816961 808163 682623 1041506 916542
13831 916542 668166 576866 869740 815595 833209 841744 988215 728409 844318 782804 932746
13820 932746 664819 985918 641964 562736 862924 880148 732869 900659 440881 755553
13810 755553 584815 595566 706341 773812 722370 798886 585645 889370 762123 841065
13800 841065 463129 377885 671228 556691 747317 743042 697525 781575 283311 413084
13790 413084 807409 679190 423668 881751 722370 596967 620408 647842 950595 507805
13780 507805 791205 596791 700968 888340 212296 773251 518161 899585 419713 359710
13770 359710 703392 552627 612083 748743 792452 603497 830409 395965 216551 664036
13760 664036 771140 563486 674139 592118 481791 671591 518006 485561 549312 313769
13750 313769 652199 473417 601048 364695 591786 320068 507183 512235 539857 801323
13740 801323 304644 492760 782863 647499 429143 419421 382187 563480 617659 566003
13730 566003 423720 650505 628339 618707 590086 599022 152656 526791 730717 537786 493128
13719 493128 281898 470445 379106 457169 740584 535479 741508 369202 634918 364596
13709 364596 370896 256852 500166 505819 459266 468025 206178 687025 649346 259424 388955
13698 388955 490666 810154 506412 359389 152989 543297 631098 445463 460401 312452
13688 312452 437263 558249 515143 661201 480421 245774 422402 682711 136574 449745
13678 449745 349828 400966 279387 159636 322238 387247 377177 282465 447229 372452 534707
13667 534707 510852 257872 120919 530733 335777 485806 373712 345430 502680 416859
13657 416859 511778 318658 231570 238827 282837 4296 391411 126151 644764 487892 296165
13646 296165 332776 650559 334297 442999 419909 221335 158543 406597 223262 -56090
13635 439354 315542 218093 401736 397422 256117 300089 220024 115508 417328 621400
13625 621400 325852 225300 436303 402827 169899 476185 382891 603447 318719 382807
13615 382807 471143 367030 228036 386245 293900 424784 527188 365332 271141 620679
13605 620679 447555 314652 447960 191188 -233332 420263 409685 -105965 480368 230313
13594 556023 414269 391154 342461 520820 278784 363605 77932 194693 158073 181565 76740
13582 51870 397480 515868 374293 502162 308429 201185 292448 224175 729784 62332
13571 415493 609115 268738 190536 142112 200558 343442 89820 58690 461561 247382
13561 247382 454782 12812 317347 161493 293244 68883 158681 310297 260194 319858
13551 319858 253335 317748 314509 287759 9698 149097 345836 279874 178249 91885 304661
13540 304661 -13695 356033 -75818 281284 70817 24274 141130 30535 375380 478035
13530 478035 362510 362484 254364 290751 131899 287914 115151 269965 219685 42675 353134
13519 353134 100840 278843 167795 424343 111074 129626 -56133 433136 407417 146030
13508 173267 407024 433138 230038 30233 270552 203713 268701 567041 64581 348588
13498 348588 290046 37650 -159826 351081 244563 482135 33324 390944 58220 241240
13488 241240 301796 285916 136661 366415 61689 71234 362250 653398 489717 131397
13477 155149 182144 -73498 239210 261402 -24793 104232 130636 253801 52040 183886 -14329
13465 250427 35460 190605 201579 146374 290026 219385 19286 254552 -34314 115043 -11453
13453 449787 227635 -27299 306704 -149268 192447 246999 -9609 421379 12537 163391
13443 163391 502631 51623 5686 103737 119885 407686 68427 351769 177411 375940 706452
13432 706452 230165 36052 218472 285419 68420 -241110 108296 -33188 313864 298799
13422 298799 227354 258718 191128 17092 90574 -91861 374330 87478 241731 168218 295844
13411 295844 279754 81318 152725 174486 238366 61766 162935 -22238 219267 -83947 402290
13399 207299 -238961 312998 344549 355832 51389 299561 168859 307927 273347 74761
13388 -9 -168140 147045 228848 301031 304219 229949 377374 350131 42059 87833 112201 32328
13375 297478 206307 96960 -65568 126643 423980 220502 98782 353738 -63573 293534
13364 260560 218213 401450 201894 261445 48592 -107660 111260 103476 161359 478837 -152085
13352 264192 383891 -31913 171285 326770 291558 299400 468850 408323 24978 376757 295172
13341 295172 490586 210403 175321 114586 394492 394376 82734 352076 56659 277336 76598
13329 -105103 263921 -175179 583177 289542 -4107 67798 121708 456678 241116 246025 243884
13318 243884 233938 124695 363900 -3911 252448 -91302 -47323 -296788 328320 297629 235969
13307 235969 123547 213204 323390 353273 56679 151127 113095 264396 156925 269575
13297 269575 153183 149962 250105 191262 -21225 316325 250192 202182 29748 19853 350074
13286 350074 -30135 235685 368752 52963 84667 19685 258757 17189 188387 128083 142073
13275 142073 46826 77823 288901 -9100 71393 -61318 32101 399530 127375 -210067 -105979
13264 -105979 394773 382658 -68491 43157 -11277 114084 126844 94839 120452 200080 -109792
13252 464036 -90335 72285 184796 111298 212280 59327 -136694 65293 17068 94076 171901
13241 171901 43939 119563 178078 -117945 259007 186701 71863 -179704 262585 171202 32932
13229 314711 -15684 15537 159444 71637 55885 43099 159555 -62960 68501 -202880 199128
13217 -4840 163482 -156485 65904 27641 139830 -135563 64511 65369 74219 182370 51335
13205 109501 77983 166221 284901 -116644 -27571 428238 -57709 320321 -83953 139493
13194 41076 153088 299484 67658 123195 63391 57193 -116598 93856 223083 81016 -17701
13182 160135 231270 285485 152791 -303742 -96132 -191467 -82187 230449 62898 158192 102145
13171 102145 179770 81323 -71955 229616 101062 -17533 243009 238110 57976 66690 37751
13160 37751 95525 -123180 55517 91183 -25633 143612 -23695 270716 138792 188629 -269924
13148 -195567 149957 73077 214345 -38534 340587 -6681 -93731 79790 381331 -61329 514166
13136 -295924 355173 263255 83708 179042 -204041 159684 366876 190562 -67299 116643
13125 -95190 -319838 -34846 24421 46861 -179409 236236 24583 -57825 325880 -144196 182335
13113 236290 299865 -41844 118548 262471 -25493 -158830 136160 -108859 158809 207600
13103 207600 -96839 -99370 -113194 5082 92294 -43199 27800 184470 43338 134248 135575 210218
13091 210218 112562 186774 -123557 31325 30100 -13585 123985 -39493 -116929 -225066 -97971
13079 -13446 -120517 -81921 -9159 360548 123481 267770 -148904 -214309 -345020 120215
13068 -2876 42836 -75769 -71077 582543 160297 178646 46153 280485 192956 277611 -342001
13056 52881 -235587 119869 229694 -225206 70698 -181303 137933 -148312 90813 284187
13046 284187 182602 -34676 180449 56221 239331 -64737 -144216 110752 365378 179779
13035 -15779 65563 157977 183659 159753 217859 52130 220071 44627 518942 85515 66054
13024 66054 256812 147995 61422 19291 168149 130577 159223 206892 -19797 259201 125141
13012 164856 12776 125946 -38631 371921 -55672 9326 -36091 176922 5855 300944 183626
13001 183626 -17659 -402762 194536 431137 -23447 17121 285022 189423 206724 -1401 -321877
12990 -321877 -116851 122947 142645 -7781 -150362 -131594 -190588 298578 120753 -186417
12979 -133702 64255 23461 -1035 222132 -254585 -57606 179937 137931 127143 248931 203207
12968 203207 126612 -187962 -273998 34772 47433 -99158 -11422 118365 17046 299361 151200
12957 151200 98551 -175731 76623 -308782 14567 36705 38268 212783 94577 -86472 -125885
12946 -125885 -54830 110867 -152558 180195 -88042 142461 18661 -255792 -32380 214408
12935 112084 136079 -314175 -93131 65617 -62994 90894 161423 104594 103547 -61599 162546
12923 227889 187399 -62847 137524 120714 -256473 136898 -265874 182618 -103005 140871
12912 -25932 124342 -38623 312673 326576 171870 1139 61604 110345 73113 71421 42815
12901 42815 29984 288559 -97581 23365 -134268 -201964 499189 57660 -12857 -162155 -79319
12889 -933 178536 114586 -98082 147615 -173025 283510 1680 99941 -45986 226049 149918
12878 149918 31004 -24860 -252734 4242 437386 92098 127093 -52116 -10544 -350857 5980
12866 -34055 -120946 152855 69825 43497 278444 -124123 -87568 125604 -139289 230472
12855 328241 209804 -64671 -48095 -56517 96454 218970 117622 -31028 120543 -188858 -68907
12843 139604 4330 213547 49886 128368 -118010 24915 -7116 -268106 -49990 53444 85634
12832 85634 196540 -43976 100935 -211978 297735 -114348 -136726 34662 -136366 102515
12821 -50761 120836 -119871 184572 -65058 81104 108538 -105816 -17049 -38716 -93595 95180
12809 -71912 -72018 149098 133526 38162 -143739 204817 101747 239142 -144408 -99195 123293
12797 182077 168083 -140308 -149734 -36038 22751 32205 174713 152670 -141444 79936 75416
12786 75416 286428 73937 221611 -29464 -83258 -6891 67082 36315 59787 -60746 87364
12774 76751 -3752 11087 -30149 -23335 -126545 246786 -156717 82187 -234740 -59873 -73829
12763 -73829 -31453 104286 265093 -38226 -197790 183865 -260473 -36802 -214519 5150 192640
12752 192640 47391 53955 113994 10136 -52599 -82460 326408 -67837 216229 -104128 195847
12740 294615 43272 26387 153894 278553 102042 313410 33616 17200 442009 -4766 -250595
12729 -250595 -71723 -104775 228865 -16528 48202 -206515 -91106 -69342 8487 269224 -87222
12717 463087 21488 8846 -32691 124865 49727 194240 -32913 -23286 34557 105580 63817
12706 63817 -25122 308810 281938 543921 178345 18991 -44203 345238 -160724 -346638
12696 -346638 112066 -55914 25470 -402832 -79102 150284 109915 -281517 151417 249426
12686 249426 46336 -407195 394565 314591 167448 233076 29727 275119 427671 -142968
12675 134957 -30385 287084 148579 520670 158204 16562 61388 234003 11322 187397
12665 187397 -104649 -59312 -44420 -65264 -433596 28394 93240 -191421 21695 63898 410013
12654 410013 399870 25417 -135662 212875 -64772 141979 22029 121302 -129123 -105367 -95319
12643 -95319 192235 -143636 206633 -158016 141095 -297320 -27655 115625 65952 155334
12633 155334 70568 -20657 -175029 375708 274837 124199 152339 338778 69802 95881
12623 95881 257608 17548 358306 -63115 126902 -70213 18514 184943 -219002 34940 26973
12612 26973 75522 115889 87952 -142680 198750 -53512 153 212677 -4889 -86022 95187 -80451
12599 148440 55062 61673 -168156 10094 -21556 176178 -99040 210577 83615 -247471 102351
12587 -148076 461804 -154668 -73262 423790 35550 67805 120853 11777 27690 7625 -273515
12575 -229856 -22496 101779 362695 15330 -69220 57680 -226574 147659 75268 -152656
12564 449632 154290 6781 -218119 50559 190033 -243149 -199838 195133 196956 114455 -84410
12552 401072 170079 201171 204658 -207782 126658 -74821 -274879 342193 -279932 -502553
12542 -502553 -393916 -229490 -69365 -193907 -218643 -156332 -276130 161388 -56818 -64681 262429
12530 35377 219586 -222212 96208 54089 -38977 15869 134651 196753 -115560 177023 -206680
12518 -65819 -69467 527432 280385 1304 88649 150546 -147676 -147499 -45985 -12614 419086 -129138
12505 -65020 10531 -216314 36221 -262227 -21571 -138219 -53925 -53814 181067 143897 -81464
12493 491049 318799 -25512 20054 -202130 -27813 -35251 95266 143737 -190130 -295408 39020
12481 -121124 55385 145176 34952 -166673 -84325 236714 -97025 -131573 177723 56057 -55798
12469 56800 -19024 -13246 -56131 75562 9322 -135382 58337 -20806 75704 52764 -141597 34255
12456 79707 -247045 52500 -94190 -103188 -122360 66408 -213975 -22783 -91708 -81302 -466127
12445 -466127 266200 -106643 -200515 258123 -129610 46953 -31144 -11571 -158158 -196923
12435 -196923 -149533 29659 11390 -58468 -312831 68049 -4451 -241552 256628 187269 -26332
12423 25822 178878 329543 -121365 -23787 71751 -195743 -109152 137906 45463 -137833
12412 83445 -146062 -82688 -286496 427717 199045 -111829 -274593 -142147 -49101 13076
12401 185479 126021 191312 225242 -43470 -190002 100561 239968 20406 -31358 140095 -101609
12389 241680 -18088 25212 13781 -364221 267677 24937 -6504 -187766 -301615 -127100 -117057
12378 -117057 60941 -47906 31952 351560 96712 67751 134933 -236909 54571 -37937 242067
12366 194149 142745 242550 -125934 -113146 -7798 60071 193575 -233469 -262228 -353484 -31321
12354 88816 48773 -197361 -187885 -124217 429265 177463 -241724 -32222 298301 143900 150171
12343 150171 -316807 -55563 124814 170681 17901 -128507 188117 121821 59924 179764
12333 179764 48012 206812 -112241 81068 140084 -125684 -203311 -106976 149911 70559 180175
12322 180175 9916 172857 -42596 -180268 83298 -77319 -240046 204061 151962 90913 73559
12311 73559 -126407 51472 118871 -42955 55267 148630 -68792 -40646 -97013 -79007 -40794
12300 -40794 25005 120766 -44294 -155203 -28968 47246 38459 281030 -87471 -225130 -74840
12288 -49181 116743 386416 -121016 61655 -104500 115317 -37034 38257 402770 -30292
12277 16496 47892 -19603 162931 291602 -123321 332862 17532 223752 -93372 -120766 163711
12265 110632 274639 263883 -18919 -44795 -106518 49564 313408 167690 31057 342765 -176955
12253 -37041 -98572 -16545 119788 -78516 18669 -51711 263176 133091 128682 -234858 171119
12241 -212258 -42868 89444 -312641 260777 118445 224544 37397 -116624 174896 -16303
12230 178345 27637 179618 277836 15001 104927 323974 158445 176702 197596 198586 220652
12219 220652 287316 166477 91776 291188 -66245 114265 74246 126613 277759 97960 103706
12208 103706 235349 -67655 -32414 292025 203027 -220746 146082 53592 18412 192421
12198 192421 228115 341484 61941 114163 115218 201358 129246 61902 -69153 176538 40267
12186 -83637 236163 283425 240667 148615 -43984 315345 321458 -68169 263433 -146265 123069
12174 236585 244333 177444 -82368 487549 122693 179129 -116930 -26734 -3597 158953 256801
12163 256801 68645 179600 -92587 195785 -129387 123783 -170412 -42519 -29635 224063
12152 71956 -70612 187981 82132 40551 -222415 -123402 59241 257638 -121054 -66811 16036
12140 141299 -189159 85889 -145555 134001 211324 -213858 83531 76274 -217300 -76317 386668
12128 -30878 87155 -126019 32710 -157653 137491 124361 -1753 142468 -143611 100133 -205556
12116 126593 -107219 -42773 -278207 197057 82026 -157312 -152832 -6064 -51543 121087 -42612
12104 -12756 164819 -55771 154864 -2325 -66535 -82210 -7709 95780 3833 -34461 157000 18558
12091 121904 -132592 -76178 44635 -20886 23846 -12631 -8787 5375 -23849 -1186 -101558 -195084
12079 -195084 -205719 552864 197940 105581 -255410 222071 1050454 1665214 621232 287644
12068 186340 157186 45537 -33791 35987 -114288 155910 -44071 -18296 56546 151518 46360
12056 107838 184570 97791 251544 84298 -79971 -38602 -133263 142447 56938 -214105 -78309
12044 -9293 -1476 -52887 -68492 195096 77461 52804 -48345 7938 -195565 55569 46243 -41927
12031 51351 369909 213158 -152038 10319 40888 180081 -156162 56157 -172320 175784
12020 95625 -115801 -6588 -41278 58553 -11243 166073 -177346 -122690 -279580 86822 66341
12009 66341 -240914 -219150 26622 9436 -136383 -175384 -162114 -217775 114052 -175630 -309816
11998 -309816 212282 -109809 -8975 14588 -58675 -21279 -378987 -127565 -98294 -104604 192665
11986 23267 -39351 56495 130287 -138498 -169610 -34946 1429 -189160 219430 51695 -108521
11974 -38890 125571 -41473 -86233 32956 -257352 -102145 147525 -228573 296870 203193
11964 203193 299835 148418 231887 108314 7654 -208123 -41158 -251631 -127336 -24639 -105623
11953 -105623 -213759 -459739 28077 75020 -167497 19633 76101 21460 63432 -87899 134082
11941 165178 -94362 -223144 63696 -96167 107220 142561 98949 -191685 -63311 124574 -113799
11929 -2688 168640 -84183 -6473 -222322 -47919 -273364 353821 228384 -232446 -318022 170586
11917 128612 74386 -66706 -161019 -301935 40130 -262137 349729 -115858 133045 -332893
11906 158378 -253095 -170301 248659 66489 103547 18951 19292 -360949 -20334 -251726 235171
11894 -381210 -24043 281777 -103258 55803 -165707 69824 164711 -399257 175177 -73637
11883 46524 176467 277595 -338809 -8399 -23843 187 119597 -20853 -83447 62432 -12838
11871 56850 65120 44567 -150629 -259317 175595 -113446 -33345 126955 33705 -250695 -47032
11859 -12712 -113271 -512591 54204 -52392 -25213 -237984 59122 -290398 -305526 -308573 -10429
11847 -270799 -69316 -101529 -166980 185248 -179488 22798 165302 280381 67436 164598 -299271
11835 37540 -42970 162515 -110501 28061 321374 -163755 -39051 148350 -295599 140114
11824 115074 30098 277247 93856 304932 -28876 -66998 -52243 -25325 62535 -82875 -5983
11812 -199092 305102 13424 548221 320904 199286 -114268 -162250 14031 229843 143160
11802 143160 35226 106744 -6089 -1629 -104618 -150700 83339 -176810 154412 113794 57138
11791 57138 465990 114873 -221485 108186 140671 -151677 83839 -122614 -255434 -243959
11781 -243959 -161651 141617 167145 54403 3455 119537 -102525 -113132 -315976 223100 282031
11770 282031 -22916 -139342 152455 50201 -76923 235904 -107049 -5075 240342 -226462
11759 -192354 86229 -427728 353550 -2876 -144124 37053 -52749 149409 178242 -115928 59882
11747 -123253 -221253 18621 55979 35398 -115772 130814 -276475 227364 88237 298255
11737 298255 -260256 326141 -119589 -267172 -13851 167822 -190699 -207528 -194326 53571
11726 -50365 108109 -288694 -80224 -132775 10073 72198 331571 154104 -236566 375110
11715 -3623 322388 -162737 14997 111862 -58529 80497 256912 -46526 -21015 312505 -173671
11703 -160692 40369 157598 597717 -153073 -291402 -30060 -2830 -91261 118210 -62137 -285141
11692 -285141 -2954 -238962 150950 231457 14326 402570 -84867 34912 168805 163209 -310687
11680 -48783 226866 -4421 -396735 134432 32904 191256 -197931 -145478 217676 149125 -158913
11668 -101795 168211 9351 146925 -28339 114420 -124795 94437 222860 44087 173588
11658 173588 -47965 -116277 219762 182940 79391 8828 -302691 -244078 71708 -76905 354949
11646 -18716 85878 232117 239607 168967 68097 62189 105650 235740 279803 -83875 340903
11634 295048 -32983 -233237 45841 270404 102312 -20876 70144 5604 -54095 124984 -59669
11622 206382 -162169 -188818 78870 15993 81416 -43358 85370 68648 128516 14014 -89154
11610 56256 37662 365694 -128346 29722 68546 37951 385184 51373 -41933 131705 347392
11599 347392 158332 -224555 -241410 -122872 167988 -49186 149230 223958 -54665 259900
11588 129147 245168 72548 59956 316489 241023 43379 -141359 128976 195029 376679
11578 376679 308503 145825 -77918 -12918 69201 -78226 -91099 43442 -70570 145775 96402
11567 96402 162400 -179062 146965 151864 115756 249141 295515 -155086 77698 186119 18008
11555 -231285 152431 -33127 17261 -217342 150255 155099 8382 -33114 43461 -269071 34671
11543 -190592 121467 92567 404833 -28365 -43387 -111473 180919 83559 -177151 -17770 374132
11531 227458 217179 113429 -16387 132485 5558 52306 155473 148508 -223636 27720 251714
11520 251714 53816 140676 122229 167525 138611 343568 -191921 -91368 149290 7966 157997
11509 157997 236882 41415 -15570 12269 -184491 52879 12305 151129 264080 99376 192770
11498 192770 185556 -91620 185519 -81298 156535 118225 -119115 406090 92491 -229543 116221
11486 230139 234965 122854 350342 -75138 331852 123982 308893 101585 80136 113588
11476 113588 -73634 -193903 23168 -6815 189923 202739 75453 182070 154206 -252876 -106595
11464 102185 214777 91670 165045 158964 398064 398999 -109480 36768 223037 75955 -63249
11452 -68724 -750 -82960 39680 -226071 100131 2080 276703 8417 -7175 150215 60041 -27494
11439 386103 -41538 147381 -136050 36857 -230970 -29519 327483 -247928 140653 83955
11429 83955 179964 135869 228529 -47190 85260 -28599 191392 212090 -66873 57175 66695 87943
11417 87943 129153 -149121 -215046 -188531 -109853 109798 192860 123557 47378 -51047 131054
11405 -236634 98924 -116311 -123593 42387 -237450 -120262 -11664 -109817 -269780 139942 -20821
11393 -182470 404027 -400649 -33726 77029 148827 -169735 421656 197743 -121870 -192568
11383 -192568 -130637 -144935 65418 -84675 97773 45416 266342 250754 -199051 124200 -140686
11371 134934 117904 -180311 358838 -275936 243870 -92417 47969 358114 -98659 -58750
11361 -58750 58713 -274836 -119043 91254 -205281 -103018 -126692 149013 -45854 -233843
11351 -233843 69056 -318749 378 159220 -220413 -195358 175032 82983 -210292 -45910 -14378
11339 187926 -51374 -49257 -261110 -26940 -112578 86333 -65945 152467 -33105 170518 102360
11328 102360 154652 -431505 141829 104287 -82124 -102143 18002 -15260 -9742 -83039 -43141
11317 -43141 96755 -128315 -72866 -214498 8519 -171073 169537 -103652 216112 39765 374769
11306 374769 -114156 -52755 -352571 -2211 136143 -167432 94510 86257 83635 65531 -34966
11294 -31149 -225472 -61771 -190670 -184828 -47190 50682 127065 -195758 116050 255412 -285510
11282 -218424 -138135 33582 -276430 340328 -151660 -107452 104553 -555377 -109277 -81253
11272 -81253 -70166 -21740 304471 116798 -187147 247257 -87801 -144215 -29347 -38622 -108527
11261 -108527 269163 -61573 101413 121919 -221571 -128315 -183314 129517 24933 37656 71829
11250 71829 -270918 -163993 115559 -99148 -1187 227148 -95974 441708 123182 -26857 -332376
11239 -332376 43433 250030 -274462 148764 -261398 -39975 -284009 -82529 -58336 -85822
11229 -85822 -390455 12866 -66104 -165708 -236388 -228520 -97651 95778 -160858 67495 -72378
11217 123121 -152914 160584 -201006 -143947 43262 -142635 -175969 -286040 45446 117149
11207 117149 -181995 -310642 22302 -113316 -118786 -16501 163272 -214615 94722 -158012
11196 114063 -63180 -243197 -342531 -147320 -25131 -130572 -153064 -355753 249241 -93942
11185 -85157 170297 21899 -27353 -40813 -243453 -141628 -72943 46784 -58996 22819 -174595
11173 44596 -168797 -113674 -80833 -98747 89982 179025 -28144 -206310 212412 -86176 64866
11161 -243065 -180121 -227330 106284 -283716 -72732 444639 -86941 -124220 -40038 -226228 90337
11149 167979 154461 85111 -104190 -33547 -45315 -36959 88116 40047 119166 38603 118380
11138 118380 88040 -97770 145944 -224898 59485 -229759 48235 -79092 -197782 111145
11127 48049 272211 74591 82741 -132585 248749 15106 -202766 -126170 123321 29295 -9449
11115 85945 38117 70318 215300 -53015 -48628 -54440 -21486 18602 -88941 30719 516709 11885
11102 -26756 52868 23430 68323 236945 -89208 467569 253279 393603 158816 221402 102410
11090 21627 249050 182021 69478 186464 188746 158161 51503 54363 91395 52221 -227195
11078 -1344 218717 95974 8201 213128 92813 593701 101839 485683 203937 173643 61275
11066 625627 301621 58018 506063 323335 289117 461259 730778 572480 388951 529735
11056 529735 872670 195827 350228 393162 649927 691445 611354 769278 405542 580778
11046 580778 593705 432575 449459 574296 676761 725384 346585 1013201 481704 430260
11036 430260 693312 777005 457546 613056 553658 432186 522151 448709 564327 427498
11026 427498 867980 545700 482481 389718 764167 825642 800159 691994 733759 599628
11016 599628 537504 385455 192163 737263 475811 443069 523973 558437 597976 516304 457125
11005 457125 545389 566414 682459 762159 505160 861629 501476 521801 808280 680615
10995 680615 803915 486215 692339 378413 709549 699206 772112 594585 508816 669717
10985 669717 471379 630499 1014979 869624 966687 939960 1433507 1536592 1062326 1442155
10975 1442155 2150644 2074947 2170194 2455785 2406296 2401003 2298156 2270730 2115377 1882821
10965 1882821 1673008 1565233 1759434 1689849 1583055 1807129 2093370 1805820 1867836 1799496
10955 1799496 1390807 1625058 1060189 1227398 591557 900207 1052844 582231 289700
10945 718333 -36466 -44906 220456 217194 365614 278684 5592 256310 322405 204987 13311
10933 24814 88829 -23406 113535 165945 289072 353024 101313 -140176 337416 -182820
10922 255142 87698 -11338 181337 233540 -7082 -17220 206841 -351104 -121611 -266489 226348
10910 -38044 108142 -210593 274634 -105572 2538 179314 15116 -219871 -256265 201841
10899 -58528 129725 51554 72722 -62831 434465 136767 -150923 12220 -125379 -37737 -8695
10887 -81603 -10551 -359718 117457 202933 50125 45320 56015 -74440 235986 -192044 -87676
10875 56304 -409575 229062 -99694 116796 80943 -25202 -201566 -34525 149964 463856
10865 463856 203844 -162294 -130342 -63859 310785 -143681 73469 135526 -120050 140712
10854 1436 -78219 104464 -245267 139441 127555 379077 -125301 101144 24992 -106805
10843 180722 -191935 211855 -113466 -18504 156579 -110749 -17109 -44365 -168229 -208969
10833 -208969 -72963 -63669 379793 -340036 45927 -5897 150838 -314876 67799 -35462 -53605
10822 -53605 81946 -38009 -131134 57370 -356249 -6753 -15252 166603 -329638 183454 146119
10811 146119 -235908 -89704 264868 -84392 103494 -396598 49327 129783 -100265 213498
10800 26487 -453789 -216916 -16238 -174250 77848 150602 -46912 44733 48119 -137321 72850
10788 -126326 -249764 -198942 87101 -203559 202070 308233 -142079 -140529 -230731 204446
10777 118671 -160630 63318 176655 -57455 73142 -145173 176788 -68661 236335 123111
10767 123111 -777 186996 -217053 204162 -85530 -108813 135514 297111 206375 -17106 -257113
10756 -257113 -5853 -62302 -55978 -123199 243500 -160731 -182004 109139 35104 -49012 97038
10744 -197029 -272186 -25991 -97963 -270113 -67014 34328 189520 409681 -156576 26742 39052
10733 39052 421471 -178599 266993 -209237 -59615 -184331 194832 108687 -118555 209682
10722 -265864 87359 -263108 -87461 -356611 170230 100113 -116701 49212 126800 236745
10712 236745 205591 -54743 -241291 -19766 298639 -297221 -173156 -10480 -56596 -96241 -120879
10701 -120879 -58473 -24139 -196647 -19309 -160129 -23850 -149135 -66395 -134597 -263060 -23103
10689 -71344 97607 106516 12586 -68782 79238 123714 -19226 269704 214995 -234610 -187206
10678 -187206 118763 -232420 1275 98002 256975 127402 169818 143130 140665 -238678 -245572
10667 -245572 -315534 -43111 -279971 -121542 -88808 -77533 234766 27369 -195071 -342998
10657 -342998 140609 34104 -266879 -563736 188002 -95647 -30676 306179 -115083 263700
10646 -42449 -186998 -27111 -31625 -81313 -10676 97799 204825 -181674 -130316 -128140 218013
10634 -165460 11286 9415 107932 -240028 307626 -306115 198296 -125385 186097 -282014
10623 36737 -110499 12037 204500 -42594 -110373 38427 278603 60151 226888 146548 76089
10612 76089 -397267 162992 -136850 -115550 196603 -209014 20116 221150 -70034 -233405
10602 -233405 122102 36147 -131163 -211367 -161042 30709 47261 -184269 -191073 -3055 -39116
10591 -39116 -228896 34071 27391 -148296 -236303 -45111 -106597 173931 -87753 245265 -171788
10579 -265557 -79565 -94168 385520 103919 -121279 -87145 -9081 51456 151089 -200169 -56232
10567 -164953 -128803 -58755 -340467 -132564 -216157 -217961 -15353 254024 -7802 133230 206307
10556 206307 -171915 -313128 374612 105002 -133759 -256582 -361778 182059 -22050 206047
10545 -116876 -129441 100193 -76987 183805 -184293 3438 170959 -15216 -258957 56565 -394772
10533 104755 -67485 -239999 196196 -4657 -107603 -128098 6704 -80434 -45459 70343 -153684
10521 50948 -123577 23372 -204274 -18700 -82972 347735 -6011 52106 56540 -221126 -10008
10509 -273630 55776 -300448 200990 177080 -137668 1573 -73161 54553 64047 28907 -63659
10497 -220224 51666 83018 230405 89890 100515 -55980 -137374 -64601 -18469 -115915 -20088
10485 67387 -63474 -203849 145001 469779 557723 490309 198285 330810 -176188 81936
10474 2975 -252277 -208885 -284468 -4375 -36206 82273 -200796 11332 -314659 40063 -31489
10462 70813 45281 115953 241959 155 116511 -165265 -273472 -287381 -88700 68519 148988
10451 148988 -226146 42691 190008 52352 222036 29937 72648 113592 -15967 27651 -399665
10439 -104885 -232381 28007 211788 70969 -140009 -209008 70951 -190375 132307 -6000 900
10427 111302 -124650 -198566 144564 -45184 -8560 48142 89181 204089 -68273 -27989 -261788
10416 -261788 -89365 -179767 -70857 -161825 -55077 -122542 -31832 -249434 -111604 -169223 339227
10404 39292 103800 219582 -99224 310180 201061 -67089 -407330 113746 201886 -62754 32483
10392 158381 123650 109240 -58075 91773 85102 189832 214748 30750 -13426 -57363 175036
10380 344092 47752 236806 8566 311905 185487 244531 292686 123534 415219 448906 182441
10368 164155 529558 285671 356648 116206 106698 21477 98138 621456 132451 383256
10358 383256 195510 280461 94671 33026 351223 254929 393472 324484 360596 514344 5812
10346 192033 401862 400149 195034 345990 141765 416033 87685 163416 322380 329356 68896
10334 120558 202334 -96695 49811 225262 -38293 -23669 -101746 33185 484763 83272 78621
10323 78621 180987 155981 8909 136876 376716 -50180 118540 -32813 47360 112111 -316526
10311 53657 220777 184839 -169654 -261625 -109502 66442 -101265 205694 142693 -253015
10300 156378 -178099 -100449 43450 -185838 175844 25174 -99494 -319964 232390 293175
10290 293175 162747 220646 -73662 44127 -70915 -186230 182314 100257 -434854 63836 190147
10279 190147 -135637 -232552 89897 -125181 -147625 223763 10427 23335 -15543 -191667 88535
10267 -261643 59452 -110119 155986 171351 131232 240690 245113 66086 482211 335645 606856
10256 606856 338180 135756 317800 144311 26468 12330 175569 -60156 -39029 -91999
10246 -91999 -69199 -26991 40688 -97607 7564 -160814 169226 -122106 -188734 -104224 78803
10234 131366 -176062 -30118 -290118 67559 -51273 -53468 -129592 -77042 98687 52956 -104103
10222 94600 241545 -31352 -198303 -176450 -66431 -39435 -136936 -33609 308327 266503 -154119
10210 36959 72202 82697 74190 12869 -1323 142294 -268826 -284091 -225958 17691 295564
10199 295564 -90186 30239 52283 68054 87499 -172280 20930 767 -179455 324878 -245098
10187 -54933 208708 -148658 205996 -12618 -102781 -206011 -178271 169431 -243273 -202041
10177 -202041 -369762 -34613 -268365 -130214 -173653 -84319 -114471 -194217 215476 -253740
10166 50593 -117976 -33630 -96945 -63564 52609 -324614 154079 -180797 -334273 359918
10155 -251133 84421 -345858 203338 -34690 -238661 18939 -32807 -67990 212289 -269019
10144 65317 -178343 -45187 271726 38681 56951 -223891 34388 69831 107226 -11028 219951
10132 -12221 -165924 -5574 -67178 -152063 -116177 -45215 -113897 1719 94274 -178122 21431 -125849
10119 -231958 -108944 131357 156832 10991 323248 -232437 -89198 -127444 -437612 -85669
10108 -27938 199372 -13557 39604 142223 -161679 74641 392890 -133337 -67680 -47483 -27165
10097 -27165 408 -58214 -47976 195449 41071 -93314 -220450 69656 -350676 -64366 -363643
10086 -363643 23036 -51582 83760 -126941 -73378 -374955 -111740 -73624 3442 -15620 -207626
10075 -207626 -28258 -252582 -12353 -307489 -141845 88835 -111075 -164995 -26973 196566
10064 187980 -86923 -211501 85255 -113645 -116934 -170408 -166115 185917 204017 -140161 -109161
10053 -109161 -242836 -7918 -120264 -15462 -135550 -103315 214634 -307105 -93108 -105865 -202225
10042 -202225 3875 -98724 -240803 -123527 -142355 -389739 -239988 -35647 -295410 -1544 -73380
10031 -73380 288577 -26923 -289902 124571 -7375 154003 -90165 163921 -60057 -198642 -205769
10020 -205769 -193586 -349271 -267045 -107118 -54647 -165143 177723 -136916 -535157 333658
10009 -71574 -508576 156468 182303 170016 49734 62711 6324 104955 -294808 91321 129252
9998 129252 67914 197612 -151322 45752 11386 284946 -108711 -343346 -245040 111627
9987 -91815 -164218 -19109 -71718 -11482 -153349 -5392 -50806 84318 57656 -24883 119359 -158002
9974 -309622 57475 -197354 -246602 130638 -207203 246490 -93845 35915 250471 -176175
9963 85560 23763 43864 92656 -221022 -14269 251114 -222977 -117739 20603 -247954 -149262
9952 -149262 106519 -323490 -62139 -75618 15910 -333037 -28784 151784 -60234 -73989 25874
9940 -72920 -200659 -16286 -8799 -148773 286417 -356400 27303 218844 57067 13836 180217
9929 180217 55720 -321196 -110855 307763 -28170 9447 39186 137406 -49797 148977 -28840
9917 135361 33459 146683 -109654 -38044 -91321 -69724 169306 -93602 -52548 57171 -68095
9905 93389 157028 -433917 -292586 -27499 -413678 125956 -302115 162473 -51884 -20152 -387510
9894 -387510 123520 -231975 -82659 -47053 -14885 -107958 -341156 -115140 -399647 239081
9883 -510309 -105645 -303619 253636 -74353 -41788 -108407 -69891 -20721 321996 -121684 -152126
9872 -152126 -163955 -118588 97835 62808 -253410 111617 -284622 -51791 -103614 -191523 -233544
9861 -233544 11074 -194698 -119490 71124 -278018 -313751 203389 110567 -265474 -47191 -29132
9850 -29132 -7284 -120423 -26229 32171 -146337 -86169 -192095 129971 -194730 -101479 96332
9838 -157402 53380 -173542 129003 -51095 5866 25820 -51668 -53224 -315732 -37978 -163629
9827 -163629 -238719 -53701 42454 429559 -80240 202250 -182371 -61093 86385 313180 -205816
9815 -251835 -141345 -256754 101431 -88594 -23265 -131443 -84067 -120912 -123610 -503689 -35519
9803 355182 -278097 -244808 -4154 -427839 32788 126812 70605 -92778 -276506 -16260 226161
9791 51439 104026 -329702 42264 -107709 -148080 -155907 169649 142601 155941 -237672 -60866
9779 126460 16131 98280 -63436 227139 -8407 -43894 -68036 17048 246446 -84937 -90242 -110519
9767 -110519 192511 -290270 -111976 393533 -106595 125495 -145728 31573 -132729 -13718
9756 -266647 133509 -18181 -138049 -189134 -136809 481 11413 -348994 -1257 -160878 -195569
9745 -195569 -76446 33336 -70827 -192476 -118348 -97639 -138238 39367 -17585 -17082 94794 58206
9733 58206 86683 -115223 -407651 42238 91765 -125304 67677 -229209 159168 -143578 322124
9721 -73430 -97694 45190 -6917 -236648 -150882 142183 -20565 -152744 -310999 -8697 164592
9709 461313 -271502 -58823 -39759 -101424 -341226 125440 79238 -241564 -90989 41931 99602
9698 99602 -97831 165525 165092 -80685 -230492 -314719 32633 -157785 -324456 103981 -98629
9686 405222 -138261 -210120 -422562 289632 -16734 -80495 135873 -19528 -12492 -133784 -130942
9675 -130942 -4808 -213384 -78007 -156946 72915 -369583 31862 -119905 -47533 -173991 61807
9663 -140570 160586 184316 500652 -244692 -186507 -102737 762 98555 -70032 29723 71997
9652 71997 -313350 -106431 -219377 362833 -82445 -27101 -217185 131731 -128173 37264
9641 296661 -116049 -213002 6530 14942 -170645 33796 -218505 -42733 50933 32505 -120852
9629 -158893 -311135 -161473 -76794 -223760 -103138 -132192 -29396 -231852 -103842 220013
9618 -56998 -96652 90659 -233299 -3545 104871 97751 27801 -59991 -113561 204893 -176108
9606 -134317 170191 -282306 -72254 248730 -109162 174457 13457 97400 218283 -61177
9595 298902 -142792 109174 98134 64346 -250053 266972 -411198 301714 -28878 -257501
9585 -257501 -157793 5158 -88688 123579 -266990 165010 -78463 -94034 -107935 4508 22362
9574 22362 -92375 -46099 65826 113548 -389125 -99244 -103872 100324 105376 -274178 -238799 -111293
9561 -16746 273898 -265904 -93822 237614 -26736 204945 148107 158527 141806 -253279 45527
9549 116570 -115674 -234773 -244933 -263955 -263592 246169 -272727 -90408 -186868 -96001 -113201
9538 -113201 52099 -114854 -204472 -161203 73687 -395541 -90929 -452536 -127745 -199404 83664
9526 -425586 119870 203418 120585 -38015 -283551 -23049 531727 -266404 -180000 -179845 -149593
9515 -149593 -28529 208008 -254633 61392 68720 167439 -48145 181014 -123756 -379488 -28370
9503 -27087 -173556 6373 -26481 -14877 64128 -103351 -121889 -103959 41019 -27540 -12656 -136692
9491 -136692 47291 139474 257404 -186924 -229977 214044 -197940 -449042 -232500 -231753 152050
9479 -139506 424614 -293948 119757 205226 150020 -60084 -144269 -342859 -247047 104992 318803
9468 318803 37103 266227 247846 -44772 -250864 -25677 -67231 74909 116270 -152258 -231023
9457 -231023 -173145 168566 -19045 -95016 117286 55867 96110 -72538 69128 70305 219460
9446 219460 -246697 36951 -17904 -196808 -129457 -49885 -358273 -54679 -42719 -49539 -268906
9435 -268906 -200666 -101493 -202397 -235710 -64631 376597 261839 18762 -78268 -11525 -83339
9424 -83339 9255 18000 -441648 32934 73857 -28974 -167194 135408 133308 1962 -159278 289653
9411 5880 -220820 -153669 43398 -171921 94314 123924 99327 -235474 -163515 -72940 -114781
9400 -114781 -93416 143422 134522 -219869 -188368 -127055 -230870 40928 -142910 -109793 -59483
9389 -59483 -134599 -268475 -211023 185083 -184062 -364671 -223286 -519254 -172831 -115069
9379 -115069 -1996 -4416 -239035 -153690 141032 -235990 -149898 -185781 -72054 -176017 36719
9367 197295 -203376 -235808 -464263 -118472 -215714 45816 -24978 -1722 -267943 72357 -245911
9355 259011 65977 -107592 83697 17479 291393 -114054 -103979 -95734 -218462 84379 431218
9344 431218 -61863 -337404 -330432 59689 -151604 168155 93615 -3345 -101412 -922 305460 225607
9332 225607 399 -96713 386431 -59575 -57646 -151863 32880 -67312 -8655 32103 126525 -252221
9319 163389 -254197 -66866 -5426 -381473 107428 359372 119106 14670 -282176 -177324
9309 -177324 103899 -271855 231482 -176215 60521 72825 242965 -33687 2899 -120112 51113
9297 182737 9262 102651 -261296 -3453 -14211 -75763 192705 -70969 -42014 -68737 48741 189898
9285 189898 -125160 -61639 -147575 -184178 173211 11155 168313 -31360 -13401 -323819 -65114
9273 75533 -159028 -217254 -52437 270430 -139627 -221363 -263936 -252671 330434 161832 247367
9262 247367 -76919 57587 -310026 -185756 -43579 -94621 -192823 72908 -159202 64853 260640
9251 260640 -63426 -44735 -210115 -238520 72356 178691 -158625 -177768 -49915 -154073 138023
9239 118839 53757 -3719 -180197 22256 123442 -15039 -37812 106906 -233131 -170167 108148
9227 22415 -27747 67107 -197765 -126994 -70823 -275040 -253510 84158 -107421 -267360 142298
9215 -35611 109185 110807 -229441 212548 -130063 -74697 -191977 113291 -91010 194200 19615
9203 146215 10555 -142865 -205755 -31197 13281 -202454 297593 -48882 83539 -110102 -79709
9192 -79709 34927 -48987 -84770 -406849 -9980 -269422 -67173 -172409 38109 -20889 165790
9180 -202773 244822 -195063 -103128 -66553 137384 -10922 -119782 -265314 -111882 -166608
9170 -166608 111545 -89171 -119644 105612 127293 -163798 -1700 143979 147890 -231025 -187515
9159 -187515 -14835 209064 -196411 -208854 -93376 -193734 132167 -149403 -16374 88508 -95143
9147 -34528 132290 -290527 -91735 77930 -53609 75322 -91376 3787 -156912 7936 254987
9136 254987 -99690 -24476 122890 287171 130934 -161899 -98063 41385 129384 -269623 -409040
9125 -409040 -271036 14274 106769 -474698 -312372 99966 -270332 180764 2851 -132370 210813
9113 179497 -157520 -252671 -104505 -51664 -164246 -188053 -208264 227361 -163433 274339
9102 201789 -3646 -38327 26263 -140869 232583 194072 28452 -18393 -393697 -155881 -101769
9091 -101769 304478 -28942 217069 149758 257959 -85443 -147795 -165394 -29330 266179 -101103
9079 260700 -358610 -427896 -110922 115784 30861 -21487 165443 -90917 -73369 96773 65106
9068 65106 -306358 230531 288997 243691 -568919 340457 15293 41015 -8788 -94447 -68669
9057 -68669 -49289 156612 -142708 -120025 -64270 -195107 -176979 -54823 134490 2478 62553
9046 62553 -142890 15844 -92638 -318677 667 -105517 -120473 66527 343124 -224268 -188858
9035 -188858 -146053 60795 79190 372860 -346468 -306474 -103978 85238 -11259 -293082 -55843
9023 -257549 -250858 85173 75988 -135264 -262320 -287545 -28541 -49641 340787 -182596 93345
9011 -283003 94445 -58449 -1221 97598 -300340 -221095 -136198 -39415 -334167 279430 -298032
8999 162746 247524 -115615 10844 -297017 149149 -157018 -100380 148654 251358 -43110
8988 154382 -190417 -137423 4416 -237540 -431264 10934 87500 -183707 33265 -178190 -195760
8977 -195760 142275 -170318 10592 112906 -81133 -5580 -133794 121863 72293 -94422 -4958
8965 258944 -295423 -199865 -104884 -124223 -68639 19571 181022 -159306 16192 -26537 203696
8953 -155170 35332 -128255 35777 -73805 12885 -238368 69019 -326738 307895 -66697 115844
8941 -70131 -204813 -63219 -84076 168360 160555 109649 57306 -89300 305178 73573 -77805
8929 -126466 80151 -10402 -27603 137841 17515 135186 624780 1715673 1867532 207914
8918 147747 -103893 -208974 -123232 206299 -69189 -160680 -129086 -84178 95927 -74638 -86943
8907 -86943 103598 -192107 129619 128259 208781 -107902 -294525 -214232 -133685 -58847 -54502
8896 -54502 -54815 19439 -101063 54447 -141562 19094 2533 -325248 346905 -29096 -288262
8885 -288262 -243802 -226129 -124466 -141321 231477 171594 34392 -427603 -141555 -115241 222645
8873 -110100 -244759 -48390 -321390 -346918 28010 234933 -306192 6935 110256 462726 -149750
8861 348884 74941 -74584 14685 53502 -113135 -15055 -139099 85230 -20517 -101314 57681
8849 18432 11287 88983 -287884 4265 117920 -120313 -180849 19679 121470 -26611 -60791
8838 -60791 109925 -156171 -186810 -209409 -138868 -50031 -114203 -154581 -78686 147660 -239384
8826 19942 -380666 -13445 -46467 -208707 33718 264336 69876 -293841 98843 246346 40273
8814 -209821 22501 -6734 -139395 -32850 -371378 -297025 -33122 49667 -144184 129174 58874
8802 -153033 -195028 365227 -46547 -245174 -244422 -349056 -81594 373904 132187 -93345 146749
8790 -411269 -206740 -9316 27808 -68516 33984 63996 80317 100642 415602 -187029 -228569
8779 -228569 -248674 -76317 -1893 -93633 12688 111968 -215143 18353 66577 143257 -80192 -93731
8767 -93731 -91552 118430 -74083 -228220 -175502 17566 -213756 -16564 166870 33713 -7125
8755 -33605 -114109 -258309 194935 71536 2622 -248831 103404 193652 -156941 154496 -96609
8743 30992 126547 -33869 -167256 -89635 -202171 132586 -290298 -150474 -129357 8418 176384
8732 176384 -474014 -167098 16694 -223679 239778 -289404 48524 -220475 44244 -85537
8721 9711 -8885 -94900 146040 -242506 -117358 -106793 -299408 -4482 6924 -35049 -185917 -32030
8708 32453 -472 -125763 51639 -85467 125422 -166303 -125512 136019 59826 -65437 -151810
8697 -151810 -56956 -71808 -294636 -58438 119444 -125271 124989 -200073 -73635 -67915 -268383
8686 -268383 155586 93345 -159599 -154146 -19795 22299 -16915 -26812 83722 51141 51863 -68688
8673 -209770 -45018 -132447 -123986 4405 5261 -92654 -349649 123154 -65874 -47051 -144073 -126348
8661 -126348 -185167 -241639 68776 -56911 84681 -81149 165100 -28571 -22646 116424 -179969
8649 127278 -41104 -41558 -241671 157772 -37272 -47425 -34171 -109608 -218847 124850 -45183
8637 -185786 -169716 -116353 -96476 -165532 160352 -199753 56465 -158122 19274 29453 278658
8626 278658 -11204 211944 41064 212944 36321 244157 -416559 -162490 -238863 -7030 -266702
8615 -266702 137088 124925 -83430 -141295 -128397 -220938 -355489 -49954 248949 67907 86385
8604 86385 -68672 -152095 51682 90957 -22228 -342319 -193046 -217534 93212 87284 86945 1223
8591 127050 99542 -114277 78706 150209 -77348 125615 -85337 -41251 136890 -141835 134642
8579 75051 -238915 86438 219815 -43686 -276291 -104717 -285512 -45812 200507 -51817 -125048
8568 -125048 -434627 -79868 176223 -138129 -190425 93924 204995 -13272 119012 -17995 50630
8556 35151 -218015 69967 -234687 -82393 129972 -190145 -71670 102533 -173684 -68837 96805
8544 86789 -294947 139606 167917 10206 -5829 -9671 -267743 -116454 -55168 84025 149714
8533 149714 -225521 -93033 47505 -55648 -168092 -349675 -8525 -126056 -27983 111120 -118858
8521 -130517 -337792 84923 189749 245920 144879 -144661 223261 -339202 2088 223580
8511 223580 275011 -17529 133756 -14536 -249868 252211 -150186 -121265 -291538 -240694 -274433
8500 -274433 -142292 -106488 -104728 -116278 -172212 59504 293207 -4107 111971 12884 200145
8489 200145 404579 -212203 -154576 -49384 -47091 -102871 -230825 183702 -201500 -259932 18084
8477 10213 -75373 322865 -45822 297051 100484 -238883 131449 243169 49942 77429 -214802
8465 244848 41963 100189 -47853 -280216 204449 83051 -191639 -188113 95050 -143926 -212085
8454 -212085 136694 -267260 -285283 -151980 -136930 -366329 -15650 -56534 -28030 -16219 -152860
8443 -152860 -299080 -184574 -111932 16960 -454330 76290 59593 67810 -186076 70485 -26678
8431 -119441 -276540 -156776 -136154 -272487 -179823 -162962 -41145 19007 -119111 -182376 -108751
8420 -108751 125465 -15512 -146790 -323105 -321801 -26983 98745 5971 -340947 100520 -65147
8408 286227 -146191 90558 -4701 -52139 -9558 67406 -16331 256826 -95393 1280 38847 -210217
8395 -4533 287634 -146088 170052 -22305 -204704 28887 -145598 -71551 206442 -490351 -275798
8384 -275798 157686 146853 -72452 -250791 -390915 -124319 82240 -334467 -83244 -77183 -61969
8373 -61969 -99630 -34995 104036 31105 48104 86754 5241 -219244 79472 53327 -46730 41105
8360 74338 298622 455143 157216 -15244 -233656 -12286 52598 203447 -423830 -157403
8349 -87154 -49925 -112213 -34009 -26034 -37212 84355 27981 -62926 95321 51609 -186324 -6598
8336 -192507 -9040 -59831 -53741 -77567 212203 -71571 45585 -104971 -23243 -361788 -42616
8324 -52048 60992 -66645 -22027 97391 -342951 36787 104564 -4443 -68554 109411 -189685
8312 -293586 200503 -50562 -329703 110499 84449 -243066 3442 68397 28956 175825 -281614
8300 18959 89197 -94125 -121580 -54257 -23148 52544 -172075 11877 -88337 267991 -64179
8288 -130873 -377260 -165004 -211472 -279418 169301 110158 -112366 -70045 -4478 -150558 143502
8276 -181774 -179998 -42554 718 161472 27585 -309899 -169797 8114 -67531 196613 -287846
8264 -31157 47088 -194091 -81764 -167390 -352897 -236521 -15544 -40728 -404848 -138156 25478
8252 136349 -8896 146877 115379 -21795 330678 -63858 -167617 -403125 -37076 -53072 270368
8240 40935 226157 -255186 -84663 -125842 101634 180119 -183430 -168828 24131 92176 106404
8229 106404 -154621 -267896 83817 -321087 -174535 -37932 -29687 24503 -180357 -178205 172126
8217 -7378 -40381 -129744 122565 -182022 -247119 -156728 -37180 44676 -366206 40286 -73915
8205 -162915 -198171 -69623 -311346 67823 386611 73411 45355 141790 -239058 -130369 -354217
8194 -354217 -174079 -46417 -83912 99165 -260755 193183 -116197 -85929 -243209 113176
8183 -201737 255523 431086 -103068 135280 -132452 -4192 -106769 -126390 55456 -35303 -351971
8172 -351971 19700 63204 47991 -418452 -236951 160524 -107997 55466 -141698 -177581 -470317
8161 -470317 -338554 -55311 124594 -184284 -22756 -30850 -222041 111569 78133 -76305 -142739
8150 -142739 -261928 -68724 -38056 328935 226125 -121640 -33255 -9387 146634 65918 43905
8139 43905 196520 50572 14209 -34834 -41118 -22387 129146 -81571 -184063 -257148 244410
8127 126002 -190991 -62123 -200874 -39976 31351 22694 -103397 138776 93800 268776 142484
8116 142484 -11407 163731 -196525 -29028 -30287 167871 180024 -39764 70539 68483 -71548
8104 390007 186451 111958 -367591 -351456 -53880 -45559 -47504 152566 234637 -187562 12730
8092 -36042 -73634 129148 -172680 295992 80928 -24744 -125777 -80562 -350837 -4877 -42347
8081 -42347 102055 -207083 -69865 -17236 -100845 14322 -221649 -10796 50439 8095 -108941
8069 -107317 61162 -35612 -42999 -226748 17324 -106953 -120754 -313836 52587 244157 84098
8057 -1563 73290 -35913 -210792 -267717 271020 195167 -45191 -297225 12131 -48778 -252854
8046 -252854 -147947 -149500 201212 -38168 12006 -170753 149432 88599 211274 -224056 -422950
8035 -422950 23377 99437 -290470 6267 -5193 13463 -291975 -171444 31627 -161517 306198
8023 -50895 37222 62466 117148 99692 -1806 36551 164980 175740 -336645 -100209 -25059
8011 -88873 -172158 17596 -354387 -18840 -56085 -73214 97564 84685 -44412 -470127 -207054
7999 -28761 -70100 -23937 -114638 -270819 -20350 127906 176751 -88968 192523 -74832 12324
7987 197180 -175076 212099 169225 239672 -195613 -138000 -119039 22360 -152419 82591 -27274
7975 109245 10056 226997 -168508 -35677 -264700 -40509 65718 267653 -245164 -235064 -136191
7964 -136191 -19911 -32472 38746 160371 26626 -184266 46973 -196269 -75784 -154137 -92287
7953 -92287 -251613 -19015 30797 -361901 17944 -251774 6673 -25121 -41779 -161780 -161444 107406
7940 20956 -182892 -165677 -109582 -224974 -96017 -107664 368033 190134 -268103 122393 89811
7929 89811 -452149 -159684 198058 -55653 48901 166330 123749 19997 147748 -223742 -18209
7917 -207803 -246276 -142768 68117 -117300 -206439 36034 78314 -193822 -55899 -46642 -208834
7906 -208834 -209443 -121790 -112728 -100527 -87695 288259 203213 75739 312186 -397795 -37953 140176
7893 -86907 -9866 54188 144317 36130 -245509 42032 -19125 190188 181797 178030 -200805 -101575
7881 -101575 144577 -122149 -89611 61777 71971 -177205 199783 340252 132325 -134880
7870 -173580 -19314 18011 82825 103313 105421 -1954 131252 -36013 2096 132614 -116259 -220194
7858 -220194 49175 -44599 -61886 -76854 23505 -191051 28295 72959 -173952 -115389 -65338
7847 -65338 -98731 -17981 -98238 69279 -298344 70308 90226 77249 153826 202803 173790 63175
7834 164834 30878 196438 -2872 -132352 -44979 93401 97357 16617 49838 186344 -14158
7822 60410 3727 -463 -33093 120569 40368 -20596 21940 -130980 160506 -60050 157086 -123161
7809 -138091 -65493 99832 -294892 -304408 3933 51934 -154371 -138983 -31586 130562 60980
7797 -222861 -444 -96164 72779 -256004 -334197 25883 68289 104271 19161 217878 -178374
7785 -217674 -29897 -396372 134359 -264055 213414 27150 -1114 -48221 733 -138693 -51160
7773 87017 -111659 181257 276130 -46172 162351 179051 69483 -179761 -132351 228829 -320856
7761 -51024 26161 24031 -124135 -50387 -51667 -140049 661 -195370 133493 216276 104585 -449574
7748 -106941 -106533 -396041 214509 261515 167437 91126 -47741 77104 60443 51050 -141879 -16913
7735 -152761 240796 15263 43372 -137038 69890 174161 66632 -171255 -55189 -90685 -251945
7724 -251945 -342177 -78179 -220666 -323697 -203014 10339 40664 10983 95255 -42238 -6104
7712 -99678 -241260 193521 -138164 14288 72942 29068 49078 373048 -3151 -136165 111977
7700 -326550 -9617 -147942 182580 -36536 -195394 60177 -31196 -380 -30994 168192 110533
7689 110533 66191 -134086 -130510 111457 218787 -344275 182193 122627 111748 -190450 -29018
7677 -456960 -247097 158683 -262903 -215756 -357932 -121700 -59404 195376 3173 -221966
7666 -58534 -127316 -123089 -444408 164565 -444086 75464 -165661 264385 -73272 20751 127386
7655 127386 122945 40657 -118452 -137741 -142838 -31018 -133711 33829 37482 -152182 -230301 -14302
7642 33857 2965 -27131 -43600 237393 -74333 320 -207394 166824 -107625 59214 -121570
7630 -49425 -166539 -225651 -90643 1160 -21149 242160 151061 -107278 -99959 -40491 9648 65601
7618 65601 -472838 212957 -37041 -215858 -259950 -34833 -22638 -258515 -32399 66089 -96904
7606 -81072 -99399 -192169 265347 83490 194193 158109 82969 -67904 82109 -160188 126567
7594 -60037 16612 -205646 19033 -96495 -420224 -226352 -190786 130564 44266 -83021 -207286
7583 -207286 2839 328632 -105246 -71281 105379 -86867 47513 -120783 -284387 -53406 120976
7571 -51138 -61110 -320763 -70023 -3201 215230 -293888 32256 181340 -399013 -105466 -144225
7560 -144225 -300475 -153034 -6756 111634 -3036 -277479 -288548 181299 -184432 109977 -18115
7548 -42849 -68317 185766 -129932 47287 -24480 16598 -59849 85907 -113750 -109371 -285145
7537 -285145 -68815 296706 30173 224213 68642 -76744 -142605 -69238 -31286 -436536 62011
7525 -23681 -70567 -223946 71010 -25407 33431 16755 -219450 238219 259678 171128 560 -264906
7512 131678 -176145 -32462 -195443 -236145 175480 -468552 -222398 -200668 -15439 4984 243718
7501 243718 139925 80083 294193 -195928 -39248 150547 -98842 -52382 66694 -49704 -357717
7490 -357717 237058 -304316 -77734 -246985 2794 -185314 -189286 74644 -196770 -59040 -213765
7479 -213765 224186 -132914 -41816 313017 20688 -57469 -6788 90148 70084 203277 8911
7467 226716 -19595 -85970 -48509 -139863 -171561 54237 116157 -164938 -49071 226607 144595
7456 144595 -94389 -399491 63519 160562 87959 -25394 -222830 -44414 -4467 -84237 -198095
7445 -198095 -187462 237166 -208434 193043 14505 111262 -10926 -22474 58274 -62140 -192211
7434 -192211 -106898 -169289 -265374 -140586 196126 -51701 -70629 2015 -313742 -122921 420782
7422 53581 320161 90945 -159059 -222397 -41319 197550 232250 3470 -1532 34355 -30595 -288761
7410 -288761 -114234 402582 -251927 90422 174725 218254 -47177 -155686 108109 339255
7400 339255 -194445 -50549 14402 227044 41325 -278795 113101 -120615 35245 85126 -307591
7388 -46027 -114804 -268470 -13849 189428 6163 -162014 -136137 -14915 14041 -171280 135195
7376 -302918 -138904 -51858 -93329 -183729 205705 173807 21165 -298060 -75943 -236745 -81537
7364 -50967 -371807 -60174 -50350 23021 -89575 -473878 151940 -152287 -7586 75247 -323043
7352 -391745 114872 -117353 146262 -314692 175947 52397 -25579 -313897 81931 -152572
7341 -374105 96102 -148606 66995 55927 59819 -498927 156510 127371 172273 -193086 118848
7329 45374 -39356 152021 -125928 -350971 211519 32339 153722 48887 -47466 147900 -23687
7317 -274275 360280 -29166 67860 42790 -36229 61042 -55707 -332092 16903 -213031 -96217
7305 -79373 -114966 186570 179747 -194938 91861 -95142 -346384 -83693 -176684 -86884 115228
7293 90133 74154 -135128 5645 -173314 8139 -119379 65134 -67370 145765 -79217 230562
7281 -204840 -14751 84037 30562 -188302 -58569 -26047 -30198 -129600 -236158 -21925 -181375
7270 -181375 -267010 282950 323684 -12129 -135904 -191063 -195929 135571 -79819 56993 -27250
7258 -45762 -18505 219214 -52822 -208302 -18507 -58136 -115226 -85552 263396 44195 -273914
7246 315557 -137398 -436453 -63240 -54971 -513317 -13333 48521 27283 229319 -204147 -180443
7235 -180443 -39358 91667 -132553 116877 61764 27038 74466 -220218 -186084 116195 -58315
7223 143274 -23377 -37943 33127 -33205 -175550 254520 235293 -115462 90436 -148581 -160254
7212 -160254 -109833 -58964 -149798 -131051 -111255 313848 247616 -60220 -218003 123790 153483
7201 153483 73880 369591 26013 -526953 -62254 -79731 -263431 -372469 -120227 -129630 104576
7189 96200 -131507 69414 48337 -321250 22785 -128999 -118706 -234574 71485 47447 37972
7178 37972 187768 -211670 45015 -54524 -235101 183186 109903 -258809 -76684 481887 209917
7166 -384034 15027 134375 -132001 273198 164021 182240 32866 -16316 -216351 293455
7155 -116933 78303 86308 15214 93306 -36671 -108806 -325850 208182 -253613 -212016 -57369
7143 5147 -19232 -83111 239781 46835 55423 113975 -64367 -266224 11502 182089 -64807 -150376
7131 -150376 -102500 94275 -98527 15094 -19183 -59430 148964 -117894 345868 -103014 -168544
7120 -168544 42858 -291802 119758 -28621 -187249 9422 76237 -223777 161376 -178876 -301557
7109 -301557 -96469 -45212 -249091 185347 71666 122701 92229 -181955 -179803 227464 47760
7097 180122 174563 308318 -253571 -429831 110968 -122745 -66447 277849 55167 107668 117933
7086 117933 82105 189995 108068 134207 -66983 -195685 -35565 65987 -32311 -47292 148962
7074 47644 -199472 17944 -4116 166262 207226 -199902 -62383 -290180 205869 162828 -194015
7062 -66288 -154901 -178419 -85069 -159416 -1579 -239780 -134998 35324 -48747 -258899 70999
7050 -111519 185577 124737 -240076 159387 88076 145723 -73521 108865 -94705 -269896 -31720
7038 350186 148077 104228 236980 -56118 -104056 165902 -55171 -114763 77941 -75130 -8416
7026 81352 162475 87210 35307 -52338 187114 94731 31428 -341498 53114 163928 -41167
7014 -110508 -147619 55691 522260 -298136 -162159 -44240 115212 -54090 -31523 -34602 -104409
7003 -104409 -132637 129656 145309 -52164 -53968 -89532 34807 -94561 -111508 -86387 -310703
6992 -310703 3283 65783 -460811 12266 8124 107000 114585 5853 -28120 -164973 194348 -146252
6979 -25415 -88398 93744 39458 -437517 -21548 358510 -210032 106605 -382370 45841 116340
6968 116340 -1618 43083 127734 -74155 21590 208542 -79973 -124436 -152079 1212 242747 -114843
6955 -66965 18566 214409 -59261 -122311 -50249 43429 115374 -37588 -126059 84370 25803 -65980
6942 213290 -61336 -80119 -42276 85029 109856 -36495 217829 125718 54028 -195032 -169241
6931 -169241 -58237 267864 18189 -42768 -75327 -156470 21148 155576 -125913 44452 -5826
6919 -46178 -191752 -94426 183042 134191 -284631 19458 170843 160944 91448 47460 88434
6908 88434 271341 120748 -120464 134021 -109464 -204650 194136 -64538 271580 -253741
6897 52756 -23948 -197500 -162481 141954 180225 -22617 149616 -138464 -240744 -48757 -111499
6886 -111499 -162915 128965 194609 -171408 -69114 51592 -338633 -80988 -31291 -199018 -143252
6875 -143252 -80696 -21304 197473 -98094 17846 -263174 445380 -170809 266035 -193229
6864 -172387 -204251 215590 -86696 69329 161856 148165 -215916 -234427 -95930 46577 311623
6853 311623 -86694 144234 -173638 40534 -141997 -100508 -466596 -201174 -218969 79819 -376647
6841 143426 130616 69904 197928 165476 111169 223250 -434295 26883 215401 2519 40468
6830 40468 247280 -7591 363021 130632 -198117 49281 -66159 -191998 -112951 -135872 -80634
6819 -80634 -66132 -111250 -104417 -241578 -374325 16521 -168117 63413 -768 -106291 295377
6807 16940 -320274 75378 -164001 -113335 -155210 -97940 989 -69366 -150276 123622 -29775 -216303
6795 -216303 99931 19409 -326122 174099 4 1855 147570 294321 35987 83648 50741 -34401
6782 -7478 -119838 -130971 -138745 139113 -130318 178260 -39284 -40354 -45027 -172970 -249212 317158
6769 -211794 -470918 165948 10641 163420 -75854 -20848 20846 -125642 123190 -309153
6758 151278 -233507 158593 144597 -181761 22311 -116945 103270 -146383 221156 -178726
6747 286087 14206 -9676 60679 -216989 161948 -46860 344971 163046 -250797 77510 -67572
6735 79461 98491 68724 314517 31410 -223158 25139 -330999 41832 -250173 -46758 -158622
6724 -158622 145132 40138 -40992 22980 -115892 17768 -183942 175721 -122455 -293274
6714 -293274 -5729 60240 -63577 258287 115687 -277811 -50462 232309 248677 -172206 -159051
6703 -159051 -34276 -38140 -213553 -15003 -139131 -16929 325978 204900 193289 7595 145644
6692 145644 134097 18741 94007 -1710 -135354 132602 -188120 165800 272704 34222 -52792
6680 100121 22422 -199350 -185245 -18192 -174777 123129 152299 -135445 -10333 -323823 191749
6668 -27670 41183 -97208 56043 -114521 -235642 211657 72872 43502 -24506 212845 25577
6656 -140008 236076 -48548 -51617 -8464 128848 -49931 -368165 -21491 74779 -110971 -97603
6645 -97603 24575 66692 -144512 164763 29218 -302534 -22349 -48096 -34714 20423 -47360
6633 163560 -106099 99221 132820 66427 42594 -106929 -303007 46985 -46551 73507 2791
6621 -118185 274820 -9113 -34699 -68613 12680 -133718 244470 11603 -424485 -195434 76898
6609 119794 -47202 -104404 -148359 -40149 -34890 180016 -27589 -275233 -65456 108134 -69 353442
6596 -31064 -111905 -11794 -1774 136091 66388 -6998 -19696 65015 -276768 -57497 -16915 -179955
6584 -179955 -238465 -4514 -40421 34569 103205 -47965 84088 177678 -68415 52916 45185 180390
6572 180390 67509 -68528 -143791 24816 -156772 73261 -23652 -317139 249644 159719 131139
6561 131139 -100703 2697 -59365 -17718 -428465 102082 -173256 7846 -186529 116472 -50609
6549 -316565 -78989 -16616 216738 -104348 -70032 -116476 -110911 -106111 19472 -71030 163173
6537 -393408 54850 -144102 -49075 118864 -195007 -207258 -26507 -203615 -77138 -408048 108222
6525 264420 -173679 276814 -180970 -9403 44416 -40105 80792 7445 -28608 -213536 -168793
6514 -168793 -237798 226905 -93988 -179369 298766 -57269 213042 197428 -75025 47974 241574
6503 241574 164842 -29318 81014 -172537 -29239 94208 73013 87251 106084 222665 38273
6491 -13930 259323 331093 -28667 129167 54882 38132 129197 -75430 4107 117657 -78110
6479 96680 -208092 -79800 28077 -143751 -284884 280314 -52929 204573 -220541 -62162 -176199
6468 -176199 -46948 -257091 -14400 -30685 12961 -60693 -142102 64257 193205 -6635 -111255
6457 -111255 77816 101792 -55317 75575 13869 -103767 -105217 -48385 -93435 -53717 104636
6445 14631 -86913 41727 155013 -181651 298 92755 -41792 -323445 219719 193360 -97372
6433 -242209 -292894 -115538 -321698 -70813 140061 -186236 -21914 53628 -61084 -65626 -319063
6422 -319063 247520 40872 -242314 90821 155957 71729 -136816 -60479 -370092 -226237 238730
6410 -2229 -126933 -16918 127743 -132511 -86531 151346 -101077 -104594 67886 32478 -4767
6398 56353 191303 -104745 13244 129886 -245667 -40286 -33752 -37800 240808 32691 153478
6387 153478 259846 -119333 -959 -113232 -189733 -168686 76821 -123292 -39125 218249 -35367
6375 44796 108229 95145 220456 60020 12529 387216 219705 -88899 24779 96233 -63168
6363 -290351 -167382 -313344 -5884 136610 31930 107360 40788 -50745 133276 -293823 242042
6351 -44719 120588 103256 10519 -143531 213187 179159 168564 263317 151039 -227490 -30859
6339 -49535 -213029 86063 -154450 -56408 211354 -90412 -182373 -166789 -68810 -198817 -227341
6328 -227341 -222429 -46153 -120084 -100866 104011 -199087 -61792 64858 -154720 95348 -7048
6316 68232 161167 81529 -129530 182856 -42739 -22507 111064 303042 -93923 217810 88787
6304 -24510 -27485 60344 -26180 -65330 -103893 -330071 -389751 44427 -9971 20330 -141658 -104398
6292 -104398 165685 47879 -15127 27889 186722 -142614 -4561 -171430 93535 155822 -148019
6280 -127031 67785 89566 38287 179668 -295718 -116889 9555 -134117 241605 14684 203952
6269 203952 195282 -162882 400965 -197575 -130989 47448 -176514 -59576 98103 26106 136944
6258 136944 120333 112639 152988 -54249 -99452 -55152 -202641 -70325 -70385 296546 119217 108788
6246 108788 -10908 116901 -60010 -167084 -218076 41811 49075 154726 -220512 -164211 -29031
6234 -207568 181062 -63864 -36086 -263193 187107 -224386 -532 118777 -136545 97013 364708
6223 364708 114509 102101 393690 145253 120099 -184405 6476 276461 -5804 43665 -84896
6211 90850 249550 -377597 170056 -118203 -193109 -196952 121652 245762 -51921 -22725 108240
6199 -137325 -164543 -226642 -132423 72925 -143620 -60971 99437 -5695 -211356 -77381 -100925
6188 -100925 27080 42267 -41767 28117 211645 -85174 141375 130844 -237491 -111304 121161
6176 -84458 50062 -19006 193097 222136 14134 74021 -455409 76012 184207 96760 59951
6165 59951 80325 309360 -96053 148572 38524 -24449 25021 129260 -65507 -14331 -56643
6154 -56643 224817 102797 78597 1275 120206 -62869 -151114 53496 74392 10723 89969
6143 89969 -170252 331647 169170 -113136 -56785 124673 74414 -62345 -115038 -280793 -90143
6131 -76699 47906 54868 -293521 194925 169366 -37362 -243122 -260666 13904 -134037 5453
6119 110649 3222 -269027 -219016 -52562 21471 292805 -159214 -106979 -119331 105515 -34210
6107 -38975 -127133 81401 -225090 -243370 -34125 -27913 81818 81355 16546 113897 -296612 153159
6094 37980 -38505 41050 94234 -4384 104108 -341932 34464 1341 -52306 -260613 115469
6082 5399 -79807 -61695 22942 -8184 101405 80341 -25713 -141376 -28735 364402 -146104
6070 -332473 -52475 21481 91400 26649 -172013 -186572 -87677 -67121 241545 181769 14743
6058 -35249 38609 -25087 -276506 -10865 238572 -10747 -107274 -11659 -286983 74750 -254806
6046 -133960 -177547 -13579 -1942 113127 11862 17200 144392 173684 81547 -308514 -60624
6034 -163639 -11804 -96353 -215048 78836 -34473 110233 -117838 73845 -12330 68037 122311
6023 122311 -70654 97540 55799 -44241 6752 -113530 78351 183678 -49617 -49573 -54770 422237
6010 -153396 -327851 71127 134471 237903 116482 -49141 -208465 -81722 -80620 198593 189344
5999 189344 -27956 -33132 246722 -154138 101266 -176683 -101738 -23103 134183 48015 -460784
5987 -159305 163009 -101455 4471 -60394 110637 19996 -201778 75612 224282 229842 33376
5975 -165816 -17707 25255 61137 127991 11139 -238331 -333962 213204 -46838 -96181 -123518
5964 -123518 167266 118977 -311641 -250407 56223 213850 -106521 19447 -42068 -163451 -32064
5952 -54800 230204 -43541 114758 -47929 121942 -59404 804 -225504 20775 -239 -266241 69643
5939 136069 -44415 -167644 119289 182430 121955 -12236 186751 -33909 -135838 -166063 -67203
5927 -98382 78443 -61678 -250888 238898 -133093 -11995 -93423 189345 124300 -250231 -229770
5916 -229770 7365 -235843 -38442 30343 74579 60804 257295 169253 61438 -12288 -68338
5905 -68338 367268 157198 -75032 31617 -64379 261364 -41106 -54365 -25490 -223946 -205301
5894 -205301 -162548 218123 -18866 9274 -187276 -272133 -278125 -218486 -146790 -16694 20034 55167
5882 55167 -134365 -132185 19094 -176351 191260 128633 -179944 41457 -238845 -48795 80527
5870 300579 2556 -43185 99619 -8006 -40020 -204530 -490337 -320324 120258 -13103 -233357
5859 -233357 -163384 189403 130982 126498 852 115011 -255956 301278 -19660 54048 -184879
5847 91695 -168759 194054 151165 -171400 -3811 -173756 -151967 -253685 -160315 16868 143317
5836 143317 10532 -294661 70911 71991 132097 279930 250971 -74156 -58907 -88054 389639
5824 92694 133229 -322566 -158871 2583 381653 36373 88460 94661 -125834 169910 -262249
5812 98686 -103296 -225074 -208025 84379 187053 79847 100901 40354 169090 -43752 -177397
5801 -177397 75360 133617 -93040 178214 -30241 323343 -188834 -4552 -244925 22377 132199
5790 132199 -361 -48026 171401 245236 387240 -13442 -21846 -68927 -108365 103711 -113915
5778 23370 99283 14775 76111 -90486 1328 233650 206116 37638 -83963 -175715 -163980 -274828
5766 -274828 96846 201087 215284 -151879 72869 -74071 301525 -198189 -10925 37813 -27710
5754 -132015 6327 -44175 -12942 -14536 39737 16659 -112831 -64621 -109177 -174912 114760 11707
5741 -230614 -119529 62599 115479 -59388 -72837 -136400 -82014 -234082 323618 -65681 -215845
5730 -215845 202802 -174313 -124981 -77826 -145392 -106925 -336717 -126421 -198659 -267760 338246
5718 -164146 -304532 -341326 -188693 272763 117037 -121310 102763 31386 -13166 100989
5707 -155401 123250 -297797 -201078 -76526 -104333 140533 -227067 -50906 64105 -131822 -36630
5695 -142435 40179 37072 -240 -263694 197119 -30806 -75244 70337 27044 295931 260161 -305885
5682 179185 139705 4345 -25668 171242 -74296 -112246 75684 273490 26310 -108702 62122
5670 -27049 -41260 -243037 203808 -217445 17409 -3756 151515 13707 79609 46082 -90287
5658 -109791 -99345 -147075 231327 -79567 24382 -107664 40975 181278 -347653 -32993 144306
5646 -6764 179231 59182 50014 -38282 -129887 -285871 -43272 164258 -305232 298060 -40632
5634 88327 -212560 -100853 72248 -11197 -114628 339481 -374757 -3376 -28071 87054 -35149
5622 -57301 -2551 -470068 -94765 184593 -383673 -219172 -132728 -138330 -123287 111937 -93262
5610 118433 -73876 245595 142485 166232 -342992 -140754 43519 -297079 22547 -112003
5599 -122825 -234597 -58425 -15851 45289 70363 -128336 60538 -218565 -246026 -34630 -109257
5588 -109257 -220194 81131 92862 -181087 138938 7653 151644 -138319 166192 69238 -149242
5576 249625 -25019 160406 -218607 138288 -247031 107365 28798 -96463 -1570 85423 101483
5565 101483 298393 11754 126305 71228 29538 -312477 62175 -151086 72028 -283681 88471
5553 246490 -64150 168924 277278 145430 10960 -55271 -166146 94391 10284 16551 -261495
5541 153523 -17280 -116217 -287223 -250956 99281 -13335 -20108 -145213 -50369 80668 -66606
5529 106662 -178031 -213277 143965 81886 -113826 -90928 -79128 302031 -17396 4180 -5834
5517 3160 79822 34669 -68499 -23289 -204416 -102419 299066 263041 120175 99938 -96928
5505 254890 -167307 238629 -292908 -49578 234126 -91838 -383 -79442 119078 108213 -142625
5493 -50047 -76744 -8175 19318 111314 -348001 -80447 -200289 129587 17931 -150581 126611
5481 86668 -14862 1601 113066 32767 259714 -151247 103274 -108051 187675 -57097 -237366
5470 -237366 -101687 -67232 -83177 -24601 87860 -143951 114099 6798 -193791 196818 -79984
5458 183260 43338 -58643 35825 16815 47778 -197927 -99785 -106552 102691 -38570 -62875
5447 -62875 -245037 163665 -254468 94252 -24037 -8917 221408 70613 287497 225264 -360119
5435 60590 84299 -56850 -46083 24961 146136 42925 10124 29400 65850 16750 50740 -254166
5422 112012 25847 58244 -32498 -28379 -125777 -109926 -9319 -192626 -260917 151534 134078 -33398
5409 -246351 54214 -23523 164243 -133249 116901 -68599 -15619 154093 23951 -269255 -13296
5397 39778 -13158 -33547 85294 -276015 -63540 230883 185487 -345192 347577 -292496 -136307
5385 282770 -117946 137735 -127946 -247469 -230129 116957 -263728 182051 121361 82875
5375 82875 127008 -15030 -51503 -301711 -40042 -479426 161922 11881 328993 -123627 286097
5363 1716 -181578 17414 151608 31334 50589 74472 -419983 81515 249479 254328 199626
5352 199626 -73680 130692 -137403 175606 270682 80792 -90226 201712 -191609 127158
5341 -48124 -1350 179025 -222138 21981 40506 153713 -138265 -130893 -195780 409038 88911
5329 299666 90670 -288952 -44755 -156786 281172 -161126 -65886 -325050 -122900 -134508
5319 -134508 126996 -55197 247673 -30604 -88792 -52029 -12527 -36011 110294 228107 -335689
5307 -30877 -148579 16408 -29210 -12843 -16263 -125912 -106732 -37530 -73296 -108495 -32340 -162014
5295 -162014 -38581 221318 -93658 38552 84516 -114482 -21442 196244 -28809 -126067 139164
5283 135162 -391666 -10308 -43663 129444 -18786 -153291 -21210 -121908 70786 186535 -16835
5271 198953 274554 -142118 11574 46383 -151406 91521 -281422 124839 -62018 61412 -59024
5259 -98605 -22057 -216486 110277 -224401 26737 24492 167166 192668 -152945 -244174 -123875
5248 -123875 216504 -187791 -62112 89012 84437 -6230 -90619 -193382 -100966 -104519 5789 26958
5236 26958 167043 1510 -57143 5366 -58042 7187 249991 -83623 -398600 27192 -72806 -143393
5224 -143393 -307291 63374 -157943 -129875 -235522 1078 65937 -131423 -141411 45651 130762
5213 130762 201617 -272076 -5160 -132987 -216232 -75503 141328 -73202 -288674 -51742 -79381
5202 -79381 118294 -14955 -162046 70342 161842 68578 -194205 112920 266897 121085 58925
5190 -226218 -53546 -72147 -110713 31186 -28281 -280708 -136143 133931 186173 -151026 31132
5178 212763 25424 116045 -53637 298549 31962 -24926 -39246 266038 -44355 -192718 -122835
5167 -122835 171909 -220649 -184075 -50107 65491 -27046 215472 91919 120840 -167499 -113447
5156 -113447 287767 171486 13869 27764 100375 -25300 -213329 18771 -151059 -60757 -29458
5144 -147671 210615 -168863 -57426 156665 -104331 -189298 232127 96297 94762 -331029 118851
5132 -135356 31252 -266901 181927 56298 79949 21807 -202638 -106449 92224 58558 -164615
5120 -107066 -117726 211048 47564 -145323 -41170 -221474 252246 262934 249150 -48596 178727
5108 190883 220818 206210 -321249 26425 -93048 -65459 -82363 54620 2556 -191075 56763
5096 -35033 38940 528420 -43826 -122736 21314 -23722 263019 -25767 191205 -134192 265473
5084 1902 261374 -138147 82411 68738 449770 -99064 96942 333920 -58645 9108 -409739
5072 -55148 -77848 -204037 145383 193322 392949 -75620 8592 206164 54607 -278713 38326
5060 133901 64615 171859 -21559 89048 238388 -91354 185024 -77111 -1222 193290 -68319
5048 -324700 -125219 18743 269262 175931 37999 152954 40270 -94899 -8609 -34961 -19352
5037 -19352 124042 -178373 58167 -135574 -8847 115560 10699 189247 -32723 40990 278252
5026 278252 104693 -6267 117906 -156391 59409 15770 113831 183820 -179829 -49442 139943
5014 83627 -301202 -67252 -85754 -133589 127717 339216 110871 -142171 -220033 -238158 -34294
5002 -38213 -309922 -276218 -199572 -19178 6787 -250748 -15089 -214058 -77098 -297992 96725
4990 170063 140605 -143119 -54524 143840 -246312 50725 90903 115224 -90220 -13875 59454
4978 96168 -38110 190619 -81073 -165952 -54205 28110 -275024 -13289 179599 -176355 -131547
4967 -131547 361923 -155511 87034 -81465 -22909 177038 -144814 40823 12338 116555 -17541
4955 -405793 276357 58769 -102027 131961 397 -47037 -61621 -19909 -203466 175253 -313810
4943 130248 -102049 -372624 17313 -212135 146966 231575 52474 436652 -44580 -127843 15692
4931 89236 -106434 -322142 229981 43791 -246716 344192 123755 28450 -9746 450535 49062
4919 -10786 17145 63247 198546 -221746 21668 177923 -234990 -178011 300875 -298054 69756
4907 -136466 113145 -98952 309198 114506 58578 -31066 191657 12986 194490 -129728
4896 124933 -133825 -218135 -72876 19186 -122613 -77991 -204595 236573 28541 93216 360406
4885 360406 76863 -95771 -91495 71920 -32191 41362 -79020 -105235 -147471 -181574 24056 20387
4873 20387 45073 68125 107290 -139349 -195727 -34810 -2902 141492 -102070 104384 -47214
4861 60051 26356 -304412 119641 294044 -57681 -267155 -280602 -504779 -142349 -88794 -140375
4850 -140375 172714 25662 416735 -2364 -56373 -48802 34264 -11855 -170554 -125002 -100091
4839 -100091 25127 24098 -125838 75807 496124 -157713 120903 159476 -120161 64621 28994
4827 -154890 47558 146666 136349 -6623 -25162 61816 -77827 146025 -12463 169108 -103164
4815 -39871 -380925 -77818 180672 235986 23343 -33697 -62923 195695 285049 6932 128303
4804 128303 200381 166960 435482 311150 -298673 201800 37112 317100 -367740 -550 -217145
4793 -217145 70776 245091 45187 96868 -121149 171909 58947 -351318 168838 -72751 -114399
4782 -114399 158926 219313 -198725 228049 -116834 230747 -41608 -246602 92169 -469566
4771 112569 39905 -42556 -92587 -72411 -36269 -144194 -6524 -280534 -112428 -204681 255106
4759 -110540 162908 324475 83851 96509 215092 364566 -164478 -209735 -139428 -191903 206711
4747 30969 208151 -135333 35027 118481 39549 42306 -61417 -171382 -112743 -113318 -153884 63010
4734 -53997 38123 100655 81547 137340 -41631 65023 175738 219446 -336393 108374 -234180
4722 -220101 -149735 318041 -112550 -112999 -19930 154047 23300 -228959 79237 138187 206335
4711 206335 -39577 269070 167454 192633 -20324 -163589 95851 -133291 48698 160797 97686
4700 97686 22264 -92615 -301611 87098 -56088 -267797 269843 -204611 95233 197352 -78504
4688 184803 -490403 -159767 117507 7003 144402 152043 185373 226449 62130 200264 2515
4676 -16817 177762 185102 -297051 15113 -121257 127015 -151232 349488 113660 235361
4666 235361 318474 -49149 17215 117504 -210634 -189539 -86339 291147 -125820 -28157 30963
4654 -24667 78456 -114791 -69710 -70740 122561 -224688 -50304 -99327 -155173 22240 216323
4643 216323 -15975 -368113 -218994 144378 -94162 -72302 271367 74088 476 -87486 175558
4631 84662 -24472 156577 51619 133155 -41498 155997 -3439 -269837 126071 -377892 -53114
4619 -74199 42103 -349216 -31672 367539 267061 412553 -65468 -100135 133188 -19129 -44285
4608 -44285 -182986 -84200 -65287 -130911 -141882 163686 -249197 -268665 -50205 -165184 108086
4596 -25131 -345579 -207395 -43913 -69898 416993 154672 42579 -136419 -78377 45945 160912
4585 160912 224422 52622 -139521 8203 -144651 142708 -254411 21612 -44324 96751 15831
4573 -154566 -143557 -143488 -54364 68106 26964 -234618 33054 14649 151427 47885 -23913 102527
4560 174696 1225 93253 -84697 -120224 -109911 207814 -243752 8296 65623 -114362 -158048
4549 -158048 134159 -140269 220924 183334 -284004 163306 -133691 302073 451361 -51475
4538 -203043 38781 253426 325395 -192939 23340 30739 319742 334777 146238 370271 -15793
4526 -78700 -97429 109387 131101 189771 -199305 62564 -146011 143125 296392 -31017 -93479
4515 -93479 107210 173652 -187307 228855 -436105 301860 -238718 -36459 -115858 377669
4504 215416 -157036 31449 120669 -305863 -178382 -249352 29821 -131039 14309 132623 -217065
$$ [...]
##END NTUPLES=NMR SPECTRUM
##END=
