##TITLE=AC1723_GUAAH15009_9207587_fpcR8WeXAq
##JCAMPDX= 6.0         $$ Bruker NMR JCAMP-DX V2.0
##DATA TYPE= NMR SPECTRUM
##DATA CLASS= NTUPLES
##ORIGIN= BRUKER
##OWNER= Administrator
$$ 1.72 TOPSPIN		Version 2.1
$$ 2015-06-01 20:39:42.436 -0700  Administrator@X
$$ Compression mode = diff/dup
##.OBSERVE FREQUENCY= 400.02188249412
##.OBSERVE NUCLEUS= ^1H
##.ACQUISITION MODE= SIMULTANEOUS (DQD)
##.ACQUISITION SCHEME= undefined
##.AVERAGES= 64
##.DIGITISER RES= 22
##SPECTROMETER/DATA SYSTEM= spect
##.PULSE SEQUENCE= noesygpps1d.comp
##.SOLVENT NAME= COFFEE_meoh
##.SHIFT REFERENCE= INTERNAL, COFFEE_meoh, 1, 14.96092
##AUDIT TRAIL= $$ (NUMBER, WHEN, WHO, WHERE, PROCESS, VERSION, WHAT)
$$ ##TITLE= Audit trail, TOPSPIN		Version 2.1
$$ ##JCAMPDX= 5.01
$$ ##ORIGIN= Bruker BioSpin GmbH
$$ ##OWNER= Administrator
$$ $$ E:\/data/COFFEE/nmr/AC1723_GUAAH15009_9207587_fpcR8WeXAq/12/pdata/1/auditp.txt
$$ ##AUDIT TRAIL=  $$ (NUMBER, WHEN, WHO, WHERE, PROCESS, VERSION, WHAT)
(   1,<2015-06-01 20:39:37.233 -0700>,<Administrator>,<X>,<go>,<TOPSPIN 2.1>,
      <created by zg
	started at 2015-06-01 20:28:07.795 -0700,
	POWCHK enabled, PULCHK disabled,
       configuration hash MD5:
       21 0F 79 D6 B3 7B B4 F6 88 20 88 DB 03 48 BD 9F
       data hash MD5: 64K
       C9 C2 20 6A 75 E3 E0 38 5E 2F 58 5C 20 1E 43 60>)
(   2,<2015-06-01 20:39:40.389 -0700>,<Administrator>,<X>,<proc1d>,<TOPSPIN 2.1>,
      <Start of raw data processing
       efp LB = 0.3 FT_mod = 6 PKNL = 1 PHC0 = 0 PHC1 = 0 SI = 128K 
       data hash MD5: 128K
       41 78 86 94 46 15 EB 0D AC 90 F1 80 36 3B 9F C3>)
(   3,<2015-06-01 20:39:41.264 -0700>,<Administrator>,<X>,<proc1d>,<TOPSPIN 2.1>,
      <pk PHC0 = -88.33557 PHC1 = 0 
       data hash MD5: 128K
       D0 37 FD 1A 73 FF EE B7 DA 39 B8 56 A0 ED E0 99>)
(   4,<2015-06-01 20:39:41.639 -0700>,<Administrator>,<X>,<proc1d>,<TOPSPIN 2.1>,
      <abs ABSG = 1 
       data hash MD5: 128K
       92 AB 10 9A 21 14 63 74 B9 CB 67 0F 9E 08 0E BD>)
(   5,<2015-06-01 20:39:41.733 -0700>,<Administrator>,<X>,<proc1d>,<TOPSPIN 2.1>,
      <abs ABSG = 2 
       data hash MD5: 128K
       62 F8 06 3D E0 BE 1A 59 79 78 C2 31 A5 68 17 F1>)
(   6,<2015-06-01 20:39:41.826 -0700>,<Administrator>,<X>,<proc1d>,<TOPSPIN 2.1>,
      <abs ABSG = 3 
       data hash MD5: 128K
       C0 10 B1 C5 67 27 FA 87 70 2E 4E 5B FE 11 B5 E9>)
(   7,<2015-06-01 20:39:41.920 -0700>,<Administrator>,<X>,<proc1d>,<TOPSPIN 2.1>,
      <abs ABSG = 4 
       data hash MD5: 128K
       40 9A 38 42 3D 19 52 3B 54 88 1E D4 F7 EB FC A3>)
(   8,<2015-06-01 20:39:42.030 -0700>,<Administrator>,<X>,<proc1d>,<TOPSPIN 2.1>,
      <abs ABSG = 5 
       data hash MD5: 128K
       3D 49 0A 70 41 EC 78 35 A4 E0 90 20 33 59 0F CF>)
$$ ##END=
$$ 
$$ $$ hash MD5
$$ $$ A5 04 AF 87 7B 9D 15 2E 51 1A DF 0D 7D 49 79 7A
##$RELAX= 
##$RELAX= 
##$RELAX= 
##$RELAX= 
##$RELAX= 
##$RELAX= 
##$RELAX= 
##$RELAX= 
$$ Bruker specific parameters
$$ --------------------------
##$DU= <E:\>
##$EXPNO= 12
$$ [...]
##$TP07= 0
##$TPNAME0= <>
##$TPNAME1= <>
##$TPNAME2= <>
##$TPNAME3= <>
##$TPNAME4= <>
##$TPNAME5= <>
##$TPNAME6= <>
##$TPNAME7= <>
##$TPOAL= (0..7)
0.5 0.5 0.5 0.5 0.5 0.5 0.5 0.5
##$TPOFFS= (0..7)
0 0 0 0 0 0 0 0
##$TUNHIN= 0
##$TUNHOUT= 0
##$TUNXOUT= 0
##$USERA1= <user>
##$USERA2= <user>
##$USERA3= <user>
##$USERA4= <user>
##$USERA5= <user>
##$V9= 5
##$VALIST= <valist>
##$VCLIST= <CCCCCCCCCCCCCCC>
##$VD= 0
##$VDLIST= <DDDDDDDDDDDDDDD>
##$VPLIST= <PPPPPPPPPPPPPPP>
##$VTLIST= <TTTTTTTTTTTTTTT>
##$WBST= 2048
##$WBSW= 25
##$XGAIN= (0..3)
0 0 0 0
##$XL= 0
##$YL= 0
##$YMAX_a= 7102378
##$YMIN_a= -7832131
##$ZGOPTNS= <>
##$ZL1= 120
##$ZL2= 120
##$ZL3= 120
##$ZL4= 120
##$ABSF1= 14.96092
##$ABSF2= -5.597261
##$ABSG= 5
##$ABSL= 3
##$ALPHA= 0
##$AQORDER= 0
##$ASSFAC= 0
##$ASSFACI= 0
##$ASSFACX= 0
##$ASSWID= 0
##$AUNMP= <proc_prof1d_extract.lims>
##$AXLEFT= 0
##$AXNAME= <>
##$AXNUC= <1H>
##$AXRIGHT= 0
##$AXTYPE= 0
##$AXUNIT= <>
##$AZFE= 0.1
##$AZFW= 0.1
##$BCFW= 0
##$BC_mod= 0
##$BYTORDP= 0
##$COROFFS= 0
##$CY= 15
##$DATMOD= 1
##$DC= 0
##$DFILT= <>
##$DTYPP= 0
##$F1P= 0
##$F2P= 0
##$FCOR= 0.5
##$FTSIZE= 131072
##$FT_mod= 6
##$GAMMA= 0
##$GB= 0
##$INTBC= 1
##$INTSCL= 1
##$ISEN= 128
##$LB= 0.3
##$LEV0= 0
##$LPBIN= 0
##$MAXI= 10000
##$MC2= 0
##$MEAN= 0
##$ME_mod= 0
##$MI= 0
##$NCOEF= 0
##$NC_proc= -2
##$NLEV= 6
##$NOISF1= 0
##$NOISF2= 0
##$NSP= 0
##$NTH_PI= 0
##$NZP= 0
##$OFFSET= 14.96092
##$PC= 1
##$PHC0= -88.33557
##$PHC1= 0
##$PH_mod= 1
##$PKNL= yes
##$PPARMOD= 0
##$PPDIAG= 0
##$PPIPTYP= 0
##$PPMPNUM= 2147483647
##$PPRESOL= 1
##$PSCAL= 4
##$PSIGN= 0
##$PYNMP= <proc.py>
##$REVERSE= no
##$SF= 400.020009670066
##$SI= 131072
##$SIGF1= 0
##$SIGF2= 0
##$SINO= 400
##$SIOLD= 131072
##$SPECTYP= <>
##$SREGLST= <1H.CDCl3>
##$SSB= 0
##$STSI= 131072
##$STSR= 0
##$SW_p= 8223.68421052631
##$SYMM= 0
##$S_DEV= 0
##$TDeff= 65536
##$TDoff= 0
##$TI= <>
##$TILT= no
##$TM1= 0
##$TM2= 0
##$TOPLEV= 0
##$USERP1= <user>
##$USERP2= <user>
##$USERP3= <user>
##$USERP4= <user>
##$USERP5= <user>
##$WDW= 1
##$XDIM= 131072
##$YMAX_p= 267597351
##$YMIN_p= -371792627
##$CURPLOT= <Network HP LaserJet P1505>
##$CURPRIN= <$Network HP LaserJet P1505>
##$DFORMAT= <normdp>
##$LAYOUT= <+/1D_H.xwp>
##$LFORMAT= <normlp>
##$PFORMAT= <normpl>
##$SURQMSG= 1
$$ End of Bruker specific parameters
$$ ---------------------------------
##NTUPLES= NMR SPECTRUM
##VAR_NAME=  FREQUENCY,     SPECTRUM/REAL,   SPECTRUM/IMAG
##SYMBOL=    X,             R,               I
##VAR_TYPE=  INDEPENDENT,   DEPENDENT,       DEPENDENT
##VAR_FORM=  AFFN,          ASDF,            ASDF
##VAR_DIM=   131072,        131072,          131072
##UNITS=     HZ,            ARBITRARY UNITS, ARBITRARY UNITS
##FACTOR=    0.0627417313425164, 1,          1
##FIRST=     8223.62146879497, -1268,        -37722
##LAST=      0,             -997,            -38686
##MIN=       0,             -371792627,      0
##MAX=       8223.62146879497, 267597351,    0
$$ Real data points
##PAGE= N=1
##DATA TABLE= (X++(R..R)), XYDATA
$$ [...]
$$ plain form
62904 437087 432892 428843 425146 421575 417865 414023 410257 406943 404643 403744 404007 404750 405528 406304 407009 407422
62888 407422 407564 407746 408033 408132 408026 408221 409039 410120 410994 411725 412497 412967 412679 411907 411470 411764 412484 413190 413552
62869 413552 413134 411592 409213 406701 404347 401995 399906 398879 399102 399581 399305 398532 398258 398770 399469 399965
62853 399965 400613 401836 403522 405286 406871 408095 408796 409086 409300 409478 409225 408296 407030 405874 404760 403359
62837 403359 401778 400543 399872 399367 398517 397222 395706 394177 392758 391577 390733 390245 390117 390414 391249 392756
62821 392756 395068 398133 401534 404749 407637 410453 413277 415824 418085 420786 424697 429612 434549 438995
62807 438995 443415 448420 453933 459515 465048 470650 476235 481791 487995 495932 505933 516979 527576
62794 527576 537140 546491 557172 570429 586647 605560 626890 650784 677637 707669 740941 777819
$$ packed form
62904D37087m195m049l697l571l710l842l766l314k300q99K63P43P78P76P05M13
62888D07422J42J82K87R9j06J95Q18J081Q74P31P72M70k88p72m37K94P20P06L62
62869D13552m18j542k379k512k354k352k089j027K23M79k76p73k74N12O99M96
62853C99965O48J223J686J764J585J224P01K90K14J78k53r29j266j156j114j401
62837D03359j581j235o71n05q50j295j516j529j419j181q44m88j28K97Q35J507
62821C92756K312L065L401L215K888K816K824K547K261K701L911M915M937M446
62807D38995M420N005N513N582N533N602N585N556O204P937J0001J1046J0597
62794E27576R564R351J0681J3257J6218J8913K1330K3894K6853L0032L3272L6878
$$ plain form
62782 777819 819161 865906 918598 977315 1041815 1111516 1185527 1262994 1343395 1426180 1510015
62771 1510015 1592606 1671395 1744301 1809668 1865701 1910301 1941590 1958427 1960352 1947311 1919722
62760 1919722 1878802 1826467 1764770 1695534 1620525 1541722 1461110 1380356 1300821 1223733 1150074
62749 1150074 1080344 1014739 953540 897086 845390 798133 755107 716355 681771 650956 623675
62738 623675 600123 580341 563580 548654 534915 522575 512067 503369 496043 489761 484673 481263
62726 481263 479801 479896 480760 481991 483853 486626 489989 493447 497206 502154 508995 517812 528424 540674
62712 540674 554292 569064 585401 604332 626642 652403 681617 714783 752353 794044 839443
62701 839443 889130 944477 1006204 1073716 1146054 1222944 1304582 1390783 1480747 1573284 1666707
$$ packed form
62782G77819M1342M6745N2692N8717O4500O9701P4011P7467Q0401Q2785Q3835
62771A510015Q2591P8789P2906O5367N6033M4600L1289J6837J925j3041k7589
62760A919722m0920n2335o1697o9236p5009p8803q0612q0754p9535p7088p3659
62749A150074o9730o5605o1199n6454n1696m7257m3026l8752l4584l0815k7281
62738F23675k3552j9782j6761j4926j3739j2340j0508q698p326o282n088l410
62726D81263j462R5Q64J231J862K773L363L458L759M948O841Q817J0612J2250
62712E40674J3618J4772J6337J8931K2310K5761K9214L3166L7570M1691M5399
62701H39443M9687N5347O1727O7512P2338P6890Q1638Q6201Q9964R2537R3423
$$ plain form
62690 1666707 1758506 1845581 1925045 1994704 2052813 2097604 2127254 2140262 2135841 2114035 2075637
62679 2075637 2022030 1955123 1877308 1791275 1699656 1604748 1508599 1413296 1320969 1233358 1151315
62668 1151315 1074874 1003860 938409 878845 825193 777000 733616 694461 659050 627066 598602
62657 598602 574040 553387 535783 519924 504936 490629 477076 464358 452714 442412 433238 424526
62645 424526 416050 408557 402920 398907 395271 391139 386846 383272 380699 378636 376509 374217 372042 370267
62631 370267 368928 367786 366568 365293 364274 363659 363058 361856 359988 358190 357413 358047 359825 362209 364730
62616 364730 367063 369080 370936 372957 375379 378309 381959 386712 392807 400079 408116 416625 425540 434929
62602 434929 445111 456849 471104 488297 507923 529154 551830 576706 604694 636068 670472
$$ packed form
62690A666707R1799Q7075P9464O9659N8109M4791K9650J3008m421k1806l8398
62679B075637n3607o6907p7815q6033r1619r4908r6149r5303r2327q7611q2043
62668A151315p6441p1014o5451n9564n3652m8193m3384l9155l5411l1984k8464
62657E98602k4562k0653j7604j5859j4988j4307j3553j2718j1644j0302r174q712
62645D24526q476p493n637m013l636m132m293l574k573k063k127k292k175j775
62631C70267j339j142j218j275j019o15o01j202j868j798p77O34J778K384K521
62616C64730K333K017J856K021K422K930L650M753O095P272Q037Q509Q915R389
62602D34929J0182J1738J4255J7193J9626K1231K2676K4876K7988L1374L4404
$$ plain form
62591 670472 707458 746673 787516 828883 869369 907602 942308 972307 996682 1014890 1026500
62580 1026500 1030945 1027819 1017371 1000385 977521 949106 915785 879033 840651 801867 763234 725258
62568 725258 688715 654273 622146 592333 564968 540251 518163 498506 481183 466272 453748
62557 453748 443255 434208 426170 419086 413127 408355 404561 401428 398671 395983 393052 389883 387066 385413
62543 385413 385179 385755 386262 386421 386743 387885 389925 392303 394413 396158 397891 399905 402177 404638 407525
62528 407525 411356 416617 423517 431939 441603 452488 465153 480431 498667 519563 543012 569730
62516 569730 600591 635547 673717 714505 758067 804650 854051 905840 959433 1013530 1065991
62505 1065991 1114889 1159410 1199190 1232977 1258615 1274477 1280505 1277725 1267177 1249587 1225843 1197400
$$ packed form
62591F70472L6986L9215M0843M1367M0486L8233L4706K9999K4375J8208J1610
62580A026500M445l126j0448j6986k2864k8415l3321l6752l8382l8784l8633l7976
62568G25258l6543l4442l2127k9813k7365k4717k2088j9657j7323j4911j2524
62557D53748j0493r047q038p084n959m772l794l133k757k688k931l169k817j653
62543C85413k34N76N07J59L22J142K040K378K110J745J733K014K272K461K887
62528D07525L831N261O900Q422R664J0885J2665J5278J8236K0896K3449K6718
62516E69730L0861L4956L8170M0788M3562M6583M9401N1789N3593N4097N2461
62505A065991M8898M4521L9780L3787K5638J5862O028k780j0548j7590k3744k8443
$$ plain form
62493 1197400 1166128 1133847 1102094 1072294 1045922 1024151 1007299 994956 986975 984185 987760 997903
62481 997903 1013415 1032567 1054116 1077311 1101218 1124353 1144978 1161525 1172706 1177502 1175405 1166679
62469 1166679 1152020 1131727 1105412 1072782 1034540 992113 946661 898925 850086 802026 756287
62458 756287 713203 672567 634841 601119 572025 547258 526255 508817 494919 484280 476312 470336
62446 470336 465830 462655 461094 461421 463427 466557 470522 475509 481786 489318 497782 506614 514941 521755
62432 521755 526388 528768 529184 527909 525024 520320 513330 503766 492074 479384 466799 454882 443825
62419 443825 433788 424835 416772 409276 402141 395318 388901 383181 378460 374592 370873 366681 362138 357873
62405 357873 354161 350653 347055 343823 341856 341550 342346 343308 343962 344455 345030 345656 346235 346895 347857 349146 350637
$$ packed form
62493A197400l1272l2281l1753k9800k6372k1771j6852j2343p981k790L575J0143
62481I97903J5512J9152K1549K3195K3907K3135K0625J6547J1181M796k097q726
62469A166679j4659k0293k6315l2630l8242m2427m5452m7736m8839m8060m5739
62458G56287m3084m0636l7726l3722k9094k4767k1003j7438j3898j0639p968n976
62446D70336m506l175j561L27K006L130L965M987O277P532Q464Q832Q327O814
62432E21755M633K380M16j275k885m704o990r564j1692j2690j2585j1917j1057
62419D43825j0037q953q063p496p135o823o417n720m721l868l719m192m543m265
62405C57873l712l508l598l232j967l06P96R62O54M93N75O26N79O60R62J289J491
$$ plain form
62388 350637 352331 354359 356730 359254 361749 364243 367017 370492 374977 380323 385964 391468 396985 402948
62374 402948 409494 416471 423926 432169 441259 450749 460161 469516 479312 490198 502823 517864 535944
62361 535944 557503 582711 611494 643661 679147 718100 760666 806748 855961 907508 959782
62350 959782 1010299 1056505 1096767 1130423 1157123 1176525 1188556 1193385 1191080 1181733 1166052 1145359
62338 1145359 1120748 1092586 1060969 1026392 989865 952781 916747 883062 852084 823481 797259
62327 797259 774073 754267 737188 721858 707844 694970 682556 669610 655627 640641 624617
62316 624617 607293 588671 569300 550080 531989 515792 501574 488642 476206 464198 453167
62305 453167 443555 435389 428543 422894 418178 414026 410168 406470 402894 399657 397259 396079 396030 396847 398456
$$ packed form
62388C50637J694K028K371K524K495K494K774L475M485N346N641N504N517N963
62374D02948O546O977P455Q243R090R490R412R355R796J0886J2625J5041J8080
62361E35944K1559K5208K8783L2167L5486L8953M2566M6082M9213N1547N2274
62350I59782N0517M6206M0262L3656K6700J9402J2031M829k305r347j5681k0693
62338A145359k4611k8162l1617l4577l6527l7084l6034l3685l0978k8603k6222
62327G97259k3186j9806j7079j5330j4014j2874j2414j2946j3983j4986j6024
62316F24617j7324j8622j9371j9220j8091j6197j4218j2932j2436j2008j1031
62305D53167r612q166o846n649m716m152l858l698l576l237k398j180m9Q17J609
$$ plain form
62290 398456 400735 403145 405089 406563 408060 409878 411898 413932 415875 417594 419098 420814 423226 426217
62276 426217 429139 431591 433775 436142 439097 443099 448567 455551 463793 473184 483867 495918 509263
62263 509263 523989 540492 559375 581473 607794 638942 674626 714230 757735 805552 857439
62252 857439 912205 968433 1024773 1079448 1130273 1175529 1214225 1245355 1267714 1280936 1285957 1283879
62240 1283879 1274917 1259020 1236812 1209136 1176131 1137718 1094806 1049233 1002565 955674 909463
62229 909463 865287 824458 787731 755261 726590 700782 677143 655849 637342 621137 605909
62218 605909 590920 576707 563988 552426 540968 529060 517002 505281 494061 483383 473475 464599
62206 464599 456781 449890 444026 439659 437182 436375 436465 436792 437238 437950 438958 440330 442464 445862 450638 456479
$$ packed form
62290C98456K279K410J944J474J497J818K020K034J943J719J504J716K412K991
62276D26217K922K452K184K367K955M002N468O984Q242R391J0683J2051J3345
62263E09263J4726J6503J8883K2098K6321L1148L5684L9604M3505M7817N1887
62252H57439N4766N6228N6340N4675N0825M5256L8696L1130K2359J3222N021k078
62240A283879q962j5897k2208k7676l3005l8413m2912m5573m6668m6891m6211
62229I09463m4176m0829l6727l2470k8671k5808k3639k1294j8507j6205j5228
62218F05909j4989j4213j2719j1562j1458j1908j2058j1721j1220j0678r908q876
62206D64599p818o891n864m367k477q07R0L27M46P12J008J372K134L398M776N841
$$ plain form
62190 456479 462986 469769 476393 482665 489008 496131 504260 512961 521762 530554 539345 548019 556483 564666
62176 564666 572199 578521 583641 588541 594481 602140 611684 623365 637628 654823 675240 699369 727618
62163 727618 759705 794680 831620 869881 908520 945843 979863 1009017 1032213 1048542 1057532 1059767
62151 1059767 1056746 1049782 1039101 1024120 1004418 980288 952622 922689 891987 861836 832888 805195
62139 805195 778880 754577 733097 714943 700352 689480 682087 677132 673153 669210 665263 661617 658325
62126 658325 655292 652616 650594 649507 649551 650839 653304 656752 661160 666706 673215 679721 684961 688325 690099
62111 690099 690793 690596 689640 688343 687065 685554 683186 679880 676337 673078 669532 664522 657687 650032 642939
62096 642939 637003 632150 628635 627320 628830 632718 637715 642688 647273 651712 656325 661174 666200 671577
$$ packed form
62190D56479O507O783O624O272O343P123Q129Q701Q801Q792Q791Q674Q464Q183
62176E64666P533O322N120M900N940P659R544J1681J4263J7195K0417K4129K8249
62163G27618L2087L4975L6940L8261L8639L7323L4020K9154K3196J6329Q990K235
62151A059767l021o964j0681j4981j9702k4130k7666k9933l0702l0151k8948k7693
62139H05195k6315k4303k1480j8154j4591j0872p393m955l979l943l947l646l292
62126F58325l033k676k022j087M4J288K465L448M408N546O509O506N240L364J774
62111F90099O94j97r56j297j278j511k368l306l543l259l546n010o835p655p093
62096F42939n936m853l515j315J510L888M997M973M585M439M613M849N026N377
$$ plain form
62082 671577 677775 685094 693231 701586 710103 719570 730908 744325 759352 775507 792626 810573 828934
62069 828934 847122 864686 881532 898045 915032 933322 953201 974297 996077 1018370 1041205
62058 1041205 1064141 1085868 1104664 1119277 1129378 1135185 1136798 1134031 1126749 1115094 1099276 1079416
62046 1079416 1055700 1028485 998012 964265 927498 888831 849874 811725 774641 738717 704445
62035 704445 672359 642544 614872 589503 566759 546627 528728 512721 498422 485664 474412
62024 474412 464965 457566 451729 446410 441069 436195 432441 429557 426593 423004 419093 415380 412002 408903
62010 408903 406261 404392 403333 402765 402376 402167 402371 403204 404707 406790 409371 412494 416203 420198 423682
61995 423682 425778 426277 425865 425406 425034 424077 421895 418599 414895 411423 408312 405150 401188 395751 388797
$$ packed form
62082F71577O198P319Q137Q355Q517R467J1338J3417J5027J6155J7119J7947J8361
62069H28934J8188J7564J6846J6513J6987J8290J9879K1096K1780K2293K2835
62058A041205K2936K1727J8796J4613J0101N807J613k767p282j1655j5818j9860
62046A079416k3716k7215l0473l3747l6767l8667l8957l8149l7084l5924l4272
62035G04445l2086k9815k7672k5369k2744k0132j7899j6007j4299j2758j1252
62024D74412r447p399n837n319n341m874l754k884k964l589l911l713l378l099
62010D08903k642j869j059n68l89k09K04Q33J503K083K581L123L709L995L484
61995D23682K096M99m12m59l72r57k182l296l704l472l111l162l962n437o954
$$ plain form
61980 388797 381070 373513 366502 359742 352856 345881 339311 333878 330175 328101 326710 324995 322938 321427
61966 321427 321059 321463 321947 322337 322771 323186 323574 324463 326429 329150 331529 332844 333353 333697 334233 335097 336399
61949 336399 338043 339686 341172 342817 345086 348255 352552 358213 365121 372734 380758 389578 399516 409967
61935 409967 419919 429233 438668 448541 458082 466527 474205 481904 489486 495886 500425 503484 505679 506920
61921 506920 506652 504694 501456 497475 493106 488607 484234 480206 476859 474841 474945 477553 482346 488629 495896
61906 495896 504059 513227 523278 533613 543359 551901 559186 565323 569972 572362 571895 568520 562581 554736
61892 554736 546119 538074 531310 525530 520154 515101 510533 506170 501449 496273 491075 486132 481292 476375
61878 476375 471358 466047 460064 453427 446754 440584 434811 429078 423504 418669 415021 412543 410932 409915
$$ packed form
61980C88797p727p557p011o760o886o975o570n433l703k074j391j715k057j511
61966C21427l68M04M84L90M34M15L88Q89J966K721K379J315N09L44N36Q64J302
61949C36399J644J643J486J645K269L169M297N661O908P613Q024Q820R938J0451
61935D09967R952R314R435R873R541Q445P678P699P582O400M539L059K195J241
61921E06920k68j958l238l981m369m499m373m028l347k018J04K608M793O283P267
61906D95896Q163R168J0051J0335R746Q542P285O137M649K390m67l375n939p845
61892E54736q617q045o764n780n376n053m568m363m721n176n198m943m840m917
61878D76375n017n311n983o637o673o170n773n733n574m835l648k478j611j017
$$ plain form
61864 409915 409439 409727 411049 413351 416287 419695 423865 429179 435683 443196 451653 461125 471654 483330
61850 483330 496355 510811 526489 543199 561048 580030 599397 617887 634609 649368 662007
61839 662007 671841 678020 680242 678829 674305 667250 658541 649331 640544 632532 625468 619978 617099 617511
61825 617511 620916 626310 632783 640004 648004 656560 664757 671113 674303 673888 670245 663754 654335 641948
61811 641948 627180 610902 593591 575493 557267 539786 523282 507383 492216 478708 467362
61800 467362 457388 447707 438411 430510 424481 419770 415675 412035 408927 406257 403939 402101 400824 399825
61786 399825 398564 396607 393927 391032 388711 387404 386816 386335 385779 385396 385220 384815 383800 382305 380757 379454
61770 379454 378513 378018 378041 378587 379621 381056 382683 384274 385836 387617 389799 392283 394870 397590 400743
$$ packed form
61864D09915m76K88J322K302K936L408M170N314O504P513Q457R472J0529J1676
61850D83330J3025J4456J5678J6710J7849J8982J9367J8490J6722J4759J2639
61839F62007R834O179K222j413m524p055q709r210q787q012p064n490k879M12
61825F17511L405N394O473P221Q000Q556Q197O356L190m15l643o491r419j2387
61811F41948j4768j6278j7311j8098j8226j7481j6504j5899j5167j3508j1346
61800D67362r974r681r296p901o029m711m095l640l108k670k318j838j277r99
61786C99825j261j957k680k895k321j307n88m81n56l83j76m05j015j495j548j303
61770C79454r41m95K3N46J034J435J627J591J562J781K182K484K587K720L153
$$ plain form
61755 400743 404572 408827 412666 415180 416150 416194 416004 415600 414513 412471 409613 406193 402449 398740 395412
61740 395412 392511 389888 387561 385658 384089 382673 381559 381058 381003 380820 380395 380304 380860 381466 381416 380989 381174
61723 381174 382481 384487 386523 388347 390108 392043 394368 397180 400242 402938 404603 404989 404498 403990 404150
61708 404150 404908 405483 405152 403884 402180 400437 398629 396502 393808 390426 386511 382625 379540 377690 376786
61693 376786 375969 374405 371810 368527 365153 362083 359384 356977 354839 353045 351692 350796 350159 349365 348009
61678 348009 345987 343516 340925 338503 336398 334507 332545 330417 328397 326752 325320 323804 322386 321572
61664 321572 321427 321485 321513 321832 322632 323535 324213 324978 326219 327585 328389 328601 328877 329658 330800 332082 333503 334956
61646 334956 336099 336796 337368 338213 339489 341286 343754 346756 349646 351627 352271 351615 350016 348139 346833
$$ packed form
61755D00743L829M255L839K514R70M4j90m04j087k042k858l420l744l709l328
61740C95412k901k623k327j903j569j416j114n01n5j83m25r1N56O06n0m27J85
61723C81174J307K006K036J824J761J935K325K812L062K696J665L86m91n08J60
61708D04150P58N75l31j268j704j743j808k127k694l382l915l886l085j850r04
61693C76786q17j564k595l283l374l070k699k407k138j794j353q96o37p94j356
61678C48009k022k471k591k422k105j891j962k128k020j645j432j516j418q14
61664C21572j45N8K8L19Q00R03O78P65J241J366Q04K12K76P81J142J282J421J453
61646C34956J143O97N72Q45J276J797K468L002K890J981O44o56j599j877j306
$$ plain form
61631 346833 346592 347049 347141 345899 343141 339496 335851 332673 329816 327001 324394 322531 321683 321533 321513 321267
61615 321267 320660 319612 318136 316373 314354 311911 309027 306092 303415 300590 296781 291758 286293 281389
61601 281389 277450 274389 272107 270368 268441 265534 261748 258162 255684 254105 252511 250398 248008 245791
61587 245791 243967 242629 241867 241586 241437 241157 240879 240961 241516 242179 242274 241235 239012 236183 233635 232030 231520
61570 231520 231839 232561 233303 233862 234186 234185 233711 232955 232649 233437 235011 236358 237103 238078 240185 243073 245556 247100
61552 247100 248254 249540 250592 250724 249944 248978 248468 248536 249068 250054 251476 253037 254255 254914 255348 256138 257499
61535 257499 259077 260443 261570 262613 263351 263241 262153 260761 259914 259788 259830 259475 258598 257281 255508 253328
61519 253328 251158 249563 248696 248164 247555 246884 246334 245808 245086 244354 244182 244815 245815 246582 246924 246892 246424 245592
$$ packed form
61631C46833k41M57R2j242k758l645l645l178k857k815k607j863q48j50k0k46
61615C21267o07j048j476j763k019k443k884k935k677k825l809n023n465m904
61601B81389l939l061k282j739j927k907l786l586k478j579j594k113k390k217
61587B45791j824j338p62k81j49k80k78Q2N55O63R5j039k223k829k548j605n10
61570B31520L19P22P42N59L24jm74p56l06P88J574J347P45R75K107K888K483J544
61552B47100J154J286J052J32p80r66n10O8N32R86J422J561J218O59M34P90J361
61535B57499J578J366J127J043P38j10j088j392q47j26M2l55q77j317j773k180
61519B53328k170j595q67n32o09o71n50n26p22p32j72O33J000P67L42l2m68q32
$$ plain form
61501 245592 244982 245242 246228 247144 247606 248070 248933 249778 249992 249751 249734 250037 250071 249643 249480 250308 251819 253044 253485
61482 253485 253476 253537 253868 254479 255354 256319 257040 257377 257577 257994 258816 260127 261943 263959 265554 266329 266506 266524 266397
61463 266397 265817 264783 263754 263173 263108 263346 263523 263171 262020 260466 259466 259841 261696 264434 267095 268857
61447 268857 269674 270473 272190 274494 275971 275790 274655 273791 273545 273557 273876 275112 277533 280635 283703 286358
61431 286358 288512 290242 291855 293738 295941 298114 299949 301465 302793 303862 304383 304071 302982 301722 301153
61416 301153 301644 302733 303750 304540 305244 305641 305262 304103 302656 301191 299582 297943 296846 296601 296767 296702
61400 296702 296217 295375 294037 291991 289312 286340 283579 281860 282071 284175 286808 288456 288953 289306 290210 291365
61384 291365 292223 292686 292871 292812 292782 293437 295083 297073 298428 298959 299419 300596 302653 305327 308306 311238 313757
$$ packed form
61501B45592o10K60R86R16M62M64Q63Q45K14k41j7L03L4m28j63Q28J511J225M41
61482B53485rO1L31O11Q75R65P21L37K00M17Q22J311J816K016J595P75J77J8j27
61463B66397n80j034j029n81o5K38J77l52j151j554j000L75J855K738K661J762
61447B68857Q17P99J717K304J477j81j135q64k46J2L19J236K421L102L068K655
61431B86358K154J730J613J883K203K173J835J516J328J069N21l12j089j260n69
61416C01153M91J089J017P90P04L97l79j159j447j465j609j639j097k45J66o5
61400B96702m85q42j338k046k679k972k761j719K11K104K633J648M97L53R04J155
61384B91365Q58M63J85n9l0O55J646J990J355N31M60J177K057K674K979K932K519
$$ plain form
61367 313757 315788 317640 319525 321165 322192 322808 323714 325347 327542 330046 332916 336161 339293 341681 343378
61352 343378 345209 347995 351897 356537 361453 366296 370836 374980 378732 381963 384358 385787 386657 387747
61338 387747 389644 392412 395724 399149 402323 405052 407404 409650 411972 414189 415819 416478 416189 415294 414160
61323 414160 413079 412386 412399 413102 414050 414828 415552 416669 418340 420311 422574 425858 431107 438460 447048 455936
61307 455936 465055 474998 485980 497373 508397 519016 529742 540575 550476 558052 562638 564576 564651
61294 564651 563444 561135 557693 553241 548202 542965 537348 530625 522288 512615 502321 491941 481856
61281 481856 472697 465190 459537 455277 451832 448925 446485 444517 443158 442563 442620 443046 443803 445072 446687
61266 446687 448039 448837 449662 451436 454556 458889 464337 470885 478070 484904 490609 495210 499253 503095 506619
$$ packed form
61367C13757K031J852J885J640J027O16R06J633K195K504K870L245L132K388J697
61352C43378J831K786L902M640M916M843M540M144L752L231K395J429Q70J090
61338C87747J897K768L312L425L174K729K352K246K322K217J630O59k89q95j134
61323D14160j081o93J3P03R48P78P24J117J671J971K263L284N249P353Q588Q888
61307D55936R119R943J0982J1393J1024J0619J0726J0833R901P576M586J938P5
61294E64651j207k309l442m452n039n237n617o723q337r673j0294j0380j0085
61281D81856r159p507n653m260l445k907k440j968j359n95N7M26P57J269J615
61266D46687J352P98Q25J774L120M333N448O548P185O834N705M601M043L842L524
$$ plain form
61251 506619 509527 511668 513126 514123 514883 515426 515401 514334 512221 509771 507776 506268 504578 502276 499672
61236 499672 497290 495246 493445 492050 491322 491240 491729 493105 495760 499496 503705 508176 513197 518866 524908
61221 524908 531317 538546 546767 555448 563996 572378 580723 588750 596004 602370 607929 612640 616581 620217
61207 620217 623960 627587 630577 632955 635414 638630 642723 647367 652208 657256 663141 670786 680532 691692
61193 691692 703240 714778 726505 738377 749656 759284 766425 770755 772507 772186 770051 766015 760351
61180 760351 754119 748369 743017 737048 729825 721666 713074 704041 694437 684655 675360 666705 658078 648643
61166 648643 638006 626488 614862 603809 593482 583527 573470 563101 552654 542718 533864 526211
61154 526211 519484 513562 508779 505525 503780 503247 503654 504607 505381 505334 504416 502839 500363 496378 490731 484071
$$ packed form
61251E06619K908K141J458R97P60N43k5j067k113k450j995j508j690k302k604
61236D99672k382k044j801j395p28q2M89J376K655L736M209M471N021N669O042
61221E24908O409P229Q221Q681Q548Q382Q345Q027P254O366N559M711L941L636
61207F20217L743L627K990K378K459L216M093M644M841N048N885P645R746J1160
61193F91692J1548J1538J1727J1872J1279R628P141M330J752l21k135m036n664
61180G60351o232n750n352n969p223q159q592r033r604r782r295q655q627r435
61166F48643j0637j1518j1626j1053j0327r955j0057j0369j0447r936q854p653
61154E26211o727n922m783l254j745n33M07R53P74m7r18j577k476l985n647o660
$$ plain form
61138 484071 477362 471432 466930 464168 462826 462233 462127 462862 464775 467792 471781 476931 483534 491645 501123
61123 501123 511819 523632 536663 551284 567689 585389 603639 622494 642895 665358 689069
61112 689069 712663 735525 757850 779744 800861 820845 839632 857128 872896 886307 896877
61101 896877 904467 909230 911371 910924 907778 901833 892973 880990 865893 848329 829314 809323 788024
61088 788024 765151 741360 717935 695835 675324 656220 638151 620719 603843 587973 573734
61077 573734 561365 550656 541342 533333 526617 521170 516936 513757 511384 509697 508848 509059 510302 512268
61063 512268 514566 516887 519230 522103 526311 532231 539337 546609 553465 560245 567881 577099 587872 599554
61049 599554 611700 624695 639410 656260 674808 694266 714092 734200 755021 777370 801763
$$ packed form
61138D84071o709n930m502k762j342n93j06P35J913L017L989N150O603Q111R478
61123E01123J0696J1813J3031J4621J6405J7700J8250J8855K0401K2463K3711
61112F89069K3594K2862K2325K1894K1117J9984J8787J7496J5768J3411J0570
61101H96877P590M763K141m47l146n945q860j1983j5097j7564j9015j9991k1299
61088G88024k2873k3791k3425k2100k0511j9104j8069j7432j6876j5870j4239
61077E73734j2369j0709r314q009o716n447m234l179k373j687q49K11J243J966
61063E12268K298K321K343K873M208N920P106P272O856O780P636R218J0773J1682
61049E99554J2146J2995J4715J6850J8548J9458J9826K0108K0821K2349K4393
$$ plain form
61038 801763 827750 854403 881536 909834 939704 970763 1002822 1036524 1072408 1110037 1148743
61027 1148743 1188704 1230441 1273735 1317842 1362532 1408238 1455607 1505669 1560031 1619938 1685558
61016 1685558 1757153 1836495 1925923 2026369 2137943 2262687 2405654 2573615 2774736 3019950
61006 3019950 3322872 3697964 4161186 4733442 5439961 6302164 7330110 8524624 9884360
60997 9884360 11404113 13060739 14797929 16520756 18101257 19396080 20283012 20712802
60989 20712802 20746342 20540474 20280669 20103854 20057866 20103146 20130520 19982430 19492884 18552533
60979 18552533 17165698 15453437 13597096 11765980 10075653 8585351 7313224 6251346
60971 6251346 5377617 4665466 4089084 3624216 3248647 2944198 2697297 2496779 2331998
$$ packed form
61038H01763K5987K6653K7133K8298K9870L1059L2059L3702L5884L7629L8706
61027A148743L9961M1737M3294M4107M4690M5706M7369N0062N4362N9907O5620
61016A685558P1595P9342Q9428J00446J11574J24744J42967J67961K01121K45214
61006C019950L02922L75092M63222N72256P06519Q62203J027946J194514J359736
60997I884360J519753J656626J737190J722827J580501J294823Q86932M29790
60989B0712802L3540k05868k59805j76815m5988M5280K7374j48090m89546r40351
60979A8552533j386835j712261j856341j831116j690327j490302j272127j061878
60971F251346q73729p12151n76382m64868l75569l04449k46901k00518j64781
$$ plain form
60962 2331998 2193586 2074829 1971319 1879847 1798201 1725243 1660116 1601495 1548051 1499259 1455178
60951 1455178 1415575 1379617 1346147 1313911 1281682 1248512 1213906 1177826 1140853 1104300 1069615
60940 1069615 1037379 1007168 978357 950589 923350 895885 868024 840583 814477 789807 766239
60929 766239 743859 722946 703211 683969 665094 647245 631061 616560 603435 591552 580975
60918 580975 571680 563433 555861 548632 541546 534481 527265 519848 512651 506436 501603 497843 494718 492311
60904 492311 490978 490638 490765 490978 491208 491234 490538 488818 486368 483699 481010 478256 475598 473460 472060 471065
60888 471065 469858 468124 466033 463833 461418 458464 454892 450940 446757 442134 436774 430720 424439 418573
60874 418573 413591 409544 406094 402916 400050 397667 395522 393021 389988 387041 384913 383616 382603 381627
$$ packed form
60962B331998j38412j18757j03510r1472q1646p2958o5127n8621n3444m8792m4081
60951A455178l9603l5958l3470l2236l2229l3170l4606l6080l6973l6553l4685
60940A069615l2236l0211k8811k7768k7239k7465k7861k7441k6106k4670k3568
60929G66239k2380k0913j9735j9242j8875j7849j6184j4501j3125j1883j0577
60918E80975r295q247p572p229p086p065p216p417p197o215m833l760l125k407
60904D92311j333l40J27K13K30K6o96j720k450k669k689k754k658k138j400r95
60888D71065j207j734k091k200k415k954l572l952m183m623n360o054o281n866
60874D18573m982m047l450l178k866k383k145k501l033k947k128j297j013r76
$$ plain form
60860 381627 381108 381563 382901 384376 385181 385040 384213 383018 381538 379913 378634 378183 378470 378987 379477 379994 380318
60843 380318 379905 378602 376892 375195 373417 371466 369669 368202 366555 364073 360703 356836 352834 349204
60829 349204 346770 345909 345869 345539 344768 344301 344632 345603 346993 348706 350338 351325 351640 351750 351781 351398 350557 349671
60811 349671 348801 347389 345110 342360 339533 336425 332837 329315 326739 325384 324791 324394 323955 323478 322932 322061
60795 322061 320450 317966 314998 311977 308803 305210 301577 298702 296733 295019 293200 291672 290696 289779 288435
60780 288435 286858 285362 283799 282190 281360 282119 284088 286071 287364 288084 288400 288231 287763 287665 288602 290769
60764 290769 293863 297275 300471 303452 306713 310484 314278 317414 319627 320870 321024 320337 319707 319856 320491
60749 320491 320905 321144 321872 323279 324885 326293 327394 327872 327306 325791 323764 321133 317333 312344 306914
$$ packed form
60860C81627n19M55J338J475Q05j41q27j195j480j625j279m51K87N17M90N17L24
60843C80318m13j303j710j697j778j951j797j467j647k482l370l867m002l630
60829C49204k434q61m0l30p71m67L31R71J390J713J632R87L15J10L1l83q41q86
60811C49671q70j412k279k750k827l108l588l522k576j355n93l97m39m77n46q71
60795C22061j611k484k968l021l174l593l633k875j969j714j819j528r76r17j344
60780B88435j577j496j563j609q30P59J969J983J293P20L16j69m68r8R37K167
60764B90769L094L412L196K981L261L771L794L136K213J243J54o87o30J49O35
60749C20491M14K39P28J407J606J408J101M78n66j515k027k631l800m989n430
$$ plain form
60734 306914 301617 296428 291467 287364 284367 281720 278470 274562 270706 267543 265297 263890 262946 261901
60720 261901 260469 258894 257527 256424 255574 255223 255618 256601 257721 258656 259340 259850 260325 260858 261371 261705 261868
60703 261868 262022 262261 262663 263517 265079 267055 268737 269772 270405 270933 271436 272152 273472 275312 277056 278543
60687 278543 280544 283741 287689 291379 294496 297539 300881 304370 307763 311056 314344 317671 320978 323945
60673 323945 326078 327298 328208 329341 330331 330390 329441 328159 326871 325006 321888 317593 312806 308191 304202
60658 304202 301218 299465 298811 298776 298736 298173 296960 295540 294667 294812 295834 297255 298709 300060 301233 302141
60642 302141 302801 303300 303434 302519 299907 295872 291683 288528 286540 285196 284308 284009 283919 283191 281643 280147
60626 280147 279478 279397 279341 279391 279874 280505 280738 280677 280836 281159 281162 280959 281270 282211 282905 282617 281703 281052 281097 281634 282217
$$ packed form
60734C06914n297n189m961m103k997k647l250l908l856l163k246j407r44j045
60720B61901j432j575j367j103q50l51L95R83J120R35O84N10M75N33N13L34J63
60703B61868J54K39M02Q54J562J976J682J035O33N28N03P16J320J840J744J487
60687B78543K001L197L948L690L117L043L342L489L393L293L288L327L307K967
60673C23945K133J220R10J133R90N9r49j282j288j865l118m295m787m615l989
60658C04202k984j753o54l5m0n63j213j420q73J45J022J421J454J351J173R08
60642C02141O60M99J34r15k612m035m189l155j988j344q88k99r0p28j548j496
60626B80147o69q1n6N0M83O31K33o1J59L23Lk03L11R41O94k88r14o51M5N37N83
$$ plain form
60605 282217 282467 282413 282685 283918 285760 287059 287338 287546 288893 291433 294295 296847 299053 301040 303047 305589
60589 305589 308953 312546 315350 317055 318136 318792 318537 317137 315349 314242 314119 314565 315283 316329 317607
60574 317607 318743 319730 321381 324737 330083 336843 344462 353036 362812 373305 383416 392500 400921 409233
60560 409233 417119 423518 427656 429516 429342 427204 423291 418255 412885 407561 402281 397143 392609 389287
60546 389287 387650 387924 390026 393605 398301 404100 411371 420487 431418 443718 456892 470772 485494
60533 485494 500987 516494 530716 542504 551308 556954 559336 558600 555381 550437 544073 536362 527945
60520 527945 520052 513461 507833 502435 497197 492665 489161 486520 484570 483381 483045 483574 485062 487485 490346
60505 490346 493060 496003 500750 508893 520864 536230 554837 577160 603570 633752 666926 702353
$$ packed form
60605B82217K50n4K72J233J842J299K79K08J347K540K862K552K206J987K007K542
60589C05589L364L593K804J705J081O56k55j400j788j107j23M46P18J046J278
60574C17607J136R87J651L356N346O760P619Q574R776J0493J0111R084Q421Q312
60560D09233P886O399M138J860j74k138l913n036n370n324n280n138m534l322
60546C89287j637K74K102L579M696N799P271R116J0931J2300J3174J3880J4722
60533D85494J5493J5507J4222J1788Q804N646K382p36l219m944o364p711q417
60520E27945p893o591n628n398n238m532l504k641j950j189l36N29J488K423K861
60505D90346K714K943M747Q143J1971J5366J8607K2323K6410L0182L3174L5427
$$ plain form
60493 702353 739455 777676 816455 855209 893129 928958 961048 987781 1007993 1020979 1026145 1022780
60481 1022780 1010337 988932 959478 923378 882176 837457 790822 743869 698185 655214 615800
60470 615800 579986 547599 519023 494910 474998 457803 441895 427119 414171 403274 393896 385556
60458 385556 378291 372221 367107 362525 358162 353841 349470 345119 340959 337119 333769 331226 329659 328704
60444 328704 327738 326542 325356 324262 322989 321492 320311 319967 320242 320369 319854 318865 317941 317504 317590 317866 317936
60427 317936 317751 317629 317814 318174 318375 318211 317637 316745 315898 315624 316080 316757 317049 317027 317284 318040 318802 319047 318893
60408 318893 318880 319316 320090 320963 321721 322120 322032 321761 321965 323061 324821 326724 328611 330784 333486 336550 339694
60391 339694 342915 346364 349915 353138 355760 357962 360097 362232 364116 365581 366863 368435 370495 372649
$$ packed form
60493G02353L7102L8221L8779L8754L7920L5829L2090K6733K0212J2986N166l365
60481A022780j2443k1405k9454l6100m1202m4719m6635m6953m5684m2971l9414
60470F15800l5814l2387k8576k4113j9912j7195j5908j4776j2948j0897r378q340
60458C85556p265o070n114m582m363m321m371m351m160l840l350k543j567r55
60444C28704r66j196j186j094j273j497j181l44K75J27n15r89r24m37Q6K76P0
60427C17936j85j22J85L60K01j64n74q92q47k74M56O77K92k2K57P56P62K45j54
60408C18893j3M36P74Q73P58L99q8k71K04J096J760J903J887K173K702L064L144
60391C39694L221L449L551L223K622K202K135K135J884J465J282J572K060K154
$$ plain form
60377 372649 374156 374560 374145 373727 374021 375135 376581 377738 378346 378656 379130 379981 381016 381859 382271 382283 382192 382445
60359 382445 383323 384600 385647 386083 386323 387328 389856 393979 399218 404934 410634 416092 421268 426097 430419
60344 430419 434125 437188 439389 440180 439124 436439 432847 428848 424373 419209 413524 407837 402615 398035
60330 398035 394058 390637 387833 385718 384143 382665 380815 378409 375586 372672 370149 368516 367887 367825 367843
60315 367843 368011 368717 369965 371393 373035 375618 379865 385888 393439 402405 412729 424219 436751 450396
60301 450396 464942 479459 492752 504071 513008 518825 520476 517435 510172 499636 486660 472019
60289 472019 456777 442229 429451 418983 410801 404457 399380 395236 391998 389638 387783 385822 383300
60276 383300 380161 376655 373161 370075 367622 365609 363423 360512 356939 353402 350610 348647 347001 345107
$$ packed form
60377C72649J507M04m15m18K94J114J446J157O08L10M74Q51J035Q43M12J2r1K53
60359C82445Q78J277J047M36K40J005K528M123N239N716N700N458N176M829M322
60344D30419L706L063K201P91j056k685l592l999m475n164n685n687n222m580
60330C98035l977l421k804k115j575j478j850k406k823k914k523j633o29o2J8
60315C67843J68P06J248J428J642K583M247O023P551Q966J0324J1490J2532J3645
60301D50396J4546J4517J3293J1319Q937N817J651l041p263j0536j2976j4641
60289D72019j5242j4548j2778j0468q182o344n077m144l238k360j855j961k522
60276C83300l139l506l494l086k453k013k186k911l573l537k792j963j646j894
$$ plain form
60262 345107 342797 340325 338151 336700 336115 336102 336093 335700 335057 334686 335048 336218 337867 339517 340850 341864 342719
60245 342719 343459 343913 343941 343728 343774 344528 345978 347545 348459 348328 347437 346513 346262 347076 348965 351576 354346 356892
60227 356892 359260 361677 364131 366412 368599 371161 374436 378193 381936 385513 389221 393360 397880 402529
60213 402529 407239 412314 418180 424914 432061 439059 445837 452825 460266 467702 474302 479653 484090 488315
60199 488315 492785 497388 501604 505003 507698 510247 513042 515815 517826 518468 517634 515582 512645 509066 504988
60184 504988 500517 495793 490993 486248 481601 477052 472567 468001 463210 458388 454160 451102 449153 447649
60170 447649 445916 443678 440988 438077 435367 433335 432127 431433 430904 430531 430411 430303 429823 429024 428434 428392 428704
60153 428704 429091 429655 430580 431663 432522 433172 433994 435203 436685 438280 439859 441165 442070 443062 444916 447691
$$ packed form
60262C45107k310k472k174j451n85j3rl93o43l71L62J170J649J650J333J014Q55
60245C42719P40M54K8k13M6P54J450J567R14j31q91r24k51Q14J889K611K770K546
60227C56892K368K417K454K281K187K562L275L757L743L577L708M139M520M649
60213D02529M710N075N866O734P147O998O778O988P441P436O600N351M437M225
60199D88315M470M603M216L399K695K549K795K773K011O42q34k052k937l579m078
60184E04988m471m724m800m745m647m549m485m566m791m822m228l058j949j504
60170D47649j733k238k690k911k710k032j208o94n29l73j20j08m80p99n90m2L12
60153D28704L87N64R25J083Q59O50Q22J209J482J595J579J306R05R92J854K775
$$ plain form
60137 447691 450544 452855 455073 458063 462024 466539 471317 476282 481126 485411 489084 492395 495385 497953
60123 497953 500358 503045 505896 508262 509907 511399 513345 515693 518007 519999 521557 522672 523635 524863
60109 524863 526151 526435 524750 521264 517047 513018 509404 505995 502499 498662 494416 489930 485446 481097
60095 481097 477053 473668 471236 469671 468590 467648 466674 465625 464613 463889 463679 463987 464629 465347 465905 466240
60079 466240 466522 466832 466823 465994 464254 461857 458716 454408 449070 443721 439204 435238 430985 426215 421327 416578
60063 416578 411953 407617 403756 399953 395478 390383 385726 382439 380418 379031 378064 377734 378017 378508 378979
60048 378979 379762 381450 384344 388287 392944 398095 403576 409113 414424 419522 424705 430094 435320 439770
60034 439770 443048 445096 446008 445895 444820 442736 439586 435518 430841 425695 420070 414235 408765 403860 399045
$$ packed form
60137D47691K853K311K218K990L961M515M778M965M844M285L673L311K990K568
60123D97953K405K687K851K366J645J492J946K348K314J992J558J115R63J228
60109E24863J288K84j685l486m217m029l614l409l496l837m246m486m484m349
60095D81097m044l385k432j565j081r42r74j049j012p24k10L08O42P18N58L35
60079D66240K82L10rq29j740k397l141m308n338n349m517l966m253m770m888m749
60063D16578m625m336l861l803m475n095m657l287k021j387r67l30K83M91M71
60048C78979P83J688K894L943M657N151N481N537N311N098N183N389N226M450
60034D39770L278K048R12j13j075k084l150m068m677n146n625n835n470m905m815
$$ plain form
60019 399045 393934 388932 384589 380547 375815 370139 364440 359717 356011 352685 349285 345835 342620 339989
60005 339989 338208 337251 336822 336653 336654 336701 336530 335998 335255 334541 333984 333730 334068 335288 337457 340448 344059 347981
59987 347981 351765 354996 357604 360008 362877 366594 370691 373912 375086 374083 371820 369318 366859 364078
59973 364078 360698 357032 353765 351280 349247 347021 344461 342228 341088 341091 341572 341824 341548 340832 340109 340071 341190
59956 341190 343130 344931 345901 346201 346466 347063 347826 348350 348418 348265 348485 349543 351304 353138 354559 355637 356735
59939 356735 357917 358713 358440 356786 354194 351670 350157 350024 351101 352981 355207 357371 359316 361241 363444
59924 363444 366010 368884 372128 375911 380338 385456 391323 397801 404385 410522 416110 421396 426402 430762
59910 430762 434168 436691 438530 439669 439961 439454 438543 437800 437658 438154 438941 439561 439720 439441 439089 439193 439915
$$ packed form
60019C99045n111n002m343m042m732n676n699m723l706l326l400l450l215k631
60005C39989j781r57m29j69JM7j71n32p43p14n57k54L38J220K169K991L611L922
59987C47981L784L231K608K404K869L717M097L221J174j003k263k502k459k781
59973C64078l380l666l267k485k033k226k560k233j140LM81K52k76p16p23l8J119
59956C41190J940J801R70L00K65N97P63N24O8j53K20J058J761J834J421J078J098
59939C56735J182P96k73j654k592k524j513j33J077J880K226K164J945J925K203
59924C63444K566K874L244L783M427N118N867O478O584O137N588N286N006M360
59910D30762L406K523J839J139K92n07r11p43j42M96P87O20J59k79l52J04P22
$$ plain form
59893 439915 440672 440653 439864 439269 439667 440867 442315 444076 446594 449809 453160 456324 459374 462240 464648 466646
59877 466646 468668 470979 473467 476015 478641 481190 483298 484700 485302 484968 483664 481794 480026 478760 477999
59862 477999 477485 476621 474690 471852 469549 469044 469680 469626 468366 467380 468213 470950 474994 480202 486488 493154
59846 493154 499438 505204 510446 514680 517409 518634 518314 515988 511749 507026 503491 501478 500173 498974
59832 498974 497691 495724 492145 486776 480481 474211 468323 462813 457598 452533 447727 443923 441928 441512
59818 441512 441376 440412 438630 436745 435305 434451 434026 433641 432862 431664 430581 430156 430228 429880 428248 425461 422707
59801 422707 421079 420402 419524 417844 416047 415036 414667 414039 412690 410856 408753 406250 403283 400067 396863
59786 396863 393875 391382 389571 388259 387068 385820 384489 383031 381674 381118 381786 382996 383609 383528 383872 385490
$$ packed form
59893D39915P57j9p89n95L98J200J448J761K518L215L351L164L050K866K408J998
59877D66646K022K311K488K548K626K549K108J402O02l34j304j870j768j266p61
59862D77999n14q64j931k838k303n05O36n4j260r86Q33K737M044N208O286O666
59846D93154O284N766N242M234K729J225l20k326m239m723l535k013j305j199
59832D98974j283j967l579n369o295o270n888n510n215n065m806l804j995m16
59818D41512j36r64j782j885j440q54m25l85p79j198j083m25P2l48j632k787k754
59801D22707j628o77q78j680j797j011l69o28j349j834k103k503k967l216l204
59786C96863k988k493j811j312j191j248j331j458j357n56O68J210O13q1L44J618
$$ plain form
59770 385490 387969 390363 392337 394208 396359 399052 402523 406815 411633 416595 421473 426071 430190 433941
59756 433941 437852 442400 447578 453060 458556 463866 468898 473885 479324 485307 491052 495469 498232 500003
59742 500003 501615 503246 504489 504972 504725 504037 503193 502507 502419 503247 504702 505939 506296 505907 505403 505148 505009
59725 505009 504787 504477 504107 503591 502876 502004 500929 499462 497511 495232 492927 490948 489682 489393 489956 490891
59709 490891 491757 492410 492880 493236 493705 494663 496331 498571 501118 503921 507097 510626 514269 517812 521290 524876
59693 524876 528567 532038 534882 536965 538420 539234 539032 537465 534745 531636 528899 526828 525236 523688 521767
59678 521767 519242 516069 512209 507564 502227 496630 491206 485923 480391 474505 468813 464100 460711 458341
59664 458341 456461 454843 453643 453035 452931 453165 453785 454900 456307 457669 459154 461497 465169 469698 474093
$$ packed form
59770C85490K479K394J974J871K151K693L471M292M818M962M878M598M119L751
59756D33941L911M548N178N482N496N310N032M987N439N983N745M417K763J771
59742E00003J612J631J243M83k47o88q44o86q8Q28J455J237L57l89n04k55j39
59725E05009k22l10l70n16p15q72j075j467j951k279k305j979j266k89N63R35
59709D90891Q66O53M70L56M69R58J668K240K547K803L176L529L643L543L478L586
59693E24876L691L471K844K083J455Q14k02j567k720l109k737k071j592j548j921
59678E21767k525l173l860m645n337n597n424n283n532n886n692m713l389k370
59664D58341j880j618j200o08j04K34O20J115J407J362J485K343L672M529M395
$$ plain form
59649 474093 477697 480384 482165 483059 483209 482704 481321 478700 474815 469988 464571 458904 453496 448779 444628
59634 444628 440482 436137 432117 429093 427096 425487 423609 421287 418702 415934 412860 409537 406487 404211
59620 404211 402436 400233 397026 393159 389262 385484 381719 378211 375451 373647 372682 372396 372520 372553 372238 372015
59604 372015 372521 373726 375066 376305 377648 379045 379990 380229 380172 380416 381199 382471 384065 385667 386900 387601
59588 387601 387748 387219 385979 384520 383550 383144 382626 381432 379655 377580 375212 372559 369957 367746 365871
59573 365871 364100 362396 360836 359383 357953 356560 355231 353997 353044 352593 352431 351858 350398 348462 347077
59558 347077 346961 347930 349134 349848 350115 350574 351633 353044 354487 356213 358626 361457 364010 366231 368945
59543 368945 372851 377924 384046 391666 401330 412794 425022 437080 448934 461237 474139 486069
$$ packed form
59649D74093L604K687J781Q94J50n05j383k621l885m827n417n667n408m717m151
59634D44628m146m345m020l024j997j609j878k322k585k768l074l323l050k276
59620D04211j775k203l207l867l897l778l765l508k760j804r65k86J24L3l15k23
59604C72015N06J205J340J239J343J397R45K39n7K44P83J272J594J602J233P01
59588C87601J47n29j240j459r70m06n18j194j777k075k368k653k602k211j875
59573C65871j771j704j560j453j430j393j329j234r53m51j62n73j460j936j385
59558C47077j16R69J204P14K67M59J059J411J443J726K413K831K553K221K714
59543C68945L906N073O122P620R664J1464J2228J2058J1854J2303J2902J1930
$$ plain form
59531 486069 494097 496132 492730 486354 479157 472144 466161 462317 460955 461126 461720 462571 463951 465582 466694
59516 466694 466634 464994 461564 456607 450780 444381 437172 429245 421491 414702 408769 403232 398062 393348 388869
59501 388869 384670 381459 379605 378224 376210 373772 371962 371014 370247 369502 369472 370376 371349 371588 371398 371678 372926
59484 372926 375100 377952 381177 384508 387916 391463 394969 398225 401540 405558 410417 415531 420305 424538
59470 424538 428003 430252 431118 431036 430610 430226 430202 430785 431712 432302 432382 432680 433931 436108 439047 443352 449829
59453 449829 458166 466979 475321 483466 491865 499915 506366 510735 513754 516343 518539 519589 518734 515685
59439 515685 510543 503722 495925 487923 480238 473171 467043 462098 458159 454751 451663 449076 447069 445381
59425 445381 443980 443508 444839 448354 453895 461186 470057 480538 493028 508031 525351 543853 562484
$$ packed form
59531D86069Q028K035l402o376p197p013n983l844j362J71N94Q51J380J631J112
59516D66694o0j640l430m957n827o399p209p927p754o789n933n537n170m714m479
59501C88869m199l211j854j381k014k438j810r48p67p45l0R04R73K39j90K80J248
59484C72926K174K852L225L331L408L547L506L256L315M018M859N114M774M233
59470D24538L465K249Q66q2m26l84k4N83R27N90Q0K98J251K177K939M305O477
59453D49829Q337Q813Q342Q145Q399Q050O451M369L019K589K196J050q55l049
59439E15685n142o821p797q002p685p067o128m945l939l408l088k587k007j688
59425D45381j401m72J331L515N541P291Q871J0481J2490J5003J7320J8502J8631
$$ plain form
59412 562484 581173 600167 618727 635155 647902 655853 657768 652710 641650 627876 615060 605165
59400 605165 598525 595245 595628 599367 604979 610141 612269 609028 599117 583090 563274 542606 523414
59387 523414 507005 493901 484125 477308 472805 469885 467989 466873 466560 467125 468565 470841 473892 477472
59373 477472 481133 484560 487945 491735 495956 499969 503137 505657 508464 512275 516896 521509 525452 528612
59359 528612 531354 534334 538221 543288 549166 555248 561330 567713 574688 582236 590259 598879 608350 618835
59345 618835 630293 642394 654487 665861 676166 685442 693730 700876 706690 710988 713373 713323 710688
59332 710688 705828 699244 691363 682736 673911 664872 655080 644404 633537 623163 613223 603548 594720
59319 594720 587525 581809 576663 571644 567029 562838 558430 553372 548088 543260 539036 535222 531912 529526
$$ packed form
59412E62484J8689J8994J8560J6428J2747P951J915n058j1060j3774j2816r895
59400F05165o640l280L83L739N612N162K128l241r911j6027j9816k0668j9192
59387E23414j6409j3104r776o817m503k920j896j116l13N65J440K276L051L580
59373D77472L661L427L385L790M221M013L168K520K807L811M621M613L943L160
59359E28612K742K980L887N067N878O082O082O383O975P548Q023Q620R471J0485
59345F18835J1458J2101J2093J1374J0305R276Q288P146N814M298K385n0k635
59332G10688m860o584p881q627q825r039r792j0676j0867j0374r940r675q828
59319E94720p195n716n146n019m615m191m408n058n284m828m224l814l310k386
$$ plain form
59305 529526 528396 528619 530225 533211 537521 543078 549772 557276 564940 571948 577409 580216 579096 573153
59291 573153 562561 548702 533545 518727 505082 492893 482479 474343 468750 465378 463565 462777 462757
59278 462757 463420 464854 467358 471300 476957 484533 494050 505018 516391 527156 536887 545556 553110 559561
59264 559561 565265 570575 575240 578501 579826 579221 576878 572942 567711 561697 555325 548764 542140 535717
59250 535717 529770 524462 519857 515921 512509 509537 507178 505767 505539 506550 508719 511748 515146 518579
59236 518579 522117 525948 529992 534001 537836 541367 544309 546506 548159 549378 549648 548251 545164 541161
59222 541161 537070 533309 529999 526997 523866 520334 516857 514207 512396 510494 507664 503988 500155 496768
59208 496768 494085 492052 490347 488652 486950 485304 483410 480840 477769 474945 472838 471236 469879 468942
$$ packed form
59305E29526j130K23J606K986M310N557O694P504P664P008N461K807j120n943
59291E73153j0592j3859j5157j4818j3645j2189j0414q136n593l372j813p88k0
59278D62757O63J434K504L942N657P576R517J0968J1373J0765R731Q669P554O451
59264E59561N704N310M665L261J325o05k343l936n231o014o372o561o624o423
59250E35717n947n308m605l936l412k972k359j411k28J011K169L029L398L433
59236E18579L538L831M044M009L835L531K942K197J653J219K70j397l087m003
59222E41161m091l761l310l002l131l532l477k650j811j902k830l676l833l387
59208D96768k683k033j705j695j702j646j894k570l071k824k107j602j357r37
$$ plain form
59194 468942 468661 468890 469320 469862 470569 471464 472592 473976 475415 476713 478183 480484 483778 487468 490955 494208
59178 494208 497406 500540 503722 507354 511559 515828 519687 523430 527693 532582 537696 542825 548137 553767
59164 553767 559654 565754 572004 578064 583374 587468 590039 590749 589262 585526 579893 572943 565262 557231
59150 557231 548892 540091 530876 521638 512718 504040 495326 486614 478373 471081 464769 458952 453087 447221
59136 447221 442059 438138 434987 431465 427034 422365 418593 416274 415209 414890 414821 414714 414724 415426 417324 420440
59120 420440 424497 429327 434961 441482 448923 457133 465658 473920 481639 488912 495866 502524 509033 515623
59106 515623 522147 528014 532835 536808 540264 543184 545467 547276 548646 549029 547790 545148 542143 539592
59092 539592 537411 535093 532521 530085 528132 526629 525408 524458 523731 522724 520680 517377 513408 509416 505333
$$ packed form
59194D68942k81K29M30N42P07Q95J128J384J439J298J470K301L294L690L487L253
59178D94208L198L134L182L632M205M269L859L743M263M889N114N129N312N630
59164E53767N887O100O250O060N310M094K571P10j487l736n633o950p681q031
59150E57231q339q801r215r238q920q678q714q712q241p292o312n817n865n866
59136D47221n162l921l151l522m431m669l772k319j065l19o9j07J0P02J898L116
59120D20440M057M830N634O521P441Q210Q525Q262P719P273O954O658O509O590
59106E15623O524N867M821L973L456K920K283J809J370L83j239k642l005k551
59092E39592k181k318k572k436j953j503j221r50p27j007k044l303l969l992m083
$$ plain form
59077 505333 500778 495892 491208 486804 482242 477371 472581 468111 463717 459293 455281 452121 449667 447489
59063 447489 445379 443273 440981 438348 435494 432683 430127 427977 426234 424692 423324 422650 423134 424229 424752
59048 424752 424409 424140 424608 425189 424999 424173 423440 423018 422724 422673 423021 423327 423007 422278 421973 422549 423875 425830
59030 425830 428446 431561 434948 438711 443063 447895 453160 459462 467518 477044 486868 496207 505227 514255
59016 514255 523068 531103 537838 542765 545522 546265 545588 543913 541363 538333 535755 534482 534634 535691 537008
59001 537008 538144 539023 539985 541556 544011 547199 550778 554457 558048 561392 564247 566190 566867 566454 565621
58986 565621 564772 563570 561582 559131 557068 555870 555508 556130 558227 561979 566902 572396 578357 585090 592904
58971 592904 601952 612246 623613 635698 648191 660999 674141 687394 700056 711189 720321 727795
$$ packed form
59077E05333m555m886m684m404m562m871m790m470m394m424m012l160k454k178
59063D47489k110k106k292k633k854k811k556k150j743j542j368o74M84J095N23
59048D24752l43k69M68N81j90q26p33m22k94n1L48L06l20p29l05N76J326J955
59030D25830K616L115L387L763M352M832N265O302Q056R526R824R339R020R028
59016E14255Q813Q035O735M927K757P43o77j675k550l030k578j273J52J057J317
59001E37008J136Q79R62J571K455L188L579L679L591L344K855J943O77m13q33
58986E65621q49j202j988k451k063j198l62O22K097L752M923N494N961O733P814
58971E92904R048J0294J1367J2085J2493J2808J3142J3253J2662J1133R132P474
$$ plain form
58959 727795 734080 738805 741043 740638 738579 735603 731035 723671 713407 701276 688172 674368 660183
58946 660183 646273 633067 620504 608515 597310 587027 577553 568869 561199 554653 549026 544092 539872
58933 539872 536551 534305 533113 532544 531878 530784 529684 529058 528582 527504 525771 524173 523345 523171 523275 523538
58917 523538 523953 524410 524794 525032 524987 524723 524870 526205 528749 531771 534796 538133 542253 547231 553131 560450
58901 560450 569637 580441 592090 603979 615825 627328 638114 648063 657511 666995 676884 687246
58889 687246 698058 709481 721788 734954 748471 761733 774491 786714 798134 808133 815998 821098
58877 821098 823052 822046 818835 814049 807606 799080 788537 776623 764044 751382 739301 728321 718336
58864 718336 708798 699444 690447 681882 673531 665283 657266 649475 641697 633872 626121 618317 610144 601699
$$ packed form
58959G27795O285M725K238m05k059k976m568p364j0264j2131j3104j3804j4185
58946F60183j3910j3206j2563j1989j1205j0283r474q684p670o546n627m934m220
58933E39872l321k246j192n69o66j094j100o26m76j078j733j598q28j74J04K63
58917E23538M15M57L84K38m5k64J47J335K544L022L025L337M120M978N900P319
58901E60450R187J0804J1649J1889J1846J1503J0786R949R448R484R889J0362
58889F87246J0812J1423J2307J3166J3517J3262J2758J2223J1420R999P865N100
58877H21098J954j006l211m786o443q526j0543j1914j2579j2662j2081j0980r985
58864G18336r538r354q997q565q351q248q017p791p778p825p751p804q173q445
$$ plain form
58850 601699 593602 586310 579721 573607 568021 562996 558183 553099 547531 541565 535441 529458 523711 517804
58836 517804 511181 503901 496785 490635 485574 481305 477671 474724 472511 471095 470651 471293 472838 474887 477122
58821 477122 479495 482172 485308 488862 492737 497106 502323 508294 514246 519401 523664 527323 530348 532482
58807 532482 533827 534730 535142 534632 533033 530559 527255 522935 517793 512515 507449 502006 495252 486978 478040
58792 478040 469710 462698 456654 450753 444794 439484 435518 432815 431042 430359 431045 432716 434660 436678 438944
58777 438944 441253 443195 444883 446660 448248 449034 449047 448611 447135 443451 437612 431205 425476 420144 414580
58762 414580 409153 404683 401321 398610 396117 393493 390531 387664 385807 385209 385108 384989 385426 387026 389257
58747 389257 391120 392455 393780 395282 396837 398754 401587 405232 408951 412370 415915 420147 425026 429915
$$ packed form
58850F01699q097p292o589o114n586n025m813n084n568n966o124n983n747n907
58836E17804o623p280p116o150n061m269l634k947k213j416m44O42J545K049K235
58821D77122K373K677L136L554L875M369N217N971N952N155M263L659L025K134
58807E32482J345R03M12n10j599k474l304m320n142n278n066n443o754q274q938
58792D78040q330p012o044n901n959n310l966k703j773o83O86J671J944K018K266
58777D38944K309J942J688J777J588P86J3m36j476l684n839o407n729n332n564
58762D14580n427m470l362k711k493k624k962k867j857n98j01j19M37J600K231
58747C89257J863J335J325J502J555J917K833L645L719L419L545M232M879M889
$$ plain form
58733 429915 434096 437318 439963 442633 445522 448345 450814 452834 454277 455076 455611 456457 457676 458916 460218
58718 460218 461962 463938 465449 466668 468832 472463 476345 479103 481012 483231 485841 487686 487837 486278
58704 486278 483320 479256 474431 468892 462031 453273 443002 432210 421368 410407 399644 389934 381754
58691 381754 374783 368528 362903 358018 353843 350183 346735 343171 339427 335843 332767 330119 327601 325099
58677 325099 322661 320355 318477 317562 317739 318411 319109 320326 322882 326660 330728 334671 339099 344667 351149
58662 351149 357734 363834 369321 374171 378047 380268 380258 378161 374844 371130 367148 362622 357579 352517 347987
58647 347987 344274 341355 338959 336709 334355 331821 329119 326506 324610 323880 323908 323901 323982 325278 328351 332202
58631 332202 335379 337500 339081 340334 340906 340632 339894 339287 339271 339929 340772 341106 340962 341270 342753 345116 347738
$$ packed form
58733D29915M181L222K645K670K889K823K469K020J443P99N35Q46J219J240J302
58718D60218J744J976J511J219K164L631L882K758J909K219K610J845J51j559
58704D86278k958m064m825n539o861q758j0271j0792j0842j0961j0763r710q180
58691C81754o971o255n625m885m175l660l448l564l744l584l076k648k518k502
58677C25099k438k306j878r15J77O72O98J217K556L778M068L943M428N568O482
58662C51149O585O100N487M850L876K221j0k097l317l714l982m526n043n062m530
58647C47987l713k919k396k250k354k534k702k613j896p30K8pQ1J296L073L851
58631C32202L177K121J581J253N72k74p38o07j6O58Q43L34j44L08J483K363K622
$$ plain form
58614 347738 350664 354277 358465 362767 367036 371252 374978 377705 379543 380947 381951 382316 382243 382246 382404 382364
58598 382364 382020 381626 381254 380689 379884 379105 378655 378755 379555 380970 382747 385015 388428 393372 399399 405904
58582 405904 412896 420521 428245 435314 441772 448235 454768 460698 465560 469670 473785 478685 484963 492743
58568 492743 501611 511205 521708 533445 546347 560293 575679 593045 612265 632515 652696 671539
58556 671539 687815 701059 711694 719877 724799 725884 724096 721064 717295 712338 706457 700886 696275
58543 696275 691913 686772 680482 672976 663884 652702 639249 623787 606954 589543 572057 554614
58531 554614 537552 521810 508297 497180 488137 480899 475093 470179 466181 463884 463476 463632 462900 461501
58517 461501 460643 460455 459849 458239 456160 454159 452128 449848 447287 444398 441428 439268 438545 438565 438183 437458
$$ packed form
58614C47738K926L613M188M302M269M216L726K727J838J404J004L65p3LJ58m0
58598C82364l44l94l72n65q05p79m50J00Q00J415J777K268L413M944O027O505
58582D05904O992P625P724P069O458O463O533N930M862M110M115M900O278P780
58568D92743Q868R594J0503J1737J2902J3946J5386J7366J9220K0250K0181J8843
58556F71539J6276J3244J0635Q183M922J085j788l032l769m957n881n571m611
58543F96275m362n141o290p506r092j1182j3453j5462j6833j7411j7486j7443
58531E54614j7062j5742j3513j1117r043p238n806m914l998k297m08J56p32j399
58517D61501q58j88o06j610k079k001k031k280k561k889k970k160p23K0l82p25
$$ plain form
58501 437458 437201 437092 435772 432965 430087 428327 427432 426824 426675 427186 427921 428618 429889 432442 436287 441209
58485 441209 447299 454487 462228 470211 478832 488542 499294 511036 524083 538432 553146 566936 579015
58472 579015 588994 596369 600585 601465 599282 594534 587708 579179 569458 559699 551650 546507 543996 543033 543051
58457 543051 544157 546439 549960 555204 562563 571383 580323 588627 596194 602438 606064 606117 602602 596052 587245
58442 587245 577256 566910 556182 544953 534236 525601 519406 514609 510425 507131 505158 504489 505243 507818
58428 507818 512098 517406 523560 531123 540306 550355 560224 569111 576304 581351 584437 585807 584847 580786
58414 580786 574227 566785 559115 550629 541367 532686 525496 519077 512412 505706 499805 494995 491115 488206
58400 488206 486274 484835 483342 481812 480781 480873 482436 485204 488314 491103 493676 496260 498493 500104 501753
$$ packed form
58501D37458k57j09j320k807k878j760q95o08j49N11P35O97J271K553L845M922
58485D41209O090P188P741P983Q621R710J0752J1742J3047J4349J4714J3790J2079
58472E79015R979P375M216Q80k183m748o826q529r721r759q049n143k511r63J8
58457E43051J106K282L521N244P359Q820Q940Q304P567O244L626N3l515o550q807
58442E87245r989j0346j0728j1229j0717q635o195m797m184l294j973o69P54K575
58428E07818M280N308O154P563R183J0049R869Q887P193N047L086J370r60m061
58414E80786o559p442p670q486r262q681p190o419o665o706n901m810l880k909
58400D88206j932j439j493j530j031R2J563K768L110K789K573K584K233J611J649
$$ plain form
58385 501753 504111 506540 507934 508539 509650 511753 514371 517475 521510 526129 530478 534736 539766 545241
58371 545241 549908 553886 558851 565558 572935 580124 587676 596084 604768 613305 622179 631619 641038 650247
58357 650247 659820 669632 678390 685223 690441 694274 696279 696525 695961 695098 693731 692375 692377 694083 696433 698893
58341 698893 702152 706496 711291 716710 724055 733580 743750 753544 763745 775077 786830 798323 810043
58328 810043 822235 833862 843948 852556 859740 865025 868607 871448 873589 874217 873928 874882 877897 881442
58314 881442 884335 887331 891162 895279 899631 905430 912988 920952 928834 937979 948790 959391 968531 977543
58300 977543 987926 999245 1010829 1023176 1036075 1047781 1057838 1068422 1081184 1095053 1108836
58289 1108836 1123501 1139987 1157215 1174311 1192390 1212127 1231909 1250536 1269367 1289803 1311058
$$ packed form
58385E01753K358K429J394O05J111K103K618L104M035M619M349M258N030N475
58371E45241M667L978M965O707P377P189P552Q408Q684Q537Q874R440R419R209
58357F50247R573R812Q758O833N218L833K005K46n64q63j367j356KJ706K350K460
58341F98893L259M344M795N419P345R525J0170R794J0201J1332J1753J1493J1720
58328H10043J2192J1627J0086Q608P184N285L582K841K141O28k89R54L015L545
58314H81442K893K996L831M117M352N799P558P964P882R145J0811J0601R140R012
58300I77543J0383J1319J1584J2347J2899J1706J0057J0584J2762J3869J3783
58289A108836J4665J6486J7228J7096J8079J9737J9782J8627J8831K0436K1255
$$ plain form
58278 1311058 1332465 1355443 1381027 1408059 1435983 1466645 1500984 1536781 1572188 1608667 1647863
58267 1647863 1688624 1729882 1773381 1820495 1869349 1918234 1968795 2022517 2077207 2130541 2184016
58256 2184016 2239623 2295678 2349943 2403956 2460175 2517699 2575074 2634495 2698807 2767019 2837176
58245 2837176 2910976 2991122 3076841 3166537 3262017 3365431 3474959 3588365 3707814 3836299
58235 3836299 3972452 4114118 4263734 4424706 4595838 4775137 4965693 5171708 5392251
58226 5392251 5625307 5874419 6144647 6435691 6746028 7079996 7443319 7835733 8256063
58217 8256063 8710576 9208020 9750773 10339994 10985088 11698583 12486400 13353665 14315640
58208 14315640 15392459 16598880 17951604 19481930 21229924 23234661 25546882 28247357
$$ packed form
58278A311058K1407K2978K5584K7032K7924L0662L4339L5797L5407L6479L9196
58267A647863M0761M1258M3499M7114M8854M8885N0561N3722N4690N3334N3475
58256B184016N5607N6055N4265N4013N6219N7524N7375N9421O4312O8212P0157
58245B837176P3800Q0146Q5719Q9696R5480J03414J09528J13406J19449J28485
58235C836299J36153J41666J49616J60972J71132J79299J90556K06015K20543
58226E392251K33056K49112K70228K91044L10337L33968L63323L92414M20330
58217H256063M54513M97444N42753N89221O45094P13495P87817Q67265R61975
58208A4315640J076819J206421J352724J530326J747994K004737K312221K700475
$$ plain form
58200 28247357 31441540 35249351 39821586 45358769 52096748 60289399 70222785 82199739
58192 82199739 96430004 112916831 131484155 151879958 173728308 196299756 218362290
58185 218362290 238292431 254297961 264583210 267597351 262543358 249889377 231356197
58178 231356197 209264605 185745243 162354896 140131964 119763871 101661190 85983111
58171 85983111 72688024 61593819 52427976 44884672 38681379 33579268 29371031 25876369
58163 25876369 22952879 20494386 18413754 16636263 15106498 13785998 12640162 11635391
58155 11635391 10747307 9960338 9258160 8623206 8045048 7519947 7041811 6601728 6196119
58146 6196119 5826869 5492723 5187796 4908632 4655417 4425651 4213352 4015295 3832088
$$ packed form
58200B8247357L194183L807811M572235N537183O737979Q192651R933386J1976954
58192H2199739J4230265J6486827J8567324K0395803K1848350K2571448K2062534
58185B18362290J9930141J6005530J0285249L014141n053993j2653981j8533180
58178B31356197k2091592k3519362k3390347k2222932k0368093j8102681j5678079
58171H5983111j3295087j1094205r165843p543304o203293n102111m208237l494662
58163B5876369k923490k458493k080632j777491j529765j320500j145836j004771
58155A1635391q88084p86969p02178o34954n78158n25101m78136m40083m05609
58146F196119l69250l34146l04927k79164k53215k29766k12299j98057j83207
$$ plain form
58137 3832088 3662562 3502643 3350076 3205088 3066313 2931172 2800275 2676653 2560768
58128 2560768 2450905 2347844 2254040 2168413 2086968 2008528 1935126 1866843 1801168 1737600 1678196
58117 1678196 1623199 1570538 1519965 1473425 1430847 1389729 1349382 1311671 1277024 1243482 1210288
58106 1210288 1178774 1149166 1119940 1090920 1063734 1038647 1014095 989769 967078 946108 925159
58095 925159 903776 883370 864424 845886 827687 811133 796381 782104 767832 754152 740557
58084 740557 725857 710748 697211 685224 672789 659356 646392 634324 621777 608254 594936
58073 594936 582349 569736 557067 545213 533876 521875 509726 499382 491148 483398 475577 468777
58061 468777 462993 456642 449428 442986 437900 432602 426032 419007 412134 404749 396802 389642 383961 378875
$$ packed form
58137C832088j69526j59919j52567j44988j38775j35141j30897j23622j15885
58128B560768j09863j03061r3804q5627q1445p8440p3402o8283o5675o3568n9404
58117A678196n4997n2661n0573m6540m2578m1118m0347l7711l4647l3542l3194
58106A210288l1514k9608k9226k9020k7186k5087k4552k4326k2691k0970k0949
58095I25159k1383k0406j8946j8538j8199j6554j4752j4277j4272j3680j3595
58084G40557j4700j5109j3537j1987j2435j3433j2964j2068j2547j3523j3318
58073E94936j2587j2613j2669j1854j1337j2001j2149j0344q234p750p821o800
58061D68777n784o351p214o442n086n298o570p025o873p385p947p160n681n086
$$ plain form
58047 378875 373750 369009 364614 359861 355262 352456 351552 350624 348500 345898 343159 339264 334092 329345 325983
58032 325983 322673 318044 312658 307506 302244 296236 289890 283750 277502 270924 264667 259247 254359 249871
58018 249871 246246 243405 240516 237414 234915 233171 231263 228907 226962 225645 223934 221484 219470 218619
58004 218619 217979 216652 215340 215149 216094 217682 219713 221676 222610 222460 222445 223316 224446 225246 226169 227509 228539
57987 228539 228684 228286 227402 225175 221409 217507 214827 213082 211270 209151 206940 204626 202465 201174 200767
57972 200767 200128 198500 196487 194914 193731 192720 192161 192024 191528 190270 188837 187632 186244 184604 183494
57957 183494 183106 182335 180418 178094 176233 174497 172404 170513 169441 168741 167896 167364 167488 167441 166545 165697 166143
57940 166143 167649 169277 171274 174679 179459 184466 189064 193629 198491 203373 207790 211216 213043 213102 212048
$$ packed form
58047C78875n125m741m395m753m599k806r04r28k124k602k739l895n172m747l362
58032C25983l310m629n386n152n262o008o346o140o248o578o257n420m888m488
58018B49871l625k841k889l102k499j744j908k356j945j317j711k450k014q51
58004B18619o40j327j312j91R45J588K031J963R34j50j5Q71J130Q00R23J340J030
57987B28539J45l98q84k227l766l902k680j745j812k119k211k314k161j291m07
57972B00767o39j628k013j573j183j011n59j37m96j258j433j205j388j640j110
57957A83494l88p71j917k324j861j736k093j891j072p00q45n32J24m7q96q48M46
57940A66143J506J628J997L405M780N007M598M565M862M882M417L426J827N9j054
$$ plain form
57925 212048 210644 208904 206490 203526 200480 197554 194681 191804 188795 185591 182688 180881 180183 179660 178647
57910 178647 177399 176263 175199 174531 175021 176610 178178 179219 180545 182482 183630 182651 180278 178249 177027
57895 177027 175834 174267 172582 170902 169325 168399 168347 168245 167069 165141 163496 162261 160749 158810 156953
57880 156953 155433 154246 153667 153717 153392 151589 148690 146194 144965 144776 145318 146448 147499 147593 146845 146336 146691
57863 146691 147495 148232 148993 150009 151246 152698 154550 156862 159462 162236 165154 168075 170914 173797 176658
57848 176658 178940 180232 180889 181446 181641 180736 178581 175702 172472 168893 165118 161490 158089 154845 152077
57833 152077 150296 149383 148442 146612 143798 140675 138256 137152 136900 136281 134690 132854 131852 131847 132335 133089
57817 133089 134076 134812 134771 134357 134629 135932 137386 137717 136124 132454 127268 121768 117061 113307 109934 106666
$$ packed form
57925B12048j404j740k414k964l046k926k873k877l009l204k903j807o98n23j013
57910A78647j248j136j064o68M90J589J568J041J326J937J148r79k373k029j222
57895A77027j193j567j685j680j577r26n2j02j176j928j645j235j512j939j857
57880A56953j520j187n79N0l25j803k899k496j229j89N42J130J051R4p48n09L55
57863A46691Q04P37P61J016J237J452J852K312K600K774K918K921K839K883K861
57848A76658K282J292O57N57J95r05k155k879l230l579l775l628l401l244k768
57833A52077j781r13r41j830k814l123k419j104k52o19j591j836j002nM88P54
57817A33089R87P36m1m14K72J303J454L31j593l670n186n500m707l754l373l268
$$ plain form
57801 106666 103892 102034 101005 100328 99515 98429 97529 97546 98539 99537 99605 99032 98984 100246 102787 106268 110229
57784 110229 113873 116489 118292 120382 123629 127893 132299 136014 138767 140953 143182 145528 147267 147637
57770 147637 146683 145128 143616 142341 141164 139703 137517 134566 131382 128550 126174 123979 121645 118882
57756 118882 115674 112642 110633 109625 108661 107305 106495 107307 109469 111784 113533 114704 115322 115443 115533 116064
57740 116064 116970 118134 120007 122860 125810 127633 128411 129373 131191 133399 135543 137775 139972 141242 140879
57725 140879 139298 137571 136408 135931 136033 136523 137023 136996 135967 133835 131018 128148 125452 122675 119655 116612
57709 116612 113631 110349 106550 102654 99142 95913 92716 89810 87662 86293 85463 85105 85074 84869 84248 83638
57693 83638 83275 82434 80346 77444 74767 72456 69880 67043 64796 63638 63197 62941 62666 62310 62083 62795
$$ packed form
57801A06666k774j858j029o77q13j086r00J7R93R98O8n73m8J262K541L481L961
57784A10229L644K616J803K090L247M264M406L715K753K186K229K346J739L70
57770A47637r54j555j512j275j177j461k186k951l184k832k376k195k334k763
57756A18882l208l032k009j008r64j356q10Q12K162K315J749J171O18J21R0N31
57740A16064R06J164J873K853K950J823P78R62J818K208K144K232K197J270l63
57725A40879j581j727j163m77J02M90N00k7j029k132k817k870k696k777l020l043
57709A16612k981l282l799l896l512l229l197k906k148j369q30l58l1k05o21o10
57693H3638l63q41k088k902k677k311k576k837k247j158m41k56k75l56k27P12
$$ plain form
57677 62795 65332 69871 76217 84691 95910 109923 126531 146260 169990 197632 228126 260588
57665 260588 294203 326851 354955 375012 384438 381178 364236 335479 299778 262397 226557 193658
57653 193658 164636 140165 120195 104215 91771 82323 75064 69322 64778 61038 57518 54051 51066
57640 51066 48809 46995 45534 44879 45177 45706 45739 45465 45467 45767 46007 46167 46477 46829 46826 46254 45121 43461 41531
57621 41531 39925 39050 38560 37723 36261 34510 32837 31207 29338 27109 24817 23061 22231 22013 21565 20295
57605 20295 18416 16699 15720 15311 14632 12944 10397 7882 5926 4119 1922 -480 -2688 -4989 -7909
57590 -7909 -11099 -13593 -15140 -16470 -18117 -19818 -21311 -22902 -24881 -26944 -28591 -29639 -30199 -30636 -31638
57575 -31638 -33721 -36494 -39040 -41170 -43573 -46537 -49252 -50828 -51379 -51692 -52360 -53600 -55403 -57418 -59072
$$ packed form
57677F2795K537M539O346Q474J1219J4013J6608J9729K3730K7642L0494L2462
57665B60588L3615L2648K8104K0057R426l260j6942k8757l5701l7381l5840l2899
57653A93658k9022k4471j9970j5980j2444r448p259n742m544l740l520l467k985
57640E1066k257j814j461o55K98N29L3k74KL00K40J60L10L52ln72j133j660j930
57621D1531j606q75m90q37j462j751j673j630j869k229k292j756q30k18m48j270
57605B0295j879j717r79m09o79j688k547k515j956j807A922d80k208k301k920
57590g909l190k494j547j330j647j701j493j591j979k063j647j048n60m37j002
57575c1638k083k773k546k130k403k964k715j576n51l13o68j240j803k015j654
$$ plain form
57560 -59072 -60145 -60916 -61588 -62047 -62310 -62614 -62820 -62416 -61380 -60441 -60073 -59886 -59421 -58929 -58891 -59296 -59908 -60773 -61915
57541 -61915 -62927 -63385 -63408 -63449 -63766 -64284 -64644 -64238 -62799 -61192 -60920 -62449 -64616 -66125 -66986 -67922 -69014
57524 -69014 -69713 -69790 -69535 -69240 -68989 -68758 -68331 -67445 -66389 -65994 -66575 -67316 -67286 -66611 -66096 -66063 -66232 -66407 -66571 -66503
57504 -66503 -66031 -65558 -65793 -66974 -68795 -70950 -73313 -75725 -78075 -80464 -82906 -85059 -86670 -88074 -89714
57489 -89714 -91343 -92288 -92478 -92689 -93667 -95360 -97127 -98491 -99612 -101084 -103235 -105641 -107593 -109031 -110568
57474 -110568 -112502 -114344 -115663 -116854 -118599 -120960 -123523 -126086 -128679 -131124 -133123 -134684 -136041 -137262
57460 -137262 -138244 -138914 -139174 -138897 -138231 -137607 -137224 -136913 -136780 -137398 -138892 -140401 -141103 -141332 -141964 -143106 -144230
57443 -144230 -145315 -146914 -149096 -151166 -152619 -153647 -154549 -155279 -155786 -156255 -156687 -156734 -156267 -155805 -156038 -157114 -158633
$$ packed form
57560e9072j073p71o72m59k63l04k06M04J036R39L68J87M65M92L8m05o12q65j142
57541f1915j012m58k3m1l17n18l60M06J439J607K72j529k167j509q61r36j092
57524f9014o99p7K55K95K51K31M27Q86J056L95n81p41L0O75N15L3j69j75j64O8
57504f6503M72M73k35j181j821k155k363k412k350k389k442k153j611j404j640
57489h9714j629r45j90k11r78j693j767j364j121j472k151k406j952j438j537
57474a10568j934j842j319j191j745k361k563k563k593k445j999j561j357j221
57460a37262r82o70k60K77O66O24L83L11J33o18j494j509p02k29o32j142j124
57443a44230j085j599k182k070j453j028r02p30n07m69m32m7M67M62k33j076j519
$$ plain form
57426 -158633 -160195 -161707 -163182 -164431 -165088 -165006 -164552 -164402 -165054 -166623 -168981 -171753 -174277 -176036 -177302 -178880
57410 -178880 -180993 -182827 -183464 -182892 -181810 -180841 -180373 -180763 -182128 -184039 -185865 -187374 -188719 -189960 -190885 -191271
57394 -191271 -191170 -190994 -191333 -192409 -193693 -194413 -194563 -194982 -196311 -198295 -200248 -201687 -202342 -202100 -201301 -200580 -200165
57377 -200165 -199828 -199710 -200521 -202608 -205525 -208867 -212744 -216975 -220687 -223419 -225864 -228781 -231857 -234412 -236529
57362 -236529 -238606 -240476 -241931 -243502 -245617 -247548 -248330 -248336 -248748 -249783 -250634 -250953 -251175 -251456 -251464 -251227 -251141 -251172
57344 -251172 -251101 -251473 -253138 -255818 -258355 -260452 -262882 -265808 -268285 -269875 -271418 -273513 -275420 -276338 -276822
57329 -276822 -277960 -279811 -281591 -282935 -284102 -285260 -286332 -287436 -288846 -290569 -292363 -294082 -295718 -297246
57315 -297246 -298628 -299830 -300718 -301148 -301255 -301383 -301608 -301671 -301435 -301079 -300759 -300475 -300340 -300550 -300956 -301097 -300799 -300375
$$ packed form
57426a58633j562j512j475j249o57Q2M54J50o52j569k358k772k524j759j266j578
57410a78880k113j834o37N72J082R69M68l90j365j911j826j509j345j241r25l86
57394a91271J01J76l39j076j284p20j50m19j329j984j953j439o55K42P99P21M15
57377b00165L37J18q11k087k917l342l877m231l712k732k445k917l076k555k117
57362b36529k077j870j455j571k115j931p82om12j035q51l19k22k81qK37Q6l1
57344b51172P1l72j665k680k537k097k430k926k477j590j543k095j907r18m84
57329b76822j138j851j780j344j167j158j072j104j410j723j794j719j636j528
57315b97246j382j202q88m30j07j28k25o3K36L56L20K84J35k10m06j41K98M24
$$ plain form
57297 -300375 -300124 -300026 -299928 -299601 -298614 -296791 -294885 -294105 -294693 -295555 -295629 -295062 -294591 -294358 -293913 -293080 -292260 -291957 -292355
57278 -292355 -293329 -294600 -295934 -297389 -299290 -301864 -304923 -307894 -310181 -311598 -312621 -313978 -315783 -317372
57264 -317372 -318299 -319147 -320809 -323236 -325551 -327202 -328292 -328925 -329102 -329333 -330421 -332321 -333875 -334067 -333043 -331714
57248 -331714 -330899 -330991 -331836 -332656 -332599 -331610 -330235 -328544 -325920 -322146 -317912 -313978 -310538 -307731 -306021 -305629
57232 -305629 -306243 -307708 -310277 -313753 -317152 -319896 -322609 -326015 -329698 -332748 -335017 -336772 -337606 -336819 -334720
57217 -334720 -332497 -330767 -329126 -327219 -325411 -324224 -323819 -324382 -326345 -329846 -334446 -339748 -345898 -353061 -360731
57202 -360731 -368064 -374743 -381026 -386869 -391425 -393730 -393709 -392209 -390067 -387397 -383868 -379274 -373622 -366922 -359335
57187 -359335 -351469 -344125 -337721 -332249 -327733 -324290 -321691 -319306 -316778 -314452 -312990 -312824 -314117 -316938
$$ packed form
57297c00375K51R8R8L27R87J823J906P80n88q62p4N67M71K33M45Q33Q20L03l98
57278b92355r74j271j334j455j901k574l059k971k287j417j023j357j805j589
57264c17372r27q48j662k427k315j651j090o33j77k31j088j900j554j92J024J329
57248c31714Q15r2q45q20N7R89J375J691K624L774M234L934L440K807J710L92
57232c05629o14j465k569l476l399k744k713l406l683l050k269j755q34P87K099
57217c34720K223J730J641J907J808J187M05n63j963l501m600n302o150p163p670
57202c60731p333o679o283n843m556k305K1J500K142K670L529M594N652O700P587
57187c59335P866P344O404N472M516L443K599K385K528K326J462J66j293k821
$$ plain form
57173 -316938 -321163 -326416 -332415 -339356 -347842 -358560 -372046 -388641 -408531 -431987 -459567 -491872
57161 -491872 -529041 -570824 -617335 -669490 -728406 -794378 -866548 -943501 -1024062 -1107643 -1194044
57150 -1194044 -1283087 -1374524 -1468253 -1564487 -1663660 -1766352 -1873407 -1985889 -2104628 -2229923
57140 -2229923 -2361921 -2501208 -2648798 -2805630 -2972332 -3149399 -3337259 -3536154 -3746094
57131 -3746094 -3966988 -4198735 -4441389 -4695525 -4962499 -5244211 -5542613 -5859454 -6196425
57122 -6196425 -6555576 -6939731 -7352340 -7796587 -8274769 -8789122 -9343431 -9943521 -10596240
57113 -10596240 -11308519 -12087415 -12940503 -13876417 -14906176 -16044669 -17310779 -18726766 -20319498
57104 -20319498 -22123708 -24184595 -26559064 -29318201 -32552088 -36374378 -40925106 -46373164
$$ packed form
57173c16938m225n253n999o941q486j0718j3486j6595j9890k3456k7580l2305
57161d91872l7169m1783m6511n2155n8916o5972p2170p6953q0561q3581q6401
57150a194044q9043r1437r3729r6234r9173j02692j07055j12482j18739j25295
57140b229923j31998j39287j47590j56832j66702j77067j87860j98895k09940
57131c746094k20894k31747k42654k54136k66974k81712k98402l16841l36971
57122f196425l59151l84155m12609m44247m78182n14353n54309o00090o52719
57113a0596240p12279p78896q53088r35914j029759j138493j266110j415987j592732
57104b0319498j804210k060887k374469k759137l233887l822290m550728n448058
$$ plain form
57096 -46373164 -52917745 -60783588 -70206205 -81408296 -94570264 -109797721 -127093216
57089 -127093216 -146342056 -167316363 -189694051 -213087119 -237065750 -261149759 -284751238
57082 -284751238 -307111467 -327322048 -344470771 -357831363 -366959618 -371644026 -371792627
57075 -371792627 -367372757 -358440785 -345213777 -328120324 -307799328 -285046219 -260728263
57068 -260728263 -235704061 -210771168 -186634883 -163877674 -142927814 -124044962 -107331826
57061 -107331826 -92762201 -80213702 -69502073 -60414070 -52731882 -46246929 -40768322
57054 -40768322 -36129126 -32188006 -28826110 -25943883 -23459738 -21307713 -19433506 -17792132
57046 -17792132 -16347574 -15071004 -13937478 -12925002 -12016194 -11198162 -10459696 -9789954 -9180005
$$ packed form
57096d6373164o544581p865843r422617j1202091j3161968j5227457j7295495
57089a27093216j9248840k0974307k2377688k3393068k3978631k4084009k3601479
57082b84751238k2360229k0210581j7148723j3360592r128255m684408j48601
57075c71792627M419870Q931972J3227008J7093453K0320996K2753109K4317956
57068b60728263K5024202K4932893K4136285K2757209K0949860J8882852J6713136
57061a07331826J4569625J2548499J0711629R088003P682188O484953N478607
57054d0768322M639196L941120L361896K882227K484145K152025J874207J641374
57046a7792132J444558J276570J133526J012476R08808Q18032P38466O69742O09949
$$ plain form
57037 -9180005 -8623357 -8113903 -7644801 -7210032 -6805493 -6427769 -6073206 -5738971 -5423728
57028 -5423728 -5126575 -4846296 -4581988 -4333058 -4098217 -3876058 -3667351 -3475480 -3303731
57019 -3303731 -3152917 -3021679 -2907355 -2805766 -2711731 -2621318 -2533221 -2447497 -2363905 -2281976
57009 -2281976 -2201596 -2122708 -2045215 -1969686 -1897259 -1828319 -1762152 -1698396 -1637854 -1581256 -1528153
56998 -1528153 -1477685 -1429636 -1384114 -1340947 -1300012 -1261441 -1224935 -1189489 -1154207 -1118783 -1082953
56987 -1082953 -1046376 -1009406 -973125 -938179 -904303 -871274 -839395 -808845 -779699 -752889 -729863
56976 -729863 -710563 -692909 -675023 -656970 -639534 -622474 -605063 -587435 -570168 -553026 -535175
56965 -535175 -516281 -496525 -475863 -454054 -431158 -407431 -383030 -358324 -334130 -311178 -289755
$$ packed form
57037i180005N56648N09454M69102M34769M04539L77724L54563L34235L15243
57028e423728K97153K80279K64308K48930K34841K22159K08707J91871J71749
57019c303731J50814J31238J14324J01589R4035R0413Q8097Q5724Q3592Q1929
57009b281976Q0380P8888P7493P5529P2427O8940O6167O3756O0542N6598N3103
56998a528153N0468M8049M5522M3167M0935L8571L6506L5446L5282L5424L5830
56987a082953L6577L6970L6281L4946L3876L3029L1879L0550K9146K6810K3026
56976g29863J9300J7654J7886J8053J7436J7060J7411J7628J7267J7142J7851
56965e35175J8894J9756K0662K1809K2896K3727K4401K4706K4194K2952K1423
$$ plain form
56954 -289755 -270337 -254063 -242036 -234489 -230944 -230615 -232221 -234039 -234775 -234087 -231937 -228010 -222160 -214789
56940 -214789 -206188 -195931 -183416 -168592 -151763 -133153 -113067 -92023 -70414 -48476 -26936 -7178
56927 9443 21922 29151 30153 25262 16413 5777 -5367 -16331 -26559 -36006 -45004 -53153 -59188 -62581
56913 -62581 -64408 -65895 -66936 -66830 -65687 -64162 -62410 -60232 -57815 -55495 -53246 -51074 -49390 -48195 -46510
56898 -46510 -43454 -39417 -35346 -31328 -26820 -21786 -16573 -10887 -3921 4520 13764 23057 32033 40513
56884 40513 48449 55855 62276 66607 68078 67173 65052 62429 59592 57068 55428 54704 54741 55980 59189
56869 59189 64590 71865 80814 91392 103345 116543 131493 148794 168050 187926 207151 224932
56857 224932 240474 252755 260809 263866 261427 253823 242592 229783 216884 204755 194288 186482
$$ packed form
56954b89755J9418J6274J2027P547L545L29j606j818p36O88K150L927N850P371
56940b14789Q601J0257J2515J4824J6829J8610K0086K1044K1609K1938K1540g178
56927I443J2479P229J002m891q849E777e367j0964j0228r447q998q149o035l393
56913f2581j827j487j041J06J143J525J752K178K417K320K249K172J684J195J685
56898d6510L056M037M071M018M508N034N213N686c921D520R244R293Q976Q480
56884D0513P936P406O421M331J471r05k121k623k837k524j640p24L7J239L209
56869E9189N401P275Q949J0578J1953J3198J4950J7301J9256J9876J9225J7781
56857B24932J5542J2281Q054L057k439p604j1231j2809j2899j2129j0467p806
$$ plain form
56845 186482 181909 180603 182516 187731 196357 208586 224696 244615 267608 292756 319512 347443
56833 347443 375605 402539 426627 446011 458413 461608 454324 436894 411490 381781 351592 323264
56821 323264 297591 275392 258235 247049 240872 238017 238021 241629 249231 260376 274652 292037 312193
56808 312193 334050 356156 376977 394854 408237 415978 417179 410991 397193 376943 352582 326692
56796 326692 301471 278555 258860 242625 229813 220354 213893 209894 208252 209310 212991 218564 225646
56783 225646 234606 245389 256690 267026 275899 283011 287153 286967 282373 274211 262970 249007 233600
56770 233600 218431 204156 190617 178302 168251 160422 153451 146419 139899 134908 131728 130080 129583
56757 129583 129565 129095 127801 126276 125366 125313 125712 125958 125671 125024 124679 125134 126194 127384 128562 129724 130562
$$ packed form
56845A86482m573j306J913N215Q626J2229J6110J9919K2993K5148K6756K7931
56833C47443K8162K6934K4088J9384J2402L195p284j7430k5404k9709l0189k8328
56821C23264k5673k2199j7157j1186o177k855ML608P602J1145J4276J7385K0156
56808C12193K1857K2106K0821J7877J3383P741J201o188j3798k0250k4361k5890
56796C26692k5221k2916j9695j6235j2812r459o461l999j642J058L681N573P082
56783B25646Q960J0783J1301J0336Q873P112M142j86m594q162j1241j3963j5407
56770B33600j5169j4275j3539j2315j0051p829o971p032o520m991l180j648m97
56757A29583j8m70j294j525r10n3L99K46k87o47l45M55J060J190J178J162Q38
$$ plain form
56740 130562 130846 130961 131374 131783 131561 130826 130277 130100 129850 129395 129120 129170 129267 129364 129775 130578 131530 132607 134002
56721 134002 135611 137237 139171 141774 144486 146180 146657 146955 147981 149582 151147 152299 152734 152267 151486
56706 151486 151658 153417 156009 158161 159312 159712 159861 160254 161255 162805 164411 165650 166501 167082 167355 167196
56690 167196 166571 165648 164930 165144 166588 168624 170194 170821 170859 170929 171393 172159 172658 172274 171222 170617 171178 172247
56672 172247 172699 172393 171955 171568 170966 170396 170522 171398 172443 173401 174401 175084 174782 173704 172962 173111 173617 174107
56654 174107 175150 177246 179785 181677 182570 182967 183424 184015 184373 184119 183353 182663 182427 182433 182576 183395 185131 186645
56636 186645 186428 184603 182869 182325 182394 182072 181209 180142 179001 177873 177018 176497 176118 175945 176224 176670 176510
56619 176510 175491 174170 173074 172260 171795 171824 171925 171284 169823 168418 167716 167500 167483 167853 168650 169431 169964 170540
$$ packed form
56740A30562K84J15M13M09k22p35n49j77k50m55k75N0R7R7M11Q03R52J077J395
56721A34002J609J626J934K603K712J694M77K98J026J601J565J152M35m67p81
56706A51486J72J759K592K152J151M00J49L93J001J550J606J239Q51N81K73j59
56690A67196o25r23p18K14J444K036J570O27L8P0M64P66M99l84j052o05N61J069
56672A72247M52l06m38l87o02n70J26Q76J045R58J000O83l02j078p42J49N06M90
56654A74107J043K096K539J892Q93L97M57N91L58k54p66o90k36OJ43Q19J736J514
56636A86645k17j825j734n44O9l22q63j067j141j128q55n21l79j73K79M46j60
56619A76510j019j321j096q14m65K9J01o41j461j405p02k16j7L70P97P81N33N76
$$ plain form
56601 170540 171207 171469 171166 170863 170938 171045 170975 171256 172275 173447 173875 173375 172361 171279 170631 170971 172322 174002
56583 174002 175393 176434 177076 176917 175910 174835 174549 175127 176128 177189 178008 178300 178246 178484 179231 179969 180453
56566 180453 181480 184036 188100 192869 197805 202925 208317 213888 219488 224914 229924 234363 238057 240496
56552 240496 241066 239772 237351 234502 231399 228107 225027 222630 221042 220040 219177 217916 216024 213835 211827
56537 211827 210089 208605 207693 207509 207470 206995 206546 206898 207604 207411 206202 205278 205536 206587 207933 209657 211474
56520 211474 212401 212058 211285 210755 209999 208478 206674 205283 204125 202676 201020 199571 198384 197301 196291
56505 196291 195208 193817 192357 191415 190974 190452 189926 190280 191698 193090 193587 193574 193655 193685 193560 193916 195146 196551
56487 196551 197320 197631 198050 198603 199087 199487 199465 198369 196416 194891 194456 194313 193816 193712 194743 196199 197109
$$ packed form
56601A70540O67K62l03l03P5J07p0K81J019J172M28n00j014j082o48L40J351J680
56583A74002J391J041O42j59j007j075k86N78J001J061Q19K92n4K38P47P38M84
56566A80453J027K556M064M769M936N120N392N571N600N426N010M439L694K439
56552B40496N70j294k421k849l103l292l080k397j588j002q63j261j892k189k008
56537B11827j738j484r12j84l9m75m49L52P06j93j209r24K58J051J346J724J817
56520B11474R27l43p73n30p56j521j804j391j158j449j656j449j187j083j010
56505A96291j083j391j460r42m41n22n26L54J418J392M97j3Q1L0j25L56J230J405
56487A96551P69L11M19N53M84M00k2j096j953j525m35j43m97j04J031J456R10
$$ plain form
56470 197109 197901 199503 201524 202708 202667 202027 201328 200937 201464 203097 204917 205909 206238 206626 207044 207060 206912 207144
56452 207144 207586 207795 208034 208817 209885 210630 211147 211906 212794 213390 213722 213864 213371 212059 210760 210237 209965 209065
56434 209065 207856 207233 207049 206475 205630 205483 206281 207296 208048 208745 209595 210579 211778 213049 213732 213526 213253
56417 213253 213824 214874 215458 215629 216162 217107 217794 218003 217982 217563 216422 215008 214121 213742 213336 213061 213576 214847
56399 214847 216241 217568 218936 219839 219593 218598 218076 218555 219571 220703 221856 222735 223068 223335 224314 225962
56383 225962 227533 228568 228967 228544 227484 226793 227230 228181 228639 228787 229447 230495 231156 231459 231978 232530 232649
56366 232649 233025 234863 237869 240441 241836 242670 243293 243303 242861 242917 243735 244478 244616 244593 244827 245183 245618 246273
56348 246273 246789 246646 246278 246740 248179 249764 251116 252609 254236 255509 256615 258379 260836 263048 264544
$$ packed form
56470A97109P92J602K021J184m1o40o99l91N27J633J820R92L29L88M18J6j48K32
56452B07144M42K09K39P83J068P45N17P59Q88N96L32J42m93j312j299n23k72r00
56434B09065j209o23j84n74q45j47P98J015P52O97Q50R84J199J271O83k06k73
56417B13253N71J050N84J71N33R45O87K09k1m19j141j414q87l79m06k75N15J271
56399B14847J394J327J368R03k46r95n22M79J016J132J153Q79L33K67R79J648
56383B25962J571J035L99m23j060o91M37R51M58J48O60J048O61L03N19N52J19
56366B32649L76J838L006K572J395Q34O23J0m42N6Q18P43J38k3K34L56M35O55
56348B46273N16j43l68M62J439J585J352J493J627J273J106J764K457K212J496
$$ plain form
56333 264544 265808 267191 268576 270273 272986 276602 280135 283095 285843 288481 290641 292464 294593 296993
56319 296993 299018 300736 302867 305214 306552 306480 306097 306440 307447 308819 310668 312855 314780 316328 318103
56304 318103 320479 323315 326703 330884 335367 339362 343166 347798 353092 357583 360572 362951 365616 368484
56290 368484 371514 375328 380188 385529 391058 397240 404288 411739 419418 427748 436743 445825 454915 464570
56276 464570 474792 484976 495292 506779 519707 533188 546851 561531 577847 595449 614151
56265 614151 634479 656547 679805 704569 732567 765217 802407 843557 888823 938798 994205
56254 994205 1056423 1127168 1207110 1295803 1393342 1500891 1619245 1748073 1886879 2035239
56244 2035239 2191621 2353259 2517673 2682936 2846011 3002331 3147574 3278489 3391562
$$ packed form
56333B64544J264J383J385J697K713L616L533K960K748K638K160J823K129K400
56319B96993K025J718K131K347J338p2l83L43J007J372J849K187J925J548J775
56304C18103K376K836L388M181M483L995L804M632N294M491K989K379K665K868
56290C68484L030L814M860N341N529O182P048P451P679Q330Q995R082R090R655
56276D64570J0222J0184J0316J1487J2928J3481J3663J4680J6316J7602J8702
56265F14151K0328K2068K3258K4764K7998L2650L7190M1150M5266M9975N5407
56254I94205O2218P0745P9942Q8693R7539J07549J18354J28828J38806J48360
56244B035239J56382J61638J64414J65263J63075J56320J45243J30915J13073
$$ plain form
56235 3391562 3482598 3548444 3587759 3599495 3582320 3536508 3464996 3371625 3259585 3132256 2993915
56224 2993915 2848314 2697693 2544188 2391088 2241672 2097759 1960262 1830187 1708344
56215 1708344 1594997 1490426 1394951 1307979 1228190 1155081 1089089 1029823 975592 925189 878761
56204 878761 836489 797967 763297 733124 706952 683119 660995 641435 624467 608584 593167
56193 593167 579515 568330 558222 547987 538512 530951 524748 518957 513882 509867 505963 501390 497013
56180 497013 493931 491807 489898 488386 487447 486389 485059 484688 486000 487796 488698 488895 488883 488118 486414 485213
56164 485213 485861 487866 490340 493747 498627 503962 508491 512607 517421 523089 529462 537163 546576 556894
56150 556894 567545 579338 592987 607939 624112 643320 667446 696541 730174 769084 813775
$$ packed form
56235C391562R1036O5846L9315J1736j7175m5812p1512r3371j12040j27329j38341
56224B993915j45601j50621j53505j53100j49416j43913j37497j30075j21843
56215A708344j13347j04571r5475q6972p9789p3109o5992n9266n4231n0403m6428
56204H78761m2272l8522l4670l0173k6172k3833k2124j9560j6968j5883j5417
56193E93167j3652j1185j0108j0235r475p561o203n791n075m015l904m573m377
56180D97013l082k124j909j512r39j058j330l71J312J796R02J97j2p65j704j201
56164D85213O48K005K474L407M880N335M529M116M814N668O373P701R413J0318
56150E56894J0651J1793J3649J4952J6173J9208K4126K9095L3633L8910M4691
$$ plain form
56139 813775 862928 914905 969488 1026378 1083374 1137799 1188529 1234995 1275715 1309783 1338624
56128 1338624 1364419 1387875 1409082 1428943 1447675 1463104 1472514 1475329 1472398 1463961 1450121 1431974
56116 1431974 1410200 1383468 1350049 1309989 1264218 1213004 1157215 1099865 1044435 992581 944914
56105 944914 902538 866037 834437 806993 784627 767846 754925 744051 735650 730599 727805 725666
56093 725666 724267 724050 724056 723744 724735 728374 733231 737446 741762 747721 754588 760800 766790 773697 780801 786985
56077 786985 793162 800557 808231 815043 822312 831593 841536 850064 858008 867428 878018 888493 899889
56064 899889 913850 928953 942384 954198 966528 979619 992050 1003851 1016079 1028240 1039330
56053 1039330 1050370 1062823 1075736 1087591 1099559 1113534 1128415 1141896 1154613 1168969 1185113
$$ packed form
56139H13775M9153N1977N4583N6890N6996N4425N0730M6466M0720L4068K8841
56128A338624K5795K3456K1207J9861J8732J5429R410K815k931q437j3840j8147
56116A431974k1774k6732l3419m0060m5771n1214n5789n7350n5430n1854m7667
56105I44914m2376l6501l1600k7444k2366j6781j2921j0874q401n051k794k139
56093G25666j399k17Ol12R91L639M857M215M316N959O867O212N990O907P104O184
56077G86985O177P395P674O812P269R281R943Q528P944R420J0590J0475J1396
56064H99889J3961J5103J3431J1814J2330J3091J2431J1801J2228J2161J1090
56053A039330J1040J2453J2913J1855J1968J3975J4881J3481J2717J4356J6144
$$ plain form
56042 1185113 1201669 1218993 1238107 1257848 1276817 1296689 1319864 1345462 1371509 1399235 1430964
56031 1430964 1465445 1499732 1534142 1570911 1609520 1647967 1687114 1728992 1772305 1814444 1856444
56020 1856444 1901018 1947294 1992699 2038490 2087978 2140682 2193729 2247737 2305736 2367573 2431037
56009 2431037 2497206 2568882 2645001 2722385 2801744 2886111 2974927 3065742 3160089 3261351 3368684
55998 3368684 3479570 3596312 3722928 3857726 3996464 4140814 4295926 4461833 4635535
55989 4635535 4819370 5018480 5232115 5456691 5695341 5954828 6235255 6533075 6851926
55980 6851926 7199439 7575645 7976499 8407007 8878520 9395070 9955522 10567204 11243417
55971 11243417 11989598 12807295 13710260 14721035 15854310 17121715 18551684 20186842
$$ packed form
56042A185113J6556J7324J9114J9741J8969J9872K3175K5598K6047K7726L1729
56031A430964L4481L4287L4410L6769L8609L8447L9147M1878M3313M2139M2000
56020A856444M4574M6276M5405M5791M9488N2704N3047N4008N7999O1837O3464
56009B431037O6169P1676P6119P7384P9359Q4367Q8816R0815R4347J01262J07333
55998C368684J10886J16742J26616J34798J38738J44350J55112J65907J73702
55989D635535J83835J99110K13635K24576K38650K59487K80427K97820L18851
55980F851926L47513L76206M00854M30508M71513N16550N60452O11682O76213
55971A1243417P46181Q17697R02965J010775J133275J267405J429969J635158
$$ plain form
55963 20186842 22066019 24232249 26759206 29750795 33322359 37611931 42808274 49140746
55955 49140746 56850674 66203705 77494381 90942313 106550886 124124224 143422595
55948 143422595 164170896 185804248 207245212 226998103 243400112 254723348 259245758
55941 259245758 255675399 243863640 225174517 202068295 177208724 152753106 130116550
55934 130116550 110041430 92755409 78157669 65997592 55975125 47764220 41036240
55927 41036240 35505668 30947086 27172129 24016940 21355905 19102021 17183397 15532931
55919 15532931 14101017 12857779 11775902 10824410 9981112 9235540 8575464 7983120 7447220
55910 7447220 6965711 6533604 6139635 5777379 5448088 5149609 4873053 4613227 4372409
$$ packed form
55963B0186842J879177K166230K526957K991589L571564M289572N196343O332472
55955D9140746P709928R353031J1290676J3447932J5608573J7573338J9298371
55948A43422595K0748301K1633352K1440964J9752891J6402009J1323236M522410
55941B59245758l570359j1811759j8689123k3106222k4859571k4455618k2636556
55934A30116550k0075120j7286021j4597740j2160077j0022467q210905o727980
55927D1036240n530572m558582l774957l155189k661035k253884j918624j650466
55919A5532931j431914j243238j081877r51492q43298p45572o60076n92344n35900
55910G447220m81509m32107l93969l62256l29291k98479k76556k59826k40818
$$ plain form
55901 4372409 4151092 3944334 3749774 3570193 3405417 3250054 3101842 2964337 2838928
55892 2838928 2721711 2610485 2507605 2413673 2325348 2241489 2164878 2095883 2030876 1968728 1912452
55881 1912452 1862393 1813893 1763724 1713038 1662232 1608789 1552347 1496417 1443066 1390882 1339771
55870 1339771 1292465 1249504 1207869 1166435 1127877 1093423 1060593 1028112 998362 972941 950083
55859 950083 928390 909018 892376 876625 861072 847267 835192 822219 807315 792578 779245
55848 779245 765805 751319 736835 722246 705504 686344 667254 649563 632133 614920 599937
55837 599937 587428 574943 561648 549898 541052 533330 525258 517658 510741 502845 493677 485384 478780
55824 478780 471889 463732 456158 450229 444195 436880 429857 424379 419237 413435 407941 403077 397289 390459
$$ packed form
55901D372409k21317k06758j94560j79581j64776j55363j48212j37505j25409
55892B838928j17217j11226j02880r3932q8325q3859p6611o8995o5007o2148n6276
55881A912452n0059m8500n0169n0686n0806n3443n6442n5930n3351n2184n1111
55870A339771m7306m2961m1635m1434l8558l4454l2830l2481k9750k5421k2858
55859I50083k1693j9372j6642j5751j5553j3805j2075j2973j4904j4737j3333
55848G79245j3440j4486j4484j4589j6742j9160j9090j7691j7430j7213j4983
55837E99937j2509j2485j3295j1750q846p722q072p600o917p896r168q293o604
55824D78780o891q157p574n929o034p315p023n478n142n802n494m864n788o830
$$ plain form
55810 390459 385341 383616 383366 382488 381825 382792 384639 386343 388746 392480 396050 398188 400076 403084 406245
55795 406245 407939 408157 407283 404549 399706 394406 390071 386024 381406 377149 374239 371725 368231 363959 359512
55780 359512 354219 347234 338950 329956 320057 309629 300399 293557 288487 284456 281893 280873 280130 278936
55766 278936 278227 278578 278818 278026 277154 277186 277311 276389 274712 272908 270629 267642 264701 262008 258467 253809
55750 253809 249767 247658 246417 244535 242340 240706 239017 236230 232736 229529 226555 223287 219917 216727
55736 216727 213398 209997 207356 205461 202978 199493 196549 195158 194038 191851 189499 188433 188145 187218 185588
55721 185588 183983 182250 179955 177624 175760 173712 171098 169192 169194 170166 170396 169873 169649 169712 169292 168627 168660
55704 168660 169496 170566 171780 173094 173628 172633 170772 169167 167802 166108 164370 163201 162279 160965 159600
$$ packed form
55810C90459n118j725k50q78o63R67J847J704K403L734L570K138J888L008L161
55795D06245J694K18q74k734m843n300m335m047m618m257k910k514l494m272m447
55780C59512n293o985q284q994r899j0428r230o842n070m031k563j020p43j194
55766B78936p09L51K40p92q72L2J25r22j677j804k279k987k941k693l541m658
55750B53809m042k109j241j882k195j634j689k787l494l207k974l268l370l190
55736B16727l329l401k641j895k483l485k944j391j120k187k352j066k88r27j630
55721A85588j605j733k295k331j864k048k614j906KR72K30n23k24O3m20o65L3
55704A68660Q36J070J214J314N34r95j861j605j365j694j738j169r22j314j365
$$ plain form
55689 159600 159009 159267 160051 161531 163806 166212 168268 170535 173461 176293 178264 179955 182186 184490 185997
55674 185997 186956 188030 188948 189240 189465 190205 190635 189693 188012 187114 187154 187012 186236 185475 185306 185873 187392 189771
55656 189771 192089 193542 194498 195622 196519 196371 195345 194219 193170 192009 190992 190230 188951 186563 183833
55641 183833 181771 179968 177319 173753 169929 165837 161185 156642 153222 150753 148311 145830 143979 142781
55627 142781 141724 140906 140799 141109 141123 140931 141097 141348 140819 139421 137877 136639 135757 135397 135503 135323 134290
55610 134290 132922 131823 130486 128297 126085 125198 125522 125771 125345 124550 123445 121954 120762 120598 120916 120731
55594 120731 120453 121277 123009 124177 124258 124198 124615 125049 125199 125404 125620 125279 124477 124077 124307 124409 124036 123908 124719
55575 124719 126297 128134 130024 132038 134555 138232 143187 148443 152993 157114 161541 165728 168144 168162 166419
$$ packed form
55689A59600n91K58P84J480K275K406K056K267K926K832J971J691K231K304J507
55674A85997R59J074R18K92K25P40M30r42j681q98M0j42p76p61j69N67J519K379
55656A89771K318J453R56J124Q97j48j026j126j049j161j017p62j279k388k730
55641A83833k062j803k649l566l824m092m652m543l420k469k442k481j851j198
55627A42781j057q18j07L10J4j92J66K51n29j398j544j238q82l60J06j80j033
55610A34290j368j099j337k189k212q87L24K49m26p95j105j491j192j64L18j85
55594A20731k78Q24J732J168Q1o0M17M34J50K05K16l41q02m00K30J02l73j28Q11
55575A24719J578J837J890K014K517L677M955N256M550M121M427M187K416J8j743
$$ plain form
55560 166419 163530 159781 155998 153220 151274 148915 145586 141903 138323 134609 130816 127627 125422 124018
55546 124018 123431 123755 124258 123856 122733 122224 122857 123743 124240 124892 126219 127776 129052 130279 131691 132836
55530 132836 133237 133052 132616 131956 131074 130041 128557 126133 122988 120075 117991 116509 115247 114039 112574
55515 112574 110584 108485 106995 105983 104647 102925 101674 101253 101000 100473 100130 100339 100670 100667 100539 100537 100407 99949
55497 99949 99476 99341 99532 99952 100490 100662 99927 98494 97111 95984 94762 93633 93329 93823 94072 93533 92944
55480 92944 93145 94014 95043 96112 97148 97768 97783 97452 96904 96007 95060 94770 95144 95308 94769 93996 93365 92536
55462 92536 91436 90826 91118 91499 91091 90254 89885 90016 89973 89503 88949 88582 88453 88668 89265 90041 90886 91978 93312
55443 93312 94437 94997 95145 95125 94929 94658 94650 94904 94951 94695 94759 95557 96592 97216 97531 97951 98344 98330 98044 97993 98318
$$ packed form
55560A66419k889l749l783k778j946k359l329l683l580l714l793l189k205j404
55546A24018n87L24N03m02j123n09O33Q86M97O52J327J557J276J227J412J145
55530A32836M01j85m36o60q82j033j484k424l145k913k084j482j262j208j465
55515A12574j990k099j490j012j336j722j251m21k53n27l43K09L31lj28kj30m58
55497I9949m73j35J91M20N38J72p35j433j383j127j222j129l04M94K49n39n89
55480I2944K01Q69J029J069J036O20J5l31n48q97r47k90L74J64n39p73o31q29
55462I2536j100o10K92L81m08q37l69J31m3m70n54l67j29K15N97P76Q45J092J334
55443I3312J125N60J48k0j96k71qK54M7k56O4P98J035O24L15M20L93j4k86n1L25
$$ plain form
55422 98318 98716 98928 98934 98842 98905 99411 100299 101092 101470 101671 102148 103020 103965 104398 103830 102472 101397 101464 102136 102125
55402 102125 101190 100391 100378 100523 100172 99695 99511 98985 97263 94654 92295 90821 90155 90259 91218 92709 94093
55385 94093 95019 95481 95399 94676 93546 92421 91475 90676 90115 89953 90190 90747 91564 92338 92438 91451 89699 87982
55367 87982 86972 86933 87691 88620 89002 88736 88423 88555 88917 89039 88934 89014 89523 90318 91045 91335 91010 90243 89335
55348 89335 88239 86644 84579 82578 81091 80088 79348 78828 78693 79299 81137 84312 87977 90810 92146
55333 92146 92261 91587 90318 88805 87618 86921 86380 85850 85625 85867 86393 87152 88188 89038 89005 88271 87912 88502
55315 88502 89509 90329 90971 91362 91014 90003 89275 89241 89003 87791 86284 85527 85352 84978 84528 84695 85271 85273 84451
55296 84451 83618 83426 83724 84186 84778 85474 86129 86808 87735 88865 89871 90544 90822 90547 89624 88387 87425 87097
$$ packed form
55422I8318L98K12Or2O3N06Q88P93L78K01M77Q72R45M33n68j358j075O7O72j1
55402A02125r35p99j3J45l51m77j84n26j722k609k359j474o66J04R59J491J384
55385I4093R26M62q2p23j130j125r46p99n61j62K37N57Q17P74J00r87j752j717
55367H7982j010l9P58R29L82k66l13J32L62J22j05Q0N09P95P27K90l25p67r08
55348H9335j096j595k065k001j487j003p40n20j35O06J838L175L665K833J336
55333I2146J15o74j269j513j187o97n41n30k25K42N26P59J036Q50l3p34l59N90
55315H8502J007Q20O42L91l48j011p28l4k38j212j507p57j75l74m50J67N76Kq22
55296H4451q33j92K98M62N92O96O55O79R27J130J006O73K78k75r23j237r62l28
$$ plain form
55278 87097 87410 88161 88905 89089 88585 87834 87132 86162 84660 83181 82659 83389 84937 86823 88827 90809 92647
55261 92647 94309 95672 96467 96627 96457 96293 96319 96850 98183 99821 100521 99632 97878 96284 94888 93159 91131
55244 91131 89376 88234 87836 88467 90124 91933 92855 92816 92511 92304 92049 91797 91824 91958 91658 90820 89983 89685
55226 89685 90057 91003 92224 93143 93332 93053 92974 93376 93995 94506 94736 94516 93757 92704 91850 91679 92518 94222
55208 94222 95825 96098 94877 93343 92574 92415 92251 92106 92212 92144 91435 90592 90507 91195 92004 92780 93762 94655 94909
55189 94909 94764 94920 95234 94906 93967 93427 93760 94316 94523 94638 94968 95272 95374 95551 95849 95767 95041 94141 93597
55170 93597 93394 93403 93784 94604 95557 96421 97318 98250 98866 98976 98853 98813 98905 99146 99560 99830 99526 98833 98466 98657
55150 98657 98889 98880 99075 99781 100537 100869 101036 101399 101534 100732 99134 97728 97253 97535 97887 97856 97572 97549 98112 98972
$$ packed form
55278H7097L13P51P44J84n04p51p02r70j502j479n22P30J548J886K004J982J838
55261I2647J662J363P95J60j70j64K6N31J333J638P00q89j754j594j396j729k028
55244I1131j755j142l98O31J657J809R22l9l05k07k55k52K7J34l00q38q37k98
55226H9685L72R46J221R19J89k79p9M02O19N11K30k20p59j053q54j71Q39J704
55208I4222J603K73j221j534p69j59j64j45J06o8p09q43q5O88Q09P76R82Q93K54
55189I4909j45J56L14l28r39n40L33N56K07J15L30L04J02J77K98q2p26r00n44
55170I3597k03RL81Q20R53Q64Q97R32O16J10j23m0R2K41M14K70l04o93l67J91
55150I8657K32rJ95P06P56L32J67L63J35q02j598j406m75K82L52l1k84k3N63Q60
$$ plain form
55130 98972 99490 99295 98416 96938 95040 93402 92962 93976 95718 97289 98335 98868 98933 98793 98919 99394 99705
55113 99705 99493 99113 99031 99051 98691 98037 97627 97567 97327 96561 95696 95497 96227 97460 98627 99530 100277 100923 101437
55094 101437 101984 102837 103876 104526 104538 104464 104889 105503 105539 104993 104731 105376 106705 108189 109504 110364 110486 109997
55076 109997 109398 108936 108460 108012 107974 108385 108705 108571 108264 108129 108087 108103 108544 109564 110579 110927 110721 110528 110517
55057 110517 110478 110400 110435 110403 109880 108775 107430 106138 104930 103800 102867 102276 102145 102505 103108 103414 103033 102073
55039 102073 100856 99501 98047 96857 96445 96828 97316 97073 95913 94547 94050 94914 96593 98119 99153 100083
55023 100083 101114 101814 101849 101674 101944 102482 102482 101699 100913 100963 101697 102155 101684 100632 99910 99975 100403 100528 100321 100368
55003 100368 101066 102192 103367 104518 105630 106408 106610 106555 106940 108106 109696 111050 111791 112135 112725 114025
$$ packed form
55130I8972N18j95q79j478j898j638m40J014J742J571J046N33O5j40J26M75L11
55113I9705k12l80q2K0l60o54m10o0k40p66q65j99P30J233J167R03P47O46N14
55094A01437N47Q53J039O50J2p4M25O14L6n46k62O45J329J484J315Q60J22m89
55076A09997n99m62m76m48l8M11L20j34l07j35m2J6M41J020J015L48k06j93j1
55057A10517l9p8L5l2n23j105j345j292j208j130r33n91j31L60O03L06l81r60
55039A02073j217j355j454j190m12L83M88k43j160j366m97Q64J679J526J034R30
55023A00083J031P00L5j75K70N38%p83p86N0P34M58m71j052p22O5M28J25k07M7
55003A00368O98J126J175J151J112P78K02n5L85J166J590J354P41L44N90J300
$$ plain form
54987 114025 115709 116890 117148 117101 117579 118476 118895 118353 117314 116397 115643 114862 114238 114046 113971 113335 112063 110926
54969 110926 110589 110787 110797 110435 110150 110240 110528 110826 111211 111630 111707 111322 111019 111334 111971 112172 111762 111235 110801 110063
54949 110063 108930 108211 108736 110145 111112 110785 109610 108642 108436 108781 109236 109569 109766 109974 110537 111775 113503
54932 113503 115002 115784 116219 116982 118053 118862 119433 120664 123154 126346 129422 132520 136381 141051 145719
54917 145719 149847 153804 158173 162866 167141 170201 171633 171479 169965 167135 162849 157292 151234 145516
54903 145516 140457 136065 132470 129663 127103 124223 121284 119134 118115 117728 117432 117217 117290 117663 118181 118624
54887 118624 118743 118589 118748 119803 121657 123826 126291 129394 132996 136495 139820 143661 148459 153787 159002
54872 159002 163910 168502 172560 175811 177974 178477 176695 172759 167593 161889 155669 149115 143098 138402
$$ packed form
54987A14025J684J181K58m7M78Q97M19n42j039r17p54p81o24j92p5o36j272j137
54969A10926l37J98J0l62k85R0K88K98L85M19P7l85l03L15O37K01m10n27m34p38
54949A10063j133p19N25J409R67l27j175r68k06L45M55L33J97K08N63J238J728
54932A13503J499P82M35P63J071Q09N71J231K490L192L076L098L861M670M668
54917A45719M128L957M369M693M275L060J432j54j514k830m286n557o058n718
54903A45516n059m392l595k807k560k880k939k150j019l87k96k15P3L73N18M43
54887A18624J19j54J59J055J854K169K465L103L602L499L325L841M798N328N215
54872A59002M908M592M058L251K163N03j782l936n166n704o220o554o017m696
$$ plain form
54858 138402 134933 132177 129861 127685 125024 121642 118331 116183 115410 115348 115360 115191 114732 114014 113308 112815 112364
54841 112364 111759 111158 110711 110079 108854 107276 106049 105509 105401 105418 105583 106060 106816 107496 107584 106912 106045 105807
54823 105807 106250 106555 106217 105832 106264 107487 108813 109836 110556 110838 110535 110028 109962 110376 110681 110541 110205 109909
54805 109909 109525 109086 109128 110031 111279 111821 111245 110314 110182 111177 112541 113355 113429 113127 112656 111982 111354 111304 112042
54786 112042 113270 114711 116341 117899 118708 118393 117461 116828 116971 117766 118877 120009 121002 121941 123052 124459
54770 124459 126243 128695 132013 135777 139314 142712 146804 151966 157640 163300 169026 174654 179206 181851
54756 181851 182807 182567 180907 177421 172433 166570 159931 152653 145830 140805 137763 135903 134714 134062 133283
54741 133283 131389 128400 125523 123798 123229 123308 123613 123744 123453 123113 123448 124655 126255 127871 129558 131364
$$ packed form
54858A38402l469k756k316k176k661l382l311k148p73o2J2j69m59p18p06m93m51
54841A12364o05o01m47o32j225j578j227n40j08J7J65M77P56O80Q8o72q67k38
54823A05807M43L05l38l85M32J223J326J023P20K82l03n07o6M14L05j40l36k96
54805A09909l84m39M2R03J248N42n76r31j32R95J364Q14P4l02m71o74o28n0P38
54786A12042J228J441J630J558Q09l15r32o33J43P95J111J132R93R39J111J407
54770A24459J784K452L318L764L537L398M092N162N674N660N726N628M552K645
54756A81851R56k40j660l486m988n863o639p278o823n025l042j860j189o52p79
54741A33283j894k989k877j725n69P9L05J31k91l40L35J207J600J616J687J806
$$ plain form
54725 131364 133219 135293 137792 140433 142866 145649 149899 155722 161829 166950 170854 173579 174583 173359
54711 173359 170361 166552 162377 157704 152567 147449 142940 139436 136975 135101 133049 130415 127557 125179
54697 125179 123654 122879 122589 122612 122915 123474 124031 124067 123229 121715 120006 118374 116953 116037 115728 115397 114256
54680 114256 112600 111781 112627 114419 115787 116117 115697 114941 114043 113174 112476 111874 111202 110491 109927 109628 109617 109903
54662 109903 110457 111153 111878 112649 113520 114410 115032 115016 114178 112817 111617 111061 111037 111101 110980 110648 110173 109774 109787
54643 109787 110212 110529 110391 110260 110876 112270 113835 115170 116261 116969 117014 116511 115891 115293 114598 114017 113951 114227
54625 114227 114190 113679 113202 113044 112907 112640 112553 112752 112911 113002 113501 114458 115073 114744 113925 113449 113489 113722 114063 114682
54605 114682 115599 116673 117699 118275 118005 117133 116489 116512 116835 117133 117717 118817 119962 120636 120970 121145 120667 119027
$$ packed form
54725A31364J855K074K499K641K433K783M250N823O107N121L904K725J004j224
54711A73359k998l809m175m673n137n118m509l504k461j874k052k634k858k378
54697A25179j525p75k90K3L03N59N57L6q38j514j709j632j421r16l09l31j141
54680A14256j656q19Q46J792J368L30m20p56q98q69o98o02o72p11n64k99j1K86
54662A09903N54O96P25P71Q71Q90O22j6q38j361j200n56k4O4j21l32m75l99J3
54643A09787M25L17j38j31O16J394J565J335J091P08M5n03o20n98o95n81o6K76
54625A14227l7n11m77j58j37k67q7J99J59R1M99R57O15l29q19m76M0K33L41O19
54605A14682R17J074J026N76k70q72o44K3L23K98N84J100J145O74L34J75m78j640
$$ plain form
54587 119027 116672 114602 113298 112642 112564 113073 113949 115064 116681 118811 120583 121041 120291 119229 118374 117742
54571 117742 117519 117906 118410 118199 117202 116050 114961 113614 112210 111692 112564 114207 115758 117014 118157 119184
54555 119184 119990 120558 120772 120505 120115 120321 121287 122372 123097 123799 124893 126029 126532 126360 126081 126213 127039 128788
54537 128788 131345 133876 135300 135219 134052 132376 130526 128794 127501 126732 126309 126117 126117 126024 125421 124412 123767
54520 123767 124073 125002 125787 126218 126686 127317 127668 127437 126984 126755 126534 125780 124529 123419 122809 122390 121818 121277
54502 121277 121097 121157 121065 120768 120605 120833 121339 121835 122092 122025 121759 121637 121945 122526 122825 122426 121584 121130 121744 123260
54482 123260 124731 125289 124887 124128 123550 123329 123543 124263 125313 126318 127135 127931 128764 129458 130062 130971 132333
54465 132333 133697 134527 134718 134360 133508 132552 132287 132980 133771 133659 132821 132214 132127 131900 131072 129928 128844 127803
$$ packed form
54587A19027k355k070j304o56p8N09Q76J115J617K130J772M58p50j062q55o32
54571A17742k23L87N04k11r97j152j089j347j404n18Q72J643J551J256J143J027
54555A19184Q06N68K14k67l90K06R66J085P25P02J094J136N03j72k79J32Q26J749
54537A28788K557K531J424q1j167j676j850j732j293p69m23j92%r3o03j009o45
54520A23767L06R29P85M31M68O31L51k31m53k29k21p54j251j110o10m19n72n41
54502A21277j80O0r2k97j63K28N06M96K57o7k66j22L08N81K99l99q42m54O14J516
54482A23260J471N58m02p59n78k21K14P20J050J005Q17P96Q33O94O04R09J362
54465A32333J364Q30J91l58q52r56k65O93P91j12q38o07q7k27q28j144j084j041
$$ plain form
54447 127803 126777 125891 125018 123934 123079 123353 124717 125749 125298 124044 123644 124692 126258 127277 127635 127845
54431 127845 128322 129142 130088 130743 130835 130524 130084 129397 128185 126775 126111 126791 128457 130370 132213 133979 135363
54414 135363 135793 135117 133930 133125 133214 134125 135433 136692 137629 138140 138200 137851 137304 136895 136845 137127 137684 138655 140204
54395 140204 142117 143821 144897 145473 145997 146681 147267 147353 146893 146353 146276 146677 146988 146692 145937 145278 144929 144593
54377 144593 144087 143833 144444 146001 147898 149375 150072 150232 150489 151369 152813 154251 155226 155859 156661 158062 160192
54360 160192 162854 165539 167714 169325 170865 172771 174995 177339 179813 182245 183910 184126 183045 181350
54346 181350 179290 176617 173357 169911 166353 162338 157968 154101 151412 149614 147942 146009 143924 142014
54332 142014 140760 140576 141221 141719 141293 140128 138964 138233 137971 138200 138896 139740 140357 140739 141118 141536 141846 141967
$$ packed form
54447A27803j026q86q73j084q55K74J364J032m51j254m00J048J566J019L58K10
54431A27845M77Q20R46O55R2l11m40o87j212j410o64O80J666J913J843J766J384
54414A35363M30o76j187q05Q9R11J308J259R37N11O0l49n47m09n0K82N57R71J549
54395A40204J913J704J076N76N24O84N86Q6m60n40p7M01L11k96p55o59l49l36
54377A44593n06k54O11J557J897J477O97J60K57Q80J444J438R75O33Q02J401K130
54360A60192K662K685K175J611J540J906K224K344K474K432J665K16j081j695
54346A81350k060k673l260l446l558m015m370l867k689j798j672j933k085j910
54332A42014j254j84O45M98m26j165j164p31k62K29O96Q44O17L82L79M18L10J21
$$ plain form
54314 141967 141846 141308 140307 139158 138205 137396 136545 135881 135846 136380 136770 136359 135190 133869 132955 132490 132068 131391
54296 131391 130795 130947 131902 132792 132721 131778 130836 130573 131033 131967 133161 134421 135599 136715 137874 139061 140165
54279 140165 141106 141734 141788 141201 140392 140033 140537 141768 143075 143601 142992 142043 142257 144361 147513 150237 151742
54262 151742 152040 151390 150335 149853 150598 152029 153012 153217 153199 153197 152785 151878 151228 151454 152201 152679 152517 151690 150120
54243 150120 147944 145834 144522 144055 143913 143750 143603 143478 143154 142588 142206 142481 143227 143559 142797 141380 140575
54226 140575 141165 142669 144043 144833 145328 145825 146213 146254 145905 145361 145052 145462 146623 147899 148643 148912 149113 149104
54208 149104 148245 146348 143986 141811 140088 138982 138701 139139 139874 140715 141817 143119 144167 144722 145029 145244
54192 145244 145056 144221 143023 141919 141097 140668 140816 141399 141808 141627 141126 140788 140740 141001 141812 143172 144444 145002
$$ packed form
54314A41967j21n38j001j149r53q09q51o64l5N34L90m11j169j321r14m65m22o77
54296A31391n96J52R55Q90p1r43r42k63M60R34J194J260J178J116J159J187J104
54279A40165R41O28N4n87q09l59N04J231J307N26o09r49K14K104L152K724J505
54262A51742K98o50j055m82P45J431R83K05j8km12r07o50K26P47M78j62q27j570
54243A50120k176k110j312m67j42j63j47j25l24n66l82K75P46L32p62j417q05
54226A40575N90J504J374P90M95M97L88M1l49n44l09M10J161J276P44K69K01r
54208A49104q59j897k362k175j723j106k81M38P35Q41J102J302J048N55L07K15
54192A45244j88q35j198j104q22m29J48N83M09j81n01l38m8K61Q11J360J272N58
$$ plain form
54174 145002 145034 145144 145389 145379 145142 145173 145564 145703 145093 144024 143230 143170 143800 144724 145394 145415 144859 144184 143789 143761
54154 143761 144020 144430 144687 144393 143483 142435 141858 141922 142348 142927 143793 145008 146052 146082 144874 143282 142425 142537
54136 142537 142893 142830 142395 141942 141593 141418 141756 142829 144197 145022 144942 144398 144116 144554 145829 147798 149989 151699
54118 151699 152482 152598 152847 153818 155301 156493 156788 156250 155315 154261 153223 152500 152409 152772 152961 152650 152222 152219
54100 152219 152657 153139 153412 153547 153724 154065 154554 154917 154775 154175 153799 154343 155786 157525 159098 160442 161624
54083 161624 162747 164199 166544 169963 174002 177982 181507 184550 187304 190082 193049 195802 197373 196944
54069 196944 194620 191297 187841 184549 181434 178688 176600 175169 174083 173098 172184 171280 170253 169274 168921
54054 168921 169615 171100 172746 174240 175659 177111 178688 180692 183380 186435 189237 191736 194601 198268
$$ packed form
54174A45002L2J10K45j0k37L1L91J39o10j069p94o0O30R24O70K1n56o75l95k8
54154A43761K59M10K57k94r10j048n77O4M26N79Q66J215J044L0j208j592q57J12
54136A42537L56o3m35m53l49j75L38J073J368Q25q0n44k82M38J275J969K191J710
54118A51699P83J16K49R71J483J192K95n38r35j054j038p23r1L63J89l11m28l
54100A52219M38M82K73J35J77L41M89L63j42o00l76N44J443J739J573J344J182
54083A61624J123J452K345L419M039L980L525L043K754K778K967K753J571m29
54069A96944k324l323l456l292l115k746k088j431j086r85r14r04j027r79l53
54054A68921O94J485J646J494J419J452J577K004K688L055K802K499K865L667
$$ plain form
54040 198268 202370 206398 210529 215308 220830 226707 232698 238912 245380 251796 257789 263262 268377 273273
54026 273273 277799 281620 284722 287717 291253 295105 298301 300397 302102 304280 306722 308443 308895 308299 306875
54011 306875 304368 300412 294991 288436 281253 273915 266588 259142 251699 245012 239830 235963 232439 228609
53997 228609 224649 220986 217749 214944 212641 210674 208537 205919 203105 200584 198500 196727 195214 193946
53983 193946 192769 191584 190599 190083 189935 189796 189531 189294 189105 188681 187859 186962 186492 186543 186686 186440 185772 185072
53965 185072 184756 184946 185511 186302 187320 188642 190255 191977 193623 195214 196927 198772 200428 201576 202401
53950 202401 203603 205833 209207 213333 217683 221865 225750 229476 233359 237749 242985 249365 257005 265704
53936 265704 275118 285085 295572 306338 316906 326832 335609 342239 345460 344890 341623 337303 332794 328229
$$ packed form
54040A98268M102M028M131M779N522N877N991O214O468O416N993N473N115M896
54026B73273M526L821L102K995L536L852L196K096J705K178K442J721M52n96j424
54011C06875k507l956n421o555p183p338p327p446p443o687n182l867l524l830
53997B28609l960l663l237k805k303j967k137k618k814k521k084j773j513j268
53983A93946j177j185r85n16j48j39k65k37j89m24q22q97m70N1J43k46o68p00
53965A85072l16J90N65P91J018J322J613J722J646J591J713J845J656J148Q25
53950B02401J202K230L374M126M350M182L885L726L883M390N236O380P640Q699
53936B65704R414R967J0487J0766J0568R926Q777O630L221n70l267m320m509m565
$$ plain form
53922 328229 324141 321817 322278 325309 329745 334526 339298 344231 349528 355178 361081 367305 374055 381224
53908 381224 388102 393785 397907 400796 402839 403923 403617 401843 399193 396501 394057 391330 387632 383006
53894 383006 378232 373830 369351 363942 357415 350370 343317 336067 328147 319558 310933 303011 296053 289765
53880 289765 283799 278308 273869 270795 268671 266705 264341 261345 257557 252993 248179 243924 240572 237715
53866 237715 234778 231707 228947 226866 225334 223810 221775 219076 215918 212603 209445 206871 205296 204601
53852 204601 203957 202516 200231 197765 195773 194587 194424 195306 196658 197484 197256 196390 195698 195584 195964 196615 197339
53835 197339 197909 198143 197958 197273 195968 194133 192223 190811 190261 190681 191976 193766 195454 196674 197630 198717
53819 198717 199838 200403 200158 199787 200429 202579 205651 208653 211130 213356 215792 218630 221832 225292 228794
$$ packed form
53922C28229m088k324M61L031M436M781M772M933N297N650N903O224O750P169
53908C81224O878N683M122K889K043J084l06j774k650k692k444k727l698m626
53894C83006m774m402m479n409o527p045p053p250p920q589q625p922o958o288
53880B89765n966n491m439l074k124j966k364k996l788m564m814m255l352k857
53866B37715k937l071k760k081j532j524k035k699l158l315l158k574j575o95
53852B04601o44j441k285k466j992j186j63Q82J352Q26k28q66o92j14L80O51P24
53835A97339N70K34j85o85j305j835j910j412n50M20J295J790J688J220R56J087
53819A98717J121N65k45l71O42K150L072L002K477K226K436K838L202L460L502
$$ plain form
53804 228794 232048 235035 238206 242108 246809 251896 256984 262008 267027 271942 276559 280777 284598 287935
53790 287935 290585 292506 294150 296276 299163 302021 303539 303089 301111 298255 294609 290084 285097 280335
53776 280335 275994 271759 267415 263035 258643 254150 249637 245272 240957 236493 232079 228168 224806 221559
53762 221559 218154 214758 211595 208848 206958 206302 206320 205678 203811 201737 200740 200691 200345 198976 197012 195169
53746 195169 193705 192652 192133 192131 192287 192231 191932 191627 191578 191979 192847 193868 194461 194227 193392 192701 192853 193899 195208
53727 195208 196117 196636 197398 198828 200588 201991 202764 203156 203443 203650 203799 204103 204773 205790 206953 208067 209053
53710 209053 210013 211336 213592 217116 221593 226121 229819 232443 234420 236285 238162 239888 241491 243322
53696 243322 245677 248474 251306 253688 255311 256344 257561 259798 263059 266359 268631 269545 269264 267838 265363
$$ packed form
53804B28794L254K987L171L902M701N087N088N024N019M915M617M218L821L337
53790B87935K650J921J644K126K887K858J518m50j978k856l646m525m987m762
53776B80335m341m235m344m380m392m493m513m365m315m464m414l911l362l247
53762B21559l405l396l163k747j890o56J8o42j867k074r97m9l46j369j964j843
53746A95169j464j053n19kJ56n6k99l05m9M01Q68J021N93k34q35o91J52J046J309
53727A95208R09N19P62J430J760J403P73L92K87K07J49L04O70J017J163J114R86
53710B09053R60J323K256L524M477M528L698K624J977J865J877J726J603J831
53696B43322K355K797K832K382J623J033J217K237L261L300K272R14k81j426k475
$$ plain form
53681 265363 262517 260221 258612 256879 254412 251740 249988 249658 250324 251336 252334 253056 253103 252230 250671 248937
53665 248937 247402 246278 245798 246007 246365 245997 244624 242982 242030 241972 242392 243078 244083 245041 245211 244586 244341
53648 244341 245510 247533 248816 248678 248102 248369 249563 250785 251427 251736 252282 253312 254653 255970 257028 257899
53632 257899 258907 260233 261647 262868 264115 265983 268717 271914 275041 277916 280522 282754 284718 286977
53618 286977 289998 293491 296795 299881 303432 307863 312801 317700 322440 327047 331345 335297 339247 343307
53604 343307 346857 349236 350692 352005 353339 354140 354212 354170 354556 355077 355095 354543 353956 353728 353647 353175 352079 350772
53586 350772 349918 349636 349314 348433 347311 346557 345998 344767 342526 339965 337945 336662 335853 335224 334408 333055
53570 333055 331386 330153 329695 329450 328871 328320 328448 329111 329610 329763 329974 330369 330618 330710 331210 332475 334156 335735
$$ packed form
53681B65363k846k296j609j733k467k672j752l30O66J012R98P22M7q73j559j734
53665B48937j535j124m80K09L58l68j373j642r52n8M20O86J005R58J70o25k45
53648B44341J169K023J283j38n76K67J194J222O42L09N46J030J341J317J058Q71
53632B57899J008J326J414J221J247J868K734L197L127K875K606K232J964K259
53618B86977L021L493L304L086L551M431M938M899M740M607M298L952L950M060
53604C43307L550K379J456J313J334Q01P2m2L86N21J8n52n87k28q1m72j096j307
53586C50772q54k82l22q81j122p54n59j231k241k561k020j283q09o29q16j353
53570C33055j669j233m58k45n79n51J28O63M99J53K11L95K49R2N00J265J681J579
$$ plain form
53552 335735 337151 338614 340123 341464 342505 343312 344092 345134 346596 348246 349633 350663 351850 353817 356712
53537 356712 360228 364073 368297 373186 378966 385550 392536 399494 406271 413002 419905 427188 435045 443523
53523 443523 452438 461672 471550 482651 495135 508460 521928 535321 548963 563314 578679 595139
53511 595139 612556 630711 649583 669399 690228 711621 732839 753504 773846 794287 814847
53500 814847 835029 854178 871920 888438 904454 920870 938150 955955 973433 989918 1005332
53489 1005332 1019929 1033917 1047541 1061362 1076085 1091983 1108642 1125365 1141660 1157297 1172178
53478 1172178 1186389 1200238 1213929 1227144 1239106 1249101 1256885 1262565 1266248 1267850 1267215 1264338 1259421
53465 1259421 1252706 1244290 1234213 1222739 1210417 1197752 1184880 1171688 1158207 1144711 1131388 1117943
$$ packed form
53552C35735J416J463J509J341J041Q07P80J042J462J650J387J030J187J967K895
53537C56712L516L845M224M889N780O584O986O958O777O731O903P283P857Q478
53523D43523Q915R234R878J1101J2484J3325J3468J3393J3642J4351J5365J6460
53511E95139J7417J8155J8872J9816K0829K1393K1218K0665K0342K0441K0560
53500H14847K0182J9149J7742J6518J6016J6416J7280J7805J7478J6485J5414
53489A005332J4597J3988J3624J3821J4723J5898J6659J6723J6295J5637J4881
53478A172178J4211J3849J3691J3215J1962R995P784N680L683J602o35k877m917
53465A259421o715q416j0077j1474j2322j2665j2872j3192j3481j3496j3323j3445
$$ plain form
53453 1117943 1103687 1088067 1071197 1053856 1036922 1020736 1004962 988992 972507 955842 939891
53442 939891 925577 913175 902221 892168 883115 875663 870205 866573 864359 863218 862790 862655 862632 862964
53428 862964 864079 866245 869558 874024 879484 885598 892090 898996 906632 915430 925811 938016 951979
53415 951979 967525 984683 1003559 1023882 1045080 1066913 1089747 1114005 1139665 1166545 1194715
53404 1194715 1224357 1255443 1287900 1321819 1357218 1393792 1431305 1470040 1510507 1552844 1596849
53393 1596849 1642420 1689493 1737613 1786018 1834191 1882018 1929402 1976075 2021839 2066620 2110131
53382 2110131 2151725 2190711 2226708 2259730 2290110 2318264 2344283 2367725 2387938 2404486 2417057
53371 2417057 2425154 2428235 2426169 2419243 2407729 2391671 2371013 2345612 2315265 2280094 2240974 2199233
$$ packed form
53453A117943j4256j5620j6870j7341j6934j6186j5774j5970j6485j6665j5951
53442I39891j4314j2402j0954j0053r053p452n458l632k214j141m28j35k3L32
53428H62964J115K166L313M466N460O114O492O906P636Q798J0381J2205J3963
53415I51979J5546J7158J8876K0323K1198K1833K2834K4258K5660K6880K8170
53404A194715K9642L1086L2457L3919L5399L6574L7513L8735M0467M2337M4005
53393A596849M5571M7073M8120M8405M8173M7827M7384M6673M5764M4781M3511
53382B110131M1594L8986L5997L3022L0380K8154K6019K3442K0213J6548J2571
53371B417057Q097L081k066o926j1514j6058k0658k5401l0347l5171l9120m1741
$$ plain form
53359 2199233 2155927 2111641 2066927 2022429 1978550 1935388 1893181 1852464 1813674 1776892 1742015
53348 1742015 1708777 1676459 1644021 1610818 1576947 1542777 1508494 1474358 1440972 1408926 1378329
53337 1378329 1349061 1321352 1295815 1272895 1252433 1233812 1216458 1200274 1185562 1172387 1160101
53326 1160101 1147805 1135203 1122589 1109936 1096580 1082104 1067073 1052484 1038846 1026255 1015034
53315 1015034 1005619 997829 990907 984450 978924 975065 973062 972533 973084 974693 977570 981756 986856 992280
53301 992280 997925 1004566 1013357 1024868 1038735 1054244 1071062 1089304 1109058 1130024 1151638 1173489
53289 1173489 1195595 1218196 1241246 1264177 1286253 1307019 1326280 1343776 1359254 1372831 1384890
53278 1384890 1395376 1403491 1408376 1409957 1408827 1405451 1399909 1392370 1383294 1372907 1360843 1346712 1330784
$$ packed form
53359B199233m3306m4286m4714m4498m3879m3162m2207m0717l8790l6782l4877
53348A742015l3238l2318l2438l3203l3871l4170l4283l4136l3386l2046l0597
53337A378329k9268k7709k5537k2920k0462j8621j7354j6184j4712j3175j2286
53326A160101j2296j2602j2614j2653j3356j4476j5031j4589j3638j2591j1221
53315A015034r415p790o922o457n526l859k003n29N51J609K877M186N100N424
53301I92280N645O641Q791J1511J3867J5509J6818J8242J9754K0966K1614K1851
53289A173489K2106K2601K3050K2931K2076K0766J9261J7496J5478J3577J2059
53278A384890J0486Q115M885J581j130l376n542p539r076j0387j2064j4131j5928
$$ plain form
53265 1330784 1313691 1295565 1275955 1254637 1232077 1208934 1185511 1161937 1138513 1115438 1092410
53254 1092410 1068997 1045375 1022273 1000058 978263 956262 934185 912878 892951 874111 855485
53243 855485 836438 816937 797229 777482 757932 739126 721618 705391 689886 674710 660014
53232 660014 646076 632916 620591 609525 600090 592037 584713 577696 570785 563470 555039 545308 534818
53219 534818 524138 513268 501878 489743 476792 463093 449139 435865 424033 413686 404402 395931
53207 395931 388333 381617 375571 369938 364500 358893 352634 345577 338275 331591 325835 320430 314620 308377
53193 308377 302347 296940 291892 286885 282181 278234 274959 271837 268653 265663 263032 260567 258079 255642
53179 255642 253368 251247 249287 247479 245540 243105 240323 237908 236351 235469 234919 234723 234893 234910 234144 232643
$$ packed form
53265A330784j7093j8126j9610k1318k2560k3143k3423k3574k3424k3075k3028
53254A092410k3413k3622k3102k2215k1795k2001k2077k1307j9927j8840j8626
53243H55485j9047j9501j9708j9747j9550j8806j7508j6227j5505j5176j4696
53232F60014j3938j3160j2325j1066r435q053p324p017o911p315q431r731j0490
53219E34818j0680j0870j1390j2135j2951j3699j3954j3274j1832j0347r284q471
53207C95931p598o716o046n633n438n607o259p057p302o684n756n405n810o243
53193C08377o030n407n048n007m704l947l275l122l184k990k631k465k488k437
53179B55642k274k121j960j808j939k435k782k415j557q82n50j96J70J7p66j501
$$ plain form
53163 232643 230990 229445 227797 226084 224900 224633 224814 224646 223999 223417 223163 222778 221760 220304 219038 218214
53147 218214 217582 216909 216246 215646 215105 214901 215569 217225 219244 220832 221647 221696 221109 220412 220568 222048 224066
53130 224066 225354 225639 225777 226498 227623 228552 228921 228659 227974 227451 227666 228439 228887 228451 227513 226814 226706 227151
53112 227151 228046 229219 230353 231171 231516 231258 230434 229507 228971 228618 227683 225860 223618 221388 219091 216814
53096 216814 215228 214813 215166 215586 215944 216425 216876 216961 216716 216424 216194 216052 216133 216307 215991 214893 213624 213065
53078 213065 213396 214269 215491 216846 217656 217382 216501 215947 215827 215506 214864 214473 214476 214303 213800 213601 213881 213601 211742
53059 211742 208785 206235 205035 205062 205862 207160 208697 210189 211548 212824 213922 214729 215460 216464 217600
53044 217600 218163 217684 216527 215502 215029 214976 215193 215809 216859 217959 218664 218998 219254 219308 218643 217187 215691
$$ packed form
53163B32643j653j545j648j713j184k67J81j68o47n82k54l85j018j456j266q24
53147B18214o32o73o63o00n41k04O68J656K019J588Q15M9n87o97J56J480K018
53130B24066J288K85J38P21J125R29L69k62o85n23K15P73M48m36r38o99j08M45
53112B27151Q95J173J134Q18L45k58q24r27n36l53r35j823k242k230k297k277
53096B16814j586m15L53M20L58M81M51Q5k45k92k30j42Q1J74l16j098j269n59
53078B13065L31Q73J222J355Q10k74q81n54j20l21o42l91Lj73n03j99K80k80j859
53059B11742k957k550j200K7Q00J298J537J492J359J276J098Q07P31J004J136
53044B17600N63m79j157j025m73n3K17O16J050J100P05L34K56N4o65j456j496
$$ plain form
53027 215691 214943 214864 214772 214360 214016 214203 214817 215212 214771 213567 212569 212929 214812 217148 218791 219640 220289 220976
53009 220976 221504 221964 222745 223749 224296 224069 223620 223631 224146 224827 225542 226308 226976 227390 227664 227974 228175 228006 227563
52990 227563 227209 227065 226913 226721 226952 228113 230066 232012 233219 233704 234120 235005 236324 237715 238967 240082
52974 240082 241036 241776 242450 243410 244901 246769 248517 249605 249824 249467 249054 248793 248441 247788 247073 246684 246572
52957 246572 246283 245528 244432 243275 242243 241471 241052 240881 240634 239978 238768 237078 235143 233227 231496 230047
52941 230047 229057 228653 228610 228466 228110 227937 228184 228482 228403 228101 227982 228016 227935 227837 227975 228024 227248 225501 223564 222415
52921 222415 222524 223777 225593 227064 227574 227382 227246 227459 227693 227706 227590 227322 226738 226047 225714 225676 225366 224685
52903 224685 224292 224595 225189 225625 226105 226916 227791 228343 228581 228508 227773 226342 225036 224709 225224 225877 226473 227289
$$ packed form
53027B15691p48p9r2m12l44J87O14L95m41j204r98L60J883K336J643Q49O49O87
53009B20976N28M60P81J004N47k27m49J1N15O81P15P66O68M14K74L10K01j69m43
52990B27563l54j44j52j92K31J161J953J946J207M85M16Q85J319J391J252J115
52974B40082R54P40O74R60J491J868J748J088K19l57m13k61l52o53p15l89j12
52957B46572k89p55j096j157j032p72m19j71k47o56j210j690j935j916j731j449
52941B30047r90m04m3j44l56j73K47K98p9l02j19L4q1r8J38M9p76j747j937j149
52921B22415J09J253J816J471N10j92j36K13K34J3j16k68n84o91l33l8l10o81
52903B24685l93L03N94M36M80Q11Q75N52K38p3p35j431j306l27N15O53N96Q16
$$ plain form
52885 227289 228209 228672 228428 227728 226840 225900 225164 224844 224735 224497 224187 224064 224024 223858 223934 224875 226506 227878 228525
52866 228525 229063 230249 231996 233630 234721 235339 235864 236818 238508 240524 241803 241520 239704 236877 233463
52851 233463 229844 226589 224078 222015 219738 217054 214423 212322 210722 209326 208014 206870 205902 204967 204002
52836 204002 203218 202979 203476 204528 205698 206552 206856 206629 206114 205623 205265 204818 204004 202923 202056 201777 201968 202226
52818 202226 202423 202820 203605 204423 204628 204038 203263 203116 203815 204975 206273 207728 209277 210531 211234 211658 212083
52801 212083 212087 210919 208615 206255 204859 204407 204209 203874 203516 203261 203095 203161 203643 204212 204103 203110 202140 202287
52783 202287 203551 204923 205663 205966 206311 206727 207028 207297 207700 208017 207800 206940 205799 204858 204459 204720 205364 205741
52765 205741 205356 204331 203094 201771 200223 198525 196972 195723 194900 194944 196256 198408 200322 201428 202139
$$ packed form
52885B27289R20M63k44p00q88r40p36l20j09k38l10j23m0j66P6R41J631J372O47
52866B28525N38J186J747J634J091O18N25R54J690K016J279k83j816k827l414
52851B33463l619l255k511k063k277k684k631k101j600j396j312j144r68r35r65
52836B04002p84k39M97J052J170Q54L04k27n15m91l58m47q14j081q67k79J91K58
52818B02226J97L97P85Q18K05n90p75j47O99J160J298J455J549J254P03M24M25
52801B12083Mj168k304k360j396m52j98l35l58k55j66O6M82N69j09r93r70J47
52783B02287J264J372P40L03L45M16L01K69M03L17k17q60j141r41l99K61O44L77
52765B05741l85j025j237j323j548j698j553j249q23M4J312K152J914J106P11
$$ plain form
52750 202139 203041 204162 205322 206636 208248 209940 211414 212681 213860 214929 216005 217501 219620 222008
52736 222008 224256 226373 228423 230077 231014 231453 231762 231884 231674 231429 231461 231425 230841 230043 229775 229902 229400 227766
52718 227766 225657 223922 222735 221935 221486 221139 220260 218539 216516 214946 213995 213382 212995 212943 213316 214258 215954
52701 215954 218136 219902 220542 220386 220390 220978 221735 222167 222270 222356 222670 223281 224032 224582 224755 224849 225293 226030 226548
52682 226548 226570 226338 226103 225669 224716 223310 221794 220339 218894 217569 216785 216879 217682 218632 219324 219887 220715 221825
52664 221825 222692 222855 222558 222563 223317 224524 225552 226098 226413 227091 228670 231161 233829 235715 236594 237177 238156
52647 238156 239258 239547 238426 236016 232791 229368 226568 225011 224492 224200 223721 223420 223662 224193 224622 225061
52631 225061 225865 227041 228386 229882 231499 232793 233273 233097 232954 233258 233775 233923 233109 231015 228078 225548
$$ packed form
52750B02139R02J121J160J314J612J692J474J267J179J069J076J496K119K388
52736B22008K248K117K050J654R37M39L09J22k10k45L2l6n84p98k68J27n02j634
52718B27766k109j735j187q00m49l47q79j721k023j570r51o13l87n2L73R42J696
52701B15954K182J766O40j56MN88P57M32J03Q6L14O11P51N50J73R4M44P37N18
52682B26548K2k32k35m34r53j406j516j455j445j325p84R4Q03R50O92N63Q28J110
52664B21825Q67J63k97NP54J207J028N46L15O78J579K491K668J886Q79N83R79
52647B38156J102K89j121k410l225l423k800j557n19k92m79l01K42N31M29M39
52631B25061Q04J176J345J496J617J294M80j76j43L04N17J48q14k094k937k530
$$ plain form
52615 225548 224519 224903 225816 226792 227985 229297 230172 230467 230708 231179 231428 231119 230709 230763 231132 231462 232098 233743
52597 233743 236360 239004 240704 241181 240811 240292 240214 240576 240705 239974 238559 237323 237017 237750 239056 240269 240984
52580 240984 241332 241688 242074 242182 242025 242100 242662 243315 243638 243768 243961 244034 243724 243181 242614 241909 241110 240831 241399
52561 241399 241977 241340 239379 237027 234912 232966 231294 230391 230265 230186 229629 228818 228082 227360 226702 226615 227388 228527
52543 228527 229316 229670 230034 230694 231505 232175 232547 232702 232932 233472 234183 234674 234755 234570 234402 234596 235506 237089 238593
52524 238593 239168 238835 238398 238327 238286 237874 237332 237315 238307 240375 243106 245719 247708 249448 251711 254553 257331
52507 257331 259814 262504 265564 268254 269845 270414 270242 269161 267088 264579 262109 259288 255562 251311 247506
52492 247506 244547 242242 240655 240092 240226 240101 239267 238302 237998 238490 239366 240301 241332 242740 244740 247165
$$ packed form
52615B25548j029L84R13R76J193J312Q75K95K41M71K49l09m10N4L69L30O36J645
52597B33743K617K644J700M77l70n19p8L62J29p31j415j236l06P33J306J213P15
52580B40984L48L56L86J08j57P5N62O53L23J30J93P3l10n43n67p05p99k79N68
52561B41399N78o37j961k352k115j946j672r03j26p9n57q11p36p22o58q7P73J139
52543B28527P89L54L64O60Q11O70L72J55K30N40P11M91Q1j85j68J94R10J583J504
52524B38593N75l33m37p1m1m12n42j7R92K068K731K613J989J740K263K842K778
52507B57331K483K690L060K690J591N69j72j081k073k509k470k821l726m251l805
52492B47506k959k305j587n63J34j25q34r65l04M92Q76R35J031J408K000K425
$$ plain form
52476 247165 249454 251166 252362 253263 253732 253513 252903 252716 253457 254863 256349 257644 258965 260758 263289 266316
52460 266316 269204 271524 273367 274815 275326 274137 271302 267906 265042 262841 260620 257844 254778 252280
52446 252280 250936 250346 249382 247305 244508 242017 240449 239731 239621 239983 240518 240690 240119 238901 237403 235921
52430 235921 234595 233526 232852 232748 233314 234402 235658 236825 237913 238987 240000 240974 242085 243413 244795
52415 244795 246196 247910 250071 252253 253997 255550 257683 260922 265389 271134 278008 285304 292206 298571
52401 298571 304604 309738 312636 312546 309997 305891 300635 294595 288691 283797 279897 276446 273256 270480 268060
52386 268060 265927 264572 264670 266046 267683 268936 270151 271849 273842 275615 277245 279374 282354 285858 289455
52371 289455 293197 297407 302055 306674 310888 314732 318262 321129 322825 323314 323097 322594 321795 320648 319459
$$ packed form
52476B47165K289J712J196R01M69k19o10j87P41J406J486J295J321J793K531L027
52460B66316K888K320J843J448N11j189k835l396k864k201k221k776l066k498
52446B52280j344n90r64k077k797k491j568p18j10L62N35J72n71j218j498j482
52430B35921j326j069o74j04N66J088J256J167J088J074J013R74J111J328J382
52415B44795J401J714K161K182J744J553K133L239M467N745O874P296O902O365
52401B98571O033N134K898r0k549m106n256o040n904m894l900l451l190k776k420
52386B68060k133j355R8J376J637J253J215J698J993J773J630K129K980L504L597
52371B89455L742M210M648M619M214L844L530K867J696M89k17n03p99j147j189
$$ plain form
52356 319459 318594 317973 317214 316287 315740 316184 317683 319736 321764 323616 325625 328132 330923 333349 335144 336936
52340 336936 339624 343381 347639 352068 357072 363131 370074 377409 385101 393540 402820 412561 422619 433601
52326 433601 446402 461364 478041 495654 513592 531648 550021 569021 588544 607834 625964
52315 625964 642655 658533 674567 691330 708745 726332 743636 760559 777396 794520 811910
52304 811910 829014 845091 859684 872850 885060 896870 908506 919636 929603 937921 944484 949316
52292 949316 952231 952818 950713 945901 938858 930403 921295 911981 902788 894229 886783 880443 874851 869995
52278 869995 866405 864434 863776 864050 865585 869087 874623 881462 889021 897502 907395 918653 930641 942729
52264 942729 954633 966289 977728 989190 1001153 1014038 1027876 1042379 1057316 1072665 1088242
$$ packed form
52356C19459q65o21p59r27n47M44J499K053K028J852K009K507K791K426J795J792
52340C36936K688L757M258M429N004O059O943P335P692Q439R280R741J0058J0982
52326D33601J2801J4962J6677J7613J7938J8056J8373J9000J9523J9290J8130
52315F25964J6691J5878J6034J6763J7415J7587J7304J6923J6837J7124J7390
52304H11910J7104J6077J4593J3166J2210J1810J1636J1130R967Q318O563M832
52292I49316K915N87k105m812p043q455r108r314r193q559p446o340n592m856
52278H69995l590j971o58K74J535L502N536O839P559Q481R893J1258J1988J2088
52264I42729J1904J1656J1439J1462J1963J2885J3838J4503J4937J5349J5577
$$ plain form
52253 1088242 1103372 1117193 1129316 1139984 1149522 1157830 1164447 1168899 1170894 1170446 1167951 1163916 1158440
52240 1158440 1151235 1142316 1132409 1122412 1112705 1103312 1094386 1086054 1077951 1069464 1060518 1051698 1043642 1036657
52226 1036657 1030886 1026273 1022308 1018359 1014502 1011561 1010096 1009795 1010151 1011206 1013121 1015395 1017259 1018817
52212 1018817 1021223 1025535 1031693 1038743 1045767 1052410 1058772 1065060 1071353 1077514 1083254 1088342 1092824 1097109
52198 1097109 1101781 1107213 1113306 1119652 1125951 1132152 1138208 1143901 1149040 1153673 1157913 1161639 1164543 1166394
52184 1166394 1167066 1166359 1164038 1160061 1154574 1147624 1139123 1129293 1118985 1109273 1100685 1092931 1085418 1077912
52170 1077912 1070649 1063998 1058185 1053353 1049705 1047462 1046716 1047354 1049056 1051369 1053822 1056085 1058044 1059746
52156 1059746 1061289 1062756 1064113 1065143 1065581 1065385 1064750 1063784 1062341 1060359 1058241 1056653 1055930 1055891 1056209 1056701
$$ packed form
52253A088242J5130J3821J2123J0668R538Q308O617M452J995m48k495m035n476
52240A158440p205q919r907r997r707r393q926q332q103q487q946q820q056o985
52226A036657n771m613l965l949l857k941j465l01L56J055J915K274J864J558
52212A018817K406M312O158P050P024O643O362O288O293O161N740N088M482M285
52198A097109M672N432O093O346O299O201O056N693N139M633M240L726K904J851
52184A166394O72p07k321l977n487o950q501r830j0308r712q588p754p513p506
52170A077912p263o651n813m832l648k243p46O38J702K313K453K263J959J702
52156A059746J543J467J357J030M38j96o35r66j443j982k118j588p23l9L18M92
$$ plain form
52140 1056701 1057128 1056976 1055741 1053460 1050809 1048642 1047510 1047640 1049225 1052526 1057563 1063949 1071340 1080135 1091446
52125 1091446 1106111 1123905 1143914 1165526 1188721 1213510 1239528 1266305 1293582 1321098 1348302
52114 1348302 1374493 1399186 1422242 1443795 1464151 1483543 1501745 1518060 1531880 1543204 1552481
52103 1552481 1560174 1566696 1572608 1578435 1584224 1589481 1593551 1595827 1595646 1592441 1586237 1577706 1567497 1555636
52089 1555636 1541830 1526117 1508976 1490966 1472647 1454720 1437821 1422162 1407830 1395468 1386067
52078 1386067 1379818 1375735 1372881 1371614 1373008 1377305 1383618 1391078 1399590 1409365 1420400 1432715 1446477
52065 1446477 1461498 1477030 1492449 1507761 1523042 1537791 1551337 1563622 1575061 1585817 1595716
52054 1595716 1604650 1612485 1618649 1622420 1623660 1622706 1619512 1613458 1604218 1592285 1578389 1562758 1545230
$$ packed form
52140A056701M27j52j235k281k651k167j132J30J585L301N037O386P391Q795J1311
52125A091446J4665J7794K0009K1612K3195K4789K6018K6777K7277K7516K7204
52114A348302K6191K4693K3056K1553K0356J9392J8202J6315J3820J1324R277
52103A552481P693O522N912N827N789N257M070K276j81l205o204q531j0209j1861
52089A555636j3806j5713j7141j8010j8319j7927j6899j5659j4332j2362r401
52078A386067o249m083k854j267J394M297O313P460Q512R775J1035J2315J3762
52065A446477J5021J5532J5419J5312J5281J4749J3546J2285J1439J0756R899
52054A595716Q934P835O164L771J240r54l194o054r240j1933j3896j5631j7528
$$ plain form
52041 1545230 1525770 1504671 1482461 1459790 1437176 1414786 1392749 1371734 1352797 1336452 1322247
52030 1322247 1309374 1297245 1285296 1272880 1259945 1247367 1235964 1225323 1214297 1202604 1191335
52019 1191335 1181681 1173619 1166067 1157977 1149003 1139334 1129223 1118784 1108087 1097332 1086696 1075899
52007 1075899 1064009 1049986 1033534 1015333 996365 977101 957378 936987 916197 895606 875495
51996 875495 855561 835565 816084 798159 782113 767139 752380 737964 724480 711747 698844
51985 698844 685372 671954 659213 646805 633864 620095 605992 592172 578910 566200 553928
51974 553928 542008 530660 520567 512462 506540 502516 500172 499479 500119 501405 503016 505476 509487 514935
51960 514935 520978 526974 532776 538038 541788 543115 541960 538905 534367 528523 521879 515389 509800 505224
$$ packed form
52041A545230j9460k1099k2210k2671k2614k2390k2037k1015j8937j6345j4205
52030A322247j2873j2129j1949j2416j2935j2578j1403j0641j1026j1693j1269
52019A191335r654q062p552q090q974r669j0111j0439j0697j0755j0636j0797
52007A075899j1890j4023j6452j8201j8968j9264j9723k0391k0790k0591k0111
51996H75495j9934j9996j9481j7925j6046j4974j4759j4416j3484j2733j2903
51985F98844j3472j3418j2741j2408j2941j3769j4103j3820j3262j2710j2272
51974E53928j1920j1348j0093q105n922m024k344o93O40J286J611K460M011N448
51960E14935O043N996N802N262L750J327j155l055m538n844o644o490n589m576
$$ plain form
51946 505224 501591 499164 498320 499082 501331 505449 512195 521696 532911 544482 555999 568025 580883
51933 580883 593876 605818 615906 623654 628362 629330 626619 621118 613711 604835 594969 585010 575742 567271
51919 567271 559386 552204 546051 540948 536679 533176 530352 527592 523962 518929 512497 504714 495696 486202
51905 486202 477587 470806 465828 462199 459725 458327 457681 457462 457556 457576 456429 452972 447058 439456 430758 420940
51889 420940 410173 399574 390590 383758 378444 373968 370676 369605 371156 374490 378404 382476 387004 392163
51875 392163 397825 404155 411623 419993 427868 433808 437681 440363 442196 442397 440152 435843 430837 426266
51861 426266 422375 418963 416058 413901 412520 411763 411823 413270 416234 419775 422569 424107 424806 424993 424342 422430
51845 422430 419299 415145 409947 403837 397479 391574 386208 381141 376594 373186 371029 369396 367508 365456
$$ packed form
51946E05224l633k427q44P62K249M118O746R501J1215J1571J1517J2026J2858
51933E80883J2993J1942J0088P748M708R68k711n501p407q876r866r959r268q471
51919E67271p885p182o153n103m269l503k824k760l630n033o432p783r018r494
51905D86202q615o781m978l629k474j398o46k19R4K0j147l457n914p602q698r818
51889D20940j0767j0599q984o832n314m476l292j071J551L334L914M072M528N159
51875C92163N662O330P468Q370P875N940L873K682J833K01k245m309n006m571
51861D26266l891l412k905k157j381p57O0J447K964L541K794J538O99J87o51j912
51845D22430l131m154n198o110o358n905n366n067m547l408k157j633j888k052
$$ plain form
51831 365456 364154 364433 366266 368822 371204 373037 374286 374718 373947 371965 369266 366302 363256 360513 358787
51816 358787 358409 358851 359418 360081 361170 362598 363950 365101 366159 366952 367263 367396 367817 368248 367857 366465 364857
51799 364857 363676 362714 361629 360682 360219 359919 359150 357890 356765 356220 355972 355248 353415 350551 347603 345757
51783 345757 345399 345796 345945 345563 345098 345019 345395 345998 346547 346985 347706 349393 352454 356754 362074 368548 376367
51766 376367 385246 394518 403620 412160 419667 425679 430068 432939 434172 433416 430521 425713 419281 411465
51752 411465 402783 394123 386187 378930 371768 364349 357093 351023 347037 345221 344818 344952 345419 346703 349343
51737 349343 353495 359016 365622 372836 380053 386887 393260 399031 403722 406866 408524 409307 409950 410979 412555
51722 412555 414365 415756 416194 415541 413783 410769 406578 401950 397856 394643 392039 389914 388377 387005 384774
$$ packed form
51831C65456j302K79J833K556K382J833J249M32p71j982k699k964l046k743j726
51816C58787l78M42N67O63J089J428J352J151J058P93L11J33M21M31l91j392j608
51799C64857j181r62j085r47m63l00p69j260j125n45k48p24j833k864k948j846
51783C45757l58L97J49l82m65p9L76O03N49M38P21J687L061M300N320O474P819
51766C76367Q879R272R102Q540P507O012M389K871J233p56k895m808o432p816
51752D11465q682q660p936p257p162p419p256o070l986j816m03J34M67J284K640
51737C49343M152N521O606P214P217O834O373N771M691L144J658P83O43J029J576
51722D12555J810J391M38o53j758l014m191m628m094l213k604k125j537j372k231
$$ plain form
51707 384774 381241 377298 374151 371959 370133 368676 368306 369222 370531 371181 370929 370117 369064 368064 367569 367843
51691 367843 368606 369314 369654 369519 368729 367124 364813 362066 358987 355561 351930 348451 345500 343366 342235
51676 342235 342109 342831 344326 346693 349868 353382 356680 359733 363171 367889 374528 383158 393219 403854
51662 403854 414247 423517 430349 433292 431870 427141 420848 414175 407659 401944 397994 396491 397439 400366
51648 400366 404609 409313 413476 416154 416554 414089 408634 400705 391189 380969 370948 362088 354935 349214
51634 349214 344323 340146 336949 334646 332875 331765 331920 333373 335227 336743 338263 340579 343705 346778
51620 346778 348954 349995 350150 349858 349534 349306 348938 348115 346716 344702 342023 338867 335789 333307 331462 330011
51604 330011 328891 328224 328112 328683 330212 332834 336274 340196 344694 349996 355852 361739 367662 374046 380549
$$ packed form
51707C84774l533l943l147k192j826j457l70R16J309O50k52q12j053j000m95K74
51691C67843P63P08L40j35p90j605k311k747l079l426l631l479k951k134j131
51676C42235j26P22J495K367L175L514L298L053L438M718O639Q630J0061J0635
51662D03854J0393R270O832K943j422m729o293o673o516n715l950j503R48K927
51648D00366M243M704M163K678M00k465n455p929r516j0220j0021q860p153n721
51634C49214m891m177l197k303j771j110J55J453J854J516J520K316L126L073
51620C46778K176J041J55k92l24k28l68q23j399k014k679l156l078k482j845j451
51604C30011j120o67j12N71J529K622L440L922M498N302N856N887N923O384O503
$$ plain form
51589 380549 385562 387465 386099 382593 378050 372980 367849 363411 360214 358291 357636 358559 361221 365251 370395
51574 370395 377330 387097 399601 413280 426576 439303 452234 465753 479436 492762 505662 518373
51562 518373 531318 545405 562051 582455 606807 634309 663939 694977 726694 757599 785276
51551 785276 807161 821602 828172 827138 818960 804353 784447 760410 732999 702700 670358 637402
51539 637402 605400 575508 548318 524037 502670 484089 468019 454120 442139 431929 423137 415101
51527 415101 407382 400463 395413 392644 391371 390545 389921 389866 390474 391433 392517 393673 394632 394907 394142 392152
51511 392152 388793 384224 379246 374848 371363 368403 365514 362505 359286 355918 352796 350293 348257 346368
51497 346368 344884 344305 344292 343722 342125 340361 339494 339535 339698 339416 338658 337650 336701 336048 335531 334700 333497 332447
$$ packed form
51589C80549N013J903j366l506m543n070n131m438l197j923o55R23K662M030N144
51574C70395O935R767J2504J3679J3296J2727J2931J3519J3683J3326J2900J2711
51562E18373J2945J4087J6646K0404K4352K7502K9630L1038L1717L0905K7677
51551G85276K1885J4441O570j034q178j4607j9906k4037k7411l0299l2342l2956
51539F37402l2002k9892k7190k4281k1367j8581j6070j3899j1981j0210q792q036
51527D15101p719o919n050k769j273q26o24n5O08R59J084J156R59K75p65j990
51511C92152l359m569m978m398l485k960k889l009l219l368l122k503k036j889
51497C46368j484n79j3n70j597j764q67M1J63k82p58j008r49o53n17q31j203j050
$$ plain form
51479 332447 331927 331643 331141 330389 329430 327862 325198 321586 317762 314404 311780 309804 308143 306531 305213
51464 305213 304819 305514 306628 307459 308041 308736 309456 309882 310155 310757 311817 313080 314527 316533 319374 322826
51448 322826 326294 329169 331363 333761 337770 343966 351416 358785 365774 372838 379780 385531 389376 391598
51434 391598 392702 392709 391607 389921 388291 386677 384369 380698 375567 369486 363271 357592 352641 348359 344994
51419 344994 343144 343094 344289 345743 346920 348102 349923 352623 355720 358332 359845 360326 360326 360307 360280 359949 359161
51402 359161 358185 357506 357367 357562 357801 358112 358776 359978 361826 364473 367855 371380 374517 377788 382613 389893
51386 389893 399256 409986 422186 436687 454299 475636 501179 530952 564441 601287 641581 684910
51374 684910 729618 773679 815821 854871 888484 913842 929645 936412 934670 924039 904447 877173
$$ packed form
51479C32447n20k84n02p52r59j568k664l612l824l358k624j976j661j612j318
51464C05213l94O95J114Q31N82O95P20M26K73O02J060J263J447K006K841L452
51448C22826L468K875K194K398M009O196P450P369O989P064O942N751L845K222
51434C91598J104Pj102j686j630j614k308l671n131o081o215n679m951m282l365
51419C44994j850n0J195J454J177J182J821K700L097K612J513M81%j9k7l31p88
51402C59161r76o79j39J95K39L11O64J202J848K647L382L525L137L271M825P280
51386C89893R363J0730J2200J4501J7612K1337K5543K9773L3489L6846M0294M3329
51374F84910M4708M4061M2142L9050L3613K5358J5803O767j742j0631j9592k7274
$$ plain form
51362 877173 843997 806119 764561 720999 677379 635052 594893 557871 524771 495527 469493
51351 469493 446332 426228 409338 395555 384724 376550 370170 364354 358422 352717 347894 343873 339795
51338 339795 335052 330169 326378 324262 323013 321255 318479 315394 312927 311286 310085 309004 307976 306979
51324 306979 306065 305571 305952 307236 308869 310277 311507 313098 315314 317739 319796 321534 323569 326267 329260
51309 329260 331831 333503 334178 334029 333475 332885 332087 330506 328122 325857 324523 323722 322332 319876 316807 313641
51293 313641 310560 307803 305716 304226 302882 301571 300635 300210 300099 300481 301990 304715 307767 310379 312890
51278 312890 316122 320191 324512 328608 332252 335020 336475 336786 336712 336833 337241 338038 339680 342532 346266 349903
51262 349903 352450 353482 353237 352275 351011 349524 347671 345286 342305 338881 335422 332455 330340 329080 328344
$$ packed form
51362H77173l3176l7878m1558m3562m3620m2327m0159l7022l3100k9244k6034
51351D69493k3161k0104j6890j3783j0831q174o380n816n932n705m823m021m078
51338C39795m743m883l791k116j249j758k776l085k467j641j201j081j028r97
51324C06979r14m94L81J284J633J408J230J591K216K425K057J738K035K698K993
51309C29260K571J672O75j49n54n90p98j581k384k265j334q01j390k456l069l166
51293C13641l081k757k087j490j344j311r36m25j11L82J509K725L052K612K511
51278C12890L232M069M321M096L644K768J455L11p4J21M08P97J642K852L734L637
51262C49903K547J032k45r62j264j487j853k385k981l424l459k967k115j260p36
$$ plain form
51247 328344 327636 326591 325206 323661 321850 319416 316453 313800 312157 311161 309873 308064 306414 305508 305260
51232 305260 305362 305588 305528 304735 303401 302376 302232 302824 303902 305453 307160 308288 308641 309001 310004 311200
51216 311200 311891 312415 313810 316510 320101 324113 328254 331975 334583 335939 336625 337451 339156 342240 346421
51201 346421 350351 352617 353073 352625 351774 350090 347279 344017 341327 339537 338197 336744 335015 333291 332040
51186 332040 331455 331224 330921 330552 330458 330787 331437 332426 333836 335436 336878 338269 339961 341645 342361 341742 340662
51169 340662 340161 340185 339942 339134 338246 337772 337789 338310 339506 341361 343468 345392 347079 348765 350633 352668 354690
51152 354690 356422 357582 357985 357535 356154 353863 350982 348071 345492 343006 340009 336255 332268 328933 326677
51137 326677 325151 323758 322400 321608 321899 323075 324272 324753 324636 324777 325960 328290 331314 334483 337382
$$ packed form
51247C28344p08j045j385j545j811k434k963k653j643r96j288j809j650r06k48
51232C05260J02K26o0p93j334j025j44N92J078J551J707J128L53L60J003J196
51216C11200O91N24J395K700L591M012M141L721K608J356O86Q26J705L084M181
51201C46421L930K266M56m48q51j684k811l262k690j790j340j453j729j724j251
51186C32040n85k31l03l69r4L29O50R89J410J600J442J391J692J684P16o19j080
51169C40662n01K4k43q08q88m74J7N21J196J855K107J924J687J686J868K035K022
51152C54690J732J160M03m50j381k291k881k911k579k486k997l754l987l335k256
51137C26677j526j393j358p92K91J176J197M81j17J41J183K330L024L169K899
$$ plain form
51122 337382 339758 341640 343395 345354 347410 349272 351098 353468 356595 359923 362778 365149 367482 369893
51108 369893 371958 373308 374122 374920 376069 377579 379282 381088 382982 384799 386101 386430 385720 384381 382973
51093 382973 381860 381164 380838 380735 380750 380940 381387 381991 382564 383064 383497 383646 383204 382265 381282 380514 379879 379419 379434
51074 379434 379944 380514 380985 381955 384103 387234 390440 393070 395260 397717 401296 406614 413698 422104 431551
51059 431551 442264 454471 467832 481586 494983 507273 517782 526565 534828 544116 555113 567475
51047 567475 580495 593421 605310 615206 622520 626949 628223 626344 621814 615128 606308 595512 583849
51034 583849 572789 562841 553453 544096 534598 524453 512883 500019 487333 476479 468164 462365 458965
51021 458965 457762 458458 461024 465575 471536 477515 482573 487128 492087 497574 503134 508742 514758 521023
$$ packed form
51122C37382K376J882J755J959K056J862J826K370L127L328K855K371K333K411
51108C69893K065J350Q14P98J149J510J703J806J894J817J302L29p10j339j408
51093C82973j113o96l26j03J5J90M47O04N73N00M33J49m42r39r83p68o35m60J5
51074C79434N10N70M71R70K148L131L206K630K190K457L579N318P084Q406R447
51059D31551J0713J2207J3361J3754J3397J2290J0509Q783Q263R288J0997J2362
51047E67475J3020J2926J1889R896P314M429J274j879m530o686q820j0796j1663
51034E83849j1060r948r388r357r498j0145j1570j2864j2686j0854q315n799l400
51021D58965j203O96K566M551N961N979N058M555M959N487N560N608O016O265
$$ plain form
51007 521023 526812 531836 536790 542714 550149 558980 568742 578957 589380 600003 610651 620709 629526
50994 629526 637111 644051 650638 656338 660406 662890 664761 666999 669721 672387 674768 677490 681580 687660
50980 687660 695741 705585 716945 729505 742909 756962 771723 787429 804485 823437 844773 868904
50968 868904 896529 928759 966415 1009280 1056461 1107443 1162235 1220502 1281209 1343375 1406661
50957 1406661 1470903 1535444 1599162 1660754 1718781 1771915 1819532 1861755 1898689 1930055 1955931
50946 1955931 1977390 1995839 2011964 2025788 2037580 2048239 2058841 2070058 2081722 2092610 2100965
50935 2100965 2105699 2106963 2105242 2100269 2091372 2078444 2061734 2040709 2014007 1980755 1941295 1896297
50923 1896297 1845702 1789121 1726942 1660661 1592229 1523449 1455928 1391097 1329892 1272486 1218612
$$ packed form
51007E21023N789N024M954N924P435Q831R762J0215J0423J0623J0648J0058Q817
50994F29526P585O940O587N700M068K484J871K238K722K666K381K722M090O080
50980F87660Q081R844J1360J2560J3404J4053J4761J5706J7056J8952K1336K4131
50968H68904K7625L2230L7656M2865M7181N0982N4792N8267O0707O2166O3286
50957A406661O4242O4541O3718O1592N8027N3134M7617M2223L6934L1366K5876
50946A955931K1459J8449J6125J3824J1792J0659J0602J1217J1664J0888Q355
50935B100965M734J264j721m973q897j2928j6710k1025k6702l3252l9460m4998
50923A896297n0595n6581o2179o6281o8432o8780o7521o4831o1205n7406n3874
$$ [...]
##END NTUPLES=NMR SPECTRUM
##END=
