##TITLE=AC1725_CUNAH15011_9208098_6u64OiWDWz
##JCAMPDX= 6.0         $$ Bruker NMR JCAMP-DX V2.0
##DATA TYPE= NMR SPECTRUM
##DATA CLASS= NTUPLES
##ORIGIN= BRUKER
##OWNER= Administrator
$$ 1.72 TOPSPIN		Version 2.1
$$ 2015-06-01 17:22:09.561 -0700  Administrator@X
$$ Compression mode = diff/dup
##.OBSERVE FREQUENCY= 400.02188249412
##.OBSERVE NUCLEUS= ^1H
##.ACQUISITION MODE= SIMULTANEOUS (DQD)
##.ACQUISITION SCHEME= undefined
##.AVERAGES= 8
##.DIGITISER RES= 22
##SPECTROMETER/DATA SYSTEM= spect
##.PULSE SEQUENCE= zg30
##.SOLVENT NAME= COFFEE_meoh
##.SHIFT REFERENCE= INTERNAL, COFFEE_meoh, 1, 14.98509
##AUDIT TRAIL= $$ (NUMBER, WHEN, WHO, WHERE, PROCESS, VERSION, WHAT)
$$ ##TITLE= Audit trail, TOPSPIN		Version 2.1
$$ ##JCAMPDX= 5.01
$$ ##ORIGIN= Bruker BioSpin GmbH
$$ ##OWNER= Administrator
$$ $$ E:\/data/COFFEE/nmr/AC1725_CUNAH15011_9208098_6u64OiWDWz/10/pdata/1/auditp.txt
$$ ##AUDIT TRAIL=  $$ (NUMBER, WHEN, WHO, WHERE, PROCESS, VERSION, WHAT)
(   1,<2015-06-01 17:22:02.233 -0700>,<Administrator>,<X>,<go>,<TOPSPIN 2.1>,
      <created by zg
	started at 2015-06-01 17:20:55.561 -0700,
	POWCHK enabled, PULCHK disabled,
       configuration hash MD5:
       21 0F 79 D6 B3 7B B4 F6 88 20 88 DB 03 48 BD 9F
       data hash MD5: 64K
       42 CC BF 31 FC 17 2B 38 76 98 A6 0F 5A 38 30 8B>)
(   2,<2015-06-01 17:22:05.592 -0700>,<Administrator>,<X>,<proc1d>,<TOPSPIN 2.1>,
      <Start of raw data processing
       efp LB = 0 FT_mod = 6 PKNL = 1 PHC0 = 0 PHC1 = 0 SI = 32K 
       data hash MD5: 32K
       08 17 B8 3C 20 88 3F 19 78 06 CD E2 59 40 ED F4>)
(   3,<2015-06-01 17:22:05.873 -0700>,<Administrator>,<X>,<proc1d>,<TOPSPIN 2.1>,
      <pk PHC0 = 89.90112 PHC1 = 0 
       data hash MD5: 32K
       F2 A6 1A 6A 0C 98 19 92 FD 0C 7D F2 05 E3 01 DD>)
(   4,<2015-06-01 17:22:05.983 -0700>,<Administrator>,<X>,<proc1d>,<TOPSPIN 2.1>,
      <abs ABSG = 1 
       data hash MD5: 32K
       57 37 5B 7A 05 29 B4 68 A0 BE D7 39 68 6B 40 8F>)
(   5,<2015-06-01 17:22:06.045 -0700>,<Administrator>,<X>,<proc1d>,<TOPSPIN 2.1>,
      <abs ABSG = 2 
       data hash MD5: 32K
       41 F5 1E 45 08 15 5E EF 42 7E 97 82 8C 76 38 4D>)
(   6,<2015-06-01 17:22:06.108 -0700>,<Administrator>,<X>,<proc1d>,<TOPSPIN 2.1>,
      <abs ABSG = 3 
       data hash MD5: 32K
       EA 96 91 F9 E4 7F D4 B6 88 C1 BD 88 55 17 48 11>)
(   7,<2015-06-01 17:22:06.155 -0700>,<Administrator>,<X>,<proc1d>,<TOPSPIN 2.1>,
      <abs ABSG = 4 
       data hash MD5: 32K
       FC 79 F9 18 89 CC C5 1B E5 F0 90 90 72 08 DB 00>)
(   8,<2015-06-01 17:22:06.217 -0700>,<Administrator>,<X>,<proc1d>,<TOPSPIN 2.1>,
      <abs ABSG = 5 
       data hash MD5: 32K
       91 2D 72 9A 4D E2 51 BD C2 F8 13 A2 4F 69 5E FA>)
$$ ##END=
$$ 
$$ $$ hash MD5
$$ $$ 4B 2F DB 23 AA DD DB 62 30 AC D5 3B C3 BA CE 79
##$RELAX= 
##$RELAX= 
##$RELAX= 
##$RELAX= 
##$RELAX= 
##$RELAX= 
##$RELAX= 
$$ Bruker specific parameters
$$ --------------------------
##$DU= <E:\>
##$EXPNO= 10
##$NAME= <AC1725_CUNAH15011_9208098_6u64OiWDWz>
$$ [...]
150 150 150 150 150 150 150 150
##$TP07= 0
##$TPNAME0= <>
##$TPNAME1= <>
##$TPNAME2= <>
##$TPNAME3= <>
##$TPNAME4= <>
##$TPNAME5= <>
##$TPNAME6= <>
##$TPNAME7= <>
##$TPOAL= (0..7)
0.5 0.5 0.5 0.5 0.5 0.5 0.5 0.5
##$TPOFFS= (0..7)
0 0 0 0 0 0 0 0
##$TUNHIN= 0
##$TUNHOUT= 0
##$TUNXOUT= 0
##$USERA1= <user>
##$USERA2= <user>
##$USERA3= <user>
##$USERA4= <user>
##$USERA5= <user>
##$V9= 5
##$VALIST= <valist>
##$VCLIST= <CCCCCCCCCCCCCCC>
##$VD= 0
##$VDLIST= <DDDDDDDDDDDDDDD>
##$VPLIST= <PPPPPPPPPPPPPPP>
##$VTLIST= <TTTTTTTTTTTTTTT>
##$WBST= 2048
##$WBSW= 25
##$XGAIN= (0..3)
0 0 0 0
##$XL= 0
##$YL= 0
##$YMAX_a= 556135
##$YMIN_a= -480199
##$ZGOPTNS= <>
##$ZL1= 120
##$ZL2= 120
##$ZL3= 120
##$ZL4= 120
##$ABSF1= 14.98509
##$ABSF2= -5.573092
##$ABSG= 5
##$ABSL= 3
##$ALPHA= 0
##$AQORDER= 0
##$ASSFAC= 0
##$ASSFACI= 0
##$ASSFACX= 0
##$ASSWID= 0
##$AUNMP= <proc_prof1d_extract_pilot.lims>
##$AXLEFT= 0
##$AXNAME= <>
##$AXNUC= <1H>
##$AXRIGHT= 0
##$AXTYPE= 0
##$AXUNIT= <>
##$AZFE= 0.1
##$AZFW= 0.1
##$BCFW= 0
##$BC_mod= 0
##$BYTORDP= 0
##$COROFFS= 0
##$CY= 15
##$DATMOD= 1
##$DC= 0
##$DFILT= <>
##$DTYPP= 0
##$F1P= 0
##$F2P= 0
##$FCOR= 0.5
##$FTSIZE= 32768
##$FT_mod= 6
##$GAMMA= 0
##$GB= 0
##$INTBC= 1
##$INTSCL= 1
##$ISEN= 128
##$LB= 0
##$LEV0= 0
##$LPBIN= 0
##$MAXI= 10000
##$MC2= 0
##$MEAN= 0
##$ME_mod= 0
##$MI= 0
##$NCOEF= 0
##$NC_proc= -8
##$NLEV= 6
##$NOISF1= 0
##$NOISF2= 0
##$NSP= 0
##$NTH_PI= 0
##$NZP= 0
##$OFFSET= 14.98509
##$PC= 1
##$PHC0= 89.90112
##$PHC1= 0
##$PH_mod= 1
##$PKNL= yes
##$PPARMOD= 0
##$PPDIAG= 0
##$PPIPTYP= 0
##$PPMPNUM= 2147483647
##$PPRESOL= 1
##$PSCAL= 4
##$PSIGN= 0
##$PYNMP= <proc.py>
##$REVERSE= no
##$SF= 400.02
##$SI= 32768
##$SIGF1= 0
##$SIGF2= 0
##$SINO= 400
##$SIOLD= 32768
##$SPECTYP= <>
##$SREGLST= <1H.CDCl3>
##$SSB= 0
##$STSI= 32768
##$STSR= 0
##$SW_p= 8223.68421052631
##$SYMM= 0
##$S_DEV= 0
##$TDeff= 65536
##$TDoff= 0
##$TI= <>
##$TILT= no
##$TM1= 0
##$TM2= 0
##$TOPLEV= 0
##$USERP1= <user>
##$USERP2= <user>
##$USERP3= <user>
##$USERP4= <user>
##$USERP5= <user>
##$WDW= 1
##$XDIM= 32768
##$YMAX_p= 414008325
##$YMIN_p= -617756
##$CURPLOT= <Network HP LaserJet P1505>
##$CURPRIN= <$Network HP LaserJet P1505>
##$DFORMAT= <normdp>
##$LAYOUT= <+/1D_H.xwp>
##$LFORMAT= <normlp>
##$PFORMAT= <normpl>
##$SURQMSG= 1
$$ End of Bruker specific parameters
$$ ---------------------------------
##NTUPLES= NMR SPECTRUM
##VAR_NAME=  FREQUENCY,     SPECTRUM/REAL,   SPECTRUM/IMAG
##SYMBOL=    X,             R,               I
##VAR_TYPE=  INDEPENDENT,   DEPENDENT,       DEPENDENT
##VAR_FORM=  AFFN,          ASDF,            ASDF
##VAR_DIM=   32768,         32768,           32768
##UNITS=     HZ,            ARBITRARY UNITS, ARBITRARY UNITS
##FACTOR=    0.250966925370066, 1,           1
##FIRST=     8223.43324360094, -43000,       53750
##LAST=      0,             -168323,         -209404
##MIN=       0,             -617756,         0
##MAX=       8223.43324360094, 414008325,    0
$$ Real data points
##PAGE= N=1
##DATA TABLE= (X++(R..R)), XYDATA
$$ [...]
23897 370030 -75650 -92607 -62765 -102878 62837 248054 307582 16747 425407 218646 -127349
23885 -1148 -139496 -208915 -53383 42492 -161094 424875 -67069 81733 -275960 -86231 -15124
23873 -16475 91668 25444 -233988 89874 100049 -225878 9909 -41595 -98532 -4192 11134 35132
23861 35132 295529 195532 -212045 -51220 -93051 -154077 12217 -236670 -204301 -119765 40226
23849 98805 11880 90743 194045 -273647 -101076 198242 -19400 -324549 124475 113083
23839 113083 25972 17556 -160043 453999 -32406 543728 -346191 -269098 -177613 -58778 -77413
23828 -77413 -88466 15030 -143782 -142052 -5462 206112 -64516 -96193 32831 21991 418650
23817 418650 -206979 -47908 -98646 14321 83045 -66603 -259467 -255931 -11940 130060 -339159
23805 -111436 380558 47635 -185365 158679 88563 -136284 -296855 172563 35660 -185179
23794 94259 -73222 -290997 -383200 142966 -264450 -142173 -96530 242922 60432 399498
23784 399498 -229923 -74596 28805 -139542 176342 90025 27300 176965 193877 163961 -133950
23772 -17759 102796 184020 40697 -153000 946 11770 7180 16172 -2527 199355 -62821 -145937
23760 -145937 162496 1879 48400 211942 -162714 101195 -50518 89453 -149131 -62567 -91179
23749 -91179 44768 -172372 49725 -261670 62000 -196218 -58873 -159429 62954 194140 142875
23738 142875 -65997 -85289 -199787 294382 145774 -206257 157128 -145695 195254 -353713
23727 34197 7583 225951 353462 170270 62714 -4269 -108441 -27560 98572 -124380 244221
23715 -348176 -156612 -51457 -166193 -43805 -240019 77090 -167097 -302292 350832 -90886
23704 254328 -13804 -33741 -62810 -228302 22748 -70767 -8590 -78131 52294 -99089 -185005
23693 -185005 152686 148497 -164263 -40460 166031 -168574 -84788 23891 -250594 -192783 -19920
23681 155018 53930 314171 -131544 -145392 27368 299233 -196052 325360 -54894 -277560
23671 -277560 60707 160143 -78185 39139 -158213 -119140 1737 -156002 58367 152145 90369
23660 90369 105579 55091 -61712 -337479 -276841 92769 43868 -135144 -89351 -367802 37048
23648 -68635 91004 -29628 45974 123594 -174379 -31053 92955 296844 -53216 -286548 -24831
23636 -291186 -25795 -84472 23849 152742 141764 93694 -324243 -211507 -133839 161323 -121475
23624 -171775 82403 127174 185906 51332 102828 46049 228006 337045 167335 214795 -61478
23612 -137988 -138819 -149935 961 -78166 -159779 -84021 -108168 -19809 -54164 -262324 -72779 95431
23599 -52215 -125641 -251101 68454 -58582 -254640 222002 -65778 21846 92688 -69051 73815
23587 121141 -63358 -40883 -60529 432883 69786 -36531 -147496 8830 380300 22655 289640
23576 289640 -91980 91501 153530 11290 269091 94373 -4715 -52638 -159183 100461 147929
23565 147929 -68764 -13095 248931 327909 -287712 -394326 68839 -480953 -29086 27409 -188996
23553 81902 -95153 188467 214881 -14992 -57230 -8841 -82153 -164929 35697 -273274 -309286
23542 -309286 -7149 -388692 -13805 -66112 175402 -47548 182470 118478 -170188 55389 -90881
23530 110279 94853 108679 -13999 282553 11561 178434 15049 35845 97272 99196 -11371
23518 -81433 -102780 151060 67288 -7838 40791 183753 -65994 -135281 47440 -20112 -423055
23507 -423055 44860 53191 -197085 334171 -29990 1203 34600 -37851 808 -18073 239024 -112493
23494 29435 129199 195111 158095 27672 -93802 -113437 -147051 -105101 296794 73985 -106188
23482 56800 181275 242852 -197741 -74884 -132512 -15574 442872 -54290 -245483 183586 -59192
23470 -19821 171702 -73466 -268237 -272334 -53888 31060 138890 -95423 -89899 312523 87206
23458 -42402 209187 379124 -31188 199590 164999 73653 -191210 14290 94288 43009 -117976
23446 407227 -256402 4104 256957 280236 71799 -40358 35373 1977 53327 81129 18074
23434 11981 -132640 -324918 -126171 -89095 -119461 -391529 158023 -17918 -235835 -38420
23423 -32021 -25573 -21798 -31727 -115018 -126200 132823 215288 -19794 98777 -51031 82373 -128464
23410 285908 26459 14108 -250288 -26569 -173699 -378587 356037 -169242 39348 173799
23400 173799 154442 -413702 128373 -243834 81287 183623 -174844 132677 235723 109686
23389 -221336 -41151 150993 20383 24090 101269 80722 -40446 231028 279717 196536 -305033
23377 103628 -154535 -205050 225003 32604 474917 -36661 65998 -16976 -193345 43316 -60325
23365 -132504 -12641 187095 138798 -14699 -65209 228102 -189464 -248987 91780 -60482 7571
23353 -143846 258906 136001 -54634 -81999 -49669 -192371 -15636 235192 3814 -14114 -110901
23342 -110901 -170033 -122802 -91477 71960 -62425 -15499 355599 -87963 174957 64384 -166504
23330 121297 -120455 -95778 -53957 -45850 188359 -227974 193054 -25023 -115757 -199744 158131
23318 114240 -45329 -99469 270729 77478 27194 -273279 10901 26863 -94301 -257405 13
23306 -111677 -205853 -189334 -105093 303203 -198905 86305 -62886 -135970 46258 20508 -198684
23294 -43799 119295 7742 346125 189890 16064 102225 233205 -155274 123290 -115617
23283 207756 -425328 -136209 -80910 -131590 -137403 -168225 16506 -237119 103521 121552 25369
23271 -244981 -133729 165362 -165572 -108320 -180005 -80986 126583 32851 -76315 -78496 345433
23259 138636 -216290 14883 164756 -75253 -230775 14387 -118145 -142511 167504 23356
23248 -160273 -336141 -51423 49105 -242522 34175 266291 -27448 -2326 105500 115358 -176641
23236 28240 224340 212707 7064 66362 -189065 -67227 -240283 -230908 -134426 -87401 -127267
23225 -127267 -74510 137742 356755 -307121 244350 -92150 217835 -135353 -82902 -126336
23215 -126336 43990 101132 219644 -77962 -166043 -131346 -214384 61672 255339 79799 -42550
23203 -51361 -103779 121561 -207303 76408 -20934 35009 -380162 -16813 -109400 -63533 226323
23191 -196611 313683 247228 77378 -211226 -169509 -93644 -119662 -80925 -80352 175286 -211212
23179 -87779 -16812 -54048 -95753 -256759 -213489 -175105 -66012 140269 -126526 113246 -132528
23167 300901 51815 11587 43459 130592 39980 87559 60555 42456 65171 -170408 -72777
23155 239608 -61368 55790 25540 -4471 159863 93331 -319604 -151504 -3164 51587 -232395
23143 136013 -282759 -290559 571 -58689 -186835 -3023 29478 -14079 -130755 -50644 148252
23131 -147419 115097 -9983 214184 35180 242309 -71226 127819 -50643 191763 -5036 -7236
23120 -7236 -215375 137171 -209813 -187743 -62627 -87874 -179951 102383 113486 44098 78142
23109 78142 -58753 -62124 -40498 152652 41995 89483 89770 -18924 -28689 -230587 378323 253086
23097 253086 35716 -209502 -33140 166561 71061 -26375 -169210 -48398 23968 -116002 -24854
23085 45771 264488 -14430 -22631 398954 72742 91143 -155051 99156 20110 240659 51958
23073 -205718 -64369 -235733 -56574 -251371 475820 -174218 147460 94516 -221919 139979
23062 -164391 78986 -182545 -433946 -10185 -60603 106020 -2830 -105531 -314647 -211151
23052 -211151 -131608 -88564 -136902 -96433 157171 61334 10157 -141747 6167 315154 -63384
23040 -288780 147032 3238 -116634 123621 -112172 112977 -47372 160923 68628 169095
23030 169095 -121199 -47446 118664 -136249 333420 41385 58248 -133696 -38934 -248216
23020 -248216 37395 -34525 -104192 75222 -356955 -168107 45315 -76960 123715 54100 388470
23009 388470 -245033 -76048 -35601 -81071 298292 144094 -153868 36031 -206773 105579
22998 -230089 -74125 -4573 63558 -226784 -71953 207366 298841 -89706 -207936 64014 -181994
22986 55259 -221871 -179641 -194542 43866 -58736 -52426 10691 75253 -78513 -104131 37442 119347
22974 119347 -11946 16196 -6884 248458 -19666 -40170 219611 194367 -208041 74745 -120787
22962 312495 -93215 149379 351627 65783 167086 -33792 151273 38313 113129 21011 -30278
22950 -31217 76372 57622 392483 -227752 252343 -200335 75340 443033 -157104 108134
22939 47423 -59164 -23542 -511 182951 -109194 -129756 -184457 3605 -36535 293610 -116001
22927 44644 -210914 15484 -142917 2200 166256 -3443 -254764 -10329 -103922 -138781 66 88734
22915 88734 -168113 26999 100767 -120919 -10623 -123788 -159623 40840 -117023 107511 -147161
22903 -22146 -74646 -47451 134826 167043 -114572 320755 78949 -448528 -277293 -242622 -4637
22891 67454 -303329 12079 12238 -209978 -12697 -23090 -214022 74650 -9981 179831 71612
22879 -147001 -83183 -23203 -142961 -396226 -88611 -264881 -61492 -95722 58272 2723 -354442
22867 179723 -138651 27854 -106482 -18061 154313 -54742 -40120 41622 279399 -12005 -35227
22856 -35227 27333 37806 213316 56048 -56984 80132 -145480 112550 112566 14431 246089
22845 246089 -89307 -64889 251555 -31429 190940 133566 56351 -63527 -254396 67970 -91077
22833 112728 -211231 191177 52599 -27166 -252061 42169 137496 49243 17401 131338 17026
22821 158382 145114 -106050 -249294 270730 -315374 -175490 -225262 -133178 -214963 -366434
22811 -366434 60354 129266 30343 117330 -14919 -92625 -29601 -277151 129739 -165838 -93575
22800 -93575 -179052 65910 -169425 80285 -128009 207754 -353361 -34277 152540 -150436
22789 6794 47228 -15170 -72032 -50184 -120253 -75996 172003 181914 -153478 335975 42703
22777 268676 -119782 -357666 -57378 -164671 -39941 82762 272082 -176281 -217421 -414863
22767 -414863 238008 106669 98248 92482 70868 -63989 -58727 -13633 99142 -18597 -328698
22756 -328698 -17715 5152 179382 -246316 68632 -94692 -315905 516390 -124034 90082 -95671
22744 125753 -161592 145611 -270315 144011 184340 467456 -117565 -230299 -105586 -154219
22734 -154219 -94138 352681 -68609 -147532 -95461 70509 278901 -114032 42395 -283712 -58443
22722 -88111 76622 -249617 292605 174218 -157475 -30844 -2047 -89237 -22815 187715 -241089
22710 243439 105387 -68182 -21691 -123645 40986 -262441 -8687 -161832 -32870 -12804 -212520
22699 -212520 -138138 -176049 368663 51942 -89943 55031 -43749 82227 -97295 -1004 -151124
22688 -151124 -245084 31381 -25937 179959 -141242 -94944 -263047 -152416 -222650 -114406
22678 -114406 31601 82173 -68435 -81356 -16205 -16995 161689 -121790 -64268 123605 -294218
22666 -102332 149391 -309377 -125960 -320026 193418 259102 21614 -212372 171208 -135877
22655 -36563 187647 80400 58253 -87707 -24108 -113613 -111258 -64070 -69795 -192125 -236933 -89181
22642 -280066 -206977 69856 3423 -15718 42511 708 116909 34105 197754 284252 71866 28865
22629 -11083 322984 362602 218385 162591 64436 -180600 29125 -241853 -117725 -158322 104243
22617 -110159 80058 -331137 177282 -35221 31969 10944 64527 -142035 176825 91604 53648
22606 53648 44965 -216625 -144999 -36760 -157715 157761 -312194 -110463 72651 -341453 -82401
22594 192311 82650 145747 189883 141120 -149651 -17889 44087 -206558 324546 -212589 -125435
22583 -125435 166304 -38243 -6146 -341957 -64053 -63754 -14474 -185166 400764 53598 -9198
22571 -107635 -33339 104394 -143729 -235588 -21466 -178491 -149841 -28573 -192279 134549
22560 180739 42598 -27443 -63167 -27885 -77209 -51162 320200 274968 -166980 348793 204812
22549 204812 -408524 -93146 26443 -271865 -186477 -123849 -89469 172852 160909 -308131 34581
22537 175263 -73922 -417696 23333 -116518 -65770 47795 -4218 238384 -55058 -11421 28307
22525 40198 -83448 -315283 257134 -17409 119673 38314 -262197 -93593 -129194 68786 205403
22514 205403 -224006 110049 -165283 -163336 187555 -134206 68708 -112148 231839 -150705
22503 -83219 -171214 -39345 262287 -211925 -109543 39578 -81596 55853 67482 -4169 140656
22491 -12977 138531 -124759 159335 49888 -149870 -114469 206959 -194813 93043 -100141
22480 56518 282374 -150473 -86057 -90353 146794 72539 56048 83674 -23388 145777 -391151
22468 -180291 97938 42919 9284 365967 80140 91947 168914 70162 -112343 67884 -50222
22456 -84812 109097 -4822 -150298 -26406 2377 -114468 169251 -188101 -248427 -3797 55933
22444 -26985 -91827 54318 87360 -45853 244712 -316377 -91100 166701 67949 240933 -100830
22432 -144872 109432 51066 -167132 -46315 -12414 52601 39339 -29831 -159274 3398 -147965
22420 -121664 -248674 -367194 33789 117592 179377 -67262 150913 79278 -106975 -8316 -125021
22409 -125021 173447 -148529 -56457 -46012 87506 27789 41773 336386 -61703 -191172 2797
22397 103828 180577 72049 82427 -79630 -122745 84793 -129447 -308684 238616 -66512 -83882
22386 -83882 35179 -58078 -252953 -262039 -4108 -460826 99333 -157761 -239453 58781 -72323
22374 -102850 -280309 102393 47190 32493 -274933 -71321 -91800 -110933 -57554 98286 -78507
22362 -156624 82866 -10856 24329 -83152 -105516 -90466 46162 -32374 -401752 164560 -113638
22350 -160683 -99306 90122 -130435 -163325 -65390 83375 196532 -240438 126680 -99126 -107648
22339 -107648 59138 -121264 285707 266172 -237862 -38520 -47054 72634 -173792 -91461 -120784
22328 -120784 162289 -232237 5869 -117970 -71494 229956 -35317 -74959 -131534 -76967 -48691
22317 -48691 11832 223036 -59938 229629 -246176 130054 249832 66317 -226498 300697
22306 -9602 -155670 154738 107825 -96159 26035 -21021 129740 -102049 250881 208190 183347
22295 183347 -80820 -249438 -233825 -105301 140214 -300545 14800 -48992 14820 -79489 -121545
22284 -121545 -192397 -106047 -11719 115722 -36878 -153662 -88629 145263 -44995 84428 -36521
22272 -246168 -87064 551 110033 -112743 71444 122122 -137476 143912 -46087 -35935 150999
22260 183561 -1907 222991 79298 -337110 1848 -58465 207070 -309727 -505452 67757 144817
22249 144817 -155495 -338806 53600 -144921 -213846 72140 -27636 39072 -54989 241990 -298789
22237 -234032 -49298 -35492 -77767 51721 123575 189957 192202 -168016 -14307 -292069 125316
22225 74148 152203 237211 105398 -158275 3301 -239760 286369 120292 -15447 -244757 49790
22213 -78884 99982 91543 -66784 -117331 74612 70888 -309478 -90173 37389 -91714 -32990 -399856
22201 -399856 -173661 -134200 207011 -167397 -191835 -13454 179064 23365 -93907 65678 -149679
22189 -271708 -46070 169195 -16709 164432 -45307 -1333 324709 -75772 63256 145723 -88443
22177 -48200 98969 -314939 -63757 121163 -180786 -13335 65918 -240879 196865 57340 135102
22166 135102 -34674 34315 95812 -2388 -254714 20009 35172 -456533 51088 -27510 -336642
22155 -336642 75024 -175499 -132904 -113058 14969 -152208 -434131 -72341 26812 -361560 -207360
22144 -207360 -491346 75297 -99368 86114 300071 -48328 -19258 -71721 -274961 -56687 238334
22132 -91235 -196726 124003 111656 -271439 6864 -15417 -64012 -523230 158551 -35009 142854
22120 -471717 -15362 17934 -348217 415713 -209806 53536 55978 215160 -63571 -126393 -12806
22108 216062 -61769 144594 -288479 -134282 134200 71011 180372 318620 -39495 -313498
22098 -313498 114270 22238 -64111 -313670 217110 -292100 -148451 199111 -77577 -101186
22088 -101186 186815 9036 -44689 -2851 -93188 -180672 -283448 46619 -143592 43539 -119525
22076 -113126 -12932 107642 87511 198482 -375717 -6339 -146886 93813 -260653 -59067 -185332
22065 -185332 121588 139898 256551 114609 71065 -84070 -120874 -98585 -45962 180849 -50457
22053 -79765 -226000 69278 -144650 -278683 -32207 -216067 129414 -136839 -106546 -91904
22043 -91904 216757 152424 -28263 164599 -187652 26847 -46971 20518 -134319 -264535 -86923
22031 -80764 49029 73625 37888 -119936 -87628 -27122 83005 120288 112547 -218402 -24589
22019 22513 -75240 -300390 631 -106952 119697 -106472 -99852 360759 180323 -190528 -468865
22008 -468865 -206358 88835 124636 250932 15695 -220427 -167639 193759 187101 -20906 -178536
21997 -178536 102273 -254620 -82513 -137625 134316 25653 -332853 27427 43446 -124555
21986 126435 -13809 -18894 -167820 159570 -18392 75994 139007 365306 39532 -135742 -290658
21975 -290658 43050 131447 -70110 71917 48836 171989 227528 -96246 334862 370202 -135068
21963 -308358 121238 -295684 -123472 363197 -208553 -326915 -99680 -289175 9426 320738
21953 320738 -48355 -157935 -1036 135466 202552 -94387 -21208 -65454 42118 215946 9798
21941 -263372 -226287 -130642 -182884 -36849 -111861 -95806 -156277 70593 147928 -113722 89130
21929 134329 -157877 140387 -83532 -11378 -16929 -97755 121807 299821 -97141 -215650 165627
21917 -49460 47233 -207164 250864 -163997 -117924 -111114 -353093 -138651 106992 -15245 294796
21905 118737 -188765 -198801 -217048 34497 -132987 -99324 -231821 95637 -192446 -88254 -127829
21894 -127829 57594 -285021 -9841 17879 20954 -16999 -42908 37255 39219 -2665 -31136 -3216
21881 -32241 517090 48029 -86098 -60842 92965 -11745 207881 -226405 -220432 312597 -248842
21869 -203961 -167566 -134044 -419057 18985 -8081 -411072 18838 29342 163770 -246511 51131
21857 84164 -35246 -198753 49811 -323181 -32849 -373757 -409561 -190283 -27751 104590 -301355
21845 -91267 -112459 -115269 -79824 -266195 -131435 144984 133291 80576 307313 17340 -347480
21833 -358338 118088 52309 -208306 11425 -242542 -7049 -1420 -302793 -180634 152490 -3957
21821 -165944 -128138 175647 269137 70009 90396 -15531 -104751 130910 48266 17777 32263
21810 32263 -37228 123902 -125179 216350 -123628 -60485 -99616 -36377 123240 -16574 214535
21798 221454 74047 -70910 -87800 -50268 6536 -47837 71000 89691 206331 257731 23173
21786 -141872 -92935 -104647 -157749 -161111 -190727 -22853 114909 -44782 -62899 60499 -120304
21774 -103052 -117677 129448 19535 66845 320921 61384 -174639 -123232 -275134 268523
21763 338517 -452566 -76719 -81593 18627 69240 95281 -129396 238005 31196 -15087 168558
21751 204023 -54545 2381 -343124 -203389 -166231 -64392 209107 19762 80211 -227082 156541
21739 333665 32658 15317 -100904 -220425 -13026 226124 216311 -92356 -139291 4424 103352
21728 103352 -562727 -14798 370190 69526 142113 237857 -104863 -314 96760 -359264 -56596
21716 50074 -355996 -170598 60964 -69417 -76297 -274833 14160 -100175 -70358 -290184 296234
21704 -151107 -137168 235486 -57745 -277244 -201996 -65547 80785 -15684 106023 -207453 237120
21692 -326593 328736 -144905 -305452 -91248 142223 -37869 -189418 -46299 -120799 -201182
21682 -201182 251918 -144788 -19522 -96957 -102215 -555991 -285748 94049 6582 -192661 -55098
21670 -186823 -154658 -79229 -299053 -176641 186577 89566 -78170 60184 83029 71767 136628
21659 136628 -131630 -24847 -54710 -296355 -119583 -304431 -75558 -195930 -239018 -336703
21649 -336703 -35748 -215126 106708 -99862 -271602 91405 60749 -17593 -226958 -186099 -159820
21638 -159820 -112955 -282397 41106 -7469 -300457 168529 -164195 57670 -90664 12352 61175
21627 61175 -58311 -920 74851 46197 -150142 -33125 -303702 2124 -45572 27300 -141743 -15100
21614 -124828 118989 233636 -174306 -209828 -195186 -170501 16079 148717 153026 33377 -149480
21602 133716 -186824 -32837 -62037 311758 -148067 -58302 -75989 -209046 -59464 -91977 25295
21590 22763 76609 42203 -93551 216638 -49315 -87659 -99655 -170921 91033 -109859 -278870
21579 -278870 -170221 66039 -39128 -54642 121321 194162 164400 104550 166667 -53156 -270363
21568 -270363 -148293 -104228 116556 -48533 60613 194029 -94833 26934 32996 16375 20774
21557 20774 -4163 -176636 -300839 -229808 -163564 24064 -184003 72667 -316885 6180 -113674
21545 75687 -190143 54290 199857 -33298 -130409 71580 63027 -263069 -150897 89359 -455
21533 165006 229129 -155016 272953 -273236 -13337 113752 16146 -184772 -120597 138542
21522 201954 -258484 -75944 -197627 235117 -119609 -159395 -81995 -62847 319228 -94362
21511 -21539 -120150 92475 66817 -21978 -382069 -71496 104125 -155860 191994 -342531 -1147
21499 211341 -247551 -44467 80690 -23900 -381485 -135662 -251019 325378 -24792 97611
21488 38942 -38474 -95797 103592 33864 90624 -15130 40087 368 85695 285859 -218784
21476 34504 -176349 -109080 -278041 -45340 -263269 -101265 -248328 -102417 -245430 40008
21465 -109643 -138094 -103232 -47479 -269804 31266 253816 -12751 244596 -319048 71298 102332
21454 102332 -95642 181292 -5484 -205573 -241649 65546 160080 -112134 -34195 171760 -85009
21442 2902 9039 411202 231027 -205420 38836 560599 245492 267982 178209 450948 128374
21430 -196651 -278586 -509100 -398964 26947 -287845 -280180 -182045 -86113 15434 166509 84221
21419 84221 -130534 -328039 39496 61742 -206084 -223336 78198 -146346 397425 -83719 -24164
21407 -145200 -165753 -149573 -139553 -95807 -42655 95349 19592 86399 -94441 39215 -434031
21395 -125056 -19268 -381003 -17860 14654 52331 -278702 174014 -37135 -202788 77407 206475
21384 206475 -17486 306701 -369201 -63515 -100124 -13093 -43127 -16617 -12940 -173114 -49088
21372 -255529 232010 -164566 -27442 -81726 124337 162938 -246639 112417 91675 -70178
21361 -166530 290212 -220485 98771 65780 -229818 84808 -227765 88310 119072 -125569
21350 -8508 -198315 176656 176989 -193813 -218635 -29815 156355 -98852 -84027 -138420 305779
21338 39614 -101082 15965 -245904 71831 248032 -115460 -270402 211967 -268248 220883
21327 120790 100765 48595 42861 -212750 -36781 21081 -73696 179454 -236580 -187824 -57046
21315 -39287 133434 -429743 -3260 -123501 20336 -83413 -213807 -36758 -116131 -190845 78531
21303 -121513 -141835 425415 -49297 -52105 -47814 23976 -162383 192243 -44220 -7313 113720
21291 -221031 -180722 -234370 -205065 -217792 158064 -16255 22751 -57379 83900 -22331 -273590
21280 -273590 131572 82704 126941 118897 -357810 -118564 93768 239620 -102599 204458
21269 -133653 204355 -14573 8227 -276952 127722 -64409 71305 -77321 -116437 -104630 84424
21257 33777 -51901 -310063 -266352 212604 172329 -333948 -163042 -417876 -336887 -71712 -431368
21246 -431368 166812 66957 -187458 -65584 -40657 -129213 13181 6371 -180361 -31406 78746
21234 -48318 -149443 190798 66945 -212184 59502 -350165 69289 -313445 73055 47890 1707
21222 -231239 135351 -309167 -137076 -196199 89252 116200 -298458 -15326 -208530 -21938
21211 -318431 194658 -70420 139773 88584 221505 -103250 -128207 -164173 -167937 -66299 62765
21199 -151730 -374161 116403 -27028 -89771 -137808 -225477 -22127 178548 12383 -262919 -139461
21188 -139461 99731 -163932 -59213 -214254 -75543 59342 -31786 -382839 -261639 -16687 -13414
21177 -13414 -159902 -68127 -51662 -224859 -394601 40960 -70767 -217105 -228814 -56860 -129754
21166 -129754 103496 -392091 -55568 -208553 -139097 -29320 -47049 27226 -312187 70666 11161
21154 180613 50862 114542 180551 -30798 -123846 108727 -89638 133968 74480 237829 393438
21143 393438 -195829 162480 95329 11580 -65352 130830 -3574 75674 -176324 148589 187059
21132 187059 -238873 345279 61344 13363 -204837 -342289 110503 312723 -38210 87731
21121 -117749 1465 -25166 -138659 -193195 41732 -178944 239989 -334244 325120 133807
21110 93866 -261798 -3464 -177088 294223 -538747 -114901 -182634 -169345 206685 14445 216610
21099 216610 -213319 50440 -3702 223557 -78113 326544 19785 -242149 42595 -203661 -148562
21088 -148562 218283 -113260 -84363 -74538 104247 -143900 187567 -133927 -423635 -82978
21077 -164524 -240375 53334 -313886 -69349 -128873 -52575 -63684 3823 -38198 180253 -178990
21065 -65834 -353569 -136022 93679 133670 -151489 -248864 -462235 -195269 -48815 76221 -93819
21053 76251 77177 31980 -16773 -189350 36438 42889 -9051 100448 -18431 -49206 -19499 117017
21040 -93532 112158 14404 -167241 -261375 -141800 -293682 -243245 198728 -109210 -68300
21030 -68300 156585 89158 -341348 -246118 -60906 136304 175485 -126677 49451 -418922 -44330
21018 -264091 -154482 -245272 123365 132790 55839 59778 -224830 -11175 105244 -64113 -8796
21006 207219 16776 -16681 -50535 -101521 148681 -116931 64700 -51056 -234292 -237903 -120420
20995 -120420 -161197 166565 -60753 116720 330577 -249208 -168115 4210 -22175 -72515 11068
20983 215555 -139758 -174974 118519 -277334 -227783 264670 -88204 -73437 -254545 -109710
20972 140543 256660 -385438 -378730 143952 -8671 -198600 46359 -212628 -107548 82726 -69754
20960 -141297 -35723 20886 -151296 -219689 -24899 116690 -215660 -366869 27566 -513789
20949 40625 -65567 -21199 -227333 -39565 -128624 -271738 -128422 75789 -338343 350472 -238356
20937 -12011 -15179 148042 -7679 148932 224986 -155877 -352586 -38351 -93616 209450 -136475
20925 86738 89707 -37235 -180695 21071 107483 213879 96109 -383375 50168 15973 -121574
20913 289424 -192672 49527 -257818 -29331 -503 76629 176362 116100 -183023 -106581 134505
20901 -128616 -439770 -100106 -161593 -63353 148769 44992 -271089 -101063 -203265 -213165
20891 -213165 230967 -45076 -1052 118860 -79397 31234 56758 -25710 -150830 142525 -62245
20879 27568 82118 -5666 -340850 -113545 -249330 -69434 -129601 -103648 59545 291821 203634
20868 203634 -120138 14549 -99421 -55417 450783 -84379 -113847 188637 37214 43810 -167767
20856 -131523 -154399 -30576 -71558 212747 -418543 -166185 30167 -229856 121359 -119406
20845 1730 -20365 19061 -161493 -79020 -246700 16981 -246826 30892 241860 -141466 -41062
20833 -321649 -156577 -148236 -110537 -224940 10509 -96997 -364126 51673 277955 -11161 11169
20821 170306 95831 21742 58423 -294994 169876 -87711 -137315 -49953 186404 -165290 322400
20809 -256971 74341 72171 143968 3166 -245162 336366 -29035 62164 16475 41077 140348
20798 140348 -45380 46553 122694 -111672 -252817 -84572 -203114 -16572 -251341 -42973 106006
20786 320347 -248845 229804 -63829 -226071 -80729 90996 -107823 38669 -49590 -54942 -101579
20775 -101579 -65865 -247733 -26276 -77928 -260010 -134436 -105792 -115239 -137376 -377919 -262432
20764 -262432 26824 -53376 62024 -35335 -170399 -96396 11358 78699 -210595 -162182 58367
20752 289602 104865 -10091 -21800 -235181 190750 211026 -157056 51569 -229219 104474
20741 34219 59514 -251136 53921 -2586 -156613 -58825 -44357 54940 -308767 38068 -3634
20729 -168614 282115 -98800 -291481 -11302 -104157 -31876 -15411 56849 -5441 -57394 -327876
20718 -327876 -182920 -55359 -188320 -120654 -212225 47107 -372784 436716 -439772 -52176
20707 -80524 -83586 -185623 66985 -275524 -271272 -127197 -69845 -164638 150497 -89372 -56350
20696 -56350 38665 -438626 228381 19856 -148418 -379535 -35402 21355 -87456 -80881 -37884
20684 -22217 -70188 146031 61863 -506071 31427 127109 -135133 27546 136752 179990 21210
20672 -159824 158045 -9419 -160115 -369014 -5237 284739 242306 97354 66676 -282670 -382655
20661 -382655 -26486 -214076 44790 114921 52197 -283002 -71392 242028 -73380 205918 466364
20650 466364 -33492 -350401 91918 -121362 -33173 -163349 74548 194594 -141989 -46192
20639 17991 -69683 -148837 122597 -52503 -119110 -52215 99235 -211012 6527 -247831 -21159
20627 -243938 -18251 332134 226578 -239449 -200203 -118922 -35188 150152 -209883 167221
20616 -291762 204687 -154837 83092 -277054 50017 166224 -18433 -8979 -57490 -86343 163129
20604 248828 105148 -154057 -70445 -136618 -252246 -4823 367818 -259128 -213069 414024
20593 81126 145027 100839 -104728 -38477 36302 -74775 118899 -138305 -40624 -8733 -1734
20581 -148591 -118611 122000 135656 -11958 -103859 -334006 455009 -54500 -101567 -340366 -410986
20570 -410986 -214973 98485 64275 -12291 -32349 -214501 -75491 68244 -37255 -5533 49794
20558 34718 -348649 37732 -286040 50624 -72453 -436106 -188064 -287130 103839 -63336 129499
20546 33797 -70750 -480329 30959 -195757 -250557 -7374 127308 -176343 -37702 -76505 63879
20534 -200612 -255217 -18908 39933 -191392 -77839 -276281 11552 24338 140669 -233227 178483
20522 -94353 -117561 -28661 139711 -206924 -170386 -281539 -178930 57387 -116412 58255 -308834
20510 16305 -40159 -106511 284032 -370202 -169405 -211729 179425 111342 7889 -127610 -114142
20499 -114142 -206846 75502 -281533 -1632 -155473 -107606 87639 -123150 -202702 -95681 -114748
20488 -114748 -352286 -74034 -281042 -211214 -84365 -171559 102486 -12052 -38624 -215568 -63946
20476 7704 -38850 -182881 136308 158514 -212822 101816 60954 -92856 290143 -150681 -203955
20465 -203955 110405 249832 129079 -55753 125354 -237689 157585 2006 387801 68413
20454 60537 -20251 -51450 -58645 -82317 36097 189657 276861 -56067 -149079 150536 23519
20442 -68615 -45443 -332898 -28457 -21009 52659 -362528 -261260 -58023 -30083 -127024 45344
20430 138409 187277 -77747 -122990 -21412 26128 -273863 115125 -110965 32957 -188198 95303
20418 -228128 -128581 380822 136770 94610 49397 99644 288103 -177580 -136884 -127988 -22758
20406 -133212 -135679 338521 -212417 -411185 -219789 56663 -84100 268232 116885 174528
20396 174528 126555 207441 154986 133985 120125 -112525 -25902 -176609 -105335 -24180 -30051
20385 -30051 -36507 41554 54983 138323 -252682 31276 -176859 142608 -261186 -248388 -172908
20374 -172908 -53933 76314 -54937 -11410 -228125 -338408 -67464 74676 -125601 173994 -155183
20362 -2471 335999 173651 -145207 -69134 -83597 -7845 10252 21383 -157502 -36807 -7256
20350 -64545 7494 -189421 -158077 -241659 -247140 188805 -15080 -203036 -141090 139503 -45079
20338 -60186 -140385 82256 -195408 26260 -62214 249189 -234800 -66393 -6734 -83242 26387
20326 174963 -134695 -134421 25065 -87237 -195090 13032 148140 -58723 -283697 -21057 28785
20314 -146839 73830 377619 -122191 -136865 -281405 -257421 -232542 -80361 -75283 -153846 39128
20302 -349725 85915 -21329 -136301 -52918 -285883 -122072 40264 153232 -18124 144739
20291 -14801 -199120 -223518 -28537 -61290 -108676 151879 45016 147678 -146604 155795 -101883
20279 -291583 -350085 -227306 -240275 -83329 -166303 -218682 431062 125356 11146 180169 -4928
20267 -347441 -136091 -216484 -234872 -209816 12688 -212036 365129 -238595 280693 -171783
20256 -434011 -60806 -83200 -283927 -262224 -218930 86332 67142 36096 -230784 -10901 -163339
20245 -163339 -29437 16969 94543 -31047 211322 -206867 177617 -154231 -2626 22538 132461
20234 132461 156184 401439 -260748 160283 -234976 -33540 48096 -289175 178054 173498
20224 173498 -68152 -176607 -196808 -180053 -225299 21844 -90290 151344 -140849 68200 -169421
20212 -24785 -204630 -232832 -113606 71429 -50018 -159373 164983 -43551 86149 -92164 120892
20200 181623 -10353 -285967 93212 106858 -23294 -140826 -39425 -223409 -190837 74276 283716
20189 283716 -291986 -171759 -4331 -88890 21614 -304538 363126 -63277 35262 -40561 -65780
20178 -65780 24016 205595 -260409 -115821 38445 -85495 -107836 -125210 8681 -172789 -107661
20167 -107661 -76009 -11426 -141278 -81277 -160483 -159820 59631 89875 320068 -156252 -133931
20156 -133931 -86040 -252479 -142874 52757 -92455 -442396 -152372 -70790 -36124 118728
20145 -108133 131940 -83206 -58704 27363 -263921 18292 165307 -366649 87607 -147738
20134 25404 5315 -72369 394522 -170367 82508 -117553 9637 202036 -52388 -228138 96864
20122 -147191 145554 -71370 48594 22164 -230895 96368 -36636 -90434 23842 166945 198633
20111 198633 141493 -170532 -844 -178785 -93607 192319 -131169 -306209 -62118 -206433 -144897
20100 -144897 -177455 74007 -321193 -100391 216894 -143464 -34558 31215 -3191 -115388 -206488
20089 -206488 -35508 -26977 27171 -54113 -99064 -70560 233729 -116672 -106964 -78030 -46315
20078 -46315 223969 -30007 113703 -18125 15010 -65394 -146067 -139666 -127819 -163199 76848
20066 13466 -460547 -36256 -148406 -39576 68543 67662 -108457 -85881 214324 -275806 -201227
20055 -201227 -261921 -170809 6795 -151324 82110 -188836 178950 -115207 -47446 -181389 34036
20043 -350742 -124164 21285 -158561 -9336 -227779 -392565 -383432 -283569 -136257 -176565 -220016
20032 -220016 -113167 -115851 351263 -205916 -14005 -12050 -75822 -285198 -142400 11792 165631
20021 165631 -145921 234153 106203 -103378 -179784 -43887 -281518 137329 -350315 16262
20010 283198 -51394 -57789 -73123 -4488 -267344 37632 -260349 -40694 -283640 -222077 83174
19998 40565 -361463 -374038 -113313 218244 -471835 -158983 -175242 -90479 46735 -445223
19987 -43752 -112901 -127285 -60304 -187058 64518 -159144 -87305 -258629 -123950 -122393 328982
19975 -46367 52680 -85819 106787 -4588 -282761 -35639 -92059 -42073 213925 64695 128787
19964 128787 -209280 -387571 -59674 215435 -82493 209443 -135142 -7153 74870 143516 372907
19953 372907 66641 299689 109094 -259582 5433 -73232 -212322 -245541 -138409 -179851 -157846
19942 -157846 62239 -29338 23737 -178455 -52792 38282 -190356 123918 -223382 -186573 -37469
19930 -196188 -272785 154760 -58071 -84711 -185725 -51690 165920 -8527 -325183 -321367 -316898
19919 -316898 -97953 -27592 -209071 70926 -14602 -163744 -189156 -286118 264168 129315 -253407
19907 -144548 -12156 35917 214202 65139 -42270 306141 -487016 -99370 -286494 31046 102
19895 49807 -108989 -28165 -71729 -343656 -61298 -17304 46741 -105987 -419071 -141597 54925
19883 -216934 -398736 -141234 -110577 -321819 141293 -305757 -45509 -130496 -232612 11065
19872 -63648 47098 -51697 60124 72100 -2083 172074 -324035 158174 49367 -219368 -72237
19860 308763 108135 -41238 319788 -153575 438678 57345 -111362 -277613 -9300 43839
19849 179943 18092 -208831 -25236 18570 -206024 -42333 108970 396343 21782 -8915 -21986
19838 -21986 -200564 -116515 -189504 -279592 -180068 -263336 -84942 -51873 335571 201486 100974
19827 100974 47807 -165161 -169367 91436 -19591 -103607 -87983 -11754 -289994 -40328 -97597
19816 -97597 -26988 86001 -163729 -138436 -63785 -111519 78609 -22320 -479172 52927 162517
19805 162517 -5915 -68505 285659 75214 85897 -379523 -132135 -125005 -323616 183126 -427586
19793 -110149 -88915 17687 -46370 263722 -6073 -483776 -20547 24415 134206 -74147 -172318
19782 -172318 -53807 -147090 110046 55416 143424 -16402 186730 88478 270764 -211009 -126049
19771 -126049 60919 -52647 -13770 -279802 -243259 13538 10342 -247297 -112074 -24464 88001
19759 17283 -80344 58848 -38272 -50522 -289424 91559 -41153 -327851 -120430 -243135 82596
19747 35824 126944 -79248 -9519 14825 -24690 210998 -196707 -225491 32897 159618 8543
19735 34363 125 -77207 -47346 -307296 -122962 -93480 241317 56643 -24066 -37633 -217337
19724 -217337 -421740 -42992 -91025 160572 95081 40010 77781 11297 -131193 -74099 -336828
19713 -336828 -17823 48196 -366479 193738 -195184 -144872 -185285 -47636 -208950 -54441 71093
19701 -290261 227960 -15564 158868 209988 -57670 -6111 -387542 -325954 -18739 138249 -194082
19689 25113 -171675 55206 38729 -5325 -102014 32673 82232 172195 75330 101563 150136 -212155
19676 -73830 -12592 -365053 -43084 -77433 -54437 -326396 336521 -72619 -10729 116964 -25078
19664 108221 167689 -213729 29827 -265509 118757 -46027 -53410 -179987 26544 -75949 101633
19652 -296563 -424614 89658 -6740 -337906 -50094 -407630 173081 -71688 37995 5595 108496
19641 108496 -26828 337269 -40638 76753 -205391 25800 241375 -33263 52690 102088 -139499
19629 -104339 -17854 -90698 48425 13941 -183395 -244074 -108123 128063 -73217 -236806 38819
19617 10224 -30906 -174927 102816 6434 -114142 -61293 -166981 129013 -43071 -140907 -73402
19606 -73402 154349 81966 173816 -160396 100974 -494213 33774 -24949 -40499 197084 -12345
19594 43883 23398 -360448 -227161 -256461 -20993 334260 -60962 -200511 -384719 -398307 -300968
19583 -300968 137842 -280397 -123097 -211852 79551 140423 -164133 -168544 -145827 -293066 -174035
19572 -174035 -108907 -136807 46868 5809 -330639 -216251 7387 160010 -322924 21604 -73730
19560 29495 236744 98478 -276874 5488 58709 -53225 13267 -260229 -72089 165297 -402406
19548 223033 -159524 1275 66106 -59431 91382 -86358 -160342 -232456 -51570 -130354 -229060
19537 -229060 21415 -87359 -201448 4534 -88710 -100236 -294586 31823 103386 -9909 -211972
19526 -211972 -6403 333909 -98192 -138262 137160 38817 -168458 -6160 -157620 -89394 -190751
19515 -190751 -196947 60285 71053 -403900 63895 15885 -289557 597 44630 -28330 -12407 93006
19502 207573 -238128 181889 -194862 -313277 -135581 228444 -157459 34600 -25013 279013
19491 162985 -144039 -162428 -218115 -168019 60238 -43546 -312069 212470 259152 -116599 -15633
19479 -166814 -83620 -189045 89121 175944 299053 77652 8802 -114997 -60055 302455 96422
19467 -152749 -150115 -168399 -224432 -3510 -240481 -110470 -331798 -259031 -173717 -302761 50436
19455 -369796 -68245 -150491 -161134 -114059 -202095 -250776 -123172 184414 146859 -282285 32158
19443 -157761 38610 -316001 131179 -126637 28897 -318202 37351 -115655 201748 72383
19432 -293066 -228912 203542 -80585 232304 100613 -188668 -88803 -131825 35284 11716 -174358
19420 128720 68211 -471770 -107727 -317300 -130964 -32346 50669 220448 -12569 125706
19409 -56105 47061 512165 103284 -365975 -36184 -233492 33405 -122892 66936 -43476 -102501
19398 -102501 70137 90876 -184099 85563 162585 37614 168815 -379723 -55262 70417 -180062
19386 -104865 -44323 -8790 -244556 -390502 -90542 24685 -96396 -189332 140 28682 -79176 179399
19373 186806 -22064 -79550 -180110 -85688 -164872 201537 -131741 222693 -79138 65219 148122
19362 148122 -295991 -68460 72058 125861 -236739 -2313 3716 17138 23940 -41140 117896
19350 -82263 -235970 70760 67158 -22784 113163 -182746 31161 -48049 117517 -54800 -332628
19339 -332628 -396802 54308 -48292 113137 -26499 227786 -171868 -11243 -35501 -252146 -152742
19328 -152742 79875 -30236 46202 -114835 76677 93038 6762 -12768 143071 12538 125860
19317 125860 -111444 214786 -70579 7179 -327129 7558 101195 58884 52567 -143056 -147276
19306 -147276 -175051 -27879 -43208 -190996 -6007 -1505 -207570 -236034 -134971 -85073 105802
19294 -280862 -413735 -102399 -49724 -189236 120810 16861 -10508 -108914 -283411 -37912
19283 150894 -149482 -195101 40661 -189400 193152 35027 21862 15918 -201301 26894 -38252
19271 -126017 -46480 -117599 -46417 -335492 211928 56223 -132410 -143137 -341515 13430 138079
19260 138079 158685 -126909 -268111 -260351 -260476 -233938 -179102 -74428 -147750 -10854 14469 -485367
19247 -68143 -199560 35025 -348139 -228039 47819 238449 -17053 -65876 -492488 20667 -29103
19235 -52883 -50126 -119414 -149684 -65805 216373 -53284 34075 191677 -141596 25129 -113337
19223 -63560 92356 -115872 -473469 -114348 -78025 -115648 38592 -91831 -372333 175718 -64952
19211 -109715 -230349 -219463 -26017 184845 -535 4431 295108 217783 106513 -118770 -470620
19200 -470620 152686 -31927 -276832 2041 4744 -170071 -28581 -277154 -51946 69381 -308525
19188 -6904 62071 85669 23395 -65739 17896 17220 -317902 34333 -71864 5353 -152950 -14806
19175 -120819 -294897 -30321 -44782 -47867 21296 -9197 49474 99976 -131792 -235201 -157093
19164 -157093 165702 51305 -189573 -75091 -291517 -33554 136124 -48208 17478 -109617
19153 4091 -273599 37812 -203995 -215544 -242726 236223 -69877 155423 -133307 138189 24781
19141 -121435 -64820 -154951 -114020 -231090 -116658 193346 -298692 15128 -144639 -85571
19131 -85571 -137604 -250487 -64523 -52669 -94292 40675 -77657 170884 -360642 -161594 -119120
19120 -119120 152589 158645 -17687 108489 -106420 49510 175895 -92254 -202199 163882
19109 230956 100837 5778 75069 -49499 -24963 -352813 193273 -305274 -263558 -330627 -34245
19097 -114664 -111473 255658 -277525 10589 -146661 -94694 -249884 -34634 -248200 -233196 -394232
19086 -394232 145705 151223 17193 -175136 -39095 -15940 51863 -20060 -30866 -137407 24710
19074 -181284 -173123 -72796 -119173 -203040 74625 -28276 -198436 -298116 9106 -129979 -27432
19062 -75375 64526 -19654 226241 -78531 257912 299060 134862 5366 116692 -322787 122260
19050 -180511 208497 -172697 -360047 -102038 -188182 -248921 -172278 -258503 -73645 -360832
19040 -360832 -23578 -106069 -202803 -112199 -192070 -167114 -58675 -38362 146593 55101 18930
19028 -141378 -97830 -285662 -103606 30223 258241 504788 19741 295936 -59162 -91138
19018 -91138 -193553 -100391 13 -77957 -142498 -24799 18813 -110764 46878 233887 -49582 -159310
19006 -159310 40577 -265446 -208331 -78406 32789 45272 -61551 11683 -66994 -238991 97798
18994 -1145 243175 -55699 82663 97205 32326 -6669 78760 -366287 -360235 -81805 141570 -145627
18981 -92677 69388 35637 -124143 -23179 -268817 181998 -117918 12183 -104681 203743
18970 -282684 -132633 48508 -170829 111745 18415 -384907 -46612 -37053 54174 10726 -164527
18958 -97086 108034 -295556 -231359 -229785 5995 -96820 -134043 93797 149491 40688 -89049 98990
18945 -410502 40292 131160 87871 49011 -153961 -39388 -405618 -153634 58861 121685 96689
18934 96689 -309360 123796 44438 166495 -375037 96508 -715 -210181 -222139 -9778 -65381
18923 -65381 52092 39637 -150324 -253602 -1850 41842 164052 87697 -235805 -154771 -164604
18912 -164604 -111322 -154496 53071 -59081 -116602 -228990 80273 -608340 136610 170087 51087
18900 218689 -173918 -9818 -224763 -81957 -144158 -98152 -23515 -175166 -206257 -165146 128
18888 -49314 -164248 123851 -155380 47357 -330871 101976 17295 -145286 196527 -258872
18877 -18388 -110934 -477681 -55388 29616 -315001 172 11299 189954 -178339 -101425 101628
18865 51752 -171001 43073 -165269 -212648 4462 242769 -80312 135745 -14534 -8107 143699
18853 -66548 -50420 157708 155188 80269 86275 232399 -218124 -184175 152695 -18881 -67530
18842 -67530 80208 -322709 -136631 -440745 -60821 -69034 -171123 47604 -153726 179116 -151154
18830 -296902 72732 -46699 -232765 53188 113777 -200969 181611 -385893 -34470 248040
18819 190838 160021 312785 -107385 246309 -2884 201083 -37816 -323022 31704 254367
18809 254367 95131 -32866 420794 44136 360207 144436 -221725 -234370 -278430 -63183 20273
18797 -133581 -85627 -78027 51710 -162404 94906 -39514 202315 -72261 -279342 269631 -391457
18785 -150572 70076 -151791 219940 -91974 157729 202004 -399155 -188347 -149724 -119481
18775 -119481 -176617 -73617 -8519 202071 257677 142449 -411914 28566 9029 -299301 -100168
18763 88293 68516 137742 -183922 64834 -248402 -69046 -387802 29955 -62077 -114641 -141089
18752 -141089 -116895 -44002 14542 -290652 -204963 -5968 -59309 -304742 -16186 -185355 -226578
18741 -226578 -247315 -123596 141768 128344 -111252 104065 141804 36848 112074 239762
18731 239762 185400 -216988 71467 127021 -294700 -126545 152104 -235725 131611 -100450
18720 -242813 87964 107214 -89536 -109333 161859 42742 291421 -31424 -223584 -302098 -112825
18708 -156793 -104060 4107 52809 101555 -100394 89842 -92700 -34227 -223721 -192772 -340096
18697 -340096 -68769 -215534 -148693 98749 88665 -208501 252662 146587 187034 -90603 -43120
18685 5886 -196048 -76385 -100655 -144331 -45455 -148524 264907 1443 44205 94177 -232441
18673 -47101 -55606 290774 182724 -153555 -208851 266995 -46076 -62633 -353725 -255143 -261644
18662 -261644 93573 137684 294534 32810 116329 -129395 -288216 22638 25777 -130545 -25138
18650 243558 -251287 -365181 -402842 289097 -69593 -437029 -194133 -306691 -235729 228982
18639 -66188 -183697 -298282 51460 -95311 -57112 -241893 -279552 18374 317251 61626 -266114
18627 -17308 -425780 -379849 22502 -110130 -229711 -106602 -284326 -85695 -296153 -55648
18616 -14971 -489393 -12184 -130271 -323680 -213101 594 -344231 -35927 157877 -195956 -1112
18604 -114073 100266 103629 16893 -83181 230770 -204116 -148894 -101924 47205 -141075 -7769
18592 -217356 62099 -542253 -327627 39896 -53034 123814 203639 -184277 23731 -166972
18581 -169596 228961 -256989 -6587 -46644 171759 -67155 -265436 -81754 201585 18297 47619
18570 47619 129815 -128643 -113627 -376837 -276866 -13646 -122774 127330 321786 -196718
18559 -51498 -134284 -160089 -183342 -188676 -354883 37080 -130489 -71792 -41568 -54225 102004
18547 -112258 -6627 215794 126259 143307 -17910 54339 -130810 -168989 14492 79361 330373
18536 330373 162650 -97917 110836 -219484 -112158 1385 269573 -79012 111595 -171128
18525 55683 146809 66071 -187649 -100216 14454 206542 -202101 -186900 279174 -214477 159100
18513 -376484 -19044 -28228 135763 90671 249771 -154800 78893 203926 90550 44447 -209725
18501 -118818 -207514 -69328 -49855 104819 -63601 -216412 -217410 161894 -321782 107421 176247
18490 176247 -5827 263454 -22279 -143072 168639 -58690 -313749 -30141 311624 -153030
18479 -83811 26818 68175 -245937 -39897 -243369 174210 72325 -26810 -97101 262597 -358300
18467 -159804 -180588 93670 162084 -133575 165103 -65605 75086 143061 -276621 230815 153436
18456 153436 -61314 -20129 198810 -291459 -78930 -5988 -155550 -325013 45492 250063 21629
18444 19660 64954 -326786 -151660 -131042 -401249 -66668 -43387 142147 -319600 405361
18433 -265131 175640 156519 211084 8560 147970 86572 -23917 135321 144546 -174982 -309738
18422 -309738 -293435 -129281 13580 -155252 -169540 11080 -252508 -378952 71346 -53707 38969
18410 -286755 268925 -265035 43436 -168966 84676 43182 323029 10257 -77459 404473
18399 -168829 -52489 27934 -218506 22671 41738 126666 -357013 -163210 220070 -1142 209152
18387 -164041 -84303 8503 95318 -172234 53369 31010 -44873 -66620 174927 -117773 -195384
18376 -195384 19163 -127187 -170643 86247 82809 -236398 65971 -178452 120898 223841 -111210
18364 -262444 32268 -81570 9227 -32790 108078 -65137 -40818 9640 -87365 -34136 -240473
18353 -240473 -59113 119138 31371 -94779 29606 -3393 -25274 -3037 -39202 53630 -186422
18341 63080 -56761 167907 -122557 -86799 -35075 -9642 -182119 50840 -146780 -89313 -159076
18330 -159076 246332 9180 -80104 -102584 -190966 -150431 8918 -65834 -202087 179966 141166
18319 141166 133151 -425496 -21728 -52230 80231 -130836 41493 -200816 -33673 183959 -44374
18307 -237204 159906 228596 -32299 -233003 148058 -83644 -165908 393622 -165461 -157834 -343140
18296 -343140 -126289 -100892 151150 -177578 177319 130780 -126111 -58160 -240804 192174
18285 142491 -112723 -113510 -118055 -242453 19009 -122237 25657 -151198 188001 -99815 343691
18273 -58068 -128130 -131993 -2618 -106699 75653 -117805 -8792 -63987 121019 205297 127166 -61837
18260 -289501 -359755 120494 -137137 -150936 138928 -148267 -58109 -309838 46398 -61305
18249 -41146 -189713 227953 138356 -312477 -21923 15410 -170046 42766 100265 -225994 -21193
18237 -21829 -179275 -27284 105478 191437 231314 -25071 -267328 139339 -181231 181445
18226 -187535 -265524 21746 86154 125996 -186419 -169160 -234030 -271907 94700 -691 -255883
18215 -255883 -12784 -101730 60948 -36127 -32579 74689 148315 -113964 183151 255085 -304841
18203 85295 88384 -150099 9188 227329 23345 89324 -1642 -199677 121357 -3651 -5745 35646
18190 -183361 -304442 -278107 -307306 -174097 -132267 -278460 24940 55213 395132 180676
18179 -1478 -82483 51608 -40787 -185218 -224860 -53337 155522 -228696 -300564 -59212 75407
18167 -174781 -69115 84665 -98701 -19703 129861 -233800 -223611 99447 -333276 50131 -226854
18155 46027 -291058 219732 5261 69355 224855 -66347 124403 -26706 -197067 -155745 -227798
18144 -227798 54165 -65918 113846 84965 99137 -73652 -168320 -241634 44666 -164439 -42260
18132 -283288 64226 -101302 46321 150616 -117044 83198 -143256 -31979 -223781 -424144
18122 -424144 -22449 115323 -206769 -204494 -94129 77926 56251 7994 34585 -172264 -152198
18111 -152198 71804 186613 -225055 81538 126146 -44947 -28472 104735 227361 29589 -106919
18099 -52106 -49938 4729 -180241 198647 -139055 -277928 -176961 404710 95839 -233871 38520
18087 60611 94742 -206430 -277950 205541 -70334 276898 48168 11726 -350428 207983 -132731
18075 -273857 134060 -263976 289987 33698 -105135 105857 143023 101719 -100264 139018
18064 20368 -18116 -441443 -363719 73468 194517 6083 -127690 -211113 98103 106449 29650
18052 -2192 -84275 -85533 91414 -151406 128561 -379662 -15852 221359 -420238 -73199 30021
18040 -272339 -139429 -107901 24668 49228 -72393 -90219 48017 -13337 303851 78214 -85293
18028 -402780 -24847 -347989 -122152 -369043 -169112 54053 137689 -38485 -110539 90389 72601
18017 72601 5835 -64688 -236770 33040 48015 -104172 332621 68927 91353 -311968 -247925
18006 -247925 -232724 -39741 -49009 -83282 126186 -30239 -231239 130630 104391 -244831 161232
17994 212677 -173967 -271876 -85868 -78085 -127319 155977 263934 -75172 -52065 123017 66232
17983 66232 -142981 119252 196888 268055 -253314 102204 -336861 46992 59049 -165055
17972 118127 -168556 6282 136442 65043 1506 -84201 138094 110250 -75935 -61293 217011
17960 -9888 -269866 95432 -241448 26864 28871 29836 51305 -119068 -31237 -81044 41807 -23661
17947 283245 -160750 -138133 60698 5813 20922 199890 -70454 -162347 368240 -379858 -127966
17935 116235 -194652 -25097 61309 73558 -103700 -28891 -138555 143500 -244979 -26842
17924 122671 125586 -68880 90590 -143614 79198 -193537 -39600 -184295 -58315 93118 40986
17912 34520 -109941 -10276 -223850 359395 -45845 48668 64187 -199296 -424667 -112547
17901 19080 -174400 58857 -75569 -18265 186789 -8241 -173268 28620 61729 156896 86088
17890 86088 62624 -153528 309407 -66797 84728 -85909 -193166 -146372 -164172 37916 -34163
17878 43318 4183 -203409 157539 -59542 201262 -55111 32182 -38169 16205 -26000 -204703
17867 -204703 -3299 -338136 -117668 60080 53495 -93327 -183173 -104711 -102607 39362 -18533 270897
17854 93866 -82024 -95131 -61869 46708 14010 305187 422416 -94024 -171255 -86598 99043
17842 -152829 -136665 -117625 161604 -198466 262 29770 -12635 -63635 200785 151072 91209
17831 91209 -391093 159602 -158197 189537 -36242 -374891 -78707 28069 152512 -40529
17820 199769 75594 -80203 -66930 -259879 234504 -115349 -196072 -63407 -164118 -188223 -215538
17809 -215538 -144802 -110662 119772 -213113 -97747 142670 -119736 -52736 -30576 -259827
17799 -259827 139841 -129458 11617 -27972 190682 -540873 191192 -121585 153958 -194932
17788 -158154 -25149 -11001 171936 -35822 80601 -147165 -17710 -86758 27846 33727 84534
17777 84534 -100168 106408 -100650 1128 216524 27902 65197 -71736 389109 -106315 -254572
17766 -254572 348624 -218467 -277731 -139967 63066 -50798 142313 92175 251854 80419
17755 -152829 163859 96333 13454 87149 -247093 -49305 195109 -132664 -145462 48896 39374
17744 39374 -99584 -81999 175336 -34272 -145329 -189401 -339407 -297980 -33778 91385 -8269
17732 113731 -178954 60637 272730 -249634 243204 -206410 -23376 51125 -160686 -295405
17722 -295405 -19839 21381 50627 -118863 -18493 515912 48461 -74889 18213 -288300 -188896
17711 -188896 128933 258060 120089 -262737 125918 -147174 -133283 18606 -304763 -231163
17701 -231163 -111774 275288 99120 -204498 128791 18614 171679 96839 97166 229983 -20601
17689 560612 -102912 -173856 131774 -105473 142848 -83692 -258611 -52978 -1604 -59746 99332
17677 72445 -324811 89844 -170513 307868 158605 -65649 -178898 34924 213474 47718
17666 -256717 321233 256562 22170 85045 91350 -13397 -256073 -53564 5332 -41510 -192776
17655 -192776 -71079 -12206 130617 182582 -268072 151199 -17762 -79137 48243 -386337 66103
17643 176244 84913 38854 -1347 -203975 -11003 -346762 83432 -121352 26564 -116846 -86699
17632 -86699 -122171 -232591 -169009 94935 60848 136527 -42328 -163766 -115531 -9119 -39450
17621 -39450 54818 -15873 96987 -214848 181128 -193441 -71702 50578 -300751 150429 231989
17610 231989 -37479 -111423 66055 -109298 166722 159901 173265 270889 141331 24266 225753
17599 225753 58839 91629 99605 31350 237941 206559 244921 54473 3415 61056 -6212 -253217
17587 -253217 233741 -323030 419205 82003 80442 181402 -72461 -43584 -135102 281848 115837
17575 42768 122045 -114130 -40606 63641 -5826 -63565 -216721 -148614 219100 -87757 -103280
17564 -103280 42780 251374 -72887 119551 93858 -151414 193494 93854 -137697 -113653
17554 -113653 64432 202342 -58754 353388 -110212 175238 31355 88046 98281 80173 -31701
17542 60732 204491 -12259 -122657 237315 67830 -150245 99782 205072 -106400 127875
17531 70948 215895 -210401 -234870 -31698 29717 -38342 -69841 179520 68040 247990 27591
17519 -153451 212498 -139335 240091 36150 10133 139121 -68848 118610 33578 -204705
17508 386505 -10586 -289882 47073 -152796 252230 177302 198150 344950 -114318 -78951
17498 -78951 -56322 56685 240342 17833 88402 -14963 273242 241578 300840 -87139 -55273
17487 -55273 -64418 72075 15304 545 -256395 305775 162564 -43418 -141887 -146921 -19030 -38529
17475 -38529 217345 115695 245606 150323 -101665 178803 201813 -13170 -72012 175154
17464 97087 150561 -186282 75490 -55429 155092 112775 -20616 161149 166210 -66176 133172
17452 650270 240129 172164 261044 155814 109852 170712 230917 96154 418719 334242 309663
17441 309663 55730 -138813 267905 272746 336096 291767 406588 -89071 319864 -75157 296623
17429 -17815 118335 85021 244340 354668 -116131 292392 260822 -83588 11739 43430 70854
17418 70854 461464 244643 358886 -69713 408864 518835 235325 271500 449394 90702
17407 61522 33708 154406 201280 71630 39280 308237 -93364 145108 119248 80389 131538
17396 131538 249598 -20182 -47086 302468 -172732 -1213 375444 -40988 348929 142444
17385 70306 153248 91484 153915 52747 -58585 76246 38949 -1017 -14142 328150 156768
17373 -25622 212208 50733 97855 346368 96916 2170 -87515 84205 49450 -27611 62450
17361 206399 -64942 293601 143293 100938 172626 84362 193837 125017 232990 -178896
17350 162063 232459 216190 226866 107148 -114450 -107854 -331129 76371 -28245 230402 238439
17339 238439 -43369 165389 -194211 105366 281573 -31667 397589 265792 156318 -175558
17328 5971 -68594 -143199 296544 97525 262117 347173 157547 140577 21774 120186 208743
17317 208743 61095 182797 264774 60941 51545 -134974 -5666 -119682 149396 244317 -33581
17305 17882 305420 207885 99933 -29644 355230 -41083 382358 251569 3349 -279792 -112084
17293 141687 -77581 -25779 244646 213122 -108589 341461 79378 143677 296518 122683
17282 123923 118201 232286 -106840 -143567 -10269 276815 405269 75406 360144 152396
17271 -119109 316548 37838 239868 -43607 269603 125885 150419 56805 -209183 51545
17260 271093 111321 229548 200566 334950 35251 275463 78065 397858 41354 3482 -49970
17248 284336 24161 -173172 399155 159504 106602 -338114 104809 140687 400743 41556
17237 20443 154360 167870 310599 221638 277375 -34667 19365 69301 50415 18842 40804
17226 40804 443876 215541 236406 42158 141628 -39680 -226630 186577 217125 60156 109982
17215 109982 -80226 3450 151887 286443 158883 -300916 243353 246795 248836 6202 319731
17204 319731 220462 99781 -33601 96804 286074 160759 263267 34349 21679 188491 18466
17192 189929 345551 143559 18815 258441 116597 482390 191571 152372 161419 222868
17182 222868 277111 -31738 131633 108448 278341 14742 137568 218911 80058 374588 49974
17170 168039 165237 368395 476078 219462 480321 229895 379108 283327 283876 32140 214946
17159 214946 215049 192713 345149 166877 294476 401881 251986 103810 615078 206286
17148 521758 413864 -82786 193760 89205 399964 -141846 335736 480865 205474 645182
17138 645182 126207 372155 445735 414628 92106 84104 275430 222347 260908 271380 86573
17126 117913 222592 168226 320149 245334 426283 371831 269943 434442 149474 164814
17116 164814 264148 316098 443345 393156 321814 -92513 179194 118901 221526 359914 405556
17105 405556 404361 345861 661120 627839 444078 226098 291951 63064 150971 247983 190837
17094 190837 498458 136286 225077 57472 378756 761305 487977 54740 472343 676193
17084 676193 252812 762478 311939 292401 299175 404886 265805 292565 196258 540253
17074 540253 540375 553146 581746 366936 427002 512798 506495 727460 337895 177634 422102
17063 422102 318385 557029 384270 369975 524215 464941 579244 356147 634505 485954
17053 485954 284101 468990 540398 365919 454644 259807 238978 410987 589978 598943
17043 598943 692463 410597 494294 514487 606866 295222 467297 479486 373827 606638
17033 606638 253370 422189 374032 328689 624682 539409 481145 399692 421163 734965 491730
17022 491730 826281 591127 332735 651292 591653 472887 454944 518973 705432 472331
17012 472331 443102 716786 490357 715137 570321 495469 503641 557309 569004 702597 638785
17001 638785 665746 727822 642309 540395 591538 682988 628395 721828 729235 692083 850283
16990 850283 880064 748717 804156 654903 745401 620573 631051 638164 895464 479556 665761
16979 665761 886047 729967 805611 579271 684806 886302 562170 574772 848833 995129
16969 995129 768762 764796 868785 564353 874481 667774 641452 822202 903298 690197
16959 690197 1019504 688233 1144477 851177 1270726 859528 1188119 780880 716139 891298
16949 891298 983632 948838 750372 1130323 999475 888277 1213876 951238 1286883 969573
16939 969573 1078035 1207842 1095676 1311315 927955 1330148 1395280 1150752 1266153 931513
16929 931513 1131670 1147884 1022886 1161863 1123212 1045466 1264203 1173879 1267139 1274345 1337858
16918 1337858 1326440 1400904 1464834 1535909 1358786 1192964 1313929 1117305 1234497 1470228
16908 1470228 1315194 1365237 1396651 1235948 1501111 1393105 1393565 1018195 1646879 1620214
16898 1620214 1745333 1542208 1384730 1748181 1692113 1786953 1422272 1633336 1930412 1802973
16888 1802973 1864119 1799094 2030070 1819341 1841271 2093058 1996875 1883540 2179152 2164858
16878 2164858 2038877 1944663 1948784 1817650 1864820 2321604 2146886 1815418 2060309 2295728
16868 2295728 2051103 2223631 2249416 2311747 2186742 2437546 2474703 2277341 2719796 2767711
16858 2767711 2798841 3017616 2734163 2766854 2795685 1963217 2745871 2743919 3177259 2860386
16848 2860386 2977833 2904676 3157155 3220334 3143230 3442376 3249613 3315558 3290495 3590802
16838 3590802 3501144 3671713 3667016 3700225 3314024 3596424 3679780 3969634 3941656 4209335
16828 4209335 4132660 4374667 4340207 4430462 4623296 4661476 4886540 4675321 4825312 4973508
16818 4973508 4800781 5167745 5449517 5263148 5350743 5442491 6048076 5813705 5705333 6288555
16808 6288555 5817365 6114496 6529207 6490694 6706464 7003741 6855749 7308361 6849467 7663837
16798 7663837 7508007 7948231 8143542 8457533 8667771 8803976 8938066 9177850 9281930
16789 9281930 9489102 9799966 10238522 10450157 10281030 11102505 11224331 11877155 11733381
16780 11733381 12264817 12677498 13381001 13675972 14065059 14396779 14936267 15422985 15917964
16771 15917964 16234138 17394743 17353833 18097693 18516342 19579188 20392475 20838748 21625191
16762 21625191 22666276 23643267 24634049 25465310 26181551 27338315 28799127 29924634 31440986
16753 31440986 32703574 34397998 36074271 37695760 39545321 41466097 43562035 45439214
16745 45439214 47828275 50663130 53191738 56244122 58982093 62184944 65670889 69427678
16737 69427678 73113031 77412508 82085419 86428990 91529683 96767069 102181326 107627256
16729 107627256 113631481 119336462 124954780 131114131 136684017 142176910 147199370 151470857
16721 151470857 155858721 159006927 161508659 162749833 163347053 162738284 161168080 158496907
16713 158496907 155242568 151095372 146216418 140983839 135207356 129461252 123549571 117530614
16705 117530614 111543136 105813277 99922777 94424973 88971631 84297068 79419072 75147369
16697 75147369 70975659 67105804 63393846 59853522 56788389 53495160 50885387 47915610
16689 47915610 45891476 43403422 41395573 39050490 37303757 35290816 34009863 32525748
16681 32525748 30834501 29371550 28096973 27178565 26221109 24854194 23726155 22766627
16673 22766627 22071262 21167650 20493721 19306829 18790891 17948892 17227782 16932935 16062597
16664 16062597 15607513 15084063 14656055 14085492 13757098 13565174 12578821 12186454 11968072
16655 11968072 11535902 11273044 10994258 10802812 10308822 9987773 9804225 9701437 9141306
16646 9141306 9040605 8864955 8467379 8709185 8188803 8045990 7624318 7456239 7315673
16637 7315673 7322974 6958668 6780383 6550787 6498133 6047032 6196151 6256012 6073513 6011677
16627 6011677 5679278 5598754 5466432 5466637 5033775 5223648 4972548 4792206 4780482 4718765
16617 4718765 4567889 4419164 4377040 4276197 4156931 4099391 4306522 3578457 3902177 3785188
16607 3785188 3633095 3498966 3814788 3240521 3350474 3289975 3403291 3253948 3045219 3066187
16597 3066187 3138802 3234717 2914485 3077058 2791492 2778992 2933888 2711926 2977100 3001602
16587 3001602 2663421 2822127 2659838 2350186 2636678 2377475 2103619 2570823 2136755
16578 2136755 2508545 2182630 2320584 2210105 2035940 1846255 2015841 2140393 2280857
16569 2280857 1785124 1888764 2104082 1908078 2139665 1824011 2019706 1972057 1683649 1870555
16559 1870555 1827686 1578974 1468125 1936440 1947981 1810797 1605246 1709436 1522641 1402096
16549 1402096 1188240 1582332 1923774 1365736 1376634 1648643 1309603 1278169 1326884 1317635
16539 1317635 1423304 1147907 1612684 1393020 1288646 1377622 1350255 1347810 1175733 919477
16529 919477 1368320 1312475 1254438 1285969 985674 1077442 1125622 1158195 1332684 1208856 1006117
16518 1006117 1166198 1106547 882417 955274 889986 1072202 893636 909356 977620 910387
16508 910387 880392 580811 690516 821644 674800 1287463 655161 960166 833262 817303
16498 817303 924729 863522 893622 691808 1020444 653818 569410 896130 1043342 798618
16488 798618 422550 985820 909646 783779 640032 658908 972292 534179 610882 1061036
16478 1061036 704018 628159 643623 634530 482759 460366 577104 594193 481433 392365 690071
16467 690071 645154 690355 839091 656170 814442 789763 661783 453362 630421 663422
16457 663422 772634 506415 564316 772787 637573 449859 437106 440265 682342 599316
16447 599316 518963 533745 747162 408399 428985 544676 127728 354889 618318 501500
16437 501500 330964 652894 550869 387425 242589 777959 383997 526590 481879 691788
16427 691788 371197 401904 406943 525450 381570 468330 457647 488216 239430 453834 287966
16416 287966 249561 794522 572618 345010 582453 183150 418547 391859 371291 343378
16406 343378 186373 610219 583487 471787 471866 460573 137981 427388 419520 376318 95887
16394 383883 481923 455715 367240 117459 206649 154571 471898 372771 13275 126361 226183
16383 226183 410874 284930 216492 309072 384530 -85510 535192 384539 352211 226438
16373 226438 584267 463519 222936 326064 159191 423764 359494 -8695 357114 -100670
16362 187766 327065 212851 414572 205515 80171 231225 513254 130411 94068 326250
16352 326250 394452 362635 149732 626216 189115 120057 207726 575741 12525 244881
16342 244881 99082 207324 243923 223632 243246 320050 -35176 -2206 17182 126319 449071
16331 449071 484970 187339 285462 290665 193428 234838 -126339 199680 249354 287736 22870
16319 28554 -11976 291400 -16603 347118 -232243 176682 2730 394125 -194054 409840
16308 -124324 -40804 -307275 -124140 -73067 271263 225821 122419 271089 144046 -74884
16297 326034 347835 164604 118310 338082 -37069 255746 288488 -81438 197074 306559
16287 306559 268401 157093 58926 85816 110417 98109 105646 -21835 214545 259081 -23194
16275 186333 275660 62370 261459 251330 -18800 389577 309167 -63903 101063 337537 129026
16263 159755 150247 99111 195248 177485 59351 -22138 107455 122555 283700 8635 202703
16252 202703 -48039 -208236 61019 126637 462520 43365 105755 -105300 203163 188499 -244491
16240 23047 -1198 -224717 -192726 -53156 -30984 9865 231253 265102 247609 244117 252429 110742
16227 86240 -239918 -253491 142266 483492 409924 -392247 46466 347525 38024 271293
16217 271293 194181 -141321 283783 46530 174162 46215 75518 -88574 61885 -148234 60318
16205 -106906 278061 90284 -132739 122069 297286 109308 79647 45293 161147 -8290
16194 56182 -26132 -112620 -127737 -181633 -138904 -46621 379390 442293 -136246 65697 35846
16183 35846 272334 278573 13036 47570 93648 252482 -39259 143644 106416 -5386 -96717
16172 -96717 339299 -18193 159674 110250 -311782 58233 259694 -122846 -158412 -187731 -269122
16161 -269122 -147575 149055 205152 -35601 -30395 -250375 59186 319120 -28734 324888 395145
16150 395145 -164983 62875 -146944 -216605 124253 -8176 453270 -42484 365378 -34992 126441
16138 -244922 17834 286499 445118 232827 -26403 121182 166010 -238628 70229 259 203872
16127 203872 -11113 415462 189512 43126 -20259 -166122 45693 88254 -85621 -221055 -61441
16115 -127328 40640 31198 -171058 174564 -8063 78245 89725 188337 226430 108458 -216571
16103 123424 -394488 126936 288811 327307 186111 201760 -201501 354480 50762 28777
16093 28777 -388884 9104 238564 2611 -89401 169525 155949 305850 -184237 -72659 -21896
16081 -94116 134581 52260 35336 -36421 25916 -124469 -48878 -170204 221606 163630 -101418
16069 -92470 63500 -5647 162564 -129005 -38564 -2258 160222 43218 31686 182596 13329
16057 92327 -24499 -256669 -129795 -157267 11035 -58806 51939 -211700 180315 -207415 96871
16045 187533 -288060 372461 -179767 -141402 -26669 -204011 -212164 -177488 -164069 95305 80801
16034 80801 100857 206181 2471 190505 175586 -115751 -167857 -236677 53974 182133 11308
16022 -173962 250177 -14890 29457 163755 18802 -130403 298 -5535 232628 21851 -14316
16010 -128494 -112767 309326 68857 157057 -197862 -170791 -663 -178314 -32914 -96229 32618
15998 -71631 170946 -8792 278000 -25219 -229303 -15106 6564 199915 21417 72167 73866
15987 73866 -48459 -7231 258650 21324 164293 144898 165660 219365 182575 56102 -77421
15975 -62223 -26781 -17348 -269605 -115589 127624 45396 23918 -160765 239162 -67219 -146082
15964 -146082 -183772 422416 -5405 213879 33633 -78990 -141111 -408638 -47253 -116484 -109169
15953 -109169 1085 -297869 38103 -88740 -12349 117245 -47883 -71183 -8651 26470 -42897
15941 -82933 -123288 -51815 149214 -112962 -8294 134070 -78707 -106589 10498 124538 -128200
15929 80332 -81891 -156062 -125175 302979 -1273 -128568 -208400 -97034 -48226 -71408 -99402
15918 -99402 -249104 207113 25900 -112460 255356 32457 101083 96865 -174773 -170233 -122317
15907 -122317 10250 -102568 -305016 -250306 -13962 -55001 -26490 -147614 -2189 110926 -52315
15895 -216280 -100276 70670 81848 -125753 65912 -32820 -142098 110736 43318 -377647
15884 100330 139530 -249880 -246748 -114689 135770 106600 266669 499909 45411 44981 -186003
15872 -83002 228820 421564 87915 -309233 -147928 -187759 -7511 4753 80453 -72292 142980
15860 -94348 199707 82410 -80765 -70109 -106554 -139894 160060 -74199 -97763 -189043 13126
15848 -175686 48243 -2182 -98007 8809 -33862 135523 87179 -231879 -302240 -164721 191310
15836 -312300 -211906 -8962 -243824 125775 -28606 -235037 -124591 42273 -173997 67034
15825 493102 -193885 -248366 -184721 99233 -404985 -195377 -337190 -161842 96926 160321
15815 160321 -363207 77119 -224541 43650 -341197 -201947 -162081 -53842 -76891 -116568 -170886
15804 -170886 390531 199899 199940 -53563 -97450 -19185 39886 -312910 -52545 11315 155355
15793 155355 244032 -23018 157257 25071 149717 -51774 57483 -18632 -21627 -57097 -81742
15782 -81742 -5920 -12799 27737 25790 -95009 145799 -187323 -61 -12369 -241576 -247780 -364229
15770 -364229 170461 -228131 -227455 193691 -161973 -291811 102745 -150027 -141523 -211806 156067
15758 -269042 -190744 -2660 212081 -120898 9803 304396 271124 20491 -146886 -196671 451093
15746 324701 395186 -198826 -89085 126124 -165612 20375 -48335 26764 123886 21593 42028
15735 42028 -101127 31910 -158003 -247277 68332 -35563 31913 135233 -79901 -5071 -40050
15724 -40050 109362 -114764 235455 -21699 130594 -193055 -35750 -198073 -24636 157431
15713 82957 -10271 247654 -223125 -96862 -192025 -172951 -31277 41580 86487 -17861 -296590
15702 -296590 -121334 58053 30888 40750 232104 -179054 12927 116843 -134414 -41291 8470
15690 -32814 -8294 162174 -75144 -120744 224396 29223 -184224 -49397 -294862 -114345 -210546
15679 -210546 -99904 -28432 372842 -26081 -198075 -226962 288702 95430 290081 147908
15669 147908 90962 -244119 -3519 105140 368420 24544 -9521 40255 -86487 -30502 -47251
15658 -47251 132732 130934 -80848 -284375 169675 -4870 -49864 32483 94364 56335 -42020
15646 -120494 95685 -157157 -140498 -92814 -249370 -33904 -161987 -26331 -256224 -18969 -1596
15634 -171353 -190376 -166025 -111821 -9927 -250813 10352 -69137 -154966 114273 170540 61767
15622 -126632 159529 107887 98348 -88720 72173 -180981 93707 -98669 -238236 3615 -252383
15610 -98124 113102 -261478 105626 -230716 34781 -261514 -11514 -58425 -55906 -23905 -413441
15599 -413441 -117547 131585 -92760 51569 69003 42977 -471854 -3319 92274 -271979 -151040
15588 -151040 42862 163089 -31854 51785 244612 -13627 221402 -104030 143957 -138140
15577 -19103 -289563 1577 -73566 -45783 -85811 -96239 -132334 -80054 -414 264956 -39372 -193481
15565 -193481 44418 114819 -157236 66323 16292 -45888 167643 18937 41280 -56013 -203832
15554 -203832 -82432 -159416 -16822 -139577 16557 -283152 -143597 53914 -97316 32995 180606
15543 180606 33426 214311 184835 -170833 71473 -46789 -117076 -110180 -76900 8528 -155731
15531 115699 73366 -279638 -25648 -905 229797 67483 -433913 -228856 84849 -218638 -108456
15519 14001 351879 -129902 -147002 203782 129277 199248 180885 141497 -110380 -37267 66088
15507 98093 -80052 120071 27158 -124097 -12264 78110 -72590 -46193 27737 89917 -133715
15495 147615 -259630 40528 235703 120480 142648 -368022 5616 -226413 249712 171780
15485 171780 66330 -33055 315558 -116943 -98287 -151736 385372 -98156 220291 -58702 22220
15473 -296989 89212 59250 152632 110521 25223 264133 -55259 -139412 -84651 -34882 -11883
15461 122414 2384 -58851 233350 -206767 226501 125810 207855 -65553 -164132 -113563 -242678
15450 -242678 -50664 114037 102536 214233 -72585 222667 -62554 66229 -143717 -239073 -25996
15438 -349969 -222368 751 40408 54467 -349102 158916 -55612 94397 -144429 12402 -192422
15426 81580 -52985 -242270 -42217 225539 29218 -50654 -239452 174166 114869 -156545 11207
15414 -310062 -243905 69596 -46713 -319214 -261140 -151265 52804 40994 86043 238139 115208
15402 -22257 243063 43016 -48882 83893 -3196 90547 -106663 74547 -100800 -86136 43624
15390 -141274 156602 -36155 80982 143226 -113329 -318068 -278419 81353 15198 -82436 112682
15378 -87875 -231447 -25426 246241 -40938 207905 -93399 191436 -33956 -126033 -88330 -262650
15367 -262650 223292 -239897 -154402 -59415 16885 -33691 -56765 -115460 -51724 -62234 144846
15355 68747 128847 -27401 99769 61832 15151 67042 -193862 -83330 75321 -64724 67275
15343 -142067 -88508 -259511 -124151 -81979 35445 -6192 70613 -137714 155664 60488 -7648
15331 -110617 70909 116018 131462 -217361 -209 73326 -313751 -29395 40460 72416 215070
15320 215070 -218242 -287794 105715 20670 -350973 -23782 70996 90199 100842 379653 -162537
15308 54845 125946 59000 -299026 199776 -234965 53861 44761 19671 273166 74806 -347
15296 -37795 79656 -97075 138515 -163449 -8570 -7659 -378733 -66768 -165699 65864 -59253 -51139
15284 -51139 -31878 -15638 63170 -9384 -27515 83019 328969 -101812 -112691 203928 122593
15273 122593 219648 -284984 -69394 332554 88084 -30924 -86270 -115449 -40386 78486 10235
15261 -148646 237900 397643 241475 274590 129668 14165 -15029 -21528 123285 130535 -99639
15249 457836 301506 1000769 1583488 979949 1156253 1009534 463577 238099 418256 -255074
15238 40879 -296755 25292 114984 189091 80523 -307890 164915 462813 158023 469556
15228 469556 36367 53482 -19806 31800 -40175 -162572 342058 57417 -37590 196022 152181
15217 152181 48016 83810 -60278 204360 -156733 206472 -53159 -119223 5674 232368 -110233
15205 -134707 -25338 75809 -91273 141971 -330983 -83199 203731 -83013 402623 -153396
15194 -25 172203 -9607 121423 -32200 10122 168473 52406 53209 222938 25832 183297 -72809
15181 36828 57276 270365 66413 34035 347141 89284 -19948 183869 -90757 -105847 -85185
15170 -85185 -244678 269448 99695 388500 187560 67005 149844 -168874 106750 105325 57465
15159 57465 187098 -37270 90843 -82064 -91046 -115689 164014 116169 -202410 380825 321918
15148 321918 -3487 43555 -29034 -69163 472927 275566 28393 -81041 -61109 333722 -38978
15136 179037 7098 -88575 -24661 -21072 -55372 188578 98299 -68270 278330 11442 -96897
15124 84453 -88672 242744 76317 205761 466346 167510 173417 3821 146563 120789 -115866
15112 10673 -156862 160149 90064 -1495 335617 -31399 518174 -174056 -51159 100620 -41364
15100 -81496 100802 356081 -107387 -70370 -12680 22683 309337 245215 -299517 18532 230546
15089 230546 93727 219272 184390 -110353 368666 101369 161433 85951 52544 82479 294370
15078 294370 -42238 196654 -79425 168744 341019 -17210 -9730 17626 182979 -376886 15123
15066 202604 -47505 170340 -178844 144881 -159244 15021 -129034 5133 -14039 -2069 44048
15054 182084 216023 -39458 152277 -245001 -175606 -187587 -15308 104543 164449 253935 76346
15042 -53760 -102090 74597 138342 254766 -147734 172385 151361 187661 -15302 223103 240889
15031 240889 257983 194375 380830 160011 212043 -51220 152685 346345 434718 -7130 395928
15019 551359 -11316 183569 213053 200355 49942 385129 120030 70612 214605 12572 -70688
15007 167417 235448 421328 437387 70021 275369 179298 85814 47822 -130282 409605 6573
14995 120185 117643 237311 69606 323505 384960 34174 291903 100632 13508 165518 -187432
14983 -66201 176801 374230 307221 339497 133547 172668 306760 73166 40666 -19244 184259
14971 179695 87371 529478 140376 141913 86791 53515 38901 440828 144003 -180759 153117
14959 -31803 19721 79396 -248334 161848 -35749 266923 280484 203652 50726 176956 454223
14948 454223 394869 52 228679 51630 6733 -126218 340015 113971 317073 -42502 -141863
14937 -141863 153151 302682 269429 207213 160516 537426 416688 -82777 202243 325380
14927 325380 544736 40213 134146 58502 253867 299646 88969 306723 455324 105488
14916 40224 325859 -93287 95229 56724 584241 328339 510941 354469 99835 327383
14906 327383 267761 226724 137414 74586 165642 339024 444220 257468 245322 289440 230623
14895 230623 136756 135996 347624 213594 158319 188392 218919 450051 312695 302236 241841
14884 241841 378929 330604 284154 451993 519799 467816 212804 220760 -126818 472468 613128
14873 613128 581278 153623 318333 387205 189845 286750 79693 392056 486881 252288
14863 252288 540967 532841 203426 451166 303590 277260 680482 169172 471017 230373
14852 503244 61494 321105 156134 431978 398725 263319 395824 70653 329396 483585
14842 483585 459461 356105 280609 344878 343158 659135 205201 395210 298168 212655 209365
14831 209365 360580 405611 532530 344784 122283 515740 427350 342680 -75787 309915
14820 469449 601712 414225 394229 427028 404687 371437 91336 349315 503457 419358 572788
14809 572788 373200 334670 334588 319454 625360 124389 433299 370884 312861 565276 281375
14797 447072 263144 270910 524987 359329 719009 326898 436303 179650 528802 254702
14786 246621 354557 356268 205227 482842 393542 436393 357561 607700 137165 627522
14776 627522 338128 422578 556983 493556 423340 81728 293133 594776 675305 558012
14766 558012 211863 440275 467811 636776 300712 383591 743221 728555 509378 609688
14756 609688 430588 543466 744238 283588 591022 288139 367216 753545 571508 545151
14746 545151 519858 549869 728816 872369 466261 389361 270424 509082 439354 688769
14736 688769 478640 837729 622934 688733 620015 398278 421017 820449 710564 649846
14726 649846 631700 427464 486643 714639 460051 655072 1094411 754730 897220 760562
14716 760562 684740 596844 504532 919624 693311 834485 594757 578377 932964 566644
14706 566644 840822 858912 616210 562851 509932 788771 496500 529189 545492 1041274
14696 1041274 637324 676505 646251 630452 692605 579595 856942 529664 703196 752145
14686 752145 833750 706410 775469 575938 643559 848998 663934 1014833 803567 843232
14676 843232 964867 383414 832222 641885 821970 903977 1206199 938139 796860 540706
14666 540706 682845 609605 848628 1089109 867519 1006854 625536 592086 1112840 985333
14656 985333 608264 1006403 803291 863920 928918 583627 1103284 1027385 1199663 1090822
14646 1090822 1151594 1045112 1153908 1359178 618307 979758 1063881 960367 1053448 1450308
14636 1450308 953460 883302 1170199 1156869 1229539 1265959 923724 1033518 1094103 1223166
14626 1223166 1330343 1070304 1012732 1037121 1425576 1228724 901754 1000865 1443315 1456638
14616 1456638 1171206 1269374 1227659 1342361 1041926 1189343 1249093 1301057 678724 1457012
14606 1457012 1278183 1702895 1090300 1582136 1403645 1153255 1044130 1423686 1523497 1489947
14596 1489947 1543768 1260177 1408697 1337260 1562727 1418357 1570048 1422339 1430710 1518671
14586 1518671 1380138 1670897 1420669 1627226 1646194 1545254 1533975 1381332 1816164 1625071
14576 1625071 1701484 1405459 1936925 1680173 1975303 1655240 2011959 1972128 1890286 1899658
14566 1899658 2124594 1947393 2138293 1852488 2230662 2131452 1933651 2484664 2200149 2279701
14556 2279701 2611686 2898245 2741644 3364595 3804870 3752915 5066007 6506760 10601098
14547 10601098 20630830 38647848 37930910 16347151 7514763 3527659 2116361 1941797
14539 1941797 1648843 1593991 1322637 1772467 1739539 1352696 1755758 1493525 1975380 1887562
14529 1887562 1861281 1944985 1770449 1844759 1924874 1848889 2028539 1730218 1903677 2142970
14519 2142970 2127770 2064353 2183137 1995871 2118126 2217297 2004415 2281484 2151618 2234223
14509 2234223 2459893 2308573 2288841 2457303 2540641 2275175 2725753 2588799 2631368 2675673
14499 2675673 2672994 2525362 2521739 2297256 2780129 2623149 2651461 2870847 3029485 3225283
14489 3225283 3108781 2897292 2751120 3140101 3009139 2952181 3103129 2799279 3338793 3096260
14479 3096260 3388624 3195165 3092929 3249394 3494853 3406889 3704118 3486335 3350985 3453960
14469 3453960 3617372 3645276 3668219 3692187 3953522 3615680 3863589 3830549 4042354 4089383
14459 4089383 3908591 4147374 4084092 4156611 4353751 4085427 4351828 4371683 4374917 4560631
14449 4560631 4721701 4630030 4707904 4688997 4568089 4620972 5098773 4942527 4992264 5116447
14439 5116447 5184764 5146451 5366607 5169945 5843394 5621289 5826232 5909420 5650724 5821272
14429 5821272 5956541 6275633 5855189 6324669 6308056 6328754 6513883 6503652 6724998 6852716
14419 6852716 6580478 6853140 7136544 7083428 7522422 7075352 7131867 7134566 7529866 7674074
14409 7674074 7661601 8124863 8285912 8309283 8189657 8423872 8704842 8628658 8984516 8967359
14399 8967359 9133057 9412913 9589854 9613530 10008145 9972054 9974309 10517179 10688706 10591959
14389 10591959 10620311 10922191 11674565 11404308 11671556 11751344 12211826 12229672 12483909 12486870
14379 12486870 12596352 13067298 13339744 13845005 13869889 14304663 14481837 14642483 14879848
14370 14879848 15479221 15588228 15921836 16250488 16880980 16965232 17501008 17484080 18283162 18243378
14360 18243378 18939188 19059957 19764625 20434526 20622191 20928235 21609401 22106300 22812885
14351 22812885 23047710 24027076 24544762 25094190 25755501 26130132 26750928 27703655 28219365
14342 28219365 28957525 30066044 31269711 31333369 32316741 32940226 34383146 35286521 36412114
14333 36412114 37810259 38559270 39891780 41280657 42274358 43922234 45184965 46817142
14325 46817142 48398202 49980020 51396136 53324376 55111379 57219498 59356592 61427113
14317 61427113 63711456 66334392 68968995 71411196 74870138 77653000 80593375 84145949
14309 84145949 87769189 91608226 95459660 99694176 104158094 108975184 113688064 119220003
14301 119220003 124941697 131261224 137581839 144464162 151884255 159340549 167556189 176207552
14293 176207552 185144586 194265521 204419316 215020787 225838278 237182371 249446102
14286 249446102 261927679 274798505 287996190 301041368 314665822 328575691 341694182
14279 341694182 354844173 367089090 378993345 389602961 399152175 406949499 412295151
14272 412295151 413945279 414008325 412404432 411088171 409969192 405908785 399260635 390244791
14264 390244791 379495965 367294329 354031525 340281874 326133408 311850826 297661295
14257 297661295 283400743 269499098 256234357 244300928 232037782 220650292 209308574
14250 209308574 198806994 188838573 179345209 170409799 161667878 154267537 146779009 139975234
14242 139975234 133228535 126762932 121038361 115669581 110602648 105999593 101104842 96865060
14234 96865060 92477916 88347098 85161688 82273012 78682092 75668041 72471032 69685321
14226 69685321 66920579 64647258 62239956 60108083 57767231 56405599 54097220 52095615
14218 52095615 50450433 48671066 47366416 45787256 44369549 43572915 41802345 40397094
14210 40397094 39325802 38269587 37180747 36634672 35489591 34108788 32680531 32062844
14202 32062844 31358602 30818402 30277964 29204462 28225437 27891460 26859461 25968817 25651817
14193 25651817 25100244 24228461 23900544 23021871 22414211 22113306 21712606 21401896 20565972
14184 20565972 20154605 19577516 19357935 18911870 18341833 18106053 17513024 17374885 17074807
14175 17074807 16534399 16230985 16122774 16106548 15448652 15212940 14614449 14522436 14412295 14154715
14165 14154715 13868015 13529440 12978377 12973154 12482331 13134383 12540034 12318652 12164937 11573226
14155 11573226 11602202 11286622 11281187 11038827 11100448 10356435 10291897 10266278 10127634 9536703
14145 9536703 9701479 9704364 9619520 9115823 9293212 9290073 8738119 8769816 8617139 8541399 8363837
14134 8363837 8356498 8375298 8246025 7923148 7751459 7938044 7594721 7554790 7504516 7159274
14124 7159274 7496918 7206626 7101331 7082647 7132196 6500429 6740408 6752292 6520091 6448361
14114 6448361 6273806 6108722 6168402 6174120 6075833 5773756 5868974 5715036 5952881 5800308
14104 5800308 5690223 5609017 5579904 5618223 5515739 5334957 5360944 5130646 5365498 5374639
14094 5374639 5025227 5262991 4769543 4833023 4955303 4804114 4668528 4711895 4336661 4384608
14084 4384608 4377066 4507894 4578745 4337862 4237520 4097398 4460180 4152615 4159748 4139992
14074 4139992 4190867 4135508 3763166 3795697 3657257 3781606 3429295 3869417 3691253 3315668
14064 3315668 3561452 3981077 3627326 3519494 3703304 3208012 3326377 3658615 3371666
14055 3371666 3540169 3311909 3381666 3154063 3183506 3222983 3204202 3074807 3128611 2920236
14045 2920236 3025040 3265176 2791873 3126327 2873309 2791452 3190919 2813747 3097186 2950732
14035 2950732 2938962 2815429 3089833 2749533 2751710 2667350 2638764 2855418 2684272 2622056
14025 2622056 2940289 2156402 2640235 2604364 2782621 2436491 2469415 2439954 2372656 2193085
14015 2193085 2231635 2116772 2230699 2183639 2132786 2347519 2232805 2247556 2175070 2043311
14005 2043311 2150980 2278605 1913143 1924006 2075453 1971671 2101074 1630045 2106585 1789059
13995 1789059 1862511 1714100 2047409 1668888 1993803 2462200 3311779 6237678 13965005
13986 13965005 32772219 41310987 21087319 10111529 6281018 4562989 4136172 3513647
13978 3513647 3062685 2773764 2434050 2660887 2459618 2392280 2452029 2244221 2320995 2200501
13968 2200501 2246583 1969141 2022018 1956666 1885981 1886422 1935411 1889800 2094793 1489649 1898496
13957 1898496 1878097 1936658 1878789 1894562 1762582 1802799 1729495 1881379 1520674 1774560
13947 1774560 1607710 1775982 1772683 1874216 1540961 1550169 1746125 1527293 1738547 1638808
13937 1638808 1508376 1474914 1309128 1589494 1552773 1575894 1551762 1589248 1742009 1352379
13927 1352379 1623120 1615924 1380009 1503062 1441942 1352618 1395354 1462421 1288825 1334425 1492755
13916 1492755 993801 1396824 1425835 1425406 1317796 1454355 1001846 1518532 1055293 868748
13906 868748 1523866 1451964 1414206 1559011 1317746 1077750 1189746 1335572 930160 1247239
13896 1247239 1198669 780670 1037792 1091790 864025 1325125 1204580 1219682 1020071 948339
13886 948339 974618 1142075 1089699 1313535 1151115 1357459 886683 1183184 1068060 1005140
13876 1005140 890026 1129115 1002467 1113167 1074867 989653 1106903 1057541 983928 1271175
13866 1271175 934263 1012925 889286 1132099 858644 993431 828845 556266 835802 749617
13856 749617 1014562 1032839 1077099 1115931 856499 1043762 923256 755216 841772 747575
13846 747575 885240 1245857 931912 1204610 1067337 899753 756911 479151 963782 716638
13836 716638 631034 751401 952541 1033387 820236 610862 859038 928211 829268 774920
13826 774920 1120003 1051335 702593 839089 728190 1056906 633639 699548 632648 815825
13816 815825 978294 944481 569127 1014710 900029 726598 919549 913820 704699 711277
13806 711277 985208 796292 815585 932655 662697 545963 951596 852796 810941 747509
13796 747509 622280 703243 820906 989538 957365 661337 1017522 776171 637237 678568
13786 678568 456139 808375 671405 551226 512428 554646 372448 837315 938364 804595
13776 804595 1033184 461098 713867 502910 562995 719816 507513 492762 482304 571335
13766 571335 658450 555753 676796 867905 723631 432562 434815 739172 506497 622965
13756 622965 837133 1119574 634075 261733 370125 630707 657437 675532 706325 752495
13746 752495 271674 646310 868371 727917 841857 466640 845953 294501 556203 529654
13736 529654 337279 891774 440678 263154 385337 478023 765277 426722 606504 624245
13726 624245 555454 725938 498974 483105 697353 242751 506278 487185 507142 272422
13716 272422 559500 549876 242025 838923 613587 655042 644003 507909 459889 527544 512998
13705 512998 385035 503985 296384 281626 362979 404345 244495 400404 488124 468105
13695 468105 629974 403837 396785 597669 541588 726083 256664 604310 583860 332264
13685 332264 483296 376633 468508 293109 76780 530332 263851 515601 411897 724281
13675 724281 538669 385715 130071 106381 150335 538268 555687 438436 414953 542462
13665 542462 222214 384320 432971 611962 352408 248095 314855 496091 537754 302722
13655 302722 134046 458164 364194 454684 143303 328895 412410 475529 511965 203723
13644 500002 739404 433062 329438 361790 419378 508148 182183 501531 481703 241831
13634 241831 577096 408307 793715 378683 268894 448231 422768 166538 207344 251656
13624 251656 76637 82620 154173 347468 373990 369098 650079 714986 363343 442747 252609
13613 252609 294271 230372 220586 272259 121927 575934 457082 454906 441291 522012 445190
13602 445190 408881 278240 568718 445329 257250 351561 474571 481495 321403 -5486 283697
13590 432019 239457 345042 662350 259992 435961 233737 264585 187890 173549 642359
13580 642359 121201 224875 252194 580718 395092 323983 345319 190438 407579 431109
13570 431109 303285 102917 113612 343609 531375 365291 376455 363619 268251 203740
13560 203740 111173 424443 247005 186629 -38526 160649 81244 156407 428303 447153 228907
13549 228907 -26768 385523 280313 -74326 377865 480437 277498 64838 463455 353137
13539 353137 310423 195383 117930 362723 408100 290106 91641 570594 397273 -43355
13528 421969 1503 79748 220445 280281 160306 405762 118593 97243 258838 190610 228996
13517 228996 334627 273438 520643 630827 83651 192276 234759 279667 298284 -13872 291144
13505 267842 -38651 96915 -79202 259789 422485 330194 143497 225411 568242 113434
13494 479227 374482 361273 206839 132239 257115 173042 368033 -42118 69582 89990 453424
13483 453424 33504 299151 250851 344102 210265 78567 262982 256381 143903 347395 99695
13471 491961 172271 624154 241708 124128 240916 422583 334785 159700 -7824 325260
13460 389655 209048 -161989 175645 264183 170299 14251 351286 490382 -29166 320463
13449 98420 213234 41238 182702 309711 257338 137297 -177538 10268 110813 432358
13439 432358 121815 219756 328082 -154789 136409 3222 256368 197795 504379 -94966
13428 43149 -260247 213917 99939 201196 261407 376344 229709 100420 511409 51295
13417 325356 307526 -34225 226123 517967 117200 203050 444661 24665 289745 166590
13407 166590 160011 304549 92715 425387 382687 -32106 368880 49941 151319 135521 277640
13396 277640 360697 125654 337427 249007 199448 172501 7552 -87336 199981 355998 -50601
13384 399557 255890 33689 -92684 23391 59186 318758 251254 380146 205239 214316 251715
13373 251715 76723 247460 112061 370258 184055 268031 337474 260339 292387 231610 355903
13362 355903 270613 101221 121009 344591 566931 149563 650474 264373 -18328 358420
13351 371844 76412 372840 349879 316189 203430 243549 254864 142153 504434 325075
13341 325075 219570 433998 575185 267185 99290 438985 465030 57232 -140351 133093
13330 -26996 107399 259968 50167 319673 189269 80321 398099 224138 426812 121053
13319 54624 264698 282941 179307 53956 230380 -15177 102936 170799 182084 160532 251158
13308 251158 -43186 21136 166058 191414 -53045 64160 -50214 -230584 399836 197913 283973
13297 283973 4740 -3729 39514 -144627 406955 35181 189444 32967 206629 -288324 -60768
13285 239106 303056 157341 73117 418857 217403 285806 98333 -107950 -124158 -72683 -53185
13274 -53185 79363 118458 186368 -81928 110976 319035 506349 229030 -125733 284567
13263 238248 270561 92530 14606 369380 294213 400231 105442 4382 152825 -11498 172470
13251 99937 300149 -63938 31133 -77032 81119 -203652 -33483 -89492 -179914 -157789 32271
13239 164343 157379 117830 -26686 84520 -161477 204532 -12881 -30583 182095 93522 147587
13228 147587 254448 75317 259513 -237858 99956 331638 184106 242028 7528 386213
13218 386213 16078 -20670 -98088 7696 124909 277329 11861 49929 522293 174474 25174
13206 -166519 266987 299095 331845 -49401 191075 110437 62375 -26481 293457 3276 121982
13195 121982 376688 -81577 219342 -22908 -22716 -441200 88103 -59708 37616 88475 294820
13184 294820 -42753 78684 541079 -87236 87090 262029 87438 -13748 46522 52437 -65487
13172 6418 -249882 134616 242718 221481 77074 225864 -6346 272833 -15088 109235 -89935
13160 -309169 298673 -151917 -20278 69380 94619 72111 41023 -130809 585128 183082
13149 25341 122838 226348 155496 82607 -61396 185845 29659 272332 68724 202960 355445
13138 355445 324902 -112087 -99874 175750 -150155 447457 98379 65105 366993 461505
13128 461505 127767 62002 278562 182621 -25568 201926 75144 44793 -44454 5925 182794
13117 182794 11235 132271 -171459 -18903 -170951 101159 58528 -86015 146097 -109571
13106 -21731 -57190 186868 -105470 159756 56921 225001 3432 -181913 80562 462832 1449
13094 -191194 173641 207912 261920 7353 314686 -219904 149354 108737 189325 375827 55438
13082 128315 360689 369265 366413 26805 -205831 96316 214676 139700 -50018 298194 -143271
13070 58373 204991 243464 289231 142475 208412 -198236 -256714 276072 -202107 174608
13059 -165897 56510 -157348 161587 185817 175800 185488 297188 -94309 373785 405794 236891
13048 236891 57391 39108 134040 348399 319123 274380 161725 -108839 -19910 139654 -5732
13036 -151328 103168 29753 -106230 2026 -40322 114785 -32022 245750 -43204 75390 -25292
13024 334790 93434 23075 -237368 -26368 344512 204519 17572 -36469 139032 72006 234238
13013 234238 549040 117729 243584 -114978 -167093 144799 150803 125747 365208 37659
13002 443513 -99001 99976 -113245 155716 -76700 -111398 50165 271316 7237 -288282 -59608
12990 307074 100027 -74986 71326 83882 103184 242366 270515 177039 202904 492527 430025
12979 430025 98835 174680 241713 -171687 287698 -366646 -301360 -32049 -134157 53498 208874
12968 208874 90116 -69365 240903 189922 150509 163616 -62709 -65807 25360 75197 -30427
12956 32043 -44687 135145 74981 47712 4316 -241372 209113 -47437 266326 142106 -121156
12944 -136554 163909 17537 43896 -10683 -428505 -99263 218030 7860 -209167 -39887 23262
12932 -74640 80806 -68608 -232299 215883 48763 -61610 -133090 -86862 71948 -86734 107107
12920 -104933 325462 -68576 -21959 -43034 212734 183558 44464 -40445 15507 300579 257280
12909 257280 156523 197546 -151499 146859 15585 140359 220069 111933 -146231 94174
12898 87665 -246148 -63947 218431 -149819 191389 -194651 72223 -83504 114258 -30149
12887 169670 -22283 -66803 84086 55715 41811 121537 194235 -26296 -76823 90543 104897
12876 104897 -149878 100108 175308 -82976 263138 90762 -264916 158021 -63928 -160387
12866 -160387 -56985 23195 -161976 351931 96423 217310 252405 167453 -76904 94873 170176
12855 170176 -162591 108945 99765 145963 146610 100403 -67745 -237995 165029 -84652 30875
12843 -195877 30007 355935 226112 -31775 -145677 -81031 -156065 221434 54204 -62832 119522
12831 -1824 252931 -137665 98753 213802 -199534 217457 29539 -217772 29640 86048 161933
12820 161933 -93273 102183 346054 -62861 251921 -340777 246934 -127814 -338639 -71908
12809 325436 104442 18992 80045 -122489 31224 -19887 88542 -106782 51069 -64748 49773
12797 -44597 -140283 -239462 248032 -71095 226015 27614 -114024 156042 136933 -287826 6394
12785 -125347 -115814 -110263 58356 -87716 -172271 -43646 -217845 -313174 195602 -55885 250652
12773 124021 135132 175380 37261 -198132 40197 195364 51313 75452 19996 -140965 114599
12761 291260 43213 124890 103792 54908 131431 139903 72166 243708 -161011 48312 -61552
12749 117145 -85391 78103 61936 -118434 222248 11327 -245922 -50860 1276 -238918 -83923
12737 -165 150068 -143979 -161170 -75126 24890 -31638 150527 178354 46402 62806 303260
12726 303260 64767 -270269 -95032 173405 -253151 83283 346460 -35430 -45012 190820 -71277
12714 167112 152050 128759 -74585 -172931 344858 104697 94404 228140 327492 166584 532267
12703 532267 95455 742683 117119 87988 92627 237289 101351 31574 23292 243890 19347
12691 341340 160736 -387118 4382 -139510 196154 83489 -133137 162492 1827 222201
12681 222201 -263916 -263807 -85381 -43057 276562 216561 -9740 133538 346694 -27059 230087
12669 164022 -125140 57010 -24067 -67328 49259 42746 -31970 90185 117369 -314942 384377
12657 84460 161603 176703 -3857 153322 260828 -23784 237132 103965 35750 13801 -223681
12645 -338712 241903 46556 24325 -33600 95463 -90561 201718 196097 110221 -58313 -73334
12634 -73334 -207911 -220573 78429 62801 397620 140190 254917 202677 -53545 107019 115193
12623 115193 204639 -24857 301534 -251110 -29906 -228484 29128 229143 -156724 37134
12612 1305 168341 -179295 -38490 -141626 122613 173663 262355 -99841 107090 154784 204810
12601 204810 -132314 -126574 241258 214950 82945 117745 148735 -42985 284070 -367248 426670
12589 200590 110628 -167984 331865 22592 305967 -2735 -11124 -15103 -32327 18244 -61632
12577 301326 198256 -86742 162034 41688 -172111 -25919 238027 -288803 304064 134602
12566 -38060 188344 387595 -160944 140999 -49876 110401 -17022 334067 -252911 -60952
12555 124863 -102060 -63898 -125815 145990 6597 52304 -51833 150042 336527 170962 29011
12543 94119 223696 161400 62852 253282 31774 -260913 -129339 13119 -162961 93490 -120745
12531 88074 113037 134765 121755 179019 235349 171147 82478 -113279 97614 295413 186722
12520 186722 191910 -115144 53954 52511 291033 -131326 35102 -106974 -63853 21783 251435
12509 251435 -60738 -387820 483088 17882 246272 326149 520667 44248 -228733 -12678
12498 197375 -80777 222401 -83563 -101133 -339615 -179321 85529 -145075 160518 -46909
12487 -14056 20673 -157111 -85237 -126349 127044 62867 96154 387059 86477 246065 131081
12476 131081 70274 149463 -300836 295679 -151608 198398 -104675 65596 76249 208356
12466 208356 -194247 34045 -181611 -106379 -62193 133741 -177444 16020 324442 113682
12455 31139 89123 81382 340747 48813 30493 110883 27744 -158542 45765 54665 -125643
12443 95064 -22780 -161970 -20763 -20387 -181104 39804 -36868 -125473 -47365 -112014 -139574 79085
12430 190270 70674 -342304 -11217 229678 5149 79251 -249751 -289902 -5240 44402 82518
12419 82518 -242722 75574 -100828 -13850 102983 -63176 -57372 -293059 280 -186211 -142471
12408 -142471 320402 -81525 199669 74737 -84388 -42462 -197816 2239 6063 155623 159858
12397 159858 162799 81211 36210 -125397 -47438 116663 -159479 -111910 -24665 -56438 221407
12385 -34350 -51219 62650 -34643 -61450 -2839 102849 -78026 -17046 -137266 104635 80027
12374 80027 -22473 246313 -395137 -129611 94000 128881 181128 -16009 -191504 -73727 -176498
12363 -176498 165369 -150210 271329 -125134 -85159 -238334 -82865 5978 -63844 -12241 -52193
12352 -52193 161992 -27456 276845 235372 119004 -279514 160799 -62631 65599 -120962
12341 -254132 155932 82056 -117218 -136421 16389 -107925 3129 -102314 1401 -117062 364930
12329 -41153 -154522 -246553 192956 129544 2087 37853 83839 156527 -58301 -5649 -28310 35682
12316 -129804 79609 289710 119278 208180 223592 41491 298259 -2895 -104873 -113284 24020
12304 27040 145107 -44098 308197 2608 -229331 -150459 -48482 -134073 -261277 136421 -195390
12292 99794 156987 -26994 193875 -91466 -74624 70425 203052 10325 119033 -1530 175946
12280 224625 265593 263618 208005 352143 -73549 -20134 275378 322571 -91930 30859 172520
12269 172520 282162 167775 57290 -34328 147008 -20640 -29584 -118358 122380 -203399 -79622
12257 199095 254173 228383 -41320 -66169 40934 -28198 94266 199758 19228 97611 -114901
12245 251042 17647 -72396 132289 170808 4174 305314 173368 103791 -233657 -91541 -157238
12234 -157238 428522 284839 -34275 60679 257502 102085 97192 319164 426671 312893
12224 312893 416910 161044 70845 295935 -56586 -130485 220740 179794 304775 38457
12213 161589 295817 229350 60498 133486 4421 324058 121585 153732 439749 484889 435060
12202 435060 683968 112428 -267393 359183 78544 -98702 419174 313785 276924 323687
12192 323687 163244 -31253 155566 -38410 9998 -7776 161384 53834 214579 -178339 7170
12180 48452 365289 8871 -232015 -120387 7072 233401 21710 116726 68424 147062 -11683
12168 473197 402523 132377 183110 140210 -39451 170044 -75209 218520 242273 86087 204540
12157 204540 -158202 42606 -22200 320711 -107220 229928 94798 292869 205079 -114176
12146 -16181 98992 316080 61445 -24302 -126820 323583 11717 88352 110821 173322 -47962
12134 -72711 246537 -192388 -221146 7201 56737 30187 283920 -202105 -99207 161038 291800
12123 291800 -147659 -122814 111412 -181897 149432 9807 178894 15885 -45419 70023 162046
12112 162046 173012 -151817 216884 19580 -192455 290240 -96912 16707 -226618 254095
12101 -228170 -10949 104827 -12130 -271027 49170 -66109 220158 13161 118510 302355
12091 302355 2116 101991 -41528 188827 -66499 73621 57331 53575 170328 -5835 -288587
12080 -288587 9547 99369 88468 -37404 -115208 299334 655420 1877875 821837 151845
12069 157143 166789 326779 -342521 172155 190855 187507 3511 -290142 -232850 304736 76828
12057 -112621 7008 130114 -248914 119844 -22374 -4198 -59086 -61998 378221 -172688 -270359
12046 -270359 222006 -80752 -5371 203386 -108230 179390 -199649 40823 -186776 -189808 61266
12034 -137681 225545 -5524 161026 63390 -175544 238453 -28218 161214 167890 -14735 -212484
12023 -212484 101847 -42308 36891 -75573 -166813 62166 90432 312291 -67163 156481 -169063
12011 -206627 136961 -24334 -159423 299712 -185192 45288 26048 -264288 57641 270510
12001 270510 -215804 47220 -40090 -74241 -470428 4216 -10921 -80569 142495 1864 220386
11990 220386 207748 239744 -26074 -6564 -40768 24420 -118759 -40526 96982 410325 140795
11978 160240 4925 -114755 -56703 86390 -401814 -211795 -150926 30200 -216139 129890 -237966
11966 -138943 -67475 -402787 119773 -185542 201055 5125 -92135 -127323 -46596 159655 -48983
11954 -245360 195409 163600 7333 -52066 212737 -42785 -22949 -71507 143806 128917 -8158
11942 -246726 -26592 85160 241359 -205919 6689 179636 3444 -155058 -367631 -89130 -286363
11931 -286363 50485 236153 -77529 -206780 3343 -168741 -63610 -124762 -216449 37607 -60010
11919 117537 278152 152669 211143 -177952 -267510 215944 -75036 -96913 9929 45517 -104807
11907 -133914 -238659 -41849 -28061 217145 285104 88490 -243222 81996 71254 -180471 -64154
11895 24780 -260606 13011 -9717 -248346 -310006 49509 40385 3553 -40893 -195296 -79890 -23437
11882 1715 25977 -118159 -22446 6340 63880 -78513 -113138 -278652 108382 23877 9666 36498
11870 36498 -149849 -165774 -393653 -301185 156615 -68562 199369 -342615 30955 -48661 -272796
11859 -272796 198549 201721 -78059 33357 82148 236895 -199442 47581 234230 -55728 -113555
11848 -113555 37477 7355 71567 -92945 -119731 388812 107855 22559 -65398 319615 -104866
11836 51900 75800 272605 -97259 -113287 -82589 -152933 -270473 -59037 -71570 45038 40588
11825 40588 -90759 227558 -29499 -92744 -27449 -38847 228482 -143345 -195973 -152562 51345
11813 140204 -92509 -19947 -113299 113080 -61806 245878 294631 -42201 -108236 116196 194950
11802 194950 -44804 -28841 -158624 142672 61587 -205826 -92102 74908 -233934 -226972 298652
11790 174881 43559 81398 -559005 80121 -274808 -15083 -165176 124792 -87794 -215025
11780 -215025 119373 -166842 25 43308 132877 113951 52461 71501 -77769 103901 175032
11769 175032 74930 142935 83050 -82997 47467 -230239 -145836 9914 -126610 -113919 96516
11757 41422 62682 -319143 88498 -86115 82033 331314 155570 63458 10646 50601 -76523
11745 -30760 15645 161611 332992 -113080 89088 -9479 -59365 157607 11307 -72122 -35295
11733 -55228 212995 309256 -30502 -145199 -50299 -91467 -16184 173491 86805 69419 -177343
11721 -102529 215075 151034 152995 148657 15160 75967 63914 -93138 69138 246240 206978
11710 206978 442878 -101435 -67533 -33518 173800 339521 174572 -392856 -212675 -67357
11699 -56300 -75338 281321 -54439 83770 530492 -267815 -99276 126385 298417 132407
11688 150286 -109276 3654 -338289 332137 219104 -4454 96088 -5083 222832 61803 17741
11676 21952 83174 89315 126494 295132 177757 22296 405636 -68904 141177 315477 113259
11664 224673 166503 118138 272248 20051 379409 -141516 -10888 -49000 45946 -229512 145174
11652 120099 312809 -246318 297988 -98664 66986 36295 170333 34052 -250064 44089
11641 239416 -37861 325548 253713 81020 -302374 288261 -159262 -28501 -57094 178954
11630 -135325 156887 253712 210239 337966 218945 212864 -246999 26653 37319 18761 266070
11619 266070 427045 -81326 207101 -68912 -154297 195093 9429 282252 -208818 290381
11608 -55089 -17958 48138 -337935 -158148 -20760 224577 101057 -95676 330342 188119
11598 188119 309114 158184 18384 251187 139165 22869 -109723 4868 188188 263496
11588 263496 284579 155285 54201 168991 239661 76696 150052 167223 -43697 294524 55360
11576 255788 34538 175608 -24841 88602 163157 217156 378414 289036 -31979 193531 -50258
11564 -255456 397881 160150 112133 199378 410663 139446 237518 19872 -79201 142274
11553 -270815 112758 32427 145158 60010 87139 3998 -107288 -4298 -13685 -281095 120629
11541 81684 265947 128184 242731 40745 149963 -64120 -114715 -34793 195581 120991 62988
11530 62988 209462 -27214 -169825 38030 105036 263832 -26870 -42453 243139 244724 -192248
11518 59230 50404 -41646 108435 112027 -4036 354842 255981 332292 193397 -119788 -154140
11507 -154140 312589 141097 494683 182234 446746 272802 -90046 -87808 106383 -265175
11496 -80109 -313642 62066 -17943 321653 80310 7806 31902 -132741 296267 94092 15887
11484 93127 220291 526502 147400 17003 355280 -78176 150462 1028 -1270 85229 98649
11473 98649 460770 -207346 146900 436174 115589 224112 -270761 208651 341354 -13207
11462 159323 394257 603632 201564 12939 -18696 332962 24354 238219 -40685 38121
11451 253198 11597 -4411 236280 -33995 -120931 92746 159628 159536 152411 -55123 -211051 -36281
11438 13182 64495 106423 -124943 219028 130082 213976 -124965 237529 63092 203033 216383
11427 216383 76432 -43731 304871 -10868 -6740 18725 15316 299900 -58176 38436 -30118
11415 71546 74904 -247490 -15427 14195 137315 -14791 146134 -216962 -92932 40573 -259559
11403 -307907 -10676 72255 94218 1217 447821 3412 -156669 165679 -40903 -91316 256898
11391 90776 198267 -135400 -224920 171336 -32291 249230 13173 -206573 18225 110859 298634
11380 298634 -21016 86183 272766 57333 -132677 234362 93881 222288 140169 61865 193395
11369 193395 105842 305907 369029 -129769 96807 302616 78872 92597 243672 -206353
11358 -131091 -28661 185049 42536 157912 113726 179749 112418 -111326 -277288 -29716 -121311
11347 -121311 -163933 -4907 -31820 -111170 222385 -315235 47946 122210 -18144 -371140 -247489
11336 -247489 -53362 -91709 -18422 62242 175478 -94212 -74976 -108330 22300 185009 -52899
11324 -30192 315741 61590 -192873 409210 159519 62227 -196388 -20295 150404 -1814 -81559
11313 -81559 -52506 166308 62817 -164734 71093 175799 -227219 -58524 -94203 -134824 122963
11301 -80335 169612 -3443 -124764 341722 269435 -20368 -170734 51882 -5298 -53702 -164602
11290 -164602 273995 178582 149174 128223 -91215 -174722 -40266 68790 -251272 -246523 -44881
11278 -215315 -78004 -160328 -46792 -56898 -279109 -61249 445157 -117619 249870 158202 -175264
11266 -5990 97889 -105210 9552 293126 304774 139249 -126952 -16441 154122 35759 51960
11255 51960 -153044 -172392 175918 74290 -66406 -137078 106379 -263453 -53495 -23396 -49632
11244 -49632 -25422 -196704 -89212 -125524 -354541 32610 241493 -106335 -22353 -210124 -281072
11233 -281072 102694 125829 92741 -108898 -120887 158645 -15381 -198119 23607 -92421 -152069
11222 -152069 -193805 -312954 -38475 174450 -170247 -42412 -29588 1793 1757 106350 7433 82602
11210 82602 -39287 -8442 -177275 -9099 -136502 -187571 95531 -310723 243177 27335 68132
11199 68132 -16698 237835 29573 -385566 330904 92378 -46448 -269536 -414006 -19271 -189869
11188 -189869 -61408 -286698 41313 1186 163933 -178993 72630 64424 -133533 -42519 -14038
11176 -148823 -17798 212032 -73363 -28660 193951 -251071 -54703 -104228 173595 59995 -151125
11164 -25002 83465 141373 274099 11858 -136731 9041 -277769 183828 -37482 148730 -211885
11152 -194837 -71024 381464 22886 179725 32782 163357 119406 -156605 -20361 335664
11141 43322 -483862 -40608 -2493 310513 133277 -37985 111 -162461 256257 38117 77966
11130 77966 91138 -179478 126047 -1055 -411371 438758 169409 227816 -78813 250692 454064
11119 454064 401724 -127084 175207 167223 7747 99938 64778 210604 50506 45988 -227738
11107 272679 276902 64893 249876 -83289 283166 329705 207003 471199 138870 291547
11097 291547 -54160 75870 247495 25890 -126549 295534 268299 105541 273730 200901
11087 200901 215480 287293 39499 229112 567132 143400 679614 8662 300025 149098
11076 575348 485316 266393 469028 117314 241184 524627 140749 324941 391826 309735
11066 309735 195900 515022 127920 495889 737177 427015 507194 463283 943319 630203
11056 630203 258547 801271 458339 720966 770810 593378 621931 673069 809768 753422
11046 753422 592934 558413 826277 701190 609878 893570 955128 946004 992729 717043 981451
11035 981451 658757 577759 711809 711343 976750 646708 525517 671290 1032616 927930
11025 927930 785035 837717 959421 642644 888732 767506 677052 705761 472372 777621
11015 777621 745346 713954 455406 581325 564368 582681 657472 593934 750664 513326 1005185
11004 1005185 737639 433290 938422 675775 787926 578257 1017388 649886 854897
10995 854897 917151 915056 855794 812700 725707 730375 845472 913912 807340 1088539 860187
10984 860187 1356005 1246984 991046 1298706 1592590 1750367 1335787 2191385 2264916 2374372
10974 2374372 2802605 2621308 3196397 3233415 3476942 3203709 3465789 3185831 2817298 2268997
10964 2268997 2530161 1962789 1995361 2455755 2419218 2142437 2408439 2314649 2040519 2182387
10954 2182387 1563241 1452720 1451824 1222784 1246449 647363 488325 447705 581502 134257
10943 212647 284091 432232 582093 99705 236696 315857 222682 220485 409640 162532 474210
10932 474210 104370 17163 168859 90648 267507 -172075 -124339 3840 -116905 10589 191062
10921 191062 -97548 -9454 127113 194240 -188969 112307 -125415 -49444 402915 85794 -103538
10909 52981 -7888 83558 -258761 149409 163925 188960 155396 -146333 370040 44451 -68416
10897 -61471 22441 -146296 60538 -305 -84193 -58420 163517 184656 -69905 -157908 -230421 22965
10884 -211748 161532 247854 -38282 236371 111368 249359 -68221 82906 35943 -138581
10873 367417 679926 -215775 256831 194485 139401 -330967 -83628 309136 208453 130469
10863 130469 5106 -204148 108001 148676 -252936 -18008 -101003 -65112 -169718 255162 -31247
10851 -9969 320753 326955 -128536 75965 -86952 -96000 -324674 -37004 295122 -192001 162986
10839 143279 248335 -24999 -100691 56732 9501 -332848 111394 -75529 76520 75149 102051
10828 102051 330391 305659 -130956 -115298 -211962 258544 50849 30672 131450 -8091 52660
10816 -367512 -120159 299358 -262997 4425 -240286 -86247 141906 -7418 168501 -34200 -62292
10805 -62292 -114267 -171063 -191598 -69156 83877 41640 -82123 199510 -83612 -136246 -106561
10794 -106561 62424 97628 -253046 -58044 -301917 -278435 -74003 -99625 -180421 104150 -201604
10782 69720 -120248 116125 -8528 257536 21865 -179094 -327633 -198289 -313774 -106204
10771 -80804 164429 -217176 -100259 34167 -63650 138971 -84769 -148451 -113406 127888 -232285
10759 -42739 -312548 59611 -134796 -45743 297187 -128283 51358 -52442 348994 26752 -73069
10747 174772 -236758 -99344 16345 52339 -146049 -73699 192769 -144483 70084 -162526
10736 60451 -61164 91225 -347657 -61672 44873 22944 -136065 -153605 79838 11413 4212
10724 241541 -158179 46625 -55214 -114127 -71219 -465669 -175613 -353384 234828 -40408
10713 132950 -109704 148100 -60608 -133408 168999 275273 121863 5859 -212128 43982
10702 -79219 74537 -90182 197595 -304237 124929 -95918 -166453 -110940 -130513 4396 -41114
10690 27970 -109449 -131444 -5372 19551 -103122 -145603 -293534 -94534 174954 -135036 -103624
10679 -103624 24300 -122983 -96884 279654 -159795 -99053 211918 -66839 209848 131500
10669 131500 291297 -146053 145772 -155849 -228844 -312601 84142 4569 71624 -25707 -11755
10657 -48194 -163200 94056 184917 -179199 15237 15042 -250183 -99722 36442 76183 65830
10646 65830 62198 61649 -421515 58660 -236821 -170612 -571882 195804 -410480 168211 -92974
10634 -223179 -65657 45778 88423 -233391 37005 -99295 38573 -129576 -150639 -131820 63343
10622 -69445 133300 190581 -159351 -31878 89888 -207720 -20020 -196615 51513 184995 20872
10610 -203417 -217026 95984 -59127 -341615 -50766 -284510 217913 -446703 19858 -42581 397468
10598 203942 52789 -67686 178021 225571 -96611 -294736 -191186 -102582 -196140 -76092 -89324
10587 -89324 -291667 -63207 89318 -16594 106525 -306042 11444 -4196 132637 172040 133614
10576 133614 -340290 -100773 347351 -125464 400951 53820 -33536 116696 -229004 -204456
10566 -204456 -325870 -192748 -102572 78870 -21299 -184585 -48198 -23124 88408 113881 -44381
10554 231845 -31315 37977 87441 -38436 167323 182958 -50620 315730 -188792 57161 107699
10543 107699 -310442 128058 -39131 86294 27086 -202050 -236889 247084 8617 -188902 -31097
10531 -25497 -22550 -56286 -99714 342633 -194607 -290385 142623 -387515 135122 126998 -253655
10519 -115675 202583 246476 -181466 207978 -164385 -177245 -215948 164818 -67918 -88928
10509 -88928 55778 -12249 11004 45889 -36952 131928 213927 76374 -804 -313736 126981
10497 61451 99546 -15592 -57857 237555 -296025 218104 118998 99867 -66887 178823 343074
10486 343074 -26506 -277819 -57750 489878 294582 242202 445085 86943 223663 -66457
10475 -315255 -152588 148087 277478 149602 167477 461679 -192329 -407260 -182021 -128762
10465 -128762 -104288 167364 173929 -62062 9462 100034 283498 67918 -140619 -108446 158359
10453 -137965 -59694 103126 -33100 45702 -323025 51215 -201121 22640 -188015 -166699 -39700
10441 58887 439265 35880 -85782 199193 -28222 -76377 -170713 23781 -162680 48660 -146193
10429 -112296 -50684 -52914 -14920 -90953 123633 27853 132792 63229 -132143 -200008 -38509
10417 -188963 54011 65219 -158422 122706 77399 105094 42079 -26151 -228485 47234 -51953
10405 222844 21216 -281349 -149010 245796 114541 142697 -179858 304915 118124 274055
10395 274055 167871 13593 299848 292957 367840 129796 169057 88328 59996 268478 119967
10383 246032 -18119 -100882 -23700 75869 157346 234660 350863 422275 262128 176807 342226
10372 342226 186462 335302 -64734 21006 419453 461907 146723 448959 339845 765497
10362 765497 246551 -22775 165011 206742 -216996 229723 235335 -17224 123084 353591
10352 353591 91731 518168 816551 493168 437882 386149 108535 614942 759303 572703
10342 572703 378850 303626 7408 277231 209266 341318 346750 148891 284410 60086 -63207
10330 105571 -403869 -212402 -13556 12643 273190 232283 2900 407995 341262 277531 321145
10319 321145 312898 -29080 383719 170415 194546 -19504 249211 -147647 189646 -23579 30430
10307 -243648 117978 -193536 -176679 207302 175549 156718 -144208 -54290 -73262 -53329 9492
10295 -279286 -1162 -153946 260134 133445 -68617 -155575 49310 122717 -79872 -117664 144376
10283 -213553 -50571 -30950 15290 -56768 7983 269715 348450 -87112 -64039 -4145 -176491
10272 -176491 -84371 223904 -204348 -126550 207515 -148513 159057 294301 13951 158727
10262 158727 364357 409801 371469 716645 497083 544407 340053 424982 326378 265902 278224
10251 278224 116621 146347 113664 -227033 -315651 -59857 -246027 136470 -4604 68379 -258039
10239 -169864 -9215 192555 -27570 -265099 -71365 59684 -13457 -14648 -116801 113406 -44569
10227 -145640 -50760 146159 54352 -120747 195006 -82549 -335471 -227565 -165035 -15059
10216 -137852 166092 -278943 149907 -194463 -147793 -285750 248593 -166487 -75852 176229
10205 -123604 -477155 -134393 -219919 -74628 -233209 -233404 -51589 22353 208180 -59911 193183
10193 75729 -23499 -39074 -56488 99498 177009 -175343 -163499 -65521 -266406 -163074 343280
10181 -151902 -222468 -93125 -353060 286221 83273 242197 -28199 -126093 -126853 2649 -19668
10169 -75585 202740 -4425 -228924 -28535 -15150 -196425 -250806 -112979 -226249 63866 -32956
10157 185909 -261985 145596 -6488 -301135 -338432 243796 -90158 97756 -152434 236726
10146 167414 -340105 17618 -139308 108557 -198545 208238 -47658 140067 142660 135226 22680
10134 -272122 83510 -160064 57483 3110 207310 -187986 19756 -163203 -76657 -405260 75448
10122 -110229 221050 -202269 67930 31766 479834 -424715 86681 107906 -90956 -115050 -317318
10111 -317318 -148418 -164409 -56442 -368374 -399616 -260934 -143747 -370567 -213336 116492
10100 112260 -354510 118812 -76381 252 -254858 135661 -146671 -128067 -229061 -111822
10089 -112371 318169 267434 36639 119357 -183195 58012 -470484 -226468 240657 -191011
10078 -16517 -21458 -277509 -56978 15381 350690 -171302 -150260 -1579 -87791 -162759 -93970
10067 -93970 -53525 -232953 -180417 31068 53884 -129303 356800 -17572 -25704 -95964 139791
10055 -125151 -7397 93926 -71125 -168050 -179424 -68845 51028 78563 -135885 3652 -79098 -13374
10042 67433 116 -57204 -138207 92433 242541 -145585 -84374 201553 -364134 -24661 135087
10030 -62766 45421 -417320 28914 -337945 -266461 -108471 -46841 -213144 237468 -232640
10019 -36220 -112377 -86006 31046 -152480 -5207 79702 -46317 -127023 -105888 109423 -91702
10007 -157851 -269090 526 -220313 6110 -352514 -182716 -360839 -222810 23656 152152 -9647
9995 -200376 -36963 -174884 -39606 -274279 -90053 -75453 81106 -100518 -52638 118250 28998
9983 -52214 147561 -320841 -153308 -438411 -109407 -154275 124139 -212953 -248529 166911
9972 -34321 -99476 -71619 -151394 -52371 -210194 27333 44878 -72332 -341092 -79841 -315487
9961 -315487 240544 -133762 449940 -104841 350296 -279866 -406527 -379657 125544 -67039
9950 22433 75393 -12723 -254618 -16514 107430 72168 -116673 -16756 219696 -12082 -187688
9939 -187688 -243404 76335 -228187 43165 -293052 -437912 -225193 -22711 -351759 113376
9928 -117895 -166889 116732 76664 335768 -264659 -147377 -142264 -210955 -254497 148268 -161183
9916 -204380 95023 97392 -347426 255434 -123870 -128225 -2258 -372519 -288468 -181411 -171208
9905 -171208 -83905 164441 -50626 -183472 -356812 169069 132583 -165594 5421 65571 -56420
9893 25642 -135342 -192699 -295032 100267 233226 -22603 -256185 70121 58791 -62458 14062
9881 105315 -234815 -242562 239687 -9589 -71811 -57376 -177576 -172431 141598 97297 -35931
9869 -34911 139600 158144 120226 42618 129388 -35218 -67643 122501 -242118 18949 -67132
9857 -104727 -197128 -459653 -265057 -280878 -52410 122872 -286766 -134256 -125692 -175000 -45080
9845 -224200 -121524 88338 -4805 -117158 264779 -175698 -172371 -43405 135775 -65895 -116918
9834 -116918 -175422 -74298 136777 -263682 78972 287920 -77352 -160881 -48434 -149353 -157649
9823 -157649 82282 -226662 226789 151628 101893 -62618 144093 -199308 -210387 -128237 -20503
9811 -147965 -95667 -54849 -84570 172871 -219997 -115386 -258049 90568 -260534 -74828 79218
9799 -345605 113689 -50784 -30116 -161403 -58125 -262985 -257532 -195470 184893 -182052 -90514
9787 -178979 -128890 -78528 -19892 -360972 -95355 -335687 -290893 -89285 -5598 -134257 -117925
9776 -117925 -153898 532 -332922 -340389 -122453 -265660 8489 -19776 21100 113655 -39372 138727
9763 -209282 78383 -7254 -150095 -78988 -40270 85617 -81670 45659 -168953 -452015 -128998
9751 -109281 224862 3343 -116695 -241942 -25241 -125357 60445 -231057 156214 -22474 204181
9739 -90367 40373 -39864 -371599 -5898 -71346 -57758 14302 -14156 229168 175051 113370 -333265
9726 215057 -55924 -345742 208818 171867 157868 -148649 125868 35335 -195158 -292809 -111362
9714 -90888 17696 -36917 -38601 -158823 -129144 -98099 -156294 36469 -116894 35853 -271066
9702 69015 -175253 -81773 -125867 -106885 36511 -72157 122515 -297516 -248634 -168994 -95202
9691 -95202 -102762 -13799 35017 103888 -15198 -221839 160054 -215715 -46812 -289154 48697
9679 223558 212195 -148565 -423231 -62893 68105 -81824 -63788 -394352 -81960 82160 -241475
9667 -53833 -89840 -157281 120665 50132 3746 104756 65534 -12622 68320 -479076 40551
9655 48953 -200753 184732 83557 70894 -282054 -45425 -195128 -153216 -137677 -101612 68149
9643 66228 113120 234677 295952 -31037 18678 -213348 -553756 -207772 -75493 32713 -75676
9631 -300160 -122567 -222355 -174588 -31195 88102 -161766 -270497 -202326 66226 160679 143057
9620 143057 -39719 175680 3863 -480447 41920 -260204 249339 -15971 64676 -42427 -482572
9609 -482572 -113644 -50330 -93215 -184624 13402 287969 11655 -75640 -150489 -190030 -186777
9598 -186777 269881 265549 -13697 -350157 -200396 117744 -258526 -71795 -277669 -209895 -66486
9586 84735 69699 115393 -286384 224223 -156078 -41427 31388 -126367 -310088 45999 -150360
9574 -33415 -264448 -12872 -86751 -258607 -493805 -157565 -26487 -63220 -74073 -114061 45466
9562 -211400 -30529 -170199 -104610 -194496 -83421 52437 426505 109483 181977 33189 -134525
9550 -42899 52902 -111480 -200224 -29462 -18316 -38229 -251457 200465 -78214 41745 -195926
9538 149097 -1759 207946 -180356 -11982 -128324 -94321 -1060 -425029 151129 326624 -161834
9526 -271208 -67472 -114988 371627 -117772 63803 -383024 8841 101723 -225357 -211463 61682
9514 -24096 205284 92977 -371009 -31412 -17671 -338522 -122789 -18856 163111 85627 34478
9502 45346 -133734 -202887 46302 -467576 132820 162584 75577 -7971 449518 -381383 -413146
9491 -413146 -70166 -63024 -39035 -140771 -128374 174734 -80099 -51723 -175293 242893 80147
9479 95180 -19130 174000 52683 -312698 93346 -123309 2635 -69868 -4755 -96243 291878
9467 -120170 175238 -6829 -94779 58327 8055 -27949 -170497 -102413 71603 -169950 74855
9455 -72462 -280905 33011 -26265 -260 -192572 -82058 -226062 -9790 203740 359860 -344224
9443 154157 81631 -50476 -240802 2650 -65943 -238932 -104955 -332710 -334504 1057 -271460
9431 -266724 171107 -187631 -108950 -148888 -86386 105052 -32919 305239 -246062 -95208 -107542
9420 -107542 -41855 5413 -39555 -591038 -228718 115211 32953 4559 126097 37368 45794
9409 45794 -246390 299516 -194059 -219304 318646 -187808 -193308 -107939 -221215 -11990 -288430
9398 -288430 -107770 2319 283375 -133836 -169180 -85965 -76990 349160 -359809 -55398 -260668
9387 -260668 -264542 -50439 223148 -110267 -194919 75193 303517 60410 345492 -302783 -63820
9375 23339 -30966 -139935 -19669 -253125 -6721 -90022 -3917 -137658 355466 -56175 -158261
9364 -158261 110064 191891 71525 -121156 -124954 -155695 -130403 -174938 31654 -90666 7111 -20125
9351 -41062 -267152 -179174 -90003 22790 -106322 -30776 -10216 4987 -345082 48244 18455
9339 -207505 -166000 -202252 -31431 52555 -7653 306839 7140 35929 27057 30052 150605 -162911
9326 146490 -21658 17355 -225449 237957 58839 -51397 107170 -140161 93622 -37996 100016
9314 111392 -29132 158811 -455915 -25191 -3675 381483 40642 -150618 -135185 40808 -340740
9302 -213651 40865 -311374 -94479 -28521 109170 -309405 106806 -281116 -159696 -43598
9291 -281538 -19882 -107683 215284 -283174 208629 15754 -149074 -310633 -276569 59274 5817
9279 -42184 277612 56478 62347 10063 36323 -196668 -53515 -216872 169616 66987 -193888
9267 -193367 -177194 -66859 -326349 -163410 104022 -10518 170957 21516 -9236 -156127 -213857
9256 -213857 89816 -178509 -105117 -35658 -60572 -244186 -171945 -208467 -131477 -248966 -98721
9244 -346973 -102842 -104644 -330410 190903 87547 80635 -112637 -168888 -291982 -305541 -55584
9232 -171843 11113 -152316 90036 93526 225526 -12854 21241 -168260 65731 73003 -192534
9220 207529 -242243 173383 -267338 -239445 -154249 175047 98484 -263364 270617 465894
9210 465894 285069 -63803 47127 43727 119212 87863 -165356 -209188 95817 -151589 171520
9198 75929 52530 -40562 -294407 -52745 117113 -236334 -24596 133075 74243 189258 -2066
9186 91197 -77355 -155828 -297468 59893 -223497 137942 -186913 -132988 -39032 -132812 160420
9174 -235017 101524 -61950 -113943 22825 -50091 -117853 236200 -317412 -243464 221737 -43754
9162 75443 -72204 78519 193213 -78044 -38344 144785 -20700 -16451 13834 -161127 24834
9150 76898 -69346 11826 -281201 -235882 -98473 -93175 1255 299751 -77657 223099 -56789 -398692
9138 -398692 -153471 -295083 -68178 187791 -207411 -164258 90916 14223 -255684 -195883 -250610
9127 -250610 115242 131035 95326 -169727 -138326 -50607 11652 -196173 51095 -9531 140930
9115 111620 -3983 58314 -90708 13847 78303 -149879 83001 55541 -34736 -207606 -266530
9104 -266530 82310 99626 97803 -355650 -260644 -360194 247600 -264828 -290485 940 125678
9093 125678 -434901 -44716 -241565 -246003 -281670 -113458 -76256 -124044 -69174 -110012 91543
9081 4321 -424533 86045 -186513 -193143 10801 -116065 -165050 -40959 -124456 -51298 -133931 -366054
9069 -366054 62702 -162806 -170637 -150243 154659 -155206 79241 -277911 -59730 117819 249803
9058 249803 -125741 43457 38089 -165477 -274243 -336544 -65964 -42671 -180469 -226124 219374
9046 -289323 -164300 -166154 8411 99288 -361402 -209091 -282091 55100 96567 -189904 -49972
9034 -185433 63804 -32236 -148813 -108832 -39095 286520 76854 -217191 -31077 -31876 -243458
9023 -243458 17575 -98770 -212142 150914 -110730 -210230 -198708 -258073 -51002 120342 158348
9012 158348 -369300 -218252 -141921 61883 -67771 -409104 14864 181053 -296404 53297 58584
9001 58584 131325 -64648 -158600 203615 82352 -51794 163798 386374 -177403 -165302 -161392
8990 -161392 76868 75737 60855 -110693 -18357 202556 -139935 47981 95403 -246175 -117828
8978 -65142 42142 -149903 175263 174504 -19486 -70447 -21284 316750 -88973 -77738 1855 -137811
8965 -149151 -156993 189442 -155658 -164068 -62573 -38692 59964 -3528 58857 -131706 44692 54958
8953 54958 -278382 -184550 147382 72907 141313 -189479 89177 -140103 42702 -213703 323700
8941 -122282 -159272 -6588 32157 -374035 -268842 -293520 -225937 -27151 -266690 24781 -130813
8929 76686 -38537 -19491 -13895 315928 23496 -45613 476947 1859753 928530 -126456 -36027
8917 313779 -81797 -22407 -32323 50200 6565 233558 121487 68167 53728 -60407 511073
8905 85143 -32539 -203679 -94169 -292055 -116524 -248095 -41293 236299 -105653 -130458 -140675
8894 -140675 140445 415097 -13361 -231998 -430585 -174614 -51952 31013 -71862 29629 -64000
8882 -250062 115603 -117887 130660 92018 -284381 -38230 -182710 -92307 149212 -363353
8871 -167264 -282777 -171256 -116223 -204829 37310 43856 104073 -230912 -26339 -29761 141574
8859 138261 -300393 -200548 337684 -83583 -39465 252545 -8558 -103256 105692 355108 -368701
8847 -51143 -91418 -263 170863 212240 -39052 -122780 22477 23489 69108 -269221 113937 -42446
8834 -209149 178214 -109850 -48780 318565 -211153 -15149 245887 -196707 -16149 -184555
8824 -184555 -183609 42279 -276018 129345 -112895 -121857 230052 -155750 -481974 -185886 157593
8812 -51052 -124254 -61990 -254001 -131036 155746 99567 63496 -86398 294606 -180896 -131540
8801 -131540 75888 -64813 79585 -484884 -98799 -372207 -73387 147368 -164696 -56372 -522987
8790 -522987 -117500 -241647 -139058 91020 157602 -196307 -101418 55309 -107167 -121550 111730
8778 -205903 -126437 167900 -229270 -68810 -30053 -340897 -16318 -99927 125605 35037 213568
8767 213568 295270 -65805 -118363 260719 141449 -9612 -279533 -93090 -262089 -65337 47704
8755 235079 -270064 -52249 -89446 119479 109910 76719 131201 96713 -141133 167138 -141495
8743 -139950 -13231 -45098 33412 45262 -75272 -223388 -219362 -61626 90303 26843 -150751
8731 -170242 212529 -89855 -62663 125940 -124192 -198722 -40771 -83275 108921 -286302 224182
8719 115790 -150396 -41516 -82301 -57976 -95281 64220 -266900 -214571 47073 169478 123507
8708 123507 -241832 -114160 -68587 -148176 -194265 89221 -43166 -770 -278772 -219160 -408474
8697 -408474 -15032 -14544 -336275 65128 68899 -80773 27949 30431 -17625 57851 -54560 -126 -16060
8684 -16060 279875 -141160 29178 -41104 -194061 -343937 -17118 -25672 43360 -36376 -95181
8673 -95181 -48821 -279578 38300 149530 82369 107787 176975 -130499 -65143 -107048 832 82796
8661 82796 143282 -105588 -327659 26224 -71041 318626 28831 -125321 -164153 -171087 -76416
8649 166634 -253369 38672 -305656 225063 54733 -84161 -302762 53920 -45679 287002 454245
8638 454245 5723 -107615 166626 208430 104289 114538 140897 19595 -268350 26407 -15030
8626 18490 70580 139239 349762 -132963 40585 -114298 -78944 10334 -282064 -48341 -521477
8615 -521477 -25376 -348622 122794 239543 115382 36737 183867 -117978 41191 43161 -192907
8603 -113591 187764 10294 -379294 -321067 22653 -285235 -119665 33182 -221123 82340 -120276
8591 -346635 135902 -300023 -245007 -348003 199973 28940 3564 82956 -57030 -60728 203773
8579 -3904 9304 33467 262252 -35826 224933 174217 -97329 15695 58884 -46400 335570 -285718
8566 -302636 -99402 -44926 16156 -127819 -35406 -152654 -361786 192172 -394373 -111324
8555 129380 -458272 80488 108110 -107843 -160639 60855 -186126 -141144 -289885 -127011 -227942
8544 -227942 -470923 18246 -415769 -219781 352820 -346324 -150204 -130531 143348 -126157
8533 -404351 -302869 66149 -132519 -183575 119579 -50679 181555 -3031 52745 241811 57002
8521 229603 -173788 -166505 -214122 207909 22575 -148637 158710 153811 -84571 126241 -72211
8509 34653 -129621 -343519 81296 -296465 -87109 100761 15808 85164 24954 -161643 -240637
8498 -240637 69983 -231519 -96557 176991 -122104 185119 -83461 50922 9352 86104 5340
8486 -160728 -97860 -137000 -121404 -261143 -167267 -11517 142242 270154 -120651 192522 -295005
8474 108131 -286664 137530 -236767 -227406 -75004 -134347 -299216 -113990 163402 15898 46354
8463 46354 -105394 141929 -138417 -135022 125796 -54338 -117154 22901 -339372 -116821 -130670
8452 -130670 36675 -75711 89527 -9023 -58419 -31060 198136 -46184 -164253 -28214 -88383
8441 -88383 -56769 -281858 -128839 -25197 -125677 -234734 -19523 124566 528408 94677 135923
8430 135923 98380 232240 -283229 -66256 -8359 -147114 244111 97776 -237492 21257 -20767
8418 202264 -169290 -169967 -50009 -28771 1486 -158112 -57429 69847 278623 1516 -238750 130789
8405 42514 183813 90150 -44916 45221 117742 -65349 -299693 130726 73244 -543937 15582
8393 -163120 -185421 -105951 -39643 -259294 -12480 201588 -284041 -109995 -240097 -34477 2910
8381 -121395 25362 143418 242022 -30723 -53101 69202 160205 178465 173967 -32102 -258315
8370 -258315 42255 -285347 -102731 -61590 151168 -140707 -144303 76457 -51401 -73329 -245120
8359 -245120 -98568 141672 -61333 189401 -104611 239934 -1776 35263 -307450 -37691 -99927
8348 -99927 15279 -252261 -283742 -251621 -192698 -2742 137651 -155674 -109021 -189506 -36505
8336 -40213 61320 -134565 -2197 -109967 324958 -197920 -26499 -1964 -216701 91206 25818
8324 -104679 -31416 -376836 -100162 -84763 -355116 73487 3407 -5161 -115027 -50206 75561
8312 -194533 183780 14185 -12597 -69307 -113406 -225317 12475 -60704 -10171 323893 78822
8300 39419 15242 -23799 -45718 -44873 -61112 -223537 -207570 161213 -209721 -81038 -108348 -193233
8288 -193233 -144984 75046 -185879 -192382 -6698 -103602 -147003 3910 -506631 -36641 33864 -51420
8275 197288 277869 -190825 124370 -95360 205538 -88551 13590 26211 8370 150950 -163012
8263 -335413 -223233 -174816 5145 -112520 81103 73242 -3674 147444 86522 96620 148279 82227
8251 82227 -151068 -357870 2405 9905 -251397 217296 70563 157321 58209 -101404 -116781
8240 -116781 9871 -81532 -68508 -58945 189131 74931 214308 220493 -169683 18065 203783
8229 203783 12536 -351533 286297 62858 -124337 69233 5957 -185932 -86 -216485 -45831
8217 -321204 -181786 -373820 232954 30345 -127975 190961 -189582 14265 -95287 -176964
8207 -176964 11554 -191622 -306785 -314590 145593 -182533 209529 -168548 -4229 -1177 301631
8195 -128127 72692 -12102 484462 -60450 -12124 -149199 208236 -226017 -126871 -42342 68903
8183 73704 -246521 -66214 225553 378279 -45671 -65701 12253 -217434 116244 -158163 101099
8171 219484 -227788 143873 69709 39934 91173 -260414 -333383 -233833 -246876 -135094 530937
8159 -136510 -235747 167771 180589 -31798 -218452 203312 -64080 -23910 -14144 61004 -297304
8147 12059 87272 -25382 -101452 -51961 -228158 -188630 -27319 -67228 -150841 24624 3637 -115110
8134 79113 -34494 97382 -77361 144371 158867 161674 34039 125697 -137001 -110158 -61343 287801
8121 -78092 -46434 -124438 177812 268590 -162430 123452 -190965 -88716 -148781 -161192 190483
8109 166433 80498 -107460 -418145 -324353 41997 116814 -65637 -79536 -133025 -45339 113957
8097 -303091 89220 -178848 20600 -60172 -180819 17022 114057 -356043 -116097 -72455 203493
8085 -239881 16906 62280 -45609 -8276 -67491 -204741 95300 -162545 60117 -228779 -220528
8074 -220528 51386 34923 -106728 -84252 -106399 -243787 -116079 139847 -45029 177302 186036
8063 186036 -196180 40619 182202 -229993 -96785 250168 54358 33747 4435 29913 147920
8052 147920 -253713 173091 -83327 42938 -178241 -321910 -343013 -104270 91725 -137429
8041 107890 103884 43022 36839 -483639 -154489 114596 -466366 -118976 -9905 -38020 77406
8029 -74411 -125039 -68650 -147401 -328251 -207503 -214871 24575 -68118 -29555 -65884 -23149 -16686
8017 -16686 -131437 131937 340151 86753 56174 261460 -38986 -35130 -322240 -205429 -228972
8006 -228972 26530 -74128 -134603 -309997 207597 158955 -32677 -106932 121203 74289 139822
7995 139822 -83638 -32371 -5004 -63619 152966 -87518 -285625 -43642 -128296 79960 -434277
7983 1154 -56092 -82568 82604 53360 -14137 109760 -49596 153095 268615 210635 54463
7971 282411 -397 122504 -63901 77487 49368 -50178 -181536 -243482 -111754 -61578 75602
7959 181891 165422 -9539 -111798 252957 -109903 124846 -183844 -65311 29537 95117 -193382
7947 -177900 173471 66398 197256 190548 168824 -14607 -11787 -239144 -201872 -241930 -21272
7935 218669 -317444 164291 32985 -19274 -155037 -84457 -187183 -234947 -7636 -63390 8041
7923 -490680 -230460 -72064 -2325 -114110 54536 38566 -180209 244894 164196 261636 66413
7911 134761 8427 -107649 23722 -143878 17022 -40347 -217692 -109222 -157488 -17242 -17777
7900 -17777 236901 -136030 -126822 -27864 29596 -149982 158004 -109178 50938 -172154 109602
7888 74646 -235672 210183 206037 -189687 284009 -71036 -15443 -55034 35465 -1122 -240708
7877 -240708 -306320 -224195 -305022 175415 -131447 -184208 -188925 76605 155865 461391 3449
7865 -49690 -36763 164995 -47714 -280323 41820 -318198 -52648 3835 -75474 -217404 330274
7853 -208290 -40466 5853 -100352 -53122 -182244 51327 120302 184981 -29440 13455 -353352
7841 262530 13071 -81902 -6519 187814 -80455 112409 -93169 56290 173818 -85413 -38494
7829 -165978 -187330 -291153 105020 -165634 -105890 -52498 258032 308167 -182023 -45423 -13379
7817 -131401 44642 -440041 129996 123687 -121330 -34854 329022 -97442 -176970 357823 77761
7805 106599 -97863 131400 -299876 -38998 -10163 -73573 -171321 -137634 -9239 10131 -201771
7793 -48133 -170892 -208781 -108477 -126439 -74785 -262381 297519 31583 -140796 -171874 149556
7781 -92380 -189146 -193159 248894 236118 12512 40201 81491 216335 -13186 52208 -249535
7769 -76897 -280296 147931 -36693 -37332 24083 25655 184178 32553 -443038 71429 66571 -107649
7756 136771 -357074 -33196 -56731 -258870 -409539 53099 -155753 265777 118590 -145950
7745 -222785 -32088 -120633 -5309 -56420 -54646 -41755 -165131 30639 -160342 -97602 -257334
7734 -257334 27893 118296 103707 294738 216240 148208 -364152 -133021 154527 -12549 -38597
7723 -38597 154107 -242894 62963 182828 181033 -260597 -256354 -203722 -77730 -143725 214022
7711 90419 90262 -150463 -8059 263990 148483 48852 -128460 -191039 -496219 76004 28278
7699 -55241 -12815 -26281 -112910 -6704 -139081 45623 -115038 25920 -14685 25388 -117679
7687 -141420 -293835 47221 -159188 182282 -113378 -132269 280534 496595 -221647 -85343
7676 100129 7931 -480874 -118200 407783 96447 90681 -207430 -97210 -139144 167289 -121935
7664 -94464 -50393 277597 -86457 95139 -1170 -66724 -109103 94175 179832 18069 -237570 70360
7651 -196433 -48804 76893 -283372 -21626 -49217 -188884 80533 96199 -145687 87838 -126466
7639 61593 -201011 -130433 -139242 -159329 209723 -52863 -89641 -23860 -22180 -46328 -177724 130335
7626 -378553 -13984 -125594 106975 67077 261668 35956 -136954 -303906 -67399 7027 -52341
7614 -53603 69572 50631 30570 -156287 -235439 -220142 -104413 -198008 -79179 -219963 201908
7602 -28830 -332341 55126 -82093 -307591 190384 23213 -5797 114977 -106466 54040 24847
7590 109079 -210735 142174 91305 -53797 116989 27043 -87494 164155 -7716 122878 -48685
7578 -171655 173098 37044 -190452 -174796 -276096 -358605 -159009 -6855 -359359 -209690 79210
7566 -231413 -101771 140591 -53091 -89404 -63491 -180963 102720 256850 110562 -15859
7555 -169301 -360039 127053 24641 31223 -240859 7537 139315 -307613 -88206 -24801 149173
7543 102986 -66894 -112011 39122 272744 213263 -70212 -323732 242924 109559 175471 -365450
7531 -200460 -338745 222377 161432 104159 -64165 -78221 46319 30452 -90325 -247222 -298813
7520 -298813 -73843 89800 -197336 -351344 114373 -33027 44189 303536 -325676 -60888 -201860
7509 -201860 -180021 61609 -153817 -195305 113337 129750 175538 -110934 112459 -122945 -126337
7498 -126337 79183 5009 4359 -49834 112951 -219059 104454 190930 9690 -9366 -231584 -256757
7486 -256757 -298741 162101 44305 -112030 200096 89403 -36064 -36947 93413 -28447 -25931 241485
7473 -30160 166791 -56032 -266436 -115300 -102752 191792 102404 -225346 -52057 25858 -134975
7461 -98600 -75318 105551 -363248 -132481 -364910 -218872 -159228 -96192 -149714 154243 -73524
7449 -47539 -26410 -92885 -227078 -26473 -211719 -25373 34403 -144267 233126 -46232 -340499
7438 -340499 -105173 23312 20791 131270 -51085 260203 -56773 -21435 90299 125007 -315352
7426 148468 -140050 -124183 -218808 -96503 -113509 153817 -52904 370803 -35336 136727 -184940
7414 -29158 274976 -369155 119696 -85076 -35689 -51744 92960 9276 -101249 -153321 -57222
7402 -13287 80886 -240319 -194108 -96006 -31526 -143123 94841 -253167 10410 -168376 -142720
7391 -142720 72829 -74013 158426 14935 -129869 49144 167789 -6490 266028 8836 -256685
7379 -218456 -27444 238537 63756 198768 -76406 202482 11670 -198282 -135744 71782 -120091
7367 -11253 -134562 70859 -234318 -104547 -13524 -306637 240913 -208973 -39300 -296616
7357 -296616 -273872 -87605 -217134 194465 -272619 -83865 -275182 233619 105328 -135369
7346 194019 75249 104125 -105700 80500 -49287 58585 279582 -89784 -106571 -62555 -187387
7335 -187387 -305965 -130505 15103 -128716 -37988 57153 -50954 -190265 158164 116511 2496
7323 -12384 -58232 -34419 17819 -32193 45022 -167717 -258588 148571 170010 -281731 2077
7311 -4379 7061 21533 -141496 -7246 -30589 -105388 100672 39892 -16877 83432 -133868 366133
7298 -17851 94754 -21821 -41181 74798 -16262 103897 -146804 -54885 -98964 -107886 79949 -64000
7285 -32382 -82928 142468 -105859 180968 -235641 165767 84558 -97143 -9994 17277 176830
7274 176830 149769 3957 -140881 -206784 -549164 -89626 -57123 -61243 114999 1988 -121532
7262 82931 -19414 86717 -143107 -5368 -165175 93892 -118461 304214 102632 -174194 -187061
7251 -187061 -5711 252196 -40110 -323171 -171529 -87893 -68052 -36532 -225043 143655 -289672
7239 238654 -127944 113925 66034 14332 -185883 -3996 179765 83134 144888 -47227 -62118
7228 -62118 152617 -239719 11483 -84632 121543 -401681 43418 -29095 -155671 -227397 166826
7216 -382844 -109954 89185 -299670 -12688 -17244 -167457 -140364 249812 -138957 113459 -77175
7204 -211885 75889 60642 37492 -105473 62771 75406 109289 -214731 182259 -117479 50844
7192 -15160 61286 235367 230922 -196004 238608 47909 -142536 -150067 47112 -127166 -130662
7181 -130662 -185072 -18233 -89542 246903 338933 177270 -203048 -306511 -195868 -44024 -285242
7170 -285242 97708 12006 -222625 -175527 -23728 200946 22164 85723 -84911 164607 286975
7159 286975 -19452 -254830 -342876 -171875 247187 48001 6287 -97515 -173853 -17362 253946
7147 21757 312664 243122 -223754 374695 -190292 -291460 -117271 -200474 -406322 49358
7136 -159175 86620 -220221 127813 150 -151372 -41448 -188069 -20043 -290109 68982 -52148
7124 -37506 -99390 218582 -46495 120492 -254154 265187 12043 167888 -32614 268231 145604
7113 145604 3136 -98195 51752 138827 -26440 -255287 101664 -89682 -241734 242617 186136
7102 186136 -116686 -63648 44079 -305873 -22854 123523 178321 -112357 -281733 95672 -355506
7090 -159686 -145422 -145201 -208868 -16017 -241417 -128481 -221190 37475 -63888 -113344 145345
7078 44863 -209683 -202979 218827 111981 3850 -249200 74764 -249648 -225020 -1243 -163040
7067 -163040 -19200 -213254 -190792 -348754 -32551 163380 90356 398079 -187997 -171773 -215208
7056 -215208 -75641 -203278 -182602 -145096 -13070 -219135 -57032 -204762 92123 -846 -1817 36435
7043 166115 150057 -148982 135390 -42990 10852 25686 35997 -153961 81344 -431533 -117194
7031 -128872 -94922 -38624 73780 -268791 -105427 57435 168799 -66172 163383 -78336 -152344
7020 -152344 125152 -105650 -34720 96443 201769 -182886 -134117 -168774 -156731 -95406 -208217
7009 -208217 61972 467125 284176 7895 429924 -77237 -59076 34041 -109390 85453 -174537
6997 -62024 29024 266904 361131 11666 -82618 -74532 -200607 -98307 -16071 171604 86640
6986 86640 -328180 223962 10454 183915 32386 -186398 -124147 28272 324324 7575 -283647
6974 -164933 -20291 -128431 129381 -61857 -113805 190194 -153004 172914 -87528 -102433 -16491
6962 -337219 -229146 79167 92138 123569 342003 -105581 163443 78198 -190597 20607 2096
6950 -88709 -78542 -139012 -15471 -82393 -88731 118918 -304309 313397 -52801 203106 -183922
6938 -196483 -41197 173787 -32215 -98418 83578 -16320 -72076 -305673 6671 -249796 -246465
6927 -246465 -46786 43592 -148086 -177473 93453 124055 183265 45238 -127474 239288 -112698
6915 -513650 261114 -90469 95097 73392 -131477 -129304 49021 -48894 -102979 -529599 -39601
6903 -14200 264026 -3017 98919 11370 90190 79296 108890 270018 -131264 -238780 281647
6891 80355 -318162 65072 85424 -47955 305257 -184135 37608 -298905 -98679 51273 -184274
6879 153318 70251 -66437 -163639 -199352 -78911 21480 38885 -50247 107632 -230477 -64117
6867 -37705 -182824 -16611 -2109 -95631 317197 20135 -116728 174464 -48486 -53263 232346
6855 112345 -118872 -181679 -133834 -448696 160420 -98797 -223533 -193770 -170488 8084 39063
6844 39063 -211274 36225 -40814 -24600 215616 106256 152477 -167970 277952 -179961 -257868
6833 -257868 346988 -126889 85410 -137288 41975 -103286 73803 40302 -68063 -191241 -240076
6822 -240076 132264 -128886 -80379 -140068 -13396 18171 -47097 -157441 56377 62612 -64888
6810 -48207 -159196 54644 158992 -53872 -160284 247630 -233943 -177819 -61608 -3739 -79662
6799 -79662 -101605 18952 163133 120877 109400 347584 166397 152599 190934 -36427 -56961
6788 -56961 150748 -245311 -124714 -167322 102033 51060 -175690 -212985 92225 366027 346291
6777 346291 -163274 -91177 48818 28244 -155372 -56758 13901 -96858 293028 -314801 -411767
6766 -411767 -216904 -125383 -167315 54280 -7448 -49456 -158084 64843 175082 -260317 -49670
6754 51301 -115319 -70378 -303382 -21535 177128 -40580 -139907 -89582 80109 2700 4633 49080
6742 49080 -14863 320739 37863 -389200 137202 66132 169247 -189458 21964 -319134 301286
6730 50824 -355585 -173446 -72221 -239768 144571 58633 143478 -383517 -149765 192734
6719 105283 7817 -188839 -323938 6573 -5460 21937 154586 163136 -302582 -111182 45498
6707 -12960 -205410 -66422 16972 49291 241320 250755 116612 -116176 -17126 87749 32560
6695 58582 -239181 63034 -47354 -148625 70643 14669 -193476 -48801 45284 253524 -313425
6683 73902 74259 33426 190273 117828 190834 -107229 -145471 -4102 -199033 -60914 -303289 97547
6670 -163598 7681 -154039 -62609 -247943 -97024 -152921 144058 96696 -77616 -101041 60611
6658 -53405 227182 -66802 164947 131043 -90055 134818 -450143 -58546 -87310 -296631 196838
6646 82142 -164026 -203898 -80558 -98576 -300491 207309 50939 -336438 -305423 80711 33517
6634 216899 84004 48479 -56908 -248101 337948 31591 159172 115395 -6671 -130 322120
6622 -51244 -5062 -67933 13346 -172631 403513 -137911 -188707 26955 -2383 230047 133990
6611 133990 138661 -18679 -81752 -144820 -316313 19888 247230 -23821 -170356 -315958 -240951
6600 -240951 176740 -277635 -290730 -73042 33104 -97165 84299 -122584 3296 -47774 54235
6588 123655 117247 88592 -76678 132235 -99260 -4620 -66433 -442346 1289 167189 116566 133721
6576 133721 -5896 170155 -12914 15249 -151423 -118760 -262637 18701 65271 10928 -11986
6564 -221748 24375 73932 -117849 113775 -121243 -288095 -107361 -413626 89877 56787
6554 56787 114348 -93568 396809 -257252 -29203 35946 -84410 -188257 -85450 -56878 338754
6542 -173290 -105541 -130636 429909 -3449 -136340 -148126 -212468 -25457 67399 -158717 -214634
6531 -214634 -4369 107255 -239061 -142346 89427 -173928 -149890 -75124 -69912 48835 286687
6520 286687 -93860 -141195 -172128 186572 153075 176070 -253443 -182008 -36202 -121943 -149858
6509 -149858 -15047 -26142 -238468 53460 23392 302537 -222198 -4257 -237194 -220037 220057
6497 170825 -437289 49359 -53987 15691 268703 -28024 44021 220740 22953 48486 -93968
6485 -86512 -346654 -241355 180926 97254 144493 -75670 -32855 43890 3154 -117453 121610
6473 -277313 43815 -79800 211022 43179 -251811 2092 -7413 167249 -54704 -218804 94288
6461 -161455 137531 32801 -38140 145641 -149101 -15030 -15307 164781 93727 68879 182467
6450 182467 -34922 64980 -15224 -110434 -517 -171354 81431 103738 -146899 -32967 27750 -15786
6437 322136 -267812 -50702 -144992 -69222 175900 232056 -347607 149064 -237600 278166
6426 -227913 -9634 31605 46438 -18688 -139330 24789 -14712 92925 -1913 -48693 158261 -437878
6413 70428 -73678 -52772 -75281 84726 -226580 -66905 -50668 -231642 186544 -87464 15363
6401 351121 -42345 -53225 -184377 86408 2993 160870 -124065 -62106 -123788 5689 176705
6390 176705 -71284 -216942 -318270 -43311 -76656 -51023 -137804 -101385 -96405 152960 -95584
6378 -103425 138759 126361 -126201 -24494 59012 -119493 -20362 -135638 91106 -236944 46751
6366 164578 -258890 182352 -238947 -114671 -28506 -83187 -111099 201023 179308 -8142 46353
6354 212857 -228231 -93038 -240905 -231490 141200 -63418 45326 386512 -129807 -38912 148250
6342 73400 29284 -155263 -12844 -96903 112424 -7931 -221967 -124331 -61223 341696 -25286
6330 25599 -84633 -34881 -100173 -192845 -153118 -225279 62146 -210429 -119893 60027 -58884 -41989
6318 -41989 -125359 400506 242728 -207009 3583 -153368 -3735 81977 -210319 19054 36496
6307 36496 -21170 265101 -105062 270943 -251 -126828 -311831 242610 -106671 -360799 209793
6295 -107400 143689 182699 11264 8337 -195466 176639 233920 -75095 -352709 134099 187114
6284 187114 41113 -13262 -36913 -58717 -59164 50373 124053 -315252 337866 160383 -145397
6272 262853 210860 53032 67504 13202 -168042 217821 319193 178104 -38556 177485 -239706
6260 -148689 103201 105822 -54156 -88859 80499 -164415 30413 -84256 -167029 -181672 142204
6248 163019 25316 -90653 4806 49128 -109206 336886 243756 70665 145391 -4299 -188424
6237 -188424 145850 13188 -155005 84768 34577 -452665 100006 87310 258505 -141916
6226 158738 137112 -124641 -137207 -59400 83230 267375 -42801 285263 -236715 -215848 86592
6214 89406 -64473 -130200 -414118 95141 11613 184448 -47557 35696 -71496 289883 161927
6203 161927 70352 13414 49555 49815 -87112 -54282 84259 -168819 -8156 150412 -38567 -192683
6191 -192683 -63144 63045 68408 -121407 -94032 225431 -127402 31523 16135 -104996 57197
6179 -245671 -2015 17247 161096 79566 -95381 459445 -222935 -8041 -39301 120737 59490
6167 -223649 89137 -46833 -212257 289257 178348 -288935 -223999 92764 -3616 -72685 -185799
6156 -185799 -8355 467826 88536 -78793 -24817 -123763 147165 -77818 103241 151165 -80066
6144 206530 -113173 32010 -123264 60150 170707 32248 -6105 -52231 -70960 100574 -30194
6132 15727 220318 61479 -290409 -128975 -154981 155683 -106366 4848 86163 88185 -150057
6120 153057 194147 -347172 185181 187551 -95802 57930 199457 -51526 196203 -117346 -298312
6109 -298312 -84623 30369 -189826 129829 -12589 132959 338582 -78250 12895 -178975 220327
6097 111958 -180029 175982 191201 235524 -138327 -184191 -15846 7945 179208 186937 382392
6086 382392 -288401 141397 -9712 -210333 -183428 -167602 -152258 123081 -185843 -137126 59250
6074 -10411 -3538 -90165 -36985 -61341 -125131 6014 13611 -52046 945 222481 258522 -124725
6061 -257680 231482 -72985 -1325 194816 175191 141276 142263 31376 -132165 -104668 -397607
6050 -397607 140974 -60798 -21896 -28137 259715 -26233 -433351 126110 -114422 185885 176849
6039 176849 196398 193762 -181996 133473 -125568 -170003 -152242 68769 93801 -184238 462025
6027 -45034 -70832 213035 -53211 -272695 -61048 -69478 43422 -24977 348496 320338 -60563
6015 -11240 41993 -106771 89216 113635 -60013 141861 60338 -177353 -90430 173505 120741
6004 120741 -149039 -101066 -148555 -225245 -92484 -153812 187017 55260 36355 -118147 -88613
5993 -88613 -75534 -35205 -9817 -45852 -60778 57989 -175563 2205 -389730 -84389 -291288 -76705
5980 245336 156833 90229 -199284 165182 -221173 8035 -177345 7622 92962 -35089 -132 -9061
5968 -9061 -455831 -243713 89939 -38122 28708 -42505 9058 -116500 133626 63598 -48918
5956 221200 20290 -58454 -261026 58976 146680 -121699 -17389 -183688 -14817 -63179 71823
5944 -79860 -135373 199086 5722 -750 41779 -267149 217023 205688 213859 36614 169278 4039
5931 73160 -57223 106471 -112812 178062 -135805 168612 211069 -169449 42893 204464
5921 204464 -2598 10750 -136527 41011 308527 50513 154773 -4814 -137614 255430 165376
5910 165376 -35889 -88754 56126 -45534 -82865 264301 9634 -120429 -304491 188404 54520
5898 -179914 57327 42997 63889 54424 -247085 42507 227981 276810 32340 152707 135031
5887 135031 145529 -32026 -232496 -295810 29503 -30194 -253178 39262 391696 77921 -18876
5875 130557 485856 -97409 158730 -66631 23953 48310 298326 -257640 -209631 163301 -62111
5863 60170 -101473 -99401 -22662 41915 -75456 -150601 -167792 -119622 -136224 -221183 67797 205937
5851 205937 -176080 -236916 108550 -166282 -205135 47140 -10772 182641 -187360 -144446 -131423
5840 -131423 251540 -168186 232567 -28932 -6878 -284678 172457 -128518 -53913 -127151 -141920
5829 -141920 212044 -39400 -72246 36633 -405295 -161720 179905 -33443 -168281 -84109 -353395
5818 -353395 -356285 -21992 -190033 -46840 -265063 -132268 90736 241667 -359348 -115518 201032
5806 -105290 -109191 -16392 -162817 21288 -135971 150632 96904 -45661 276962 86565 -58496
5794 154292 134248 431963 -316400 269476 -52106 190018 248311 -110823 40814 291404
5784 291404 34366 -457666 291282 -121059 229738 -114619 -265928 -296227 -442231 170839
5773 -513353 289653 -39300 -37748 -135207 -196691 349804 -283466 -243690 78918 23910 -69347
5761 130617 -357972 -13991 -222474 61465 47647 -80075 152037 33927 108897 -36939 -192463
5750 -192463 -141800 128716 -194864 -19938 -44546 114772 -36376 -17324 159179 -308602 -120174
5738 -137070 70670 -57615 23681 317002 28816 -355902 96877 -41311 -41126 -148941 149801
5726 -97816 416977 74611 93719 -49143 -90608 290114 87306 -210221 -62487 143988 -299398
5714 -20857 375223 -27518 -412209 -12422 -142660 304202 320750 -108361 -114767 312418 -270564
5702 -12049 3323 -185920 -89956 134733 41129 15556 -192068 244831 -154423 -16285 37956
5690 124959 29453 -104758 -171382 -365759 -82540 80775 122320 -373180 187591 -25152 286514
5678 150472 175109 114502 76876 -10183 -506703 22742 69865 44989 95292 -18447 -61360
5667 -61360 -194707 -288330 197095 128212 287758 90627 -249525 -211954 36633 -155083 -91070
5656 -91070 -99755 -15638 233063 136062 3849 41474 166782 -1407 247142 205897 -57606 269322
5643 -13074 195482 133984 -181523 -86663 201023 -106371 111993 -160216 -39212 137512
5632 160489 -141497 35773 30057 -21188 -52320 -415255 -57014 -78041 -138877 11358 -194295
5620 -67216 74755 -64399 92438 -183441 -439718 -149547 -14216 57365 43240 -156096 54687
5608 -148839 -99035 10782 99085 -255467 208948 -88851 -97607 -172523 -108357 -197242 -226649
5597 -226649 -28106 -152860 -300995 162591 -215052 2226 142374 -148472 98216 -42025 -117945
5586 -117945 126072 -200724 -140225 238700 65056 142580 -248234 -169909 -2995 160365 -26896
5574 98233 -311009 105677 -243053 -103455 -84052 208587 177033 56007 265067 -10269 416408
5562 -135642 -39028 -393324 97221 -12897 64288 -159954 -18413 8952 39686 -163131 -13239
5550 -67594 93842 97195 -117884 31831 -69861 72818 -128157 37063 122192 -326199 -14100
5538 318240 72003 -13134 -241437 -167973 111810 266470 -43533 92876 -45836 390345 -309472
5526 18967 87989 -32973 150516 -161980 -63818 278468 -164463 -119379 383736 -315360 -36511
5514 125709 78009 -75537 -43891 109274 15954 54415 -191490 -144202 -49201 51296 414355
5503 414355 -120886 27906 -163261 47697 133550 4201 44804 20324 90054 272785 33401
5491 -139343 -154006 -84513 200523 -147252 79950 -186379 -39515 184806 176892 -88620 -51683
5480 -51683 236812 173668 -119563 13075 -52109 -194214 64400 -50537 -58731 89466 -86341
5468 -81822 -572 -317738 136575 197700 21285 -231954 -368817 -33509 -191405 -93788 -214877
5457 -214877 -18852 34722 236156 55265 -116822 -85224 -143692 -72340 -101435 52437 140234
5446 140234 -320212 260270 16026 49675 222061 -115046 13810 145614 174863 27747 -447342
5434 -75670 3511 -188673 -454624 162568 88781 -187482 72769 270755 132576 -14851 -47029
5423 -47029 -311789 -160233 79597 64600 -288879 45022 57018 -29429 -33470 -63075 -20968
5411 41588 -96952 33264 251276 -40450 218003 45471 12452 99830 183830 -254328 211013
5399 -91134 437726 380067 201328 95486 281487 73065 -260330 -126203 -97736 -89962 164862
5387 -218933 -168049 -49477 -300315 33468 84649 -122512 89247 -118892 -148948 -37995 51669
5375 106362 94618 3923 -117468 51545 243727 -175881 302149 47707 -259948 -177176 -51142
5363 -46962 -246959 -72371 57888 186112 103361 -88741 97254 115589 155689 86725 256086
5352 256086 -169782 192540 -182972 83152 176374 129351 -313574 -120587 -109258 -100694 158195
5340 -61583 -235220 -135932 -65073 -112186 80283 152774 122886 -123919 -297903 -223440 4502
5328 136398 -12326 31194 -134287 -206697 -33940 -339731 21589 -68100 64864 -39162 -131186
5317 -131186 65042 5609 -106087 -61282 -84970 23038 209878 -189320 -24972 46271 44126
5306 44126 -47618 -35627 -81843 -410484 112555 -55994 -35776 77860 -264010 -151728 94703
5294 -166093 86485 40428 149411 205071 -22775 -155407 21157 -124702 -59924 -60574 -5565 299157
5281 -75777 24705 -107498 283598 -120783 7800 -169923 -29273 -15363 140496 -225094 225703
5269 31776 -56439 183678 65809 -174704 -122810 17017 60290 -207349 -63478 168739 243671
5258 243671 21815 -59005 -20759 50457 -248863 183694 -5162 6366 -212619 -71335 -302696
5247 -302696 -254257 -93587 28439 267075 131333 -39676 -132816 118138 -1441 -22490 420215
5235 -17282 165266 1325 -57729 5153 -237164 -144470 35592 -60382 158674 -47065 110856
5223 -34454 103553 232330 43360 28678 26166 84744 118662 -138667 -355445 154130 -231994
5211 5850 -33988 11002 -227575 -40177 178827 -333373 123801 -131772 -28933 -264691 37531
5199 -349622 17364 154751 -265998 -78075 -178427 152810 48086 -125429 -16048 -64096 -123151
5188 -123151 133850 251740 -151953 -40224 49957 -61590 148661 89855 -71492 52848 259213
5177 259213 -58589 -246926 82555 132896 82237 89295 199010 -204106 -219716 26158 90916
5166 90916 281149 -41964 -77794 165686 57604 57980 162881 -66452 -16973 -23581 -224931 -168558
5154 -168558 37489 -103926 85916 109366 -67124 -2888 208538 114739 -62381 -292555 -99887
5142 152804 14300 -171244 231606 26226 48712 25760 58510 -168480 -202272 16841 192502
5131 192502 -113125 68154 -7520 6468 -295192 173904 293708 -134383 99343 185784 188904
5120 188904 212410 -173451 -75250 -178481 -287574 -40840 42751 11844 -176358 70165 -171929
5108 181819 171243 37120 15812 157610 131096 34761 -198410 102839 -83513 294201 86609
5096 -160588 31507 -41873 -336568 -101498 -257678 -225176 258536 72415 92335 68956 159812
5085 159812 102533 -67488 99328 66519 -118136 249043 166512 -50584 166379 105898 -241883
5073 400740 -61454 -34894 -27824 -153637 -94963 93187 34299 -56042 40440 -40791 -199566
5062 -199566 112955 -137701 115234 -187025 151314 -43013 245652 -95645 -33898 146576
5051 -83945 -84996 -96632 -95323 183271 411675 26334 -136868 315322 143374 -178068 10746
5039 -6713 275135 35512 99660 72455 39388 1096 62493 -136807 47500 27675 -148279 110560
5026 180321 -56598 9171 -136863 54995 23384 -163161 -162346 -95502 256026 188779 61805 69482
5014 69482 110301 -235563 82715 -138950 -109380 122642 42081 -77262 -80017 -95924 -168740
5003 -168740 21446 97479 164237 -190856 119922 -92092 143037 145474 37970 -415988 -264900
4992 -264900 22637 93684 13639 221833 -195429 61708 121021 136623 -87322 19509 -266904
4980 102685 192575 -228450 239672 28260 344726 -186768 77502 -70295 -40219 33452 -98943
4968 -180033 -213774 -40831 202040 -82041 -37351 -195177 -83902 72972 -164294 -51602 52021
4956 237698 37932 31257 -61316 -147959 242608 187513 46410 -190801 -161524 244748 263478
4945 263478 135893 204458 165535 223425 134363 -91761 232689 -128209 -48732 40981 -43290
4933 131902 -161767 -353835 209305 -291172 124562 267586 22451 76379 43140 -88897
4922 -408056 120274 162815 -127193 -101497 6842 -176564 -27428 183048 99082 -108038 281735
4910 15274 174402 134574 76679 85495 208231 194606 34596 389441 36042 -185743 330585
4898 96900 -268689 66162 86149 417911 -187895 128584 158808 171895 191304 87481 -101254
4886 19273 -257867 153724 -55089 -87768 -173190 -54801 157027 177405 -416544 6787 -76068
4874 37656 39983 -152986 -245829 -436112 -17097 -373158 55253 -162351 -126523 -172301 270110
4862 91207 -83954 -155579 -26479 -242552 26351 118289 -277226 -238612 -100274 -128478 -69538
4851 -69538 -157203 81314 211288 -18991 -427748 -110126 159714 343456 188857 -157524
4840 309031 -180664 17192 210451 67458 194259 158219 49479 73533 232862 -37473 96179
4828 221311 -112496 -17959 -152944 113831 -104251 -64609 160206 -149041 -8744 -179058
4818 -179058 116970 71640 19254 -8475 35325 -85234 10531 116534 -26164 -78563 -181874
4807 -181874 -154606 -128747 -175416 -142539 60264 -495553 244444 -320346 -204968 450876 -106221
4795 -195509 181694 -111771 70073 -48859 -141198 176728 -7681 -247659 73970 -204385 -21816
4783 236715 -237510 61614 49570 119997 -59890 49421 9480 -45623 -244245 -173040 72450
4771 60479 32542 -68632 160944 -4923 -131666 -156146 -186252 252245 -28623 -54369 -20052
4759 -746 158547 47966 195078 59130 -323157 179526 84770 60876 -437490 348646 6147
4747 22266 -1064 310124 22282 -110084 122587 -57791 -153442 73139 -198475 -22536 -81603
4736 -81603 -138513 244541 327582 85794 426485 89890 27711 -29357 -79231 126020 77353
4725 77353 -5057 20247 83324 -171405 -11101 -39296 59839 206225 -33201 -171071 22851
4713 202056 120669 -224922 -168296 206616 209984 331476 131219 -259245 -11793 -296312 -213638
4702 -213638 -39825 -186108 -18152 79123 -128623 -182285 192547 50972 114216 -74350 -9283
4690 168555 200567 163356 -65346 101274 -115758 336522 -106978 185245 271664 -65156 134588
4678 61248 139305 -313437 -15069 50897 -173248 -110775 4717 -10057 91417 10171 -42367 -215607
4666 -215607 63293 -116371 3574 -400304 140704 -265335 -130021 -133155 -11186 224590 -170832
4654 352475 145698 53111 -8076 369270 220809 -10408 128904 139400 -107026 -19863 69924
4642 399999 -152597 261316 209394 121185 230380 63068 -158830 211963 -182105 3840 154093
4631 154093 48144 -117270 14547 -134915 -207843 214467 -14720 72924 89180 -134778 -195159
4620 -195159 -71180 -34405 -133704 98059 -83211 162583 55204 31509 54766 -154236 406366
4608 131960 88486 -68826 -287996 -142697 122124 -209640 -204175 -99063 -56267 -212566 189928
4596 -56863 -13524 -318499 -116998 263200 -27999 -127518 219626 -29506 -6151 -169693 41146
4584 -28065 -79766 257548 -77221 -53082 32177 175360 -163978 -159480 -113470 -285682 13740
4572 227116 -2601 -151892 -145597 -187536 -160629 -113797 -227604 149584 476036 -67152 -64887
4561 -64887 55542 95377 -172989 -50318 -247716 -79515 43927 -46333 13137 13879 2628 -47983
4548 171008 -12452 351293 -112520 -207755 -86297 135310 -22376 -178920 216828 200107 -4543
4536 -251667 -65085 202802 -69284 297201 50091 -93026 -269555 -38383 -53222 -113535 -306550
4525 -306550 -26538 -6254 118451 -36030 144916 198273 -115745 74933 164704 2308 36144
4514 36144 271800 -164 -329138 -108034 15391 59348 392428 117137 -84157 292745 -55127
4502 90911 -14724 -139366 265651 -154144 -362375 -24257 -146116 62103 136092 19164 139056
4491 139056 188242 40561 -20139 -161310 -21748 21716 173197 -272177 -283912 169166 331667
4480 331667 -74287 240763 188744 -149648 124510 -192058 -256014 4620 -76632 104818 -12788
$$ [...]
##END NTUPLES=NMR SPECTRUM
##END=
