##TITLE=AC1725_CUNAH15011_9208098_6u64OiWDWz
##JCAMPDX= 6.0         $$ Bruker NMR JCAMP-DX V2.0
##DATA TYPE= NMR SPECTRUM
##DATA CLASS= NTUPLES
##ORIGIN= BRUKER
##OWNER= Administrator
$$ 1.72 TOPSPIN		Version 2.1
$$ 2015-06-01 17:35:14.092 -0700  Administrator@X
$$ Compression mode = diff/dup
##.OBSERVE FREQUENCY= 400.02188249412
##.OBSERVE NUCLEUS= ^1H
##.ACQUISITION MODE= SIMULTANEOUS (DQD)
##.ACQUISITION SCHEME= undefined
##.AVERAGES= 64
##.DIGITISER RES= 22
##SPECTROMETER/DATA SYSTEM= spect
##.PULSE SEQUENCE= noesygpps1d.comp
##.SOLVENT NAME= COFFEE_meoh
##.SHIFT REFERENCE= INTERNAL, COFFEE_meoh, 1, 14.96079
##AUDIT TRAIL= $$ (NUMBER, WHEN, WHO, WHERE, PROCESS, VERSION, WHAT)
$$ ##TITLE= Audit trail, TOPSPIN		Version 2.1
$$ ##JCAMPDX= 5.01
$$ ##ORIGIN= Bruker BioSpin GmbH
$$ ##OWNER= Administrator
$$ $$ E:\/data/COFFEE/nmr/AC1725_CUNAH15011_9208098_6u64OiWDWz/12/pdata/1/auditp.txt
$$ ##AUDIT TRAIL=  $$ (NUMBER, WHEN, WHO, WHERE, PROCESS, VERSION, WHAT)
(   1,<2015-06-01 17:35:08.717 -0700>,<Administrator>,<X>,<go>,<TOPSPIN 2.1>,
      <created by zg
	started at 2015-06-01 17:23:39.201 -0700,
	POWCHK enabled, PULCHK disabled,
       configuration hash MD5:
       21 0F 79 D6 B3 7B B4 F6 88 20 88 DB 03 48 BD 9F
       data hash MD5: 64K
       A1 49 E5 23 23 1F 00 6A 5A 46 D6 B5 6A 83 B7 04>)
(   2,<2015-06-01 17:35:12.030 -0700>,<Administrator>,<X>,<proc1d>,<TOPSPIN 2.1>,
      <Start of raw data processing
       efp LB = 0.3 FT_mod = 6 PKNL = 1 PHC0 = 0 PHC1 = 0 SI = 128K 
       data hash MD5: 128K
       12 0E 0A C1 1E A3 28 D6 C6 6B BC CE 80 7D 5D E4>)
(   3,<2015-06-01 17:35:12.905 -0700>,<Administrator>,<X>,<proc1d>,<TOPSPIN 2.1>,
      <pk PHC0 = -87.25891 PHC1 = 0 
       data hash MD5: 128K
       4F 09 DB 38 92 5A 21 D3 09 B8 D0 55 A5 36 FC FF>)
(   4,<2015-06-01 17:35:13.311 -0700>,<Administrator>,<X>,<proc1d>,<TOPSPIN 2.1>,
      <abs ABSG = 1 
       data hash MD5: 128K
       59 E7 39 27 DE 9A 16 BF A7 1B 3B 8D 15 B1 AE 20>)
(   5,<2015-06-01 17:35:13.405 -0700>,<Administrator>,<X>,<proc1d>,<TOPSPIN 2.1>,
      <abs ABSG = 2 
       data hash MD5: 128K
       01 2E 22 6A 09 F7 5F 5D BF CD 0B 1D CC 18 1B 10>)
(   6,<2015-06-01 17:35:13.498 -0700>,<Administrator>,<X>,<proc1d>,<TOPSPIN 2.1>,
      <abs ABSG = 3 
       data hash MD5: 128K
       68 28 0B DC 0C 68 EF CB DA 97 08 09 31 FC 43 C9>)
(   7,<2015-06-01 17:35:13.576 -0700>,<Administrator>,<X>,<proc1d>,<TOPSPIN 2.1>,
      <abs ABSG = 4 
       data hash MD5: 128K
       B0 7D C5 E3 5D 03 EC 00 09 91 EB 8A 5C F3 F8 F8>)
(   8,<2015-06-01 17:35:13.811 -0700>,<Administrator>,<X>,<proc1d>,<TOPSPIN 2.1>,
      <abs ABSG = 5 
       data hash MD5: 128K
       7D 4D CA CD DC 74 D4 6D 3D 52 E8 B4 E8 FE 9B 6C>)
$$ ##END=
$$ 
$$ $$ hash MD5
$$ $$ 81 53 2F 1A 00 5A 9D D8 88 DE 6D B4 60 26 3E 3C
##$RELAX= 
##$RELAX= 
##$RELAX= 
##$RELAX= 
##$RELAX= 
##$RELAX= 
##$RELAX= 
##$RELAX= 
$$ Bruker specific parameters
$$ --------------------------
##$DU= <E:\>
##$EXPNO= 12
$$ [...]
##$TP07= 0
##$TPNAME0= <>
##$TPNAME1= <>
##$TPNAME2= <>
##$TPNAME3= <>
##$TPNAME4= <>
##$TPNAME5= <>
##$TPNAME6= <>
##$TPNAME7= <>
##$TPOAL= (0..7)
0.5 0.5 0.5 0.5 0.5 0.5 0.5 0.5
##$TPOFFS= (0..7)
0 0 0 0 0 0 0 0
##$TUNHIN= 0
##$TUNHOUT= 0
##$TUNXOUT= 0
##$USERA1= <user>
##$USERA2= <user>
##$USERA3= <user>
##$USERA4= <user>
##$USERA5= <user>
##$V9= 5
##$VALIST= <valist>
##$VCLIST= <CCCCCCCCCCCCCCC>
##$VD= 0
##$VDLIST= <DDDDDDDDDDDDDDD>
##$VPLIST= <PPPPPPPPPPPPPPP>
##$VTLIST= <TTTTTTTTTTTTTTT>
##$WBST= 2048
##$WBSW= 25
##$XGAIN= (0..3)
0 0 0 0
##$XL= 0
##$YL= 0
##$YMAX_a= 8837069
##$YMIN_a= -9638457
##$ZGOPTNS= <>
##$ZL1= 120
##$ZL2= 120
##$ZL3= 120
##$ZL4= 120
##$ABSF1= 14.96079
##$ABSF2= -5.597392
##$ABSG= 5
##$ABSL= 3
##$ALPHA= 0
##$AQORDER= 0
##$ASSFAC= 0
##$ASSFACI= 0
##$ASSFACX= 0
##$ASSWID= 0
##$AUNMP= <proc_prof1d_extract.lims>
##$AXLEFT= 0
##$AXNAME= <>
##$AXNUC= <1H>
##$AXRIGHT= 0
##$AXTYPE= 0
##$AXUNIT= <>
##$AZFE= 0.1
##$AZFW= 0.1
##$BCFW= 0
##$BC_mod= 0
##$BYTORDP= 0
##$COROFFS= 0
##$CY= 15
##$DATMOD= 1
##$DC= 0
##$DFILT= <>
##$DTYPP= 0
##$F1P= 0
##$F2P= 0
##$FCOR= 0.5
##$FTSIZE= 131072
##$FT_mod= 6
##$GAMMA= 0
##$GB= 0
##$INTBC= 1
##$INTSCL= 1
##$ISEN= 128
##$LB= 0.3
##$LEV0= 0
##$LPBIN= 0
##$MAXI= 10000
##$MC2= 0
##$MEAN= 0
##$ME_mod= 0
##$MI= 0
##$NCOEF= 0
##$NC_proc= -2
##$NLEV= 6
##$NOISF1= 0
##$NOISF2= 0
##$NSP= 0
##$NTH_PI= 0
##$NZP= 0
##$OFFSET= 14.96079
##$PC= 1
##$PHC0= -87.25891
##$PHC1= 0
##$PH_mod= 1
##$PKNL= yes
##$PPARMOD= 0
##$PPDIAG= 0
##$PPIPTYP= 0
##$PPMPNUM= 2147483647
##$PPRESOL= 1
##$PSCAL= 4
##$PSIGN= 0
##$PYNMP= <proc.py>
##$REVERSE= no
##$SF= 400.020009720553
##$SI= 131072
##$SIGF1= 0
##$SIGF2= 0
##$SINO= 400
##$SIOLD= 131072
##$SPECTYP= <>
##$SREGLST= <1H.CDCl3>
##$SSB= 0
##$STSI= 131072
##$STSR= 0
##$SW_p= 8223.68421052631
##$SYMM= 0
##$S_DEV= 0
##$TDeff= 65536
##$TDoff= 0
##$TI= <>
##$TILT= no
##$TM1= 0
##$TM2= 0
##$TOPLEV= 0
##$USERP1= <user>
##$USERP2= <user>
##$USERP3= <user>
##$USERP4= <user>
##$USERP5= <user>
##$WDW= 1
##$XDIM= 131072
##$YMAX_p= 288721423
##$YMIN_p= -457126854
##$CURPLOT= <Network HP LaserJet P1505>
##$CURPRIN= <$Network HP LaserJet P1505>
##$DFORMAT= <normdp>
##$LAYOUT= <+/1D_H.xwp>
##$LFORMAT= <normlp>
##$PFORMAT= <normpl>
##$SURQMSG= 1
$$ End of Bruker specific parameters
$$ ---------------------------------
##NTUPLES= NMR SPECTRUM
##VAR_NAME=  FREQUENCY,     SPECTRUM/REAL,   SPECTRUM/IMAG
##SYMBOL=    X,             R,               I
##VAR_TYPE=  INDEPENDENT,   DEPENDENT,       DEPENDENT
##VAR_FORM=  AFFN,          ASDF,            ASDF
##VAR_DIM=   131072,        131072,          131072
##UNITS=     HZ,            ARBITRARY UNITS, ARBITRARY UNITS
##FACTOR=    0.0627417313425164, 1,          1
##FIRST=     8223.62146879497, -768,         -58678
##LAST=      0,             1649,            -59035
##MIN=       0,             -457126854,      0
##MAX=       8223.62146879497, 288721423,    0
$$ Real data points
##PAGE= N=1
##DATA TABLE= (X++(R..R)), XYDATA
$$ [...]
$$ plain form
62749 1014390 967107 922765 882359 846196 813548 783263 754750 728288 704420 683327 664909
62738 664909 649163 636181 625778 617421 610608 605189 601221 598654 597318 597117 598029 599937 602626 606063
62724 606063 610529 616401 623905 633129 644145 656925 671276 687134 704886 725112 748003 773329
62712 773329 801160 832308 867733 907718 952013 1000724 1054679 1114877 1182020 1256769 1340011
62701 1340011 1432416 1533973 1644420 1764097 1893789 2033642 2182619 2339138 2501627 2667945
62691 2667945 2834565 2996932 3150596 3291588 3415825 3518877 3596672 3646211 3665605 3653975
62681 3653975 3611738 3540724 3443735 3324174 3186246 3034987 2875400 2711470 2546268 2382783
62671 2382783 2224108 2072699 1929862 1796098 1671690 1556895 1451879 1356689 1271132 1194526
$$ packed form
62749A014390m7283m4342m0406l6163l2648l0285k8513k6462k3868k1093j8418
62738F64909j5746j2982j0403q357o813n419l968k567j336k01R12J908K689L437
62724F06063M466N872P504R224J1016J2780J4351J5858J7752K0226K2891K5326
62712G73329K7831L1148L5425L9985M4295M8711N3955O0198O7143P4749Q3242
62701A340011R2405J01557J10447J19677J29692J39853J48977J56519J62489J66318
62691B667945J66620J62367J53664J40992J24237J03052P7795M9539J9394j1630
62681C653975m2237p1014r6989j19561j37928j51259j59587j63930j65202j63485
62671B382783j58675j51409j42837j33764j24408j14795j05016r5190q5557p6606
$$ plain form
62661 1194526 1125702 1063417 1006793 955400 909118 867926 831647 799753 771516 746343 723815
62650 723815 703395 684364 666184 648829 632674 618171 605620 595000 585879 577663 570143 563661
62638 563661 558552 554532 550897 547264 543869 541042 538579 535758 531871 526701 520587 514212 508290 503273
62624 503273 499167 495652 492433 489474 486892 484750 483128 482355 482833 484398 486052 486716 486345 486068 487062 489363
62608 489363 491933 493912 495648 498374 502893 508756 514892 520964 527794 536433 547080 559192 572435
62595 572435 587221 604415 624720 648282 674504 702195 730127 757572 784228 809722 833384
62584 833384 854411 871919 884837 892162 893616 889890 882093 870961 856573 838680 817332 793344
62572 793344 768172 743125 718677 694689 671195 648679 627680 608507 591308 575964 561838
$$ packed form
62661A194526o8824o2285n6624n1393m6282m1192l6279l1894k8237k5173k2528
62650G23815k0420j9031j8180j7355j6155j4503j2551j0620r121q216p520o482
62638E63661n109m020l635l633l395k827k463k821l887n170o114o375n922n017
62624E03273m106l515l219k959k582k142j622p73M78J565J654O64l71k77R94K301
62608D89363K570J979J736K726M519N863O136O072O830Q639J0647J2112J3243
62595E72435J4786J7194K0305K3562K6222K7691K7932K7445K6656K5494K3662
62584H33384K1027J7508J2918P325J454l726p797j1132j4388j7893k1348k3988
62572G93344k5172k5047k4448k3988k3494k2516k0999j9173j7199j5344j4126
$$ plain form
62561 561838 548198 535170 523794 514823 507850 501975 496936 493067 490453 488715 487491 486594 485758 484796
62547 484796 484077 484353 485909 488220 490632 493053 495806 499026 502472 505911 509540 513979 519736 526644 533985
62532 533985 541311 548962 557594 567444 578459 590969 605700 623039 642785 664790 689483 717574
62520 717574 749570 785816 826802 873158 925470 984173 1049443 1121106 1198826 1282359 1371220
62509 1371220 1463946 1558094 1651168 1741177 1826050 1903037 1969246 2022534 2061406 2084398 2090415
62498 2090415 2079803 2054491 2016869 1968999 1913105 1852216 1789739 1728522 1670629 1617807 1571717
62487 1571717 1533659 1504344 1484017 1472651 1470020 1475737 1489119 1508838 1532690 1557984 1582341 1604121
62475 1604121 1622066 1634709 1640277 1637197 1624654 1602658 1571566 1531550 1482626 1425310 1361207 1292785
$$ packed form
62561E61838j3640j3028j1376q971o973n875n039l869k614j738j224q97q36r62
62547D84796p19K76J556K311K412K421K753L220L446L439L629M439N757O908P341
62532E33985P326P651Q632R850J1015J2510J4731J7339J9746K2005K4693K8091
62520G17574L1996L6246M0986M6356N2312N8703O5270P1663P7720Q3533Q8861
62509A371220R2726R4148R3074R0009Q4873P6987O6209N3288L8872K2992O017
62498B090415j0612k5312l7622m7870n5894o0889o2477o1217n7893n2822m6090
62487A571717l8058k9315k0327j1366k631N717J3382J9719K3852K5294K4357K1780
62475A604121J7945J2643N568l080j2543k1996l1092m0016m8924n7316o4103o8422
$$ plain form
62463 1292785 1222449 1151894 1082265 1014681 950335 890201 834978 785290 741608 703750 670759
62452 670759 641581 615889 594027 576212 562009 550553 540977 532561 524806 517663 511570 507006 503960
62439 503960 501928 500379 499067 497977 497151 496635 496411 496291 495900 494895 493202 491077 488870 486676 484170
62424 484170 480888 476678 471844 466825 461925 457416 453644 450720 448210 445462 442258 438918 435717 432524
62410 432524 429167 425848 422932 420481 418259 416158 414340 412965 412025 411558 411797 412883 414487 415990 417132
62395 417132 418350 420288 423086 426340 429689 433109 436586 439908 443111 446844 451833 458055 464807 471552
62381 471552 478373 485629 493584 502354 511787 521306 530342 539066 548227 558050 567869 577208 586695 597356
62367 597356 609432 622560 636869 653155 672048 693710 718455 746980 779678 816238 856329
$$ packed form
62463A292785p0336p0555o9629o7584o4346o0134n5223m9688m3682l7858l2991
62452F70759k9178k5692k1862j7815j4203j1456r576q416p755p143o093m564l046
62439E03960k032j549j312j090q26n16k24j20l91j005j693k125k207k194k506
62424D84170l282m210m834n019m900m509l772k924k510k748l204l340l201l193
62410D32524l357l319k916k451k222k101j818j375r40m67K39J086J604J503J142
62395D17132J218J938K798L254L349L420L477L322L203L733M989O222O752O745
62381D71552O821P256P955Q770R433R519R036Q724R161R823R819R339R487J0661
62367E97356J2076J3128J4309J6286J8893K1662K4745K8525L2698L6560M0091
$$ plain form
62356 856329 900358 949091 1002541 1059386 1117426 1174454 1228771 1278981 1323505 1360632 1389275
62345 1389275 1409491 1421968 1427154 1425194 1416502 1401842 1381856 1356968 1327811 1295275 1260015 1222411
62333 1222411 1183157 1143387 1103930 1064944 1026661 990114 956554 926293 898444 871775 845595
62322 845595 819956 795234 771509 748300 725070 702028 680057 659754 640938 623394 607610
62311 607610 594269 583180 573270 563679 554525 546551 540238 535326 531081 527026 523393 520714 519010 517748
62297 517748 516683 516264 516861 518063 519207 520410 522488 525942 530392 535000 539084 542427 545346 548427 551893
62282 551893 555235 557743 559312 560450 561597 562803 564038 565495 567538 570478 574328 578638 582855 587169
62268 587169 592755 600840 611771 625314 641488 660484 682026 705700 732016 762430 798117 839200
$$ packed form
62356H56329M4029M8733N3450N6845N8040N7028N4317N0210M4524L7127K8643
62345A389275K0216J2477N186j960q692j4660j9986k4888k9157l2536l5260l7604
62333A222411l9254l9770l9457l8986l8283l6547l3560l0261k7849k6669k6180
62322H45595k5639k4722k3725k3209k3230k3042k1971k0303j8816j7544j5784
62311F07610j3341j1089r910r591r154p974o313m912m245m055l633k679j704j262
62297E17748j065m19N97J202J144J203K078L454M450M608M084L343K919L081L466
62282E51893L342K508J569J138J147J206J235J457K043K940L850M310M217M314
62268E87169N586Q085J0931J3543J6174J8996K1542K3674K6316L0414L5687M1083
$$ plain form
62256 839200 885297 936170 991454 1050171 1110868 1172006 1231983 1289062 1341478 1387536 1425709
62245 1425709 1455030 1475472 1487658 1492086 1488934 1478460 1461091 1437094 1406715 1370753 1330449 1286673
62233 1286673 1239837 1190870 1141661 1094071 1048882 1005998 965203 926365 889338 854208 821410
62222 821410 791288 763783 738803 716461 696601 678556 661805 646527 632988 620799 609387
62211 609387 598867 589790 582195 575572 569649 564589 560487 557294 555272 554844 555851 557522 559433 562007
62197 562007 565855 571076 577479 585079 593954 603802 613994 624113 634278 644971 656556 668846 681119
62184 681119 692761 703873 714961 725999 736167 744653 751368 756584 760257 762242 763067 763984 766160
62171 766160 770225 776779 786875 801569 821162 845245 873429 905652 941774 981241 1023181 1066361
$$ packed form
62256H39200M6097N0873N5284N8717O0697O1138N9977N7079N2416M6058L8173
62245A425709K9321K0442J2186M428l152j0474j7369k3997l0379l5962m0304m3776
62233A286673m6836m8967m9209m7590m5189m2884m0795l8838l7027l5130l2798
62222H21410l0122k7505k4980k2342j9860j8045j6751j5278j3539j2189j1412
62211F09387j0520r077p595o623n923n060m102l193k022m28J007J671J911K574
62197E62007L848N221O403P600Q875R848J0192J0119J0165J0693J1585J2290J2273
62184F81119J1642J1112J1088J1038J0168Q486O715N216L673J985Q25R17K176
62171G66160M065O554J0096J4694J9593K4083K8184L2223L6122L9467M1940M3180
$$ plain form
62159 1066361 1108869 1148353 1183008 1212147 1235534 1252562 1262571 1265633 1262363 1253120 1238103 1218132
62147 1218132 1194464 1167681 1137549 1104347 1069551 1034687 1000190 966130 933486 903777 877585
62136 877585 854280 833198 814389 798073 783999 771721 761075 752076 744576 738313 733286 729870
62124 729870 728531 729352 731846 735378 739866 745883 753901 763646 774416 785830 797872 810295 822325
62111 822325 832959 841305 846756 849285 849681 849191 848690 848220 847309 845582 843070 840084 836857 833329 829433
62096 829433 825622 822806 821537 821542 822415 824520 828655 834952 842704 851446 861728 874468 889850 907190
62082 907190 925782 945627 967318 991341 1017580 1045492 1074680 1105087 1136555 1168412 1199678
62071 1199678 1229525 1257352 1282615 1305007 1324779 1342576 1358974 1374434 1389645 1405431 1422121
$$ packed form
62159A066361M2508L9484L4655K9139K3387J7028J0009L062l270r243j5017j9971
62147A218132k3668k6783l0132l3202l4796l4864l4497l4060l2644k9709k6192
62136H77585k3305k1082j8809j6316j4074j2278j0646q999p500o263n027l416
62124G29870j339Q21K494L532M488O017Q018R745J0770J1414J2042J2423J2030
62111H22325J0634Q346N451K529L96m90n01m70r11j727k512k986l227l528l896
62096H29433l811k816j269NQ73K105M135O297P752Q742J0282J2740J5382J7340
62082I07190J8592J9845K1691K4023K6239K7912K9188L0407L1468L1857L1266
62071A199678K9847K7827K5263K2392J9772J7797J6398J5460J5211J5786J6690
$$ plain form
62060 1422121 1439207 1455749 1470978 1484465 1495937 1505071 1511427 1514542 1514239 1510797 1504655 1495908 1484181
62047 1484181 1468904 1449530 1425545 1396601 1362836 1324966 1283982 1240743 1195832 1149771 1103377
62036 1103377 1057822 1014113 972532 932867 895272 860446 828826 800158 774286 751874 733548
62025 733548 718614 705333 692531 680279 669011 658646 648802 639286 630107 621383 613360 606169 599478
62012 599478 592859 586556 581341 577512 574667 572692 572248 573845 577008 581007 585891 592075 599174 605999
61998 605999 611702 616263 619830 622167 622990 622377 620470 617019 611556 604007 594936 585150 575130 564814
61984 564814 553853 542098 529900 518036 507287 497913 489461 481250 473185 465934 460142 455702 452113
61971 452113 449329 447723 447222 447095 446828 446734 447312 448381 449335 450081 451243 453319 455943 458143 459287 459736
$$ packed form
62060A422121J7086J6542J5229J3487J1472R134O356L115l03l442o142q747j1727
62047A484181j5277j9374k3985k8944l3765l7870m0984m3239m4911m6061m6394
62036A103377m5555m3709m1581l9665l7595l4826l1620k8668k5872k2412j8326
62025G33548j4934j3281j2802j2252j1268j0365r844r516r179q724q023p191o691
62012E99478o619o303n215l829k845j975m44J597L163L999M884O184P099O825
61998F05999N703M561L567K337Q23o13j907l451n463p549r071r786j0020j0316
61984E64814j0961j1755j2198j1864j0749r374q452q211q065p251n792m440l589
61971D52113k784j606n01j27k67r4N78J069R54P46J162K076K624K200J144M49
$$ plain form
61955 459736 460570 462690 466143 470360 474903 479833 485469 492101 499962 509276 520223 533049 548187 565969
61941 565969 586162 608121 631516 656606 683601 712003 740782 768994 796137 822147 847227
61930 847227 871457 894333 914866 932278 946394 957232 964541 968052 967975 964830 958915 950262 939166
61917 939166 926523 913670 902047 892996 887574 886403 889670 897339 909358 925602 945482 967618
61905 967618 990134 1011526 1031123 1048513 1062795 1072768 1077660 1077222 1071261 1059841 1044038 1025740
61893 1025740 1006348 986135 965152 944114 923885 904596 885899 867834 850844 835086 820200
61882 820200 805673 791109 776271 761184 745980 730424 713974 696797 680384 666491 655588
61871 655588 646930 639964 634900 631835 630125 629129 629150 631132 635520 641738 648933 657127 667518 681482
$$ packed form
61955D59736Q34K120L453M217M543M930N636O632P861R314J0947J2826J5138J7782
61941E65969K0193K1959K3395K5090K6995K8402K8779K8212K7143K6010K5080
61930H47227K4230K2876K0533J7412J4116J0838P309L511p7l145n915q653j1096
61917I39166j2643j2853j1623r051n422j171L267P669J2019J6244J9880K2136
61905I67618K2516K1392J9597J7390J4282R973M892m38n961j1420j5803j8298
61893A025740j9392k0213k0983k1038k0229j9289j8697j8065j6990j5758j4886
61882H20200j4527j4564j4838j5087j5204j5556j6450j7177j6413j3893j0903
61871F55588q658o966n064l065j710r96K1J982M388O218P195Q194J0391J3964
$$ plain form
61857 681482 699341 720349 743971 770689 801242 835513 872736 912572 955267 1000736 1048094
61846 1048094 1096173 1143863 1189682 1231591 1267776 1297459 1320639 1337181 1346504 1348118 1342278 1330092
61834 1330092 1313189 1293344 1272376 1252277 1235149 1222827 1216448 1216336 1222066 1232538 1246255 1261848
61822 1261848 1278262 1294260 1307933 1317035 1319798 1315243 1302910 1282734 1255222 1221391 1182389 1139324
61810 1139324 1093405 1046046 998761 953084 910332 871093 835040 801601 770754 742819 717563
61799 717563 694147 672093 651849 634132 619012 605867 593964 582913 572779 563982 556887 551295
61787 551295 546454 541663 536722 531741 526831 522140 517969 514522 511618 508836 505969 503284 501338 500502
61773 500502 500593 501031 501464 502115 503352 505100 507000 509031 511560 514762 518402 522263 526442 531108 536313
$$ packed form
61857F81482J7859K1008K3622K6718L0553L4271L7223L9836M2695M5469M7358
61846A048094M8079M7690M5819M1909L6185K9683K3180J6542R323J614n840j2186
61834A330092j6903j9845k0968k0099j7128j2322o379j12N730J0472J3717J5593
61822A261848J6414J5998J3673R102K763m555j2333k0176k7512l3831l9002m3065
61810A139324m5919m7359m7285m5677m2752l9239l6053l3439l0847k7935k5256
61799G17563k3416k2054k0244j7717j5120j3145j1903j1051j0134q797p095n592
61787E51295m841m791m941m981m910m691m171l447k904k782k867k685j946q36
61773E00502R1M38M33O51J237J748J900K031K529L202L640L861M179M666N205
$$ plain form
61758 536313 542117 548505 555051 561064 566228 570684 574271 576162 575646 572980 569101 564780 560383 556089
61744 556089 551805 547045 541388 535092 528913 523417 518785 515144 512552 510693 509037 507476 506401 506052
61730 506052 506122 506211 506362 506884 507863 509135 510671 512755 515745 519747 524515 529562 534362 538498 541694 543805
61714 543805 544890 545226 545071 544276 542226 538303 532526 525760 519242 513736 509041 504319 498928 492919 486743
61699 486743 480708 474933 469687 465428 462360 460123 458054 455676 452871 449727 446356 442863 439367 436019
61685 436019 433005 430447 428275 426255 424204 422128 420135 418283 416632 415335 414462 413778 412907 411780 410703
61670 410703 409830 408825 407347 405718 404751 404780 405255 405508 405650 406397 408070 410179 412080 413737 415620 418022
61654 418022 420756 423500 426171 428856 431588 434436 437739 441931 447017 452401 457422 462005 466599 471556
$$ packed form
61758E36313N804O388O546O013N164M456L587J891n16k666l879m321m397m294
61744E56089m284m760n657o296o179n496m632l641k592j859j656j561j075l49
61730E06052P0Q9J51N22R79J272J536K084K990M002M768N047M800M136L196K111
61714E43805J085L36j55p95k050l923n777o766o518n506m695m722n391o009o176
61699D86743o035n775n246m259l068k237k069k378k805l144l371l493l496l348
61685D36019l014k558k172k020k051k076j993j852j651j297q73o84q71j127j077
61670D10703q73j005j478j629r67K9M75K53J42P47J673K109J901J657J883K402
61654D18022K734K744K671K685K732K848L303M192N086N384N021M583M594M957
$$ plain form
61640 471556 476771 481852 486351 489761 491606 491786 490663 488591 485537 481400 476605 471949 467825 463945
61626 463945 460021 456389 453540 451232 448608 445333 442194 440219 439483 439236 438986 438865 438887 438510 437247 435162
61610 435162 432246 427755 420910 412107 402748 393884 385634 377994 371442 366359 362352 358574 354437 349828
61596 349828 345019 340606 337132 334425 331633 328259 324791 322038 320264 319332 319173 319481 319383 318233 316596
61581 316596 315693 315856 316180 315827 314962 314197 313661 313056 312299 311657 311279 310836 309761 307895 305869 304633 304467
61564 304467 304727 304760 304744 305261 306330 307406 308224 309102 310414 312192 314235 316176 317508 318027 318259 318948 320085
61547 320085 320972 321308 321665 322739 324635 327036 329586 331926 333810 335501 337719 340998 345337 350417 355663
61532 355663 360046 362532 363098 362809 362608 362467 361937 360938 359595 357873 355904 354207 353025 351782 349785 347255
$$ packed form
61640D71556N215N081M499L410J845J80j123k072l054m137m795m656m124l880
61626D63945l924l632k849k308k624l275l139j975p36k47k50j21K2l77j263k085
61610D35162k916m491o845q803r359q864q250p640o552n083m007l778m137m609
61596C49828m809m413l474k707k792l374l468k753j774r32j59L08r8j150j637
61581C16596r03J63L24l53q65p65n36o05p57o42l78m43j075j866k026j236j66
61564C04467K60L3j6N17J069J076Q18Q78J312J778K043J941J332N19K32O89J137
61547C20085Q87L36L57J074J896K401K550K340J884J691K218L279M339N080N246
61532C55663M383K486N66k89k01j41n30r99j343j722j969j697j182j243j997k530
$$ plain form
61516 347255 345093 343848 343420 343575 344225 345232 346437 347813 349179 349869 349204 347380 345472 344434 344377 344831
61500 344831 345407 346039 346813 347709 348486 348838 348710 348338 347929 347484 347077 347014 347430 347941 347980 347379 346370 345205 344163
61481 344163 343848 345009 347809 351421 354448 355843 355583 354585 353868 353676 353514 352985 352240 351538 350761 349720 348588
61464 348588 347686 347063 346658 346654 347208 347970 348287 347916 347237 346841 347123 348086 349263 350023 350370 351216 353395 356539
61446 356539 359426 361368 362758 364290 366236 368600 371472 374983 379182 384017 389137 393767 397328 400256
61432 400256 403617 407719 411681 414687 417034 419426 421732 423211 423792 424368 425666 427470 429263 431191 433832
61417 433832 437163 440291 442342 443241 443326 442522 440393 436953 432919 428966 425146 421241 417327 413609 410000
61402 410000 406324 402731 399516 396674 394094 392028 390797 390052 388917 387043 385047 383765 383452 383879 384757
$$ packed form
61516C47255k162j245m28J55O50J007J205J376J366O90o65j824j908j038n7M54
61500C44831N76O32P74Q96P77L52j28l72m09m45m07o3M16N11L9o01j009j165j042
61481C44163l15J161K800L612L027J395k60r98p17j92j62n29p45p02p77j041j132
61464C48588r02o23m05mN54P62L17l71o79l96K82R63J177P60L47Q46K179L144
61446C56539K887J942J390J532J946K364K872L511M199M835N120M630L561K928
61432D00256L361M102L962L006K347K392K306J479N81N76J298J804J793J928K641
61417D33832L331L128K051Q99Q5q04k129l440m034l953l820l905l914l718l609
61402D10000l676l593l215k842k580k066j231p45j135j874j996j282l13M27Q78
$$ plain form
61387 384757 385824 386888 388053 389587 391340 392709 393452 394213 395833 398384 401227 403784 405906 407765 409821
61372 409821 412672 416401 420126 422701 423926 424690 425909 427779 430088 432734 435630 438567 441580 445220
61358 445220 450064 456077 462802 470105 478355 487865 498513 510029 522342 535357 548512 560810 571340
61345 571340 579751 586321 591686 596386 600565 604103 607046 609767 612545 615200 617359 618942 620012 620217
61331 620217 618840 615625 611221 606497 601607 596085 589773 583221 577086 571418 565829 560326 555717 553030
61317 553030 552534 553475 554814 556081 557423 559104 561303 564309 568496 574032 580920 589333 599470 610856
61303 610856 622194 632106 639685 644155 644629 640826 633713 624817 615047 604726 594457 585106 576854 569065
61289 569065 561387 554347 548539 543821 539838 536893 535686 536341 538229 540694 543539 546814 550548 554830
$$ packed form
61387C84757J067J064J165J534J753J369P43P61J620K551K843K557K122J859K056
61372D09821K851L729L725K575J225P64J219J870K309K646K896K937L013L640
61358D45220M844O013O725P303Q250R510J0648J1516J2313J3015J3155J2298J0530
61345E71340Q411O570N365M700M179L538K943K721K778K655K159J583J070K05
61331F20217j377l215m404m724m890n522o312o552o135n668n589n503m609k687
61317E53030m96R41J339J267J342J681K199L006M187N536O888Q413J0137J1386
61303F10856J1338R912P579M470M74l803p113q896r770j0321j0269r351q252p789
61289E69065p678p040n808m718l983k945j207O55J888K465K845L275L734M282
$$ plain form
61275 554830 559877 565830 572581 579921 587760 596092 604767 613404 621658 629611 637808 646798 656723 667525
61261 667525 679496 693217 708790 725394 741828 757303 771368 783278 791983 797005 799049 799395
61249 799395 798690 796521 792176 785607 777538 768817 759909 750949 741947 732808 723420 713999 705190 697493
61235 697493 690624 683788 676672 669869 664183 659793 656381 653820 652334 651961 652216 652481 652567 652699 652947 652895
61219 652895 652018 650343 648589 647559 647495 648133 649187 650431 651285 650816 648525 644987 641347 638324 636054 634805
61203 634805 635259 637808 642089 647731 655281 665836 679833 696722 715886 737191 760256 783605 805140
61190 805140 823353 837864 849017 857452 863981 869352 873874 877465 880059 881768 882655 882650 881726 879951 877316
61175 877316 873717 869087 863314 856152 847524 837882 827883 817748 807329 796717 786199 775515 763882
$$ packed form
61275E54830N047N953O751P340P839Q332Q675Q637Q254P953Q197Q990R925J0802
61261F67525J1971J3721J5573J6604J6434J5475J4065J1910Q705N022K044L46
61249G99395p05k169m345o569q069q721q908q960r002r139r388r421q809p697
61235F97493o869o836p116o803n686m390l412k561j486l73K55K65Q6J32K48n2
61219F52895q77j675j754j030o4O38J054J244Q54m69k291l538l640l023k270j249
61203F34805M54K549M281N642P550J0555J3997J6889J9164K1305K3065K3349K1535
61190H05140J8213J4511J1153Q435O529N371M522L591K594J709Q87nr24j775k635
61175H77316l599m630n773p162q628r642r999j0135j0419j0612j0518j0684j1633
$$ plain form
61162 763882 751038 737723 724784 712393 700584 689963 681241 674480 669522 666851 667249 670621 675806
61149 675806 681534 686994 691483 694187 694469 691899 685896 675994 662799 648201 634229 621869 611105
61136 611105 601708 593603 586754 581219 577352 575681 576419 579185 583288 588306 594377 601925 611159 621965
61122 621965 634268 648267 664143 681742 700767 721104 742666 765043 787704 810581 834135
61111 834135 858636 883533 907614 929779 949676 967708 984444 999942 1013625 1024688 1032383 1035945
61099 1035945 1034695 1028527 1018090 1004205 987272 967451 945209 921380 896851 872393 848570 825509
61087 825509 802964 780875 759636 739585 720655 702923 687001 673276 661071 649369 638214
61076 638214 628650 621315 615786 611359 607721 604728 602204 600227 599042 598497 598077 597712 598081 599870 603109
$$ packed form
61162G63882j2844j3315j2939j2391j1809j0621q722o761m958k671L98L372N185
61149F75806N728N460M489K704K82k570o003r902j3195j4598j3972j2360j0764
61136F11105r397q105o849n535l867j671P38K766M103N018O071P548R234J0806
61122F21965J2303J3999J5876J7599J9025K0337K1562K2377K2661K2877K3554
61111H34135K4501K4897K4081K2165J9897J8032J6736J5498J3683J1063P695L562
61099A035945j250o168j0437j3885j6933j9821k2242k3829k4529k4458k3823k3061
61087H25509k2545k2089k1239k0051j8930j7732j5922j3725j2205j1702j1155
61076F38214r564p335n529m427l638k993k524j977j185n45m20l65L69J789L239
$$ plain form
61061 603109 607412 612413 617841 623640 630175 637884 646566 655576 664875 675330 687654 701606 716676
61048 716676 733027 751223 771319 792758 815064 838253 862607 888315 915234 942841 970496
61037 970496 997912 1025333 1053253 1082110 1112147 1143249 1174876 1206523 1238307 1270858 1304618
61026 1304618 1339577 1375711 1413242 1452364 1492975 1534714 1577090 1619930 1664271 1712651 1767801
61015 1767801 1831003 1902284 1982014 2071441 2171754 2283803 2409319 2551804 2716230 2909140
61005 2909140 3139702 3419923 3763375 4184802 4701874 5336986 6117609 7076334 8249179
60996 8249179 9665784 11329320 13196945 15176282 17140370 18948967 20467739 21591804
60988 21591804 22279737 22582110 22633902 22600396 22606479 22694236 22824912 22903873 22804507 22393475
$$ packed form
61061F03109M303N001N428N799O535P709Q682R010R299J0455J2324J3952J5070
61048G16676J6351J8196K0096K1439K2306K3189K4354K5708K6919K7607K7655
61037I70496K7416K7421K7920K8857L0037L1102L1627L1647L1784L2551L3760
61026A304618L4959L6134L7531L9122M0611M1739M2376M2840M4341M8380N5150
61015A767801O3202P1281P9730Q9427J00313J12049J25516J42485J64426J92910
61005B909140K30562K80221L43452M21427N17072O35112P80623R58725J172845
60996H249179J416605J663536J867625J979337J964088J808597J518772J124065
60988B1591804O87933L02373N1792l3506O083Q7757J30676P8961r9366m11032
$$ plain form
60978 22393475 21570335 20311331 18685614 16828087 14889812 12999593 11249394 9693883
60970 9693883 8354179 7225351 6287544 5515606 4883718 4367314 3944780 3598085 3311761
60961 3311761 3072308 2869039 2694486 2543139 2410255 2292077 2186246 2091181 2005409 1927811
60951 1927811 1857878 1795080 1738232 1685765 1636326 1588874 1542490 1496402 1450027 1402983 1355320
60940 1355320 1307726 1261122 1215994 1172383 1130405 1090341 1052276 1016127 982075 950529 921634
60929 921634 895155 870776 848148 826774 806344 787101 769422 753179 737982 723895 711287
60918 711287 700108 689915 680526 672074 664492 657620 651720 647213 643959 641493 639867 639490 640205 641368
60904 641368 642829 644864 647043 648165 647626 645943 643642 640542 636561 632316 628329 624329 619883 615098
$$ packed form
60978B2393475q23140j259004j625717j857527j938275j890219j750199j555511
60970I693883j339704j128828r37807p71938o31888n16404m22534l46695k86324
60961C311761k39453k03269j74553j51347j32884j18178j05831r5065q5772p7598
60951A927811o9933o2798n6848n2467m9439m7452m6384m6088m6375m7044m7663
60940A355320m7594m6604m5128m3611m1978m0064l8065l6149l4052l1546k8895
60929I21634k6479k4379k2628k1374k0430j9243j7679j6243j5197j4087j2608
60918G11287j1179j0193r389q452p582o872n900m507l254k466j626l77P15J163
60904F41368J461K035K179J122n39j683k301l100l981m245l987m000m446m785
$$ plain form
60890 615098 610233 605233 600168 595536 591615 588050 584492 581038 577538 573145 567224 560197 552849 545313
60876 545313 537428 529637 522674 516586 510786 505008 499598 494959 491205 488279 485980 483958 482047 480445
60862 480445 479317 478455 477649 477082 477007 477321 477897 479004 480845 482928 484423 485012 484881 484074 482520 480704 479732
60845 479732 480415 482488 484827 486309 486481 485570 483911 481381 477610 472737 467660 463360 460209 457990 456200
60830 456200 454252 451904 449723 448677 448899 449326 448890 447603 446088 444623 443195 441973 441046 440058 438785
60815 438785 437707 437282 436976 435842 433826 431660 429602 427249 424628 422482 421194 420206 418797 416820 414386
60800 414386 411474 408239 405145 402443 399928 397495 395423 393753 391910 389412 386534 383813 381263 378647
60786 378647 376254 374786 374498 374898 375284 375209 374507 373345 372273 371750 371498 370699 369080 367469 366972 367854 369577
$$ packed form
60890F15098m865n000n065m632l921l565l558l454l500m393n921p027p348p536
60876E45313p885p791o963o088n800n778n410m639l754k926k299k022j911j602
60862D80445j128q62q06n67p5L14N76J107J841K083J495N89j31q07j554j816r72
60845D79732O83K073K339J482J72r11j659k530l771m873n077m300l151k219j790
60830D56200j948k348k181j046K22M27m36j287j515j465j428j222r27r88j273
60815D38785j078m25l06j134k016k166k058k353k621k146j288r88j409j977k434
60800D14386k912l235l094k702k515k433k072j670j843k498k878k721k550k616
60786C78647k393j468k88M00L86p5p02j162j072n23k52p99j619j611m97Q82J723
$$ plain form
60769 369577 371756 374533 377901 381237 383937 386321 389358 393436 397793 401331 403722 405515 407412 409667
60755 409667 412003 413830 414626 414406 413762 413221 412621 411399 409460 407496 406336 406207 406626 406767 405832 403391
60739 403391 399604 395073 390275 385262 380019 374951 370642 367199 364123 360993 357962 355339 352920 350205
60725 350205 347231 344740 343305 342709 342477 342642 343458 344561 345093 344778 344317 344400 344778 344675 343831 342692 341726
60708 341726 341034 340620 340640 341134 341766 342083 342051 342161 342910 344253 345711 347025 348479 350441 352780 355023 356992
60691 356992 358937 361034 363080 364845 366462 368271 370473 373081 376085 379516 383382 387532 391536 394813
60677 394813 397206 399324 401965 405141 408051 410109 411526 412713 413582 413781 413251 412058 409923 406466 401924
60662 401924 397224 393206 389935 386850 383539 380281 377836 376630 376244 375916 375412 375127 375307 375689 376004 376415
$$ packed form
60769C69577K179K777L368L336K700K384L037M078M357L538K391J793J897K255
60755D09667K336J827P96k20o44n41o00j222j939j964j160j29M19J41r35k441
60739D03391l787m531m798n013n243n068m309l443l076l130l031k623k419k715
60725C50205k974k491j435n96k32J65Q16J103N32l15m61Q3L78j03q44j139r66
60708C41726o92m14K0M94O32L17l2J10P49J343J458J314J454J962K339K243J969
60691C56992J945K097K046J765J617J809K202K608L004L431L866M150M004L277
60677C94813K393K118K641L176K910K058J417J187Q69J99n30j193k135l457m542
60662D01924m700m018l271l085l311l258k445j206l86l28n04k85J80L82L15M11
$$ plain form
60646 376415 377220 378421 379811 381092 381625 380550 377618 373714 370197 367817 366446 365493 364274 362353 360022
60631 360022 358272 357839 358429 359202 359768 360286 360833 361234 361428 361582 361853 362385 363335 364568 365498 365722 365642 365996
60613 365996 366908 367900 368734 369614 370563 371212 371411 371546 372058 372970 374013 374942 375656 376310 377300 378819 380499 381886
60595 381886 383248 385413 388797 393047 397708 402718 408068 413448 418488 422911 426294 428133 428430 427859 427039
60580 427039 425964 424472 422943 422079 422138 422817 423876 425572 428396 432592 438069 444749 452856 462725 474277
60565 474277 486916 500157 514179 529436 545718 561884 576437 588125 596087 599908 599775 596338
60553 596338 590352 582616 574058 565452 557074 549124 542492 538510 537745 539562 543157 548503 555983 565599
60539 565599 577104 590520 606038 623614 643170 664922 688895 714077 738532 760428 778681
$$ packed form
60646C76415Q05J201J390J281N33j075k932l904l517k380j371r53j219j921k331
60631C60022j750m33N90P73N66N18N47M01J94J54K71N32R50J233R30K24q0L54
60613C65996R12R92Q34Q80R49O49J99J35N12R12J043R29P14O54R90J519J680J387
60595C81886J362K165L384M250M661N010N350N380N040M423L383J839K97n71q20
60580D27039j075j492j529q64N9O79J059J696K824M196N477O680Q107R869J1552
60565D74277J2639J3241J4022J5257J6282J6166J4553J1688P962L821j33l437
60553E96338n986p736q558q606q378p950o632l982p65J817L595N346P480R616
60539E65599J1505J3416J5518J7576J9556K1752K3973K5182K4455K1896J8253
$$ plain form
60528 778681 792711 802100 806705 806770 802748 795195 784933 773045 760547 748188 736608 726389 717687
60515 717687 709997 702637 695543 689406 684930 682192 680850 680808 682320 685495 690094 696070 704035 714925
60501 714925 729326 747457 769690 796681 828971 866812 910445 960062 1015170 1074175 1134938
60490 1134938 1195728 1255524 1313511 1368405 1418173 1460277 1492332 1512750 1520809 1516179 1498638 1468318
60478 1468318 1426108 1373661 1313175 1247204 1178390 1109061 1041044 975843 914736 858583 807762
60467 807762 762432 722592 687694 656649 628728 604286 584080 567958 554705 543162 532839
60456 532839 523377 514144 504869 496168 488824 482839 477747 473573 470735 468953 466982 463796 459622 455511
60442 455511 452241 449915 448298 447074 445905 444528 442810 440624 437968 435430 434138 434752 436641 438426
$$ packed form
60528G78681J4030R389M605O5m022p553j0262j1888j2498j2359j1580j0219q702
60515G17687p690p360p094o137m476k738j342m2J512L175M599N976P965J0890
60501G14925J4401J8131K2233K6991L2290L7841M3633M9617N5108N9005O0763
60490A134938O0790N9796N7987N4894M9768M2104L2055K0418Q059m630j7541l0320
60478A468318m2210n2447o0486o5971o8814o9329o8017o5201o1107n6153n0821
60467H07762m5330l9840l4898l1045k7921k4442k0206j6122j3253j1543j0323
60456E32839r462r233r275q701p344n985n092m174k838j782j971l186m174m111
60442D55511l270k326j617j224j169j377j718k186k656k538j292O14J889J785
$$ plain form
60428 438426 439245 439169 438627 438002 437643 437610 437321 436093 434175 432675 432239 432392 432458 432507 432933 433664 434430 435447 437165
60409 437165 439457 441662 443411 444926 446493 448057 449446 450662 451820 452961 454026 455025 456243 458175
60395 458175 460982 464068 466598 468555 470775 473758 477030 480032 483012 486411 489886 492733 495020 497568
60381 497568 500970 505273 510373 515887 520815 524287 526797 529826 534046 538614 542468 545523 548185 550450
60367 550450 552100 553336 554570 555839 556884 557670 558446 559414 560592 561882 563169 564522 566387 569295 573263
60352 573263 577811 582728 588509 595833 604863 615178 626070 636623 645848 653117 658379 661823 663506
60339 663506 663413 661604 658124 652991 646476 639136 631437 623527 615516 607690 600290 593353 586921 581100 575742
60324 575742 570398 564855 559452 554632 550482 546985 544393 542947 542460 542631 543598 545756 549071 553153 558137
$$ packed form
60428D38426Q19p6n42o25l59l3k89j228j918j500m36J53O6M9M26P31P66J017J718
60409D37165K292K205J749J515J567J564J389J216J158J141J065R99J218J932
60395D58175K807L086K530J957K220K983L272L002K980L399L475K847K287K548
60381D97568L402M303N100N514M928L472K510L029M220M568L854L055K662K265
60367E50450J650J236J234J269J045P86P76R68J178J290J287J353J865K908L968
60352E73263M548M917N781P324R030J0315J0892J0553R225P269N262L444J683
60339F63506r3j809l480n133o515p340p699p910q011p826p400o937o432n821n358
60324E75742n344n543n403m820m150l497k592j446m87J71R67K158L315M082M984
$$ plain form
60309 558137 565071 575052 588142 603493 620533 639671 661600 686156 712243 738763 764972 789694
60297 789694 810785 826049 834423 835814 830124 817249 798062 774579 748918 722543 696594 672257
60285 672257 650423 631449 615479 602520 592005 582830 574234 566242 558982 552140 545458 539227 533690
60272 533690 528418 522942 517736 513835 511530 510036 508492 506804 505390 504484 503890 503232 502272 501030 499620
60257 499620 498043 496278 494590 493474 493125 493177 493117 492777 492295 491826 491439 491133 490816 490443 490193 490228 490248 489665 488366
60238 488366 486926 485947 485627 486105 487672 490296 493438 496724 500426 504904 509973 515241 520631 526065 531033
60223 531033 535053 538352 541567 545013 548705 552824 557606 562978 568794 575287 582733 590859 599121 607462
60209 607462 616231 625417 634530 643138 651006 657775 663180 667638 672004 676581 680887 684544 687829 691028
$$ packed form
60309E58137O934R981J3090J5351J7040J9138K1929K4556K6087K6520K6209K4722
60297G89694K1091J5264Q374J391n690j2875j9187k3483k5661k6375k5949k4337
60285F72257k1834j8974j5970j2959j0515r175q596p992p260o842o682o231n537
60272E33690n272n476n206l901k305j494j544j688j414r06n94o58r60j242j410
60257D99620j577j765j688j116l49N2o0l40m82m69l87l06l17l73k50L5K0n83j299
60238D88366j440r79l20M78J567K624L142L286L702M478N069N268N390N434M968
60223E31033M020L299L215L446L692M119M782N372N816O493P446Q126Q262Q341
60209F07462Q769R186R113Q608P868O769N405M458M366M577M306L657L285L199
$$ plain form
60195 691028 693712 695112 695054 694165 693180 692198 690652 687942 684071 679606 675010 670247 665160 659959 655050
60180 655050 650548 646265 642110 638200 634612 631270 628083 625054 622359 620356 619308 618909 618414 617425 616260
60165 616260 615257 614101 612300 609981 607773 606123 605187 605066 605604 606205 606529 607187 609004 611685 614029 615513
60149 615513 616895 619000 621613 623990 625914 627857 630417 633906 638176 642574 646341 649302 651976 654958
60135 654958 658506 662785 668024 674051 680063 685205 689255 692491 695094 696975 698058 698478 698545 698665 699256
60120 699256 700560 702496 704761 707084 709364 711534 713276 714002 713402 712038 711006 710705 710270 708638 705871
60105 705871 702861 699892 696226 691279 685556 680087 675339 671098 667160 663787 661524 660769 661435 662891 664344
60090 664344 665423 666406 667865 670143 673034 675748 677240 676957 675416 673878 673233 673225 672791 671006 667683 663182
$$ packed form
60195F91028K684J400n8q89r85r82j546k710l871m465m596m763n087n201m909
60180F55050m502m283m155l910l588l342l187l029k695k003j048l99m95r89j165
60165F16260j003j156j801k319k208j650r36j21N38O01L24O58J817K681K344J484
60149F15513J382K105K613K377J924J943K560L489M270M398L767K961K674K982
60135F54958L548M279N239O027O012N142M050L236K603J881J083M20O7J20N91
60120F99256J304J936K265K323K280K170J742P26o00j364j032l01m35j632k767
60105G05871l010k969l666m947n723n469m748m241l938l373k263p55O66J456J453
60090F64344J079R83J459K278K891K714J492k83j541j538o45qm34j785l323m501
$$ plain form
60074 663182 657874 651840 645063 637710 630094 622446 614921 607779 601195 594879 588305 581463 574924 568983
60060 568983 563261 557483 552119 547698 543999 540559 537627 535800 534954 534443 534340 535624 538911 543677 548987
60045 548987 554402 559938 565680 571803 578536 585708 592576 598378 602895 606336 608866 610335 610342 608597 605393
60030 605393 601573 597749 593710 588925 583453 577795 572004 565602 558415 550942 543765 537102 531006 525469
60016 525469 520191 514772 509280 504212 499736 495451 491006 486515 482243 478345 475011 472404 470312 468371
60002 468371 466799 466390 467604 470021 472791 475197 476759 477408 477755 478659 480363 482537 485168 488700 493150
59987 493150 497841 502292 506671 511123 515352 519194 522792 525751 526952 525842 523239 520229 516874 512697
59973 512697 507882 503175 499053 495710 493531 492726 492712 492576 492114 491839 492165 493063 494384 496003 497808 499902
$$ packed form
60074F63182n308o034o777p353p616p648p525p142o584o316o574o842o539n941
60060E68983n722n778n364m421l699l440k932j827q46n11j03J284L287M766N310
60045E48987N415N536N742O123O733P172O868N802M517L441K530J469Pj745l204
60030F05393l820l824m039m785n472n658n791o402p187p473p177o663o096n537
60016E25469n278n419n492n068m476m285m445m491m272l898l334k607k092j941
60002D68371j572m09J214K417K770K406J562O49L47R04J704K174K631L532M450
59987D93150M691M451M379M452M229L842L598K959J201j110k603l010l355m177
59973E12697m815m707m122l343k179q05j4j36m62k75L26Q98J321J619J805K094
$$ plain form
59957 499902 502509 505262 507027 507110 506289 505915 506189 506152 505242 504048 503369 503254 503234 502965 502279 500938 498637 495270
59939 495270 491212 487383 484747 483472 482795 481973 481110 480716 480885 481457 482754 485416 489545 494569 499981 505743
59923 505743 511929 518493 525523 533343 542158 551760 561580 570874 579017 585878 591801 597037 601468 605107
59909 605107 608463 611881 614912 616947 618211 619396 620437 620431 618793 615823 612055 607759 603258 599043 595305
59894 595305 591876 588896 586982 586447 586867 587780 589358 591929 595184 598413 601386 604552 608351 612652 616995
59879 616995 621226 625761 631138 637346 643713 649540 654651 659089 662509 664273 664117 662433 659840 656774
59865 656774 653450 649877 645938 641721 637708 634262 631041 627455 623698 620695 618850 617511 616019 614722
59851 614722 614398 615130 616472 618497 621936 627139 633576 640644 648446 657197 666022 673020 676764 677469 676507
$$ packed form
59957D99902K607K753J765Q3q21l74K74l7r10j194o79j15k0k69o86j341k301l367
59939D95270m058l829k636j275o77q22q63l94J69N72J297K662M129N024N412N762
59923E05743O186O564P030P820Q815R602R820R294Q143O861N923N236M431L639
59909F05107L356L418L031K035J264J185J041oj638k970l768m296m501m215l738
59894E95305l429k980j914n35M20R13J578K571L255L229K973L166L799M301M343
59879F16995M231M535N377O208O367N827N111M438L420J764j56j684k593l066
59865F56774l324l573l939m217m013l446l221l586l757l003j845j339j492j297
59851F14722l24P32J342K025L439N203O437P068P802Q751Q825O998L744P05r62
$$ plain form
59836 676507 675085 673765 672909 672851 673420 673809 673238 671504 668685 664740 659747 654150 648347 642325 636185 630620
59820 630620 626232 622593 618769 614744 611534 609735 608710 607500 605819 603711 600869 597055 592880 589518
59806 589518 587583 586701 586099 585272 584096 582720 581432 580395 579372 577877 575723 573306 571260 569794 568424
59791 568424 566387 563399 559966 556896 554526 552508 550348 547988 545794 544139 543094 542515 542350 542768 543850
59776 543850 545155 545922 545995 546396 548458 552321 556672 560210 563083 566585 571614 577784 583994 589566 594753
59761 594753 600351 606942 614397 621967 628888 635002 640850 647120 654051 661380 668783 676217 683820 691643
59747 691643 699585 707375 714484 720214 724192 726722 728381 729367 729535 728995 728233 727551 726891 726302 726080 726182
59731 726182 726004 725177 724216 723879 724177 724450 724196 723358 722069 720681 719870 720132 721232 722629 724296 726514 729020
$$ packed form
59836F76507j422j320q56n8N69L89n71j734k819l945m993n597n803o022o140n565
59820F30620m388l639l824m025l210j799j025j210j681k108k842l814m175l362
59806E89518j935q82o02q27j176j376j288j037j023j495k154k417k046j466j370
59791E68424k037k988l433l070k370k018k160k360k194j655j045n79j65M18J082
59776E43850J305P67P3M01K062L863M351L538K873L502N029O170O210N572N187
59761E94753N598O591P455P570O921O114N848O270O931P329P403P434P603P823
59747F91643P942P790P109N730L978K530J659R86J68n40p62o82o60n89k22J02
59731G26182j78q27r61l37K98K73k54q38j289j388q11K62J100J397J667K218K506
$$ plain form
59714 729020 731158 733012 735573 739475 744261 749301 754824 761465 769215 777466 785875 794566 803508 812192
59700 812192 820135 827374 834329 841289 848055 854005 858473 861184 862340 862314 861324 859417 856617 852957 848434
59685 848434 843050 836915 830263 823414 816699 810347 804371 798567 792574 785935 778267 769608 760587 752039
59671 752039 744351 737329 730699 724576 719349 715250 712155 709749 707791 706212 705049 704373 704286 704883 706104
59656 706104 707741 709828 712890 717340 722513 726808 729186 730212 731124 732120 732071 729840 725322 719100 711614
59641 711614 702977 693347 683188 673151 663715 654892 646359 638006 630253 623665 618409 614279 611026 608314
59627 608314 605532 602096 597871 593011 587495 581266 574658 568201 562075 556239 550995 546731 543044 538854
59613 538854 533706 528447 524313 521803 520734 520847 521878 523342 524764 526035 527268 528446 529411 530011 530132
$$ packed form
59714G29020K138J854K561L902M786N040N523O641P750Q251Q409Q691Q942Q684
59700H12192P943P239O955O960O766N950M468K711J156k6r90j907k800l660m523
59685H48434n384o135o652o849o715o352n976n804n993o639p668q659r021q548
59671G52039p688p022o630o123n227m099l095k406j958j579j163o76q7N97J221
59656G06104J637K087L062M450N173M295K378J026R12R96m9k231m518o222p486
59641G11614q637r630j0159j0037r436q823q533q353p753o588n256m130l253k712
59627F08314k782l436m225m860n516o229o608o457o126n836n244m264l687m190
59613E38854n148n259m134k510j069J13J031J464J422J271J233J178R65O00J21
$$ plain form
59598 530132 529846 529640 530162 531446 532728 533286 533197 533032 533146 533582 534336 535284 536070 536456 536595 536565 535867 533884
59580 533884 530753 527272 523918 520401 516315 511816 507486 503729 500499 497417 494046 490188 486098 482369
59566 482369 479509 477620 476492 475944 475938 476395 477001 477415 477697 478333 479654 481364 482935 484353 486091 488341
59550 488341 490771 493236 496277 500477 505601 510879 516127 522196 530186 540505 552804 566609 581758
59537 581758 598270 615959 634285 652496 669703 684702 696060 702933 706018 707385 709064 711854
59525 711854 715599 720237 726088 733195 740855 747990 753711 757304 757976 755056 748544 739178 727826 714926
59511 714926 700666 685510 670168 655032 640050 625350 611691 599920 590144 581815 574476 568036
59499 568036 562377 557301 553035 550256 549188 548999 548547 547612 547021 547637 549581 552425 555666 558853 561626
$$ packed form
59598E30132k86k06N22J284J282N58q9j65J14M36P54R48P86L86J39l0o98j983
59580E33884l131l481l354l517m086m499m330l757l230l082l371l858m090l729
59566D82369k860j889j128n48oM57O06M14K82O36J321J710J571J418J738K250
59550D88341K430K465L041M200N124N278N248O069P990J0319J2299J3805J5149
59537E81758J6512J7689J8326J8211J7207J4999J1358O873L085J367J679K790
59525G11854L745M638N851P107P660P135N721L593O72k920o512r366j1352j2900
59511G14926j4260j5156j5342j5136j4982j4700j3659j1771r776q329p339o440
59499E68036n659n076m266k779j068j89m52r35n91O16J944K844L241L187K773
$$ plain form
59484 561626 563988 566406 569334 572618 575627 578016 580146 582646 585727 589015 591900 593922 594989 595459
59470 595459 595926 596686 597452 597771 597601 597262 596961 596740 596806 597493 598924 601146 604528 609437 615451 621629 627831
59453 627831 635084 644135 654236 663906 672384 679656 685493 689299 690806 690247 687886 683902 678612 672312
59439 672312 664995 656692 647929 639430 631536 624446 618654 614542 611708 609356 607268 605843 605512 606715
59425 606715 610120 615924 623212 630962 639554 650307 663566 678345 693893 710461 728347 747274
59413 747274 766971 787138 806404 822477 833843 840332 841637 836723 825676 811010 796055 782866
59401 782866 772606 766751 766248 769935 775226 780191 783786 784380 779648 768452 751983 732810 713438
59388 713438 695717 680634 668203 658049 650264 645266 642890 642266 642731 644277 646952 650420 654278 658355
$$ packed form
59484E61626K362K418K928L284L009K389K130K500L081L288K885K022J067M70
59470E95459M67P60P66L19j70l39l01k21O6O87J431K222L382M909O014O178O202
59453F27831P253R051J0101R670Q478P272N837L806J507n59k361l984n290o300
59439F72312p317q303q763q499p894p090n792m112k834k352k088j425l31J203
59425F06715L405N804P288P750Q592J0753J3259J4779J5548J6568J7886J8927
59413G47274J9697K0167J9266J6073J1366O489J305m914j1047j4666j4955j3189
59401G82866j0260n855n03L687N291M965L595N94m732j1196j6469j9173j9372
59388G13438j7721j5083j2431j0154p785m998k376o24M65J546K675L468L858M077
$$ plain form
59374 658355 662476 666409 670234 674310 678655 682770 686364 689903 694035 698700 703198 707119 710923 715442
59360 715442 720989 727158 733512 740237 747912 756813 766745 777491 789046 801377 814416 828436 843926
59347 843926 860803 878150 895125 911754 928348 944373 958440 969439 977352 982902 986593 988164
59335 988164 986926 982672 976041 967756 957707 945348 930903 915486 899895 884099 868219 853220
59323 853220 840056 828723 818695 809674 801278 792653 783267 773742 765098 757468 750277 743360 737078
59310 737078 731494 726223 721040 715979 710961 705992 701578 698243 695851 694216 694197 697229 703600 712047 721257
59295 721257 730954 741127 750824 758233 761632 760055 753473 742746 729359 714978 701212 689400 680206
59282 680206 673477 668918 666736 667258 670101 674413 679928 687256 696984 708984 722612 737105 751729
$$ packed form
59374F58355M121L933L825M076M345M115L594L539M132M665M498L921L804M519
59360G15442N547O169O354O725P675Q901R932J0746J1555J2331J3039J4020J5490
59347H43926J6877J7347J6975J6629J6594J6025J4067J0999P913N550L691J571
59335I88164j238m254o631q285j0049j2359j4445j5417j5591j5796j5880j4999
59323H53220j3164j1333j0028r021q396q625r386r525q644p630p191o917o282
59310G37078n584n271n183n061n018m969m414l335k392j635j9L032O371Q447R210
59295G21257R697J0173R697P409L399j577o582j0727j3387j4381j3766j1812r194
59282F80206o729m559k182N22K843M312N515P328R728J2000J3628J4493J4624
$$ plain form
59269 751729 765997 779845 793263 805800 816796 825958 833122 837591 838441 835605 830064 822815 814212
59256 814212 804448 793986 783234 772309 761481 751418 742651 735061 728169 721722 715896 711162 708059
59243 708059 706843 707334 709292 712751 717534 722688 727092 730726 734662 739581 744859 749332 752399 754050
59229 754050 754336 753263 750966 747628 743375 738389 732902 726976 720577 713973 707728 702158 697076 692176
59215 692176 687366 682649 678003 673466 669088 664808 660691 657174 654639 652778 650934 649054 647642 646723
59201 646723 645588 643863 642115 640956 640153 639197 638318 638320 639665 642194 645578 649584 653949 658355 662494 666096
59185 666096 669076 671884 675337 679789 684619 688882 692307 695394 698660 702161 705712 709272 713024 717251
59171 717251 722227 728168 735210 743341 752242 761295 769894 777811 785125 791859 797825 802700 806018 807161
$$ packed form
59269G51729J4268J3848J3418J2537J0996R162P164M469Q50k836n541p249q603
59256H14212r764j0462j0752j0925j0828j0063q767p590o892o447n826m734l103
59243G08059j216M91J958L459M783N154M404L634L936M919N278M473L067J651
59229G54050K86j073k297l338m253m986n487n926o399o604o245n570n082m900
59215F92176m810m717m646m537m378m280m117l517k535j861j844j880j412r19
59201F46723j135j725j748j159q03r56q79KJ345K529L384M006M365M406M139L602
59185F66096K980K808L453M452M830M263L425L087L266L501L551L560L752M227
59171G17251M976N941P042Q131Q901R053Q599P917P314O734N966M875L318J143
$$ plain form
59157 807161 805699 801797 796050 788902 780400 770456 759095 746537 733351 720448 708487 697267 686085
59144 686085 674709 663661 653507 644310 635854 627996 620636 613705 607402 602105 597890 594441 591622
59131 591622 589842 589594 590786 592796 595153 598077 602276 608183 615436 623311 631686 641219 652384 664799
59117 664799 677866 691625 706390 721913 737635 753516 769765 785880 800852 814441 827360
59106 827360 839959 851523 861301 869492 876683 882770 887040 889080 889138 887679 884932 880917 875858 870576
59092 870576 866181 863111 860675 858038 855403 853590 852565 851169 848391 844158 838640 831524 822417 811511
59078 811511 799480 787031 774725 762816 751097 739283 727566 716392 705774 695528 686164 678643
59066 678643 672955 667724 661659 654724 647569 640553 633862 627904 622861 618244 613498 608758 604587 601232
$$ packed form
59157H07161j462l902n747p148q502r944j1361j2558j3186j2903j1961j1220j1182
59144F86085j1376j1048j0154r197q456p858p360o931o303n297m215l449k819
59131E91622j780k48J192K010K357K924M199N907P253P875Q375R533J1165J2415
59117F64799J3067J3759J4765J5523J5722J5881J6249J6115J4972J3589J2919
59106H27360J2599J1564R778Q191P191O087M270K040N8j459k747m015n059n282
59092H70576m395l070k436k637k635j813j025j396k778m233n518p116r107j0906
59078H11511j2031j2449j2306j1909j1719j1814j1717j1174j0618j0246r364p521
59066F78643n688n231o065o935p155p016o691n958n043m617m746m740m171l355
$$ plain form
59052 601232 598546 596337 594407 592441 590229 587843 585542 583717 582924 583440 584739 585952 586969 588522 591104
59037 591104 594461 598271 602465 606709 610499 614189 619013 625543 633030 640930 650092 661619 675313 690363
59023 690363 706939 725881 747060 769063 790436 810275 827666 841546 851501 858160 862550 865281
59011 865281 866456 866114 864770 863499 863184 863611 863839 863716 864404 866984 871140 875802 880427 884885 888516 890300
58995 890300 889813 887327 883022 876796 868757 859245 848398 836260 823357 810640 798755 787700 777182
58982 777182 766985 757161 748214 740993 736074 733319 732284 732772 734722 737897 742091 747430 754042 761661
58968 761661 769865 778488 787474 796641 805886 815209 824224 832046 838112 842589 845529 846192 843861 838837
58954 838837 831847 822848 811289 797360 782208 766957 752157 738031 724587 711566 698924 687359
$$ packed form
59052F01232k686k209j930j966k212k386k301j825p93N16J299J213J017J553K582
59037E91104L357L810M194M244L790L690M824O530P487P900R162J1527J3694J5050
59023F90363J6576J8942K1179K2003K1373J9839J7391J3880R955O659M390K731
59011H65281J175l42j344j271l15M27K28j23O88K580M156M662M625M458L631J784
58995H90300m87k486m305o226q039r512j0847j2138j2903j2717j1885j1055j0518
58982G77182j0197r824q947p221m919k755j035M88J950L175M194N339O612P619
58968G61661Q204Q623Q986R167R245R323R015P822O066M477K940O63k331n024
58954H38837o990q999j1559j3929j5152j5251j4800j4126j3444j3021j2642j1565
$$ plain form
58942 687359 677813 670522 664967 660548 656799 653240 649787 647149 646098 646334 646719 646559 645973 645013 643207
58927 643207 640182 636137 631466 626361 621005 615827 611347 607882 605315 602955 599877 595827 591642 588432
58913 588432 586509 585508 585349 586510 589417 594031 600045 607111 614983 623745 633779 645157 657243 669186
58899 669186 680607 691542 702131 712834 724540 737779 751999 766164 779946 793853 808443
58888 808443 823986 840648 858257 875954 892643 907769 921264 932878 942091 948549 952107 952622
58876 952622 950183 945318 938501 929744 919202 907867 896921 886612 876446 866279 856446 846907 837043
58863 837043 826425 815218 803752 792174 780474 768453 755833 742838 730394 719238 709135
58852 709135 699589 690958 684040 678757 674096 669244 664021 658308 651984 645415 639179 633181 626743 619668
$$ packed form
58942F87359r546p291n555m419l749l559l453k638j051K36L85j60n86r60j806
58927F43207l025m045m671n105n356n178m480l465k567k360l078m050m185l210
58913E88432j923j001j59J161K907M614O014P066P872Q762J0034J1378J2086J1943
58899F69186J1421J0935J0589J0703J1706J3239J4220J4165J3782J3907J4590
58888H08443J5543J6662J7609J7697J6689J5126J3495J1614R213O458L558N15
58876I52622k439m865o817q757j0542j1335j0946j0309j0166j0167r833r539r864
58863H37043j0618j1207j1466j1578j1700j2021j2620j2995j2444j1156j0103
58852G09135r546q631o918n283m661m852n223n713o324o569o236n998o438p075
$$ plain form
58838 619668 612511 605752 599387 593491 588523 584893 582708 581957 582427 583464 584346 584955 585640 586538 587546 588730
58822 588730 590130 591359 592029 592437 593126 593940 594247 593902 593200 592115 590513 588996 588453 588761 588924 588638 588656
58805 588656 589330 589769 588940 586899 584505 582449 580875 579458 577651 575239 572708 570665 568992 567128 565090
58790 565090 563517 562816 562850 563458 564639 566395 569075 573534 580122 587758 595029 601996 609790 618532 626915
58775 626915 633858 639297 643197 645124 645192 644170 642139 638146 631761 623989 616054 608199 600261 592596 585796
58760 585796 580139 575775 572825 570932 569442 568353 568353 569717 571972 574852 578559 582775 586519 589491 592558
58745 592558 596399 600772 605639 611851 619773 628240 635861 642692 649754 657553 665962 674973 684622 694565
58731 694565 704434 714260 723931 732610 739313 743737 746124 746813 746373 745577 744713 743465 741923 741082 741735 743507
$$ packed form
58838F19668p157o759o365n896m968l630k185p51M70J037Q82O09O85Q98J008J184
58822E88730J400J229O70M08O89Q14L07l45p02j085j602j517n43L08J63k86J8
58805E88656O74M39q29k041k394k056j574j417j807k412k531k043j673j864k038
58790E65090j573p01L4O08J181J756K680M459O588P636P271O967P794Q742Q383
58775F26915O943N439L900J927O8j022k031l993o385p772p935p855p938p665o800
58760E85796n657m364k950j893j490j089%J364K255K880L707M216L744K972L067
58745E92558L841M373M867O212P922Q467P621O831P062P799Q409R011R649R943
58731F94565R869R826R671Q679O703M424K387O89m40p96q64j248j542q41O53J772
$$ plain form
58715 743507 745570 747706 750011 752132 753539 754110 753739 751824 747729 741395 732917 722028 708634 693380
58701 693380 676994 659448 640488 620664 601132 582649 565420 549675 535752 523645 512978
58690 512978 503487 495221 488375 483062 479071 475715 472186 468191 463950 459649 455392 451647 449068 447700
58676 447700 447049 446970 447737 449165 450664 452431 455545 460427 466228 472341 479450 488249 498027 507496 516403
58661 516403 525313 534174 541927 547277 549316 547785 543376 537393 530649 523039 514546 506025 498427 491837
58647 491837 485836 480270 475156 470368 465961 462248 459097 455844 452439 449921 449103 449445 449924 450309 450851
58632 450851 451351 451462 451390 451501 451670 451695 451884 452483 453026 452987 452612 452395 452310 452325 453216 456010 460909 467368 474726
58613 474726 482149 488554 493498 497735 502146 506554 510343 513657 517046 520329 522760 524096 524676 524729 524326
$$ packed form
58715G43507K063K136K305K121J407N71l71j915m095o334q478j0889j3394j5254
58701F93380j6386j7546j8960j9824j9532j8483j7229j5745j3923j2107j0667
58690E12978r491q266o846n313l991l356l529l995m241m301m257l745k579j368
58676D47700o51p9P67J428J499J767L114M882N801O113P109Q799R778R469Q907
58661E16403Q910Q861P753N350K039j531m409n983o744p610q493q521p598o590
58647D91837o001n566n114m788m407l713l151l253l405k518q18L42M79L85N42
58632D50851N00J11p2J11J69K5J89N99N43l9l75k17q5J5Q91K794M899O459P358
58613D74726P423O405M944M237M411M408L789L314L389L283K431J336N80N3m03
$$ plain form
58598 524326 523791 523421 522998 522222 521355 520856 520845 521510 523640 527969 534341 542155 551252 561727 573278 585445
58582 585445 598100 611045 623583 635143 645900 656099 665330 673291 680752 688844 697757 706985 716537
58569 716537 727132 739532 754434 772632 794456 819292 846295 875178 905606 936226 965213
58558 965213 991546 1015038 1035402 1051939 1063898 1070652 1071963 1068662 1062527 1054871 1045717 1034875 1023047
58545 1023047 1011043 998565 984593 968393 949457 927250 902049 875337 848344 820804 792245
58534 792245 763844 737740 714927 694988 677536 662699 650389 640144 631640 624582 618454 613104
58522 613104 609108 606685 604885 602754 600685 599514 598928 597956 596523 595244 594052 592285 589814 586959 583640
58507 583640 579763 576055 573359 571428 569576 568021 567330 566975 565849 563972 562379 561536 561131 561154 561855 562854
$$ packed form
58598E24326n35l70m23p76q67m99j1O65K130M329O372P814R097J0475J1551J2167
58582E85445J2655J2945J2538J1560J0757J0199R231P961P461Q092Q913R228R552
58569G16537J0595J2400J4902J8198K1824K4836K7003K8883L0428L0620K8987
58558I65213K6333K3492K0364J6537J1959O754J311l301o135p656r154j0842j1828
58545A023047j2004j2478j3972j6200j8936k2207k5201k6712k6993k7540k8559
58534G92245k8401k6104k2813j9939j7452j4837j2310j0245q504p058o128n350
58522F13104l996k423j800k131k069j171n86r72j433j279j192j767k471k855l319
58507E83640l877l708k696j931j852j555o91l55j126j877j593q43m05K3P01R99
$$ plain form
58491 562854 563664 564954 567993 572981 579254 586930 596889 609175 622923 638015 655396 675411 696981
58478 696981 718765 740128 760669 779607 795866 808163 815185 816401 812594 804956 794062 780426
58466 780426 765413 750507 736209 722713 711120 702702 697476 694794 694933 698705 705880 715389 726740
58453 726740 739778 753337 765530 775214 781893 784594 782373 775696 765924 753655 739035 723326 708523
58440 708523 695503 683989 674106 666413 660694 656294 653525 653189 654937 657746 661779 668134 676899 687174
58426 687174 698750 712035 726390 740327 753219 765060 774736 780505 782116 780569 775996 767891 757318
58413 757318 746493 735905 724140 710882 697838 686158 675145 664268 654405 646261 639399 633641
58401 633641 629724 627864 627277 627739 630002 634054 638559 642683 646924 651625 656147 659948 662994 664805 664795
$$ packed form
58491E62854Q10J290L039M988O273P676R959J2286J3748J5092J7381K0015K1570
58478F96981K1784K1363K0541J8938J6259J2297P022J216l807p638j0894j3636
58466G80426j5013j4906j4298j3496j1593q418n226k682J39L772P175R509J1351
58453G26740J3038J3559J2193R684O679K701k221o677r772j2269j4620j5709j4803
58440G08523j3020j1514r883p693n719m400k769l36J748K809M033O355Q765J0275
58426F87174J1576J3285J4355J3937J2892J1841R676N769J611j547m573q105j0573
58413G57318j0825j0588j1765j3258j3044j1680j1013j0877r863q144o862n758
58401F33641l917j860n87M62K263M052M505M124M241M701M522L801L046J811j0
$$ plain form
58386 664795 663807 663510 663958 663651 662329 661634 662421 663584 664311 665535 668170 671665 675213 678852 682675 686527
58370 686527 691109 697652 705933 714297 722198 730951 741408 752792 764436 776703 789399 801166 811326
58357 811326 820563 829085 835869 840453 843622 845686 845992 844836 843873 843815 843633 842823 842521 843625 845805 849200
58341 849200 854986 863314 872675 882300 893256 906215 920107 933955 948203 963203 978166 992357
58329 992357 1005553 1016775 1024633 1029526 1033310 1036237 1036632 1034244 1031350 1029565 1028138 1026357 1025093 1024888
58315 1024888 1025136 1026286 1030226 1037281 1045455 1053791 1063696 1075612 1087366 1097526 1107654 1119477 1132424
58302 1132424 1145641 1159782 1174925 1189214 1201523 1213139 1225155 1236604 1246867 1257379 1269152
58291 1269152 1281057 1292378 1304639 1319101 1334775 1350582 1367097 1384612 1401970 1418803 1436402
$$ packed form
58386F64795r88k97M48l07j322o95P87J163P27J224K635L495L548L639L823L852
58370F86527M582O543Q281Q364P901Q753J0457J1384J1644J2267J2696J1767J0160
58357H11326R237Q522O784M584L169K064L06j156r63n8j82q10l02J104K180L395
58341H49200N786Q328R361R625J0956J2959J3892J3848J4248J5000J4963J4191
58329I92357J3196J1222P858M893L784K927L95k388k894j785j427j781j264k05
58315A024888K48J150L940P055Q174Q336R905J1916J1754J0160J0128J1823J2947
58302A132424J3217J4141J5143J4289J2309J1616J2016J1449J0263J0512J1773
58291A269152J1905J1321J2261J4462J5674J5807J6515J7515J7358J6833J7599
$$ plain form
58280 1436402 1454986 1472956 1490148 1508809 1529994 1552299 1575602 1602452 1634021 1668397 1704743
58269 1704743 1745254 1790872 1839065 1888289 1940647 1997481 2056220 2114406 2172971 2232657 2291058
58258 2291058 2346211 2399443 2451734 2501141 2546706 2590969 2635801 2680040 2724176 2772612 2827820
58247 2827820 2886952 2947826 3013354 3086172 3163941 3244442 3330455 3424982 3526310 3632434 3745601
58236 3745601 3867827 3996847 4131312 4274876 4430147 4593990 4764109 4944782 5140480
58227 5140480 5349507 5569841 5805398 6060268 6332813 6622125 6934302 7275401 7644419
58218 7644419 8040359 8469705 8939640 9451002 10005983 10615524 11290856 12035677 12855623
58209 12855623 13767201 14788327 15929909 17207848 18654242 20306618 22198600 24375652
$$ packed form
58280A436402J8584J7970J7192J8661K1185K2305K3303K6850L1569L4376L6346
58269A704743M0511M5618M8193M9224N2358N6834N8739N8186N8565N9686N8401
58258B291058N5153N3232N2291M9407M5565M4263M4832M4239M4136M8436N5208
58247B827820N9132O0874O5528P2818P7769Q0501Q6013R4527J01328J06124J13167
58236C745601J22226J29020J34465J43564J55271J63843J70119J80673J95698
58227E140480K09027K20334K35557K54870K72545K89312L12177L41099L69018
58218G644419L95940M29346M69935N11362N54981O09541O75332P44821Q19946
58209A2855623R11578J021126J141582J277939J446394J652376J891982K177052
$$ plain form
58201 24375652 26910814 29895282 33432438 37663050 42787485 49051531 56734188 66176900
58193 66176900 77809859 92120099 109581003 130542497 154984444 182139181 210283769
58186 210283769 237021711 259921843 277012717 286890119 288721423 282448517 269012132
58179 269012132 250212281 228193418 204922950 181920784 160184002 140203015 122089644
58172 122089644 105798678 91290418 78537457 67466852 57957541 49875110 43073572
58165 43073572 37380088 32614156 28621677 25275782 22458887 20067308 18026777 16284160
58157 16284160 14787828 13489514 12357383 11370666 10504762 9733724 9042186 8422148 7861665
58148 7861665 7347520 6874942 6444079 6050044 5685706 5350423 5046703 4771339 4518288
$$ packed form
58201B4375652K535162K984468L537156M230612N124435O264046P682657R442712
58193F6176900J1632959J4310240J7460904K0961494K4441947K7154737K8144588
58186B10283769K6737942K2900132J7090874R877402J831304o272906j3436385
58179B69012132j8799851k2018863k3270468k3002166k1736782j9980987j8113371
58172A22089644j6290966j4508260j2752961j1070605r509311q082431o801538
58165D3073572n693484m765932l992479l345895k816895k391579k040531j742617
58157A6284160j496332j298314j132131r86717q65904p71038o91538o20038n60483
58148G861665n14145m72578m30863l94035l64338l35283l03720k75364k53051
$$ plain form
58139 4518288 4286899 4078811 3889782 3712680 3545898 3391188 3245891 3104911 2968139
58130 2968139 2838788 2716409 2598176 2485063 2380176 2282748 2189901 2102544 2023560 1951795
58120 1951795 1883555 1818491 1758487 1702347 1647054 1592955 1542506 1495107 1448179 1402160 1359667
58109 1359667 1320727 1283265 1247112 1213294 1180741 1148121 1117664 1092775 1072860 1054526 1036636
58098 1036636 1020154 1004308 987175 969159 951904 934797 916337 897877 882022 868227 853852
58087 853852 838729 824826 812153 798833 784669 770963 757222 741535 723962 706365 689301
58076 689301 672009 654840 638698 622796 605963 589447 575431 563525 551795 540355 530755 522531
58064 522531 513751 504540 496874 491151 485930 480724 476104 471427 465388 458578 452713 447586 441511 434439
$$ packed form
58139D518288k31389k08088j89029j77102j66782j54710j45297j40980j36772
58130B968139j29351j22379j18233j13113j04887r7428r2847q7357p8984p1765
58120A951795o8240o5064o0004n6140n5293n4099n0449m7399m6928m6019m2493
58109A359667l8940l7462l6153l3818l2553l2620l0457k4889j9915j8334j7890
58098A036636j6482j5846j7133j8016j7255j7107j8460j8460j5855j3795j4375
58087H53852j5123j3903j2673j3320j4164j3706j3741j5687j7573j7597j7064
58076F89301j7292j7169j6142j5902j6833j6516j4016j1906j1730j1440r600q224
58064E22531q780r211p666n723n221n206m620m677o039o810n865n127o075p072
$$ plain form
58050 434439 427889 422161 416367 410919 407179 404807 402087 398739 395863 393382 390131 386289 383102 380362
58036 380362 376692 372179 368152 364500 359761 353873 348305 343422 338068 331824 325440 319106 312508 306450
58022 306450 302119 298828 294771 289914 285849 282935 279981 276692 274036 272089 269838 267294 265618 265058
58008 265058 264783 264742 265512 266410 266028 264665 263984 264299 264473 264428 265266 266772 267303 266551 266117 266936 268304 269816
57990 269816 271999 274602 276409 277286 278379 279899 280690 280342 279616 278482 275936 272202 268905 266479 263584
57975 263584 259744 256392 254522 253346 252142 251453 251514 251331 250288 249081 248163 246931 245230 244063 243920 243855
57959 243855 243014 241671 240144 238185 236106 234911 234568 233615 231260 228481 226385 224953 224157 224753 227075
57944 227075 230279 233608 237290 241591 246255 251412 257705 264947 272062 278912 286739 296139 305965 314844
$$ packed form
58050D34439o550n728n794n448l740k372k720l348k876k481l251l842l187k740
58036C80362l670m513m027l652m739n888n568m883n354o244o384o334o598o058
58022C06450m331l291m057m857m065k914k954l289k656j947k251k544j676n60
58008B65058k75m1P70Q98l82j363o81L15J74m5Q38J506N31p52m34Q19J368J512
57990B69816K183K603J807Q77J093J520P91l48p26j134k546l734l297k426k895
57975B63584l840l352j870j176j204o89O1j83j043j207r18j232j701j167j43o5
57959B43855q41j343j527j959k079j195l43r53k355k779k096j432p96N96K322
57944B27075L204L329L682M301M664N157O293P242P115O850P827R400R826Q879
$$ plain form
57930 314844 322318 327929 330804 331071 330188 328932 326388 321780 315871 309609 302775 295088 287369 280531 274472
57915 274472 268954 264457 261194 258387 255558 253485 252930 253435 254314 255750 257836 259576 260091 259926 260008 260041
57899 260041 259123 257317 255473 253961 252636 251665 251436 251913 252757 253856 255213 256664 258089 259473 260474
57884 260474 260601 260040 259476 258833 257175 254288 251237 248736 246020 242198 237781 233945 231043 228745 227114
57869 227114 226653 227643 229956 233086 236077 238138 239788 242609 247444 253617 260266 267387 275026 282578 289678
57854 289678 296799 304100 310574 315253 318419 320721 321924 321529 319861 317429 313863 308602 302177 295749
57840 295749 289718 283701 277554 271518 265645 259955 254928 251054 248151 245772 244006 243153 242889 242476 241655
57825 241655 240722 239917 239247 238703 238191 237499 236710 236290 236282 235834 234008 230795 226869 222746 218592 214491 210354
$$ packed form
57930C14844P474N611K875K67q83j256k544m608n909o262o834p687p719o838o059
57915B74472n518m497l263k807k829k073n55N05Q79J436K086J740N15j65Q2L3
57899B60041r18j806j844j512j325r71k29M77Q44J099J357J451J425J384J001
57884B60474J27n61n64o43j658k887l051k501k716l822m417l836k902k298j631
57869B27114m61R90K313L130K991K061J650K821M835O173O649P121P639P552P100
57854B89678P121P301O474M679L166K302J203l95j668k432l566n261o425o428
57840B95749o031o017o147o036n873n690n027l874k903k379j766q53k64m13q21
57825B41655r33q05o70n44n12o92p89m20qm48j826l213l926m123m154m101m137
$$ plain form
57808 210354 205856 200868 195670 190419 184862 178944 173293 168679 165314 163020 161661 161102 161154 161871 163481
57793 163481 165786 168122 170240 172717 176287 181198 187295 194080 200591 206044 210909 216515 223348 230561
57779 230561 237347 243735 249644 254379 257738 260563 263438 265775 266981 267462 267551 266398 263063 257931 251986
57764 251986 245338 237602 229133 220733 212554 204393 196677 190140 184797 180233 176630 174612 174297 175299
57750 175299 177317 179940 182336 184075 185893 188715 192245 195480 198245 201108 203997 206059 206887 206965 206863
57735 206863 206880 207442 208906 210878 212530 213712 215055 216908 218896 220587 221875 222587 222418 221505 220588 220336
57719 220336 220757 221275 221061 219432 216286 212112 207376 202179 196743 191705 187383 183151 178188 172586 167110
57704 167110 162250 158107 154877 152651 150955 149241 147743 147139 147476 148055 148269 147907 146789 144760 142059
$$ packed form
57808B10354m498m988n198n251n557n918n651m614l365k294j359n59N2P17J610
57793A63481K305K336K118K477L570M911O097O785O511N453M865N606O833P213
57779B30561O786O388N909M735L359K825K875K337J206M81Q9j153l335n132n945
57764B51986o648p736q469q400q179q161p716o537n343m564l603k018l15J002
57750A75299K018K623K396J739J818K822L530L235K765K863K889K062Q28P8j02
57735B06863J7N62J464J972J652J182J343J853J988J691J288P12j69r13r17k52
57719B20336M21N18k14j629l146m174m736n197n436n038m322m232m963n602n476
57704A67110m860m143l230k226j696j714j498o04L37N79K14l62j118k029k701
$$ plain form
57689 142059 139163 136336 133787 132013 131312 131236 131183 131426 132828 135675 139545 144378 150975 160348 173117
57674 173117 189654 210404 236093 268030 307988 357037 414227 476608 540253 600872 653683
57663 653683 693564 715768 716896 696109 656199 603104 543477 482415 423357 369081 321658 281745
57651 281745 248916 222618 202085 185740 171912 160170 151018 144275 138768 133787 129827 127477 126357
57638 126357 125555 124584 123553 122823 122718 123202 123699 123576 122835 121959 121163 120196 118821 117023 114885 112677 110819
57621 110819 109242 107136 103961 100353 97212 94333 90960 87415 84879 83575 82452 80925 79697 79405
57607 79405 79534 79268 78517 77492 76171 74818 74239 74699 75149 74271 71871 68706 65414 62275 59551 57254
57591 57254 54786 51510 47617 43893 40739 37873 35000 32251 29857 27686 25294 22390 19194 16284
$$ packed form
57689A42059k896k827k549j774p01p6n3K43J402K847L870M833O597R373J2769
57674A73117J6537K0750K5689L1937L9958M9049N7190O2381O3645O0619N2811
57663F53683L9881K2204J128k0787l9910n3095n9627o1062n9058n4276m7423l9913
57651B81745l2829k6298k0533j6345j3828j1742r152o743n507m981l960k350j120
57638A26357q02r71j031p30j05M84M97j23p41q76p96r67j375j798k138k208j858
57621A10819j577k106l175l608l141k879l373l545k536j304j123j527j228k92
57607G9405J29k66p51j025j321j353n79M60M50q78k400l165l292l139k724k297
57591E7254k468l276l893l724l154k866k873k749k394k171k392k904l196k910
$$ plain form
57577 16284 13977 11968 9791 7540 5757 4555 3231 901 -2697 -7067 -11285 -14522 -16630 -18361 -20652
57562 -20652 -23556 -26179 -27731 -28249 -28268 -28265 -28624 -29653 -31231 -32696 -33379 -33122 -32125 -30599 -28768 -26939 -25324
57545 -25324 -23945 -22913 -22601 -23313 -24878 -26687 -28129 -28962 -29425 -30010 -30960 -31973 -32505 -32373 -31886 -31431 -31114
57528 -31114 -30846 -30587 -30487 -30823 -31660 -32580 -32942 -32576 -31889 -31105 -29838 -27780 -25451 -23716 -22800 -22273 -21790 -21269
57510 -21269 -20536 -19503 -18686 -18933 -20495 -22777 -24999 -26742 -27983 -29054 -30491 -32449 -34430 -36026 -37716
57495 -37716 -40314 -43890 -47895 -52079 -56433 -60401 -63160 -64718 -65813 -66695 -67066 -67349 -68801 -71845 -75224
57480 -75224 -77521 -78792 -80094 -82052 -84538 -87247 -89953 -92542 -95293 -98776 -103096 -107550 -111357 -114353
57466 -114353 -116734 -118658 -120449 -122648 -125399 -128189 -130520 -132351 -133670 -134249 -134273 -134537 -135425 -136227 -136092 -135195
$$ packed form
57577A6284k307k009k177k251j783j202j324I01b697m370m218l237k108j731k291
57562b0652k904k623j552n18j9Ll59j029j578j465o83K57R97J526J831J829J615
57545b5324J379J032L12p12j565j809j442q33m63n85r50j013n32J32M87M55L17
57528c1114K68K59J00l36q37r20l62L66O87P84J267K058K329J735R16N27M83N21
57510b1269P33J033Q17k47j562k282k222j743j241j071j437j958j981j596j690
57495c7716k598l576m005m184m354l968k759j558j095q82l71k83j452l044l379
57480g5224k297j271j302j958k486k709k706k589k751l483m320m454l807k996
57466a14353k381j924j791k199k751k790k331j831j319n79k4k64q88q02J35Q97
$$ plain form
57450 -135195 -134377 -134076 -134286 -135102 -136438 -137515 -137475 -136574 -136036 -136667 -138138 -139655 -140808 -141642 -142392 -143399 -144980
57433 -144980 -147110 -149278 -150818 -151471 -151684 -152270 -153574 -155018 -155798 -155974 -156432 -157687 -159267 -160523 -161552 -162933
57417 -162933 -164899 -167121 -169103 -170494 -171318 -172060 -173202 -174476 -175059 -174726 -174283 -174505 -175249 -176119 -177396 -179550
57401 -179550 -182165 -184164 -185033 -185217 -185398 -185958 -187130 -189055 -191489 -193785 -195323 -195885 -195683 -195238 -195023 -195082 -195123
57384 -195123 -195132 -195484 -196235 -196788 -196653 -196190 -196099 -196531 -197229 -198239 -199793 -201690 -203502 -205340 -207834 -211253 -215144
57367 -215144 -218911 -222323 -225468 -228627 -232190 -236316 -240606 -244447 -247700 -250709 -253739 -256761 -259759 -262825
57353 -262825 -265917 -268896 -271810 -274761 -277483 -279468 -280623 -281463 -282567 -284140 -286115 -288323 -290470 -292257
57339 -292257 -293695 -295099 -296701 -298424 -300071 -301540 -302882 -304321 -306154 -308380 -310492 -311963 -312917 -314074
$$ packed form
57450a35195Q18L01k10q16j336j077M0R01N38o31j471j517j153q34p50j007j581
57433a44980k130k168j540o53k13n86j304j444p80j76m58j255j580j256j029j381
57417a62933j966k222j982j391q24p42j142j274n83L33M43k22p44q70j277k154
57401a79550k615j999q69j84j81n60j172j925k434k296j538n62K02M45K15n9m1
57384a95123rl52p51n53J35M63R1m32o98j010j554j897j812j838k494l419l891
57367b15144l767l412l145l159l563m126m290l841l253l009l030l022k998l066
57353b62825l092k979k914k951k722j985j155q40j104j573j975k208k147j787
57339b92257j438j404j602j723j647j469j342j439j833k226k112j471r54j157
$$ plain form
57325 -314074 -316000 -318649 -321605 -324482 -327079 -329400 -331604 -333745 -335621 -337091 -338496 -340438 -343096 -346002
57311 -346002 -348471 -350067 -350762 -350955 -351323 -352271 -353515 -354449 -354924 -355363 -356135 -357238 -358637 -360394 -362277 -363680
57295 -363680 -364366 -365015 -366646 -369518 -372919 -376066 -378954 -382150 -385901 -389678 -392724 -394902 -396757 -398768 -400917
57280 -400917 -403193 -406092 -410114 -414828 -418994 -421708 -423102 -423809 -424149 -424115 -423849 -423727 -424003 -424630 -425427 -426255 -426997
57263 -426997 -427565 -428014 -428614 -429648 -431051 -432359 -433163 -433683 -434690 -436766 -439779 -443172 -446539 -449676 -452241
57248 -452241 -453822 -454440 -454704 -455326 -456575 -458244 -459970 -461500 -462760 -463765 -464512 -465019 -465472 -466181 -467242 -468424
57232 -468424 -469649 -471408 -474293 -478150 -482134 -485720 -489241 -493204 -497515 -501704 -505611 -509373 -512867 -515633
57218 -515633 -517379 -518285 -518765 -519284 -520368 -522416 -525354 -528735 -532334 -536389 -541206 -546882 -553602 -561727 -571119
$$ packed form
57325c14074j926k649k956k877k597k321k204k141j876j470j405j942k658k906
57311c46002k469j596o95j93l68r48j244r34m75m39p72j103j399j757j883j403
57295c63680o86o49j631k872l401l147k888l196l751l777l046k178j855k011k149
57280d00917k276k899m022m714m166k714j394p07l40L4K66J22k76o27p97q28p42
57263d26997n68m49o00j034j403j308q04n20j007k076l013l393l367l137k565
57248d52241j581o18k64o22j249j669j726j530j260j005p47n07m53p09j061j182
57232d68424j225j759k885l857l984l586l521l963m311m189l907l762l494k766
57218e15633j746r06m80n19j084k048k938l381l599m055m817n676o720q125r392
$$ plain form
57203 -571119 -580652 -588943 -595492 -600765 -605256 -608936 -611590 -613103 -613334 -612191 -610015 -607436 -604668 -601429
57189 -601429 -597731 -594153 -590762 -586100 -577793 -564043 -544350 -519364 -490822 -461469 -434165 -410662
57177 -410662 -391468 -376910 -367852 -365239 -369380 -380024 -397012 -420662 -451493 -489637 -534557 -585415
57165 -585415 -641724 -703426 -770247 -841257 -915238 -991255 -1068655 -1146855 -1225428 -1304226 -1383088
57154 -1383088 -1461617 -1539602 -1617490 -1696232 -1776905 -1860796 -1949477 -2044230 -2145594 -2253910 -2370213
57143 -2370213 -2496133 -2633056 -2781710 -2942364 -3114940 -3299143 -3494978 -3703021 -3923776
57134 -3923776 -4156954 -4401827 -4658077 -4925786 -5204857 -5495131 -5797074 -6111890 -6441074
57125 -6441074 -6786309 -7149717 -7533788 -7941130 -8374642 -8837714 -9333967 -9867138 -10441657
$$ packed form
57203e71119r533q291o549n273m491l680k654j513k31J143K176K579K768L239
57189f01429L698L578L391M662Q307J3750J9693K4986K8542K9353K7304K3503
57177d10662J9194J4558R058K613m141j0644j6988k3650l0831l8144m4920n0858
57165e85415n6309o1702o6821p1010p3981p6017p7400p8200p8573p8798p8862
57154a383088p8529p7985p7888p8742q0673q3891q8681r4753j01364j08316j16303
57143b370213j25920j36923j48654j60654j72576j84203j95835k08043k20755
57134c923776k33178k44873k56250k67709k79071k90274l01943l14816l29184
57125f441074l45235l63408l84071m07342m33512m63072m96253n33171n74519
$$ plain form
57116 -10441657 -11063206 -11738626 -12475973 -13285045 -14177298 -15164808 -16260076 -17477473 -18834519
57107 -18834519 -20352209 -22056384 -23981088 -26171546 -28685587 -31596226 -34996873 -39006328
57099 -39006328 -43771985 -49473967 -56330478 -64598142 -74562242 -86517853 -100742009 -117454460
57091 -117454460 -136773847 -158686832 -183038137 -209531842 -237739975 -267129486 -297098486
57084 -297098486 -326974864 -355955324 -383054797 -407172133 -427275900 -442583025 -452611922
57077 -452611922 -457126854 -456074356 -449561030 -437843566 -421308298 -400464215 -375964264
57070 -375964264 -348620413 -319372154 -289212980 -259107678 -229919469 -202350839 -176907095
57063 -176907095 -153892446 -133432366 -115506538 -99985098 -86667508 -75318147 -65691007
$$ packed form
57116a0441657o21549o75420p37347q09072q92253r87510j095268j217397j357046
57107a8834519j517690j704175j924704k190458k514041k910639l400647m009455
57099c9006328m765657n701982o856511q267664r964100j1955611j4224156j6712451
57091a17454460j9319387k1912985k4351305k6493705k8208133k9389511k9969000
57084b97098486k9876378k8980460k7099473k4117336k0103767j5307125j0028897
57077d52611922m514932J052498O513326J1717464J6535268K0844083K4499951
57070c75964264K7343851K9248259L0159174L0105302K9188209K7568630K5443744
57063a76907095K3014649K0460080J7925828J5521440J3317590J1349361R627140
$$ plain form
57056 -65691007 -57544926 -50655419 -44823011 -39874901 -35662596 -32060551 -28965151 -26291044
57048 -26291044 -23966974 -21934575 -20147932 -18570319 -17170348 -15921428 -14802636 -13797123
57040 -13797123 -12889589 -12066495 -11317469 -10634302 -10008859 -9433525 -8902914 -8413184 -7959979
57031 -7959979 -7538547 -7145419 -6778254 -6434237 -6110082 -5803402 -5512734 -5236470 -4973063
57022 -4973063 -4722142 -4484369 -4260556 -4052075 -3861548 -3691474 -3541943 -3410566 -3294355
57013 -3294355 -3190644 -3096561 -3009051 -2925725 -2845014 -2765728 -2687265 -2609989 -2534496 -2460652 -2388008
57002 -2388008 -2316749 -2247374 -2179851 -2113949 -2049947 -1988045 -1927461 -1867115 -1806905 -1747298 -1687984
56991 -1687984 -1627907 -1566462 -1503748 -1439891 -1375035 -1309765 -1244723 -1180064 -1116237 -1054963 -998415
$$ packed form
57056f5691007Q146081O889507N832408M948110M212305L602045L095400K674107
57048b6291044K324070K032399J786643J577613J399971J248920J118792J005513
57040a3797123R07534Q23094P49026O83167O25443N75334N30611M89730M53205
57031g959979M21432L93128L67165L44017L24155L06680K90668K76264K63407
57022d973063K50921K37773K23813K08481J90527J70074J49531J31377J16211
57013c294355J03711R4083Q7510Q3326Q0711P9286P8463P7276P5493P3844P2644
57002b388008P1259O9375O7523O5902O4002O1902O0584O0346O0210N9607N9314
56991a687984O0077O1445O2714O3857O4856O5270O5042O4659O3827O1274N6548
$$ plain form
56980 -998415 -947552 -902183 -862410 -828926 -801831 -780040 -761952 -746104 -731309 -716931 -703013
56969 -703013 -689580 -676041 -661776 -646825 -631219 -614120 -594611 -573003 -550429 -527369 -503521
56958 -503521 -478955 -454434 -430742 -408575 -388990 -373053 -361054 -352724 -347905 -346198 -346270 -346566 -346559 -346414
56944 -346414 -345639 -343128 -338408 -331757 -323125 -312026 -298580 -283595 -267389 -249385 -229093 -206785 -183106
56931 -183106 -158737 -134601 -111796 -91370 -74640 -63406 -58981 -61086 -68385 -79695 -93744 -108220
56919 -108220 -120575 -129933 -137152 -142966 -147220 -149975 -151961 -153404 -153557 -151958 -149320 -146643 -144161 -141552
56905 -141552 -138519 -134817 -130378 -125671 -121287 -116949 -111685 -105238 -98500 -92216 -85994 -78950 -70708 -61377
56891 -61377 -51175 -40397 -29260 -17556 -5015 7855 19948 30643 39973 47487 51894 52359 49543
$$ packed form
56980i98415N0863M5369L9773L3484K7095K1791J8088J5848J4795J4378J3918
56969g03013J3433J3539J4265J4951J5606J7099J9509K1608K2574K3060K3848
56958e03521K4566K4521K3692K2167J9585J5937J1999Q330M819J707p2k96PJ45
56944c46414P75K511M720O651Q632J1099J3446J4985J6206J8004K0292K2308K3679
56931a83106K4369K4136K2805K0426J6730J1234M425k105p299j1310j4049j4476
56919a08220j2355r358p219n814m254k755j986j443j53J599K638K677K482K609
56905a41552L033L702M439M707M384M338N264O447O738O284O222P044Q242R331
56891f1377J0202J0778J1137J1704e015G855J2093J0695R330P514M407M65k816
$$ plain form
56878 49543 44979 39899 34981 30598 26892 23983 22331 22443 24182 26972 30880 36783 45288 56179
56864 56179 69259 85000 103909 125672 149178 172871 194893 213499 227680 236997 240865 238743
56852 238743 231203 220099 207369 194261 181763 170913 162268 155807 151751 150839 153533 159725 169618
56839 169618 184133 203974 228991 258755 292845 329900 367044 401007 429426 450686 463218
56828 463218 465788 458190 441281 416809 387608 357198 328309 301962 278324 257960 241737 230022
56816 230022 222703 219722 221029 226306 235304 248284 265605 286901 310860 335510 358553 377839
56804 377839 391949 400134 401661 395757 382511 363339 340230 314935 289127 264625 242891 224613
56792 224613 210090 199523 192599 188366 186080 185822 188010 192825 200484 211335 224994 239796 253691
$$ packed form
56878D9543m564n080m918m383l706k909j652J12J739K790L908N903Q505J0891
56864E6179J3080J5741J8909K1763K3506K3693K2022J8606J4181R317L868k122
56852B38743p540j1104j2730j3108j2498j0850q645o461m056r12K694O192R893
56839A69618J4515J9841K5017K9764L4090L7055L7144L3963K8419K1260J2532
56828D63218K570p598j6909k4472k9201l0410k8889k6347k3638k0364j6223j1715
56816B30022p319k981J307N277Q998J2980J7321K1296K3959K4650K3043J9286
56804C77839J4110Q185J527n904j3246j9172k3109k5295k5808k4502k1734j8278
56792B24613j4523j0567o924m233k286k58K188M815P659J0851J3659J4802J3895
$$ plain form
56779 253691 265366 274108 279128 279698 275618 267089 254592 239373 223454 208408 194401 181071 168869
56766 168869 158740 150769 144011 137671 131845 127104 123836 121937 120729 119265 117119 114790 113055 112166
56752 112166 111937 112220 112825 113292 113315 113200 113488 114308 115401 116480 117162 116968 115929 114872 114568 114894 115354 116062
56734 116062 117464 119290 120580 120787 120310 119890 119942 120534 121526 122666 123876 125448 127776 130882 134342 137503
56718 137503 139696 140640 140941 141798 143790 146291 148467 150451 152998 156258 159600 162515 165095 167585 169930
56703 169930 171885 173265 174027 174297 174287 174069 173595 172994 172590 172475 172403 172197 171856 171155 169688 167565 165517 164000
56685 164000 162732 161459 160519 160155 159980 159722 159902 161044 162687 163938 164607 165036 165226 164958 164474 164251 164279
56668 164279 164320 164633 165648 167051 167958 167986 167568 167336 167727 168926 170541 171564 171426 170933 171404 173044 174880
$$ packed form
56779B53691J1675Q742N020N70m080q529j2497j5219j5919j5046j4007j3330j2202
56766A68869j0129p971o758o340n826m741l268j899j208j464k146k329j735q89
56752A12166k29K83O05M67K3j15K88Q20J093J079O82j94j039j057l04L26M60P08
56734A16062J402J826J290K07m77m20N2N92R92J140J210J572K328L106L460L161
56718A37503K193R44L01Q57J992K501K176J984K547L260L342K915K580K490K345
56703A69930J955J380P62K70j0k18m74o01m04j15p2k06l41p01j467k123k048j517
56685A64000j268j273r40l64j75k58J80J142J643J251O69M29J90k68m84k23K8
56668A64279M1L13J015J403R07K8m18k32L91J199J615J023j38m93M71J640J836
$$ plain form
56651 174880 176173 177071 177938 178817 179635 180308 180645 180715 181114 182194 183240 183260 182462 182006 182310 182593 182238 181611
56633 181611 181206 180842 180154 179211 178242 177279 176394 175788 175330 174470 172961 171234 169813 168738 167755 166695 165482
56616 165482 164192 163310 163478 164765 166511 168041 169159 169838 169900 169262 168157 166855 165494 164288 163568 163373
56600 163373 163340 163237 163349 164041 165089 165766 165593 164880 164407 164624 165243 165727 166058 166704 167903 169369 170811 172307
56582 172307 173918 175387 176495 177313 177862 177956 177742 177824 178516 179481 180532 182105 184377 186627 188244 189814
56566 189814 192348 195975 200299 205504 211984 219230 226256 233032 240376 248372 255887 261700 265338 266811
56552 266811 266448 265020 263248 261135 258390 255277 252247 249132 245725 242799 241281 240499 238663 235254 231699
56537 231699 229380 228161 227173 225906 224146 221897 219848 218952 219132 219244 218534 217229 215540 213269 210717
$$ packed form
56651A74880J293Q98Q67Q79Q18O73L37P0L99J080J046K0p98m56L04K83l55o27
56633A81611m05l64o88r43r69r63q85o06m58q60j509j727j421j075r83j060j213
56616A65482j290q82J68J287J746J530J118O79O2o38j105j302j361j206p20j95
56600A63373l3j03J12O92J048O77j73p13m73K17O19M84L31O46J199J466J442J496
56582A72307J611J469J108Q18N49R4k14Q2O92R65J051J573K272K250J617J570
56566A89814K534L627M324N205O480P246P026O776P344P996P515N813L638J473
56552B66811l63j428j772k113k745l113l030l115l407k926j518p82j836l409l555
56537B31699k319j219r88j267j760k249k049q96J80J12p10j305j689k271k552
$$ plain form
56522 210717 208781 207669 206612 205291 204348 203959 203143 201253 198996 197182 195535 193596 191770 190493 189336
56507 189336 187934 186901 186768 186866 186428 186002 186524 187620 188195 188247 188735 189890 191032 192037 193638 196061 198482
56490 198482 200230 201623 203140 204431 204729 203934 202855 202426 202839 203496 203789 203778 203877 203984 203501 202304 201077
56473 201077 200394 200073 199766 199552 199481 199152 198407 197905 198330 199425 200464 201271 202038 202548 202450 202101 202255 202972 203600
56454 203600 203845 204108 204561 204627 203757 202296 201187 201017 201638 202644 203959 205808 208117 210168 211129 210874 209968
56437 209968 208945 208023 207475 207646 208344 208800 208587 208151 208019 207966 207439 206488 205760 205788 206654 208149 209838 211118
56419 211118 211657 211774 212113 212914 213736 213911 213246 212337 212078 212660 213267 213054 212176 211335 210661 209754 208774 208523 209295
56400 209295 210466 211491 212582 214067 215787 217485 219193 220872 222240 223248 224196 225165 225953 226675 227743
$$ packed form
56522B10717j936j112j057j321r43l89q16j890k257j814j647j939j826j277j157
56507A89336j402j033j33R8m38m26N22J096N75N2M88J155J142J005J601K423K421
56490A98482J748J393J517J291K98p95j079m29M13O57K93j1R9J07m83j197j227
56473B01077o83l21l07k14p1l29p45n02M25J095J039Q07P67N10r8l49J54P17O28
56454B03600K45K63M53O6q70j461j109j70O21J006J315J849K309K051R61k55r06
56437B09968j023r22n48J71O98M56k13m36j32n3n27r51p28K8Q66J495J689J280
56419B11118N39J17L39Q01Q22J75o65r09k59N82O07k13q78q41o74r07r80k51P72
56400B09295J171J025J091J485J720J698J708J679J368J008R48R69P88P22J068
$$ plain form
56385 227743 229090 230258 231361 232978 234781 235458 234560 233374 233241 233933 234447 234530 234555 234635 234787 235328 236321 237152
56367 237152 237406 237567 238160 238832 239024 238919 238950 239007 238928 239141 239959 240817 241114 241271 242050 243312 244337 244915 245261
56348 245261 245270 244736 243934 243228 242504 241725 241510 242389 243952 245551 247268 249327 251164 252138 252690 253791 255664
56331 255664 258018 261102 265339 270214 274640 278283 281572 284576 286889 288446 289561 290211 290206 289952 290189 290888
56315 290888 291116 290061 287850 285509 284368 285045 286688 287799 288084 288619 289814 290563 290278 290412 292566 296125
56299 296125 299322 301824 304569 307712 310484 312731 314886 316593 317059 316709 316991 318467 320436 322426 324742
56284 324742 327531 330626 334316 339013 344197 348900 353109 357395 361424 364378 366764 370183 375077 380268
56270 380268 385002 389979 395970 402742 409851 417361 425379 433941 443605 455096 468136 481726 495780
$$ packed form
56385B27743J347J168J103J617J803O77q98j186j33O92N14Q3K5Q0J52N41R93Q31
56367B37152K54J61N93O72J92j05L1N7p9K13Q18Q58K97J57P79J262J025N78L46
56348B45261Rn34q02p06p24p79k15Q79J563J599J717K059J837R74N52J101J873
56331B55664K354L084M237M875M426L643L289L004K313J557J115O50nk54K37O99
56315B90888K28j055k211k341j141O77J643J111K85N35J195P49k85J34K154L559
56299B96125L197K502K745L143K772K247K155J707M66l50K82J476J969J990K316
56284C24742K789L095L690M697N184M703M209M286M029K954K386L419M894N191
56270C80268M734M977N991O772P109P510Q018Q562R664J1491J3040J3590J4054
$$ plain form
56257 495780 511371 529214 549048 570719 594686 621285 650715 683932 722226 765487 812110
56246 812110 860952 912268 966322 1022209 1078486 1133925 1187233 1236986 1282300 1322749 1357412
56235 1357412 1384876 1404329 1415714 1418827 1413334 1399829 1379771 1354239 1323768 1289355 1252360 1213318
56223 1213318 1172155 1129668 1087467 1046299 1005833 966258 928621 893290 859565 827166 796630
56212 796630 767881 740003 712953 687963 665600 644822 624655 605438 587753 571478 556659
56201 556659 544018 533705 524666 516000 507965 501030 495008 489690 485273 481636 478303 475548 474295 474472
56187 474472 474778 474550 474429 474606 474051 472381 471004 471351 473134 475317 477604 479998 482060 483672 485610 488448
56171 488448 491759 495138 498990 503537 508101 512197 516430 521553 527579 534442 542538 551921 561942 572293
$$ packed form
56257D95780J5591J7843J9834K1671K3967K6599K9430L3217L8294M3261M6623
56246H12110M8842N1316N4054N5887N6277N5439N3308M9753M5314M0449L4663
56235A357412K7464J9453J1385L113n493j3505k0058k5532l0471l4413l6995l9042
56223A213318m1163m2487m2201m1168m0466l9575l7637l5331l3725l2399l0536
56212G96630k8749k7878k7050k4990k2363k0778k0167j9217j7685j6275j4819
56201E56659j2641j0313r039q666q035o935o022n318m417l637l333k755j253J77
56187D74472L06k28j21J77n55j670j377L47J783K183K287K394K062J612J938K838
56171D88448L311L379L852M547M564M096M233N123O026O863Q096R383J0021J0351
$$ plain form
56157 572293 583434 595583 608482 622583 639121 658444 679733 702993 729875 761818 799048
56146 799048 842249 893623 955169 1027434 1111018 1207657 1318240 1440782 1571454 1706403 1841436
56135 1841436 1971307 2091010 2197353 2288795 2365157 2428608 2483452 2533263 2578562 2617757 2649009
56124 2649009 2670431 2680275 2678464 2666918 2647195 2618809 2580640 2532330 2472928 2399721 2310206 2204585
56112 2204585 2085426 1956287 1821942 1688467 1561213 1443166 1336058 1241705 1160981 1092808
56102 1092808 1035597 988661 951043 920377 894431 872719 855281 841107 829173 819822 813610 809736
56090 809736 806921 804852 803645 802984 802865 803944 806075 807910 809022 810854 814423 818824 823250 828569 835372
56075 835372 842388 848586 855078 863182 872358 881916 892928 906338 920826 934694 948301 962597 976866
$$ packed form
56157E72293J1141J2149J2899J4101J6538J9323K1289K3260K6882L1943L7230
56146G99048M3201N1374O1546P2265Q3584R6639J10583J22542J30672J34949J35033
56135A841436J29871J19703J06343R1442P6362O3451N4844M9811M5299L9195L1252
56124B649009K1422R844j811j1546j9723k8386l8169m8310n9402p3207q9515j05621
56112B204585j19159j29139j34345j33475j27254j18047j07108r4353q0724o8173
56102A092808n7211m6936l7618l0666k5946k1712j7438j4174j1934r351o212l874
56090H09736k815k069j207o61j19J079K131J835J112J832L569M401M426N319O803
56075H35372P016O198O492Q104R176R558J1012J3410J4488J3868J3607J4296J4269
$$ plain form
56062 976866 990133 1003251 1017239 1030881 1042241 1051343 1059302 1066202 1071972 1077959 1085382 1093455 1101047
56049 1101047 1108818 1117699 1126797 1134983 1143067 1152336 1162511 1173146 1185219 1199197 1213496 1227226
56037 1227226 1242423 1261095 1282183 1304110 1328150 1356307 1387871 1421136 1456556 1495097 1535427
56026 1535427 1575924 1617517 1661329 1705523 1747880 1789459 1832219 1875165 1916570 1957949 2001898
56015 2001898 2047867 2094049 2141583 2192798 2247064 2302488 2359979 2421600 2486697 2553721 2623902
56004 2623902 2699007 2777694 2858451 2943755 3036618 3135460 3237406 3344141 3459162 3581667
55994 3581667 3708856 3842029 3984558 4136042 4294459 4461819 4641559 4832756 5033434
55985 5033434 5247121 5479310 5729917 5996375 6281647 6591696 6927738 7288939 7680109
$$ packed form
56062I76866J3267J3118J3988J3642J1360R102P959O900N770N987P423Q073P592
56049A101047P771Q881R098Q186Q084R269J0175J0635J2073J3978J4299J3730
56037A227226J5197J8672K1088K1927K4040K8157L1564L3265L5420L8541M0330
56026A535427M0497M1593M3812M4194M2357M1579M2760M2946M1405M1379M3949
56015B001898M5969M6182M7534N1215N4266N5424N7491O1621O5097O7024P0181
56004B623902P5105P8687Q0757Q5304R2863R8842J01946J06735J15021J22505
55994C581667J27189J33173J42529J51484J58417J67360J79740J91197K00678
55985E033434K13687K32189K50607K66458K85272L10049L36042L61201L91170
$$ plain form
55976 7680109 8108402 8575275 9080610 9632011 10240921 10912965 11652230 12471597 13388200
55967 13388200 14412985 15557348 16846955 18317113 20000425 21935493 24185721 26837032
55959 26837032 29986912 33759364 38330454 43923717 50792983 59241435 69656742 82496619
55951 82496619 98221857 117202646 139535568 164718039 191371271 217349983 240273713
55944 240273713 258068541 269156172 272437243 267446966 254677699 235659894 212576941
55937 212576941 187677054 162864016 139546136 118603859 100414802 84970598 72048885
55930 72048885 61339400 52499859 45196007 39142454 34111109 29910224 26376165 23383413
55922 23383413 20840575 18670400 16803705 15189118 13791601 12578229 11515750 10580643
$$ packed form
55976G680109M28293M66873N05335N51401O08910O72044P39265Q19367R16603
55967A3388200J024785J144363J289607J470158J683312J935068K250228K651311
55959B6837032L149880L772452M571090N593263O869266Q448452J0415307J2839877
55951H2496619J5725238J8980789K2332922K5182471K6653232K5978712K2923730
55944B40273713J7794828J1087631L281071m990277j2769267j9017805k3082953
55937B12576941k4899887k4813038k3317880k0942277j8189057j5444204j2921713
55930G2048885j0709485q839541p303852o053553n031345m200885l534059k992752
55922B3383413k542838k170175j866695j614587j397517j213372j062479r35107
$$ plain form
55914 10580643 9758742 9033759 8386334 7804082 7282092 6812971 6385574 5993540 5635921
55905 5635921 5309002 5005822 4723749 4464342 4225569 4001971 3792553 3600673 3425702
55896 3425702 3262264 3108218 2966145 2836195 2714424 2599210 2492813 2395395 2303508 2215710
55886 2215710 2134114 2059369 1989445 1924325 1866666 1816675 1771041 1727786 1687595 1649621 1610649
55875 1610649 1569276 1526693 1482856 1436199 1387626 1340254 1294591 1248369 1201842 1158728 1120932
55864 1120932 1086651 1054845 1027298 1004843 985370 967207 951002 936800 922382 905933 887633
55853 887633 867693 845600 822169 799568 778441 757542 736646 716993 698462 679378 659725
55842 659725 641567 625593 610201 594742 580724 568945 558267 548120 539445 532159 524385 515350
$$ packed form
55914A0580643q21901p24983o47425n82252n21990m69121m27397l92034l57619
55905E635921l26919l03180k82073k59407k38773k23598k09418j91880j74971
55896C425702j63438j54046j42073j29950j21771j15214j06397r7418r1887q7798
55886B215710q1596p4745o9924o5120n7659m9991m5634m3255m0191l7974l8972
55875A610649m1373m2583m3837m6657m8573m7372m5663m6222m6527m3114l7796
55864A120932l4281l1806k7547k2455j9473j8163j6205j4202j4418j6449j8300
55853H87633j9940k2093k3431k2601k1127k0899k0896j9653j8531j9084j9653
55842F59725j8158j5974j5392j5459j4018j1779j0678j0147q675p286p774r035
$$ plain form
55830 515350 506698 499957 494826 490710 487643 484918 481029 475787 470543 465806 460698 455090 449998 445475
55816 445475 440479 435274 431572 429812 428664 427645 427785 429261 430962 432991 437008 443360 450440 457580
55802 457580 465964 475843 485447 493673 501200 507890 511625 511068 507238 501140 492240 480659 468545 457591
55788 457591 447214 436657 426908 418968 412065 405193 398724 392926 386513 378333 369173 360405 352128 344054
55774 344054 336986 331940 328769 326776 325671 324939 323518 321188 319195 318438 318102 316971 314871 311934 307689
55759 307689 301988 295768 289924 284329 278715 273403 268403 263027 257241 252185 248542 245505 242173 238796
55745 238796 235850 233097 230345 227940 225719 222766 219040 215936 214300 213153 211310 209032 207110 205511
55731 205511 203915 202566 201674 201044 200965 202214 204391 205689 205245 204290 203935 203297 201132 197963 195113 192730
$$ packed form
55830E15350q652o741n131m116l067k725l889n242n244m737n108n608n092m523
55816D45475m996n205l702j760j148j019J40J476J701K029M017O352P080P140
55802D57580Q384R879R604Q226P527O690L735n57l830o098q900j1581j2114j0954
55788D57591j0377j0557r749p940o903o872o469n798o413q180r160q768q277q074
55774C44054p068n046l171j993j105p32j421k330j993p57l36j131k100k937m245
55759C07689n701o220n844n595n614n312n000n376n786n056l643l037l332l377
55745B38796k946k753k752k405k221k953l726l104j636j147j843k278j922j599
55731B05511j596j349q92o30p9J249K177J298m44r55l55o38k165l169k850k383
$$ plain form
55715 192730 190227 187808 186130 185202 184822 185328 186773 188162 188643 188735 189324 190288 191141 192120 193396 194040 193107
55698 193107 191097 189199 187697 186281 185218 185020 185429 185931 186741 188218 189845 190874 191605 192978 195287
55683 195287 198282 202096 207113 213172 219689 226217 232224 236899 239959 242144 244194 245904 246880 247453 247973
55668 247973 247931 246865 245549 245189 245857 246715 247442 248476 250079 251997 253876 255351 256064 256147 256312 256929 257450
55651 257450 257204 256103 254110 250878 246563 242131 237975 233085 226525 218974 211760 205143 198644 192494
55637 192494 187457 183580 180221 177078 174306 171876 169669 167867 166501 165042 163199 161559 160644 159921 158690
55622 158690 157381 156868 156982 156769 155874 154653 153239 151538 149867 148609 147481 146076 144850 144592 145123 145482
55606 145482 145174 144373 143211 141787 140657 140277 140071 138982 136905 134802 133517 133198 133654 134435 134767 134237
$$ packed form
55715A92730k503k419j678r28l80N06J445J389M81R2N89R64Q53R79J276O44r33
55698A93107k010j898j502j416j063j98M09N02Q10J477J627J029P31J373K309
55683A95287K995L814N017O059O517O528O007M675L060K185K050J710R76N73N20
55668B47973m2j066j316l60O68Q58P27J034J603J918J879J475P13Q3J65O17N21
55651B57450k46j101j993l232m315m432m156m890o560p551p214o617o499o150
55637A92494n037l877l359l143k772k430k207j802j366j459j843j640r15p23j231
55622A58690j309n13J14k13q95j221j414j701j671j258j128j405j226k58N31L59
55606A45482l08q01j162j424j130l80k06j089k077k103j285l19M56P81L32n30
$$ plain form
55590 134237 133436 133213 133494 133574 133271 132953 132745 132612 133011 134505 136839 139215 141357 143490 145513 147148 148808
55573 148808 151408 155276 159993 165227 170915 176703 182007 186638 190698 193963 196027 196899 196805 195662 193472
55558 193472 190934 188763 186619 183592 179604 175449 171574 167789 164166 161297 159586 159031 159651 161362 163490
55543 163490 165255 166689 168291 169907 170852 171095 171360 171983 172578 172940 173406 174074 174448 174032 172710 170435 167242
55526 167242 163574 159890 155950 151218 146007 141414 138055 135613 133669 132138 130756 129009 126887 125034
55512 125034 123925 123426 123245 123148 122627 121148 118970 117091 116130 115844 115832 116037 116332 116241 115453 114156 112689 111247
55494 111247 110011 109164 108667 108432 108619 109327 110113 110380 110144 109833 109495 108926 108403 108451 108899 109057 108847 108903 109496
55475 109496 110226 110920 111854 112854 113135 112442 111490 110839 110136 108975 107747 107090 107030 107213 107492 107817 108016 108105
$$ packed form
55590A34237q01k23K81Q0l03l18k08j33L99J494K334K376K142K133K023J635J660
55573A48808K600L868M717N234N688N788N304M631M060L265K064Q72r4j143k190
55558A93472k538k171k144l027l988m155l875l785l623k869j711n55O20J711K128
55543A63490J765J434J602J616R45K43K65O23N95L62M66O68L74m16j322k275l193
55526A67242l668l684l940m732n211m593l359k442j944j531j382j747k122j853
55512A25034j109m99j81r7n21j479k178j879r61k86j2K05K95r1p88j297j467j442
55494A11247j236q47m97k35J87P08P86K67k36l11l38n69n23M8M48J58k10N6N93
55475A09496P30O94R34J000K81o93r52o51p03j161j228o57o0J83K79L25J99Q9
$$ plain form
55457 108105 108381 108859 109103 108971 109002 109651 110603 111295 111651 111854 111755 111130 110226 109485 108895 108086 107056 106307 106174
55438 106174 106374 106403 106241 106391 107153 108123 108731 109154 110166 111882 113301 113516 112862 112209 111670 110879 110250 110829
55420 110829 112810 115116 116687 117390 117470 116972 116193 115973 116943 118768 120569 121778 122342 122408 122162 121748 121104
55403 121104 119960 118132 115710 113064 110764 109318 108721 108468 108300 108523 109171 109402 108464 106921 105994 105942 106018
55386 106018 105886 105963 106345 106462 106047 105474 104906 104115 103388 103587 104804 105950 106229 106177 106632 107477 108132 108561 108992
55367 108992 109169 108697 107822 107187 107043 107152 107216 107008 106406 105670 105310 105355 105171 104353 103362 102855 102833 102938 103149 103708
55347 103708 104614 105624 106481 106826 106326 105261 104554 104778 105526 106159 106714 107552 108495 109001 108972 108788 108627 108278
55329 108278 107603 106788 106151 105915 106079 106314 106149 105484 104698 104040 103230 101932 100393 99323 99297 100461 102540
$$ packed form
55457A08105K76M78K44j32L1O49R52O92L56K03r9o25r04p41n90q09j030p49j33
55438A06174K00K9j62J50P62R70O08M23J012J716J419K15o54o53n39p91o29N79
55420A10829J981K306J571P03Q0m98p79k20R70J825J801J209N64O6k46m14o44
55403A21104j144j828k422k646k300j446n97k53j68K23O48K31r38j543r27n2P6
55386A06018j32P7L82J17m15n73n68p91p27J99J217J146K79n2M55Q45O55M29M31
55367A08992J77m72q75o35j44J09O4k08o02p36l60M5j84q18r91n07k2J05K11N59
55347A03708R06J010Q57L45n00j065p07K24P48O33N55Q38R43N06k9j84j61l49
55329A08278o75q15o37k36J64K35j65o65p86o58q10j298j539j070k6J164K079
$$ plain form
55312 102540 104935 107001 108462 109400 109835 109708 109324 109257 109523 109362 108213 106536 105254 104720 104592 104465 104189
55295 104189 103811 103569 103791 104504 105264 105628 105651 105792 106475 107801 109442 110812 111660 112451 113761 115278 115979
55278 115979 115387 114063 112737 111623 110822 110594 110772 110578 109597 108410 107731 107435 107024 106553 106376 106321 105898 105166
55260 105166 104779 105146 106020 106919 107554 107882 107972 107898 107677 107426 107452 107888 108338 108350 108164 108276 108293 107174 104925 103070
55240 103070 102881 103943 105134 106183 107442 108814 109926 110849 111701 111872 110671 108551 106796 106078 106108 106565
55224 106565 107462 108555 109215 109091 108453 107737 107203 107003 107185 107695 108652 110325 112416 113751 113397 111860 110559
55207 110559 110311 110932 112028 113342 114392 114672 114357 114167 114399 114657 114522 113925 112858 111403 110077 109506 109556
55190 109556 109403 108567 107337 106117 105015 104253 104294 105180 106332 107304 108307 109621 110940 111741 112039 112322 112881
$$ packed form
55312A02540K395K066J461R38M35j27l84o7K66j61j149j677j282n34j28j27k76
55295A04189l78k42K22P13P60L64K3J41O83J326J641J370Q48P91J310J517P01
55278A15979n92j324j326j114q01k28J78j94r81j187o79k96m11m71j77n5m23p32
55260A05166l87L67Q74Q99O35L28R0p4k21k51K6M36M50J2j86J12J7j119k249j855
55240A03070j89J062J191J049J259J372J112R23Q52J71j201k120j755p18L0M57
55224A06565Q97J093O60j24o38p16n34k00J82N10R57J673K091J335l54j537j301
55207A10559k48O21J096J314J050K80l15j90K32K58j35n97j067j455j326n71N0
55190A09556j53q36j230j220j102p62M1Q86J152R72J003J314J319Q01K98K83N59
$$ plain form
55173 112881 113498 113805 113758 113715 114069 114794 115517 116107 116970 118474 120294 121695 122306 122179 121286 119573 117565 116240
55155 116240 116041 116440 116699 116690 116677 116661 116365 115701 114963 114566 114742 115389 116099 116440 116352 116252 116652 117600 118492 118521 117459
55134 117459 115998 115151 115249 115710 115841 115569 115254 115095 115050 115075 115138 115168 115236 115608 116337 117033 117343 117423 117646 118081 118655
55113 118655 119532 120863 122256 123006 122854 122186 121532 121179 121150 121201 120934 120272 119741 119925 120764 121707 122406 122884 123167
55094 123167 123183 122959 122547 121880 121033 120415 120265 120163 119578 118788 118629 119351 120239 120452 119808 118672 117512 116638
55076 116638 116088 115706 115489 115706 116448 117343 118081 118887 119956 120804 120817 120204 119647 119235 118553 117713 117344 117516 117592
55057 117592 117343 117300 117715 118029 117816 117462 117417 117420 117082 116641 116542 116630 116449 116035 115853 116061 116354 116464 116406 116290 116165
55036 116165 116047 115905 115669 115352 115084 114981 115136 115716 116789 118013 118824 119053 119058 119145 119282 119473 119965 120791 121472
$$ packed form
55173A12881O17L07m7m3L54P25P23N90Q63J504J820J401O11j27q93j713k008j325
55155A16240j99L99K59rj3j6k96o64p38l97J76O47P10L41q8j00M00R48Q92K9j062
55134A17459j461q47R8M61J31k72l15j59m5K5O3L0O8L72P29O96L10Q0K23M35N74
55113A18655Q77J331J393P50j52o68o54l53k9N1k67o62n31J84Q39R43O99M78K83
55094A23167J6k24m12o67q47o18j50j02n85p90j59P22Q88K13o44j136j160q74
55076A16638n50l82k17K17P42Q95P38Q06J069Q48J3o13n57m12o82q40l69J72P6
55057A17592k49m3M15L14k13l54m5Ll38m41r9Q8j81m14j82K08K93J10n8j16j25
55036A16165j18j42k36l17k68j03J55N80J073J224Q11K29NQ7J37J91M92Q26O81
$$ plain form
55017 121472 121599 121433 121536 121947 122108 121576 120512 119435 118711 118356 118187 118093 118123 118365 118819 119440 120193 120981 121682
54998 121682 122355 123300 124735 126615 128871 131504 134156 135942 136199 135226 133882 132677 131675 130986 130679 130428
54982 130428 129947 129651 130112 130946 131126 130482 129951 130130 130550 130781 131290 132503 133843 134498 134630 134954 135509 135696
54964 135696 135373 135142 135533 136544 138007 139872 141939 143696 144664 144770 144368 144004 144086 144583 145039 144967 144238 143111
54946 143111 142046 141466 141418 141404 140858 139863 139096 138948 139064 138951 138629 138400 138308 138260 138462 139331 141023 143339 146081
54927 146081 149303 153240 158079 163836 170424 177916 186501 195920 205087 212787 218723 223341 226608 227722
54913 227722 226367 223500 220276 216641 211672 205005 197280 189357 181763 174923 169259 164802 161065 157544
54899 157544 154216 151478 149739 149132 149494 150558 152065 153621 154594 154575 154053 154211 155758 158226 160682 162833
$$ packed form
55017A21472J27j66J03M11J61n32j064j077p24l55j69r4L0K42M54O21P53P88P01
54998A21682O73R45J435J880K256K633K652J786K57r73j344j205j002o89l07k51
54982A30428m81k96M61Q34J80o44n31J79M20K31N09J213J340O55J32L24N55J87
54964A35696l23k31L91J011J463J865K067J757R68J06m02l64Q2M97M56p2p29j127
54946A43111j065n80m8j4n46r95p67j48J16j13l22k29r2m8K02Q69J692K316K742
54927A46081L222L937M839N757O588P492Q585R419R167P700N936M618L267J114
54913B27722j355k867l224l635m969o667p725p923p594o840n664m457l737l521
54899A57544l328k738j739o07L62J064J507J556R73j9n22J58J547K468K456K151
$$ plain form
54883 162833 165157 168220 172327 177655 184283 192049 200619 209585 218290 225792 231388 235041 236903 236631
54869 236631 233697 228373 221791 214806 207216 198457 188781 179367 171415 165425 161238 158345 156012 153489
54855 153489 150533 147698 145847 145253 145259 144848 143430 141163 138774 137124 136603 136761 136754 136283 135807 135703 135685 135443
54837 135443 135364 135973 136949 137357 136763 135479 133804 131756 129593 127877 126792 125935 124952 123894 122869 121969
54821 121969 121601 122217 123508 124557 125094 125880 127499 129448 130923 131882 132777 133720 134544 135276 135985 136480 136613
54804 136613 136611 136688 136684 136500 136466 136784 136989 136587 135919 135840 136710 138217 139920 141444 142397 142688 142791 143165 143576 143497
54784 143497 143038 142883 143361 144087 144539 144624 144695 145352 147125 150052 153670 157686 162406 168187 174843 182083 190184
54767 190184 199553 209754 219596 228236 235673 242208 247861 252288 254862 254855 251992 246799 240113 232343 223607
$$ packed form
54883A62833K324L063M107N328O628P766Q570Q966Q705P502N596L653J862k72
54869B36631k934n324o582o985p590q759r676r414p952n990m187k893k333k523
54855A53489k956k835j851n94Om11j418k267k389j650n21J58pm71m76j04j8k42
54837A35443p9O09R76M08n94j284j675k048k163j716j085q57r83j058j025r00
54821A21969l68O16J291J049N37P86J619J949J475R59Q95R43Q24P32P09M95J33
54804A36613kP7mj84l4L18K05m02o68p9Q70J507J703J524R53K91J03L74M11p9
54784A43497m59j55M78P26M52Q5P1O57J773K927L618M016M720N781O656P240Q101
54767A90184R369J0201R842Q640P437O535N653M427K574pk863n193o686p770q736
$$ plain form
54752 223607 214376 205419 197177 189655 182883 177021 172044 167780 164259 161639 159824 158527 157621 157074 156645
54737 156645 156087 155510 155182 155192 155752 157486 160723 164708 168334 171608 175632 181114 187670 194677 201943 209251
54721 209251 216038 221972 227231 231768 234828 235675 234381 231509 227337 221834 215116 207561 199649 191921
54707 191921 184861 178596 172961 168022 164191 161594 159685 157781 155723 153729 151911 150317 149179 148697
54693 148697 148648 148534 148100 147454 146755 146023 145236 144373 143363 142165 140957 140067 139640 139421 138986 138199 137360 136801
54675 136801 136408 135782 134887 134289 134542 135586 136916 138113 138897 138995 138384 137580 137181 137163 137034 136665 136467 136648
54657 136648 136813 136532 136004 135847 136379 137260 137754 137271 135836 134090 132791 132367 133002 134770 137347 139795 141202
54640 141202 141559 141588 141744 141844 141707 141560 141596 141632 141497 141418 141732 142480 143501 144619 145531 145849 145595 145439 146092
$$ packed form
54752B23607r231q957q242p522o772n862m977m264l521k620j815j297r06n47m29
54737A56645n58n77l28J0N60J734L237L985L626L274M024N482O556P007P266P308
54721B09251O787N934N259M537L060Q47j294k872m172n503o718p555p912p728
54707A91921p060o265n635m939l831k597j909j904k058j994j818j594j138m82
54693A48697m9j14m34o46o99p32p87q63j010j198j208q90m27k19m35p87q39n59
54675A36801l93o26q95n98K53J044J330J197P84R8o11q04l99j8j29l69j98J81
54657A36648J65k81n28j57N32Q81M94m83j435j746j299m24O35J768K577K448J407
54640A41202L57K9J56J00j37j47L6L6j35p9L14P48J021J118R12L18k54j56O53
$$ plain form
54621 146092 147500 148921 149724 149904 149852 149811 149674 149214 148367 147244 145929 144518 143364 143017 143680 144916 146083
54604 146083 146843 147063 146607 145652 144877 144774 144965 144796 144472 144856 146130 147408 147928 147976 148271 148976 149747 150363
54586 150363 150891 151443 152099 152875 153567 153775 153308 152421 151608 151345 151957 153337 154729 155246 154825 154239 154037 153872
54568 153872 153182 152056 151106 150743 150963 151632 152616 153740 154882 156021 157068 157789 158020 157803 157319 156872 156936
54551 156936 157827 159218 160359 160925 161342 162111 163179 164177 164910 165440 165997 166995 168760 171021 173068 174574
54535 174574 175869 177180 178110 178246 177810 177273 176693 175877 174863 173771 172545 171328 170770 171335 172490 173176
54519 173176 172967 172247 171441 170730 170517 171333 172986 174355 174444 173349 171849 170369 168813 167212 165980 165340
54503 165340 164889 164113 163191 162874 163475 164384 164798 164648 164447 164458 164507 164516 164688 165107 165621 166225 167128 168295 169357
$$ packed form
54621A46092J408J421Q03J80n2m1j37m60q47j123j315j411j154l47O63J236J167
54604A46083P60K20m56r55p75j03J91j69l24L84J274J278N20M8K95P05P71O16
54586A50363N28N52O56P76O92K08m67q87q13k63O12J380J392N17m21n86k02j65
54568A53872o90j126r50l63K20O69R84J124J142J139J047P21K31k17m84m47O4
54551A56936Q91J391J141N66M17P69J068R98P33N30N57R98J765K261K047J506
54535A74574J295J311R30J36m36n37n80q16j014j092j226j217n58N65J155O86
54519A73176k09p20q06p11k13Q16J653J369Q9j095j500j480j556j601j232o40
54503A65340m51p76r22l17O01R09M14j50k01J1M9RJ72M19N14O04R03J167J062
$$ plain form
54484 169357 170170 170991 171878 172417 172419 172486 173391 175167 177250 179315 181503 183897 186219 188123 189539 190636 191638
54467 191638 192700 193894 195234 196628 197776 198379 198587 199023 199962 200797 200874 200618 201016 201997 202307 201254 199636
54450 199636 198447 197531 196233 194656 193421 192586 191640 190287 188582 186640 184877 184209 185136 186825 187876
54435 187876 187854 187399 186968 186367 185535 184879 184617 184490 184367 184558 185234 186047 186576 186701 186357 185414 184118 183250 183446
54416 183446 184512 185701 186568 187341 188441 189766 190585 190318 189361 188758 188865 188857 187975 186845 186875 188521 190824
54399 190824 192658 193779 194549 195215 195727 195922 195701 195251 195055 195380 195851 195896 195526 195170 194861 194231 193346 192884
54381 192884 193216 193921 194452 194807 195176 195381 195111 194506 194125 194381 195121 195685 195448 194536 193978 194794 196859 198959
54363 198959 199982 199819 199222 199224 200634 203498 206907 209720 211535 212598 212966 212441 211300 210201 209137 207332
$$ packed form
54484A69357Q13Q21Q87N39KO7R05J776K083K065K188K394K322J904J416J097J002
54467A91638J062J194J340J394J148O03K08M36R39Q35P7k56L98R81L10j053j618
54450A99636j189r16j298j577j235q35r46j353j705j942j763o68R27J689J051
54435A87876k2m55m31o01q32o56k62j27j23J91O76Q13N29J25l44r43j296q68J96
54416A83446J066J189Q67P73J100J325Q19k67r57o03J07qq82j130L0J646K303
54399A90824J834J121P70O66N12J95k21m50j96L25M71M5l70l56l09o30q85m62
54381A92884L32P05N31L55L69K05k70o05l81K56P40N64k37r12n58Q16K065K100
54363A98959J023j63n97KJ410K864L409K813J815J063L68n25j141j099j064j805
$$ plain form
54347 207332 204538 201668 199638 198312 197131 196079 195363 194752 193991 193388 193204 192960 192205 191493 191589 192031 191654
54330 191654 190422 189532 189507 189405 188342 186684 185100 183409 181262 179283 178404 178406 178163 177293 176670 177067 178098
54313 178098 178882 179169 179323 179521 179532 179218 178861 178849 179258 179807 180174 180301 180402 180662 180976 181080 180928 180754 180713 180645
54293 180645 180323 179761 179109 178419 177732 177249 177078 176931 176393 175517 174785 174468 174379 174365 174604 175173 175704 175859 175869 176231
54273 176231 176996 177770 178289 178613 178792 178704 178320 177878 177718 178103 179137 180629 182129 183381 184618 186078 187316
54256 187316 187570 186887 186384 187065 188697 190151 190599 190059 189054 188118 187579 187389 187124 186333 184991 183517 182368
54239 182368 181731 181561 181708 181944 182017 181787 181316 180841 180679 181064 181924 182792 183101 182650 181752 180840 180079 179463 179173
54220 179173 179517 180432 181343 181743 181775 181954 182442 182928 183116 182936 182305 181160 179926 179389 179802 180447 180469 179845 179101
$$ packed form
54347B07332k794k870k030j326j181j052p16o11p61o03j84k44p55p12R6M42l77
54330A91654j232q90k5j02j063j658j584j691k147j979q79Kk43q70o23L97J031
54313A78098P84K87J54J98J1l14l57j2M09N49L67J27J01K60L14J04j52j74m1o8
54293A80645l22n62o52o90o87m83j71j47n38q76p32l17q9j4K39N69N31J55J0L62
54273A76231P65P74N19L24J79q8l84m42j60L85J034J492J500J252J237J460J238
54256A87316K54o83n03O81J632J454M48n40j005r36n39j90k65p91j342j474j149
54239A82368o37j70J47K36P3k30m71m75j62L85Q60Q68L09m51q98r12p61o16k90
54220A79173L44R15R11M00L2J79M88M86J88j80o31j145j234n37M13O45K2o24p44
$$ plain form
54201 179101 178431 177607 176610 175747 175219 175065 175467 176558 177857 178480 178082 177131 176157 175214 174292 173652 173334 172849
54183 172849 171922 171209 171645 173153 174624 175230 175234 175287 175410 175125 174429 174076 174718 176071 177244 177731 177733 177557 177106
54164 177106 176196 175062 174277 174261 175020 176165 177028 177030 176251 175446 175165 175089 174642 173982 173807 174267 174785 174978 175044 175033
54144 175033 174477 173214 172019 171791 172400 172945 173038 173296 174501 176606 178701 179773 179527 178640 178230 178957 180532
54127 180532 182082 182874 182799 182374 182348 183041 183979 184422 184313 184393 185199 186304 186886 186792 186627 186943 187699 188516 189113
54108 189113 189461 189729 190149 190789 191496 192152 192905 193955 195203 196337 197214 197916 198411 198409 197754 196788 196142 196152 196664
54089 196664 197499 198936 201469 205092 209238 213675 219054 226054 234064 241340 246611 249961 251964 252560 251314
54074 251314 248385 244589 240623 236736 233121 230108 227836 226053 224408 222739 221076 219595 218619 218421 218930
$$ packed form
54201A79101o70q24r97q63n28j54M02J091J299O23l98r51r74r43r22o40l18m85
54183A72849r27p13M36J508J471O06MN3J23k85o96l53O42J353J173M87Kj76m51
54164A77106r10j134p85j6P59J145Q63Kp79q05k81p6m47o60j75M60N18J93O6j1
54144A75033n56j263j195k28O09N45R3K58J205K105K095J072k46q87m10P27J575
54127A80532J550P92p5m25k6O93R38M43j09Q0Q06J105N82r4j65L16P56Q17N97
54108A89113L48K68M20O40P07O56P53J050J248J134Q77P02M95ko55r66o46J0N12
54089A96664Q35J437K533L623M146M437N379P000Q010P276N271L350K003N96j246
54074B51314k929l796l966l887l615l013k272j783j645j669j663j481r76j98N09
$$ plain form
54059 218930 219768 220617 221361 221957 222419 222956 223828 224937 225899 226692 227960 230391 233890 237668 241097 244227
54043 244227 247470 251088 255130 259652 264780 270649 277412 285256 294256 304268 315066 326487 338264
54030 338264 349834 360655 370723 380421 389697 397700 403508 407057 409141 410599 411710 412178 411496 409396
54016 409396 406198 402649 399245 395785 391724 386756 380856 374052 366471 358416 350068 341305 332204 323486
54002 323486 315923 309443 303341 297305 291688 286787 282490 278671 275354 272336 269251 266174 263564 261403
53988 261403 259010 255987 252797 250065 247860 245994 244448 243072 241413 239417 237803 237172 237100 236759 236098
53973 236098 235728 235873 236149 236291 236405 236463 236207 235719 235586 236250 237484 238668 239391 239728 240073 240742 241687 242656
53955 242656 243643 244906 246504 248233 250283 253409 257957 263146 267932 272327 277153 282697 288420 294053
$$ packed form
54059B18930Q38Q49P44N96M62N37Q72J109R62P93J268K431L499L778L429L130
54043B44227L243L618M042M522N128N869O763P844R000J0012J0798J1421J1777
54030C38264J1570J0821J0068R698R276Q003N808L549K084J458J111M68o82k100
54016D09396l198l549l404l460m061m968n900o804p581q055q348q763r101q718
54002C23486p563o480o102o036n617m901m297l819l317l018l085l077k610k161
53988B61403k393l023l190k732k205j866j546j376j659j996j614o31p2l41o61
53973B36098l70J45K76J42J14N8k56m88j33O64J234J184P23L37L45O69R45R69
53955B42656R87J263J598J729K050L126M548N189M786M395M826N544N723N633
$$ plain form
53941 294053 300178 307432 315724 324576 333840 343696 354165 364803 374706 382773 388306 391523 393259 394123
53927 394123 394202 393629 393005 393042 394097 396275 399756 404769 411335 419174 427776 436556 445195 453958 463469 474038
53911 474038 485331 496790 508125 519228 529688 538616 545048 548605 549811 549687 548927 547543 545344
53898 545344 542446 539038 534904 529696 523614 517314 511043 504251 496246 486871 476405 465189 453590
53885 453590 442062 430909 420179 409989 400779 392900 386025 379269 371978 364269 356849 350392 345043
53872 345043 340330 335518 330191 324588 319323 314720 310458 305930 300933 295848 291087 286600 282166 277974
53858 277974 274469 271592 268682 265379 262182 259733 257908 256126 254366 253269 253192 253615 253651 252847 251393 249804
53842 249804 248493 247457 246303 244748 243095 242043 242017 242790 243676 243988 243519 242849 243002 244423 246438 248034
$$ packed form
53941B94053O125P254Q292Q852R264R856J0469J0638R903Q067N533L217J736Q64
53927C94123P9n73o24L7J055K178L481N013O566P839Q602Q780Q639Q763R511J0569
53911D74038J1293J1459J1335J1103J0460Q928O432L557J206j24p60j384k199
53898E45344k898l408m134n208o082o300o271o792q005r375j0466j1216j1599
53885D53590j1528j1153j0730j0190r210p879o875o756p291p709p420o457n349
53872C45043m713m812n327n603n265m603m262m528m997n085m761m487m434m192
53858B77974l505k877k910l303l197k449j825j782j760j097p7M23L6q04j454j589
53842B49804j311j036j154j555j653j052k6P73Q86L12m69o70J53J421K015J596
$$ plain form
53826 248034 249017 249956 251154 252269 252986 253503 254185 255176 256497 258166 260058 262028 264211 266897 269997 273088
53810 273088 276018 279046 282326 285809 289724 294467 299820 305021 310083 316249 324444 333766 342413 349732
53796 349732 356543 363570 370532 376932 382881 388648 393917 398014 400697 402364 403626 404853 406024 406798
53782 406798 406785 405905 404376 402196 398765 393302 385749 377056 368419 360274 352244 344023 336017 328946 323037
53767 323037 317901 313090 308456 303958 299477 295011 290822 287163 283995 281099 278356 275787 273438 271340
53753 271340 269452 267519 265114 262062 258781 256067 254476 253968 254019 253982 253436 252399 251278 250496 250075 249582
53737 249582 248578 247119 245745 244895 244482 244188 244092 244580 245535 246107 245682 244825 244720 245762 247216 248318 249158
53720 249158 250252 251685 253070 254186 255264 256670 258469 260385 262095 263549 264987 266631 268533 270767
$$ packed form
53826B48034R83R39J198J115P17N17O82R91J321J669J892J970K183K686L100L091
53810B73088K930L028L280L483L915M743N353N201N062O166Q195R322Q647P319
53796C49732O811P027O962O400N949N767N269M097K683J667J262J227J171P74
53782D06798j3q80j529k180l431n463p553q693q637q145q030q221q006p071n909
53767C23037n136m811m634m498m481m466m189l659l168k896k743k569k349k098
53753B71340j888j933k405l052l281k714j591n08N1l7n46j037j121p82m21m93
53737B49582j004j459j374q50m13k94r6M88R55N72m25q57j05J042J454J102Q40
53720B49158J094J433J385J116J078J406J799J916J710J454J438J644J902K234
$$ plain form
53706 270767 273519 276776 280134 283262 286331 289580 292651 294897 296392 298080 300751 304319 308178 311880
53692 311880 315329 318736 322484 326609 330325 332600 333361 333588 333986 334213 333722 332702 331711 330936 330362 330185
53676 330185 330408 330475 329991 329493 329758 330560 330892 330324 329405 328708 328165 327497 326694 325861 325035 324335 323910 323649 323282
53657 323282 322849 322653 322638 322305 321420 320367 319577 318962 318255 317577 317239 317197 317117 316974 317189 318042 319218 320168 320831
53638 320831 321674 322955 324273 325125 325712 326664 327992 328891 328892 328718 329491 331434 333855 336191 338465 340742 342874
53621 342874 344956 347524 350993 355211 359791 364615 369752 375084 380263 385007 389316 393506 398064 403343
53607 403343 409246 415282 420989 426227 431080 435565 439467 442458 444356 445326 445744 445835 445605 445184 444924 444974
53591 444974 444967 444502 443757 443230 442968 442472 441392 439939 438514 437249 436048 434836 433676 432779 432384 432445 432484 432021
$$ packed form
53706B70767K752L257L358L128L069L249L071K246J495J688K671L568L859L702
53692C11880L449L407L748M125L716K275P61K27L98K27m91j020r91p75n74j77
53676C30185K23O7m84m98K65Q02L32n68r19o97n43o68q03q33q26p00m25k61l67
53657C23282m33j96j5l33q85j053p90o15p07o78l38m2q0j43K15Q53J176R50O63
53638C20831Q43J281J318Q52N87R52J328Q99Jj74P73J943K421K336K274K277K132
53621C42874K082K568L469M218M580M824N137N332N179M744M309M190M558N279
53607D03343N903O036N707N238M853M485L902K991J898R70M18R1k30m21k60N0
53591D44974pm65p45n27k62m96j080j453j425j265j201j212j160q97l95O1L9m63
$$ plain form
53573 432021 431064 429893 428489 426640 424585 423027 422276 421825 420965 419484 417578 415455 413360 411693 410770
53558 410770 410545 410765 411259 411952 412835 414043 415745 417834 419973 422005 423935 425407 425773 425120 424776 426176
53542 426176 429385 433254 436841 440057 442983 445347 447018 448574 450959 454751 459984 466451 473920 482154
53528 482154 490969 500327 510234 520615 531380 542602 554452 566938 579832 592932 606396 620691
53516 620691 636201 652932 670691 689461 709449 730751 753200 776593 800874 825918 851362
53505 851362 876944 902886 929603 956980 984297 1010984 1037176 1063281 1089281 1114841 1139971
53494 1139971 1165086 1190292 1215006 1238605 1261221 1283520 1305765 1327500 1348199 1367903 1387039
53483 1387039 1405925 1424724 1443743 1463370 1483700 1504380 1524897 1544894 1564191 1582591 1599694
$$ packed form
53573D32021r57j171j404j849k055j558p51m51q60j481j906k123k095j667r23
53558D10770k25K20M94O93Q83J208J702K089K139K032J930J472L66o53l44J400
53542D26176L209L869L587L216K926K364J671J556K385L792N233O467P469Q234
53528D82154Q815R358R907J0381J0765J1222J1850J2486J2894J3100J3464J4295
53516F20691J5510J6731J7759J8770J9988K1302K2449K3393K4281K5044K5444
53505H51362K5582K5942K6717K7377K7317K6687K6192K6105K6000K5560K5130
53494A139971K5115K5206K4714K3599K2616K2299K2245K1735K0699J9704J9136
53483A387039J8886J8799J9019J9627K0330K0680K0517J9997J9297J8400J7103
$$ plain form
53472 1599694 1614888 1627645 1637876 1645831 1651473 1654143 1653069 1648131 1639858 1628843 1615573 1600775
53460 1600775 1585361 1569805 1553893 1537316 1520151 1502509 1484072 1464398 1443515 1421792 1399406
53449 1399406 1376343 1352886 1329560 1306457 1283031 1258923 1234757 1211789 1190788 1171458 1152994
53438 1152994 1135037 1118047 1102870 1090041 1079464 1070608 1062899 1055988 1049862 1044797 1041175 1039314 1039455
53425 1039455 1041809 1046336 1052508 1059632 1067602 1077069 1088526 1101536 1115328 1130049 1146880 1166796
53413 1166796 1189681 1214766 1241398 1269143 1297746 1327524 1359495 1394400 1431725 1470236 1509476
53402 1509476 1550175 1593192 1638647 1686288 1736084 1788054 1841969 1897660 1955273 2014770 2075451
53391 2075451 2136547 2198131 2260827 2324589 2388335 2450928 2512050 2571878 2630348 2687080 2741737
$$ packed form
53472A599694J5194J2757J0231P955N642K670j074m938q273j1015j3270j4798
53460A600775j5414j5556j5912j6577j7165j7642j8437j9674k0883k1723k2386
53449A399406k3063k3457k3326k3103k3426k4108k4166k2968k1001j9330j8464
53438A152994j7957j6990j5177j2829j0577q856p709o911o126n065l622j861J41
53425A039455K354M527O172P124P970R467J1457J3010J3792J4721J6831J9916
53413A166796K2885K5085K6632K7745K8603K9778L1971L4905L7325L8511L9240
53402A509476M0699M3017M5455M7641M9796N1970N3915N5691N7613N9497O0681
53391B075451O1096O1584O2696O3762O3746O2593O1122N9828N8470N6732N4657
$$ plain form
53380 2741737 2794006 2843364 2889301 2931910 2971995 3010370 3047067 3081303 3112161 3139115 3161807
53369 3161807 3179477 3190925 3195121 3191596 3180080 3160056 3131073 3093506 3048710 2998436 2944272 2887514
53357 2887514 2829167 2769938 2710458 2651495 2593685 2537166 2481887 2428277 2377034 2328054 2280021
53346 2280021 2231349 2181206 2129450 2076145 2021654 1966900 1912933 1860276 1808921 1758789 1709920
53335 1709920 1662552 1617435 1575767 1538281 1504525 1473496 1444783 1418544 1394555 1372002 1350306
53324 1350306 1329482 1309441 1289491 1268973 1248079 1227734 1208903 1192227 1178025 1166248 1156469
53313 1156469 1148165 1141077 1135294 1131079 1128722 1128423 1130183 1133728 1138569 1144301 1151052 1159662 1171073 1185327
53299 1185327 1201474 1218657 1236980 1256966 1278599 1301492 1325683 1351526 1378866 1407148 1436386
$$ packed form
53380B741737N2269M9358M5937M2609M0085L8375L6697L4236L0858K6954K2692
53369C161807J7670J1448M196l525j1516k0024k8983l7567m4796n0274n4164n6758
53357B887514n8347n9229n9480n8963n7810n6519n5279n3610n1243m8980m8033
53346B280021m8672n0143n1756n3305n4491n4754n3967n2657n1355n0132m8869
53335A709920m7368m5117m1668l7486l3756l1029k8713k6239k3989k2553k1696
53324A350306k0824k0041j9950k0518k0894k0345j8831j6676j4202j1777r779
53313A156469q304p088n783m215k357k99J760L545M841N732O751Q610J1411J4254
53299A185327J6147J7183J8323J9986K1633K2893K4191K5843K7340K8282K9238
$$ plain form
53288 1436386 1467130 1499178 1531074 1561419 1590129 1617922 1645080 1671238 1695913 1718645 1738939
53277 1738939 1756670 1772312 1786206 1797793 1806153 1811091 1813061 1812137 1807797 1799817 1788663 1774767 1757939
53264 1757939 1737881 1714877 1689571 1662365 1633423 1603127 1572111 1540821 1509260 1477254 1444840
53253 1444840 1412348 1380182 1348613 1317807 1287998 1259469 1232226 1205709 1179004 1151380 1122568
53242 1122568 1092580 1061451 1029264 996282 962953 929840 897629 867026 838411 811513 785689
53231 785689 760765 737562 717311 700459 686233 673529 661931 651559 642066 632293 621097 608224
53219 608224 594214 579714 565096 550501 535915 521239 506519 492088 478340 465427 453377
53208 453377 442433 433044 425417 419129 413292 407145 400579 394087 388103 382446 376584 370440 364589 359546
$$ packed form
53288A436386L0744L2048L1896L0345K8710K7793K7158K6158K4675K2732K0294
53277A738939J7731J5642J3894J1587Q360M938J970r24m340p980j1154j3896j6828
53264A757939k0058k3004k5306k7206k8942l0296l1016l1290l1561l2006l2414
53253A444840l2492l2166l1569l0806k9809k8529k7243k6517k6705k7624k8812
53242A122568k9988l1129l2187l2982l3329l3113l2211l0603k8615k6898k5824
53231G85689k4924k3203k0251j6852j4226j2704j1598j0372r493r773j1196j2873
53219F08224j4010j4500j4618j4595j4586j4676j4720j4431j3748j2913j2050
53208D53377j0944r389p627o288n837o147o566o492n984n657n862o144n851n043
$$ plain form
53194 359546 355160 350930 346645 342392 338170 333930 329932 326590 323904 321371 318619 315845 313481 311604
53180 311604 309905 308138 306403 304917 303610 302119 300277 298461 297158 296170 294686 292398 290169 289103
53166 289103 289195 289408 288965 287929 286522 284592 282116 279639 277749 276450 275472 274867 274769 274852 274586 273982 273541
53149 273541 273452 273368 273039 272684 272552 272521 272402 272239 272027 271478 270505 269709 269921 271274 273095 274709 276039 277378
53131 277378 278860 280294 281300 281583 281262 280968 281335 282269 283007 283052 282828 283204 284577 286663 289029 291456 293762
53114 293762 295584 296522 296470 295734 294822 294100 293560 292930 291967 290654 289132 287591 286170 284808 283218 281296
53098 281296 279566 278827 279166 279699 279586 278974 278504 278209 277527 276301 275073 274206 273336 272046 270708 270221 270996
53081 270996 272481 273674 274022 273882 274130 275175 276405 276817 276158 275140 274500 274228 273881 273248 272395 271346 270124
$$ packed form
53194C59546m386m230m285m253m222m240l998l342k686k533k752k774k364j877
53180C11604j699j767j735j486j307j491j842j816j303r88j484k288k229j066
53166B89103R2K13m43j036j407j930k476k477j890j299r78o05r8Q3k66o04m41
53149B73541q9q4l29l55j32l1j19j63k12n49r73p96K12J353J821J614J330J339
53131B77378J482J434J006K83l21k94L67R34P38M5k24L76J373K086K366K427K306
53114B93762J822R38n2p36r12p22n40o30r63j313j522j541j421j362j590j922
53098B81296j730p39L39N33j13o12m70k95o82j226j228q67q70j290j338m87P75
53081B70996J485J193L48j40K48J045J230M12o59j018o40k72l47o33q53j049j222
$$ plain form
53064 270124 269023 268525 268912 270073 271615 273027 273879 274025 273634 272986 272369 272140 272585 273604 274803 276038
53048 276038 277561 279439 281213 282447 283315 284184 284863 284783 283878 282738 281848 281137 280470 280138 280519 281460 282314
53031 282314 282544 282144 281539 281203 281286 281500 281486 281377 281853 283435 285744 287753 288787 289083 289292 289709 290260 291033
53013 291033 292312 293989 295400 296042 296204 296572 297383 298295 298937 299248 299394 299773 300969 303176 305605 307025
52997 307025 307034 306419 306122 306342 306854 307653 308824 310163 311406 312618 314009 315557 317167 318934 320900 322721
52981 322721 324034 325033 326313 328186 330420 332566 334275 335458 336426 337679 339305 340785 341702 342319 343078
52966 343078 343902 344569 345450 347071 349076 350468 350917 350993 350917 350015 347866 345264 343345 342255 341348 340351 339581
52949 339581 339173 338796 338146 337138 335529 332987 329782 326963 325436 325118 325320 325681 326306 327095 327470 326965 325739
$$ packed form
53064B70124j101m98L87J161J542J412Q52J46l91o48o17k29M45J019J199J235
53048B76038J523J878J774J234Q68Q69O79q0r05j140q90p11o67l32L81R41Q54
53031B82314K30m00o05l36Q3K14j4j09M76J582K309K009J034K96K09M17N51P73
53013B91033J279J677J411O42J62L68Q11R12O42L11J46L79J196K207K429J420
52997C07025Ro15k97K20N12P99J171J339J243J212J391J548J610J767J966J821
52981C22721J313R99J280J873K234K146J709J183R68J253J626J480R17O17P59
52966C43078Q24O67Q81J621K005J392M49P6p6r02k149k602j919j090r07r97p70
52949C39581m08l77o50j008j609k542l205k819j527l18K02L61O25P89L75n05j226
$$ plain form
52932 325739 324303 323016 322101 321886 322532 323575 324205 324147 323978 324388 325396 326401 326747 326111 324656 323046 322000
52915 322000 321596 321261 320685 320364 320885 321977 322764 322769 322187 321298 320177 318950 317793 316566 314941 313032 311470
52898 311470 310707 310577 310711 310986 311402 311895 312575 313863 316023 318680 321062 322711 323762 324563 325175 325258 324414
52881 324414 322640 320439 318448 317028 316244 316044 316284 316746 317338 318185 319318 320471 321441 322448 323761 325130
52865 325130 326066 326587 327170 327997 328754 329218 329512 329694 329589 329141 328387 326962 324289 320546 316818 313852 311215
52848 311215 308145 304729 301588 298759 295643 291987 288278 285159 282918 281530 280679 279702 278021 275845 274157
52833 274157 273755 274482 275503 276172 276511 276955 277702 278397 278514 278071 277678 277702 277662 276852 275470 274625 275081 276318
52815 276318 277113 276912 276392 276695 278258 280432 282156 282928 283096 283258 283522 283442 282579 280948 278878 276561 273919
$$ packed form
52932C25739j436j287r15k15O46J043O30n8j69M10J008J005L46o36j455j610j046
52915C22000m04l35n76l21N21J092P87Nn82q89j121j227j157j227j625j909j562
52898C11470p63j30J34K75M16M93O80J288K160K657K382J649J051Q01O12Q3q44
52881C24414j774k201j991j420p84k00K40M62N92Q47J133J153R70J007J313J369
52865C25130R36N21N83Q27P57M64K94J82j05m48p54j425k673l743l728k966k637
52848C11215l070l416l141k829l116l656l709l119k241j388q51r77j681k176j688
52833B74157m02P27J021O69L39M44P47O95J17m43l93K4m0q10j382q45M56J237
52815B76318P95k01n20L03J563K174J724P72J68J62K64q0q63j631k070k317k642
$$ plain form
52798 273919 270982 268239 266434 265923 266350 267004 267390 267372 266982 266308 265490 264629 263782 263235 263594 265199 267542
52781 267542 269681 271227 272497 273680 274461 274727 275071 276100 277532 278465 278398 277599 276586 275590 274486 272989
52765 272989 270998 268952 267715 267787 268716 269593 270041 270377 270827 271079 270780 270132 269656 269492 269332 269093 269320 270629
52747 270629 272854 275147 277006 278835 281203 283920 286286 288075 289693 291434 293188 294952 296977 299151
52733 299151 300856 301851 302771 304316 306379 308436 310314 311976 312937 312677 311460 310082 308834 307400 305706
52718 305706 304195 303123 302241 301351 300623 300131 299541 298614 297590 296759 295964 294903 293741 293060 293241 294098 295090
52701 295090 295812 296315 296972 298023 299315 300592 301885 303361 304909 306262 307440 308661 309785 310321 310092
52686 310092 309452 308678 307654 306444 305684 305866 306549 306801 306289 305451 304719 304049 303264 302372 301422 300411 299494 298968
$$ packed form
52798B73919k937k743j805n11M27O54L86j8l90o74q18q61q47n47L59J605K343
52781B67542K139J546J270J183P81K66L44J029J432R33o7p99j013r96j104j497
52765B72989j991k046j237P2R29Q77M48L36M50K52k99o48m76j64j60k39K27J309
52747B70629K225K293J859J829K368K717K366J789J618J741J754J764K025K174
52733B99151J705R95R20J545K063K057J878J662R61k60j217j378j248j434j694
52718C05706j511j072q82q90p28m92n90r27j024q31p95j061j162o81J81Q57R92
52701B95090P22N03O57J051J292J277J293J476J548J353J178J221J124N36k29
52686C10092o40p74j024j210p60J82O83K52n12q38p32o70p85q92r50j011r17n26
$$ plain form
52668 298968 298851 298758 298380 297907 297686 297679 297587 297442 297688 298572 299709 300495 300870 301483 303081 305811 309108 312178
52650 312178 314564 316331 317830 319319 320766 321820 321942 320721 318326 315639 313723 312982 312942 312908 312657 312399
52634 312399 312281 312171 311816 310990 309582 307764 305986 304650 303851 303635 304235 305686 307389 308565 309132 309620
52618 309620 310201 310433 310132 309911 310471 311810 313488 315256 317023 318558 319729 320796 321997 323080 323687 323988
52602 323988 324429 325018 325397 325538 325783 326221 326576 326806 327301 328307 329551 330614 331351 331870 332420 333373 334914
52585 334914 336658 337923 338514 338887 339448 340140 340917 342085 343739 345231 345779 345515 345371 345907 346626 346632 345627
52568 345627 344033 342355 340749 339255 338105 337552 337449 337288 336752 336032 335447 334966 334264 333182 331875 330621
52552 330621 329664 329125 328778 328016 326410 324341 322704 321922 321615 321339 321191 321354 321477 321075 320414 320440 321613 323266
$$ packed form
52668B98968j17r3l78m73k21pr2j45K46Q84J137P86L75O13J598K730L297L070
52650C12178K386J767J499J489J447J054J22j221k395k687j916p41m0l4k51k58
52634C12399j18j10l55q26j408j818j778j336p99k16O00J451J703J176N67M88
52618C09620N81K32l01k21N60J339J678J768J767J535J171J067J201J083O07L01
52602C23988M41N89L79J41K45M38L55K30M95J006J244J063P37N19N50R53J541
52585C34914J744J265N91L73N61O92P77J168J654J492N48k64j44N36P19Oj005
52568C45627j594j678j606j494j150n53j03j61n36p20n85m81p02j082j307j254
52552C30621r57n39l47p62j606k069j637p82l07k76j48J63J23m02o61K6J173J653
$$ plain form
52534 323266 324401 324845 325169 325635 325752 325109 324189 323919 324656 325993 327463 328840 329791 329885 329292 328943 329504 330523
52516 330523 331097 331219 331960 334295 338172 342737 347150 351116 354832 358513 361861 364054 364327 362450 358700
52501 358700 353737 348663 344614 341864 339631 337231 335014 333625 332800 331694 330125 328617 327361 326090
52487 326090 324998 324732 325185 325294 324589 324056 324777 326327 327306 327113 326480 326478 327532 329330 331139 332251 332462
52470 332462 332187 331967 332019 332350 333001 333961 335131 336566 338460 340734 342995 345092 347205 349103 349838 348652
52454 348652 345822 342158 338114 333907 330084 327217 325175 323303 321227 318955 316410 313533 310823 309085
52440 309085 308439 308136 307531 306857 306873 308026 310028 311979 312879 312359 311038 309952 309607 309714 309689 309128 307966
52423 307966 306595 305807 306194 307564 309216 310680 311890 312861 313713 314877 316669 318711 320458 322307 325484
$$ packed form
52534C23266J135M44L24M66J17o43r20k70P37J337J470J377R51R4n93l49N61J019
52516C30523N74J22P41K335L877M565M413L966L716L681L348K193K73j877l750
52501C58700m963n074m049k750k233k400k217j389q25j106j569j508j256j271
52487C26090j092k66M53J09p05n33P21J550R79j93o33kJ054J798J809J112K11
52470C32462k75k20N2L31O51R60J170J435J894K274K261K097K113J898P35j186
52454C48652k830l664m044m207l823k867k042j872k076k272k545k877k710j738
52440C09085o46l03o05o74J6J153K002J951R00n20j321j086l45J07k5n61j162
52423C07966j371p88L87J370J652J464J210R71Q52J164J792K042J747J849L177
$$ plain form
52408 325484 330572 336830 343311 349976 357280 365179 373123 380615 387219 392314 395396 396452 395561 392414
52394 392414 386849 379751 372747 366897 362120 357957 354334 351401 349135 347479 346554 346379 346587 346815 347299
52379 347299 348683 351207 354423 357871 361751 366551 372150 377688 382431 386469 390299 394025 397333 400103
52365 400103 402538 404584 405726 405675 404911 404172 403586 402700 401251 399504 397907 396859 396858 398360 401204 404453
52349 404453 407134 409004 410462 411921 413558 415494 417840 420563 423568 426927 430802 435185 439962 445243
52335 445243 451285 458014 464989 472077 479870 489155 500181 512761 526858 542562 559474 576634 593406
52322 593406 610167 627804 646531 665493 683567 700430 716734 733300 750272 767142 783570
52311 783570 800025 817473 836468 856638 877058 897005 916332 935277 954067 972677 990819
$$ packed form
52408C25484N088O258O481O665P304P899P944P492O604N095L082J056q91l147
52394C92414n565p098p004n850m777m163l623k933k266j656r25j75K08K28M84
52379C47299J384K524L216L448L880M800N599N538M743M038L830L726L308K770
52365D00103K435K046J142n1p64p39n86q86j449j747j597j048jJ502K844L249
52349D04453K681J870J458J459J637J936K346K723L005L359L875M383M777N281
52335D45243O042O729O975P088P793R285J1026J2580J4097J5704J6912J7160J6772
52322E93406J6761J7637J8727J8962J8074J6863J6304J6566J6972J6870J6428
52311G83570J6455J7448J8995K0170K0420J9947J9327J8945J8790J8610J8142
$$ plain form
52300 990819 1008070 1024032 1038522 1051633 1063504 1073913 1082233 1087941 1091100 1092089 1090982 1087657 1082572
52287 1082572 1076877 1071392 1065840 1059579 1052867 1046898 1042671 1040268 1039173 1038873 1039143 1040136 1042296 1045894 1050741
52272 1050741 1056649 1063981 1073197 1083943 1095241 1106625 1118415 1130760 1143144 1155188 1167304 1180132
52260 1180132 1193856 1208478 1224187 1240886 1257806 1274310 1290761 1307962 1325909 1343681 1360406
52249 1360406 1375720 1389349 1400849 1409945 1416773 1421746 1425439 1428443 1431007 1432908 1434031 1434870 1436017
52236 1436017 1437369 1438445 1439458 1441424 1445060 1450075 1455713 1461579 1467694 1474077 1480553 1486870 1492970 1499237
52222 1499237 1506338 1514515 1523185 1531626 1539905 1548684 1558269 1568481 1579455 1591753 1605393 1619371 1632583
52209 1632583 1644855 1656761 1668856 1681436 1694661 1708390 1722078 1735247 1747928 1760421 1772818
$$ packed form
52300I90819J7251J5962J4490J3111J1871J0409Q320N708L159R89j107l325n085
52287A082572n695n485n552o261o712n969m227k403j095l00K70R93K160L598M847
52272A050741N908P332R216J0746J1298J1384J1790J2345J2384J2044J2116J2828
52260A180132J3724J4622J5709J6699J6920J6504J6451J7201J7947J7772J6725
52249A360406J5314J3629J1500R096O828M973L693L004K564J901J123Q39J147
52236A436017J352J076J013J966L636N015N638N866O115O383O476O317O100O267
52222A499237P101Q177Q670Q441Q279Q779R585J0212J0974J2298J3640J3978J3212
52209A632583J2272J1906J2095J2580J3225J3729J3688J3169J2681J2493J2397
$$ plain form
52198 1772818 1785113 1797548 1810445 1823723 1836918 1849692 1862082 1874272 1886279 1897751 1907882
52187 1907882 1915642 1920410 1922390 1922217 1920204 1916165 1909908 1901594 1891579 1880179 1867793 1855060 1842615
52174 1842615 1830673 1819019 1807469 1796237 1785738 1776217 1767712 1760319 1754146 1748991 1744423 1740395 1737453
52161 1737453 1735966 1735386 1734711 1733547 1732235 1730932 1729095 1726127 1722099 1717585 1713038 1708596 1704314 1700303
52147 1700303 1696709 1693669 1691225 1689226 1687375 1685326 1682533 1678191 1671776 1663743 1655250 1647069 1639116 1631205
52133 1631205 1623713 1617198 1611864 1607947 1606245 1607601 1611928 1618333 1626205 1635746 1647371 1661086 1676617
52120 1676617 1693720 1712134 1731466 1751363 1771630 1792005 1812099 1831716 1851023 1870103 1888492
52109 1888492 1905590 1921551 1937422 1954126 1971557 1988938 2005918 2022909 2040243 2057421 2073486
$$ packed form
52198A772818J2295J2435J2897J3278J3195J2774J2390J2190J2007J1472J0131
52187A907882P760M768J980j73k013m039o257q314j0015j1400j2386j2733j2445
52174A842615j1942j1654j1550j1232j0499r521q505p393o173n155m568m028k942
52161A737453j487n80o75j164j312j303j837k968m028m514m547m442m282m011
52147A700303l594l040k444j999j851k049k793m342o415q033q493q181p953p911
52133A631205p492o515n334l917j702J356M327O405P872R541J1625J3715J5531
52120A676617J7103J8414J9332J9897K0267K0375K0094J9617J9307J9080J8389
52109A888492J7098J5961J5871J6704J7431J7381J6980J6991J7334J7178J6065
$$ plain form
52098 2073486 2087919 2100776 2111980 2120825 2126319 2127919 2125860 2120936 2114009 2105627 2096065 2085636 2074833
52085 2074833 2064072 2053523 2043414 2034288 2026657 2020594 2015991 2013038 2011960 2012425 2013844 2016304 2020596
52072 2020596 2027122 2035387 2044873 2055796 2068527 2082756 2097817 2113447 2129641 2145998 2161852 2176992
52060 2176992 2191725 2206234 2220338 2233783 2246268 2257188 2265864 2272120 2276134 2277643 2275776 2269965
52048 2269965 2260619 2248588 2234305 2217742 2198940 2178178 2155764 2132055 2107707 2083536 2060065
52037 2060065 2037422 2015794 1995704 1977562 1961084 1945508 1930506 1916580 1904394 1893890 1884394
52026 1884394 1875405 1866899 1858840 1850835 1842522 1834005 1825666 1817717 1810150 1802914 1795899 1788785 1781119 1772502
52012 1772502 1762624 1751302 1738615 1724797 1709738 1692710 1672839 1649790 1623824 1595355 1564677
$$ packed form
52098B073486J4433J2857J1204Q845N494J600k059m924o927q382r562j0429j0803
52085B074833j0761j0549j0109r126p631o063m603k953j078M65J419K460M292
52072B020596O526Q265R486J0923J2731J4229J5061J5630J6194J6357J5854J5140
52060B176992J4733J4509J4104J3445J2485J0920Q676O256M014J509j867n811
52048B269965r346j2031j4283j6563j8802k0762k2414k3709k4348k4171k3471
52037B060065k2643k1628k0090j8142j6478j5576j5002j3926j2186j0504r496
52026A884394q989q506q059q005q313q517q339p949p567p236p015p114p666q617
52012A772502r878j1322j2687j3818j5059j7028j9871k3049k5966k8469l0678
$$ plain form
52001 1564677 1532069 1497942 1462889 1427712 1393253 1360023 1328064 1297275 1267663 1239140 1211339
51990 1211339 1183892 1156663 1129461 1101818 1073526 1045153 1017558 990921 964682 938419 912377
51979 912377 887166 863413 841689 822213 804451 787470 771020 755971 743522 734251 728101 724883
51967 724883 724359 726009 729062 732851 736986 741233 745327 748905 751483 752523 751540 748249 742734 735550 727513
51952 727513 719231 710901 702688 695153 689139 685366 684253 685889 689878 695467 702206 710325 720127 731281
51938 731281 743209 755835 769190 782425 794085 803527 811194 817208 820532 820089 816090 809640 801524
51925 801524 792030 781576 770774 760043 749726 740488 733035 727424 723011 718963 714482 708727 701148
51912 701148 691958 681925 671620 661159 650590 640206 630476 621962 615254 610647 607846 606216 605240
$$ packed form
52001A564677l2608l4127l5053l5177l4459l3230l1959l0789k9612k8523k7801
51990A211339k7447k7229k7202k7643k8292k8373k7595k6637k6239k6263k6042
51979I12377k5211k3753k1724j9476j7762j6981j6450j5049j2449r271o150l218
51967G24883n24J650L053L789M135M247M094L578K578J040r83l291n515p184q037
51952G27513q282q330q213p535o014l773j113J636L989N589O739Q119R802J1154
51938G31281J1928J2626J3355J3235J1660R442P667O014L324m43l999o450q116
51925H01524r494j0454j0802j0731j0317r238p453n611m413m048m481n755p579
51912G01148r190j0033j0305j0461j0569j0384r730q514o708m607k801j630r76
$$ plain form
51899 605240 604451 603038 599916 594308 586120 575832 564233 552112 539880 527570 515404 504143 494538
51886 494538 486660 480217 475337 472500 471839 473031 475887 480452 486557 493914 502694 513272 525132 536688
51872 536688 546548 554395 560257 563565 563591 560549 555676 550330 545392 541238 537787 534621 531480 528681 526772
51857 526772 525921 525929 526681 528181 530156 531972 532984 532780 531153 528123 524054 519479 514699 509608 503941 497735
51841 497735 491695 487023 484524 483669 482869 480939 478089 475326 473351 472436 472931 475097 478492 482133 485326
51826 485326 487907 489689 490281 489593 488064 486179 484149 482142 480395 478914 477495 476270 475846 476615 478153
51811 478153 479597 480394 480527 480293 480067 480029 479917 479243 477956 476601 475690 475249 475249 475989 477633 479605 480985 481407
51793 481407 481116 480297 478802 476580 473914 471091 468136 465068 462226 460191 459351 459524 459905 459543 458138 456388
$$ packed form
51899F05240p89j413l122n608q188j0288j1599j2121j2232j2310j2166j1261r605
51886D94538p878o443m880k837o61J192K856M565O105P357Q780J0578J1860J1556
51872E36688R860P847N862L308K6l042m873n346m938m154l451l166l141k799j909
51857E26772q51QP52J500J975J816J012k04j627l030m069m575m780n091n667o206
51841D97735o040m672k499q55q00j930k850k763j975r15M95K166L395L641L193
51826D85326K581J782N92o88j529j885k030k007j747j481j419j225m24P69J538
51811D78153J444P97J33k34k26l8j12o74j287j355r11m41%P40J644J972J380M22
51793D81407k91q19j495k222k666k823k955l068k842k035q40J73L81l62j405j750
$$ plain form
51777 456388 455410 455850 457602 460248 463535 467505 472411 478450 485495 493177 501320 510023 519048 527422 534091
51762 534091 538770 541701 542690 541060 536649 530276 522967 515140 506829 498272 489865 481804 474187 467273
51748 467273 461247 455854 450687 445900 442273 440394 440018 440457 441503 443707 447672 453212 459418 465520 471487
51733 471487 477720 484361 491081 497300 502366 505710 507289 507985 509183 511695 515176 518616 521159 522402
51719 522402 522243 520747 518131 514722 510895 507038 503413 500035 496840 493941 491460 489079 486121 482346
51705 482346 478473 475633 474396 474430 474928 475170 474823 474036 473281 472893 472671 472029 470639 468864 467517 467111 467338
51688 467338 467323 466402 464550 462066 459086 455651 452026 448625 445622 442932 440501 438354 436444 434904 434375
51673 434375 435495 437996 440871 443672 447071 451840 457850 464598 472162 480961 490761 500539 509151 515612
$$ packed form
51777D56388r78M40J752K646L287L970M906O039P045P682Q143Q703R025Q374O669
51762E34091M679K931R89j630m411o373p309p827q311q557q407q061p617o914
51748D67273o026n393n167m787l627j879l76M39J046K204L965N540O206O102N967
51733D71487O233O641O720O219N066L344J579O96J198K512L481L440K543J243
51719E22402j59j496k616l409l827l857l625l378l195k899k481k381k958l775
51705D82346l873k840j237L4M98K42l47p87p55l88k22o42j390j775j347m06K27
51688D67338j5r21j852k484k980l435l625l401l003k690k431k147j910j540n29
51673D34375J120K501K875K801L399M769O010O748P564Q799R800R778Q612O461
$$ plain form
51659 515612 518937 518579 515194 510419 505651 501372 497768 495441 495132 496995 500494 504878 509485 513587 516220
51644 516220 516389 513551 507890 500011 490413 479470 467945 457106 447986 440720 434884 430281 427069 425319
51630 425319 424913 425793 427869 430731 433856 437036 440181 442786 444227 444693 445165 446202 447250 447391 446304
51615 446304 444143 441052 437411 434101 431810 430133 427989 424955 421692 419047 417269 416253 416032 416629 417786
51600 417786 419235 421119 423850 427653 432582 438849 446740 456084 466060 475639 484011 490458 494125 494316
51586 494316 491106 485500 478955 472768 467746 464128 461802 460816 461734 465279 471582 479988 489778 500819
51572 500819 513401 527608 543144 559701 577236 595835 615431 635699 656281 677174 698954
51561 698954 722530 748630 777586 809490 844234 881191 918988 955652 988792 1015715 1033905
$$ packed form
51659E15612L325l58l385m775m768m279l604k327l09J863L499M384M607M102K633
51644E16220J69k838n661p879r598j0943j1525j0839r120p266n836m603l212j750
51630D25319m06Q80K076K862L125L180L145K605J441M66M72J037J048J41j087
51615D46304k161l091l641l310k291j677k144l034l263k645j778j016k21N97J157
51600D17786J449J884K731L803M929O267P891R344R976R579Q372O447L667J91
51586D94316l210n606o545o187n022l618k326r86R18L545O303Q406R790J1041
51572E00819J2582J4207J5536J6557J7535J8599J9596K0268K0582K0893K1780
51561F98954K3576K6100K8956L1904L4744L6957L7797L6664L3140K6923J8190
$$ plain form
51550 1033905 1041926 1039864 1028758 1009734 983760 951919 915585 876400 836130 796256 757494 720048
51538 720048 684582 652555 625199 602442 583266 566788 552588 540380 530063 521940 516163 512072
51526 512072 508671 505733 503705 502643 502020 501684 502084 503220 504093 503695 501977 499427 496253 492494 488457
51511 488457 484472 480517 476549 472899 469824 466923 463535 459587 455577 451900 448680 446146 444642 444160
51497 444160 444266 444500 444551 444021 442513 440162 437866 436676 436933 438007 438843 438787 438000 437079 436284 435222 433340
51480 433340 430581 427404 424279 421349 418556 415939 413659 411796 410150 408405 406516 404828 403606 402564
51466 402564 401128 399166 397146 395521 394260 393095 391932 390828 389832 389103 389004 389830 391450 393378 395153
51451 395153 396634 398012 399589 401457 403534 406075 409962 416072 424357 433971 444257 455089 466118
$$ packed form
51550A033905Q021k062j1106j9024k5974l1841l6334l9185m0270l9874l8762l7446
51538G20048l5466l2027k7356k2757j9176j6478j4200j2208j0317q123n777m091
51526E12072l401k938k028j062o23l36M00J136Q73l98j718k550l174l759m037
51511D88457l985l955l968l650l075k901l388l948m010l677l220k534j504m82
51497D44160J06K34N1n30j508k351k296j190K57J074Q36n6p87r21p95j062j882
51480D33340k759l177l125k930k793k617k280j863j646j745j889j688j222j042
51466D02564j436j962k020j625j261j165j163j104r96p29r9Q26J620J928J775
51451C95153J481J378J577J868K077K541L887O110Q285R614J0286J0832J1029
$$ plain form
51438 466118 476326 484706 490963 495240 497611 498278 497869 496982 495553 493064 489163 483803 477066 469371 461674
51423 461674 454965 449567 445285 442076 440151 439421 439298 439185 438938 438828 439210 440165 441328 442116 442244 441921 441472
51406 441472 441059 440893 441380 442762 444905 447604 450715 453696 455618 456235 456748 458790 462791 467886 473210
51391 473210 478648 484477 491075 499100 509293 521932 536998 554970 576924 603670 635266 671497
51379 671497 712312 757556 806733 859217 914168 969829 1023286 1071350 1111632 1142615 1163088
51368 1163088 1171975 1168732 1153679 1127945 1093150 1051048 1003388 952008 898894 845905 794541 746101
51356 746101 701764 662153 626976 595637 568176 545094 526298 510821 497708 486569 476982 468012
51344 468012 458848 449643 441220 434076 427988 422475 417263 412345 407858 403975 400880 398764 397768 397708 397892
$$ packed form
51438D66118J0208Q380O257M277K371O67m09q87j429k489l901n360o737p695p697
51423D61674o709n398m282l209j925p30j23j13k47j10L82R55J163P88J28l23m49
51406D41472m13j66M87J382K143K699L111K981J922O17N13K042M001N095N324
51391D73210N438N829O598Q025J0193J2639J5066J7972K1954K6746L1596L6231
51379F71497M0815M5244M9177N2484N4951N5661N3457M8064M0282L0983K0473
51368A163088Q887l243j5053k5734l4795m2102m7660n1380n3114n2989n1364m8440
51356G46101m4337l9611l5177l1339k7461k3082j8796j5477j3113j1139r587q970
51344D68012r164r205q423p144o088n513n212m918m487l883l095k116r96o0J84
$$ plain form
51329 397892 397539 396451 395077 393859 392794 391710 390655 389782 389067 388376 387778 387681 388666 391055 394474 398022
51313 398022 401123 404094 407498 411135 414182 416216 417458 417979 417467 416047 414561 413536 412458 410623 408163
51298 408163 405592 402789 399226 395032 391054 387869 385282 382910 380706 378799 377270 376287 376211 377371 379866
51283 379866 383566 388120 393031 397987 403062 408380 413635 418276 422073 425133 427388 428492 428434 427920 427899
51268 427899 428831 430532 432495 434192 435218 435479 435305 435255 435695 436496 437130 437042 436006 434237 432250 430584 429455
51251 429455 428560 427223 424991 422086 419161 416595 414181 411592 408903 406502 404594 402947 401121 398915
51237 398915 396688 395217 395034 395810 396568 396591 395964 395172 394420 393593 392709 392120 392160 392664 392888 392104 390473 389270
51219 389270 389912 392665 396471 400073 403017 405582 408200 411187 414596 418054 420990 423336 425716 428633
$$ packed form
51329C97892l53j088j374j218j065j084j055q73p15o91n98r7R85K389L419L548
51313C98022L101K971L404L637L047K034J242N21n12j420j486j025j078j835k460
51298D08163k571k803l563m194l978l185k587k372k204j907j529r83p6J160K495
51283C79866L700M554M911M956N075N318N255M641L797L060K255J104n8n14k1
51268D27899R32J701J963J697J026K61j74n0M40Q01O34q8j036j769j987j666j129
51251D29455q95j337k232k905k925k566k414k589k689k401j908j647j826k206
51237C98915k227j471j83P76P58K3o27p92p52q27q84n89M0N04K24p84j631j203
51219C89270O42K753L806L602K944K565K618K987L409L458K936K346K380K917
$$ plain form
51205 428633 431753 434318 436008 437031 437623 437977 438482 439473 440696 441414 441169 440185 439020 438097 437497 436929 435972
51188 435972 434616 433450 432996 432989 432751 432215 432048 432645 433562 434166 434449 434819 435360 435702 435544 435012 434451 434051 433709
51169 433709 433164 432228 430940 429571 428555 428370 429331 431389 434230 437596 441383 445328 448866 451510 453271
51154 453271 454522 455565 456532 457490 458298 458483 457618 455852 453779 451762 449640 447094 444034 440585 436972
51139 436972 433516 430558 428355 427099 426946 427777 429086 430362 431625 433267 435453 437958 440558 443235 445972
51124 445972 448674 451335 454009 456618 459101 461721 464819 468212 471288 473795 476056 478295 480275 481920
51110 481920 483757 486219 488792 490420 490672 490107 489520 489289 489520 490334 491699 493116 493858 493664 493047 492688 492539
51093 492539 491859 490296 488590 487745 487670 487202 485591 483450 482013 481848 482598 483647 484663 485668 486848 488240
$$ packed form
51205D28633L120K565J690J023N92L54N05R91J223P18k45r84j165r23o00n68r57
51188D35972j356j166m54pk38n36j67N97R17O04K83L70N41L42j58n32n61m00l42
51169D33709n45r36j288j369j016j85R61K058K841L366L787L945L538K644J761
51154D53271J251J043R67R58Q08J85q65j766k073k017k122k546l060l449l613
51139D36972l456k958k203j256j53Q31J309J276J263J642K186K505K600K677K737
51124D45972K702K661K674K609K483K620L098L393L076K507K261K239J980J645
51110D81920J837K462K573J628K52n65n87k31K31Q14J365J417P42j94o17l59j49
51093D92539o80j563j706q45p5m68j611k141j437j65P50J049J016J005J180J392
$$ plain form
51077 488240 489514 490293 490843 492022 494343 497385 500476 503544 506859 510297 513557 517017 521700 528295 536687
51062 536687 546545 557874 570765 585038 600429 616765 633607 649988 664906 678066 689905 701005
51050 701005 711806 722836 734795 748043 762022 775336 786483 794553 799311 800785 798910 793565
51038 793565 784857 773380 760233 746803 734304 723266 713370 703813 693850 683029 671118 658109
51026 658109 644542 631700 621171 613860 609374 606567 604782 604457 606371 610530 616075 622148 628426 634785
51012 634785 640947 646772 652659 659250 666823 675164 683933 692945 702265 712202 723101 734854 746721
50999 746721 757841 767791 776427 783429 788502 791926 794382 796084 796593 795686 793953 792188 790568 788895
50985 788895 787420 786872 787705 789876 793528 799445 808378 820135 833659 848013 862950 878474 894228
$$ packed form
51077D88240J274P79N50J179K321L042L091L068L315L438L260L460M683O595Q392
51062E36687R858J1329J2891J4273J5391J6336J6842J6381J4918J3160J1839J1100
51050G01005J0801J1030J1959J3248J3979J3314J1147Q070M758J474j875n345
51038G93565q708j1477j3147j3430j2499j1038r896r557r963j0821j1911j3009
51026F58109j3567j2842j0529p311m486k807j785l25J914M159N545O073O278O359
51012F34785O162N825N887O591P573Q341Q769R012R320R937J0899J1753J1867
50999G46721J1120R950Q636P002N073L424K456J702N09r07j733j765j620j673
50985G88895j475n48Q33K171L652N917Q933J1757J3524J4354J4937J5524J5754
$$ plain form
50972 894228 909705 925034 941250 959575 980591 1004279 1030786 1060845 1095305 1134388 1177572
50961 1177572 1224160 1273733 1325993 1380395 1436192 1492865 1550305 1608425 1666717 1724409 1781150
50950 1781150 1837448 1894392 1952903 2013223 2075065 2138275 2203401 2271534 2343434 2418794 2496438
$$ packed form
50972H94228J5477J5329J6216J8325K1016K3688K6507L0059L4460L9083M3184
50961A177572M6588M9573N2260N4402N5797N6673N7440N8120N8292N7692N6741
50950A781150N6298N6944N8511O0320O1842O3210O5126O8133P1900P5360P7644
$$ [...]
##END NTUPLES=NMR SPECTRUM
##END=
