##TITLE=AC1727_3474_9208054_ibkSnlMSrY
##JCAMPDX= 6.0         $$ Bruker NMR JCAMP-DX V2.0
##DATA TYPE= NMR SPECTRUM
##DATA CLASS= NTUPLES
##ORIGIN= BRUKER
##OWNER= Administrator
$$ 1.72 TOPSPIN		Version 2.1
$$ 2015-07-10 21:20:56.894 -0700  Administrator@X
$$ Compression mode = diff/dup
##.OBSERVE FREQUENCY= 400.02188249412
##.OBSERVE NUCLEUS= ^1H
##.ACQUISITION MODE= SIMULTANEOUS (DQD)
##.ACQUISITION SCHEME= undefined
##.AVERAGES= 8
##.DIGITISER RES= 22
##SPECTROMETER/DATA SYSTEM= spect
##.PULSE SEQUENCE= zg30
##.SOLVENT NAME= COFFEE_meoh
##.SHIFT REFERENCE= INTERNAL, COFFEE_meoh, 1, 14.98509
##AUDIT TRAIL= $$ (NUMBER, WHEN, WHO, WHERE, PROCESS, VERSION, WHAT)
$$ ##TITLE= Audit trail, TOPSPIN		Version 2.1
$$ ##JCAMPDX= 5.01
$$ ##ORIGIN= Bruker BioSpin GmbH
$$ ##OWNER= Administrator
$$ $$ E:\/data/COFFEE/nmr/AC1727_3474_9208054_ibkSnlMSrY/40/pdata/1/auditp.txt
$$ ##AUDIT TRAIL=  $$ (NUMBER, WHEN, WHO, WHERE, PROCESS, VERSION, WHAT)
(   1,<2015-07-10 21:20:49.613 -0700>,<Administrator>,<X>,<go>,<TOPSPIN 2.1>,
      <created by zg
	started at 2015-07-10 21:19:43.628 -0700,
	POWCHK enabled, PULCHK disabled,
       configuration hash MD5:
       21 0F 79 D6 B3 7B B4 F6 88 20 88 DB 03 48 BD 9F
       data hash MD5: 64K
       79 57 DA 53 31 17 40 F4 25 EF 7B A8 52 19 B0 1C>)
(   2,<2015-07-10 21:20:52.800 -0700>,<Administrator>,<X>,<proc1d>,<TOPSPIN 2.1>,
      <Start of raw data processing
       efp LB = 0 FT_mod = 6 PKNL = 1 PHC0 = 0 PHC1 = 0 SI = 32K 
       data hash MD5: 32K
       29 21 65 B6 15 B7 0C 6B D0 96 14 E6 CB AA 8D BB>)
(   3,<2015-07-10 21:20:53.081 -0700>,<Administrator>,<X>,<proc1d>,<TOPSPIN 2.1>,
      <pk PHC0 = 93.35632 PHC1 = 0 
       data hash MD5: 32K
       58 29 12 10 F1 10 A8 56 8C AB 21 40 A1 15 F4 22>)
(   4,<2015-07-10 21:20:53.191 -0700>,<Administrator>,<X>,<proc1d>,<TOPSPIN 2.1>,
      <abs ABSG = 1 
       data hash MD5: 32K
       9E 57 C4 08 93 05 20 35 8E CA 04 06 24 C4 17 BA>)
(   5,<2015-07-10 21:20:53.269 -0700>,<Administrator>,<X>,<proc1d>,<TOPSPIN 2.1>,
      <abs ABSG = 2 
       data hash MD5: 32K
       57 DF EE 21 3D C1 BE 68 5B C7 0A 47 5C A0 F3 36>)
(   6,<2015-07-10 21:20:53.331 -0700>,<Administrator>,<X>,<proc1d>,<TOPSPIN 2.1>,
      <abs ABSG = 3 
       data hash MD5: 32K
       06 4E 68 EF 6C 90 16 89 0E AE 5A 2F 8C 46 5C A4>)
(   7,<2015-07-10 21:20:53.378 -0700>,<Administrator>,<X>,<proc1d>,<TOPSPIN 2.1>,
      <abs ABSG = 4 
       data hash MD5: 32K
       F0 2F E7 09 A5 96 8E 9D 6A A6 CF C0 24 0A 01 BC>)
(   8,<2015-07-10 21:20:53.441 -0700>,<Administrator>,<X>,<proc1d>,<TOPSPIN 2.1>,
      <abs ABSG = 5 
       data hash MD5: 32K
       EC 43 41 7D 5C AF 8F A9 D1 E3 6A 65 27 EE 9D 0E>)
$$ ##END=
$$ 
$$ $$ hash MD5
$$ $$ 99 D9 4B 4E 23 E8 18 AF 17 19 BC A2 5F 07 52 C6
##$RELAX= 
##$RELAX= 
##$RELAX= 
##$RELAX= 
##$RELAX= 
##$RELAX= 
##$RELAX= 
$$ Bruker specific parameters
$$ --------------------------
##$DU= <E:\>
##$EXPNO= 40
##$NAME= <AC1727_3474_9208054_ibkSnlMSrY>
##$PROCNO= 1
$$ [...]
##$TP= (0..7)
150 150 150 150 150 150 150 150
##$TP07= 0
##$TPNAME0= <>
##$TPNAME1= <>
##$TPNAME2= <>
##$TPNAME3= <>
##$TPNAME4= <>
##$TPNAME5= <>
##$TPNAME6= <>
##$TPNAME7= <>
##$TPOAL= (0..7)
0.5 0.5 0.5 0.5 0.5 0.5 0.5 0.5
##$TPOFFS= (0..7)
0 0 0 0 0 0 0 0
##$TUNHIN= 0
##$TUNHOUT= 0
##$TUNXOUT= 0
##$USERA1= <user>
##$USERA2= <user>
##$USERA3= <user>
##$USERA4= <user>
##$USERA5= <user>
##$V9= 5
##$VALIST= <valist>
##$VCLIST= <CCCCCCCCCCCCCCC>
##$VD= 0
##$VDLIST= <DDDDDDDDDDDDDDD>
##$VPLIST= <PPPPPPPPPPPPPPP>
##$VTLIST= <TTTTTTTTTTTTTTT>
##$WBST= 2048
##$WBSW= 25
##$XGAIN= (0..3)
0 0 0 0
##$XL= 0
##$YL= 0
##$YMAX_a= 637621
##$YMIN_a= -539424
##$ZGOPTNS= <>
##$ZL1= 120
##$ZL2= 120
##$ZL3= 120
##$ZL4= 120
##$ABSF1= 14.98509
##$ABSF2= -5.573092
##$ABSG= 5
##$ABSL= 3
##$ALPHA= 0
##$AQORDER= 0
##$ASSFAC= 0
##$ASSFACI= 0
##$ASSFACX= 0
##$ASSWID= 0
##$AUNMP= <proc_prof1d_extract_pilot.lims>
##$AXLEFT= 0
##$AXNAME= <>
##$AXNUC= <1H>
##$AXRIGHT= 0
##$AXTYPE= 0
##$AXUNIT= <>
##$AZFE= 0.1
##$AZFW= 0.1
##$BCFW= 0
##$BC_mod= 0
##$BYTORDP= 0
##$COROFFS= 0
##$CY= 15
##$DATMOD= 1
##$DC= 0
##$DFILT= <>
##$DTYPP= 0
##$F1P= 0
##$F2P= 0
##$FCOR= 0.5
##$FTSIZE= 32768
##$FT_mod= 6
##$GAMMA= 0
##$GB= 0
##$INTBC= 1
##$INTSCL= 1
##$ISEN= 128
##$LB= 0
##$LEV0= 0
##$LPBIN= 0
##$MAXI= 10000
##$MC2= 0
##$MEAN= 0
##$ME_mod= 0
##$MI= 0
##$NCOEF= 0
##$NC_proc= -8
##$NLEV= 6
##$NOISF1= 0
##$NOISF2= 0
##$NSP= 0
##$NTH_PI= 0
##$NZP= 0
##$OFFSET= 14.98509
##$PC= 1
##$PHC0= 93.35632
##$PHC1= 0
##$PH_mod= 1
##$PKNL= yes
##$PPARMOD= 0
##$PPDIAG= 0
##$PPIPTYP= 0
##$PPMPNUM= 2147483647
##$PPRESOL= 1
##$PSCAL= 4
##$PSIGN= 0
##$PYNMP= <proc.py>
##$REVERSE= no
##$SF= 400.02
##$SI= 32768
##$SIGF1= 0
##$SIGF2= 0
##$SINO= 400
##$SIOLD= 32768
##$SPECTYP= <>
##$SREGLST= <1H.CDCl3>
##$SSB= 0
##$STSI= 32768
##$STSR= 0
##$SW_p= 8223.68421052631
##$SYMM= 0
##$S_DEV= 0
##$TDeff= 65536
##$TDoff= 0
##$TI= <>
##$TILT= no
##$TM1= 0
##$TM2= 0
##$TOPLEV= 0
##$USERP1= <user>
##$USERP2= <user>
##$USERP3= <user>
##$USERP4= <user>
##$USERP5= <user>
##$WDW= 1
##$XDIM= 32768
##$YMAX_p= 453414617
##$YMIN_p= -700764
##$CURPLOT= <Network HP LaserJet P1505>
##$CURPRIN= <$Network HP LaserJet P1505>
##$DFORMAT= <normdp>
##$LAYOUT= <+/1D_H.xwp>
##$LFORMAT= <normlp>
##$PFORMAT= <normpl>
##$SURQMSG= 1
$$ End of Bruker specific parameters
$$ ---------------------------------
##NTUPLES= NMR SPECTRUM
##VAR_NAME=  FREQUENCY,     SPECTRUM/REAL,   SPECTRUM/IMAG
##SYMBOL=    X,             R,               I
##VAR_TYPE=  INDEPENDENT,   DEPENDENT,       DEPENDENT
##VAR_FORM=  AFFN,          ASDF,            ASDF
##VAR_DIM=   32768,         32768,           32768
##UNITS=     HZ,            ARBITRARY UNITS, ARBITRARY UNITS
##FACTOR=    0.250966925370066, 1,           1
##FIRST=     8223.43324360094, -49307,       47361
##LAST=      0,             -39316,          7969
##MIN=       0,             -700764,         0
##MAX=       8223.43324360094, 453414617,    0
$$ Real data points
##PAGE= N=1
##DATA TABLE= (X++(R..R)), XYDATA
$$ [...]
$$ plain form
19552 -247807 -91870 3145 -300464 -321937 -182183 79697 -125677 -14673 333139 -220287 -246815
19541 -246815 -31212 -278543 -180179 -153548 -141244 -161698 -167756 -28992 -240774 -169505 3872
19529 -243040 -58739 -22947 112928 290269 49805 -46063 -56936 -20441 -6121 -166238 9237
19517 40662 -23606 -187267 -158527 -113094 31692 -254422 254819 96952 -278597 42176 128253
19506 128253 -54292 67337 227719 -218676 100813 -154137 204046 102141 -153808 -34842
19495 79162 222713 68349 30212 -110066 -125729 -442537 25950 78199 174824 -20783 -398177
19484 -398177 -343005 -276359 80772 -52914 -71763 -534143 -179355 157649 -123431 -197229 -46328
19472 152697 -129467 -182113 -73217 -145350 89860 -16688 88892 75645 -51634 -50041 -97891
$$ packed form
19552b47807i1870C145c00464k1473J39754G9697a25677a4673C33139b20287k6528
19541b46815c1212k47331R8364K6631J2304k0454o058b8992k11782P1269C872
19529b43040e8739b2947A12928J77341D9805d6063j0873b0441f121j60117I237
19517D0662b3606j63661K8740M5433C1692b54422B54819I6952b78597D2176Q6077
19506A28253e4292F7337J60382b18676A00813a54137B04046j01905a53808c4842
19495G9162J43551F8349C0212a10066j5663l16808B5950N2249R6625b0783l77394
19484c98177N5172O6646H0772e2914j8849m62380a79355A57649a23431p3798d6328
19472A52697a29467n2646g3217p2133H9860a6688H8892j3247e1634J593m7850
$$ plain form
19461 -97891 57973 85991 116152 124912 -172138 -65396 117236 75765 -139339 10390 94381
19450 94381 59630 -319439 -22770 -150307 35018 148832 -225529 124196 170237 -145811
19439 225514 229434 -287733 -193217 76244 -37279 43996 33764 125575 -2099 29073 -57525 -368109
19427 -368109 188618 -263492 124129 -161935 -97861 -192182 -189586 33992 -122745 -112358 82792
19415 -162074 49257 15115 -256382 27384 -28660 -134589 -145364 -280817 50617 318804 16767
19403 -245168 -222553 -69834 -310536 -201024 -164979 4422 99049 -140103 -186677 -169757 -268056
19392 -268056 35609 322971 -390843 -10986 135672 42174 -161726 33141 13616 -230794
19381 -123907 -237216 -97844 -41852 -121687 22222 76264 23278 115467 7996 -255520 137791
$$ packed form
19461i7891E7973K8018L0161Q760a72138f5396A17236m1471a39339A0390Q3991
19450I4381l4751c19439b2770j27537C5018J13814b25529A24196M6041a45811
19439B25514L920b87733R4516G6244c7279D3996j0232R1811b099B9073e7525l10584
19427c68109A88618b63492A24129a61935O4074r4321K596C3992a22745J0387H2792
19415a62074D9257A5115b56382B7384b8660j05929j0775j35453E0617K68187A6767
19403b45168K2615f9834k40702J09512L6045D422R4627a40103m6574J6920r8299
19392b68056C5609K87362c90843a0986A35672D2174a61726C3141A3616b30794
19381a23907j13309i7844d1852p9835B2222N4042B3278R2189G996b55520A37791
$$ plain form
19369 34247 67610 -183071 -30306 131719 -231218 99748 -227754 -53859 -7032 -211127 39726
19357 -349224 -114980 -85522 -62480 -365314 -245887 68486 -135831 171990 214364 -173360
19346 -8832 -108023 -184831 -141882 -160049 -113393 77230 -141202 407854 -184241 -146170 -87144
19335 -87144 89573 200876 -80366 -163680 75984 127642 112506 -342646 -83542 449893 -58976
19323 -138024 -158875 111054 -148848 148147 -118945 197484 -264797 -377472 -352537 -168164
19312 -45989 127069 -319772 221373 4353 122684 -289710 -123821 145112 -154853 338463
19301 -272069 -294140 80878 -363269 -147156 36389 -125789 -345207 -235725 -3089 -121245
19291 -121245 234834 -172964 -283343 -42773 75692 34232 20794 -83569 -96354 -76034 -180300
$$ packed form
19369C4247L3363a83071c0306A31719b31218I9748b27754e3859g032k04095C9726
19357c49224a14980K9458K3042l02834J19427F8486a35831A71990M2374a73360
19346h832r9191p6808M2949j8167M6656G7230a41202D07854a84241L8071N9026
19335h7144H9573J11303h0366q3314G5984N1658j5136c42646h3542D49893e8976
19323a38024k0851A11054a48848A48147a18945A97484b64797j12675K4935a68164
19312d5989A27069c19772B21373D353J18331b89710a23821A45112a54853C38463
19301b72069k2071H0878c63269a47156C6389a25789k19418J09482c089j18156
19291a21245B34834a72964j10379d2773G5692C4232j3438h3569j2785K0320j04266
$$ plain form
19280 -180300 196687 65224 264048 25935 195258 -28812 152061 -52694 15487 73946 -156358
19268 -21030 -148788 -392721 -176381 -124014 -316320 -47283 103280 -307409 -22437 -113747
19258 -113747 -23430 3292 -167652 -213120 -64793 -84537 -287179 -109020 23961 427318 -147549
19246 -104391 -17261 33610 -238143 227650 -224064 -92608 49402 55633 189634 -261630 211937
19234 -372850 30068 -160037 288799 94248 -72700 -27825 15341 84826 -6028 -24809 -28662
19223 -28662 -47943 33441 397552 -201540 46999 16977 -145155 58372 -147202 -50443 -116686
19212 -116686 -330024 -130247 120298 -21658 156664 -46323 198671 -179389 5807 1521 -195126
19200 -174601 -49878 -92852 -206413 71016 -117142 135433 -168126 140575 -390911 -100181
$$ packed form
19280a80300A96687F5224J98824B5935J69323b8812A52061e2694A5487N8459a56358
19268b1030j27758k43933a76381N2367j92306d7283A03280c07409b2437r1310
19258a13747b3430C292a67652m5468f4793j9744k02642a09020B3961M03357a47549
19246a04391a7261C3610b38143B27650b24064i2608D9402O231J34001b61630B11937
19234c72850C0068a60037B88799I4248g2700b7825A5341O9485f028j8781l853
19223b8662j9281C3441L64111b01540D6999A6977a45155E8372a47202e0443o6243
19212a16686k13338a30247A20298b1658A56664d6323A98671a79389E807A521a95126
19200a74601d9878m2974j13561G1016a17142A35433a68126A40575c90911a00181
$$ plain form
19189 -202125 -97881 -431182 -213858 209659 62464 -6309 -292509 -431239 -198546 -249034
19179 -249034 -193493 -323819 134661 -326298 138402 -16364 -142597 34162 -37750 -174770
19169 -174770 -73380 -99353 -7387 -308894 -140663 -203181 -459652 972 42658 -218069 -1341
19157 22659 -65210 109360 -73573 -120249 -205498 -223082 38600 -121026 -122945 180695 -205290
19145 39072 18934 129551 -343506 -175433 -71417 79404 -72909 214662 74990 112037 -225487
19133 -23264 -98193 -74662 18528 32136 61678 -107344 -36367 11601 19511 -96890 311802
19121 88644 139145 198132 -118145 152124 -176371 -181269 -57118 13231 -109552 74431 -164759
19109 -99676 33583 -139976 -307711 -117428 -48624 -176398 36572 -276002 125193 -32117
$$ packed form
19189b02125i7881l33301b13858B09659F2464f309k86200j38730a98546n0488
19179b49034N5541j30326A34661c26298A38402a6364j26233C4162c7750j37020
19169a74770g3380k5973g387l01507a40663o2518k56471I72M1686b18069a341
19157B2659f5210A09360g3573m6676q5249j7584C8600a21026j919A80695b05290
19145C9072A8934J10617c43506J68073g1417G9404g2909B14662G4990L7047b25487
19133b3264p4929K3531A8528J3608K9542a07344c6367A1601P910i6890C11802
19121H8644N0501N8987a18145A52124a76371m898e7118A3231a09552G4431a64759
19109i9676C3583a39976j67735a17428d8624j27774C6572b76002A25193c2117
$$ plain form
19098 115331 -40010 -25083 120070 34724 10327 -8572 83240 116516 -161362 -47810 172323
19086 -107755 -148295 -184743 101455 81680 -54795 -126226 64808 -25723 41469 -118508 62676
19074 -28887 -164479 -89369 -261216 124466 121579 -83734 33466 207670 -258655 -87663 -135698
19063 -135698 56413 9751 60592 328542 -134441 107702 76756 116529 -244792 119481 -151532
19051 35547 15417 -35250 221534 -245079 207114 -23999 2946 -104071 95768 -84702 -134501
19040 -134501 52871 -161268 58662 -37625 145560 40509 -333748 23644 -31066 -178851 201360
19028 51976 48502 144536 141361 289994 -29357 158386 130397 128293 -102119 337928 -82360
19016 184038 -254532 -156490 -419409 124880 -147719 24706 -58567 110895 164913 41462
$$ packed form
19098A15331d0010J4927A20070C4724A0327h572H3240L3276a61362d7810A72323
19086a07755m0540l6448A01455j9775e4795p1431F4808b5723D1469a18508F2676
19074b8887j35592P5110j71847A24466k887h3734C3466J74204b58655h7663m8035
19063a35698E6413I751N0841K67950a34441A07702l0946L9773b44792A19481a51532
19051C5547A5417c5250B21534b45079B07114b3999B946a04071I5768h4702m9799
19040a34501E2871a61268E8662c7625A45560D0509c33748B3644c1066j47785B01360
19028E1976l474R6034l175J48633b9357A58386k7989k104a02119C37928h2360
19016A84038b54532R8042k62919A24880a47719B4706e8567A10895N4018D1462
$$ plain form
19005 -182285 106600 -74678 54468 -352340 -256510 920 91399 -38386 -115892 -125180 -292569
18994 -292569 -125363 -161605 -113908 115693 330258 160180 -131851 -41588 -215586 23425
18983 -371267 211977 -112509 -298928 150187 -58111 -214695 -161135 -37352 61946 72372
18973 72372 109443 124009 -170874 281430 -202449 135897 -54501 -160401 -241623 256055
18962 -25990 44365 23591 -388810 -452204 -213149 19040 -249533 -87386 34786 -378371 254170
18950 -14636 57350 -164214 -221928 -199153 -224488 -55603 -255438 -314820 -51793 -151153 60442
18938 150910 -220477 -83196 -180723 -206092 -118591 113083 198631 80053 -32367 -104033 -146620
18927 -146620 -160140 8364 49246 -227614 -335069 -139013 -111785 -81519 59486 79021 220976
$$ packed form
19005a82285A06600g4678E4468c52340R5830I20R0479c8386p7506r288j67389
18994b92569a25363l6242M7697A15693K14565A60180a31851d1588j73998B3425
18983c71267B11977a12509j86419A50187e8111j56584N3560c7352F1946J0426
18973G2372L7071J4566a70874B81430b02449A35897e4501j05900q1222B56055
18962b5990D4365k0774c88810o3394b13149A9040b49533h7386C4786c78371B54170
18950a4636E7350a64214n7714K2775k5335e5603j99835n9382e1793r9360F0442
18938A50910b20477h3196r7527k5369Q7501A13083Q5548H0053c2367p1666m2587
18927a46620j3520H364M0882b27614j07455a39013K7228L0266E9486J9535J41955
$$ plain form
18916 220976 -115698 -58749 -79374 57599 256979 260068 -80433 -319507 -146912 67031 -90110
18904 -302478 -75870 308152 -20996 77202 -236385 -60719 -250422 25022 23297 -74849 51031
18892 -254926 -10416 -120173 131756 173294 81686 -39223 131803 279572 -126278 1330 147399
18881 147399 -33970 -204259 -28361 -319510 214603 -95235 -100250 -276475 -570884 -186842
18870 80718 -25113 94443 -101923 21405 -111441 -253394 118869 147642 211220 12518 -51695
18858 -146210 -21766 46267 -204732 248742 -53078 29691 -71493 -61947 229672 21376 145124
18847 145124 -13623 64755 246365 -51394 -214176 -173630 -101470 -89537 -296932 180731 3690
18835 50812 -110905 -237160 -47072 -112038 -55447 -8717 94011 43917 -227644 -116212 146890
$$ packed form
18916B20976a15698N6949k0625E7599J99380L089h0433k39074a46912F7031i0110
18904c02478g5870C08152b0996G7202b36385f0719j89703B5022j725g4849E1031
18892b54926a0416j09757A31756M1538H1686c9223A31803J47769a26278A330J46069
18881A47399c3970j70289b8361k91149B14603i5235n015j76225k94409a86842
18870H0718b5113I4443a01923B1405a11441j41953A18869K8773O3578A2518e1695
18858a46210b1766D6267b04732B48742e3078B9691g1493R546B29672B1376J23748
18847A45124a3623F4755J81610e1394j62782M0546P2160J1933k07395A80731C690
18835E0812a10905j26255d7072o4966e5447h717I4011D3917b27644J11432A46890
$$ plain form
18823 -144465 -46830 -24779 -467700 -26488 370173 -42458 -181413 -102388 -218216 121666
18812 -284130 354785 -49001 299902 250837 228208 7020 6595 -279574 -190857 124888 -239396
18800 -19072 174338 -96908 -132854 -111619 -111574 -48016 55800 56819 291344 205301 106844 -89699
18787 43516 -185361 -151070 -460010 85440 -142568 -164879 285408 -138883 -243904 -254457
18777 -254457 79621 -219782 78323 -147248 -251958 -300200 -20945 -12805 15538 43085 -16629
18765 -16063 -70184 286410 -20263 -316210 -268747 -22615 -29411 -76902 -111182 124157 -134594
18753 -89353 -38724 278511 68246 143519 190187 -165840 -453879 -292903 -66568 325923 5294
18741 54275 -209643 -265609 -187315 120992 -197534 -128596 -237074 35833 93651 -17781 154013
$$ packed form
18823a44465d6830K2051m42921b6488C70173d2458j38955P9025j15828A21666
18812b84130C54785d9001B99902m9065k2629G020m25b79574Q8717A24888b39396
18800a9072A74338i6908l5946K1235M5d8016E5800J019K34525q6043r8457h9699
18787D3516a85361L4291l08940H5440a42568k2311B85408a38883j05021j0553
18777b54457G9621b19782G8323a47248j04710m8242b0945Q140A5538K7547a6629
18765a6063n4121B86410b0263k95947M7463b2615o796m7491l4280A24157a34594
18753h9353c8724B78511F8246P5273M6668a65840k88039J60976f6568C25923E294
18741E4275b09643n5966P8294A20992a97534O8938j08478C5833N7818a7781A54013
$$ plain form
18729 5682 170380 -61265 -54597 -96477 86203 -114179 -137667 118301 47071 90690 -90372
18717 -224251 -99856 -86822 213455 -211289 -162041 -48159 -201233 204620 192047 -296154
18706 -66218 -371221 -82802 146896 22764 -27643 112184 -91999 -271854 -138659 -171818 49019
18694 -248730 28405 46948 -277057 65080 -344618 -137013 -36991 -145666 -341341 99411
18683 -100627 -300874 301396 32803 65641 -66935 -106513 -54478 245851 -79199 -581212 16991
18671 10118 -219498 -217525 -93801 66605 -412013 -10205 24849 15058 26487 -12736 -94357 49326
18658 -267077 47941 -120377 -174727 25789 -309513 -204715 -72078 -20573 28732 -63654 66739
18646 67798 -244802 78869 169678 122973 247979 -144367 -105792 -208384 78085 102892 -233750
$$ packed form
18729E682J64698f1265O668m1880H6203a14179k3488A18301D7071M3619i0372
18717b24251i9856J3034B13455b11289M9248d8159j53074B04620j2573b96154
18706f6218l05003h2802A46896B2764b7643A12184i1999j79855J33195l3159D9019
18694b48730B8405J8543b77057F5080c44618a37013c6991j08675j95675I9411
18683a00627k00247C01396C2803L2838f6935l9578N2035B45851g9199n02013A6991
18671A0118b19498J973i3801F6605d12013a0205B4849r791J1429a2736q1621D9326
18658b67077D7941a20377n4350B5789c09513J04798g2078b0573B8732f3654F6739
18646F7798b44802G8869R0809m6705J25006a44367L8575j02592G8085K4807b33750
$$ plain form
18634 46600 176783 -16600 -181993 23122 77717 -25585 -326790 -22427 -448679 -91173 103453
18622 -215948 -214154 -188510 55794 -12688 -222462 65859 -81960 217352 195082 -151759 -456338
18611 -456338 -63871 154822 1639 -151506 318856 37844 -31061 277648 -40357 -96381 138578
18599 10063 -86483 -16449 -5742 -159007 -284297 118563 6382 -310658 -284054 24662 -474650
18587 -137458 -109420 -135004 129003 -304612 211146 -22464 137250 -171111 55606 -94617
18576 -274277 -30581 -81292 -321342 84212 54767 -139069 10848 129904 104361 -299968 -178010
18565 -178010 283980 136400 -43598 120018 -8792 91473 90414 -132737 -47417 -184112 -31175
18553 -60999 -274613 410706 -29796 73225 45907 134950 98730 72409 -97421 -115249 -45234
$$ packed form
18634D6600J30183a6600j65393B3122N4595b5585l01205b2427m26252i1173A03453
18622b15948J794K5644E5794a2688k09774F5859h1960B17352k2270a51759l04579
18611d56338f3871A54822A639a51506C18856C7844c1061B77648d0357n6024A38578
18599A0063h6483a6449e742j53265j25290A18563F382c10658K6604B4662d74650
18587a37458K8038k5584A29003c04612B11146b2464A37250a71111E5606i4617
18576b74277c0581n0711k40050H4212k9445a39069A0848J19056k5543b99968J21958
18565a78010B83980A36400d3598A20018h792I1473j059a32737d7417j36695c1175
18553f0999k13614D10706b9796G3225k7318Q9043l6220k6321i7421j7828d5234
$$ plain form
18541 -8208 -21185 -235408 -75328 26411 -44866 61420 140299 389840 69762 -326864 -84780
18529 91313 122457 43466 -73755 105287 -27150 85982 -45887 52127 85822 243334 -362757
18517 277998 -158697 -235133 134183 -162229 -166254 -193642 -251122 -432025 -427878 -64689 111014
18505 -147674 -56963 -137168 -36510 32957 156117 -309426 -87036 -439013 -392465 281835 -103301
18493 -168188 -499332 39382 -81229 -341651 102934 40322 36315 63881 -31197 -222471 116642
18481 199068 241816 103350 166893 -227162 225207 37032 -471806 -173153 -202745 80923
18470 -228898 -51248 10614 -8448 -46957 -47337 -152860 -117029 -239227 18792 -218340 -236832
18459 -236832 -387998 57925 -287026 -61643 -389062 -521545 114853 28809 41962 -47175
$$ packed form
18541h208j2977k14223g5328B6411d4866F1420P8879K49541F9762c26864h4780
18529I1313L1144D3466g3755A05287b7150H5982d5887E2127L3695J57512c62757
18517B77998a58697p6436A34183a62229m025k7388n7480j80903M147f4689A11014
18505a47674e6963q0205c6510C2957J23160c09426h7036l51977M6548B81835a03301
18493a68188l31144C9382h1229k60422A02934D0322m007K7566c1197j91274A16642
18481A99068M2748A03350O3543b27162B25207C7032d71806a73153k9592H0923
18470b28898e1248A0614h448l8509l80j05523L5831j22198A8792b18340j8492
18459b36832j51166E7925b87026f1643l27419j32483A14853B8809J3153d7175
$$ plain form
18448 109323 326552 -196866 -71375 -80015 126051 24804 -259624 182210 22697 -229905
18437 -90216 -120134 -153230 -96920 -342481 12154 -5846 -220527 -63345 -112520 -274140 -84486
18425 -46402 316860 -187335 -187314 150814 -7337 56775 -210484 -206142 -124316 -47340 -119015 72656
18412 -9823 200123 -133656 -13353 -97103 -257087 -138817 131531 105804 -166914 284577
18401 42168 -43542 52323 -182452 -11299 -126895 397266 -63869 8056 18314 117998 -269153
18389 56096 241730 212061 -14989 -317480 -98184 238224 -338490 -128404 258502 39113
18378 -368571 193840 24339 -215350 -80853 -94251 189159 -184891 -31085 -388330 -75311
18367 19726 -232005 29677 367633 142243 169246 -42850 -32412 436368 -16999 141449 38611
$$ packed form
18448A09323K17229a96866g1375q640A26051B4804b59624A82210B2697b29905
18437i0216k9918l3096N6310k45561A2154e846k14681f3345m9175j61620h4486
18425d6402C16860a87335K1A50814g337E6775b10484M342Q1826d7340p1675G2656
18412i823B00123a33656a3353q3750j59984J18270A31531k5727a66914B84577
18401D2168d3542E2323a82452a1299j15596C97266f3869H056J0258R9684b69153
18389E6096J85634k9669a4989l02491i8184B38224c38490a28404B58502C9113
18378c68571A93840B4339b15350h0853j3398A89159a84891c1085l57245g5311
18367A9726b32005B9677L37956A42243K7003d2850J0438D36368a6999A41449C8611
$$ plain form
18355 -349954 -82894 -292547 -52247 -135700 81549 -85714 -1655 148807 -93595 88471 -200357
18343 -84077 76697 4155 -23191 85426 -342703 -219815 305921 -83385 86160 -111227 -131326
18332 -131326 42342 -164972 3938 19494 466678 52450 167562 -69833 -326525 301294 99404
18320 -46408 -263380 -296686 31004 -99682 -57657 -229410 -90823 -11960 113023 8763 -66504
18308 -83625 -174754 4986 224197 -56924 303096 -88200 -160530 -168176 64472 173726 -177096
18296 326778 -121357 83546 -139786 -219641 -255565 -182 -41589 315284 -97410 266596 -355
18284 89356 49900 279562 82294 -31490 616 -41738 125014 63020 -38960 62157 -32317 -52098
18272 -52098 149071 -29434 201423 194111 -240533 60463 -29691 285847 -224506 -70715 106179
$$ packed form
18355c49954h2894k09653e2247q3453H1549h5714a655A48807i3595H8471b00357
18343h4077G6697D155b3191H5426c42703J22888C05921h3385H6160a11227k0099
18332a31326D2342a64972C938J5556M47184E2450J15112f9833k56692C01294I9404
18320d6408k16972l3306C1004i9682M2025j71753i0823a1960A13023H763f6504
18308h3625r1129D986K19211e6924C03096h8200p2330p646F4472J09254a77096
18296C26778a21357H3546a39786p9855l5924a82m1407C15284i7410B66596c55
18284H9356l9456K29662H2294c1490F16d1738A25014o1994c8960F2157c2317j9781
18272e2098A49071b9434B01423p312b40533F0463b9691B85847b24506g0715A06179
$$ plain form
18260 -194024 -366070 -24708 -81121 -137493 29252 7637 -87047 -144404 -293474 117220 86666
18249 86666 210367 71803 183896 -86222 -39828 -3261 -69424 -106677 -364195 -338697 -46310
18237 -419988 214734 -51701 53649 -18940 -151567 330960 -67243 -39539 84873 -451066 -87993
18225 -218750 93546 4810 -128226 -259524 41138 -182373 54900 32204 -182478 -411750 -218234
18214 -218234 50893 -229604 -188269 -107405 113592 -3082 -16856 198127 31891 -116604 -49159
18202 113816 -79486 149632 87864 -49990 30515 11175 -92586 2779 -87591 249316 -601262
18190 183802 131700 159430 -223475 -13542 -63431 120135 96748 103584 -33284 -70389 -55970
18179 -55970 72624 -233235 -45678 -2297 -13327 220156 -104150 28240 -121069 190042 210797
$$ packed form
18260a94024j72046b4708n6413n6372B9252G637h7047n7357j49070A17220l0554
18249H6666J23701G1803J12093h6222c9828c261o6163l7253k57518K5498d6310
18237d19988B14734e1701E3649a8940j32627C30960f7243K7704H4873d51066h7993
18225b18750I3546D810a28226j31298D1138a82373E4900k2696a82478k29272J93516
18214b18234E0893b29604M1335Q0864A13592c082j3774A98127C1891a16604d9159
18202A13816g9486A49632o1768d9990C0515A1175i2586B779h7591B49316f01262
18190A83802n2102K7730b23475a3542m9889A20135k3387O836c3284l7105J4419
18179e5970G2624b33235d5678b297j1030B20156a04150B8240a21069A90042K0755
$$ plain form
18168 210797 -120236 -11788 186696 228952 125402 206910 -138963 -78762 186849 -146859
18157 -276606 -23610 38440 119333 -52560 -156813 -17094 118251 -20621 516262 254767 -81598
18145 132702 89654 -246535 -169810 -180947 35955 -99546 178345 -129465 -198138 16664 -161641
18133 -86501 -21108 307932 -60124 -265539 -37684 -59622 -140955 -192046 49472 -39993 -97232
18122 -97232 -90756 378065 86674 31146 -213547 -49888 207257 -152174 -10922 -109199 -10655
18110 9019 43259 119009 -37589 40722 -12190 -44926 -91109 -486941 -60169 -526423 -155842
18098 108923 -328672 66006 -131015 2898 -9212 -324952 -80585 298888 250122 93605 18080
18086 -72632 -90579 152496 -298017 -204176 90233 107313 -163303 229048 151713 66188 -108825
$$ packed form
18168B10797a20236a1788A86696M2256j03550Q1508a38963O0201A86849a46859
18157b76606b3610C8440Q0893e2560j04253a7094A18251b0621E16262B54767h1598
18145A32702m3048b46535P6725j1137C5955i9546A78345a29465o8673A6664a61641
18133h6501b1108C07932f0124k05415c7684k1938q1333n1091D9472c9993n7239
18122i7232O476C78065H6674C1146b13547d9888B07257a52174a0922r8277a0655
18110I019L4240P5750c7589D0722a2190l2736m6183l95832f0169m66254a55842
18098A08923c28672F6006a31015B898i212l15740h0585B98888m8766I3605A8080
18086g2632j7947A52496b98017R3841I0233J7080a63303B29048p7335F6188a08825
$$ plain form
18074 -82055 -146483 -158846 190283 -52570 -36619 -144079 36535 125100 2287 -390284 -250674
18063 -250674 -495325 -135053 340067 -132728 -305626 50744 108417 -40139 -69237 -7088 -35827
18052 -35827 146140 -118872 89387 -83862 18639 -189867 91670 -135006 -147052 -102656 177002
18040 -73305 -6612 206118 -48460 135115 17252 -296310 -97548 -110739 219251 -90430 -141098
18029 -141098 -311017 -177107 -119161 -102504 -268466 -247501 587523 -124578 -134592 42787
18018 21179 -103735 137668 -173622 9927 -33675 -126387 41807 -192084 63778 -10363 191870
18006 -4050 56453 76287 -170618 47569 -157607 276230 -69571 39347 -216582 195983 33118
17994 -239533 255998 -159114 27021 -291699 135951 -173240 289567 -257552 -102695 -50355
$$ packed form
18074h2055o4428j2363A90283e2570J5951j07460C6535Q8565B287c90284J39610
18063b50674k44651a35053C40067a32728j72898E0744N7673d0139k9098g088k8739
18052c5827A46140a18872H9387h3862A8639a89867I1670a35006j2046M4396A77002
18040g3305f612B06118d8460A35115A7252b96310i7548j3191B19251i0430n0668
18029a41098j69919J33910N7946J6657j65962K0965E87523a24578j0014D2787
18018B1179a03735A37668a73622I927c3675r2712D1807a92084F3778a0363A91870
18006d050E6453J9834a70618D7569a57607B76230f9571C9347b16582A95983C3118
17994b39533B55998a59114B7021b91699A35951a73240B89567b57552a02695e0355
$$ plain form
17983 -179569 -225014 85700 324371 -106407 -152843 -365239 -62365 -172789 63925 -53557 -240162
17972 -240162 205069 -47064 158499 -93522 -27547 178363 316513 709 91783 -63290 -56753
17961 -56753 77879 40319 -112974 -151956 -123286 241229 269190 27831 277823 -122308 -18393
17949 99245 -85660 -137538 -19060 42465 -125206 -259 -38933 64456 -37017 -35802 114614 -40936
17936 -161546 95054 -64756 -189530 451223 377286 30033 -52435 -206614 109280 -192391
17925 318956 -285870 -39490 159875 -80637 156955 3033 -126661 -222734 -20920 18736 156626
17914 156626 -137325 56319 -142047 83722 42252 -233283 62533 -45406 -71129 337655 114821
17902 -226117 498800 255340 -83805 -178724 -220777 -104350 105317 -136626 -113866 50660
$$ packed form
17983a79569m5445H5700K38671a06407m6436k12396f2365j10424F3925e3557j86605
17972b40162B05069d7064A58499i3522b7547A78363J38150G09R1074f3290O537
17961e6753G7879l7560a12974l8982K8670B41229K7961B7831K49992a22308a8393
17949I9245h5660n1878a9060D2465a25206b59l8674F4456c7017J215A14614d0936
17936a61546I5054f4756j24774D51223p3937C0033e2435j54179A09280a92391
17925C18956b85870c9490A59875h0637A56955C033a26661r6073b0920A8736J37890
17914A56626a37325E6319a42047H3722m1470b33283F2533d5406k5723C37655A14821
17902b26117D98800k43460h3805r4919m2053a04350A05317a36626K2760E0660
$$ plain form
17891 358197 -123799 147258 121176 46705 28188 364445 263862 48521 -62715 12963 127269
17880 127269 -362800 39443 -85647 -201400 -43248 -101352 163299 -39376 243255 226784 272078
17869 272078 -128822 178640 83298 -9100 -174984 283255 27821 -45625 40974 89503 471935
17858 471935 -114494 -47991 162108 -104676 -105544 223081 144900 -300905 -40275 216402 294810
17847 294810 -317528 -173755 -112185 -219311 -51854 234404 119919 -271236 -5797 65283
17836 55154 185212 -151896 -146442 155299 -243986 -115177 25693 -189689 -174716 -106708 -38555
17824 72905 -44257 -109763 -81746 243461 257799 -219661 51039 -123095 -59950 44720 184230
17813 184230 -133695 -50612 142528 45214 -177647 277347 111355 -64223 -11479 -47056
$$ packed form
17891C58197a23799A47258k6082D6705j8517L36257j00583D8521f2715A2963J14306
17880A27269c62800C9443h5647j15753d3248n8104A63299c9376B43255j6471M5294
17869B72078a28822A78640H3298i100j65884B83255B7821d5625D0974M8529L82432
17858D71935a14494d7991A62108a04676q68B23081p8181c00905d0275B16402P8408
17847B94810c17528J43773O1570j07126e1854B34404j14485b71236e797F5283
17836E5154J30058a51896N454A55299b43986a15177B5693a89689J4973O8008c8555
17824G2905d4257o5506K8017B43461J4338b19661E1039a23095e9950D4720J39510
17813A84230a33695e0612A42528D5214a77647B77347A11355f4223a1479l5577
$$ plain form
17803 -47056 -49289 -27921 252420 -270773 40871 -163487 286605 -126417 -24869 7282 -102853
17791 -117368 -21677 82119 92097 -160354 222919 -437972 -40886 169885 -142758 22622 -87202
17779 -383824 -26393 -141772 97683 -41168 -189308 188286 -59165 -8618 -60322 110869 -11322
17767 69467 65115 27023 286136 -316586 211019 -221100 418546 77803 -171135 197006
17756 34343 -128757 -97680 299643 304980 -145850 257411 18845 -47909 -328083 109638 50325
17744 63817 -182450 -180444 -123726 323679 90978 195024 -75301 78561 -297683 -269738 104400
17732 -18196 -43107 -13069 -135002 -64281 -200033 279940 117244 -193034 -221494 -91465 -128267
17721 -128267 -117829 126208 11950 -48793 27062 137947 -13248 115152 -72123 -8998 130698
$$ packed form
17803d7056k233K1368B52420b70773D0871a63487B86605a26417b4869G282a02853
17791a17368b1677H2119R978a60354B22919d37972d0886A69885a42758B2622h7202
17779c83824b6393j15379I7683d1168j48140A88286e9165h618n1704A10869a1322
17767F9467m352B7023K59113c16586B11019b21100D18546G7803a71135A97006
17756C4343a28757L1077B99643N337a45850B57411A8845d7909k80174A09638E0325
17744F3817a82450K006N6718C23679I0978J04046g5301G8561b97683K7945A04400
17732a8196k4911a3069j21933f4281j35752B79940A17244a93034k8460i1465l6802
17721a28267J0438A26208A1950d8793B7062J10885a3248A15152g2123h998A30698
$$ plain form
17709 184151 131294 -69727 -217525 211533 128523 -16911 192630 2817 302290 71949 46863
17698 46863 -287041 -173964 -51592 225294 -142918 290498 -132499 -68213 15415 -49558
17687 253099 -191548 89806 -79158 -119627 6700 152022 247831 159093 38459 -92385 -134721
17676 -134721 93294 41775 190529 -220721 -984 -92875 130596 68524 -259511 -121238 63169
17664 -284908 153915 177348 355853 -69795 228209 203870 143478 2468 -88798 16414 99265
17653 99265 10768 74083 60831 -199615 -143991 -163233 -199106 40371 -100977 -212288 -154251
17642 -154251 160430 20444 54929 -777 -70291 41571 275432 236024 -44065 7769 -70391 -48547
17630 -48547 32870 -202985 425292 -111852 -175847 -47208 248545 -31819 146677 -4089 -62286
$$ packed form
17709A84151n2857f9727j47798B11533q3010a6911A92630B817K99473G1949k5086
17698D6863b87041J13077e1592B25294a42918B90498a32499O4286A5415d9558
17687B53099a91548H9806g9158m0469F700J45322R5809q8738C8459i2385m2336
17676a34721I3294D1775J48754b20721i84r1891A30596o2072b59511a21238F3169
17664b84908A53915K3433J78505f9795B28209k4339o0392B468h8798A6414Q2851
17653I9265A0768O3315j3252a99615N5624j9242l5873D0371a00977j11311N8037
17642a54251A60430B0444L4485g77o9514D1571K33861l9408d4065G769g0391K1844
17630d8547C2870b02985D25292a11852o3995d7208B48545c1819A46677d089n8197
$$ plain form
17619 -62286 372707 98488 229611 -98168 -41966 -100999 -96888 16987 -381835 124773 -142400
17607 63103 57696 40026 -91938 225973 330724 -142141 -148815 80316 -22612 3803 144736
17596 144736 -131987 -89730 74866 -48452 47772 189807 -331977 98838 19423 86819 285244
17585 285244 -10287 270540 225245 326012 -133607 136836 27555 154409 -1565 126711
17574 -24716 -71672 18497 85455 362092 37171 155430 184856 -187780 177004 92828 15203
17562 52532 -192863 -140800 -39850 -161558 244598 -85448 401971 19636 75023 -399056 417190
17550 168573 40756 354884 256994 117636 102674 65902 -14981 -136356 3620 82273 -78227
17538 -94512 -105936 -138910 -22476 130315 -137644 -1997 426762 90519 117432 275676 -164885
$$ packed form
17619f2286C72707I8488J31123i8168d1966n9033M111A6987c81835A24773a42400
17607F3103n407j7670i1938B25973J04751a42141o674H0316b2612C803J40933
17596A44736a31987M2257G4866d8452D7772J42035c31977I8838A9423O7396J98425
17585B85244a0287B70540m5295J00767a33607A36836B7555J26854a565A26711
17574b4716m6956A8497O6958K76637C7171J18259K9426a87780A77004q4176A5203
17562E2532a92863N2063c9850j21708B44598h5448D01971A9636N5387c99056D17190
17550A68573D0756L14128r7890A17636j4962l6772a4981j21375C620P8653g8227
17538i4512j1424l2974b2476A30315a37644a997D26762I0519K6913J58244a64885
$$ plain form
17526 294076 144987 223441 -321943 -4649 238773 258763 411383 -167870 -4103 74608 167118
17515 167118 2566 207046 31001 -165459 172924 74212 243295 369486 2114 432564 261103
17504 261103 208258 -122802 166727 95400 52111 301683 156827 275111 380346 147345
17493 174876 73989 -138923 284807 3220 117081 -119971 -261482 392900 -46697 2101 -8512
17481 100988 213000 -121464 19639 80854 -71812 292602 298589 229789 -81952 240530 447935
17470 447935 402042 200276 310226 13835 208094 151379 -11855 442765 241480 289054
17460 289054 179530 212622 248973 236378 38110 -109773 -6918 47705 248469 145302 91974
17449 91974 115732 200811 287398 585403 238067 442731 487841 192687 130650 398711 182767
$$ packed form
17526B94076A44987P8454c21943d649B38773J9990J52620a67870d103G4608R2510
17515A67118B566K04480C1001a65459A72924G4212J69083J26191B114M30450j71461
17504B61103n2845a22802A66727p1327m3289K49572j44856J18284J05235A47345
17493A74876G3989a38923B84807C220J13861a19971j41511C92900d6697B101h512
17481A00988J12012a21464A9639O1215g1812B92602N987o8800h1952B40530K07405
17470D47935m5893B00276J09950A3835J94259n6715a1855D42765k01285M7574
17460B89054j09524L3092L6351j2595C8110a09773f918D7705K00764j03167n3328
17449I1974K3758Q5079Q6587K98005B38067K04664M5110A92687o2037K68061A82767
$$ plain form
17437 -89082 424658 262341 26137 -29216 179291 1372 185893 433688 255583 333483 101608
17425 179236 335401 223241 302751 170369 95481 161104 164701 348525 312512 417517 287387
17414 287387 274711 430549 262770 283794 66745 116672 258513 193504 358345 272441 89924
17402 218017 -379700 395864 56879 145452 -143680 254572 57502 -151204 318586 168376
17392 168376 52567 83202 285897 211485 67232 -59948 174490 57785 -21416 183235 358912
17381 358912 -50306 167994 97630 124504 74698 208170 390547 -52267 240531 84783 30247
17369 -111402 426741 408095 332133 -73692 -27559 280394 8936 127117 -189331 127418 -57349
17357 19934 375789 143220 151231 126431 86147 -44749 167543 270062 65389 20345 256433
$$ packed form
17437h9082D24658j62317B6137b9216A79291A372J84521K47795j78105P7900A01608
17425A79236J56165j12160P9510j32382p4888O5623L597J83824l6013J05005j30130
17414B87387j2676J55838j67779K1024F6745M9927J41841o5009J64841q5904H9924
17402B18017c79700C95864E6879Q8573a43680B54572E7502a51204C18586j50210
17392A68376E2567L0635K02695p4412F7232e9948A74490E7785b1416A83235J75677
17381C58912e0306A67994p0364K6874m9806J33472J82377e2267B40531H4783C0247
17369a11402D26741j8646p5962g3692b7559B80394H936J18181a89331A27418e7349
17357A9934L55855A43220Q011k4800m0284d4749A67543J02519F5389B0345K36088
$$ plain form
17346 256433 30399 -49749 322196 126944 -39178 -201957 -109357 112659 525245 77075
17335 67444 -3089 -124636 515946 230808 362276 -6209 47136 144835 82620 127109 48680
17323 254650 200172 21662 280345 230431 -63806 70419 -315449 4628 401967 401360 -2936 -106821
17311 -106821 173358 202759 101429 210867 193339 134984 355578 411753 262194 266451 251587
17300 251587 351356 535124 79877 43555 66387 116409 241017 62160 432001 256644 109078
17288 186393 -44353 274611 385808 -112162 14817 144475 13987 504937 319340 336761
17278 336761 95342 267381 442594 182101 402729 380316 221093 14209 406728 -202197
17267 362912 295775 201365 147058 75131 634509 184696 419811 223312 256654 366279
$$ packed form
17346B56433C0399d9749C22196A26944c9178j62779R2600A12659M12586G7075
17335F7444c089j21547E15946B30808J31468f209D7136R7699o2215M4489D8680
17323B54650n4478B1662K58683m9914f3806G0419c15449D628L97339o07b936j03885
17311a06821A73358K9401j01330J09438j7528n8355K20594N6175j49559M257j4864
17300B51587R9769J83768G9877l6322K2832N0022J24608F2160L69841j75357A09078
17288A86393d4353B74611J11197a12162A4817J29658A3987M90950j85597J7421
17278C36761I5342J72039J75213A82101K20628k2413j59223A4209L92519b02197
17267C62912o7137r4410n4307p1927N59378A84696K35115j96499L3342J09625
$$ plain form
17257 366279 504376 187705 79998 337182 363676 7824 113573 368159 47689 318425
17247 318425 322881 103337 349988 339921 287285 364112 228733 128958 -74467 31808 386882
17236 386882 341731 131783 210901 254947 303062 224155 84493 237895 205369 375047 -105350
17224 270662 464311 277798 155164 239876 332755 84343 256996 363018 158474 268291
17214 268291 65135 188607 383384 262510 286985 268139 396186 327334 474623 217141
17203 247154 276442 422768 417484 198225 280547 429922 -68631 381175 273374 140118
17193 140118 161288 515167 123092 81824 277619 171990 343129 250727 -750 314775 288242
17182 288242 328611 282331 667045 541633 356764 109258 118610 601250 110636 482141
$$ packed form
17257C66279J38097A87705G9998K57184K6494G824J05749K54586D7689K70736
17247C18425M456A03337K46651j0067n2636P6827j35379r9775g4467C1808L55074
17236C86882m5151A31783P9118M4046M8115p8907H4493J53402l2526J69678a05350
17224B70662J93649j86513j22634Q4712R2879H4343J72653J06022A58474J09817
17214B68291F5135J23472J94777j20874K4475j8846J28047o8852J47289B17141
17203B47154K9288J46326n284A98225Q2322J49375f8631C81175j07801j33256
17193A40118K1170L53879A23092m1268J95795j05629J71139r2402g50C14775k6533
17182B88242M0369m6280L84714j25412j84869A09258R352M82640A10636L71505
$$ plain form
17172 482141 9436 157144 171484 377105 400750 291571 228918 423263 245470 721524
17162 721524 340779 279606 494546 153316 303284 157122 173566 437486 214668 580079
17152 580079 162395 273648 422803 504404 365366 74269 509716 399984 370105 249382
17142 249382 72437 47695 401889 273799 373263 120139 407976 477699 250428 388575
17132 388575 601326 868923 326486 611831 327789 613389 203064 210993 548820 407830
17122 407830 735568 144221 512575 333481 585061 246450 159351 343353 334893 145439
17111 226834 171793 334084 503131 336449 573523 689240 538815 512826 240413 436694
17101 436694 473470 465645 477983 200562 555478 565429 612539 227605 588008 269193 463555
$$ packed form
17172D82141I436J47708J4340K05621K3645j09179o2653J94345j77793M76054
17162G21524C40779o1173K14940A53316J49968j46162J6444K63920B14668L65411
17152E80079A62395J11253J49155Q1601j39038G4269M35447j09732k9879j20723
17142B49382G2437k4742L54194j28090R9464A20139K87837O9723k27271J38147
17132C88575K12751K67597C26486K85345k84042K85600B03064P929L37827j40990
17122D07830L27738A44221L68354j79094K51580B46450q7099J84002q460A45439
17111B26834n5041J62291J69047j66682K37074J15717j50425k5989B40413J96281
17101D36694L6776p825J2338B00562L54916R951M7110B27605L60403B69193J94362
$$ plain form
17090 463555 483940 403568 682447 651089 375707 259165 613330 524652 554117 456943 579077
17079 579077 510593 246345 493451 303952 549690 769745 388741 556089 640436 543421
17069 543421 405112 799009 587169 533596 769889 729606 619308 909248 654526 544256
17059 544256 657456 640324 631470 534269 488495 511722 706111 576902 463838 539592 705777
17048 705777 649187 539957 634116 616821 633454 748490 558260 800004 662800 495947
17038 495947 390359 772843 931831 553353 713931 677035 480809 544825 572674 883354
17028 883354 474395 672641 454567 606607 720892 513468 873343 591477 996809 781575
17018 781575 989887 727497 824683 836641 941313 873682 601826 1083455 788011 754135
$$ packed form
17090D63555K0385q0372K78879l1358k75382j16542L54165q8678K9465r7174J22134
17079E79077o8484B46345K47106j89499K45738K20055l81004J67348Q4347r7015
17069E43421j38309L93897k11840n3573K36293m0283j10298K89940k54722j10270
17059E44256J13200j7132q854r7201m5774K3227J94389j29209j13064P5754J66185
17048G05777n6590j09230R4159j7295J6633J15036j90230K41744j37204j66853
17038D95947j05588L82484J58988l78478J60578l6896j96226O4016K7849L10680
17028H83354m08959J98246k18074J52040J14285k07424L59875k81866M05332k15234
17018G81575K08312k62390R7186J1958J04672o7631k71856M81629k95444l3876
$$ plain form
17008 754135 726390 946687 718856 855416 709819 922916 338490 812088 920149 1021455
16998 1021455 992921 868377 946097 718642 676077 834086 1001732 980973 641022 915344
16988 915344 1083779 914880 974510 1166508 1121865 1115650 853205 1023732 772913 1082484
16978 1082484 1199015 877344 1322884 1102646 836833 712292 751722 815908 1273559 598623
16967 978708 1112771 1119624 1239497 1313583 1081486 1204090 1189453 1314414 730406 1190333
16957 1190333 956827 1259369 1109129 1158268 1303001 1299775 1286937 1584218 1426245 1075251
16947 1075251 1201356 1387240 1357156 1460866 1400193 1821681 1371726 1383810 1409840 775769
16937 775769 1388745 1412108 1417070 1035260 1330474 1160775 1302615 1232163 1400348 1526854
$$ packed form
17008G54135k7745K20297k27831J36560j45597K13097C38490M73598J08061J01306
16998A021455k8534j24544P7720k27455m2565J58009J67646k0759l39951K74322
16988I15344J68435j68899N9630J91998m4643o215k62445J70527k50819L09571
16978A082484J16531l21671M45540k20238k65813j24541L9430O4186M57651E98623
16967I78708J34063O853J19873P4086k32097J22604j4637J24961n84008M59927
16957A190333k33506L02542j50240M9139J44733l226j2838K97281j57973l50994
16947A075251J26105J85884l0084J03710o0673M21488m49955J2084K6030o34071
16937G75769O12976K3363M962l81810K95214j69699J41840p0452J68185J26506
$$ plain form
16927 1526854 1864464 1188674 1621692 1639132 1598650 1585529 1806783 1467860 1425327 1923339
16917 1923339 1541004 1520029 1602615 1560491 1930990 2002942 1576602 1507191 1737506 1767553
16907 1767553 1826747 1749413 1890880 1762237 1999651 2264471 1892033 2228444 1883164 2049450
16897 2049450 1829426 2184776 2141773 2174057 2071735 2380196 2077106 2160479 2311497 2446728
16887 2446728 2497460 2162035 2046339 2469629 2117120 2362349 2737988 2495063 2566587 2621371
16877 2621371 2598020 2462071 2725290 2655081 2777434 2615537 2915290 2441694 2704912 3029605
16867 3029605 2878895 2742879 3074112 3010597 3215483 3363268 3155227 3204481 3136652 3440750
16857 3440750 3413214 2899196 3477617 3491692 3385283 3632786 3787216 3425750 3715292 3752256
$$ packed form
16927A526854L37610o75790M33018J7440m0482j3121K21254l38923m2533M98012
16917A923339l82335k0975Q2586m2124L70499P1952m26340o9411K30315L0047
16907A767553N9194p7334J41467j28643K37414K64820l72438L36411l45280J66286
16897B049450k20024L55350m3003L2284j02322L08461l03090Q3373J51018J35231
16887B446728N0732l35425j15696M23290l52509K45229L75639k42925P1524N4784
16877B621371k3351j35949K63219p0209J22353j61897K99753m73596K63218L24693
16867C029605j50710j36016L31233o3515K04886J47785k08041M9254o7829L04098
16857C440750k7536n14018N78421J4075j06409K47503J54430l61466K89542L6964
$$ plain form
16847 3752256 3529951 3928888 4058129 4096943 4058119 4109751 4548092 4515875 4149541 4448513
16837 4448513 4421213 4228714 4665702 4710138 4631762 5009522 5002857 5238090 5082547 5130972
16827 5130972 5153684 5248378 5458211 5669658 5642088 5977840 5937848 5617581 6127164 6426950
16817 6426950 6372993 6603674 6623665 6631760 6799761 6853059 6912109 7498667 7614855 7511969
16807 7511969 7565706 7660018 8323996 8364002 8528631 8516215 8740018 8969024 8752297 9230249
16797 9230249 9739559 9590592 10006749 10411442 10644615 10814688 10838048 11219569 12107376 11994124
16787 11994124 12154827 12500200 13080247 13344449 13675997 14123023 14180342 14868627 15261744
16778 15261744 15846414 16576525 16969590 17303393 17555383 18365969 19057123 19546641 19998360
$$ packed form
16847C752256k22305L98937J29241L8814l8824N1632M38341l2217l66334K98972
16837D448513k7300j92499M36988M4436p8376L77760o665K35233j55543M8425
16827E130972K2712R4694K09833K11447k7570L35752l9992l20267N09583K99786
16817F426950n3957K30681J9991Q095J68001N3298N9050N86558J16188j02886
16807G511969N3737R4312O63978M0006J64629j2416K23803K29006k16727M77952
16797I230249N09310j48967M16157M04693K33173J70073K3360L81521Q87807j13252
16787A1994124J60703L45373N80047K64202L31548M47026N7319O88285L93117
16778A5261744N84670P30111L93065L33803K51990Q10586O91154M89518M51719
$$ plain form
16769 19998360 21006762 21643619 22243247 23103153 24195269 24855106 25918811 26611277 27608313
16760 27608313 29195207 30115995 31448267 32397064 33706619 35284403 36870754 38598562
16752 38598562 40365214 42135878 43664542 45893388 48165579 50131718 52874992 55466472
16744 55466472 58531687 61375786 64703796 67777094 71489412 75102203 79292640 83730088
16736 83730088 88057594 93188013 97556388 103207735 108752191 114609142 120367973 126157095
16728 126157095 132448389 138430075 144656469 150253203 155817662 161105939 165756060 170006911
16720 170006911 173245257 175707380 177459586 177826168 177282451 176233673 173634626 170829714
16712 170829714 166821054 162214159 156784014 151145018 145074499 138982799 132779204 126232026
$$ packed form
16769A9998360J008402O36857N99628Q59906J092116O59837J063705O92466R97036
16760B7608313J586894R20788J332272R48797J309555J577784J586351J727808
16752C8598562J766652J770664J528664K228846K272191J966139K743274K591480
16744E5466472L065215K844099L328010L073298L712318L612791M190437M437448
16736H3730088M327506N130419M368375N651347N544456N856951N758831N789122
16728A26157095O291294N981686O226394N596734N564459N288277M650121M250851
16720A70006911L238346K462123J752206L66582n43717j048778k599047k804912
16712A70829714m008660m606895n430145n638996o070519o091700o203595o547178
$$ plain form
16704 126232026 119913377 114004210 107719829 102030166 96595783 91089840 86264221 81837417
16696 81837417 77368691 73210241 69231141 65864679 61994653 58792589 55832649 53132234
16688 53132234 50091198 47952811 45332965 43283773 41285247 39396892 37584760 36015370
16680 36015370 34317800 32743433 31322943 30181210 28839428 27563938 26373743 25350989
16672 25350989 24884903 23658851 22990130 21867368 20972025 19902237 19978196 18794496 18074983
16663 18074983 17621871 17220314 16429545 15822853 15274798 14972162 14512900 14248905 13459729
16654 13459729 12719496 12771008 12408397 11928787 11476374 11018328 10957261 10531020 10653810 10270884
16644 10270884 9742192 9667171 9536582 9180217 8814755 8427181 8669747 8029045 7863789
$$ packed form
16704A26232026o318649n909167o284381n689663n434383n505943m825619m426804
16696H1837417m468726m158450l979100l366462l870026l202064k959940k700415
16688E3132234l041036k138387k619846k049192j998526j888355j812132j569390
16680C6015370j697570j574367j420490j141733j341782j275490j190195j022754
16672B5350989m66086j226052o68721j122762q95343j069788P5959j183700p19513
16663A8074983m53112m01557p90769o06692n48055l02636m59262k63995p89176
16654A3459729p40233N1512l62611m79610m52413m58046o1067m26241J22790l82926
16644A0270884n28692p5021j30589l56365l65462l87574K42566o40702j65256
$$ plain form
16635 7863789 7924033 7532598 7387006 7039770 7103951 6577089 6790427 6729137 6692315 5938928
16625 5938928 6517733 5906778 5789032 5545040 5708851 5263259 5644174 5087772 5357144
16616 5357144 5038128 4612741 4858281 4726283 4645455 4764021 4343536 4122983 4360935 4367592
16606 4367592 3942877 4116866 4134919 4052196 3782821 3697127 3688104 3634165 3786198 3354139
16596 3354139 3295833 3571659 3250337 3346952 3329608 3516499 3210391 3127331 2937741 3090392
16586 3090392 2852904 3073273 3109440 2521056 2771209 2410867 2859583 2575047 2389693 2614494
16576 2614494 2561600 2537338 2703472 2409297 2510146 2378094 2150673 2145888 2169789 2172797 2147158
16565 2147158 2292372 1959382 2150814 1943391 1716603 2128054 2064381 1888516 2099426 1951303
$$ packed form
16635G863789O0244l91435j45592l47236O4181n26862K13338o1290l6822p53387
16625E938928N78805o10955j17746k43992J63811m45592L80915n56402K69372
16616E357144l19016m25387K45540j31998q0828J18566m20485k20553K37952O657
16606D367592m24715J73989J8053q2723k69375q5694r023n3939J52033m32059
16596C354139n8306K75826l21322R6615j7344J86891l06108q3060j89590J52651
16586C090392k37488K20369L6167n88384K50153l60342M48716k84536j85354K24801
16576B614494n2894k4262J66134k94175J00849j32052k27421m785K3901L008k5639
16565B147158J45214l32990J91432k07423k26788M11451o3673j75865K10910j48123
$$ plain form
16555 1951303 1971912 1807099 1699191 1661902 1865317 1770758 1364228 1622736 1742472 1380614
16545 1380614 1687676 1674586 1437180 1721379 1257373 1567205 1619118 1100930 1571511 1483917
16535 1483917 1452741 1435789 1521626 1117187 1273272 1054586 1217363 1210029 1176010 1506361
16525 1506361 1459273 1101554 974761 1289437 1210103 1079373 1118620 1149784 602347 1496720
16515 1496720 1142407 946176 898715 903704 862900 1249695 828633 980262 451429 974954
16505 974954 1103365 1162288 998495 1097534 780820 598808 709686 1013502 1014333 1055279 1039935
16494 1039935 950125 894284 701580 964698 919883 1080848 998715 289005 1015706 798490
16484 798490 877110 844169 1114492 512788 540275 792667 912914 837560 772960 700123 400130
$$ packed form
16555A951303K0609j64813j07908l7289K03415r4559m06530K58508J19736l61858
16545A380614L07062j3090k37406K84199m64006L09832N1913n18188M70581q7594
16535A483917l1176j6952Q5837m04439J56085k18686J62777p334l4019L30351
16525A506361m7088l57719j26793L14676p9334j30730L9247L1164n47437Q94373
16515A496720l54313j96231m7461M989m0804L86795m21062J51629D51429N23525
16505I74954J28411N8923j63793R9039l16714j82012J10878L03816Q31M0946j5344
16494A039935q9810n5841j92704K63118m4815J60965q2133B89005P26701k17216
16484G98490P8620l2941K70323E12788K7487K52392J20247p5354o4600p2837k99993
$$ plain form
16473 400130 839407 527634 783162 653203 989458 434468 429699 612620 940892 476984
16463 476984 543572 755323 698977 417515 533889 327150 872327 742483 925124 480625
16453 480625 491660 284758 801892 618688 548073 696693 543231 254032 850192 437313
16443 437313 727050 579958 597713 657370 711944 439474 440493 331484 382831 540261 714617
16432 714617 323657 609979 272941 563245 296881 381703 765989 537256 446383 208278
16421 405042 446582 690844 196564 417249 583876 414562 357102 330167 215406 629380
16411 629380 514915 482343 267694 554536 634114 688209 477121 30748 366144 302315
16401 302315 324166 459480 139752 723820 327975 394303 371409 289985 243305 359781
$$ packed form
16473D00130M39277l11773K55528j29959L36255D34468m769J82921L28272m63908
16463D76984O6588K11751n6346k81462J16374k06739N45177j29844J82641m44499
16453D80625J1035k06902N17134j83204p0615J48620j53462B54032N96160m12879
16443D37313K89737j47092J7755N9657N4574k72470J019j09009N1347J57430J74356
16432G14617C23657K86322B72941K90304k66364Q4822L84286k28733r0873B08278
16421D05042M1540K44262A96564K20685J66627j69314n7460k6935j14761M13974
16411F29380j14465l2572k14649K86842P9578N4095k11088C0748L35396o3829
16401C02315K1851J35314A39752N84068C27975O6328k2894q1424m6680J16476
$$ plain form
16391 359781 323387 207153 178989 28722 314213 181547 280531 411783 358887 559072
16381 559072 71838 559358 368200 252649 296975 41764 391643 183666 363870 78205
16370 719897 81002 -2883 313271 88857 432467 377457 235671 167386 32483 144305 278350
16359 278350 248884 173028 300869 278098 411286 148182 373622 315168 420945 595573
16349 595573 105585 -63175 323724 208883 138638 370137 417031 276270 192050 166752
16339 166752 349741 191650 290752 -80390 236631 171090 8168 149967 238706 11920 -203634
16327 -7426 293769 190629 429589 88816 122380 482479 57870 313774 -160237 79695 325825
16316 325825 29135 392799 -88560 348512 171862 165653 -29713 215288 173971 89312 333674
$$ packed form
16391C59781l6394j16234k8164B8722K85491j32666R8984J31252n2896K00185
16381E59072G1838M87520j91158j15551M4326D1764L49879A83666J80204G8205
16370G19897H1002b883C13271H8857L43610n5010j41786o8285C2483J11822J34045
16359B78350k9466p5856J27841k2771J33188A48182K25440n8454J05777J74628
16349E95573A05585f3175C23724j14841p0245K31499M6894j40761q4220k5298
16339A66752J82989j58091R9102h0390B36631o5541H168J41799Q8739A1920b03634
16327g426B93769j03140K38960H8816L3564L60099E7870K55904a60237G9695K46130
16316C25825B9135L63664h8560C48512A71862o209b9713B15288m1317q4659K44362
$$ plain form
16305 333674 192915 250988 -335330 286103 36875 70492 184546 147804 -14165 194582
16294 -102495 221677 326586 -37346 145475 208496 46680 -86155 370700 253202 144526
16284 144526 62787 89924 215493 -40004 -25379 -9435 240544 273312 39119 -56464 -1348
16272 172968 32096 72311 101996 -53384 65713 157039 24243 52524 37259 160913 374020
16261 374020 426568 128457 144684 210320 -304902 291874 -85241 169043 110838 133505 80409
16250 80409 202339 -66771 -151829 87313 281365 123912 85516 303352 156040 -52110 318499
16238 -66953 149046 -40232 117655 -74082 55091 129348 -13069 -269076 402055 -184475 -110345
16227 -110345 44711 260527 -204147 222024 116634 48872 152354 135964 326649 -99780
$$ packed form
16305C33674j40759N8073c35330B86103C6875L3617J14054l6742a4165A94582
16294a02495B21677J04909c7346A45475O3021D6680h6155C70700j17498j08676
16284A44526F2787K7137J25569d0004J4625i435B40544L2768C9119e6464a348
16272A72968C2096M0215K9685e3384F5713R1326B4243K8281j5265J23654K13107
16261C74020N2548A28457J6227O5636c04902B91874h5241A69043n8205K2667n3096
16250H0409J21930f6771q5058H7313J94052A23912l8396K17836j47312e2110C18499
16238f6953A49046d0232A17655g4082E5091P4257a3069k56007D02055a84475P4130
16227a10345D4711K15816b04147B22024j05390D8872J03482j6390J90685i9780
$$ plain form
16216 106018 -116561 106983 -23470 -51360 -182986 -283081 224006 -148489 -340608 141193
16205 59716 68746 256813 87003 -296038 86867 68160 -167235 93190 141964 -56287 20923
16193 59029 -4878 -139453 108188 -62270 35434 167441 61273 15865 -239100 108102 -95315
16181 92973 295635 -1763 104738 244027 182014 -121899 -35967 97058 338848 -148548 94250
16169 341397 374302 -92002 100367 -204546 -71194 -93522 80568 113452 280151 177250 -178094
16157 1348 257785 213952 -17461 65670 -71257 82930 66669 131368 -304407 105575 25099
16145 -410422 -57042 97459 141850 141154 -19403 59156 190620 121121 -244569 71555 -135898
16133 -26775 -57456 66014 -172016 51688 130851 -30553 -100263 86547 -33190 48958 -8172 -201257
$$ packed form
16216A06018a16561A06983b3470k7890j31626j00095B24006a48489j92119A41193
16205E9716R030J88067H7003b96038H6867j8707a67235I3190M8774e6287B0923
16193E9029d878j34575A08188f2270C5434J32007F1273A5865b39100A08102i5315
16181I2973K02662a763A04738J39289o2013a21899c5967I7058K41790a48548I4250
16169C41397L2905i2002A00367b04546g1194k2328H0568L2884J66699j02901a78094
16157A348K56437m3833a7461F5670g1257H2930j6261O4699c04407A05575B5099
16145d10422e7042I7459M4391o96a9403E9156J31464o9499b44569G1555a35898
16133b6775l0681F6014a72016E1688P9163c0553o9710H6547c3190D8958h172j93085
$$ plain form
16121 -201257 214331 -164773 -78820 -1972 244934 280134 173195 -125643 319926 -216967
16110 -232622 139267 5957 60339 114110 -129554 -101052 324142 -12051 23824 209137 67656
16098 200574 336569 618 -26383 -212735 98493 247236 58403 -145159 267096 217939 -45433
16086 -112161 -279272 -238133 178770 37662 -45259 119552 8160 -46921 67637 -201076 68178
16074 191366 193067 221881 -1540 -90799 78101 109400 102195 -145006 -184183 -122815 173696 -196592
16061 -230402 -94680 -11795 -66753 248869 -309013 -496124 -16150 69044 -104482 -160331 -204813
16050 -204813 -331985 200434 188965 294870 94901 129025 146618 351514 -3409 -73726 -135685
16039 -135685 -118452 63351 -71242 -318748 45787 -14858 182430 -85668 -119678 -71436 -36859
$$ packed form
16121b01257B14331a64773g8820a972B44934L5200j06939a25643C19926b16967
16110b32622A39267E957N4382N3771a29554K8502C24142a2051B3824J85313F7656
16098B00574J35995F18b6383j86352I8493J48743E8403a45159B67096m9157d5433
16086a12161j67111M1139A78770C7662d5259A19552H160d6921F7637b01076F8178
16074A91366J701K8814a540q9259G8101L1299p205a45006l9177O1368A73696a96592
16061b30402i4680a1795n4958B48869c09013j87111a6150F9044a04482n5849m4482
16050b04813j27172B00434j1469J05905I4901L4124J7593K04896c409p0317o1959
16039a35685J7233F3351g1242k47506D5787a4858A82430h5668l4010M8242L4577
$$ plain form
16028 -36859 -71449 -259594 71756 -102302 -326887 291533 -15895 -259673 28796 249916
16018 249916 -237111 158182 -11639 66338 -41270 -298646 -209257 5450 125791 -450901 -168922
16006 -216686 -30794 -290500 116803 -268908 -115691 -55906 -76207 -42923 291779 81702
15995 -37076 -7106 -96738 -62289 -87619 -135070 86109 162572 67606 -71754 112819 -17587 -204425
15983 -204425 363523 75398 336837 133196 297132 115648 -94689 52951 -51672 64185
15972 82120 -114658 -25647 94286 44904 -14919 52112 -120964 102418 234711 80538 396497
15961 396497 132712 -227779 49093 -13794 -51316 -34327 -61706 147600 92049 215196 -278122
15949 -243114 -26233 -98633 160990 -52152 -183434 -54434 -134202 -20237 -330682 -7442 -8327
$$ packed form
16028c6859l4590j88145G1756a02302k24585B91533a5895k43778B8796K21120
16018B49916b37111A58182a1639F6338d1270k57376Q9389E450J20341d50901a68922
16006b16686c0794k59706A16803b68908a15691e5906k0301L3284B91779H1702
15995c7076g106q9632L4449k5330m7451H6109P6463F7606g1754A12819a7587j86838
15983b04425C63523G5398K61439A33196J63936A15648i4689E2951e1672F4185
15972H2120a14658b5647I4286D4904a4919E2112a20964A02418J32293H0538L15959
15961C96497A32712b27779D9093a3794l7522J6989k7379A47600n5551J23147b78122
15949b43114b6233p2400A60990e2152j31282e4434p9768b0237l10445g442q85
$$ plain form
15938 -8327 -128718 216222 -85310 -65051 100815 75429 98551 -249708 -447412 -387692 -398743
15927 -398743 -14910 169950 -106535 -30895 39878 255621 -216758 43479 -413495 34351
15916 147041 98632 -217984 -173919 -251709 281811 -42947 -212663 -152435 -137518 -149227 -257754
15905 -257754 154185 147376 -228394 -105351 46947 50932 100519 -134279 -428389 -199425 79616
15893 -300514 176094 -18112 176049 -214452 -307963 -166742 99400 63145 110173 -373583
15882 -136422 -164425 -440581 -630828 -153933 72546 430098 -124758 142346 -47978 -113018
15872 -113018 113585 82611 -121214 -95378 -178686 -161983 -367649 -304985 -218473 12800 83052
15861 83052 56495 127824 -56992 84557 85879 160475 6185 242883 66777 55112 -7317 5676
$$ packed form
15938h327j20391B16222h5310K0259A00815k5386K3122b49708j97704N9720j1051
15927c98743a4910A69950a06535c0895C9878K15743b16758D3479d13495C4351
15916A47041m8409b17984M4065p7790B81811d2947j69716O0228J4917j1709j08527
15905b57754A54185o809b28394a05351D6947L985M9587a34279k94110a99425G9616
15893c00514A76094a8112A76049b14452r3511J41221I9400l6255M7028c73583
15882a36422k8003k76156j90247a53933G2546L57552a24758A42346d7978o5040
15872a13018A13585l0974a21214K5836q3308J6703k05666O2664Q6512A2800P0252
15861H3052k6557P1329e6992H4557J322P4596F185K36698F6777j1665g317E676
$$ plain form
15848 176367 -147430 93376 88693 -66902 182911 -140869 -501796 177210 34183 -64059 -69289
15837 -69289 -146027 -169839 120825 -167793 347746 -62498 35539 -264067 3751 -211591 219027
15825 -171371 23706 -91371 -103248 176329 -68201 -143304 -161113 -227840 -122700 225626 -155405
15813 57156 328180 -30067 69678 -125139 102960 -407367 47845 -461127 194765 -24196
15802 128371 -315750 -158294 -3994 -347415 96113 -141749 -72355 316900 -3527 -9866 70159
15790 55819 315254 180945 147939 -238496 -240416 145326 -135920 257697 37673 -14703 -303613
15779 -303613 -62004 -92532 -16359 180366 -217873 -27544 -215226 151126 -76300 -130661 -180518
15768 -180518 -107617 6542 -319869 161306 -321212 -271827 166249 -96779 63863 93858 -103183
$$ packed form
15848A76367a47430I3376m683f6902A82911a40869l60927A77210C4183f4059n230
15837f9289p6738k3812A20825a67793C47746f2498C5539b64067C751b11591B19027
15825a71371B3706i1371j1877A76329f8201p5103j7809o6727J05140B25626a55405
15813E7156K71024c0067F9678a25139A02960d07367D7845d61127A94765b4196
15802A28371c15750J57456c994l43421I6113a41749O9394C16900c527o339G0159
15790E5819K59435j34309l3006b38496j920A45326a35920B57697C7673a4703k88910
15779c03613f2004l0528a6359A80366b17873b7544j87682A51126g6300n4361m9857
15768a80518P2901F542c19869A61306c21212M9385A66249i6779F3863K9995a03183
$$ plain form
15756 94415 392068 53455 241178 -39436 231899 166374 335227 -257317 176730 58320
15745 201720 96436 51643 343280 -30155 -88450 -105046 24480 -58844 10691 98756 -246503
15733 228235 -65957 3795 -48787 -164640 -163297 -12866 166977 -227739 -241535 -12929 -194129
15722 -194129 -424171 211818 -16067 66523 -11477 -52612 15291 66230 -4450 -222753 -122134
15711 -122134 138880 -298120 -287526 -2626 299753 -165368 -107781 -214476 173952 131703
15701 131703 -182115 93077 -25477 -41091 2225 234893 294196 -62200 31569 206299 -129229
15689 152589 -229758 364401 301161 -186224 -198527 -35595 -120478 -230108 -221251 -13764 82355
15677 -70784 -146223 34609 5120 107093 -270662 10691 -15065 114465 217637 343049 -314479
$$ packed form
15756I4415K97653E3455J87723c9436B31899o5525J68853b57317A76730E8320
15745B01720I6436m4793K91637c0155n8295j6596B4480e8844A0691Q8065b46503
15733B28235f5957C795d8787j15853J343a2866A66977b27739j3796a2929j81200
15722a94129k30042B11818a6067F6523a1477m1135A5291N0939d450k18303J00619
15711a22134A38880b98120J0594b626B99753a65368N7587j06695A73952m2249
15701A31703a82115I3077b5477j5614B225K32668N9303f2200C1569J74730a29229
15689A52589b29758C64401o3240a86224j2303c5595q4883j09630Q857a3764H2355
15677g0784p5439C4609E120J01973b70662A0691a5065A14465J03172J25412c14479
$$ plain form
15665 43268 -158935 -239874 23495 -277427 173431 -52356 68363 33266 -57243 -149679 100410
15653 -207996 149079 459069 22 -115881 -165172 146735 102882 2136 283573 184620 78993
15641 83329 -275688 371038 -91978 163008 -303182 -135065 -487043 391359 44152 -61471
15630 309837 228626 109156 -80218 158245 178483 -187534 198260 -276928 156430 125897
15620 125897 213926 122850 252910 -147882 104688 59849 124056 171387 8094 -176057 -44754
15608 -208315 144343 -291829 -201552 15722 -225677 51349 -160123 124111 219096 167222
15598 167222 -196754 -483469 -243107 -188866 -166517 87463 -159682 295463 -174102 56799
15587 -120997 464646 26552 265080 -85838 124726 -353561 -119988 -421790 -291881 -177572
$$ packed form
15665D3268a58935q0939B3495b77427A73431e2356F8363C3266e7243r2436A00410
15653b07996A49079L09990B2a15881m9291A46735m3853B136K81437r8953G8993
15641H3329b75688C71038i1978A63008c03182a35065l51978C91359D4152f1471
15630C09837q1211A09156h0218A58245K0238a87534A98260b76928A56430l0533
15620A25897Q8029r1076J30060a47882A04688m4839O4207M7331H094a76057d4754
15608b08315A44343b91829R0277A5722b25677E1349a60123A24111R4985n1874
15598A67222a96754k86715K40362N4241K2349H7463a59682B95463a74102E6799
15587a20997D64646B6552K38528h5838A24726c53561a19988l01802J29909J14309
$$ plain form
15577 -177572 -208155 -406003 -86651 85370 -139384 22827 65517 216544 27902 290029 21036
15565 -112294 51993 -21360 137286 191120 92420 -144893 -59093 -173659 -11177 22993 222583
15554 222583 100517 -122275 -89754 -33197 -189649 -115766 -673988 -113897 -166245 -87617
15544 -87617 31043 -42470 10965 -34542 -95491 63923 -49391 -37379 252026 -55204 -37314
15533 -37314 -322219 77646 -159622 81186 92458 -87478 -195576 136241 154603 -445219 -227587
15522 -227587 -65531 66973 -128110 -275742 55205 -17794 69246 404647 131266 28073 -75797
15510 -15842 -222120 330667 361725 17134 -31183 270391 -99161 87334 49036 -10716 -150085
15499 -150085 -109473 -424457 240401 -122361 15122 62456 -23420 -55199 38869 -22663 -291782
$$ packed form
15577a77572l0583j97848h6651H5370a39384B2827M2690J51027B7902K62127B1036
15565a12294E1993b1360A37286N3834I2420a44893e9093j14566a1177B2993J99590
15554B22583A00517a22275L2521c3197j56452P3883n58222a13897n2348P8628
15544h7617C1043d2470A0965c4542o0949F3923d9391J2012B52026e5204J7890
15533c7314k84905G7646a59622H1186J1272h7478j08098A36241J8362d45219K17632
15522b27587f5531F6973a28110j47632E5205a7794F9246L35401A31266B8073g5797
15510a5842k06278C30667L1058A7134c1183B70391i9161H7334l8298a0716j39369
15499a50085M0612l14984B40401a22361A5122M7334b3420l1779C8869b2663k69119
$$ plain form
15488 -291782 257734 434320 99719 -254846 -118804 27530 -62740 353077 12658 -458918
15477 -206150 -24465 -244949 96190 -34078 -179373 33660 -80200 -87033 -7032 -175822 191581
15465 98907 -12701 -6959 98522 -155956 -60085 -64911 160410 -6573 -228467 108479 179528
15454 179528 171793 -184589 78017 -309270 -26358 -59931 356618 310909 -63890 -135981 35748
15442 -183382 339551 -22618 -23763 -162980 -20125 15508 32890 -60607 53921 -184089 146702
15430 -87741 271389 38590 241745 73747 92669 1265 -42889 312249 42115 -77998 -157725
15419 -157725 -103137 144151 -304369 -127109 115386 -143136 207611 97537 -228245 -20181
15408 -18911 -2359 -173858 -349518 165628 4911 471206 -294039 67212 -84959 -154577 146302
$$ packed form
15488b91782B57734J76586I9719b54846a18804B7530f2740C53077A2658d58918
15477b06150b4465k20484I6190c4078j45295C3660h0200o833g032j68790A91581
15465I8907a2701N742I8522a55956f0085m826A60410f573k21894A08479P1049
15454A79528p735a84589G8017c09270b6358l3573C56618m5709f3890p2091C5748
15442a83382C39551b2618j145j39217b0125A5508J7382f0607E3921a84089A46702
15430h7741B71389C8590K03155G3747J8922A265d2889C12249D2115g7998p9727
15419a57725N4588A44151c04369a27109A15386a43136B07611I7537b28245b0181
15408a8911b359j71499j75660A65628D911M66295b94039F7212h4959o9618A46302
$$ plain form
15396 -68802 -115355 -119 -350530 -1828 -83668 -217903 65138 171946 -164168 -258117 67808
15384 48372 226931 127384 -55533 153713 -85654 -21719 -12939 141761 192001 -8725 204740
15372 63305 21867 -147846 -61032 -54743 -26113 -165547 -148311 145143 -375199 -46575 44781
15360 -55571 179849 111950 -122792 -194785 -247486 431598 82343 22790 -92614 65971 397027
15349 397027 311577 -19550 -312154 209432 241463 70569 13943 114622 -212084 353391
15338 -164169 390294 36558 62821 50617 -172105 16433 41928 29906 129899 70277 -161016
15326 92924 -22306 -13423 233583 -244845 -134126 21071 1555 157173 -2251 -59026 -31690
15315 -31690 4421 54807 -48039 154604 -216835 258538 -47277 -231513 -266893 45728 90504
$$ packed form
15396f8802m6553a19l50411a828q1840j34235F5138J06808a64168r3949F7808
15384D8372J78559r9547e5533A53713h5654b1719Q780A41761N0240h725B04740
15372F3305B1867a47846f1032O289b6113j39434J7236A45143c75199d6575D4781
15360e5571A79849o7899a22792p1993n2701D31598H2343B2790i2614F5971L31056
15349C97027q5450a9550k92604B09432L2031G0569A3943J00679b12084C53391
15338a64169C90294C6558K6263j2204a72105A6433K5495j2022R9993n9622a61016
15326I2924b2306Q883B33583b44845J10719B1071A555J55618b251n6775K7336
15315c1690D421N0386d8039A54604b16835B58538d7277j84236l5380D5728M4776
$$ plain form
15304 90504 139370 433099 287887 -138891 -273801 -41299 -10370 174877 34784 421020
15294 421020 -67945 -40124 -222519 133547 -373181 272485 -108638 63365 182950 93625
15284 93625 -26303 58483 236448 117567 -42317 486650 68631 155961 231537 -206714 93585
15272 -38359 -131415 166450 -190444 -19945 -191245 -8833 121438 -21025 142686 159571 292030
15261 292030 -44711 -59626 123125 115184 -23723 333999 184406 60698 -190881 226901 75827
15249 286372 115642 178700 571137 1361976 1309392 1251259 1510451 966486 405252 376407
15239 376407 130592 97213 89286 104508 45549 23104 -21269 244344 23099 351477 17290
15227 -65916 45300 54238 173324 332073 -242520 24173 5366 3026 236178 245545 268587 -448766
$$ packed form
15304I0504M8866K93729j45212a38891j34910d1299a0370A74877C4784L86236
15294D21020f7945K7821j82395A33547c73181B72485a08638F3365J19585q9325
15284I3625b6303E8483J77965A17567d2317D86650F8631Q7330P5576b06714I3585
15272c8359r3056A66450a90444a9945j71300h833A21438b1025A42686J6885J32459
15261B92030d4711j4915A23125p941b3723C33999j49593F0698a90881B26901G5827
15249B86372A15642O3058L92437P90839n2584n8133K59192n43965D05252k8845
15239C76407A30592l3379p927J5222D5549k2445b1269B44344B3099L28378A7290
15227f5916D5300Q938J19086J58749b42520B4173E366k340K33152R367K3042d48766
$$ plain form
15214 34062 63227 102919 166444 -273556 52904 141405 -53924 219146 121257 161453 69797
15202 70199 77074 188255 279029 107004 141210 -54957 309863 85457 -178494 91066 37069
15190 -185354 154765 -99572 1944 -223043 -7937 139292 -55503 162623 17460 -100682 -64885
15179 -64885 235462 153528 78004 165732 12108 352175 -17481 503355 20526 283238 384286
15168 384286 9181 387184 -116025 221069 5916 128542 319022 -47399 -89893 -296586 82405
15156 57764 197318 337837 -20691 173759 184016 64032 -42199 125545 334033 244599 -32201
15144 195116 205504 -189469 -44689 202394 417503 -258937 37379 -97153 47892 238685
15134 238685 -131679 -118975 71382 368316 32538 233933 -35467 243132 101058 255853
$$ packed form
15214C4062K9165L9692O3525b73556E2904Q8501e3924B19146r7889M0196F9797
15202G0199O875J11181R0774A07004L4206e4957C09863H5457a78494I1066C7069
15190a85354A54765i9572A944b23043g937A39292e5503A62623A7460a00682L5797
15179f4885B35462q1934p5524Q7728A2108L40067a7481E03355B0526K62712J01048
15168C84286I181L78003a16025B21069E916J22626J90480d7399m2494k06693H2405
15156E7764J39554J40519b0691A73759J0257F4032d2199A25545K08488q9434c2201
15144A95116J0388a89469d4689B02394K15109b58937C7379i7153D7892J90793
15134B38685a31679J2704G1382K96934C2538K01395c5467B43132A01058J54795
$$ plain form
15124 255853 23104 -29040 27275 92758 169905 184357 120819 198173 443864 99426 232747
15113 232747 144983 216862 77648 357696 41713 157002 184825 167574 212461 185123 63976
15101 252801 -131965 528776 -70880 336095 239863 -97811 284525 -69441 239582 -2945 230551
15089 301869 119362 335213 -15157 202070 152750 162071 165248 27313 65898 260409 345302
15078 345302 128572 266075 170167 750 193621 186059 212218 297309 221036 265327 83281
15066 183751 313514 258734 262948 294864 55491 119642 91350 307500 19944 73047 266649
15055 266649 119694 -127977 135396 386972 -176328 171531 367290 63499 -260085 -35516
15044 -62723 208903 -142606 107435 17834 -9159 201147 182592 5879 105181 -244519 196402
$$ packed form
15124B55853B3104b9040B7275O5483P7147J4452o3538P7354K45691I9426J33321
15113B32747q7764P1879G7648K80048D1713J15289K7823j7251M4887k7338F3976
15101B52801a31965E28776g0880C36095r6232i7811B84525f9441B39582b945B30551
15089C01869A19362K15851a5157B02070m9320R321L177B7313L8585J94511Q4893
15078C45302A28572J37503r5908G50J92871p562K6159Q5091p6273M4291H3281
15066A83751J29763n4780M214L1916E5491O4151k8292K16150A9944N3103J93602
15055B66649A19694a27977A35396K51576a76328A71531J95759F3499b60085c5516
15044f2723B08903a42606A07435A7834i159B01147j8555E879R9302b44519A96402
$$ plain form
15032 393824 330063 132251 256461 359121 106763 250918 189752 365280 155546 297540
15022 297540 180866 -16934 -27790 156581 414042 200953 108019 212674 169512 323226
15012 323226 440155 406396 -16653 147256 411570 613145 167744 302765 426740 122584
15001 -234855 21721 339423 159805 194263 237103 220440 202674 300322 108666 74150 15671
14989 -193195 31825 59538 314373 127892 84257 352940 165335 252189 202141 159805 227963
14978 227963 251814 -3814 -158086 289872 50808 3194 241815 42053 16615 100578 -219049
14966 146140 333215 130447 343504 294972 463967 92769 309446 460892 422960 305499
14956 305499 386042 39689 173327 285176 273549 -33601 -11039 255420 583492 139350
$$ packed form
15032C93824o3761A32251J24210J02660A06763J44155o1166J75528A55546J41994
15022B97540j16674a6934j0856A56581K57461B00953r2934J04655m3162J53714
15012C23226J16929l3759a6653A47256K64314K01575A67744J35021J23975A22584
15001b34855B1721L17702A59805L4458M2840j6663j7766R7648A08666l4516A5671
14989a93195C1825K7713K54835A27892m3635K68683A65335Q6854n0048m2336O8158
14978B27963K3851c814j54272B89872E0808C194K38621D2053A6615Q3963b19049
14966A46140J87075A30447K13057m8532J68995I2769K16677J51446l7932j17461
14956C05499Q0543C9689J33638J11849j1627c3601a1039B55420L28072A39350
$$ plain form
14945 263628 348430 304467 469409 549621 359354 183241 203432 399301 258138 322939
14935 322939 363504 436936 401814 115239 505794 480588 141405 247897 164767 -100684
14924 57186 357042 475763 352134 330269 302473 534535 537009 130856 391393 591160
14914 591160 401472 137695 40887 467977 579604 290672 298321 376895 160319 124172
14904 124172 545198 402444 346291 -23274 129417 207456 444592 409928 375907 368379 393063
14893 393063 710895 644900 273457 253912 347058 381273 390838 173959 61196 453761 244791
14882 244791 310932 168625 550942 643122 473422 477262 623513 794484 270368 512457
14872 512457 539922 316744 733928 349309 292630 189250 595314 399510 609902 398783
$$ packed form
14945B63628Q4802m3963J64942Q0212j90267j76113K0191J95869j41163O4801
14935C22939M0565P3432l5122A15239L90555k5206A41405J06492q3130a00684
14924E7186K99856J18721j23629k1865k7796K32062K474A30856K60537J99767
14914E91160j89688A37695D0887M27090J11627k88932P649P8574A60319l6147
14904A24172M21026j42754n6153b3274A29417P8039K37136l4664l4021p528K4684
14893C93063L17832o5995B73457j9545R3146L4215R565A73959F1196L92565k08970
14882B44791O6141j42307L82317R2180j69700L840J46251J70971B70368K42089
14872E12457K7465k23178M17184C49309n6679j03380M06064j95804K10392k11119
$$ plain form
14862 398783 555174 556292 443693 164665 90007 338370 348649 459740 696129 452453
14852 452453 424625 299050 425429 405697 442994 475342 339064 251019 666928 288263
14841 387066 859684 632238 339304 706720 409225 387212 506678 618451 602715 530979
14831 530979 105314 268719 739356 341687 583553 339953 362016 499035 524521 388879
14821 388879 269111 526545 610224 676179 253717 400420 665660 741243 778967 362658
14810 448140 552307 583973 313222 448257 313900 550209 495945 496748 672497 500900
14800 500900 520449 504618 344734 586529 774463 611160 463056 515399 466756 620489
14790 620489 544485 647269 725833 870557 951934 664822 776874 527632 749516 347258
$$ packed form
14862C98783J56391J118j12599A64665p4658K48363J0279J11091K36389k43676
14852D52453k7828j25575J26379j9732L7297L2348j36278q8045M15909B88263
14841C87066M72618k27446k92934L67416k97495k2013J19466J11773j5736p1736
14831E30979A05314J63405M70637C41687K41866k43600K2063J37019K5486j35642
14821C88879j19768K57434Q3679O5955B53717J46703K65240P5583L7724C62658
14810D48140J04167L1666k70751J35035j34357K36309n4264Q03J75749j71597
14800E00900J9549j5831j59884K41795J87934j63303j48104N2343m8643J53733
14790F20489p6004J02784P8564J44724Q1377k87112J12052k49242K21884C47258
$$ plain form
14779 711425 367451 439613 329621 697637 349741 623057 425053 713756 254051 754367
14769 754367 433616 356207 694109 461808 626114 507249 536849 442544 400943 646354
14759 646354 688751 601121 602008 587368 901240 645471 730236 407976 567457 659888 851650
14748 851650 520879 621064 741947 837818 444623 1093171 740928 727574 894630 764571
14738 764571 871933 697890 556511 901032 707978 897341 989623 820753 377352 648398
14728 648398 450744 856765 950669 1054676 770242 702526 1078638 940251 550920 647868
14718 647868 783153 767543 751196 808739 682113 787161 883830 665720 542412 774887
14708 774887 1009696 928847 912995 816376 933247 910986 716933 706225 1141839 702591
$$ packed form
14779G11425l43974P2162j09992L68016l47896K73316j98004K88703B54051N00316
14769G54367l20751p7409L37902k32301J64306j18865K9600r4305m1601K45411
14759F46354M2397q7630Q87j4640L13872k55769Q4765l22260J59481R2431J91762
14748H51650l30771J00185J20883R5871l93195O48548l52243j3354J67056j30059
14738G64571J07362j74043j41379L44521j93054J89363R2282j68870C77352K71046
14728F48398j97654M06021R3904J04007k84434o7716L76112j38387l89331R6948
14718F47868J35285j5610j6347N7543j26626J05048R6669k18110j23308K32475
14708G74887K34809q0849j5852r6619J16871k2261j94053j0708M35614m39248
$$ plain form
14698 702591 926013 1205154 1127157 747827 955046 725040 692905 799250 754454 1250647
14688 1250647 1024999 1233803 1010782 929124 761145 1171359 1213487 1030127 1106610 901882
14678 901882 1282371 887854 1013202 843634 943713 925223 1096617 668032 1053263 1059987
14668 1059987 1229486 901804 1385891 813448 621957 1159391 1288391 968860 939966 1049363
14658 1049363 872737 934606 788905 1231979 1273867 1161611 1316814 1081492 1325935 1090128
14648 1090128 1220443 1265327 1195973 1299777 1226387 996438 780395 1302450 1548303 1272544
14638 1272544 1363245 1496355 1342118 1358165 1326520 1458812 875043 1432046 1170991 1167974
14628 1167974 1036347 1349564 1243382 1112995 1220506 1202029 1387629 1505784 1355867 1319824
$$ packed form
14698G02591K23422K79141p7997l79330K07219k30006l2135J06345m4796M96193
14688A250647k25648K08804k23021q1658j67979M10214M2128j83360P6483k04728
14678I01882L80489l94517J25348j69568J00079j8490J71394m28585L85231O724
14668A059987J69499l27682M84087n72443j91491N37434J29000l19531k8894J09397
14658A049363j76626O1869j45701M43074M1888j12256J55203k35322K44443k35807
14648A090128J30315M4884o9354J03804p3390k29949k16043N22055K45853k75759
14638A272544R0701J33110j54237J6047l1645J32292n83769N57003k61055l017
14628A167974j31627L13217j06182j30387J07511j8477J85600J18155j49917l6043
$$ plain form
14618 1319824 1628065 1676599 1153695 1228084 1572439 1347600 1504787 1473176 1512131 1806173
14608 1806173 1622246 1497371 1458377 1694855 1585903 1546510 1462947 1497150 2135042 1432329
14598 1432329 1608600 1630896 1764027 1768414 1677811 1837296 1826895 1886320 1727252 1655020 1856243
14587 1856243 1648068 1687764 1787225 2152883 1929743 1612312 1888914 2153557 2113302 2105737
14577 2105737 2203892 1783698 2040940 2256090 2341650 2116187 2120021 2536383 2441120 2192275
14567 2192275 2140596 2430090 2438876 2590542 2287839 2682993 2424449 2582722 2798853 2798075
14557 2798075 2792195 3390856 3413277 2960432 3815924 4318667 4417850 5403560 6872217 11148838
14547 11148838 21149932 41695026 46637795 19557056 9070949 6844453 3209803 1701300
$$ packed form
14618A319824L08241M8534n22904P4389L44355k24839J57187l1611L8955K94042
14608A806173j83927j24875l8994K36478j08952l9393q3563L4203O37892p02713
14598A432329J76271K2296J33131M387r0603J59485j0401N9425j59068p2232K01223
14587A856243k08175L9696R9461L65658k23140l17431K76602K64643m0255p565
14577B105737R8155m20194K57242K15150Q5560k25463L834M16362r5263k48845
14567B192275n1679K89494Q786J51666l02703L95154k58544J58273K16131p78
14557B798075n880N98661K2421m52845Q55492N02743R9183R85710J468657M276621
14547A1148838J0001094K0545094M942769A9557056I070949k226496C209803j508503
$$ plain form
14539 1701300 2404339 1695913 1749301 1794902 1722467 1973067 2115861 1964180 2118429 2278720
14529 2278720 1986413 2374477 2413521 2007827 2302116 2770591 2284556 2759623 2494986 2517604
14519 2517604 2693418 2693445 2495961 2426340 2650055 2647627 2912483 2836647 2478172 2864756 2488267
14508 2488267 2882035 2819719 2921773 2715544 3070252 2953237 2966576 3085301 3227434 3053356
14498 3053356 3024790 3415662 3218670 3404746 3311740 3254389 3453023 3374675 3490334 3111598
14488 3111598 3573432 3350904 3472819 3647663 3788365 3903652 3557614 4179316 4121406 3938036
14478 3938036 3884326 3934004 4036025 4335224 4444836 4355870 4345890 4051217 4269015 4375561
14468 4375561 4285748 4404233 4437450 4602421 4929605 4784407 4525590 4777894 4871005 4720063
$$ packed form
14539A701300P03039p08426N3388M5601p2435K50600J42794j51681J54249J60291
14529B278720k92307L88064L9044m05694K94289M68475m86035M75067k64637K2618
14519B517604J75814K7j97484o9621K23715k428K64856p5836l58475L86584l76489
14508B488267L93768o2316J02054k06229L54708j17015J3339J18725J42133j74078
14498C053356k8566L90872j96992J86076r3006n7351J98634p8348J15659l78736
14488C111598M61834k22528J21915J74844J40702J15287l46038O21702n7910j83370
14478C938036n3710M9678J02021K99199J09612q8966r980k94673K17798J06546
14468D375561q9813J18485L3217J64971L27184j45198k58817K52304R3111j50942
$$ plain form
14458 4720063 5101426 4845698 4754404 4926605 5095561 5166435 5710287 5249774 4958984 5475999
14448 5475999 5356155 5646319 5833686 5382372 5842800 5825599 5902318 6339309 6068539 6018799
14438 6018799 6375298 6375923 6223110 6477287 6360244 6904617 6667260 6970585 6546133 7033552
14428 7033552 7334977 6888281 7615089 7439112 7564525 7153063 7460765 7846779 7627670
14419 7627670 8413001 8154067 8035167 8249628 8677599 8644008 8842581 8495768 9001405 9019972
14409 9019972 9353458 9207376 9533583 9450829 9501727 9788136 10049153 10210192 10317632 10931130
14399 10931130 10392115 11087188 11309747 11369241 11373097 11769793 11656186 11787756 12479855 12216371
14389 12216371 12497149 13135599 13065329 13418315 13801976 13893536 13735237 13996281 14651630 14637633
$$ packed form
14458D720063L81363k55728r1294J72201J68956P0874N43852m60513k90790N17015
14448E475999j19844K90164J87367m51314M60428j7201P6719M36991k70770m9740
14438F018799L56499O25j52813K54177j17043N44373k37357L03325m24452M87419
14428G033552L01425m46696P26808j75977J25413m11462L07702L86014k19109
14419G627670P85331k58934j18900K14461M27971l3591J98573l46813N05637J8567
14409I019972L33486j46082L26207q2754N0898K86409K61017J61039J07440O13498
14399A0931130n39015O95073K22559N9494L856L96696j13607J31570O92099k63484
14389A2216371K80778O38450p0270L52986L83661R1560j58299K61044O55349j3997
$$ plain form
14379 14637633 15105185 15440342 15598204 15762315 16065042 16427121 17043380 17016467 17568931
14370 17568931 17965218 18181450 18439616 18931218 19015287 19773945 19936078 20570255 20837461
14361 20837461 21461160 21789278 22080492 22674516 23489143 23924528 23867507 24780999 25579166
14352 25579166 26032178 26737380 27448335 27916691 28526330 29000003 30283898 31046777 31660196
14343 31660196 32660006 33337383 34185654 35534881 36312799 37473754 37996039 39061728 40321774
14334 40321774 41585069 43170163 44170689 45500425 46772700 48276034 50055920 51382060
14326 51382060 53233480 54833519 56703277 58420423 60590457 62630196 65057617 67368957
14318 67368957 69888083 72463910 75016796 77826142 80967500 84318026 87694151 91166576
$$ packed form
14379A4637633M67552L35157J57862J64111L02727L62079O16259k6913N52464
14370A7568931L96287K16232K58166M91602Q4069P58658J62133O34177K67206
14361B0837461O23699L28118K91214N94024Q14627M35385n7021R13492P98167
14352B5579166M53012P05202P10955M68356O09639M73673J283895P62879O13419
14343C1660196R99810O77377Q48271J349227P77918J160955N22285J065689J260046
14334D0321774J263295J585094J000526J329736J272275J503334J779886J326140
14326E1382060J851420J600039J869758J717146K170034K039739K427421K311340
14318F7368957K519126K575827K552886K809346L141358L350526L376125L472425
$$ plain form
14310 91166576 95065982 98838396 102829293 107372317 112093567 116763032 122384862 127719101
14302 127719101 133514641 139639918 146111002 153531800 160594071 168538740 176942364 185574057
14294 185574057 194819751 204293017 214479338 225695789 236854055 248767314 260785004
14287 260785004 273583570 287132964 300643086 314707517 329186234 343592593 357707492
14280 357707492 372062947 385880240 399792428 412853010 424779493 435995589 445275117
14273 445275117 452003951 453414617 452536876 451767136 452419609 449258716 446282102 441416053
14265 441416053 434974133 425456486 413256713 400110480 385555868 370450095 355077469
14258 355077469 339615399 324437639 309071269 294428804 279948493 266917737 254272045
$$ packed form
14310I1166576L899406L772414L990897M543024M721250M669465N621830N334239
14302A27719101N795540O125277O471084P420798P062271P944669Q403624Q631693
14294A85574057R245694R473266J0186321J1216451J1158266J1913259J2017690
14287B60785004J2798566J3549394J3510122J4064431J4478717J4406359J4114899
14280C57707492J4355455J3817293J3912188J3060582J1926483J1216096R279528
14273D45275117O728834J410666q77741p69740O52473l160893k976614m866049
14265D41416053o441920r517647j2199773j3146233j4554612j5105773j5372626
14258C55077469j5462070j5177760j5366370j4642465j4480311j3030756j2645692
$$ plain form
14251 254272045 241902922 229720619 218246522 207499462 197177463 187329159 178688949
14244 178688949 170444631 162570824 154852244 147239206 140688821 134197108 128647980 123196186
14236 123196186 117456602 112585773 107698533 103279500 99198893 95563542 91926730 87612659
14228 87612659 84795772 81317617 78031395 75232318 72573282 69791017 67563775 65053425
14220 65053425 62979279 61107662 58890715 56784775 55058834 53254590 51684246 50368366
14212 50368366 48855350 47363201 45353188 44482399 43246108 42259249 41480761 39612019
14204 39612019 38521844 37255311 36324272 35537784 34989022 33741225 32835043 32169598 31090330
14195 31090330 30195012 29903523 28968213 28536360 27499773 27190531 25932685 25598792 25539355
$$ packed form
14251B54272045j2369123j2182303j1474097j0747060j0321999r848304q640210
14244A78688949q244318p873807p718580p613038o550385o491713n549128n451794
14236A23196186n739584m870829m887240m419033m080607l635351l636812m314071
14228H7612659k816887l478155l286222k799077k659036k782265k227242k510350
14220F5053425k074146j871617k216947k105940j725941j804244j570344j315880
14212E0368366j513016j492149k010013q70789j236291r86859p78488j868742
14204C9612019j090175j266533r31039p86488n48762j247797r06182o65445j079268
14195C1090330q95318k91489r35310m31853j036587l09242j257846l33893n9437
$$ plain form
14186 25539355 24919463 23769090 23489671 23351753 22273119 21829166 21482170 20902160 20477355
14177 20477355 20148066 19442518 19254908 18801414 18765035 18088552 17649067 17351541 17209375
14168 17209375 16762672 16792537 16203329 16046999 15655952 15262371 15211219 14885685 14425435 14336141
14158 14336141 13977460 13887880 13573376 13340242 13371581 12774386 12531258 12177087 12414669 12089972
14148 12089972 11926214 11350779 11401335 11418866 11124674 10983576 10718146 10530214 10504262 10413993
14138 10413993 10191804 9865257 9638243 9696312 9623268 9270603 9601233 9298875 8991006 9181404
14128 9181404 9030479 8452889 8644998 8574283 8337481 8091592 8077739 8116096 8291648 7838800
14118 7838800 7793968 7534773 7171614 7299380 7665630 7274036 7033129 7088448 7106505 6878730
$$ packed form
14186B5539355o19892j150373k79419j37918j078634m43953l46996n80010m24805
14177B0477355l29289p05548j87610m53494l6379o76483m39485k97526j42166
14168A7209375m46703K9865n89208j56330l91047l93581n1152l25534m60250q9294
14158A4336141l58681q9580l14504k33134L1339n97195k43128l54171K37582l24697
14148A2089972j63758n75435N0556J7531k94192j41098k65430j87932k5952r0269
14138A0413993k22189l26547k27014N8069p3044l52665L30630l02358l07869J90398
14128I181404j50925n77590J92109p0715k36802k45889j3853L8357J75552m52848
14118G838800m4832k59195l63159J27766L66250l91594k40907N5319J8057k27775
$$ plain form
14108 6878730 6674635 6938531 6774945 6458778 6468654 6318966 6192676 6288289 6192274 5706219
14098 5706219 6187572 5936631 5670586 5887430 5985002 5917826 5662035 5559011 5210843 5469896
14088 5469896 5451144 5131947 4944033 5022659 5170029 4883583 4908996 4994648 4822582 4931299
14078 4931299 4727207 4705987 4920677 4617473 4834225 4547361 4520955 4498440 4257653 4779165
14068 4779165 4366022 4400517 4131867 4017888 4220109 4228865 4248363 4500893 4393751 3753612
14058 3753612 4291687 3811115 4008913 4134173 3687058 3653216 3462203 3743467 3873771 3630335
14048 3630335 3159648 3420261 3551357 3529181 3497964 3148958 2991456 3429001 3245597 3499942
14038 3499942 3329674 3235818 3258567 3486486 3038520 3622315 3032926 3110826 3231196 3323162
$$ packed form
14108F878730k04095K63896j63586l16167R876j49688j26290R5613r6015m86055
14098E706219M81353k50941k66045K16844R7572o7176k55791j03024l48168K59053
14088E469896j8752l19197j87914P8626J47370k86446K5413Q5652j72066J08717
14078D931299k04092k1220K14690l03204K16752k86864k6406k2515k40787N21512
14068D779165m13143L4495k68650j13979K02221Q756J9498K52530j07142o40139
14058C753612N38075m80572J97798J25260m47115l3842j91013K81264J30304k43436
14048C630335m70687K60613J31096k2176l1217l49006j57502M37545j83404K54345
14038C499942j70268r3856K2749K27919m47966N83795n89389P7900J20370R1966
$$ plain form
14028 3323162 3146439 3059623 3184385 2845605 2547542 2662671 2440058 3191253 2725782 2623530
14018 2623530 2580012 2523808 2377092 2522756 2529033 2510133 2471867 2591002 2378005 2318386 2131304
14007 2131304 2226209 2111087 2289583 2253649 2377260 2131327 2181439 2027685 2175982 1983738
13997 1983738 2162985 2271118 2023572 2094020 1942976 1761742 2240932 2239917 2910568 5774746
13987 5774746 13445715 33006976 50843896 26764991 13421981 8345300 5697213 4670276
13979 4670276 3589000 3521848 3501083 3031659 2905497 2477731 2634866 2694626 2451801 2710267
13969 2710267 2399585 2375935 2355236 2375273 2566617 2246407 2114239 2124533 2067353 2011675
13959 2011675 2036879 2266084 1776045 2205833 1780846 2224518 1922121 1950763 2068878 2201189
$$ packed form
14028C323162j76723q6816J24762l38780k98063J15129k22613P51195m65471j02252
14018B623530m3518n6204j46716J45664O277j8900l8266J19135k12997n9619j87082
14007B131304R4905j15122J78496l5934J23611k45933N0112j53754J48297j92244
13997A983738J79247J08133k47546P0448j51044j81234M79190j015O70651K864178
13987E774746P670969J9561261J7836920k4078905j3343010n076681k648087j026937
13979D670276j081276o7152k0765m69424j26162m27766J57135N9760k42825K58466
13969B710267l10682k3650k0699K0037J91344l20210j32168J0294n7180n5678
13959B011675K5204K29205m90039M29788m24987M43672l02397K8642J18115J32311
$$ plain form
13949 2201189 1905783 1952439 1842436 1777310 1912838 1859273 1754645 2036365 2018176 1565866
13939 1565866 1829718 1747877 2063983 1854547 1830542 1656277 1281346 1786967 1698091 1722163
13929 1722163 1430705 1528597 1732642 1424711 1791415 1607003 1655028 1750395 1755823 1197595
13919 1197595 1503598 1395808 1344464 1384569 1528518 1667093 1637678 1397769 1245274 1325142
13909 1325142 1705508 1361299 1455913 1485170 1578898 1375969 1256666 1479926 1116116 1257691
13899 1257691 1524875 1505477 1454838 1257647 1176443 1046685 1432303 1227054 1418766 1320720
13889 1320720 1125127 1564494 1323924 1349257 1325585 1320350 1644203 1144970 1158642 1162127 1389176
13878 1389176 1159512 885768 1308603 1209787 1477316 1108419 1263494 910258 1455364 771841
$$ packed form
13949B201189k95406M6656j10003o5126J35528n3565j04628K81720j8189m52310
13939A565866K63852q1841L16106k09436k4005j74265l74931N05621q8876K4072
13929A722163k91458R7892K04045l07931L66704j84412M8025R5367N428n58228
13919A197595L06003j07790n1344M0105J43949J38575k9415k39909j52495P9868
13909A325142L80366l44209R4614K9257R3728k02929j19303K23260l63810J41575
13899A257691K67184j9398n0639j97191q1204j29758L85618k05249J91712r8046
13889A320720j95593M39367k40570K5333k3672n235L23853m99233J3672L485K27049
13878A389176k29664k73744M22835r8816K67529l68897J55075l53236N45106o83523
$$ plain form
13868 771841 1271454 993782 1127161 1635497 982266 964206 1122374 1322166 1054510 950963
13858 950963 1154512 1174366 1131188 1442008 1129051 941834 1476892 1021675 1012388 1205892
13848 1205892 843354 712039 1003754 980855 973909 812446 1028830 955009 1083552 929669
13838 929669 1201906 666026 1092192 971366 1147570 870644 1005260 1041438 1126620 943350
13828 943350 920938 658195 1122556 1031331 1353034 972494 1055415 934410 1031335 1011848
13818 1011848 753034 573801 1085676 800373 893931 1059808 346454 520390 763371 1136352
13808 1136352 913687 626086 1125678 815423 788965 639472 785731 840631 905130 646456
13798 646456 589576 992798 672843 1031572 610647 760509 514514 777665 676957 647800
$$ packed form
13868G71841M99613k77672J33379N08336o53231j8060J58168J99792k67656j03547
13858I50963K03549J9854m3178L10820l12957j87217N35058m55217r287J93504
13848A205892l62538j31315K91715k2899o946j61463K16384p3821J28543j53883
13838I29669K72237n35880M26166j20826J76204k76926J34616L6178Q5182j83270
13828I43350k2412k62743M64361r1225L21703l80540Q2921j21005R6925j9487
13818A011848k58814j79233N11875k85303R3558J65877C46454J73936K42981L72981
13808A136352k22665k87601M99592l10255k6458j49493J46259N4900O4499k58674
13798F46456n6880M03222l19955L58729m20925J49862k45995K63151j00708k9157
$$ plain form
13788 647800 853220 955250 934456 800424 865609 817833 630171 525055 947904 660188
13778 660188 686494 678648 811684 681507 770093 942322 721504 811913 721794 791495 864652
13767 864652 788711 1089155 596446 682185 682564 657239 732911 449689 824008 885177 865317
13756 865317 662294 589671 840163 637878 714979 404646 810266 432178 644392 740063
13746 740063 711062 181606 635839 515049 451578 449757 615510 777529 515371 1049813
13736 1049813 148042 436558 611059 648994 571013 204854 776390 381265 737225 661234
13726 661234 540360 296252 267611 542402 503536 337800 357589 671829 650908 366868
13716 366868 277042 520809 484866 534123 411151 414783 368007 838475 728474 480465 715816
$$ packed form
13788F47800K05420J02030k0794j34032O5185m7776j87662j05116M22849k87716
13778F60188K6306p846J33036j30177Q8586J72229k20818R0409r0119O9701P3157
13767H64652p5941L00444m92709Q5739L79k5325P5672k83222L74319O1169j9860
13756H65317k03023p2623K50492k02285P7101l10333M05620l78088K12214R5671
13746G40063k9001A81606M54233j20790o3471j821J65753J62019k62158N34442
13736A049813A48042K88516J74501L7935p7981B04854N71536C81265L55960p5991
13726F61234j20874k44108k8641K74791l8866j65736J9789L14240k0921k84040
13716C66868q9826K43767l5943M9257j22972L632m6776M70468j10001k48009K35351
$$ plain form
13705 715816 633441 278449 488805 625515 950223 452890 604192 466889 651928 573077
13695 573077 619362 359091 806620 338531 529555 313795 511101 657569 346424 497777
13685 497777 386247 246141 703411 797764 515675 634273 643981 815107 606621 261237
13674 583946 633634 146435 765404 395463 635306 381853 487011 233644 375516 204937
13664 204937 735194 200176 593509 399516 301310 234370 441389 382397 297426 603891
13654 603891 535358 329379 552372 558769 467733 612876 552779 592312 496493 477039 173013
13642 296953 324777 542840 341094 133999 331277 268640 647995 482274 80697 425849
13632 425849 180923 438495 428738 384004 253100 508479 146855 641351 574960 378840
$$ packed form
13705G15816q2375B78449K10356J36710L24708D52890J51302j37303J85039p8851
13695E73077M6285k60271M47529C38531J91024k15760J97306J46468l11145J51353
13685D97777j11530j40106M57270R4353k82089J18598R708J71126k08486B61237
13674E83946M9688A46435O18969l69941K39843k53453J05158B33644J41872j70579
13664B04937N30257B00176L93333j93993r8206o6940K07019n8992q4971L06465
13654F03891o8533k05979K22993O397r1036J45143o0097L9533r5819j9454A73013
13642B96953K7824K18063k01746A33999J97278o2637L79355j65721H0697L45152
13632D25849A80923K57572r757m4734j30904K55379A46855M94496o6391j96120
$$ plain form
13622 378840 560807 267762 336268 177626 452299 429963 446298 630586 293497 259386
13612 259386 675892 475301 259995 257944 593790 306228 363510 532882 -101849 368352
13601 289999 564449 24884 546071 369421 352783 314620 56007 406091 124704 364284
13591 364284 470172 128428 161502 432692 31330 626802 470659 243871 685272 164857
13580 171207 359813 429807 165396 249109 176319 219239 277176 322363 182148 695679 613016
13569 613016 448069 295138 503136 174935 313934 285874 278160 378697 291583 499878
13559 499878 146074 365576 457340 867129 273210 95305 218726 676857 506428 260058
13549 260058 652838 349041 321470 386711 277728 350482 548104 185974 579197 92911
$$ packed form
13622C78840J81967B67762O8506j58642K74673k2336J6335J84288B93497l4111
13612B59386M16506k00591k15306k051L35846k87562N7282J69372a01849C68352
13601B89999K74450B4884N21187j76650j6638l8163E6007L50084A24704K39580
13591C64284J05888A28428L3074K71190C1330N95472j56143k26788M41401A64857
13580A71207J88606O9994A65396Q3713p2790M2920N7937M5187j40215N13531q2663
13569F13016j64947j52931K07998A74935J38999k8060p714J00537q7114K08295
13559D99878A46074K19502R1764M09789B73210I5305J23421M58131j70429k46370
13549B60058L92780l03797k7571O5241j08983P2754J97622A85974L93223I2911
$$ plain form
13538 386332 105835 575273 715049 357566 333496 525735 339551 241236 425436 270021
13528 270021 209905 498715 489660 315641 -134699 292120 67563 394934 105773 473255
13518 473255 276886 116321 284866 308940 476336 598139 671096 189764 297825 310068
13508 310068 2314 333121 67806 -131067 183487 79227 259528 433567 143062 133475 283828
13497 283828 330138 -187324 217982 6599 439423 133174 249537 275885 217349 100373
13486 38048 335089 220795 106636 241960 8574 455292 142865 237251 277034 504324
13476 504324 1280 -260831 275491 -90495 496952 -123357 -30230 -5248 399033 159815 175528
13465 175528 105888 132256 232989 315645 418455 243954 363529 305295 369512 381126 1774
$$ packed form
13538C86332A05835M69438J39776l57483k4070J92239j86184r8315J84200j55415
13528B70021o0116K88810r055j74019a34699B92120F7563L27371A05773L67482
13518D73255j96369A16321J68545K4074J67396J21803P2957A89764J08061J2243
13508C10068B314L30807F7806a31067A83487G9227J80301J74039A43062r587J50353
13497B83828M6310a87324B17982F599M32824A33174J16363K6348n8536A00373
13486C8048K97041j14294A06636J35324H574M46718A42865R4386L9783K27290
13476E04324A280b60831B75491i0495D96952a23357c0230e248C99033A59815J5713
13465A75528o9640K6368J00733Q2656J02810j74501J19575n8234O4217J1614A774
$$ plain form
13453 566127 288359 152992 185652 160486 483028 156754 143905 57273 233474 287938
13443 287938 327531 380908 217405 165173 390640 -10477 314270 50466 -49252 47116 -28161
13431 372482 337468 75688 175786 494721 252040 306520 73162 -114646 -7702 368130 58254
13419 265246 229226 137355 43249 195389 466213 125406 -150565 287326 401427 222898
13409 222898 185884 67840 -10654 75785 244936 70006 188044 286729 570714 65950 156714
13398 156714 318842 337162 475217 449588 -34164 173361 281679 78102 137822 -118871
13387 -13030 154403 264170 330689 163373 115339 84661 -104907 223441 315031 -124895
13376 227872 395263 278081 322262 265764 -110956 45528 1184 522047 56159 -114959 337756
$$ packed form
13453E66127k77768j35367L2660k5166L22542A56754j2849E7273J76201N4464
13443B87938L9593N3377j63503n2232K25467a0477C14270E0466d9252D7116b8161
13431C72482l5014G5688J00098L18935k42681N4480G3162a14646g702C68130E8254
13419B65246l6020r1871D3249J52140K70824A25406a50565B87326J14101j78529
13409B22898l7014F7840a0654G5785J69151G0006J18038R8685K83985F5950R0764
13398A56714J62128J8320J38055k5629c4164A73361J08318G8102N9720a18871
13387a3030A54403J09767O6519A63373m8034l0678a04907B23441R1590a24895
13376B27872J67391j17182M4181n6498a10956D5528A184N20863E6159a14959C37756
$$ plain form
13364 129570 -16500 254176 13122 108544 240404 58528 437582 48087 272555 100749
13353 172727 316219 456756 143602 114217 -237228 250862 319773 53953 187183 422807
13343 422807 534702 305373 471427 191623 314136 181542 365 680341 94334 48530
13333 48530 -58860 135554 -11136 243251 -3574 410512 204583 360337 552128 76944 288648
13322 288648 299277 326644 148707 180176 105945 309927 20835 261080 35464 293299 -45617
13310 464440 75606 98818 -55166 -122445 93043 302504 69621 -1802 258031 209592 3454
13298 297540 -20374 -100197 159659 -96281 208838 311807 143812 210554 46199 245342
13288 245342 395044 132507 80167 -258554 66661 168840 181127 -30984 384973 -87838
$$ packed form
13364A29570a6500B54176A3122R5422J31860E8528L79054D8087K24468A00749
13353A72727J43492J40537A43602k9385b37228B50862O8911E3953J33230K35624
13343D22807J11895k29329J66054A91623J22513j32594C65O79976I4334m5804
13333D8530e8860A35554a1136B43251c574D10512B04583J55754J91791G6944K11704
13322B88648J0629K7367A48707L1469p4231K03982B0835K40245C5464K57835d5617
13310D64440G5606K3212e5166o7279I3043K09461F9621a802B58031m8439C454
13298B97540b0374p9823A59659i6281B08838J02969A43812O6742D6199J99143
13288B45342J49702A32507n2340b58554F6661J02179J2287c0984C84973h7838
$$ plain form
13277 174747 219255 34938 -36720 106976 347973 31073 -36731 -7974 200252 199063 223890
13266 223890 -70389 282948 129055 -4835 -25214 250372 131085 274687 220061 220133 138872
13255 138872 162833 173446 -227176 -12211 25046 82701 186111 148347 162884 33425 292676
13244 292676 37121 -220777 307338 348039 90587 -209854 143664 -44055 29806 76944 191241
13233 191241 408460 242001 80896 96671 12241 294790 166136 182385 -71818 -168202 356187
13221 120671 250285 67498 220644 -37198 59700 215630 172024 164844 269060 171401 -120517
13209 215185 394282 40589 193371 212482 240634 508628 -94802 304373 260547 71902 54002
13198 54002 49455 -214420 -30690 -119725 -267567 99414 -176476 288138 -5946 248300 279814
$$ packed form
13277A74747M4508C4938c6720A06976K40997C1073c6731g974B00252j189K4827
13266B23890g0389B82948A29055d835k0379B50372j19287J43602n4626P2q1261
13255A38872K3961J0613b27176a2211B5046N7655J03410l7764J4537C3425K59251
13244B92676C7121b20777C07338M0701I0587b09854A43664d4055B9806M7138J14297
13233A91241K17219j66459H0896J5775A2241K82549j28654J6249g1818r6384C56187
13221A20671J29614F7498J53146c7198E9700J55930m3606p180J04216r7659a20517
13209B15185J79097D0589J52782J9111K8152K67994i4802C04373m3826G1902j7900
13198E4002m547b14420c0690q9035j47842I9414a76476B88138e946B48300L1514
$$ plain form
13187 279814 -12508 214914 -276985 69104 94867 276045 -185680 102015 206565 81053
13176 243665 55755 6268 17947 45479 282083 -201468 29402 -51112 105658 -11978 -529668
13165 -529668 337558 40202 57253 104755 215838 62128 -47588 241037 122849 324206
13155 324206 140328 -117680 -150888 -31300 148166 165183 -36987 33482 -103359 139773
13144 -37451 -138558 147364 31723 36098 -113425 155623 47141 35754 196001 88126 384429
13133 384429 81303 203383 314031 136937 65796 199832 395405 72408 -60151 46895
13122 -284870 351874 -167748 114986 -378660 -57195 -36199 105047 184521 105857 -86663
13111 231868 21425 51532 7046 -73228 9929 -83978 -93545 173757 155475 364181 -36081 146030
$$ packed form
13187B79814a2508B14914b76985F9104K5763J81178a85680A02015J04550H1053
13176B43665E5755F268J1679K7532K36604b01468B9402e1112A05658a1978n17690
13165e29668C37558D0202J7051M7502J11083F2128d7588B41037j18188K01357
13155C24206A40328a17680l3208c1300A48166J7017c6987C3482a03359A39773
13144c7451j01107A47364C1723M375a13425A55623D7141j1387J60247H8126K96303
13133C84429H1303J22080J10648A36937F5796J34036J95573G2408f0151D6895
13122b84870C51874a67748A14986c78660e7195K0996A05047P9474p8664h6663
13111B31868B1425L0107G046g3228I929h3978r567A73757j8282K08706c6081A46030
$$ plain form
13098 -215238 209999 341607 -76481 53716 86925 -314044 -9648 7507 132435 387767 119676
13086 -63366 156107 226479 -83733 262952 35831 -100282 262093 166966 -37574 -14902 -143125
13075 -143125 36895 -53103 293827 251236 56823 232850 161483 -149740 46439 255015 252403
13064 252403 151276 100511 495577 255825 -117756 95348 -21652 162070 348371 336895
13054 336895 -113057 93700 175477 44004 -57685 -58933 149846 94885 55513 -297773 141501
13042 155093 227926 226033 -12047 612303 -121407 434383 242670 -254476 51075 -135649
13031 71294 62094 -367955 -78762 277291 150165 -107835 57531 177306 104914 191048 136020
13020 136020 67218 322155 -95686 -106452 -96352 67414 257074 229542 212605 18240 30182
$$ packed form
13098b15238B09999J31608g6481E3716L3209c14044i648G507J24928K55332A19676
13086f3366A56107P0372h3733B62952C5831a00282B62093r5127c7574a4902j28223
13075a43125C6895e3103B93827m2591E6823J76027p1367a49740D6439K08576k612
13064B52403j01127n0765L95066k39752a17756I5348b1652A62070J86301j1476
13054C36895a13057I3700Q1777D4004e7685j248A49846n4961l9372b97773A41501
13042A55093P2833j893a2047F12303a21407D34383j91713b54476E1075a35649
13031G1294r200c67955g8762B77291j27126a07835E7531J19775p2392Q6134n5028
13020A36020F7218K54937i5686j0766J0100F7414J89660k7532j6937A8240J1942
$$ plain form
13009 30182 360401 340483 156544 -25855 81783 -39244 -2727 -165719 117499 207647 -3029
12997 371681 -187338 264450 -83460 -114990 -203160 -223221 19606 185416 -255778 38605 142198
12986 142198 118340 192655 -20798 -72414 -74222 154970 168801 363389 61590 -217849 -147958
12975 -147958 33699 -90199 222441 232384 -5835 310842 -256113 92726 153712 -60765 -14823
12963 309017 -162963 86266 -43661 -22023 90707 320253 -37819 140751 29948 -160387 156060
12951 -143045 209480 230178 143334 -107912 62912 -71779 126987 321651 -85370 215342
12940 115408 293910 200964 -118546 21791 -70050 361795 -62593 46238 -39309 45728 166756
12929 166756 -50823 7891 168616 54800 224034 -185364 139171 6237 -79531 99024 -261703
$$ packed form
13009C0182L30219j9918A56544b5855H1783c9244b727j62992A17499R0148c029
12997C71681a87338B64450h3460l1530q8170k0061A9606J65810b55778C8605J03593
12986A42198k3858P4315b0798n1616j808A54970J3831J94588F1590b17849O9891
12975a47958C3699i0199B22441R943e835C10842b56113I2726O0986f0765a4823
12963C09017a62963H6266d3661K1638I0707K29546c7819A40751B9948a60387A56060
12951a43045B09480K0698q6844a07912F2912g1779A26987J94664h5370B15342
12940A15408J78502r2946a18546B1791g0050C61795f2593D6238c9309D5728J21028
12929A66756e0823G891J60725E4800J69234a85364A39171F237g9531I9024b61703
$$ plain form
12917 -27604 -258783 456393 323483 122316 78894 210922 172418 2940 121294 -24813 -98864
12906 -98864 127787 362895 294897 -146356 74067 19562 103098 -146215 111168 48779 -131159
12894 196837 173998 -62094 45102 -90710 -371676 99114 311089 -150282 -244691 -61328 -35088
12883 -35088 -170687 -176839 172734 110855 20430 98389 83883 -138868 79595 -85025 -202345
12872 -202345 95431 -109385 95198 405974 -189752 474586 -8021 -23935 -10857 -143333 132348
12860 8930 154544 -60745 -23729 -123165 -60912 -34139 151867 108624 38743 -121630 -7117
12848 -30999 286631 -44281 -226044 99618 -146105 158215 133125 -92298 -24922 82256 -37164
12836 13329 -27903 106357 -106170 -16038 -57963 28020 -134005 18729 -6174 362883 84567
$$ packed form
12917b7604k31179D56393j32910A22316m3422J32028l8504B940J18354b4813p4051
12906i8864A27787K35108o7998a46356G4067A9562Q3536a46215A11168D8779a31159
12894A96837k2839f2094D5102i0710k80966I9114K11975a50282r4409f1328K6240
12883c5088j35599o152A72734o1879B0430P7959j4506a38868G9595h5025j17320
12872b02345I5431a09385I5198L10776a89752D74586h021j5914a0857j32476A32348
12860H930J45614f0745b3729r9436f0912K6773A51867m3243C8743a21630g117
12848c0999B86631d4281j81763I9618a46105A58215k5090i2298b4922H2256c7164
12836A3329b7903A06357a06170a6038m1925B8020a34005A8729f174C62883H4567
$$ plain form
12824 -244500 372146 9526 154654 116299 -42014 -14437 87496 -149014 -7577 -248209 -213647
12813 -213647 37324 92978 -83226 4072 252252 -210172 262411 -423496 172633 -251193
12802 169265 81343 121207 -27551 -20137 -103964 -307407 194129 93712 -58901 152310 -489
12790 73390 -99551 41245 26292 -73817 -29162 142241 -75148 -205353 209326 47713 -143633
12778 273180 -66791 -98743 270009 -239610 -61692 -161175 -135240 -121783 21792 -202187 -28607
12766 90452 94071 280665 -69587 -164557 316143 -111075 -3587 203937 -43930 186082 59860
12754 246200 98896 77602 14979 209684 -23031 361019 -125510 -47511 249910 113442
12743 243537 154378 -288130 -92510 -58820 -32133 -329780 103291 114198 83580 -66862 253869
$$ packed form
12824b44500C72146I526J45128l8355d2014a4437H7496a49014g577k40632L4562
12813b13647C7324N5654h3226D072K48180b10172B62411d23496A72633b51193
12802A69265H1343L9864b7551P414q3827k03443A94129I3712e8901A52310d89
12790G3390i9551D1245j4953g3817b9162A42241g5148j30205B09326D7713a43633
12778B73180f6791l1952B70009b39610f1692r9483K5935J3457B1792b02187b8607
12766I0452L619J86594f9587r4970C16143a11075c587B03937d3930A86082E9860
12754B46200I8896k1294A4979J94705b3031C61019a25510d7511B49910A13442
12743B43537q9159b88130i2510L3690K6687k97647A03291J0907l0618f6862B53869
$$ plain form
12731 60735 -21798 230613 23323 -29889 62891 230830 35897 170682 146018 279305 -100679
12719 -24710 -151533 -110076 184380 -88500 300617 -83720 -103183 -189479 196473 113528 184796
12708 184796 311739 251922 391844 239417 361607 319249 83426 167237 -170430 -21550
12697 -62908 -29963 203284 149368 95847 185929 43733 -295124 -193318 280377 149716 213556
12686 213556 24109 68418 -407676 223504 396312 150648 274886 99077 591098 32573
12675 215336 -37740 350473 335853 188422 -39243 -81351 -1811 44090 57475 136836 -43087
12663 -5508 -250629 -54500 138191 -301122 146559 118379 -203447 -147795 -182850 62364 -145308
12651 70678 336553 79113 31329 -85520 93102 -107036 133899 215663 -86750 215081 -87372
$$ packed form
12731F0735b1798B30613B3323b9889F2891J67939C5897J34785k4664J33287a00679
12719b4710j26823M1457A84380h8500C00617h3720j9463q6296A96473q2945P1268
12708A84796J26943n9817J39922j52427J22190m2358H3426Q3811a70430b1550
12697f2908b9963B03284n3916n3521R0082D3733b95124J01806B80377j30661O3840
12686B13556B4109M4309d07676B23504J72808A50648J24238I9077M92021C2573
12675B15336c7740C50473j4620j47431c9243m2108a811D4090J3385P9361d3087
12663e508k45121e4500A38191c01122A46559k8180b03447N5652l5055F2364a45308
12651G0678K65875G9113C1329h5520I3102a07036A33899Q1764h6750B15081h7372
$$ plain form
12639 429826 -1431 216233 -49931 -97250 -104933 108602 295126 124468 -67179 -241748 -176145
12628 -176145 206818 57473 381871 39124 366047 2687 187643 -254482 293851 134313
12617 360882 44623 -379638 -29 169017 -113128 245934 -249318 -279595 -122970 400678 132125
12605 -45261 -32895 -195795 -15868 -56060 158737 108627 72264 407911 79182 -52632 -125418
12594 -125418 110720 386681 259001 -90573 -104657 16483 -183618 245281 112579 363410
12584 363410 36138 -18390 60030 -182681 -62603 359540 185821 -44306 -144358 -134517 -84294
12573 -84294 -16134 83554 -12087 100676 -106874 154150 70020 177311 204930 226543 -17818
12561 -72674 -49403 -158003 61675 84965 -40763 122660 -10340 178460 77306 296610 -105795
$$ packed form
12639D29826a431B16233d9931m7319p683A08602J86524A24468f7179j74569O5603
12628a76145B06818E7473L24398C9124L26923B687J84956b54482B93851A34313
12617C60882D4623c79638b9A69017a13128B45934b49318l0277a22970D00678A32125
12605d5261J2366j62900a5868m0192A58737n0110l6363L35647G9182e2632p2786
12594a25418A10720K75961j27680i0573j4084A6483a83618B45281A12579K50831
12584C63410C6138a8390F0030a82681f2603C59540j73719d4306j00052R841N0223
12573h4294a6134H3554a2087A00676a06874A54150G0020J07291K7619K1613a7818
12561g2674K3271j08600F1675K3290d0763A22660a0340A78460G7306K19304a05795
$$ plain form
12549 245258 -97402 135095 61075 7975 133400 145258 -117446 354390 151724 232584 288834
12538 288834 -263 20017 -11955 -66405 96797 250090 122322 -269467 47572 189689 -24458
12526 179583 -256804 -158452 377672 5848 -111839 -99481 -47716 108366 22272 29103 -142002
12514 -28830 234499 -249180 106326 8915 67722 125914 -73590 -89521 -49897 33550 40257
12503 40257 103727 115684 386 225448 258319 -44940 -46212 35637 346717 169630 179975 105536
12491 105536 28194 194286 -123855 -93223 144829 -80539 36824 -199114 -128456 2690 -23771
12479 111168 112404 -162233 292722 -97574 -141055 54387 95021 98214 -250620 -28638 -107566
12468 -107566 -194155 -82896 -161853 77795 -111054 156590 -84085 -295666 26276 157169 -227441
$$ packed form
12549B45258i7402A35095F1075G975J25425J1858a17446C54390A51724Q0860N6250
12538B88834b63B0017a1955n4450I6797J53293A22322b69467D7572J42117b4458
12526A79583b56804R8352C77672E848a11839J2358d7716A08366B2272O831a42002
12514b8830B34499b49180A06326H915N8807N8192g3590j5931L9624C3550O707
12503D0257O3470J1957C86K25062L2871d4940j272C5637L11080A69630J0345p4439
12491A05536B8194J66092a23855L0632A44829h0539C6824a99114P0658B690b3771
12479A11168J236a62233B92722i7574m3481E4387M0634L193b50620b8638p8928
12468a07566q6589h2896p8957G7795a11054A56590h4085k11581B6276J30893b27441
$$ plain form
12456 92311 -135271 -214030 85537 -234686 -105260 243532 -114421 25683 -123407 248053
12445 107834 -31017 -325437 -207431 -90717 96206 -88731 98801 -287698 69506 -405278 -3875
12433 -7734 -184323 104908 -192721 170425 207580 29876 361819 -213997 90440 358426
12423 358426 -76765 81101 242293 75756 168597 -74806 -41192 29520 29907 112209 183264 146073
12411 146073 21397 -221757 155373 -1784 351059 -44532 43716 -19572 -87125 -91523 -73286
12400 -73286 36302 -267823 -83631 -191368 -211012 -101406 115132 296206 -140448 -147052 -18442
12388 -254888 -49766 -57138 -129166 -263140 -301476 95284 -13600 205935 -255502 144207 -11901
12376 -237358 71314 336956 -36577 -68763 -88289 -29550 261734 313379 -17238 40745 -98503
$$ packed form
12456I2311a35271p8759H5537b34686a05260B43532a14421B5683a23407B48053
12445A07834c1017k94420J18006i0717I6206h8731I8801b87698F9506d05278c875
12433g734j76589A04908a92721A70425L7155B9876L31943b13997I0440K67986
12423C58426g6765H1101J61192G5756R2841g4806L3614B9520L87Q2302P1055l7191
12411A46073B1397b21757A55373a784C51059d4532D3716a9572o7553m398J8237
12400g3286C6302b67823h3631j07737j9644a01406A15132J81074a40448o604a8442
12388b54888d9766p372p2028j33974l8336I5284a3600B05935b55502A44207a1901
12376b37358G1314K65642c6577l2186j9526b9550B61734N1645a7238D0745i8503
$$ plain form
12364 -99335 -109952 -86383 -409983 364490 -157632 322597 -155898 -64658 16601 23017 230128
12353 230128 233017 51033 53392 84777 -154177 13695 174501 71309 -201004 104298 -481823
12341 -160196 -139891 239471 178867 -82844 -298395 -48324 359034 22756 283145 57016 -20455
12329 -2788 213682 -115349 77696 104548 50193 -115863 132715 -388848 35270 -14262 2589
12317 284672 101945 171231 115778 -56199 94159 255456 -119813 -34550 164339 -7463 84297
12305 256322 -136423 149517 23763 -161128 -127520 371902 91039 -403569 -212779 -116428
12295 -116428 181988 203639 18156 32491 -330331 -40168 285704 74575 91487 6145 -209502
12283 63485 -254359 -35342 4369 341190 437893 311201 -34963 498567 149537 412159 475371
$$ packed form
12364i9335j0617K3569l23600C64490a57632C22597a55898f4658A6601O416K07111
12353B30128K889E1033K359L1385a54177A3695J60806G1309b01004A04298d81823
12341a60196K0305B39471o0604h2844k15551d8324C59034B2756K60389E7016b0455
12329b788B13682a15349G7696K6852E0193a15863A32715c88848C5270a4262B589
12317B84672A01945O9286n5453e6199I4159J61297a19813c4550A64339g463H4297
12305B56322a36423A49517B3763a61128L3608C71902I1039d03569J90790R6351
12295a16428A81988K1651A8156J4335c30331d0168B85704G4575J6912F145b09502
12283F3485b54359c5342D369L36821R6703j26692c4963D98567A49537K62622O3212
$$ plain form
12272 475371 113936 36305 -12183 322538 -78573 -73255 93370 62720 243382 -31270 -137888
12261 -137888 -58639 183174 101672 322338 56253 -71644 -81866 76643 47763 222076 201289
12250 201289 25126 36790 145024 -288542 187027 143458 199071 240587 9616 245047 99824
12238 64745 -6615 152823 97871 226536 75984 -32419 -11766 220685 188882 127046 238758
12227 238758 -67326 199033 417936 214060 162096 65008 280580 353407 156633 860 387951
12216 387951 155133 263442 114693 -101325 380690 -76944 -68862 -80919 210359 -82132
12205 -80029 -136681 293645 46538 -123522 270657 347859 267104 254022 97158 -11706 -43877
12194 -43877 315091 242293 324422 -10413 126852 -222644 98024 -171532 -29643 293859 -189228
$$ packed form
12272D75371A13936C6305a2183C22538g8573N318I3370l0650J80662c1270j06618
12261a37888e8639A83174q1502K20666E6253g1644j0222G6643k8880J74313k0787
12250B01289B5126J1664J08234b88542A87027m3569N5613M1516I616K35431I9824
12238F4745f615A52823n4952J28665G5984c2419a1766B20685l1803o1836J11712
12227B38758f7326A99033K18903k03876n1964F5008K15572P2827A56633H60L87091
12216C87951A55133J08309A14693a01325C80690g6944Q082j2057B10359h2132
12205h0029n6652B93645D6538a23522B70657P7202q0755j3082I7158a1706l2171
12194d3877C15091p2798Q2129a0413A26852b22644I8024a71532b9643B93859a89228
$$ plain form
12182 6084 229305 178462 412928 281070 20448 230197 146722 77328 304163 250618 -144361
12170 69139 14133 228571 150605 66114 89920 73516 -160075 326318 82909 134586 312639
12159 312639 55476 120825 48768 56285 6911 12343 -135962 49866 -156020 72780 186045
12148 186045 -321398 -79126 111011 62805 148608 95909 154659 -154389 -106426 269790 -161085
12136 312 56094 369696 141638 312797 8594 -43308 109557 130551 -32603 -6397 -46743 -178423
12124 -178423 153175 -266006 -202525 138334 313888 145675 118155 -296718 63569 83572
12114 83572 224238 -247422 -105108 63331 67585 -112915 -10408 283693 22895 345080 -148477
12102 1377 -107044 -209770 -175401 -5878 32885 126671 159182 52260 211915 -363217 -184179
$$ packed form
12182F084K23221n0843K34466j31858B0448K09749q3475o9394K26835n3545a44361
12170F9139A4133K14438p7966F6114K3806j6404a60075C26318H2909N1677J78053
12159C12639E5476O5349D8768P517F911N432a35962D9866a56020G2780J13265
12148A86045c21398g9126A11011m8206Q5803n2699N8750a54389M7963B69790a61085
12136C12N5782L13602A41638J71159H594d3308A09557K0994c2603f397m0346j31680
12124a78423A53175b66006O3481A38334J75554A45675k7520b96718F3569K0003
12114H3572J40666b47422a05108F3331M254a12915a0408B83693B2895L22185a48477
12102A377a07044j02726L4369e878C2885R3786L2511E2260J59655c63217J79038
$$ plain form
12091 -184179 -61653 -41775 -363035 -98084 9710 248023 18264 40274 -212627 347955 224572
12080 224572 -380941 18278 19379 633152 1292922 2320063 1452580 582403 354061 26401
12069 60278 -141163 -80475 -27231 -63162 -104375 -44293 -132675 310417 86128 -89606 186893
12057 -147696 -23042 196727 97482 118842 8130 -250793 187395 45048 -118751 403696 59236
12045 -236267 100683 41055 77804 -120630 218519 221078 200675 117292 -92390 11396 -84698
12033 -332342 91356 252325 -88453 182539 -283860 -258476 -363507 -79337 120529 -214202
12022 -49885 83378 59511 165961 -20209 43643 245764 -10260 -26364 -19229 -146359 24258
12010 133634 141546 2917 352892 -59296 -302005 -43784 346656 -164187 308994 -74290 471591
$$ packed form
12091a84179f1653J9878l21260i8084I710K38313A8264K2010b12627C47955j23383
12080B24572c80941A8278J101O13773O59770J027141q67483E82403k28342B6401
12069F0278a41163O0688b7231l5931m1213d4293q8382C10417H6128h9606A86893
12057a47696b3042A96727I7482K1360H130b50793A87395D5048a18751D03696E9236
12045b36267A00683D1055L6749a20630B18519K559k0403q3383i2390A1396h4698
12033c32342I1356J60969h8453A82539b83860K5384j05031g9337A20529b14202
12022d9885H3378k3867J06450b0209D3643K02121a0260j6104P135j27130B4258
12010A33634P912B917L49975e9296k42709d3784C46656a64187C08994g4290D71591
$$ plain form
11998 10026 -6420 109469 -228020 -20697 -271759 -208893 141810 121094 -37680 -18859 -242647
11987 -242647 -83952 -103059 86385 66567 -244425 179060 -78303 92235 116383 38808 321173
11976 321173 88604 -9666 111836 -578 114527 -174302 -77054 136920 16767 -73590 -25823
11964 -17666 -189136 -223248 -199092 -101243 -13590 13364 -163454 -68524 -337590 67028 138434
11953 138434 357988 -282994 269205 43159 -149854 111883 57664 28983 99852 -111536
11942 120962 -121560 350306 214196 -413318 -68539 -122239 -139850 69084 -41597 179074
11931 -144389 -118689 264385 -144128 -103254 -149119 -128865 300643 211855 -98553 24492 131414
11920 131414 -241431 214739 -30166 -184344 -135261 -318874 -93259 -94224 151 187834 6693
$$ packed form
11998A0026f420A09469b28020b0697k51062O2866A41810k0716c7680J8821k23788
11987b42647h3952j9107H6385j9818b44425A79060g8303I2235K4148C8808K82365
11976C21173H8604i666A11836e78A14527a74302g7054A36920A6767g3590b5823
11964a7666j71470l4112K4156R7849a3590A3364a63454f8524k69066F7028P1406
11953A38434K19554b82994B69205D3159a49854A11883n4219k8681P0869a11536
11942A20962a21560C50306j36110d13318f8539n3700j7611F9084d1597A79074
11931a44389K5700B64385a44128M0874m5865K0254C00643q8788i8553B4492J06922
11920A31414b41431B14739c0166j54178M9083j83613i3259r65A51J87683F693
$$ plain form
11908 -202290 -248613 -62749 -11640 -70131 -10456 -47101 80527 122210 -127994 -142395 170859
11896 187191 301403 -131707 111691 242160 6296 -182302 -136785 68643 23258 23380 225044
11885 225044 -361124 -203593 225517 101781 86979 -50570 41901 -67667 -114902 -102853 158471
11873 -39085 -218436 -16801 35396 -293066 -205951 345875 -109452 167344 -232017 -52924
11862 -220726 -125721 -218027 458195 328236 63168 -315659 -181026 -58129 74785 -167952
11851 102568 -95919 -283065 -363442 -277097 -150234 202417 151478 162648 -71057 -124851 -120265
11840 -120265 -183661 -346732 -13552 -134393 111402 -12810 -274731 82315 113911 -164062
11829 -153028 -129382 5672 -41263 43733 -130146 -113607 -155054 3594 162592 -8993 80487 -173379
$$ packed form
11908b02290m6323f2749a1640n8491a0456l6645H0527M1683a27994j4401A70859
11896A87191J14212a31707A11691J30469F296a82302M5517F8643B3258J22K01664
11885B25044c61124J57531B25517A01781j4802e0570D1901f7667m7235J2049A58471
11873c9085j79351a6801C5396b93066Q7115C45875a09452A67344b32017e2924
11862b20726R5005r2306D58195j29959F3168c15659J34633e8129G4785a67952
11851A02568i5919j87146q0377Q6345J26863B02417n0939J1170g1057n3794M586
11840a20265o3396j63071a3552j20841A11402a2810k61921H2315L1596a64062
11829a53028K3646E672d1263D3733a30146J6539m1447C594J58998h993H0487a73379
$$ plain form
11816 38412 205255 -209024 247425 -11362 -40859 -23673 -3740 363223 -137159 61733 -279317
11804 190377 -178287 -375381 -85075 -459236 -184012 -226496 186996 74574 151591 44305
11793 411412 181382 -162686 94075 -235821 -267532 -59026 -36213 -283853 221349 -135882
11782 238685 -18133 -108249 -59122 200395 -122174 -450804 85791 -114320 -284824 -139801
11771 -177278 73820 -58383 237141 181175 -105264 60723 -50239 -269273 -102201 -75119 178344
11759 136171 -92490 60008 -64363 -47847 39612 -77200 275377 380153 -103164 99560 -177318
11747 -11785 -206818 103921 -21235 -110294 -35152 -168933 -456253 -46921 -301578 -125506
11736 -52312 -16471 -169530 204141 -261769 -164062 11564 386033 -29245 -116958 -42358 -14465
$$ packed form
11816C8412J66843b09024B47425a1362k9497J7186c740C63223a37159F1733b79317
11804A90377a78287j97094h5075l74161a84012m2484A86996G4574P7017D4305
11793D11412A81382a62686I4075b35821l1711e9026K2813k47640B21349a35882
11782B38685a8133r0116M9127B00395a22174l28630H5791a14320j70504a39801
11771a77278G3820e8383B37141n5966a05264F0723e0239k19034a02201K7082A78344
11759A36171i2490F0008f4363J6516C9612g7200B75377J04776a03164I9560a77318
11747a1785j95033A03921b1235q9059c5152j33781k87320d6921k54657a25506
11736e2312a6471j53059B04141b61769R7707A1564L74469b9245q7713d2358a4465
$$ plain form
11724 -172775 -150364 54569 50967 211640 143184 33392 55650 131938 -60473 -14151 -64708
11713 -64708 -95070 90156 -143898 78258 150201 23093 190164 235254 -64926 80411 -420462
11701 514395 67943 -102110 -10188 7964 40029 1179 158970 -106509 -21386 52521 39878
11690 39878 -388281 263502 114506 48068 66458 232108 -317717 56767 -172577 133780
11679 -103085 -167826 122961 -86613 -14851 279160 -61813 40188 46434 45758 356022 -3492 110027
11666 23919 -208855 158285 198863 85246 88603 206308 91147 90965 193577 302855 -86065
11654 -35245 -216506 -128795 14002 303915 206597 259278 257736 18109 -160608 130022 87167
11643 87167 30673 -237686 304657 -72460 30970 -37992 -156678 426271 198648 -2495 26951
$$ packed form
11724a72775K2411E4569l602J60673o8456C3392K2258P6288f0473a4151n0557
11713f4708l0362I0156a43898G8258P1943B3093J67071M5090f4926H0411d20462
11701E14395F7943a02110a0188G964L2065A179J57791a06509b1386E2521j2643
11690C9878c88281B63502A14506D8068J8390J65650c17717E6767a72577A33780
11679a03085o4741A22961h6613a4851B79160f1813D0188O246o76L10264c492A10027
11666B3919b08855A58285M0578H5246L357J17705I1147j82J02612J09278h6065
11654c5245j81261Q7711A4002K89913r7318N2681j542A8109a60608A30022m2855
11643H7167C0673b37686C04657g2460C0970c7992j18686D26271A98648b495B6951
$$ plain form
11631 203414 59171 -316768 60535 -215419 -83723 42483 25681 122022 -165400 70715 -3857
11619 -173509 42846 -8220 328619 339238 120391 -155613 174349 -160871 -20068 67880 -144206
11607 -7051 24481 211273 82509 95979 -157786 76455 -90898 -2212 -219913 -47638 36291
11595 334418 217618 17997 -141713 46418 -183325 -4451 12446 78149 26493 -90792 227353
11583 -37043 -201889 30814 273393 -182786 174046 67153 20711 -135622 4958 184145 -37402
11571 -102262 182403 55753 33865 496600 -184101 25432 -32617 -30964 -99067 40441 -84809
11559 -170840 74389 385118 -90863 -160931 348017 558199 39868 14878 179505 339554
11549 339554 243854 203705 -85799 278531 130838 193380 101820 78856 160329 -62336 259744
$$ packed form
11631B03414E9171c16768F0535b15419h3723D2483j6802R6341a65400G0715c857
11619a73509D2846h220C28619J0619A20391a55613A74349a60871b0068F7880a44206
11607g051B4481J86792H2509J3470a57786G6455i0898b212k17701d7638C6291
11595C34418j16800A7997a41713D6418a83325d451A2446O5703B6493i0792B27353
11583c7043j64846C0814K42579a82786A74046F7153B0711a35622D958J79187c7402
11571a02262A82403E5753k1888M62735a84101B5432c2617J653o8103D0441h4809
11559a70840G4389L10729i0863p0068C48017K10182C9868A4878J64627J60049
11549C39554r5700m0149h5799B78531A30838O2542r1560k2964Q1473f2336B59744
$$ plain form
11537 -25256 -172503 198405 197337 192478 24871 -68478 135269 -119130 209063 172118 200775
11526 200775 276464 -149350 50477 139256 -60104 62792 249364 233709 27577 202856 212143
11515 212143 222397 132166 207048 146354 -46000 -72723 345259 26720 232531 -130947 348621
11503 215052 30670 352470 314409 730673 59445 271871 166202 -40190 137849 71344
11493 71344 193260 166384 109369 258194 217268 162757 332486 212055 201674 376628 124144
11481 -284870 114191 20046 210258 263090 41042 255643 133804 307398 -128643 445450
11470 140203 411845 338901 -304887 168169 -5912 116379 299100 -124024 105414 -30401
11459 360143 167165 85179 -79073 69513 -374827 217581 -48342 51015 -135728 -195408 27885
$$ packed form
11537b5256j47247A98405j068m859B4871f8478A35269a19130B09063l6945K8657
11526B00775P5689a49350E0477Q8779f0104F2792J86572j5655B7577J75279R287
11515B12143J0254r0231P4882o0694d6000k6723C45259B6720K05811a30947C48621
11503B15052C0670L21800l8061M16264E9445K12426j05669d0190A37849o6505
11493G1344J21916k6876n7015J48825m0926n4511J69729j20431j0381J74954A24144
11481b84870A14191B0046J90212N2832D1042K14601j21839J73594a28643D45450
11470A40203K71642p2944c04887A68169e912A16379J82721a24024A05414c0401
11459C60143A67165q1986g9073F9513c74827B17581d8342E1015a35728n9680B7885
$$ plain form
11447 148598 -218311 -32561 122095 362983 99974 -54992 189550 154799 236647 -73704 -149200
11436 -149200 40655 61571 124791 405410 142565 4980 173031 212268 120475 -83865 -156626
11425 -156626 106513 95325 45758 588201 -225130 214824 46557 -47873 -361070 -293076
11415 -293076 -37527 160719 91522 -154033 107788 121434 57009 46225 49298 173246 201459
11404 201459 117229 -130637 73196 127771 104827 43432 -21097 41851 -270703 46244 188191
11393 188191 -120045 -8472 -118153 21442 -90390 -252152 -276509 363472 -222897 88855 7634
11381 1786 24791 141907 -185633 73097 -161477 236627 -153531 -124746 355646 -134775
11370 -125147 -123514 107987 -132898 276553 19 -65295 -85605 -243963 -191982 251413 151765
$$ packed form
11447A48598b18311c2561A22095K40888I9974e4992A89550l4751Q1848g3704p5496
11436a49200D0655K0916O3220K80619A42565D980J68051L9237r1793h3865p2761
11425a56626A06513j1188D5758N42443b25130B14824D6557d7873l13197O7994
11415b93076c7527A60719o9197a54033A07788J3646E7009j0784L073J23948K8213
11404B01459q4230a30637G3196N4575k2944D3432b1097D1851b70703D6244J41947
11393A88191a20045h472j09681B1442i0390j61762k4357C63472b22897H8855G634
11381A786K3005J17116a85633G3097a61477B36627a53531K8785C55646a34775
11370a25147J633A07987a32898B76553A9f5295k0310j58358N1981B51413r9648
$$ plain form
11359 151765 -185632 238511 -47496 27062 133280 383216 -149078 327545 -12520 -54620
11349 -54620 -31660 4479 328502 -225761 -2666 271416 156175 -25737 -36269 112517 -207024
11337 -351188 -45020 11306 349390 -339715 160721 73056 -230231 103220 -82396 674 -211388
11325 36578 175809 -135231 -359751 17409 -22661 6202 41305 113623 -251228 9755 248083
11314 248083 -32435 -47557 -11001 -114478 228437 85527 -237309 111582 27864 -33025 122309
11302 181069 86552 -215050 -301796 -136731 115366 72013 18608 -352193 61990 137628 -10918
11290 -385655 456593 81742 -376406 192074 83876 -351921 107649 -261489 -139810 -319112
11280 -319112 -65344 191159 91293 232362 63483 -296820 152938 54306 -234708 261024
$$ packed form
11359A51765a85632B38511d7496B7062J06218K49936a49078C27545a2520m2100
11349e4620K2960D479L24023b25761b666B71416j15241b5737j0532A12517b07024
11337c51188d5020A1306L38084c39715A60721G3056b30231A03220h2396F74b11388
11325C6578J39231a35231k24520A7409b2661F202L5103P2318b51228I755K38328
11314B48083c2435j5122a1001j03477B28437H5527b37309A11582B7864c3025A22309
11302A81069H6552b15050q6746a36731A15366m3353A8608c52193F1990P5638a0918
11290c85655D56593H1742c76406A92074H3876c51921A07649b61489J21679j79302
11280c19112f5344A91159I1293J41069F3483b96820A52938E4306b34708B61024
$$ plain form
11269 -154165 271703 121632 -57018 191152 53777 -178272 -18796 -70152 -309939 121002
11258 -34117 293368 -161933 -415154 -224217 -59199 108378 128090 180646 -176940 -344344
11248 -344344 -265007 17074 45759 -113674 78337 -185625 -5590 -278721 -223785 -116650 -154903
11237 -154903 -24431 138995 -109150 -3896 78677 -274496 -208477 -116870 -218842 181943 62835
11225 -263852 149445 -57459 -160747 -314210 -170927 117435 297709 -183116 -179800 67830
11214 54676 328045 -113370 117374 -211913 -278430 257431 95433 98941 269896 -68556 69958
11202 -261427 -84322 -185649 -154400 -44194 -98549 261614 -40982 3223 -299290 77746 -250492
11190 -216428 15659 61300 -201051 -246558 -154229 -41993 -197354 151367 -13242 169634 -139717
$$ packed form
11269a54165B71703A21632e7018A91152E3777a78272a8796n1356k39787A21002
11258c4117B93368a61933k53221J90937e9199A08378J9712N2556a76940j67404
11248c44344P9337A7074K8685a13674G8337a85625e590k73131N4936J07135l8253
11237a54903b4431A38995a09150c896G8677b74496O6019R1607j01972A81943F2835
11225b63852A49445e7459j03288j53463J43283A17435J80274a83116L316F7830
11214E4676K73369a13370A17374b11913o6517B57431I5433L508J70955f8556F9958
11202b61427h4322j01327L1249d4194n4355B61614d0982C223b99290G7746b50492
11190b16428A5659M5641b01051m5507R2329d1993j55361A51367a3242A69634a39717
$$ plain form
11178 -56391 -271976 -299207 -191 -48147 39733 16469 -76025 11088 -31869 -138569 -82964 310146
11165 187088 -24073 163363 -87126 1481 6517 -150329 -55891 -136678 -75631 23622 51502
11154 51502 -34451 -286199 -125724 163728 -219885 81887 -80014 81769 144761 86532 9022
11142 167821 -145070 -92998 -61838 -103242 161570 -45577 -133202 -83810 -52206 199400 537659
11131 537659 228750 -29721 -90185 47932 -273638 33447 60724 -189474 133458 211838 -27617
11119 157307 -200937 -93491 -20182 -106719 35684 -127087 150608 -165557 199989 -126060
11108 145710 73589 -1734 32975 51839 87800 596270 -23629 67427 246042 335064 116846
11096 260059 271733 -64202 80279 213512 159633 -90594 93019 53767 322683 -71658 428921
$$ packed form
11178e6391k15585k7231a91m7956C9733A6469g6025A1088c1869j06700N5605C10146
11165A87088b4073A63363h7126A481N036a50329e5891q0787O1047B3622K7880
11154E1502c4451k51748a25724A63728b19885H1887h0014H1769O2992n8229I022
11142A67821a45070N2072L1160m1404A61570d5577q7625M9392L1604A99400L38259
11131E37659B28750b9721o0464D7932b73638C3447K7277a89474A33458P8380b7617
11119A57307b00937i3491b0182q6537C5684a27087A50608a65557A99989a26060
11108A45710p2121a734C2975J8864L5961N08470b3629F7427J78615Q9022A16846
11096B60059J1674f4202H0279J33233n3879i0594I3019l9252K68916g1658D28921
$$ plain form
11084 149981 210898 308116 384645 138991 338322 297267 95330 269378 240904 219821 97120
11072 303162 423351 262549 -65240 282950 344644 274207 602249 477796 -14849 546718
11061 334674 508369 690379 576431 567140 829737 538981 646856 674930 643915 623127
11051 623127 717733 711399 539350 1000951 907364 511972 957286 274442 670157 564578
11041 564578 844405 848473 731625 468908 718161 1084994 574053 542321 443983 333913
11031 333913 414506 740519 499559 598725 1091620 863596 609479 840919 616290 336455
11021 336455 591039 719396 230685 286349 489497 703919 547330 353356 284550 708563
11011 708563 594188 738382 645426 817002 586002 613189 669451 444023 726467 616675
$$ packed form
11084A49981O0917R7218P6529A38991J99331m1055I5330J74048k8474k1083I7120
11072C03162J20189j60802f5240B82950O1694p0437L28042j24453a4849E46718
11061C34674J73695J82010j13948r291K62597k90756J07875K8074l1015k0788
11051F23127R4606o334j72049M61601r3587l95392M45314B74442L95715j05579
11041E64578K79827M068j16848k62717K49253L66833n10941l1732r8338j10070
11031C33913Q0593L26013k40960R9166M92895k28024k54117K31440k24629k79835
11021C36455K54584J28357B30685N5664K03148K14422j56589j93974o8806M24013
11011G08563j14375J44194r2956J71576k31000K7187N6262k25428K82444j09792
$$ plain form
11001 616675 690858 669705 440691 462319 689970 599114 923670 922233 683965 437192 836139
10990 836139 754353 797517 488344 771756 877546 1020186 843564 1165143 751169 1010493
10980 1010493 1502931 1178374 1161159 1401406 1608085 1709516 1801849 2015324 2212887 2379935
10970 2379935 2564290 2990544 3264971 2814353 2486296 2454992 1937379 1980531 1563313 1776449
10960 1776449 1544269 1761437 1432511 1705134 1482512 1599496 1578631 1694772 1426521 1009185
10950 1009185 1079934 1281694 843412 892112 334205 427447 683566 534828 182068 585574
10940 585574 260070 281367 493520 256303 244240 90388 108714 41739 30086 216441 209626
10929 209626 164472 58605 171828 131652 219099 184229 192513 77282 -217543 12943 -155824
$$ packed form
11001F16675P4183k1153k29014K1628K27651r0856L24556j437k38268k46773L98947
10990H36139q1786M3164l09173K83412J05790J42640j76622L21579m13974K59324
10980A010493M92438l24557j7215K40247K06679J01431R2333K13475J97563J67048
10970B379935J84355M26254K74427m50618l28057l1304n17613M3152m17218K13136
10960A776449k32180K17168l28926K72623k22622J16984k0865J16141k68251m17336
10950A009185P0749K01760m38282M8700C34205R3242K56119j48738A82068M03506
10940E85574B60070K1297K12153k37217j2063I0388J8326D1739j1653J86355o815
10929B09626m5154E8605J13223m0176Q7447l4870Q284G7282b17543A2943a55824
$$ plain form
10917 -260501 -212629 293854 -173985 341010 38418 392949 155824 59374 -14380 52192
10906 -57913 -66023 345303 -224173 -270932 -100120 -161681 -77617 98902 -96018 -73977 -90649
10895 -90649 48765 138652 -43775 -12806 -78529 80885 -1395 600 201618 40033 -112465 -109642
10883 -109642 60477 -214552 -246699 -90289 -69596 -78141 119611 178472 -43393 214073 -72696
10871 247284 32723 134544 -196941 -28882 223134 -113307 -318591 -235825 42211 -198373
10860 -333648 -77003 72257 26163 45210 -161836 30053 -4320 -93533 8217 -184665 36322
10848 -127890 -206388 3459 -281005 202997 -102322 196729 -20583 472643 50440 -413564
10837 -53164 84902 54599 266696 -48565 163859 145406 113896 112154 262261 -204835 -180693
$$ packed form
10917b60501M7872B93854a73985C41010C8418L54531A55824E9374a4380E2192
10906e7913q110C45303b24173m6759a00120o1561g7617I8902i6018K2041j6672
10895i0649D8765Q9887d3775a2806o5723H0885a395F00K01018D0033a12465K823
10883a09642F0477b14552l2147i0289K0693q545A19611N8861d3393B14073g2696
10871B47284C2723J01821a96941b8882B23134a13307k05284Q2766D2211a98373
10860c33648g7003G2257B6163J9047a61836C0053d320q9213H217a84665C6322
10848a27890p8498C459b81005B02997a02322A96729b0583D72643E0440d13564
10837e3164H4902l0303K12097d8565A63859j8453l1510j742J50107b04835K4142
$$ plain form
10826 -180693 130078 -159883 178125 -64186 438240 40147 -280114 -157445 -50375 -36210
10816 -36210 247087 -130681 -17925 -56800 -108344 -142589 -20035 182352 -154271 -30106 -105544
10805 -105544 153514 346095 271569 60076 -9623 -16214 176387 -215542 -137884 -334946 -6172
10793 -81104 -186405 50571 -229388 -61424 -296523 -60240 -151053 -189975 -140926 199105 164224
10782 164224 -100193 -344685 -388176 -16381 78452 -73858 -93835 120753 -298603 3952 280198
10771 280198 26235 -13995 4471 -150213 -20143 13989 -120560 19433 -234095 51131 -46739
10759 114177 -359144 -131644 108699 127725 32318 -113580 125049 -256253 166344 -201356
10748 33861 -53649 -211951 -58874 -90082 -95322 89690 -12353 -222435 -138688 -242626 85526
$$ packed form
10826a80693A30078a59883A78125f4186D38240D0147b80114J22669e0375J4165
10816c6210B47087a30681a7925l8875n1544l4245b0035A82352a54271c0106p5438
10805a05544A53514J92581p4526F0076i623o591A76387b15542P7658j97062f172
10793h1104j05301E0571b29388f1424k35099f0240r0813l8922M9049A99105l4881
10782A64224a00193k44492m3491a6381G8452g3858j9977A20753b98603C952K76246
10771B80198B6235a3995D471a50213b0143A3989a20560A9433b34095E1131d6739
10759A14177c59144a31644A08699J9026C2318a13580A25049b56253A66344b01356
10748C3861e3649j58302e8874l1208n240H9690a2353k10082Q3747j03938H5526
$$ plain form
10736 -250553 -389364 -217011 99529 253839 120708 174269 95427 -133506 56389 204991
10726 204991 -270509 129131 -205916 -190785 10972 -1062 183051 -326810 75340 -5052 -216935
10715 -216935 -262713 -172925 137735 163131 -258804 -30747 -75882 49225 -241819 -140761 -41682
10703 -310553 -246259 -348706 -285113 88290 263761 -33778 -247479 -199485 -238885 -350400 -106387
10691 90410 -72736 56630 -162597 -206781 -151937 -145193 -11610 -78202 -209309 -82810 -67182
10680 -67182 210951 -268555 187907 275967 -145917 27599 -180388 -84355 -116819 -343477
10670 -343477 230263 -159546 -83418 -188351 -190785 -178690 -155355 -118777 12663 -36201 -59766
10659 -59766 4008 37765 -138160 -77492 -383770 -276452 -102056 -96230 -117386 64981 126452
$$ packed form
10736b50553j38811J72353I9529J54310A20708N3561p8842a33506E6389J48602
10726B04991b70509A29131b05916J5131A0972a062A83051c26810G5340e052k11883
10715b16935m5778Q9788A37735K5396b58804c0747m5135D9225b41819J01058d1682
10703c10553O4294j02447O3593H8290J75471c3778k13701M7994l9400j11515a06387
10691I0410g2736E6630a62597m4184N4844O744a1610o6592j31107h2810J5628
10680f7182B10951b68555A87907Q8060a45917B7599a80388h4355l2464k26658
10670c43477B30263a59546P6128j04933k434J2095K3335L6578A2663c6201k3565
10659e9766D008L3757a38160O0668l06278J07318a02056N826k1156F4981O1471
$$ plain form
10648 126452 55963 38200 219368 31323 47267 -252706 150108 110019 -136265 -290766
10638 -290766 58619 -7211 -109647 31023 93914 -78714 -250951 53618 -562892 -146761 -375610
10627 -375610 -67182 -54404 -1624 -138740 123677 -885 74583 -15056 295810 192425 -46193
10615 -144781 257991 -511078 -184196 12281 -24287 -90694 -187673 -65083 -142410 -109204 139455
10603 171911 172503 11510 136368 46160 -61270 418599 -149632 -337518 77654 -112524 -89687
10592 -89687 255912 -180722 -106370 -123468 -288487 -191705 69306 148269 -173796 -21848 -353547
10581 -353547 148877 -240852 352106 -163736 27502 -368971 156066 -416348 -118528 175441
10570 22782 -181231 -77388 102943 254952 129591 -85160 -19433 -56809 -269663 25377 -358710
$$ packed form
10648A26452E5963j7763J81168C1323J5944b52706A50108m0089a36265j54501
10638b90766E8619g211j02436C1023O2891g8714j72237E3618e62892a46761k28849
10627c75610f7182J2778a624j37116A23677h85G4583a5056B95810j03385d6193
10615a44781B57991e11078a84196A2281b4287o6407r6979f5083p7327L3206A39455
10603A71911N92A1510J24858D6160f1270D18599a49632j87886G7654a12524K2837
10592h9687B55912a80722P4352j7098j65019R6782F9306P8963a73796b1848l31699
10581c53547A48877b40852C52106a63736B7502c68971A56066d16348a18528A75441
10570B2782a81231g7388A02943J52009j25361h5160a9433l7376k12854B5377c58710
$$ plain form
10558 -131281 -103141 -90106 -298291 -311094 -92859 -59380 158579 -320735 -59367 -569549 -307354
10547 -307354 396891 259480 208980 -113052 34222 -31426 -182994 -47016 -315156 -108795
10536 13070 -49530 -186416 -42770 -178309 104001 -191442 -122825 123547 -176376 -153402
10526 -153402 104884 25920 236385 -122422 -56501 -279814 -232236 157177 -73786 89322
10515 168972 -155166 20910 33647 7205 247679 -47194 80102 -91029 41117 -220934 35295
10503 -81488 -381555 -228755 -57838 -46460 173728 -37225 34014 143405 222219 81532 28388
10491 77621 26005 143021 17929 -198609 -168577 223364 26592 -105836 4290 -111821 154613
10479 141366 440279 128865 529611 512453 585711 572605 -89985 -388397 6254 -201229 208581
$$ packed form
10558a31281K8140J3035k08185j2803i2859L3479A58579c20735e9367n10182K62195
10547c07354C96891j37411n0500a13052C4222c1426j51568d7016k68140a08795
10536A3070d9530j36886d2770j35539A04001a91442O8617A23547a76376K2974
10526a53402A04884B5920K10465a22422e6501k23313M7578A57177g3786H9322
10515A68972a55166B0910J2737G205K40474d7194H0102i1029D1117b20934C5295
10503h1488l00067J52800e7838J1378A73728c7225C4014J09391P8814H1532B8388
10491G7621B6005J17016A7929a98609L0032B23364B6592a05836D290a11821A54613
10479A41366K98913A28865M00746j7158P3258j3106h9985k98412F254b01229B08581
$$ plain form
10467 144348 -128672 -308251 71363 84404 -239471 -181443 211102 -131048 28396 58844
10457 58844 -56340 -128760 -4400 -3605 219468 -297095 3478 -17928 -149534 35304 -205522 228364
10444 -65795 209957 -72143 114281 29919 125324 -6390 107051 -149217 182440 -190611 -204809
10433 -204809 214326 152982 -44898 -34819 -224897 -20477 86260 -117296 265256 38945 57091
10422 57091 -175392 -268651 -351036 -184568 -239751 -10942 9221 -93655 13705 125595 -80066
10410 -228121 -19623 33529 -210295 -89697 288326 -139708 -833 46023 72560 -84365 107527
10398 -338236 -261179 -50591 -62544 -73158 -77151 -36072 -19235 -200143 244552 259656 -24582
10386 96496 164115 43795 -306153 183575 296827 278623 246735 -139639 143994 190490 194579
$$ packed form
10467A44348a28672j79579G1363J3041b39471N8028B11102a31048B8396L0448
10457E8844e6340p2420d400P95B19468b97095C478a7928j31606C5304b05522B28364
10444f5795B09957g2143A14281B9919R5405f390A07051a49217A82440a90611j4198
10433b04809B14326o1344d4898J0079j90078b0477H6260a17296B65256C8945J8146
10422E7091a75392r3259q2385J66468n5183a0942I221i3655A3705J11890h0066
10410b28121a9623C3529b10295h9697B88326a39708h33D6023K6537h4365A07527
10398c38236P7057e0591j1953j0614l993c6072J6837j80908B44552J5104b4582
10386I6496O7619D3795c06153A83575J13252j8204l1888a39639A43994M6496M089
$$ plain form
10375 194579 49431 510321 96978 225213 182323 -75824 146743 -34873 148441 460666
10365 460666 459391 189803 527505 734172 3777 74142 379907 7226 304974 113097 27767
10353 118655 86319 522033 290157 296579 145895 916749 804946 360168 72095 139373
10343 139373 168821 230762 239710 133917 26406 216226 331490 120897 272495 205621 42694
10331 432860 -269289 68788 -190960 197842 15359 147535 317209 342223 11663 152761
10321 152761 254592 166555 -91218 -44789 10136 -120485 317000 147290 356277 -26525
10310 251318 -25150 64955 61379 93118 -21548 43930 -35072 -497188 289825 11080 158395
10299 158395 3010 221841 333919 -26754 -270110 -251724 -62796 -54938 178498 53396 -330435
$$ packed form
10375A94579D9431M60890I6978J28235m2890g5824A46743c4873A48441L12225
10365D60666j275A89803L37702K06667C777P0365L05765G226K97748A13097B7767
10353A18655l2336M35714k31876O422A45895P70854j11803C60168G2095O7278
10343A39373K9448O1941Q948j05793B6406J89820J15264A20897J51598o6874D2694
10331D32860b69289F8788a90960A97842A5359J32176J69674K5014A1663J41098
10321A52761J01831q8037i1218d4789A0136a20485C17000A47290K08987b6525
10310B51318b5150F4955l576L1739b1548D3930c5072m62116B89825A1080J47315
10299A58395C010K18831J12078b6754k43356J8386f2796P858A78498E3396c30435
$$ plain form
10287 -146934 -81169 94068 59874 -154491 -225038 -91274 32051 -326816 -20247 -397774 -234046
10276 -234046 -114006 157622 -67174 -128662 103490 -101963 242933 -23197 -199451 -201672
10266 -201672 -13095 225630 34823 78943 41666 -100839 263976 30414 337504 306745 570716
10255 570716 -41678 129211 158065 296867 47682 -34596 152451 141045 209710 116238 -19876
10243 -253715 230660 -210420 157395 -239612 96951 -20790 314786 12166 -252940 11721
10232 247063 117452 -276973 -465805 98248 -236276 64584 -192357 131218 -25797 -19660
10222 -19660 -63197 -240431 -55817 210278 -354174 -1339 154361 -33025 -158555 139213 49077
10210 46978 -31659 -62436 64675 24042 -299871 -57070 -156443 217531 -164852 -343431 -239589
$$ packed form
10287a46934O5765I4068l4194a54491p0547i1274C2051c26816b0247l77527J63728
10276b34046a14006A57622f7174o1488A03490a01963B42933b3197j76254k221
10266b01672a3095B25630C4823M4120l7277a00839B63976C0414L07090l0759K63971
10255E70716d1678A29211K8854J38802D7682c4596A52451j1406O8665r3472a9876
10243b53715B30660b10420A57395b39612I6951b0790C14786A2166b52940A1721
10232B47063A17452b76973j88832I8248b36276F4584a92357A31218b5797O137
10222a9660m3537j77234e5817B10278c54174a339A54361c3025j25530A39213D9077
10210D6978c1659l0777F4675B4042b99871e7070r9373B17531a64852j78579J03842
$$ plain form
10199 -239589 -81658 -117729 132733 -77357 -257085 59372 -100939 -287855 -234707 148751
10188 53316 -140653 84234 -97433 60154 -224984 43430 -121857 -17470 150515 -190329 -12818
10176 -242696 -17776 106016 -12021 -27524 -379817 -41643 83840 17786 136941 214008 23239
10164 -92 12895 -240903 -254420 40467 18460 -271842 -153015 15385 3011 -4436 50720 -20359
10151 80573 133257 -39420 242720 57393 -86186 -176506 151706 -58617 -181966 -18368 -352657
10140 -352657 -15615 -1998 313024 36528 -150854 -375293 150515 -117308 -174687 -62232 27680
10128 164182 -114671 -43731 -74383 44965 147341 -42428 -505908 -180314 179865 216865
10118 216865 -249134 326870 -133280 -214796 -55508 -105934 -367987 43804 -154397 -5202 -101698
$$ packed form
10199b39589h1658l6071A32733g7357j79728E9372a00939j86916N3148A48751
10188E3316a40653H4234i7433F0154b24984D3430a21857a7470A50515a90329a2818
10176b42696a7776A06016a2021j5503l52293d1643H3840A7786J19155P7067B3239
10164i2A2895b40903j3517D0467A8460b71842J18827A5385C011d436E0720b0359
10151H0573N2684c9420B42720E7393h6186r0320A51706e8617j23349a8368l34289
10140c52657a5615a998C13024C6528a50854k24439A50515a17308n7379f2232B7680
10128A64182a14671d3731l0652D4965J02376d2428m63480a80314A79865L7000
10118B16865b49134C26870a33280q1516e5508n0426k62053D3804a54397e202r6496
$$ plain form
10107 -101698 46422 -43252 -95829 -66913 -350768 -320146 -79557 -188309 100293 219019 -244206
10095 -211779 -11092 -55401 149867 39558 -195932 -164794 -246418 -85153 127190 -260791 248545
10083 84689 -261904 -236952 -139785 184223 140232 -149320 45210 -298242 305381 80045 139906
10072 139906 -224707 -127074 -67144 33250 -24073 153769 132469 -195251 181306 -93029 -203388
10061 -203388 -84225 -136682 452138 -267594 -293774 88040 -40969 -54117 -264383 -303478 169559
10049 -254351 -99074 340155 128899 -177980 92610 -262629 -485855 -20010 -272571 -280454
10039 -280454 7269 -89731 -27552 141547 32700 -86849 246158 86632 142358 -168662 -183180
10028 -183180 -100970 -916 -111472 47539 -132104 -147089 -367169 -38996 327149 31160 -85957
$$ packed form
10107a01698D6422d3252n2577K8916k83855L0622g9557j08752A00293J18726b44206
10095b11779a1092m4309A49867C9558a95932L1138q1624h5153A27190b60791B48545
10083H4689b61904K4952R7167A84223m3991a49320D5210b98242C05381H0045N9861
10072A39906b24707R7633N9930C3250b4073A53769k1300a95251A81306i3029j10359
10061b03388h4225n2457D52138b67594k6180H8040d0969j3148k10266l9095A69559
10049b54351i9074C40155A28899a77980I2610b62629k23226b0010k52561p883
10039b80454G269h9731b7552A41547C2700h6849B46158H6632N5726a68662j4518
10028a83180Q2210i16j10556D7539a32104j4985k20080c8996C27149C1160h5957
$$ plain form
10016 -104678 101396 -183995 -61085 -86752 -61490 -316641 200462 -232013 -33117 -57896
10006 -57896 -138062 91530 -166831 -302784 182677 -68656 -51783 -169476 -330156 141466
9995 78468 -6620 104614 -192259 261565 -184834 -293151 -137325 -128541 -24826 -20490 68780
9983 -117956 41125 -354351 -337445 -70184 -207640 342448 137909 64123 -369636 133967
9972 87367 119272 -42834 -88983 -343105 105948 -214013 53021 -39170 18632 35345 -118287
9960 -25777 -110851 230746 34655 -185314 303147 -484625 -155015 21182 187291 -71029 -154073
9949 -154073 -443509 28590 -272692 -156140 -147126 -301775 -238363 -297446 -114480 -29755 -18409
9938 -18409 123774 -356817 -45751 -130216 145889 -77746 -52539 49993 -116000 368860 -104852
$$ packed form
10016a04678A01396a83995f1085k5667K5262k55151B00462b32013c3117k4779
10006e7896q0166I1530a66831j35953A82677f8656J6873j17693j60680A41466
9995G8468f620A04614a92259B61565a84834j08317a37325Q784b4826M336F8780
9983a17956D1125c54351J6906g0184j37456C42448A37909F4123c69636A33967
9972H7367L1905d2834m6149k54122A05948b14013E3021c9170A8632J6713a18287
9960b5777q5074B30746C4655a85314C03147d84625a55015B1182J66109g1029q3044
9949a54073k89436B8590b72692J16552R014j54649O3412n9083a14480b9755J1346
9938a8409A23774c56817d5751q4465A45889g7746K5207D9993a16000C68860a04852
$$ plain form
9926 -156351 -287793 -47357 57164 -292806 -182220 -217396 83869 48221 110843 -212750 -384775
9915 -384775 123149 79719 152491 -223410 -171455 -12826 144795 -170567 109563 -150876
9904 -38047 322912 -54502 133948 -104824 -60967 -144805 -18774 65766 -248933 -347273 -58533
9892 -39452 -303087 -174458 -91230 -104136 83697 -233926 -201753 -207710 -321122 -364655 -174093
9880 -381802 -158676 109974 75786 -321334 138021 -83099 -76882 -80226 9688 15785 -37396 -338720
9868 -338720 -330957 -31804 -57421 368031 -267229 -289641 5939 213788 156410 -36519 49499
9856 106488 -107500 65299 -107679 -41281 -14273 -26142 36241 90628 -27716 -344264 107646
9844 -34097 -72420 73293 -134358 150917 109567 38397 272566 -224710 -94325 -105448 104393
$$ packed form
9926a56351j31442d7357E7164b92806J10586l5176H3869l5648O2622b12750j72025
9915c84775A23149m3430P2772b23410N1955a2826A44795a70567A09563a50876
9904c8047C22912e4502A33948a04824M3857q3838a8774F5766b48933r8340e8533
9892c9452k63635J28629Q3228j2906H3697b33926L2173n957j13412m3533a74093
9880c81802a58676A09974l4188c21334A38021h3099O217l344I688O097c7396l01324
9868c38720P763c1804k5617C68031b67229k2412E939K07849n7378c6519D9499
9856A06488a07500F5299a07679d1281a4273j1869C6241N4387b7716l16548A07646
9844c4097l8323G3293a34358A50917m1350C8397K34169b24710i4325j1123A04393
$$ plain form
9832 -183657 -161548 98287 -101996 -199884 -227438 169056 34667 -294870 15827 -149230 -175801
9821 -175801 -51546 -55749 -281673 -66552 -145630 -171394 200938 -53347 -269612 -230158 216255
9809 55051 70720 -20267 119472 35639 -11695 -118948 -42256 -358747 8118 -65257 -6294 83095
9796 -228393 -23251 150618 -206966 214113 57450 118578 -111418 162905 -308684 -134321
9785 -98657 -205498 27207 83082 -226675 -41942 82022 -258546 -169348 -47345 -154166 -11361
9773 125563 -124687 35796 -64547 -102642 -451939 118520 -2157 155639 -52842 97149 8127
9761 -392399 -34525 43175 -2266 -352107 249017 -67848 -169101 204742 -114797 205762 19112
9749 290146 -70624 -20893 119815 -90721 69069 -138370 17879 110031 -134245 69376 -13551
$$ packed form
9832a83657K2109I8287a01996r7888k7554A69056C4667b94870A5827a49230k6571
9821a75801e1546m203k25924f6552p9078k5764B00938e3347k16265L9454B16255
9809E5051J5669b0267A19472C5639a1695j07253d2256l16491H118f5257f294H3095
9796b28393b3251A50618b06966B14113E7450O1128a11418A62905c08684a34321
9785i8657j06841B7207N5875b26675d1942H2022b58546Q9198d7345j06821a1361
9773A25563a24687C5796f4547l8095l49297A18520b157A55639e2842I7149H127
9761c92399c4525D3175b266l49841B49017f7848j01253B04742a14797B05762A9112
9749B90146g0624b0893A19815i0721F9069a38370A7879R2152a34245F9376a3551
$$ plain form
9737 -193365 -319938 -11328 124290 -156390 87070 -121982 -10370 -55964 -149265 -64977 -321602
9726 -321602 111594 207075 -218112 121200 -77258 240361 276641 -417562 -52304 142726
9715 -110827 -195453 -129381 -177081 -51611 -96750 -347705 -400778 172647 35394 -539347 100780
9703 -109100 -237524 173866 139913 128862 174789 -221209 -32229 -63310 18284 -151463 131666
9691 118810 -129960 -211933 69495 -183727 199360 -916 -16973 -55273 -126772 -190562 -394848
9680 -394848 -15201 67039 -552004 -139641 -280548 -205892 -73485 -542537 214847 -378307
9669 -150797 -321543 -102594 70478 -20214 26192 -16564 27913 -185246 -161445 -216530 -105549
9657 -227241 158280 -256557 -329761 149193 109829 7444 -149806 107339 -158174 122066
$$ packed form
9737a93365j26573a1328A24290a56390H7070a21982a0370m5594r3301f4977k56625
9726c21602A11594R5481b18112A21200g7258B40361L6280d17562e2304A42726
9715a10827q4626O6072m7700e1611m5139k50955n3073A72647C5394e39347A00780
9703a09100j28424A73866l3953j1051M5927b21209c2229l1081A8284a51463A31666
9691A18810a29960q1973F9495a83727A99360i16j6057l8300p1499o3790k04286
9680c94848a5201F7039e52004a39641j40907P4656g3485m69052B14847c78307
9669a50797j70746a02594G0478b0214B6192a6564B7913a85246K3801n5085a05549
9657b27241A58280b56557p3204A49193l9364G444a49806A07339a58174A22066
$$ plain form
9646 -367863 -29632 78439 -94662 -117684 47991 -203118 -116960 81878 -251723 -287539 98357
9634 -21903 -80147 -264020 82414 13300 53592 47272 -304486 171676 7251 -43187 -314621
9623 -314621 86434 34910 -190078 -123146 -89345 -186720 -21570 -249742 60359 -219932 -76880
9611 -332745 150203 -39683 87773 -277942 -282967 -145443 -181680 47020 70897 -7910 -24857
9600 -24857 -83488 40006 70843 91987 -143973 -80130 5705 -113537 -234006 221269 -458183
9588 11544 -64962 -21606 248419 -197383 191282 -169465 -62481 -24902 17394 107700 110823
9577 110823 -345278 -298334 -573303 87329 -169972 -219253 41812 215224 57854 -265662 -294826
9566 -294826 -206665 -75600 -36533 110939 -183088 -244210 1175 -100975 71360 106286 306451
$$ packed form
9646c67863b9632G8439i4662k3022D7991b03118Q6158H1878b51723l5816I8357
9634b1903n8244j83873H2414A3300M0292o320c04486A71676G251d3187k71434
9623c14621H6434C4910a90078O6932L3801r7375b1570k28172F0359b19932g6880
9611c32745A50203c9683H7773b77942n025J37524l6237D7020K3877g910j6947
9600b4857n8631D0006L0837K1144a43973O3843E705a13537j20469B21269d58183
9588A1544f4962b1606B48419a97383A91282a69465f2481b4902A7394R0306L123
9577A10823c45278M6944k74969H7329a69972m9281D1812J73412E7854b65662k9164
9566b94826Q8161g5600c6533A10939a83088o1122A175a00975G1360L4926K00165
$$ plain form
9555 306451 10640 -99305 35133 -190800 -193533 123242 -178316 45623 76815 -20631 -65169
9544 -65169 68548 9943 -173846 -11186 -319196 48356 -128071 -133816 207277 -342383 -63799
9532 -109129 60570 395993 88807 115647 216023 -88736 -58628 -181776 -39712 501845 -241491
9520 -170672 -328460 -19983 -325144 25539 65499 -167141 -39973 225349 143345 861 -265 15572
9507 298442 -11300 71250 -142776 -46867 180703 -21114 -75542 -422448 -167834 -48513 -356668
9496 -356668 242302 77524 -52187 73623 -60792 26972 -1573 339628 -292827 244279 110849
9484 -327575 127390 310801 -18707 20494 -111257 -125965 -26989 -245389 44311 -24204 -154648
9473 -154648 -305729 85519 -175224 -242457 147636 -63000 136487 -207432 -40358 44115 -36096
$$ packed form
9555C06451A0640i9305C5133a90800k733A23242a78316D5623L1192b0631m4538
9544f5169F8548I943a73846a1186l08010D8356a28071n745B07277c42383f3799
9532a09129F0570L35423H8807K6840J00376h8736L0108j23148c9712E01845b41491
9520a70672j57788a9983l05161B5539L9960a67141c9973B25349q2004H61b65A5572
9507B98442a1300G1250a42776d6867A80703b1114n4428l46906a67834d8513l08155
9496c56668B42302G7524e2187G3623f0792B6972a573C39628b92827B44279A10849
9484c27575A27390J83411a8707B0494a11257j4708b6989k18400D4311b4204j30444
9473a54648j51081H5519a75224o7233A47636f3000A36487b07432d0358D4115c6096
$$ plain form
9461 58056 -352059 -152765 -295261 -56851 -18921 -109417 -104401 -196643 87504 -48274 -314143
9450 -314143 147189 -337581 -58137 -38513 -376607 74181 -250005 54126 16392 -93050 -103772
9439 -103772 -78625 171058 27239 -46496 -408947 -346494 -105794 158515 154210 84676 -257820
9427 -200842 28849 183916 -283528 -59704 52400 -70233 -104315 -26729 -30377 -111596 123417
9415 -105682 -19631 -208745 -448279 72645 -181333 288917 -164791 -21631 136416 35350
9404 74438 -341057 -162570 -165611 199303 259460 -200835 -85455 -250656 12938 -156595 -27681
9392 -180272 -27002 191158 -117331 -80141 -150368 -149460 -25484 -54994 433990 -153566 381426
9380 145324 -260199 68683 -30010 -251118 -11269 44896 -16875 -264391 -114208 410142 -130920
$$ packed form
9461E8056c52059a52765j42496e6851a8921r0496N016r2242H7504d8274k65869
9450c14143A47189c37581e8137J9624l38094G4181b50005E4126A6392i3050j0722
9439a03772K5147A71058B7239d6496l62451O2453a05794A58515m305o9534b57820
9427b00842B8849J55067b83528e9704E2400g0233l4082b6729l648q1219A23417
9415a05682a9631j89114k39534G2645a81333B88917a64791b1631A36416C5350
9404G4438c41057a62570l041A99303O0157b00835h5455j65201A2938a56595b7681
9392a80272b7002A91158a17331L7190p0227R08b5484k9510D33990a53566C81426
9380A45324b60199F8683c0010k21108a1269D4896a6875k47516a14208D10142a30920
$$ plain form
9368 -55954 -66005 -349536 -32293 67013 67582 -283671 -98735 -194228 -702 -21816 254032 -526949
9355 -296887 -208572 -57765 -58104 19666 -375866 -340209 -128953 -79516 83360 6150 -175503 -304644
9343 -304644 -64848 33196 360692 -326554 221711 136588 -343922 -40156 202655 20490 -211277
9331 -27170 95460 -174988 65355 32975 277302 403119 -281987 -109778 -254654 -41653 16362
9319 -86002 -196112 282028 -188011 138994 -481737 -371980 61961 770 -45131 -50808 -228573
9308 -228573 73960 -58012 -127885 -120263 -272083 206531 -36151 -433202 -106624 -225619 -457943
9297 -457943 254122 -270014 -159737 -35309 -235361 -103859 -62563 -226727 -83239 51611
9286 -417580 -4777 -50783 -60621 44913 27033 -53504 -217240 9153 -277604 9501 -101789 -163560
$$ packed form
9368e5954j0051k83531c2293F7013N69b83671i8735r5493g02k1114B54032e26949
9355b96887Q8315e7765l39A9666c75866L5657a28953M9437H3360F150a75503j29141
9343c04644f4848C3196L27496c26554B21711q5123c43922d0156B02655B0490b11277
9331b7170I5460a74988F5355l2380K44327J25817b81987a09778j44876d1653A6362
9319h6002j10110B82028a88011A38994d81737J09757F1961G70d5131n677j77765
9308b28573G3960e8012o9873P622j51820B06531c6151l97051a06624j18995k32324
9297d57943B54122b70014J10277c5309k00052a03859M1296j64164h3239E1611
9286d17580d777m6006r838D4913j7880e3504j63736I153b77604I501a01789o1771
$$ plain form
9274 -163560 -193246 -200242 312894 -277547 -212645 -319867 -349217 -271483 -80768 -535391 -12180
9262 23111 -277325 117709 188369 51360 133332 -292500 -159932 -300485 282561 379305 -82168
9250 -177810 69385 -100113 -235249 412116 -106216 -321545 21526 -12383 166145 -110486
9239 -132297 82796 168705 -46037 60063 -26684 -25082 -134639 134187 142891 -227538 -130189
9228 -130189 458758 -177706 -115253 53482 236550 284448 -123154 -161995 -159379 -119285 115774
9216 -545526 79995 -6527 20247 143151 -133389 -192767 21940 113062 -255950 -8504 -160669
9205 -160669 -135291 23336 137759 54427 -172602 -38398 57604 -43960 -26105 -38623 148767
9193 -419251 -28964 -78512 -255273 205664 -214343 -303723 89926 -57807 3212 -50960 -101013
$$ packed form
9274a63560k9686o996C12894b77547O4902j07222k9350P7734h0768m54623a2180
9262B3111b77325A17709P0660E1360Q1972b92500J32568j40553B82561R6744h2168
9250a77810F9385a00113j35136D12116a06216k15329B1526a2383A66145a10486
9239a32297H2796Q5909d6037F0063b6684J602j09557A34187Q704b27538R7349
9228a30189D58758a77706O2453E3482J83068M7898a23154l8841K616M0094A15774
9216e45526G9995f527B0247J22904a33389n9378B1940R1122b55950h504j52165
9205a60669K5378B3336J14423E4427a72602c8398E7604d3960J7855j2518A48767
9193d19251b8964m9548j76761B05664b14343q9380H9926e7807C212e0960n0053
$$ plain form
9182 -101013 -475602 -345138 107605 -201109 -12575 108244 -198507 -253199 280802 220848
9172 220848 -171083 151718 -5694 -117474 -54417 -80258 -46286 161535 -118679 -104119 141435
9160 -143816 -142141 -118174 -19036 -288368 -350096 -90992 -133190 -146960 57870 -100663 -269688
9149 -269688 -171108 -136005 45483 -31034 694 -40373 -74853 132132 10936 -272250 -263175 -170783
9137 -170783 84797 111701 222200 53311 -219000 161798 98829 133475 -3180 -376131 -177292
9125 -149077 -388201 43047 -198436 143266 -61567 39632 -195937 85033 99243 -150506 -18897
9113 -152071 -7741 -177349 -89457 -97146 73583 -148675 -101689 -117979 37151 161866 -548254
9101 21771 -99958 -190278 -38675 -416658 -88375 -190253 -127947 73281 -184381 188782 69982
$$ packed form
9182a01013l74589J30464A07605b01109a2575A08244a98507n4692B80802n9954
9172B20848a71083A51718e694j11780e4417k5841L3972A61535a18679J4560A41435
9160a43816J675K3967a9036k69332o1728i0992m2198j3770E7870a00663j69025
9149b69688R8580L5103D5483c1034F94d0373l4480A32132A0936b72250R075R2392
9137a70783H4797K6904J10499E3311b19000A61798o2969L4646c180l72951a77292
9125a49077k39124D3047a98436A43266f1567C9632a95937H5033J4210a50506a8897
9113a52071g741j69608Q7892p689G3583a48675M6986j6290C7151J24715e48254
9101B1771i9958r0320c8675l77983h8375j01878O2306G3281a84381A88782F9982
$$ plain form
9089 -258291 277269 -142362 -220257 -364396 176366 -85465 137626 148311 97588 -172572
9078 235658 -287500 -310963 -82354 61670 -113915 2597 -138545 -233718 17560 -365543 -25539
9066 3068 -119704 -111904 -38695 -96651 -120765 -220154 108089 -347766 -45620 229316 24773
9054 390015 -279798 27230 -141394 -88500 95924 -37721 -93504 4539 98512 -72328 -296182
9043 -296182 84090 -335810 -233392 20773 -293660 124776 191311 -393961 -251741 182483
9032 -248685 -32350 -93654 99475 45462 42358 -107848 -22165 -253785 -111384 -271046 -89248
9020 -217036 -73380 39345 211943 -263900 86658 246015 -69294 -46164 -174418 21657 -344552
9008 -85982 -124619 -8041 38532 123579 139953 437062 74846 -140418 -257285 -188941 -49893
$$ packed form
9089b58291B77269a42362p7895j44139A76366h5465A37626J0685n0723a72572
9078B35658b87500k3463h2354F1670a13915B597a38545r5173A7560c65543b5539
9066C068a19704P800c8695n7956k4114r9389A08089c47766d5620B29316B4773
9054C90015b79798B7230a41394N2894I5924c7721n5783D539R3973g2328k23854
9043b96182H4090c35810J02418B0773b93660A24776O6535c93961J42220A82483
9032b48685c2350o1304I9475D5462l104a07848b2165k31620a11384j59662h9248
9020b17036g3380C9345J72598b63900H6658J59357f9294K3130j28254B1657c44552
9008h5982l8637h041C8532Q5047J6374K97109G4846a40418j16867O8344d9893
$$ plain form
8996 -117102 -7584 -344765 -52514 13945 95616 100750 63197 -231775 -115716 -144238 -195265
8985 -195265 -207809 -323899 -259576 -88194 -193817 -90934 89506 -194329 -262963 -158781 -96803
8974 -96803 -206886 23179 -304005 -98281 181334 -51093 -18716 196904 -153158 -4713 18840
8962 288040 -15502 48931 -23886 -115515 -75703 97057 68395 -258787 -146187 134327 -191394
8950 11262 -97144 136794 -227136 13877 103537 -101862 -100229 -231994 -378422 69478 -374920
8938 95801 -222779 172831 51933 -43783 220782 -255376 4729 -138036 118377 24696 -100637
8926 -50756 -231116 257465 -200206 5280 369398 725340 560036 160960 1158 241395 795
8914 -153572 -187310 61342 -233363 161797 -113195 -188841 -93379 120199 -212292 199202
$$ packed form
8996a17102g584l37181e2514A3945Q1671N134l7553b31775a15716k8522n1027
8985a95265j2544j16090O4323h8194j05623i0934H9506a94329o8634J04182O1978
8974i6803j10083B3179c04005i8281A81334e1093a8716A96904a53158d713A8840
8962B88040a5502D8931b3886r1629L9812I7057k8662b58787J12600A34327a91394
8950A1262i7144A36794b27136A3877Q9660a01862J633j31765j46428F9478c74920
8938I5801b22779A72831E1933d3783B20782b55376D729a38036A18377B4696a00637
8926e0756j80360B57465b00206E280L64118L55942j65304A60960A158K40237G95
8914a53572l3738F1342b33363A61797a13195p5646i3379A20199b12292A99202
$$ plain form
8903 -7174 -14235 144587 55956 237868 -116810 5480 2925 291627 -128852 -434854 26174
8891 331071 237103 144929 124934 -168003 -84660 -20320 41984 -5095 11566 -38443 -125506 -303362
8879 -303362 -458952 -41470 127564 -23925 52007 436654 -215717 -112932 93330 -197988
8868 -243585 216832 -97089 -209142 12876 14611 -173666 -34259 -411170 79425 -13273 230825
$$ packed form
8903g174p061A44587E5956J81912a16810E480k555K88702a28852l06002B6174
8891C31071r3968r2174j9995a68003Q3343b0320D1984e095A1566c8443q7063j77856
8879c03362j55590d1470A27564b3925E2007L84647b15717J02785I3330a97988
8868b43585B16832i7089j12053A2876J735a73666c4259l76911G9425a3273B30825
$$ [...]
##END NTUPLES=NMR SPECTRUM
##END=
