##TITLE=AC1728_SEN00001_9274204_Mng1pFnGc1
##JCAMPDX= 6.0         $$ Bruker NMR JCAMP-DX V2.0
##DATA TYPE= NMR SPECTRUM
##DATA CLASS= NTUPLES
##ORIGIN= BRUKER
##OWNER= Administrator
$$ 1.72 TOPSPIN		Version 2.1
$$ 2015-07-14 17:44:27.713 -0700  Administrator@X
$$ Compression mode = diff/dup
##.OBSERVE FREQUENCY= 400.02188249412
##.OBSERVE NUCLEUS= ^1H
##.ACQUISITION MODE= SIMULTANEOUS (DQD)
##.ACQUISITION SCHEME= undefined
##.AVERAGES= 8
##.DIGITISER RES= 22
##SPECTROMETER/DATA SYSTEM= spect
##.PULSE SEQUENCE= zg30
##.SOLVENT NAME= COFFEE_meoh
##.SHIFT REFERENCE= INTERNAL, COFFEE_meoh, 1, 14.98509
##AUDIT TRAIL= $$ (NUMBER, WHEN, WHO, WHERE, PROCESS, VERSION, WHAT)
$$ ##TITLE= Audit trail, TOPSPIN		Version 2.1
$$ ##JCAMPDX= 5.01
$$ ##ORIGIN= Bruker BioSpin GmbH
$$ ##OWNER= Administrator
$$ $$ E:\/data/COFFEE/nmr/AC1728_SEN00001_9274204_Mng1pFnGc1/10/pdata/1/auditp.txt
$$ ##AUDIT TRAIL=  $$ (NUMBER, WHEN, WHO, WHERE, PROCESS, VERSION, WHAT)
(   1,<2015-07-14 17:44:20.510 -0700>,<Administrator>,<X>,<go>,<TOPSPIN 2.1>,
      <created by zg
	started at 2015-07-14 17:43:14.619 -0700,
	POWCHK enabled, PULCHK disabled,
       configuration hash MD5:
       21 0F 79 D6 B3 7B B4 F6 88 20 88 DB 03 48 BD 9F
       data hash MD5: 64K
       FF 2D 70 7F D8 58 CA 3F BF 5F F7 93 B5 2D 29 3E>)
(   2,<2015-07-14 17:44:23.635 -0700>,<Administrator>,<X>,<proc1d>,<TOPSPIN 2.1>,
      <Start of raw data processing
       efp LB = 0 FT_mod = 6 PKNL = 1 PHC0 = 0 PHC1 = 0 SI = 32K 
       data hash MD5: 32K
       13 BF 8B EA C3 47 CD 51 55 05 AD ED B7 61 DE D3>)
(   3,<2015-07-14 17:44:23.932 -0700>,<Administrator>,<X>,<proc1d>,<TOPSPIN 2.1>,
      <pk PHC0 = 91.46118 PHC1 = 0 
       data hash MD5: 32K
       D7 47 D3 77 F2 67 A6 58 FD 9B 26 93 1D D8 0D 5B>)
(   4,<2015-07-14 17:44:24.025 -0700>,<Administrator>,<X>,<proc1d>,<TOPSPIN 2.1>,
      <abs ABSG = 1 
       data hash MD5: 32K
       49 F2 6B 44 09 0A 00 E5 66 4D 08 4D 1E 54 54 E1>)
(   5,<2015-07-14 17:44:24.088 -0700>,<Administrator>,<X>,<proc1d>,<TOPSPIN 2.1>,
      <abs ABSG = 2 
       data hash MD5: 32K
       95 BC EC E5 5D C5 14 1B 5F FA 01 C3 0D 0D 8B 52>)
(   6,<2015-07-14 17:44:24.150 -0700>,<Administrator>,<X>,<proc1d>,<TOPSPIN 2.1>,
      <abs ABSG = 3 
       data hash MD5: 32K
       9A 01 FE A8 92 05 04 C1 6F F3 E5 8F ED 87 5A E5>)
(   7,<2015-07-14 17:44:24.213 -0700>,<Administrator>,<X>,<proc1d>,<TOPSPIN 2.1>,
      <abs ABSG = 4 
       data hash MD5: 32K
       2A C6 A5 34 2B 2C 96 82 D7 63 43 C8 F3 A1 6F A2>)
(   8,<2015-07-14 17:44:24.275 -0700>,<Administrator>,<X>,<proc1d>,<TOPSPIN 2.1>,
      <abs ABSG = 5 
       data hash MD5: 32K
       6D 01 A1 72 34 35 F6 D6 AC 96 65 03 E3 B3 F1 E8>)
$$ ##END=
$$ 
$$ $$ hash MD5
$$ $$ 9D 3C 3C 35 93 9C 23 26 0B 54 61 F1 B5 9E 30 BC
##$RELAX= 
##$RELAX= 
##$RELAX= 
##$RELAX= 
##$RELAX= 
##$RELAX= 
##$RELAX= 
$$ Bruker specific parameters
$$ --------------------------
##$DU= <E:\>
##$EXPNO= 10
##$NAME= <AC1728_SEN00001_9274204_Mng1pFnGc1>
$$ [...]
150 150 150 150 150 150 150 150
##$TP07= 0
##$TPNAME0= <>
##$TPNAME1= <>
##$TPNAME2= <>
##$TPNAME3= <>
##$TPNAME4= <>
##$TPNAME5= <>
##$TPNAME6= <>
##$TPNAME7= <>
##$TPOAL= (0..7)
0.5 0.5 0.5 0.5 0.5 0.5 0.5 0.5
##$TPOFFS= (0..7)
0 0 0 0 0 0 0 0
##$TUNHIN= 0
##$TUNHOUT= 0
##$TUNXOUT= 0
##$USERA1= <user>
##$USERA2= <user>
##$USERA3= <user>
##$USERA4= <user>
##$USERA5= <user>
##$V9= 5
##$VALIST= <valist>
##$VCLIST= <CCCCCCCCCCCCCCC>
##$VD= 0
##$VDLIST= <DDDDDDDDDDDDDDD>
##$VPLIST= <PPPPPPPPPPPPPPP>
##$VTLIST= <TTTTTTTTTTTTTTT>
##$WBST= 2048
##$WBSW= 25
##$XGAIN= (0..3)
0 0 0 0
##$XL= 0
##$YL= 0
##$YMAX_a= 609148
##$YMIN_a= -521977
##$ZGOPTNS= <>
##$ZL1= 120
##$ZL2= 120
##$ZL3= 120
##$ZL4= 120
##$ABSF1= 14.98509
##$ABSF2= -5.573092
##$ABSG= 5
##$ABSL= 3
##$ALPHA= 0
##$AQORDER= 0
##$ASSFAC= 0
##$ASSFACI= 0
##$ASSFACX= 0
##$ASSWID= 0
##$AUNMP= <proc_prof1d_extract_pilot.lims>
##$AXLEFT= 0
##$AXNAME= <>
##$AXNUC= <1H>
##$AXRIGHT= 0
##$AXTYPE= 0
##$AXUNIT= <>
##$AZFE= 0.1
##$AZFW= 0.1
##$BCFW= 0
##$BC_mod= 0
##$BYTORDP= 0
##$COROFFS= 0
##$CY= 15
##$DATMOD= 1
##$DC= 0
##$DFILT= <>
##$DTYPP= 0
##$F1P= 0
##$F2P= 0
##$FCOR= 0.5
##$FTSIZE= 32768
##$FT_mod= 6
##$GAMMA= 0
##$GB= 0
##$INTBC= 1
##$INTSCL= 1
##$ISEN= 128
##$LB= 0
##$LEV0= 0
##$LPBIN= 0
##$MAXI= 10000
##$MC2= 0
##$MEAN= 0
##$ME_mod= 0
##$MI= 0
##$NCOEF= 0
##$NC_proc= -8
##$NLEV= 6
##$NOISF1= 0
##$NOISF2= 0
##$NSP= 0
##$NTH_PI= 0
##$NZP= 0
##$OFFSET= 14.98509
##$PC= 1
##$PHC0= 91.46118
##$PHC1= 0
##$PH_mod= 1
##$PKNL= yes
##$PPARMOD= 0
##$PPDIAG= 0
##$PPIPTYP= 0
##$PPMPNUM= 2147483647
##$PPRESOL= 1
##$PSCAL= 4
##$PSIGN= 0
##$PYNMP= <proc.py>
##$REVERSE= no
##$SF= 400.02
##$SI= 32768
##$SIGF1= 0
##$SIGF2= 0
##$SINO= 400
##$SIOLD= 32768
##$SPECTYP= <>
##$SREGLST= <1H.CDCl3>
##$SSB= 0
##$STSI= 32768
##$STSR= 0
##$SW_p= 8223.68421052631
##$SYMM= 0
##$S_DEV= 0
##$TDeff= 65536
##$TDoff= 0
##$TI= <>
##$TILT= no
##$TM1= 0
##$TM2= 0
##$TOPLEV= 0
##$USERP1= <user>
##$USERP2= <user>
##$USERP3= <user>
##$USERP4= <user>
##$USERP5= <user>
##$WDW= 1
##$XDIM= 32768
##$YMAX_p= 444701078
##$YMIN_p= -656197
##$CURPLOT= <Network HP LaserJet P1505>
##$CURPRIN= <$Network HP LaserJet P1505>
##$DFORMAT= <normdp>
##$LAYOUT= <+/1D_H.xwp>
##$LFORMAT= <normlp>
##$PFORMAT= <normpl>
##$SURQMSG= 1
$$ End of Bruker specific parameters
$$ ---------------------------------
##NTUPLES= NMR SPECTRUM
##VAR_NAME=  FREQUENCY,     SPECTRUM/REAL,   SPECTRUM/IMAG
##SYMBOL=    X,             R,               I
##VAR_TYPE=  INDEPENDENT,   DEPENDENT,       DEPENDENT
##VAR_FORM=  AFFN,          ASDF,            ASDF
##VAR_DIM=   32768,         32768,           32768
##UNITS=     HZ,            ARBITRARY UNITS, ARBITRARY UNITS
##FACTOR=    0.250966925370066, 1,           1
##FIRST=     8223.43324360094, -117150,      -75841
##LAST=      0,             59443,           -118707
##MIN=       0,             -656197,         0
##MAX=       8223.43324360094, 444701078,    0
$$ Real data points
##PAGE= N=1
##DATA TABLE= (X++(R..R)), XYDATA
$$ [...]
$$ plain form
19546 -118732 151535 121610 -176802 -57391 -107374 67416 264472 251994 -282308 -200241 -352766
19535 -352766 -398653 -28487 94252 112336 53407 47176 7740 -276909 -51166 -32217 -295500
19524 -295500 -404768 -9667 28105 107050 24301 -250094 -29987 15456 -276863 -219226 244051
19512 -50082 -52252 29038 -99829 227196 -42876 622 -18126 176573 -72619 -312894 -49879 8092
19499 -148994 96852 -166600 43118 -144908 9525 34285 149156 -325934 -150158 37932 50956
19488 50956 -249188 -469711 -2150 62549 26376 38195 216638 -84157 171766 -19552 -228510
19477 -228510 98065 94841 -91291 -194971 -60372 126706 -128188 184195 4737 -82051 -2637
19465 -229657 -52279 1408 6929 -118717 -116018 -163786 -76057 -172472 42525 6029 -90987 -198097
$$ packed form
19546a18732A51535k9925a76802e7391m9983F7416J97056j2478b82308Q2067j52525
19535c52766m5887b8487I4252J8084E3407o231G740b76909e1166J8949k63283
19524b95500j09268i667B8105P8945B4301b50094b9987A5456b76863N7637B44051
19512e0082k170B9038i9829B27196d2876F22a8126A76573g2619k40275d9879H092
19499a48994I6852a66600D3118a44908I525K4760J14871c25934a50158C7932J3024
19488E0956b49188k20523b150F2549B6376J1819J78443h4157A71766a9552k08958
19477b28510I8065l224i1291j03680f0372A26706a28188A84195D737h2051b637
19465b29657e2279A408N521a18717K699m7768g6057r6415D2525F029i0987j07110
$$ plain form
19453 -198097 26637 48541 -159707 22477 -219840 103857 -47180 147043 -275650 -9263 -117563
19442 -117563 -74449 243603 -151951 7522 -190606 79704 33831 -188106 -4526 -140601 -396030
19431 -396030 -4896 -142315 76258 93919 -238885 84000 -176841 -158431 319962 56177 -20440
19419 -122397 -150019 14015 -17454 -31632 134892 -40551 -43090 -239323 -39948 68067 65924
19408 65924 -96769 301484 87430 57260 -63700 -280695 179238 -228534 -341517 44162 226777
19397 226777 155294 114204 62902 -254472 -328045 -218236 117195 274802 72119 -17536 -8084
19385 -92863 -304599 -307685 -158771 -154246 -132215 -253026 -367698 82603 269462 -80721 250025
19373 -166905 -48518 149010 -372187 125890 -11499 -11591 -69876 104351 30329 -176468 -120936
$$ packed form
19453a98097B6637K1904a59707B2477b19840A03857d7180A47043b75650i263j08300
19442a17563M3114B43603a51951G522a90606G9704C3831a88106d526j36075k55429
19431c96030d896j37419G6258J7661b38885H4000a76841J8410C19962E6177b0440
19419a22397k7622A4015a7454j4178A34892d0551k539j96233c9948F8067k143
19408F5924i6769C01484H7430l0170f3700k16995A79238b28534j12983D4162J82615
19397B26777p1483m1090n1302b54472p3573J09809A17195J57607G2119a7536h084
19385i2863k11736l086J48914M525K2031j20811j14672H2603J86859h0721B50025
19373a66905d8518A49010c72187A25890a1499r2n8285A04351C0329a76468N5532
$$ plain form
19362 -120936 -81510 -208798 -378055 -31803 -19717 201278 -190165 75439 -341245 -354134
19352 -354134 -87352 -157479 -93336 -74850 109601 -134148 -74051 -20649 85419 60230 28902
19340 -40559 -192985 298723 109731 -157040 -140189 -27539 -240277 2280 -68102 275305 317901
19329 317901 407521 73315 -45919 101826 -200517 187221 -209627 196888 208452 119035
19319 119035 145032 -92828 -303773 224131 -27304 138493 -92734 -291545 69867 -106392
19308 -155916 -123345 -189579 -85074 -100827 -79186 -37487 82844 -116872 21165 -156440 -198022
19297 -198022 -49335 63070 169142 -149126 -91373 -297840 -328398 298739 -87612 -329432
19287 -329432 -36161 53045 -191412 -110878 -379647 68034 -42987 100798 -437839 133340
$$ packed form
19362a20936L9426j27288j69257c1803J2086B01278a90165G5439c41245j2889
19352c54134h7352p0127O4143J8486A09601a34148O0097b0649H5419k5189B8902
19340d0559j52426B98723A09731a57040J6851b7539k12738B280f8102B75305M2596
19329C17901Q9620G3315d5919A01826b00517A87221b09627A96888J1564q9417
19319A19035K5997i2828k10945B24131b7304A38493i2734j98811F9867a06392
19308a55916L2571o6234h5074j5753K1641c7487H2844a16872B1165a56440m1582
19297a98022d9335F3070J06072a49126N7753k06467l0558B98739h7612k41820
19287c29432c6161E3045a91412Q0534k68769F8034d2987A00798d37839A33340
$$ plain form
19276 -25124 75825 78728 115525 -88378 163562 -135916 -387200 27689 -98410 -320042 -177843
19265 -177843 -456174 52951 -6643 -17612 -12696 -74947 -54290 109463 249358 -129461 -142321
19254 -142321 -366877 -186242 -359415 130772 -35252 -250274 -69029 -134387 121258 -161099
19243 -236017 117268 -197921 61771 -109561 79659 -274531 20512 -5457 218119 -217961
19232 -365744 -160674 -167285 98422 -280686 -249448 -174183 -106778 -170444 -185100 96325 -234771
19220 -243670 -131091 260646 213619 -90370 235942 350836 75878 -131935 11688 276156
19210 276156 -471542 153831 -157564 -433640 -207517 53613 -80781 241956 -32342 -165240
19200 -165240 -3445 -334916 209993 -180631 -409870 -103137 151697 71341 346805 234469
$$ packed form
19276b5124G5825K903L6797h8378A63562a35916k51284B7689i8410k21632J42199
19265a77843k78331E2951f643j0969M916o2251K0657A09463J39895a29461j2860
19254a42321k24556J80635j73173A30772c5252k15022f9029o5358A21258a61099
19243b36017A17268a97921F1771a09561G9659b74531B0512e457B18119b17961
19232c65744a60674o611I8422b80686L1238P5265O7405o3666j4656I6325b34771
19220b43670J12579B60646m7027i0370B35942J14894G5878a31935A1688K64468
19210B76156d71542A53831a57564k76076b07517E3613h0781B41956c2342j32898
19200a65240c445l31471B09993a80631k29239a03137A51697G1341K75464j12336
$$ plain form
19190 234469 -147050 -237529 102185 -162521 25401 91635 -487476 49356 4322 -76021 -33646
19178 -29469 -32562 72529 157583 4978 -157666 146561 -41446 41608 -274329 -50626 -203506
19167 -203506 95275 -127294 -363537 -100004 7413 184450 -84143 -214728 -194134 43600 -235690
19155 -142784 -18614 -104127 -166952 74716 -227380 -33269 -189400 -47076 329206 151517 -139512
19143 -245139 -75236 -82778 -226882 258935 139363 73 -201628 -121433 29525 -170666 41100
19131 140282 -32871 26604 -47006 -28152 114157 -176746 -377335 155663 279401 21072
19120 -104461 -150872 -107892 272237 68239 180907 -127484 -217843 -51162 -73942 11471 -77180
19108 27169 -9082 53309 -159496 -209615 -104997 -278427 -269657 -235077 -158138 -133650 85049
$$ packed form
19190B34469a47050r0479A02185a62521B5401O6234d87476D9356D322g6021c3646
19178b9469l093G2529Q5054D978a57666A46561d1446D1608b74329e0626j52880
19167b03506I5275a27294k36243a00004G413J77037h4143j30585K0594D3600b35690
19155a42784a8614q5513o2825G4716b27380c3269j56131d7076C29206A51517a39512
19143b45139g5236p542j44104B58935j19572G3b01628Q0195B9525a70666D1100
19131A40282c2871B6604d7006J8854A14157a76746k00589A55663J23738B1072
19120a04461m6411M2980B72237F8239J12668a27484r0359e1162k2780A1471g7180
19108B7169i082E3309a59496n0119J04618j73430Q770L4580P6939K4488H5049
$$ plain form
19096 41776 292202 362256 -47867 90056 26409 268024 -196659 6056 -90909 -97655 199020
19084 -263758 -20108 -164588 17238 -177128 -149946 -123374 34901 154409 -185747 72135 -49571
19072 -40900 14230 -248630 -336457 125568 -115130 -267092 -175301 -295689 351412 -114786
19061 -102343 -36175 -154457 22184 -37740 11951 58368 -8780 -63366 -296482 48991 258284
19050 258284 179099 -198678 -114312 8267 -408497 -3523 138515 -117171 39144 -31132 -35427
19039 -35427 -244165 -6124 78181 -281253 -15492 -112274 -90168 321779 -162623 257489 -64176
19027 -198279 -215703 327549 -227197 394551 -75312 64313 226366 329989 -215584 217178
19016 321887 15578 -45467 -32057 31242 -78755 109134 -176245 -148967 179671 57346 202714
$$ packed form
19096D1776K50426P0054d7867I0056B6409K41615a96659F056i0909o746A99020
19084b63758b0108j44480A7238a77128K7182K6572C4901J19508a85747G2135d9571
19072d0900A4230b48630q7827A25568a15130j51962R1791j20388C51412a14786
19061a02343c6175j18282B2184c7740A1951M6417h780n4586k33116D8991K09293
19050B58284p9185a98678Q4366H267d08497c523A38515a17171C9144c1132m295
19039c5427k08738f124G8181b81253a5492r6782K2106C21779a62623B57489f4176
19027a98279j7424C27549b27197C94551g5312F4313J62053J03623b15584B17178
19016C21887A5578d5467J3410C1242g8755A09134a76245K7278A79671E7346J45368
$$ plain form
19005 202714 -136417 131116 -6779 285208 -70 156503 73338 1574 -105813 -253712 78829
18993 -294686 -196077 -183288 -260313 354243 74523 8763 -254774 1619 -126904 -2639 -220267
18982 -220267 166116 179020 31544 -235515 -60612 -13408 -36344 -22417 134083 180823 -399808
18970 -50032 180907 8538 -94243 125697 68410 353255 238178 164560 -13269 40299 169832
18959 169832 -236892 -57095 -86027 -2154 -134799 -162176 418011 -12772 157406 -163520 149355
18947 -239345 -71681 -68004 -409566 86962 56172 -75803 -65236 108294 -4874 -25043 -137825
18936 -137825 -225973 -261564 81147 -2339 -347767 -59831 -63557 173942 29139 53585 116623
18925 116623 -137651 51627 -48109 -79546 74465 -169422 -42263 -122831 -266751 -157533 -247323
$$ packed form
19005B02714a36417A31116f779B85208g0A56503G3338A574a05813j47899G8829
18993b94686R8609J2789p7025C54243G4523H763b54774A619a26904b639k17628
18982b20267A66116J2904C1544b35515f0612a3408k2936J3927A34083M6740c99808
18970e0032A80907H538i4243A25697n7287K84845j15077p3618a3269D0299J29533
18959A69832b36892e7095k8932b154j32645k7377D18011a2772A57406a63520A49355
18947b39345g1681L677l41562H6962l0790g5803J0567A08294d874k0169j12782
18936a37825q8148l5591H1147b339l45428e9831l726A73942B9139K4446O3038
18925A16623a37651E1627d8109l1437G4465a69422d2263q0568j43920J09218q9790
$$ plain form
18914 -247323 171654 197709 -75118 -89437 119443 -175888 -173354 -141599 -336811 -286749 99871
18902 -219778 267409 -120851 -68873 68151 164603 -165221 -309571 -66151 52974 -255348
18891 33333 -55538 -331453 -325335 -85567 -19615 -207346 46917 75084 -205948 6931 -135181
18879 13586 -59805 -180242 277933 134167 25514 -27480 -31798 195757 -53094 172417 19554
18867 -324313 16647 -77810 19818 -93065 151058 -15121 -133035 238334 -105981 -51248 -122631
18856 -122631 97899 20931 178560 -99930 46302 235870 56849 21975 -57872 -72459 -51223
18845 -51223 -109460 103733 46023 -76318 -154969 -120515 -53543 222976 -195824 121399 -166760
18833 -326658 -115987 -40357 -364688 214857 -34613 20905 -22787 40632 -81485 -137836 191074
$$ packed form
18914b47323A71654K6055g5118j4319A19443a75888K534L1755j95212N0062I9871
18902b19778B67409a20851N1978F8151R6452a65221j44350f6151E2974b55348
18891C3333e5538k75915O118h5567a9615j87731D6917K8167b05948F931a35181
18879A3586e9805j20437B77933A34167B5514b7480m318A95757e3094A72417A9554
18867c24313A6647g7810A9818i3065A51058a5121j17914B38334a05981e1248p1383
18856a22631I7899B0931J57629i9930D6302J89568E6849B1975e7872j4587K1236
18845e1223n8237A03733D6023g6318p8651L4454e3543B22976a95824A21399a66760
18833c26658a15987d0357l24331B14857c4613B0905b2787D0632h1485n6351A91074
$$ plain form
18821 38013 -69797 -79936 180255 277730 30648 -3697 -184152 163411 322358 -180833 256049
18809 364348 688 56910 175043 15690 -181638 19183 -231240 23612 -91782 -371389 -77086
18797 -21642 -62141 -9716 118323 -108196 175248 121902 -167622 91500 -174631 -178350 -492783
18786 -492783 98875 63865 -525422 131086 -108137 -3737 -54846 -352472 -242441 70261 -128230
18774 -187038 80287 -214228 -253916 -115052 -216981 -26042 -142034 -266027 -137358 -396850
18764 -396850 75813 -73663 -113304 53611 132137 77105 -156342 -360780 -115062 -31246 55646
18752 202600 69216 -1286 192648 -139728 309746 239578 62631 90901 -45144 -143883 -143616
18741 -143616 -235061 119598 -429217 88438 -33364 -176417 -122748 -101520 43161 -347100 -177909
$$ packed form
18821C8013f9797j0139A80255R7475C0648c697j80455A63411J58947a80833B56049
18809C64348F88N6222J18133A5690a81638A9183b31240B3612i1782k79607g7086
18797b1642m0499i716A18323a08196A75248n3346a67622I1500a74631l719l14433
18786d92783I8875l5010e25422A31086a08137c737n1109k97626J10031G0261a28230
18774a87038H0287b14228l9688a15052j01929b6042j15992j23993J28669k59492
18764c96850G5813g3663l9641E3611P8526n5032a56342k04438a15062c1246E5646
18752B02600F9216a286A92648a39728C09746p0168F2631K8270d5144r8739K67
18741a43616r1445A19598d29217H8438c3364j43053N3669K1228D3161c47100J69191
$$ plain form
18730 -177909 -91893 38641 178414 5336 -158548 -305881 66887 -255711 -263812 -146668 -292228
18719 -292228 83041 61094 103631 238118 -161970 17326 12537 -102451 2415 -225792 -14976
18707 -104344 159973 -52250 -59794 120275 -73200 -395816 -176817 219948 42433 -105381
18696 380324 -136341 83728 -195874 -153838 -5707 -248146 -41163 -120352 47280 -31590 -71064
18685 -71064 -78822 173711 -161626 -168542 -392116 156363 111604 123618 -136358 -77702 -79854
18674 -79854 141152 -199015 117727 -35603 28236 9500 -162117 -115750 -257901 -167682 -199050
18663 -199050 -167011 -180836 144573 31504 -42584 -135377 -35643 35580 -113320 179011 -187086
18651 -239721 69520 128635 -192594 -303906 126162 -34253 -241696 48402 -226304 -129309
$$ packed form
18730a77909Q6016C8641J39773E336a58548j47333F6887b55711q101J17144j45560
18719b92228H3041k1947M2537J34487a61970A7326m789a02451B415b25792a4976
18707a04344A59973e2250p544A20275g3200l22616a76817B19948D2433a05381
18696C80324a36341H3728a95874M2036e707k42439d1163p9189D7280c1590l9474
18685g1064p758A73711a61626o916k23574A56363m4759J2014a36358N8656k152
18674g9854A41152a99015A17727c5603B8236I500a62117M6367j42151R0219l1368
18663a99050L2039j3825A44573C1504d2584r2793c5643C5580a13320A79011a87086
18651b39721F9520N9115a92594j11312A26162c4253k07443D8402b26304R6995
$$ plain form
18641 -129309 -193081 -56859 95123 -356815 -45421 64915 -279879 -107382 85303 -383486 40100
18629 -200520 -172111 192720 80156 -162363 -375427 -80960 -99082 298643 -13992 323732
18618 -6246 -313995 -28410 266338 -357557 -488328 259176 -164239 30919 -263560 78528
18607 -92426 -241653 -406199 231799 -215992 -99274 218561 104461 139748 42766 -74879
18596 -216496 -246226 -97980 -52058 -244323 98286 -50802 323995 26855 96400 301179 -6514
18584 143033 10576 2855 -322003 56416 -113171 -11949 -275238 143816 -69768 -232205 190360
18572 -259360 -23229 128649 -162797 -44883 -40689 -95748 -277376 -203547 -123944 51507 -69947
18560 -58040 134746 1947 60987 14798 -93688 133487 -126090 -12650 -617272 -273950 76323
$$ packed form
18641a29309o3772e6859I5123c56815d5421F4915b79879a07382H5303c83486D0100
18629b00520K8409A92720H0156a62363k13064h0960j8122B98643a3992C23732
18618f246l07749b8410B66338c57557j30771B59176a64239C0919b63560G8528
18607i2426j49227j64546B31799b15992i9274B18561A04461L5287D2766g4879
18596b16496k9730i7980M5922j92265I8286e0802C23995B6855O9545K04779f514
18584A43033A0576B855c22003E6416a13171a1949k63289A43816f9768j62437A90360
18572b59360b3229A28649a62797d4883M194n5059j81628P3829P9603E1507f9947
18560e8040A34746A947N9040A4798i3688A33487a26090a2650o04622b73950G6323
$$ plain form
18548 -108941 -31813 -45356 -104918 231154 -33351 -89159 130995 243243 -80854 -285482 -211999
18537 -211999 -86483 -238672 -52960 -213974 13023 289571 208049 -103361 35968 -81715 90965
18525 -258765 -337159 199468 64835 108929 -302164 -208736 14360 -279686 65878 95255 -377630
18513 -21155 -214214 54981 -223415 9071 200224 4359 -140791 -42547 -204640 27430 -256860
18501 -122521 100282 -175420 -79001 23521 -162697 -77624 -268343 260600 218620 65280
18490 -264094 156927 155137 -197677 -121140 10973 -321536 -406426 77212 129592 -145380 -44024
18478 -263305 44341 263754 -196007 -183609 7282 321663 25703 20546 -174183 -147383 -55533
18466 57609 -109079 -195311 -149181 19439 -134384 -68889 -59810 -59715 -200143 -154876 -340181 -246902
$$ packed form
18548a08941c1813j3543n9562B31154c3351n5808A30995J12248h0854k04628P3483
18537b11999h6483j52189e2960j61014A3023K76548q1522a03361C5968h1715I0965
18525b58765p8394A99468F4835M4094c02164R3428A4360b79686F5878K9377c77630
18513b1155j93059E4981b23415I071J91153D359a40791d2547j62093B7430b56860
18501a22521A00282a75420g9001B3521a62697g7624j90719B60600m1980F5280
18490b64094A56927j790a97677P6537A0973c21536q4890G7212N2380a45380d4024
18478b63305D4341K19413a96007J2398G282L14381B5703n157a74183K6800e5533
18466E7609a09079q6232M6130A9439a34384O5495R079R5j40428M5267j85305R3279
$$ plain form
18454 -246902 39505 -67558 42057 270515 -127742 -132672 311369 -13468 -83877 -141560 47258
18442 124111 -144097 -65826 -282966 36893 -67152 -201709 -12500 -133374 -60650 201311
18431 -54535 66072 -28557 -11242 -198416 -89914 -199373 353718 73161 -161217 -221682 -141513
18420 -141513 -47446 -202138 -23250 237213 -149446 -310356 -331413 -137027 235386 -139789
18409 -156502 -170121 123732 16736 -150293 -312114 -119430 81601 -72415 117377 -26904
18398 -203699 -101471 194899 -186411 -74872 105166 -8302 -187305 288888 115540 -105447
18387 -286788 243621 -122653 212278 -174957 -53611 -143466 -182774 -264193 223283 46761
18376 -245139 -38930 20781 54007 268824 -154884 -114421 82998 -259076 -379439 255107
$$ packed form
18454b46902C9505f7558D2057K28458a27742m930C11369a3468p0409n7683D7258
18442A24111a44097f5826k17140C6893f7152j34557a2500j20874f0650B01311
18431e4535F6072b8557a1242j87174h9914j09459C53718G3161a61217o0465Q0169
18420a41513d7446j54692b3250B37213a49446j60910k1057a37027B35386a39789
18409a56502j3619A23732A6736a50293j61821a19430H1601g2415A17377b6904
18398b03699a01471A94899a86411g4872A05166h302j79003B88888A15540a05447
18387b86788B43621a22653B12278a74957e3611q9855l9308q1419B23283D6761
18376b45139c8930B0781L3226K14817a54884M0463H2998b59076j20363B55107
$$ plain form
18365 158778 234344 161426 81161 96154 -423870 400316 162410 209887 24686 -343269 -284383
18354 -284383 -179897 -71302 -184578 72175 -305583 8079 -64246 -360096 -116060 -257259
18344 -257259 -75986 -187762 -19003 205737 -161706 23188 201572 -265 205983 155698 135446
18333 135446 -79048 -13701 98668 83714 286074 298738 -405346 -335221 -128419 -195717 149832
18321 -174062 -33035 -68791 -313217 149013 -65745 -282636 183356 -151433 98303 250187
18311 250187 -213191 163997 135235 174566 62014 -116085 -394246 -2490 -10728 36055 -83033
18299 -35701 18668 185264 24382 223980 -24478 -67067 -244101 136865 -178390 109685
18288 -187330 75891 68188 -63734 -13522 55681 -42346 -237136 166101 -234919 64905 135677
$$ packed form
18365A58778P5566p2918q0265J4993d23870D00316A62410M7477B4686c43269N8886
18354b84383J04486g1302j13276G2175c05583H079f4246k95850a16060j41199
18344b57259g5986j11776a9003B05737a61706B3188J78384b65B05983n0285k0252
18333A35446g9048a3701I8668j4954K02360J2664d05346P0125a28419o7298A49832
18321a74062c3035l5756k44426A49013f5745k16891A83356a51433I8303J51884
18311B50187b13191A63997k8762L9331F2014a16085k78161b490q238C6055h3033
18299c5701A8668J66596B4382J99598b4478m2589j77034A36865a78390A09685
18288a87330G5891p703f3734a3522E5681d2346j94790A66101b34919F4905P0772
$$ plain form
18277 135677 -91904 176360 214720 -50544 163071 -13528 329425 -30756 64024 -2179 -326118
18266 -326118 -162078 86322 -39241 -108864 228682 -156522 -50701 -201703 -217874 -194753 26620
18254 60388 -51945 82087 -35987 -373777 -36372 73097 -289330 -24658 71032 136094 -242103
18242 43372 -126177 -13130 -179769 -174232 -229852 33082 -182682 93776 -185284 -70734 -41074
18231 -41074 -113168 -52582 -209560 -239717 -245075 -199797 51883 188967 -184921 225259 -41816
18219 353309 -289932 -140828 115331 63281 326744 264142 -16036 -23048 -25107 -93835 -230901
18208 -230901 -116097 -341804 261732 -102827 67584 32404 -75859 -265276 -25994 130953
18197 -92735 81146 92176 63770 -338699 -413716 -56696 311958 176359 -561113 -301593 129468
$$ packed form
18277A35677i1904A76360L8360e0544A63071a3528C29425c0756F4024b179l23939
18266c26118a62078H6322c9241o9623B28682a56522e0701j51002j6171K3121B6620
18254F0388e1945H2087c5987l37790c6372G3097b89330b4658G1032O5062b42103
18242D3372a26177a3130j66639N537n5620C3082a82682I3776a85284g0734K9660
18231d1074p2094e2582j56978l0157n358M5278E1883J37084a84921B25259d1816
18219C53309b89932a40828A15331n2050K63463o2602a6036p012k059o8728j37066
18208b30901J14804k25707B61732a02827F7584C2404g5859j89417b5994A30953
18197i2735H1146J1030k8406c38699p5017e6696C11958j35599e61113K59520A29468
$$ plain form
18185 71136 -147035 -73826 -97573 259430 117003 -40055 -289173 192132 -36860 -62709 63898
18173 -123275 -95788 -22268 42627 238211 18892 269852 -111689 -205949 -351525 -18369 48288
18161 261280 -123379 -10644 177945 124574 124635 36881 -359890 -91248 174991 -10568 -117028
18150 -117028 1344 50328 -82315 373264 28298 -83423 167329 -44476 177274 93954 -80751
18138 -79974 -41085 33899 53233 -275389 53591 -15344 189266 -331055 -18600 49767 214978
18127 214978 -143065 -208306 -465818 10574 210411 51001 -3187 -188022 -65751 82049 142990
18116 142990 -223787 180599 -176697 155814 73806 156543 -322592 -122667 -113570 -67509
18106 -67509 -405262 -284682 -107423 332686 294625 221607 66101 58919 -337746 -135616 -96727
$$ packed form
18185G1136a47035P3209k3747B59430A17003d0055k49118A92132c6860k5849F3898
18173a23275K7487b2268D2627J95584A8892K50960a11689r4260j45576a8369D8288
18161B61280a23379a0644A77945n3371O1C6881c59890i1248A74991a0568j06460
18150a17028A344M8984h2315C73264B8298h3423A67329d4476A77274q3320h0751
18138g9974L8889C3899J9334b75389E3591a5344A89266c31055a8600D9767J65211
18127B14978a43065o5241k57512A0574J99837E1001c187j84835f5751H2049O0941
18116A42990b23787A80599a76697A55814G3806Q2737c22592a22667R097M6061
18106f7509l37753J20580a07423C32686l8061p3018F6101p182c37746a35616L8889
$$ plain form
18095 -96727 -333405 -86986 36011 77378 -133404 -94617 -49282 1313 125907 89361 -157457
18083 157523 -266117 -65623 168585 31430 -191889 -16593 98064 -70891 66327 -79912 26576
18071 -128985 147742 -151841 -94430 295190 -216373 192036 237524 -122037 -281735 38098
18060 133065 -243957 -28670 -123175 -142128 -157405 69329 145309 -35654 -254098 -116691 279905
18048 25334 62640 368080 200316 -228565 3381 -194752 50599 -118569 -85655 71428 -244039
18036 35701 -55197 -355600 27154 -36329 207171 -29130 -55940 65113 -426649 -69825 13242
18024 178483 56294 185290 -12870 226900 166114 17670 102097 35745 -146069 -244670 -195157
18013 -195157 -281943 -167574 -65684 -203370 102687 19552 -306435 123113 -186151 -224465
$$ packed form
18095i6727k36678h6986C6011M1367a33404L8787M5335A313J24594l6546a57457
18083A57523b66117f5623A68585C1430a91889a6593I8064g0891F6327g9912B6576
18071a28985A47742a51841N7411B95190b16373A92036M5488a22037j59698C8098
18060A33065b43957b8670r4505j8953j5277F9329P5980c5654k18444a16691B79905
18048B5334L7306L05440j67764b28565C381a94752E0599a18569L2914G1428b44039
18036C5701e5197l00403B7154c6329B07171b9130k6810F5113d26649f9825A3242
18024A78483E6294J28996a2870B26900o0786A7670Q4427C5745a46069r8601M9513
18013a95157q6786J14369f5684j37686A02687A9552c06435A23113a86151l8314
$$ plain form
18003 -224465 161857 -66295 -141094 -98109 5419 -272218 99735 57056 194494 -42935 -46979
17992 -46979 -24463 -65606 -110184 193955 45257 15281 -64949 -21647 -162930 7394 -127292
17980 -160561 77906 -120009 -43293 -23940 161385 -169746 -40499 26261 236775 18885 -23000
17968 40028 -24229 -303802 106641 39288 70462 -17276 95376 37684 -46862 -101107 -208850
17957 -208850 107843 43988 124353 351553 166902 -97734 -29765 -42068 -53989 -2597 -112409
17946 -112409 -153132 54739 -223237 390921 40414 -125238 -48446 -134298 -379488 291378
17935 -55160 133908 -274574 125972 -253514 -74823 107577 359954 183413 295769 301142
17925 301142 -145007 -123763 -249434 -87014 -116372 -31538 -244208 -188092 82216 191722 122349
$$ packed form
18003b24465A61857f6295p4799M2985E419b72218I9735m2679J37438d2935m044
17992d6979K2516m1143m4578A93955D5257A5281f4949b1647j41283G394a27292
17980a60561G7906a20009d3293J9353A61385a69746d0499B6261K10514A8885b3000
17968D0028b4229k79573A06641C9288L1174a7276I5376C7684d6862n4245j07743
17957b08850A07843D3988Q0365K27200A66902i7734b9765j2303j1921b597j09812
17946a12409m0723E4739b23237C90921D0414a25238d8446q5852k45190B91378
17935e5160A33908b74574A25972b53514g4823A07577K52377j76541J12356N373
17925C01142a45007K1244j25671h7014k9358c1538k12670N6116H2216J09506o9373
$$ plain form
17914 122349 11894 -75999 -92113 -26290 -98433 64666 -52834 -138506 -7221 238644 262742
17903 262742 159015 95056 9581 -380 -166505 -24606 -73857 -29057 29132 -194848 -87312
17891 -20296 73415 75328 133299 119602 -36175 -378815 229874 -15168 71105 -268796 -93449
17879 -158680 176464 -229092 70949 161235 -84343 -141849 -152282 -155324 -122761 197890 178455
17868 178455 -154697 -49795 25717 -75652 77307 -102519 -193714 -143374 -212525 267546 -151713
17856 -186682 -183278 -328602 -224375 71104 -154576 159926 209899 13664 -106903 -220442
17846 -220442 -111181 -93904 -77050 -266798 -158266 -166105 157360 145952 14526 432184 281653
17835 281653 -152936 45908 -375297 -8630 -190317 98968 -184296 96776 -179283 170510
$$ packed form
17914A22349A1894g5999j6114b6290p2143F4666e2834q5672g221B38644K4098
17903B62742j03727o3959I581c80j66125b4606m9251b9057B9132a94848h7312
17891b0296G3415J913N7971j3697c6175l42640B29874a5168G1105b68796i3449
17879a58680A76464b29092G0949R0286h4343n7506j0433l042L2563A97890j9435
17868A78455a54697d9795B5717g5652G7307a02519r1195N0340o9151B67546a51713
17856a86682L404j45324J04227G1104a54576A59926M9973A3664a06903j13539
17846b20442J09261J7277J6854j89748J08532p839A57360j1408A4526M17658j50531
17835B81653a52936D5908c75297h630j81687I8968a84296I6776a79283A70510
$$ plain form
17824 -409149 59741 222537 88124 251591 -83128 -118234 -55912 -100562 -491384 210315 -208657
17812 -35939 -75353 -41846 72228 184973 -91165 -202917 60884 -144905 -69168 -64513 -177036
17801 -177036 -55176 97259 -254302 91538 -97963 7733 111611 -223295 -172662 111734 112557
17790 112557 -95128 -148196 -321604 7393 -37737 185662 235719 -448041 279381 -14551 -8170
17779 -8170 -86886 -67741 -38817 6932 523287 99980 -125487 -56221 -150122 165098 -141612
17767 -54455 -84258 -124818 -259636 -237655 -34972 -53020 147204 284708 -144068 -278108 306976
17755 -147496 30764 95872 60410 73973 -142301 193117 -89007 239716 25687 66322 -75
17743 -90141 -240332 -410481 -171152 115763 88454 204684 -204475 159043 170196 -32076
$$ packed form
17824d09149E9741J62796H8124J63467h3128l5106e5912m4650l90822B10315b08657
17812c5939l9414L3507G2228J12745i1165j11752F0884a44905f9168M655j12523
17801a77036e5176I7259b54302I1538i7963G733J03878b23295N0633A11734Q23
17790A12557i5128n3068j73408G393c7737A85662N0057d48041B79381a4551O381
17779h170p8716J9145K8924F932N16355I9980a25487e6221r3901A65098a41612
17767e4455k9803m0560j34818K1981c4972j8048A47204J37504a44068j34040C06976
17755a47496C0764O5108l5462J3563a42301A93117h9007B39716B5687M0635g5
17743i0141j50191j70149a71152A15763k7309J16230b04475A59043J1153c2076
$$ plain form
17732 -127889 -159842 273329 -146552 -16729 -72917 -88396 -231494 77515 67197 -130353 91084
17720 -19834 72761 -321429 88727 -306298 210198 8894 18273 -149251 -89315 -109220 3531
17708 272542 -117199 216635 39458 64838 12042 -324669 -16363 -153473 174091 -37373
17697 -191936 23318 -111466 25282 28628 274135 -142226 -122584 38385 318094 63637 -79597
17685 127814 -97851 124298 -295595 -122997 236230 197533 115222 -276683 145342 -22472
17674 309781 63868 80425 31937 310678 32137 54347 120488 25100 282872 30415 2598
17662 -4963 3391 -115998 186234 45772 -399418 229810 -126755 2719 283886 21227 143304
17651 143304 54149 -25673 8807 76667 -135979 94336 -119155 287317 302015 216794 -111652
$$ packed form
17732a27889l1953B73329a46552a6729n6188j5479j43098G7515j0318a30353I1084
17720a9834G2761c21429H8727c06298B10198H894R379a49251N9936j9905C531
17708B72542a17199B16635C9458K5380A2042c24669a6363j37110A74091c7373
17697a91936B3318a11466B5282L346K45507a42226J9642C8385K79709F3637g9597
17685A27814i7851A24298b95595a22997B36230l8697q2311b76683A45342b2472
17674C09781F3868J6557C1937K78741C2137K2210O6141B5100K57772C0415B598
17662d963C391a15998A86234D5772c99418B29810a26755B719K81167B1227J22077
17651A43304E4149b5673H807O7860a35979I4336a19155B87317J4698q5221a11652
$$ plain form
17639 -31846 -206759 -266636 -9527 -212633 -205162 -119609 -255916 -148807 -181661 332130 -165519
17627 -62693 -224539 -16131 -169366 364066 217195 27244 -73163 -127957 223248 -139992
17616 -57107 192812 208668 7616 -312900 -144521 182304 262907 -9221 97799 291248 144035
17604 -35162 223490 -34051 -96778 208325 192103 413182 88830 135669 198077 213972 23993
17592 52859 -155798 176775 333910 6015 207185 -38501 323876 -133829 299775 61180
17581 -250846 300410 100119 114916 -100186 -97863 -37371 -268008 324767 -37414 238408
17570 -131621 202778 60713 85083 22038 1464 -17708 321184 -345219 131997 164154 -43978
17558 4628 310265 -7776 137010 -185419 179816 -173891 125726 92591 -352218 16625 196331
$$ packed form
17639c1846j74913n9877i527k03106P471Q5553j36307J07109l2854C32130a65519
17627f2693j61846a6131j53235C64066j46871B7244g3163n4794B23248a39992
17616e7107A92812J5856G616c12900a44521A82304Q0603i221I7799J93449A44035
17604c5162B23490c4051o2727B08325j6222K21079H8830M6839O2408J5895B3993
17592E2859a55798A76775J57135F015K01170c8501C23876a33829B99775F1180
17581b50846C00410A00119J4797a00186K323c7371k30637C24767c7414B38408
17570a31621B02778F0713K4370B2038A464a7708C21184c45219A31997L2157d3978
17558D628L05637g776A37010a85419A79816a73891A25726l3135c52218A6625J79706
$$ plain form
17547 196331 -8081 312819 269354 -227254 38819 193863 98404 -188306 5535 35723 55589
17536 55589 276027 116945 -70817 -62977 -108196 164756 12508 -246440 5153 -217865 -26142
17524 137827 91377 78841 309604 390246 146651 -76366 124962 183711 222807 229518 -196478
17512 29460 -148787 151715 256201 126351 261684 -314078 -37204 84902 16814 64915
17502 64915 313451 38070 -18536 -81760 -4250 -259678 101190 299374 233602 248394 384297
17491 384297 154122 247212 -17846 223141 269598 98591 -44655 224632 198558 -1489 208073
17479 -7661 167264 323733 157269 39150 -25918 170889 -160769 -75545 413699 84556 189016
17468 189016 57237 -233813 27361 165163 -206147 29645 164947 480897 -292028 -179912
$$ packed form
17547A96331h081C12819m3465b27254C8819J55044r5459a88306E535L0188J9866
17536E5589K20438A16945g0817P840m5219A64756A2508b46440E153b17865b6142
17524A37827m6450j2536K30763Q0642A46651g6366A24962N8749L9096O711a96478
17512B9460a48787A51715J04486A26351J35333c14078c7204H4902A6814M8101
17502F4915K48536C8070a8536o3224d250k55428A01190J98184o5772J4792J35903
17491C84297A54122R3090a7846B23141M6457I8591d4655B24632k6074a489B08073
17479g661A67264J56469A57269C9150b5918A70889a60769g5545D13699H4556J04460
17468A89016E7237b33813B7361J37802b06147B9645J35302L15950b92028J12116
$$ plain form
17458 -179912 309223 154023 -6379 58630 433602 66990 10548 263673 -94720 156327 351324
17447 351324 65882 397178 129323 392756 358211 178473 -35764 285812 270143 428454
17437 428454 -2442 372014 254080 251353 154372 335734 467779 273949 135506 161232 189371
17426 189371 225533 329739 -60221 243513 227656 204022 258084 262750 28840 251659 201219
17415 201219 267000 231611 96703 141875 204616 -133933 117137 310932 267966 415768 186310
17403 107720 37360 96942 128221 106498 194740 -29 40246 309253 398185 -36924 59148 -33881
17390 90508 -179134 191795 71934 173000 158562 -70488 -187197 91160 125809 134588 287622
17379 287622 248142 423161 -4637 12855 -86673 84824 -129567 202530 -106277 11209 191576
$$ packed form
17458a79912C09223A54023f379E8630L74972F6990A0548K53125i4720A56327J94997
17447C51324F5882L31296A29323K63433l4545A78473c5764B85812j5669J58311
17437D28454b442C72014j17934k727r6981J81362J32045j93830A35506K5726K8139
17426A89371L6162J04206f0221B43513j5857k3634N4062M666B8840K22819n0440
17415B01219O5781l5389I6703M5172O2741a33933A17137J93795m2966J47802A86310
17403A07720C7360N9582L1279k1723Q8242b9D0246K69007Q8932c6924E9148c3881
17390I0508a79134A91795G1934J01066j4438g0488j16709I1160L4649Q779J53034
17379B87622l9480J75019d637A2855h6673H4824a29567B02530a06277A1209J80367
$$ plain form
17368 191576 246204 23377 128200 346910 141589 57347 -18410 315235 10446 2875 62176
17357 62176 -120860 30125 206490 49179 175378 -217466 142155 202891 -145940 127001
17346 33764 260216 438372 93432 -60023 112384 152079 7613 376099 328577 261336 115221
17334 58502 224618 393960 131182 5471 78137 163425 -62975 211199 62852 105388 135754
17323 135754 75262 17866 142032 -261008 146382 -29372 7487 156500 229759 129830 82193
17312 82193 382393 124036 -58994 5696 459704 -57239 210544 240904 455999 -71502 -52970
17301 -52970 419464 392027 204274 71583 333942 146633 -287688 366659 322363 119654
17290 401988 146383 -8310 210734 107510 121895 231929 23378 336583 82480 -170608
$$ packed form
17368A91576N4628B3377J04823K18710A41589E7347a8410C15235A0446B875N9301
17357F2176a20860C0125J76365D9179J26199b17466A42155O0736a45940A27001
17346C3764K26452J78156I3432f0023A12384L9695G613L68486m7522o7241A15221
17334E8502J66116J69342A31182E471P2666Q5288f2975B11199F2852M2536L0366
17323A35754o0492A7866J24166b61008A46382b9372G487J49013P3259r9929m7637
17312H2193L00200A24036e8994E696M54008e7239B10544L0360K15095g1502J8532
17301e2970D19464k7437j87753G1583K62359A46633b87688C66659m4296A19654
17290D01988A46383h310B10734j03224J4385J10034B3378L13205H2480a70608
$$ plain form
17279 90311 183191 294863 179786 320496 445329 30392 254436 172066 201330 2243 342295
17268 342295 -58630 227342 283461 2519 75625 291106 -51473 116509 74857 290096 150659
17257 150659 37913 315536 127165 -180587 131174 56118 167342 314900 277596 266 319153
17246 319153 380169 106722 302942 273020 196151 262920 88371 135644 14676 52825 323145
17235 323145 95804 122643 474550 265966 109805 350787 378556 358216 124956 100122
17225 100122 363860 378678 278035 416296 89347 -123714 83535 -106863 -89053 227712
17214 74278 305081 331968 234848 113307 319481 284080 97133 193164 265295 -34803 371284
17202 336493 179323 -29818 244887 317334 406961 375214 382677 258708 195448 324077 480385
$$ packed form
17279I0311R2880J11672j15077J40710J24833C0392K24044q2370K9264B243L40052
17268C42295e8630B27342N6119B519P3106K15481e1473A16509m1652K15239j39437
17257A50659C7913K77623A27165a80587A31174E6118J11224J47558l7304B66L18887
17246C19153O1016A06722J96220k9922p6869O6769H8371M7273A4676L8149K70320
17235C23145I5804K6839L51907k08584A09805K40982K7769k0340A24956k4834
17225A00122K63738J4818j00643J38261H9347a23714H3535a06863J7810B27712
17214G4278K30803K6887r7120A13307K06174l5401I7133R6031P2131c4803C71284
17202C36493j57170b9818B44887P2447Q9627l1747P463j23969o3260J28629J56308
$$ plain form
17191 480385 156023 496579 171820 196561 331764 367890 1148 14572 425810 417715 377321
17180 377321 309044 42854 285831 207204 57075 319654 263812 74460 83497 385894 176160
17168 54109 286364 270180 79725 41635 -7615 380119 362586 134232 320497 135884 38042
17156 326521 211007 468862 134409 326633 100391 186363 400378 122590 -74360 395421
17145 -145882 182159 146432 53628 246110 412083 189969 397739 340289 485655 -125390
17134 797922 170225 254179 259459 264080 162053 51970 270541 139009 201659 379877 549854
17123 549854 335472 421996 243013 525723 152309 394673 276504 468968 524255 404122
17113 404122 268162 270049 355730 412072 391766 237998 158166 167975 183131 384977 149943
$$ packed form
17191D80385A56023L40556A71820K4741J35203L6126A148J3424M11238q095m0394
17180C77321o8277D2854K42977p8627E7075K62579n5842G4460R037L02397A76160
17168E4109K32255j6184G9725l8090g615C80119j7533A34232J86265A35884C8042
17156C26521j15514K57855A34409J92224A00391Q5972K14015A22590g4360C95421
17145a45882A82159l5727E3628J92482J65973A89969K07770n7450J45366a25390
17134G97922A70225Q3954N280M621j02027E1970K18571j31532O2650J78218J69977
17123E49854k14382Q6524j78983K82710A52309K42364j18169J92464N5287j20133
17113D04122j35960J887Q5681N6342k0306j53768p9832R809J5156K01846A49943
$$ plain form
17101 397298 317927 342229 503351 256130 314477 346787 570829 151519 251272 237352 562413
17090 562413 216381 590082 231993 546859 513748 459646 679608 506335 345745 311749
17080 311749 189226 379563 574446 541306 162641 301288 405125 430020 472497 513052
17070 513052 550324 401429 490506 617453 334658 584584 642105 367812 225081 763389
17060 763389 463854 531599 273020 433428 611823 402535 384014 595583 334175 612510
17050 612510 586438 777502 313433 607879 889319 352570 458570 299019 665700 919212
17040 919212 429349 501580 527718 673379 673931 660579 367267 666543 734091 545556 514721
17029 514721 539730 669063 651662 694325 689063 328588 851229 445884 590005 449548
$$ packed form
17101C97298p9371K4302J61122k47221N8347L2310K24042A51519R9753j3920L25061
17090E62413B16381L73701B31993L14866l3111n4102K19962j73273j60590l3996
17080C11749j22523J90337J94883l3140A62641J38647J03837K4895M2477M0555
17070E13052L7272j48895Q9077J26947k82795K49926N7521k74293j42731N38308
17060G63389k99535O7745k58579J60408J78395k09288j8521K11569k61408K78335
17050F12510k6072J91064C13433K94446K81440C52570J06000j59551L66681K53512
17040I19212D29349P2231K6138J45661N52j3352k93312K99276O7548j88535l0835
17029E14721K5009J29333j7401M2663n262C28588N22641m05345J44121j40457
$$ plain form
17019 449548 520274 573155 479998 477405 631424 1029489 728034 540657 568570 678017 1053690
17008 1053690 431755 1035867 537623 847935 774762 603432 750448 661050 545056 715565
16998 715565 522852 742519 687388 887685 775865 719467 733308 706069 739061 807439 428600
16987 428600 758106 674706 782031 1142846 920854 740967 837009 1104654 641087 887156
16977 887156 929420 973705 562085 857951 849910 825307 798771 848007 873667 748115 903524
16966 903524 959830 1131444 790006 1181121 632953 918263 990759 1073140 709436 805931
16956 805931 704642 984338 1354174 1012610 1001436 1034529 1033100 1068882 1369018 993826
16946 993826 1178203 1240084 1406154 1030075 953585 1058919 977936 1016068 1003630 1213051
$$ packed form
17019D49548P0726N2881r3157k593J54019L98065l01455j87377K7913J09447L75673
17008A053690D31755O04112m98244L10312p3173j71330J47016q9398j15994J70509
16998G15565j92713K19667n5131K00297j11820n6398J3841k7239L2992O8378l78839
16987D28600L29506q3400J07325L60815k21992j79887R6042K67645m63567K46069
16977H87156M2264M4285m11620K95866q041k4603k6536M9236K5660j25552J55409
16966I03524N6306J71614l41438L91115n48168K85310P2496Q2381l63704R6495
16956H05931j01289K79696L69836l41564j1174L3093j429L5782L00136l75192
16946I93826J84377O1881J66070l76079p6490J05334q0983L8132j2438K09421
$$ plain form
16936 1213051 1335355 1123801 1245903 1449467 1158647 1196746 1184527 970526 1282398 974718
16926 974718 1217731 1249407 1207993 1166517 1524747 1114383 1321101 1326059 1097458 1450589
16916 1450589 1656309 1251825 1562650 1112742 1215271 1525306 1399293 1528602 1630552
16907 1630552 1404815 1366835 1461185 1678033 1359038 1771404 1624500 1395831 1558065 1608717
16897 1608717 1686479 1752730 1899371 1610777 1941155 1672952 2026918 2004335 1758759 2121580
16887 2121580 1986328 1822112 1830334 1930264 1749150 1968000 2211424 2168574 2177636 1795407
16877 1795407 2249756 2096625 2193953 2387721 2459241 2173179 2730124 2289007 2489593 2013833
16867 2013833 2521694 2275313 2057069 2560048 2656780 2472028 2509697 2909008 2877367 2713871
$$ packed form
16936A213051J22304k11554J22102K03564k90820L8099j2219k14001L11872l07680
16926I74718K43013L1676m1414m1476L58230m10364K06718M958k28601L53131
16916A450589K05720m04484L10825m49908J02529L10035j26013J29309J01950
16907A630552k25737l7980R4350K16848l18995M12366j46904k28669J62234N0652
16897A608717P7762O6251J46641k88594L30378k68203L53966k2583k45576L62821
16887B121580j35252j64216Q222R9930j81114K18850K43424m2850R062l82229
16877A795407M54349j53131R7328J93768P1520k86062N56945m41117K00586m75760
16867B013833N07861k46381k18244N02979R6732j84752L7669L99311l1641j63496
$$ plain form
16857 2713871 2573497 2906234 3180643 3001684 3287323 2974246 3232248 3012493 3274444
16848 3274444 3125646 3211987 3179886 3517881 3578097 3410994 3711623 3453844 3574364 3650112
16838 3650112 3964242 3907594 3994696 4082340 3939805 3884280 4096908 4010920 4057906 4090408 4643236
16827 4643236 4525728 4639512 4591268 4845319 4957760 4687606 5085661 5224801 5322763 5243379
16817 5243379 5525306 5708950 5841311 5452688 6021531 6172740 5807439 6111809 6457175
16808 6457175 6602423 6620411 6967097 6962834 7131283 7219162 7223211 7669785 7666157 7828647 7648148
16797 7648148 8037681 8161957 8566634 8955184 9001110 9188090 9452350 9758957 10328702 10307888
16787 10307888 10403682 10716272 11330426 11298105 11653970 11949624 12124084 13092760 13044347 13835708
$$ packed form
16857B713871j40374L32737K74409j78959K85639l13077K58002k19755K61951
16848C274444j48798Q6341l2101L37995O0216j67103L00629k57779J20520P5748
16838C650112L14130n6648Q7102Q7644j42535n5525K12628q5988M6986L2502N52828
16827D643236j17508J13784m8244K54051J12441k70154L98055J39140R7962p9384
16817E243379K81927J83644J32361l88623N68843J51209l65301L04370L45366
16808F457175J45248J7988L46686m263J68449Q7879M049M46574l628J62490j80499
16797G648148L89533J24276M04677L88550M5926J86980K64260L06607N69745k0814
16787A0307888R5794L12590O14154l2321L55865K95654J74460R68676m8413P91361
$$ plain form
16777 13835708 13970638 14331286 14872885 15110260 15895741 16189450 17096624 17376791 17830374
16768 17830374 18655252 19557221 20171599 20640906 21624442 22571800 23277971 24377071 24504114
16759 24504114 25836482 27647319 28441669 29543275 30406820 32068191 33764722 35120131
16751 35120131 36684680 38301740 40228625 41960104 44063736 46421415 48830340 51126846
16743 51126846 54040508 56785383 59853251 63144856 66824564 70248634 74556210 78577392
16735 78577392 83393796 88286363 93383283 98871536 104839221 110941477 117031293 123955412
16727 123955412 130921608 137832273 144637383 151346732 158391492 164626115 170128991 175357114
16719 175357114 179447810 182579337 184837762 185411049 184927615 183373489 180263405 176223723
$$ packed form
16777A3835708J34930L60648N41599K37375P85481K93709R07174K80167M53583
16768A7830374Q24878R01969O14378M69307R83536R47358P06171J099100J27043
16759B4504114J332368J810837P94350J101606Q63545J661371J696531J355409
16751C5120131J564549J617060J926885J731479K103632K357679K408925K296506
16743E1126846K913662K744875L067868L291605L679708L424070M307576M021182
16735G8577392M816404M892567N096920N488253N967685O102256O089816O924119
16727A23955412O966196O910665O805110O709349P044760O234623N502876N228123
16719A75357114M090696L131527K258425N73287m83434j554126l110084m039682
$$ plain form
16711 176223723 171176412 165366861 159411701 152509794 145222496 137823763 130547500 123667125
16703 123667125 116754207 110000610 103749612 97802315 91765219 85943514 81406732 76201237
16695 76201237 71734498 67523613 63760764 60228747 57176795 53755900 50620792 47992295
16687 47992295 45856653 43178382 40973125 38800874 37146382 35464573 33569745 32145535
16679 32145535 30467572 29173856 28088414 26663470 25425109 24367413 23596332 22716049
16671 22716049 21586670 20692308 20294449 19475973 18598542 18159443 17285264 16642523 15895069
16662 15895069 15409343 14939987 14288056 13989922 13700355 13272318 12735646 12190918 11805805
16653 11805805 11657322 11400435 11075739 10644121 10398309 10085196 9455757 9180271 9292835
$$ packed form
16711A76223723n047311n809551n955160o901907p287298p398733p276263o880375
16703A23667125o912918o753597o250998n947297o037096n821705m536782n205495
16695G6201237m466739m210885l762849l532017l051952l420895l135108k628497
16687D7992295k135642k678271k205257k172251j654492j681809j894828j424210
16679C2145535j677963j293716j085442j424944j238361j057696p71081q80283
16671B2716049j129379q94362l97859q18476q77431m39099q74179o42741p47454
16662A5895069m85726m69356o51931k98134k89567m28037n36672n44728l85113
16653A1805805j48483k56887l24696m31618k45812l13113o29439k75486J12564
$$ plain form
16644 9292835 9227900 8741270 8367689 8226911 7842769 7948510 7801681 6998608 7228194 7306260
16634 7306260 7096683 6572030 6427671 6162960 6245004 6428019 6145056 6029008 5549089 5516438
16624 5516438 5654432 5296544 5243853 4771007 4855508 4963524 4906765 4385714 4319675 4514625
16614 4514625 4537025 4470552 4410144 3930873 4026159 3879397 3941820 3729610 3681193 3493641
16604 3493641 3669363 3400918 3570285 3420180 3268471 3596254 3384094 3325312 3100576 2926787
16594 2926787 3369834 2758144 2891980 3014589 2726215 2663512 2330809 2655098 2600270 2863046
16584 2863046 2574736 2489298 2754567 2131206 2184849 2904796 2483518 2101611 2164603 1993174
16574 1993174 2586064 2324239 1861698 1951179 2018962 2104930 2162145 1827392 1786200 1724841
$$ packed form
16644I292835o4935m86630l73581j40778l84142J05741j46829q03073K29586P8066
16634G306260k09577n24653j44359k64711Q2044J83015k82963j16048m79919l2651
16624E516438J37994l57888n2691m72846Q4501J08016n6759n21051o6039J94950
16614D514625K2400o6473o0408m79271R5286j46762O2423k12210m8417j87552
16604C493641J75722k68445J69367j50105j51709L27783k12160n8782k24736j73789
16594B926787M43047o11690J33836J22609k88374o2703l32703L24289n4828K62776
16584B863046k88310q5438K65269o23361N3643P19947m21278l81907O2992j71429
16574A993174N92890k61825m62541Q9481O7783Q5968N7215l34753m1192o1359
$$ plain form
16564 1724841 2079361 2153862 1677877 1769636 1703280 1821473 1724454 1717925 1714055 1656762 1361771
16553 1361771 1924454 1647176 1622252 1739752 1270390 1394630 1377935 1854562 1428347 1496739
16543 1496739 1270057 1568660 1371773 1568639 1526679 1385592 1125414 1172336 1609217 1281613
16533 1281613 1279263 1463889 1357667 865370 1242169 926396 1064979 1248680 748417 1374735
16523 1374735 1255147 1396436 1255888 1277151 1165175 1162684 1131709 807624 979069 989779
16513 989779 1046647 940271 552952 872089 807975 802060 1024659 1169688 944094 924510
16503 924510 607383 730769 907242 664127 882329 894265 818104 752626 783985 516813
16493 516813 792917 1113136 880997 564258 613046 522947 1027398 672904 752423 615463
$$ packed form
16564A724841L54520P4501m75985R1759o6356J18193r7019o529l870n7293k94991
16553A361771N62683k77278k4924J17500m69362J24240j6695M76627m26215O8392
16543A496739k26682K98603j96887J96866m1960j41087k60178M6922M36881l27604
16533A281613k350J84626j06222m92297L76799l15773J38583J83701n00263O26318
16523A374735j19588J41289j40548K1263j11976k491l0975l24085J71445J0710
16513I89779N6868j06376l87319L19137o4114n915K22599J45029k25594j9584
16503I24510l17127J23386J76473k43115K18202J1936p6161o5478L1359k67172
16493E16813K76104L20219k32139l16739M8788r0099N04451l54494P9519j36960
$$ plain form
16483 615463 1047351 594503 445172 428165 684326 656887 571419 856869 532960 500995
16473 500995 699506 619951 265723 571115 494469 608882 986380 690141 574365 679360
16463 679360 414400 472774 741842 327873 567444 579765 314023 569528 477856 609084
16453 609084 469365 646224 245270 462116 719625 458181 591895 480512 768424 540587
16443 540587 591953 279581 718201 542697 308131 496723 687403 495843 679123 617188
16433 617188 403372 579474 349367 286525 155990 486694 571615 446462 595390 389071
16423 389071 537028 377266 278111 409103 397698 203056 384051 709666 307424 458110
16413 458110 277245 448186 255703 283337 381870 281516 449869 540919 307163 333315
$$ packed form
16483F15463M31888m52848j49331j7007K56161k7439q5468K85450l23909l1965
16473E00995J98511p9555B65723L05392p6646J14413L77498k96239j15776J04995
16463F79360k64960N8374K69068C27873K39571J2321k65742K55505r1672J31228
16453F09084j39719J76859B45270K16846K57509k61444J33714j11383K87912k27837
16443E40587N1366B79581M38620j75504k34566J88592J90680j91560J83280o1935
16433F17188k13816J76102k30107o2842j30535L30704Q4921j25153J48928k06319
16423C89071J47957j59762r9155J30992j1405j94642J80995L25615C07424J50686
16413D58110j80865J70941j92483K7634R8533j00354J68353R1050k33756K6152
$$ plain form
16403 333315 397135 120091 156005 433008 424946 60606 604266 302366 286160 494657 145441
16391 477058 403619 157512 246144 324689 505788 167012 247806 -74941 122101 339341
16381 339341 568768 67205 285163 485010 122887 428366 248412 273245 268997 167773
16371 167773 124344 236592 290632 289810 240957 56589 51067 318743 151273 106728 386059
16360 386059 307757 -2219 247773 435056 139845 180519 77546 389772 277745 660945
16350 660945 121007 -297212 172895 312939 140463 340514 22544 -37144 220126 438803
16340 438803 259222 -109391 239870 171163 505337 89340 63980 -67948 328676 183115
16330 183115 475276 -91872 138877 222831 35637 178213 151376 167543 274315 391770
$$ packed form
16403C33315O3820A20091L5914K77003q062F0606N43660l01900j6206K08497A45441
16391D77058p3439A57512Q8632P8545J81099A67012Q0794g4941A22101K17240
16381C39341K29427F7205K17958J99847A22887L05479j79954K4833m248j01224
16371A67773m3429J12248N4040q22m8853E6589n522K67676A51273m4545K79331
16360C86059p8302b219B47773J87283A39845M0674G7546L12226j12027L83200
16350F60945A21007b97212A72895J40044A40463K00051B2544c7144B20126K18677
16340D38803j79581a09391B39870o8707L34174H9340k5360f7948C28676j45561
16330A83115K92161i1872A38877Q3954C5637J42576k6837J6167J06772J17455
$$ plain form
16320 391770 177627 -79587 126336 212193 -55071 98821 232182 8948 221786 289817 248469
16309 248469 378039 74356 36829 97809 34241 384255 354691 -116050 233192 -60361 110762
16297 282547 -25307 -93294 483129 247479 149484 -65686 -159772 259418 -9124 145075 242242
16286 242242 88746 -212679 305057 84330 51420 185545 -35151 72273 -84085 100931 86377
16275 86377 343419 -14131 124161 -56194 146009 178924 475893 -28372 -34827 -213426 -28275
16263 416829 -28909 46746 32708 323982 -277527 229301 326116 313638 231243 96880 -24081
16251 157085 180657 71007 291681 -319084 182176 37951 -36567 83493 156698 58442 -63300
16239 -125769 -192621 79297 25914 137568 276481 -36662 170359 150939 283554 85596 271443
$$ packed form
16320C91770A77627g9587A26336Q5857e5071I8821J33361H948K12838O8031m1348
16309B48469J29570G4356C6829O0980C4241L50014k9564a16050B33192f0361A10762
16297B82547b5307o7987D83129k35650r7995f5686r4086B59418i124A45075R7167
16286B42242H8746b12679C05057H4330l2910J34125c5151G2273h4085A00931j4554
16275H6377K57042a4131A24161e6194A46009L2915K96969b8372o455j78599b8275
16263D16829b8909D6746j4038K91274b77527B29301R6815j2478q2395I6880b4081
16251A57085K3572G1007K20674c19084A82176C7951c6567H3493P3205E8442f3300
16239a25769o6852G9297B5914J11654J38913c6662A70359j9420J32615H5596J85847
$$ plain form
16228 271443 384756 98641 219658 -136770 -99353 -43476 271355 301874 4914 219321 -267320
16216 189515 110715 -148366 227528 -77500 333375 119289 34565 237234 -199949 -58146
16205 17621 -46052 272948 539842 -120736 219654 86527 76637 -111998 178524 -247032
16194 -38657 -62720 384802 -167962 113845 141010 200612 101389 125278 -9959 1663 -39615
16182 96982 202704 -156765 140980 -252146 3234 -27225 -121995 1638 143831 29530 64747
16171 64747 -124903 167091 104172 220264 225043 256876 193513 24419 -137581 -5259 411869
16159 -11063 -431038 228290 -55452 85548 -19480 -145 -154608 216712 229387 16315 -127293
16147 -459204 157692 -233458 68820 -64170 -29484 -232855 -150023 -45345 104037 138692 31572
$$ packed form
16228B71443J13313I8641J21017a36770L7417d3476B71355L0519D914K14407b67320
16216A89515p8800a48366B27528g7500C33375A19289C4565K02669a99949e8146
16205A7621d6052B72948K66894a20736B19654H6527r890a11998A78524b47032
16194c8657k4063C84802a67962A13845K7165N9602r9223K3889i959A663c9615
16182I6982J05722a56765A40980b52146C234b7225r4770A638J42193B9530L5217
16171F4747a24903A67091o2919J16092M779L1833o3363B4419a37581e259D11869
16159a1063m19975B28290e5452H5548a9480a45j54463B16712J2675A6315a27293
16147d59204A57692b33458F8820f4170b9484k03371Q2832d5345A04037L4655C1572
$$ plain form
16135 30626 -52013 -34252 42464 -33711 -98115 273176 -128305 138927 198822 19666 -132253
16123 -81053 105594 -479060 9833 -343063 95013 128392 -81384 -80127 188080 15421 204535
16112 204535 -89345 -141457 -179070 144749 139547 -106063 236849 -37353 73224 -136873 -351761
16101 -351761 471532 -72253 90121 -261070 180842 -376993 -127242 47306 -188281 -126845
16091 -126845 -133774 -34520 -290128 -78148 -656197 118069 37685 15293 142391 -267047 164461
16079 -158606 46626 126833 181099 25652 112644 -13340 367113 191338 22844 106274 151529
16068 151529 157150 -145841 265825 -72648 91088 -226357 -320790 -5127 -56536 215262 94941
16056 80662 -201637 -151787 258013 -335446 -385958 -257901 -25733 -230809 -36289 -201117
$$ packed form
16135C0626e2013J7761D2464c3711o4404B73176a28305A38927N9895A9666a32253
16123h1053A05594d79060I833c43063I5013L3379h1384J257A88080A5421J89114
16112B04535h9345n2112l7613A44749n202a06063B36849c7353G3224a36873k14888
16101c51761D71532g2253I0121b61070A80842c76993a27242D7306a88281O1436
16091a26845o929c4520k55608g8148n78049A18069C7685A5293J27098b67047A64461
16079a58606D6626Q0207N4266B5652Q6992a3340C67113j75775B2844Q3430M5255
16068A51529N621a45841B65825g2648I1088b26357r4433e127n1409B15262I4941
16056H0662b01637M9850B58013c35446n0512J28057b5733k05076c6289j64828
$$ plain form
16046 -201117 -139173 -171584 -29546 -89324 -310020 224572 -29030 -79015 137904 34802 54003
16035 54003 149222 -195720 -112478 37623 20714 171118 327890 77501 -28577 -118622 -173856
16024 -173856 -57870 60678 -141853 -116723 -283565 -41076 176702 -46813 -148493 142845
16013 224049 -229182 -88510 40100 96877 -261185 109816 -217114 -169999 161729 87820
16003 87820 41617 5228 -266261 -216205 14575 -172448 -167389 -39357 -131926 -98158 -181532 -164158
15991 -164158 128026 -229869 36985 -293243 -185865 206525 56507 -82083 285571 -94387
15980 364973 164121 154720 47897 464147 -75140 28781 151516 44001 47355 540898 83395
15968 -131699 -99338 -27446 -22389 -201111 -51978 -76066 -334886 15890 299749 177791 -75494
$$ packed form
16046b01117O1944l2411b9546n9778k20696B24572b9030m9985A37904C4802J9201
16035E4003R5219a95720Q3242C7623j6909J50404J56772G7501b8577r0045n5234
16024a73856e7870F0678a41853K5130j66842d1076A76702d6813j01680A42845
16013B24049b29182h8510D0100N6777b61185A09816b17114M7115A61729p3909
16003H7820D1617E228b66261N0056A4575a72448N059c9357r2569L3768q3374J7374
15991a64158A28026b29869C6985b93243J07378B06525E6507h2083B85571i4387
15980C64973A64121r401D7897M16250g5140B8781J22735D4001L354M93543H3395
15968a31699L2361b7446N057j78722e1978k4088k58820A5890K83859j21958g5494
$$ plain form
15956 -191701 1903 189266 18737 -325631 -253226 -192765 -157231 49841 89867 -56671 -15663
15944 218635 124621 165494 5823 -267460 133308 172944 92685 110208 -334676 80472 -134943
15932 -375139 125016 -300767 280769 -9367 -303647 -87996 48818 -134159 -97719 -274736
15922 -274736 -5464 -254269 70198 -152474 -375780 61323 -240662 106488 104980 -158484 -97350
15911 -97350 -4577 19656 -6693 36118 156349 227494 -235423 12608 -8679 2645 58282 102400
15899 102400 -104749 -88799 -57954 171332 122617 -5384 -142142 -103315 -32187 -140612 135784
15887 157233 -100120 -194790 -259304 -243957 -235934 -145722 -106419 88483 -19430 197400 -70785
15875 43452 -252404 111261 19597 30166 3690 158685 -192615 102996 49787 -149986 -317866
$$ packed form
15956a91701A903J87363A8737c25631P2405O0461L5534D9841M0026e6671a5663
15944B18635r4014M0873E823b67460A33308L9636q0259J7523c34676H0472a34943
15932c75139A25016c00767B80769i367k94280h7996D8818a34159L6440j77017
15922b74736e464k48805G0198a52474k23306F1323b40662A06488j508a58484O1134
15911i7350d577A9656f693C6118J20231P1145b35423A2608h679B645N5637M4118
15899A02400a04749J5950L0845A71332m8715e384j36758L8827c2187j08425A35784
15887A57233a00120r4670o4514J5347Q023R0212L9303H8483a9430A97400g0785
15875D3452b52404A11261A9597J0569C690J54995a92615A02996D9787a49986j67880
$$ plain form
15864 -317866 226576 -89809 -34292 -45843 -79707 -89391 99007 -63286 -381828 -276944 84834
15852 -264987 -162952 -189711 165642 -79253 -231515 381381 -83529 -324058 -100200 -6118
15841 -242978 -112938 -273657 160594 -369820 -193915 96527 211497 8676 -8359 2872 111623
15830 111623 40537 -16571 40482 -220936 -103798 -74054 -122186 281333 197055 -104609 -23295
15818 -64801 -104901 29303 -104084 -146494 -312976 -76875 89568 -138752 -62788 -7558 -135336
15807 -135336 103441 -237301 -28537 31701 231352 47914 -56077 132399 -263811 121468
15796 -21984 75841 -96909 -33810 86324 76037 -229115 -88410 -262890 -238617 125025 295781
15785 295781 261711 173481 96230 103020 -400951 -221495 -66929 26341 10520 42937 144134
$$ packed form
15864c17866B26576h9809c4292j1551l3864r684I9007f3286l18542J04884H4834
15852b64987J02035k6759A65642g9253j52262C81381h3529k40529a00200f118
15841b42978a12938j60719A60594c69820J75905I6527J14970H676h359B872J08751
15830A11623D0537a6571D0482b20936a03798K9744m8132B81333q4278a04609b3295
15818f4801m0100B9303a04084m2410j66482g6875H9568a38752f2788g558j27778
15807a35336A03441b37301b8537C1701J99651D7914e6077A32399b63811A21468
15796b1984G5841i6909c3810H6324j0287b29115h8410j74480K4273A25025J70756
15785B95781l4070q8230p7251O790d00951J79456f6929B6341A0520L2417J01197
$$ plain form
15774 144134 -212450 -296272 102169 8648 139398 94759 81912 14945 -45766 -14082 -79844
15763 -79844 -94654 150327 -141368 309704 -75957 -21011 207862 102681 180352 349286
15753 349286 -1613 -85580 -327006 -199271 249990 -201336 268157 180103 -151219 49492
15742 103674 252452 29246 138628 -10749 -17818 56945 -46463 -20685 -14183 -10454 225159
15730 -148939 -83029 -147557 80697 -157567 -4655 -344360 22760 -226819 -61238 -163449 41955
15718 40931 117003 178724 -85659 -179484 99968 -4805 15620 -162973 197287 -317572 54281
15706 22114 13426 23525 121890 -28917 -142576 -99161 -365443 103919 36561 171358 -109958
15694 191621 59796 383825 -161171 73364 336326 245322 401238 -178283 -149988 -121672
$$ packed form
15774A44134b12450q3822A02169H648J30750m4639j2847A4945d5766a4082o5762
15763g9844j4810A50327a41368C09704g5957b1011B07862A02681P7671J68934
15753C49286a613q3967k41426J27735B49990b01336B68157q8054a51219D9492
15742A03674J48778B9246J09382a0749p069E6945d6463b0685O502L729B25159
15730a48939O5910o4528H0697a57567d655l39705B2760b26819f1238j02211D1955
15718D0931P6072O1721h5659r3825I9968d805A5620a62973A97287c17572E4281
15706B2114q688J0099R8365b8917j13659M3415k66282A03919C6561J34797a09958
15694A91621E9796L24029a61171G3364K62962r1004J55916a78283K8295K8316
$$ plain form
15684 -121672 15427 122544 87509 -57181 83244 74387 62232 314196 20141 69772 67910
15673 67910 241538 309135 43026 239466 57259 339908 138487 161155 -232946 -197285 -217821
15662 -217821 -406771 -92805 16176 93577 2015 35243 -202025 -203619 -152987 -101408 -162466
15651 -162466 -274384 153743 1092 111141 172784 205038 60007 -133698 -127178 10120 -213569
15639 -24091 65010 -20319 28244 137898 51508 68408 -183116 -417 -350560 -107996 224043
15627 -309993 -151140 -248438 -89781 111604 4521 -32920 -77436 194256 27546 90994 -124292
15615 125697 82561 316984 -28541 31202 99352 -263545 -40715 13372 -121274 -168998 -113410
15604 -113410 148337 -148481 -132575 194144 259563 -302497 -21035 149044 -147102 63875
$$ packed form
15684a21672A5427J07117l5035e7181H3244q857j2155K51964B0141M9631j862
15673F7910J73628O7597D3026J96440E7259K82649A38487K2668b32946L5661k0536
15662b17821j88950i2805A6176P7401B015L3228b02025j594N0632N1579o1058
15651a62466j11918A53743A092J10049O1643L2254F0007a33698O520A0120b13569
15639b4091F5010b0319B8244J09654E1508J6900a83116d17l50143a07996B24043
15627c09993a51140r7298h9781A11604D521c2920m4516A94256B7546O3448a24292
15615A25697m3136K34423b8541C1202O8150b63545d0715A3372a21274m7724N5588
15604a13410A48337a48481J5906A94144O5419c02497b1035A49044a47102F3875
$$ plain form
15593 133441 132226 -136897 224518 343252 103557 161043 289432 -269376 91499 -62594
15582 -62852 174232 31214 -127195 40485 -369789 -36355 118402 -528 60163 -72946 -63747
15571 -63747 -167694 -78633 20165 -108925 -213139 -338042 -12039 461776 282488 86097
15560 130347 138534 -57868 -80717 -26383 176464 -233025 312173 -146736 -58947 -105640 -397451
15549 -397451 24077 104130 97083 114988 1366 70453 167229 -8190 -186490 -231490 -155387 19429
15536 211532 174791 -406853 -185609 -127512 100377 95492 40362 -185561 3789 1742 134877
15525 134877 -17573 161566 -5343 4648 131328 -54760 -104920 135523 178327 34879 196301
15514 196301 -73534 50936 234160 -144643 37631 326489 52937 -311276 -172455 -261209
$$ packed form
15593A33441j215a36897B24518J18734A03557N7486J28389b69376I1499f2594
15582f2852A74232C1214a27195D0485c69789c6355A18402e28F0163g2946R199
15571f3747j03947g8633B0165a08925j04214j24903a2039D61776j79288H6097
15560A30347Q187e7868k2849b6383A76464b33025C12173a46736e8947m6693k91811
15549c97451B4077Q0053p047J7905A366O9087R6776h190j78300m5000P6103A9429
15536B11532l6741d06853a85609N8097A00377m885D0362a85561C789A742J33135
15525A34877a7573A61566e343D648J26680e4760n0160A35523M2804C4879J61422
15514A96301g3534E0936J83224a44643C7631K88858E2937c11276J38821q8754
$$ plain form
15504 -261209 -328839 6573 -22699 -103569 -4011 -302934 51733 -258293 -16474 66598 -360876
15492 -68363 13918 -85639 170836 73162 48389 -67414 -192872 139157 -126575 -76427 -35481
15480 176024 10814 95582 -71930 -53598 49707 -35574 91321 -157589 346153 73734 62388
15469 62388 90667 22078 -37206 -76629 80549 134386 -78912 -37428 -73946 19011 113795 -76462
15456 43646 -69186 277584 34024 -24566 94946 287013 182033 -92836 314060 -30778 -131481
15445 -131481 -100652 80051 -442294 -454 -23891 225112 121273 11707 141155 -184568 315729
15433 76696 -46878 -182013 -108029 234133 103446 -133713 -198558 -50108 2125 143851 109694
15422 109694 -117909 -24013 -79787 -56362 -195697 -169054 103760 151471 205791 21087 -90510
$$ packed form
15504b61209o7630F573b2699q0870d011k98923E1733b58293a6474F6598c60876
15492f8363A3918h5639A70836G3162k4773f7414j25458A39157a26575N0148c5481
15480A76024A0814Q4768g1930J8332D9707c5574I1321a57589C46153G3734j1346
15469F2388K8279B2078c7206l9423H0549N3837g8912c7428l6518A9011R4784g6462
15456D3646f9186B77584C4024b4566I4946J92067j04980i2836C14060c0778j00703
15445a31481L0829H0051d42294d54k3437B25112j03839A1707J29448a84568C15729
15433G6696d6878j35135P3984B34133A03446a33713o4845e0108B125J41726l4157
15422A09694a17909b4013n5774K3425j39335K6643A03760M7711N4320B1087i0510
$$ plain form
15410 -30371 145000 -32449 -219698 -236093 117044 85933 65292 -169767 -226271 -79184 -254595
15399 -254595 -45386 185006 44869 228644 52572 -19264 -340691 117595 -327533 174213
15388 -165218 89878 20134 -98101 -78376 184470 -145061 -43471 -468737 132622 -79283 -117474
15377 -117474 -77700 -200409 -141563 -100219 43318 -57283 -43228 -78157 -217655 -62001 -495254
15366 -495254 120963 -20532 118981 30646 230371 164817 -123073 -385087 -42236 -283848
15356 -283848 -100924 -72947 80516 94232 -36385 -79036 11722 88508 -79477 -78541 172956
15344 46292 84609 -170915 -318408 33978 86336 -123902 -6345 449200 44089 59530 171730
15333 171730 -52460 -11402 80500 -152074 -156180 -8758 157154 -110592 -282611 -38735 -14285
$$ packed form
15410c0371A45000c2449j87249j6395A17044l1111k0641a69767n6504g9184j75411
15399b54595d5386A85006D4869J83775E2572a9264l21427A17595c27533A74213
15388a65218H9878B0134i8101J9725A84470a45061d3471m25266A32622g9283l8191
15377a17474L9774j22709N8846M1344D3318e7283J4055l4929j39498f2001m33253
15366d95254A20963b0532A18981C0646J99725o5554a23073k62014d2236k41612
15356b83848a00924K7977H0516J3716c6385m2651A1722P6786g9477R36A72956
15344D6292L8317a70915j47493C3978N2358a23902f345D49200D4089J5441J12200
15333A71730e2460a1402H0500a52074m106h758A57154a10592j72019c8735a4285
$$ plain form
15321 -98356 253553 -191684 11369 12187 190673 80461 60010 48475 196318 -51734 55490
15309 166216 -217448 152896 80560 -75305 -1899 -29442 274686 210262 -270688 248925 301796
15298 301796 111607 106303 -141789 118017 28315 168375 352974 -87482 -35827 46080 11883
15286 168812 359866 221358 52954 160972 30061 99824 21466 35254 221362 -112187
15275 238005 111507 509454 233341 473363 98223 137526 -326447 -131975 -67949 17097
15264 126554 10920 -120913 278142 63650 79628 -19786 239005 221552 65871 11557 277688
15253 277688 378306 281098 301439 114700 670978 976150 1775836 884202 1525134 1105801
15243 1105801 490464 347768 -34092 436877 156551 -151519 11503 -99100 363969 -45771
$$ packed form
15321i8356B53553a91684A1369Q18J78486H0461k0451j1535J47843e1734E5490
15309A66216b17448A52896p2336g5305a899k7543B74686o4424b70688B48925N2871
15298C01796A11607n304a41789A18017B8315J40060J84599h7482c5827D6080A1883
15286A68812J91054j38508E2954J08018C0061O9763B1466J3788J86108a12187
15275B38005A11507L97947B33341K40022I8223L9303c26447a31975O4026A7097
15264A26554A0920a20913B78142F3650J5978a9786B39005j7453F5871A1557K66131
15253B77688J00618r7208K0341A14700N56278L05172P99686H84202O40932m19333
15243A105801D90464j42696c4092D36877A56551a51519A1503i9100C63969d5771
$$ plain form
15232 348582 149245 -12292 -10666 479811 -176929 228995 187318 190366 -336387 153025 229119
15221 229119 -334057 56599 -75602 -184091 230472 -30507 9306 10939 114822 -106251 134969
15209 66128 -158099 -170618 47565 416708 116912 -330216 498455 12451 54030 305283
15199 305283 86961 170182 89809 251046 323372 -30553 175408 -235607 -151490 29859 -167904
15187 63877 -21265 -156995 -65191 -202126 268607 -78077 -84011 -251699 55181 484754 95452
15175 220940 209354 455172 -69336 -196841 43070 145115 118925 -158252 205348 -11842
15164 241255 451090 116283 59482 -93998 158507 136816 -97553 281954 -189897 -78222
15153 447428 38543 -106902 13989 407036 -22857 246309 230836 69782 267194 -296965
$$ packed form
15232C48582A49245a2292J626D79811a76929B28995m1677L048c36387A53025P6094
15221B29119c34057E6599g5602j08489B30472c0507I306J633J03883a06251A34969
15209F6128a58099j2519D7565L69143A16912c30216D98455A2451M1579K51253
15199C05283H6961Q3221q0373J61237P2326c0553A75408b35607Q4117B9859a67904
15187F3877b1265j35730f5191j36935B68607g8077n934j67688E5181M29573I5452
15175B20940j1586K45818f9336j27505D3070J02045k6190a58252B05348a1842
15164B41255K09835A16283n6801i3998A58507k1691i7553B81954a89897g8222
15153D47428C8543a06902A3989L93047b2857B46309j5473F9782J97412b96965
$$ plain form
15142 -6138 175405 232000 -11532 157579 -207952 341691 331528 23749 -58508 67840 -170437
15130 -122279 -9290 77290 45368 11236 381999 169593 -74062 -25858 203679 -20172 119279
15118 58301 51032 -75342 302030 100665 117446 300207 113422 203950 411046 -137240 56062
15106 164628 -101211 168017 254422 85532 -80034 -19953 39172 12466 22179 78248 397346
15095 397346 324798 62922 -103613 218276 -487 -23256 -18349 -305118 63982 229965 192683
15084 192683 -146657 152325 339117 -90718 156728 394179 104810 49119 277855 277924 -3855
15072 -31025 95368 2710 51296 -298407 190451 156535 445285 385902 46157 101769 92793
15061 92793 439720 212634 334501 335489 96093 -104008 129425 195593 458725 204735 316826
$$ packed form
15142f138A75405N6595a1532A57579b07952C41691j0163B3749e8508F7840a70437
15130a22279i290G7290l1922A1236L70763A69593g4062b5858B03679b0172A19279
15118E8301p269g5342C02030A00665J6781J82761A13422R0528K07096a37240E6062
15106A64628a01211A68017Q6405H5532h0034a9953C9172A2466R713N6069L19098
15095C97346p2548F2922a03613B18276d87k2769M907k86769F3982J65983l7282
15084A92683a46657A52325J86792i0718A56728K37451A04810D9119K28736O9c855
15072c1025I5368B710M8586b98407A90451l3916K88750n9383D6157N5612q976
15061I2793L46927B12634J21867R88I6093a04008A29425O6168K63132B04735J12091
$$ plain form
15050 316826 414773 149382 285200 307864 255653 27927 129697 141832 665375 296257
15039 239227 372253 328452 206016 -45941 128686 379852 95682 272546 168936 -59168
15028 379021 386976 118897 251614 294265 -42635 303845 256122 204893 94724 418709 -183923
15016 80825 57190 31219 312208 101184 186850 208836 41946 312187 168670 -64034 59173
15004 143065 396441 164336 341219 195151 348961 -33121 78327 549665 9375 158431
14994 158431 26020 377067 135626 257524 83628 184924 164204 402254 276674 308132
14984 308132 156661 376 284895 548885 403593 132067 113346 118503 179736 319205 -45414
14972 616471 218415 14452 355505 306590 244563 614371 424967 45198 74299 299891
$$ packed form
15050C16826R7947A49382J35818K2664n2211B7927J01770J2135N23543B96257
15039B39227J33026m3801j22436d5941A28686K51166I5682J76864j03610e9168
15028C79021P955A18897J32717M2651d2635C03845m7723n1229I4724L23985a83923
15016H0825k3635k5971K80989A01184Q5666K1986D1946K70241j43517f4034E9173
15004A43065K53376A64336J76883j46068J53810c3121G8327M71338I375J49056
14994A58431B6020L51047A35626J21898H3628J01296k0720K38050j25580L1458
14984C08132j51471C76K84519K63990j45292A32067j8721N157O1233J39469d5414
14972F16471B18415A4452L41053m8915o2027L69808j89404D5198K9101K25592
$$ plain form
14962 299891 379368 537227 499616 253146 9902 32748 197316 -4521 87768 290921 28673
14950 324134 296886 52567 352547 183439 181836 369322 146699 564741 527829 168252
14939 -154482 595738 184010 623061 285968 130594 453933 208258 534520 332270 313452
14929 313452 444774 80528 129234 551965 218511 59626 -83111 206140 426805 187546
14918 151691 244863 324753 282281 155727 335263 441228 246171 481689 -53034 281454
14907 89292 364020 250292 323462 172104 220871 339329 624426 304060 405347 338805
14897 338805 475474 145920 311215 236766 223897 353751 195762 209454 43679 87329
14887 87329 199269 252698 455184 78437 380601 260082 134681 447654 398535 188467
$$ packed form
14962B99891P9477J57859l7611k46470I902K2846J64568d521H7768K03153B8673
14950C24134k7248E2567K99980j69108j603J87486A46699M18042l6912A68252
14939a54482E95738A84010M39051B85968A30594L23339B08258L26262k02250j8818
14929C13452J31322H0528M8706M22731B18511E9626h3111B06140K20665A87546
14918A51691R3172P9890m2472j26554J79536J05965j95057K35518e3034B81454
14907H9292K74728j13728P3170j51358M8767J18458K85097C04060J01287o6542
14897C38805J36669A45920J65295p4449j2869J29854j57989J3692D3679M3650
14887H7329J11940N3429K02486G8437L02164j20519j25401L12973m9119A88467
$$ plain form
14876 252630 249680 530603 540481 344599 -16719 320331 171568 437981 263615 321510 212577
14865 212577 644644 398708 341010 352356 529163 262097 592452 265192 349867 622819
14855 622819 263301 244942 469591 431068 369788 825179 450488 219845 502873 550991
14845 550991 288554 425138 296365 663798 789054 298512 553087 374675 683169 85202
14834 398492 298170 517356 354459 285641 347842 276595 654322 306784 405912 599649
14824 599649 698408 718894 582165 543123 245627 327624 558570 636969 512312 535526 92006
14812 529135 265066 373473 707985 402027 759522 459351 711511 677162 520844 403869
14802 403869 278432 501959 618224 700907 425154 704812 477632 404407 638557 581307
$$ packed form
14876B52630k950K80923R878j95882a6719C20331j48763K66413j74366N7895j08933
14865B12577M32067k45936n7698J1346J76807B62097L30355B65192Q4675K72952
14855F22819B63301j8359K24649l8523o1280M55391l74691B19845K83028M8118
14845E50991k62437J36584j28773L67433J25256B98512K54575j78412L08494H5202
14834C98492j00322K19186j62897o8818O2201p1247L77727C06784R9128J93737
14824E99649R8759K0486j36729l9042B45627Q1997K30946P8399j24657K3214I2006
14812E29135k64069J08407L34512l05958L57495l00171K52160l4349j56318j16975
14802D03869j25437K23527J16265Q2683k75753K79658k27180p3225K34150n7250
$$ plain form
14792 581307 643058 335547 497368 451688 665760 502057 509402 428929 602139 278410
14781 456683 316002 553825 414072 315516 238284 597773 188859 353815 625726 737356
14771 737356 749141 546340 306121 509113 577881 406217 317328 783405 453302 473608
14761 473608 592023 317029 341453 415308 799283 810021 727518 491491 457484 439496 607885
14750 607885 859765 770525 908422 859245 666634 714936 706547 580629 516943 588720 562161
14739 562161 766147 970468 633178 809058 946410 611880 659191 863442 824910 748034
14729 748034 313196 660641 540060 660284 692096 742819 839037 936135 650845 800094
14719 800094 631666 599457 389736 593741 424183 821354 676034 668710 786126 1187261
$$ packed form
14792E81307O1751l07511J61821m5680K14072j63703P345q0473J73210B78410
14781D56683j40681K37823j39753r8556p7232L59489A88859J64956K71911J11630
14771G37356J1785k02801k40219K02992O8768j71664q8889M66077l30103K0306
14761D73608J18415k74994K4424P3855L83975J0738q2503k36027l4007j7988J68389
14750F07885K51880q9240J37897m9177j92611M8302q389j25918o3686P1777k6559
14739E62161K03986K04321l37290J75880J37352l34530M7311K04251l8532p6876
14729G48034C13196L47445j20581J20224L1812N0723R6218R7098k85290J49249
14719H00094j68428l2209k09721K04005j69558L97171j45320p324J17416M01135
$$ plain form
14709 1187261 701235 696124 775700 773652 541707 754030 1010067 749011 516576 694227
14699 694227 800467 1111340 790145 984191 750337 1099956 953645 654117 766584 675563
14689 675563 876181 1089386 1008929 1134737 958753 893982 699183 858940 1010753 1016808
14679 1016808 1126503 861897 761935 1204127 1127437 985597 1098838 1179981 949662 1040311
14669 1040311 857372 1173591 1224663 782335 1072309 760176 1190616 875091 1180764 1161869
14659 1161869 814695 603673 1126284 1125844 1125187 1061887 1240607 1207316 1398083 1121078 1276926
14648 1276926 1127239 1076080 1137386 1177627 1291722 1176166 1042167 1216044 1525940 1061555
14638 1061555 1571686 1544804 1429650 1098112 1285296 1074479 753606 1302280 1295654 1371128
$$ packed form
14709A187261m86026n111P9576k048k31945K12323K56037k61056k32435J77651
14699F94227J06240L10873l21195J94046k33854L49619j46311k99528J12467r1021
14689F75563K00618K13205q0457J25808j75984o4771j94799J59757J51813O055
14679A016808J09695k64606r9962M42192p6690j41840J13241Q1143k30319R0649
14669A040311j82939L16219N1072m42328K89974l12133M30440l15525L05673j8895
14659A161869l47174k11022N22611m40o57o3300J78720l3291J90767k77005J55848
14648A276926j49687n1159O1306M0241J14095j15556j33999J73877L09896m64385
14638A061555N10131k6882j15154l31538J87184k10817l20873N48674o626P5474
$$ plain form
14628 1371128 1210134 1403242 1296560 1158233 1453122 1610353 1564740 1316864 1726118 1523170
14618 1523170 1219031 1602263 1567201 1552968 1484170 1889361 1445568 1262510 1446864 1601393
14608 1601393 1479507 1453269 1449793 1391128 1394627 1626875 1590251 1459261 1466111 1752384 1401393
14597 1401393 1541980 1333137 1472852 1507984 1405070 1703597 1827663 1451491 1769274 1637972
14587 1637972 1524023 1835128 1923575 1944143 1821002 1767701 2094651 1702378 1791174 1897530
14577 1897530 2155613 1901274 1754953 1980358 1990405 2134314 2131685 2169691 2125583 2419883
14567 2419883 2333646 2378485 2394540 2503331 2342187 2789797 2762866 2380535 2784926 2902204
14557 2902204 2933577 3102751 3196598 3191809 3625177 4135881 4679911 5832549 7637713 11370763
$$ packed form
14628A371128j60994J93108j06682j38327K94889J57231m5613k47876M09254k02948
14618A523170l04139L83232l5062j4233o8798M05191m43793j83058J84354J54529
14608A601393j21886k6238l476n8665L499K32248l6624j30990O850K86273l50991
14597A401393J40587k08843J39715L5132j02914K98527J24066l76172L17783j31302
14587A637972j13949L11105Q8447K0568j23141n3301L26950l92273Q8796J06356
14577A897530K58083k54339j46321K25405J0047J43909k629L8006m4108K94300
14567B419883q6237M4839J6055J08791j61144M47610k6931l82331M04391J17278
14557B902204L1373J69174R3847m789M33368N10704N44030J152638J805164L733050
$$ plain form
14547 11370763 19472887 37946146 39305202 21843296 10756794 5136474 3120786 2457887
14539 2457887 2291631 1756989 1992301 1729899 2010902 1790734 2024524 1993975 2230314 1596437
14529 1596437 2079353 2083417 2216513 2325937 2493904 2218079 1899159 2233034 2394730 2611268
14519 2611268 2365857 2345250 2523797 2540362 2949761 2800937 2678057 2773375 2902192 2772123
14509 2772123 2657681 2842687 2844602 2991843 2721476 2665404 2831270 3108243 2987494 2918051
14499 2918051 3019535 2965755 3043249 3050853 3224423 3416010 3211428 3111814 3385233 3522321
14489 3522321 3472596 3491952 3346308 3219377 3585170 3424163 3403410 4042362 3597566 3824104
14479 3824104 3651642 3676633 3732247 3848023 3975200 3944767 4071480 4155141 4073585 4133173
$$ packed form
14547A1370763Q102124J8473259J359056j7461906A0756794E136474k015688o62899
14539B457887j66256n34642K35312k62402K81003k20168K33790l0549K36339o33877
14529A596437M82916M064J33096J09424J67967k75825l18920L33875J61696K16538
14519B611268k45411k0607J78547J6565M09399j48824j22880R5318J28817j30069
14509B772123j14442J85006J915J47241k70367n6072J65866K76973j20749o9443
14499B918051J01484n3780P7494P604J73570J91587k04582r9614K73419J37088
14489C522321m9725J9356j45644j26931L65793j61007k0753O38952m44796K26538
14479C824104j72462K4991N5614J15776J27177l0433J26713Q3661q1556N9588
$$ plain form
14469 4133173 4370959 4210144 4379932 4638415 4435297 4300586 4415101 4330371 4637781 4425367
14459 4425367 4764145 4664745 4421810 4793421 4650866 5030089 4847464 5486074 5092994 5112183
14449 5112183 5052653 4797003 5425437 5423372 5307145 5625446 5709497 5785461 5528113 6211016
14439 6211016 5977226 5983843 6154278 6195280 6371887 6326030 6681955 6414685 6683205 6731696
14429 6731696 6662400 6913870 7399978 6965812 7285379 7482520 7172908 7871805 7796693 7714598
14419 7714598 7896523 7993677 8196325 8002414 8183395 8409875 8865036 8570698 8833240 8838564
14409 8838564 8846771 9194675 9434141 9494462 9495338 9760739 9953668 9920717 10119219 10347697 10652771
14398 10652771 10676586 11043786 10760544 11046914 11278813 11701272 11889245 11793110 12017718 12532629
$$ packed form
14469D133173K37786j60815J69788K58483k03118j34711J14515q4730L07410k12414
14459D425367L38778r9400k42935L71611j42555L79223j82625O38610l93080J9189
14449E112183n9530k55650O28434k065j16227L18301Q4051P5964k57348O82903
14439F211016k33790O617J70435M1002J76607m5857L55925k67270K68520M8491
14429F731696o9296K51470M86108m34166L19567J97141l09612O98897p5112q2095
14419G714598J81925R7154K02648j93911J80981K26480M55161k94338K62542N324
14409H838564Q207L47904K39466O0321Q76K65401J92929l2951J98502K28478L05074
14398A0652771K3815L67200k83242K86370K31899M22459J87973r6135K24608N14911
$$ plain form
14388 12532629 12934463 12973184 13215146 13238689 13401341 13672427 13811277 14247658 14464752 14564879
14378 14564879 15141190 15337293 15614458 16155266 16164777 16254132 16489080 17140165 17626134 17847955
14368 17847955 18348627 18638416 18927356 19412230 19706157 20233611 20496887 21162245 21444511
14359 21444511 22074860 22377891 23093512 23371605 23891816 24740562 24924091 25940975 26159816
14350 26159816 27041302 27730459 28569126 29020828 30224624 30250526 30880254 32129545 33466378
14341 33466378 34439864 34971121 35703523 36895620 37878385 39150924 39998231 41417167 42429438
14332 42429438 44101890 45301343 46662614 48090369 49520265 51295296 52953766 54688204
14324 54688204 56380434 58538736 60644034 62703747 64628370 67297286 69547851 71706211
$$ packed form
14388A2532629M01834L8721K41962K3543J62652K71086J38850M36381K17094J00127
14378A4564879N76311J96103K77165N40808R511Q9355K34948O51085M85969K21821
14368A7847955N00672K89789K88940M84874K93927N27454K63276O65358K82266
14359B1444511O30349L03031P15621K78093N20211Q48746J83529J016884K18841
14350B6159816Q81486O89157Q38667M51702J203796K5902O29728J249291J336833
14341C3466378R73486N31257P32402J192097R82765J272539Q47307J418936J012271
14332D2429438J672452J199453J361271J427755J429896J775031J658470J734438
14324E4688204J692230K158302K105298K059713J924623K668916K250565K158360
$$ plain form
14316 71706211 74595448 77668036 80542018 83562551 86904038 90477914 94180537 98083979
14308 98083979 101894294 106639602 111060614 115674551 120861305 126369615 131871238 137976060
14300 137976060 144053699 150925472 158272401 165593226 173896742 182101246 190770705 200362232
14292 200362232 210475459 220680856 231624463 243267123 255245263 267645718 280476277
14285 280476277 293920163 307196923 321420808 335667870 350091065 364396478 378669153
14278 378669153 392226297 405447112 417544384 428368697 437060655 442243361 443590881
14271 443590881 444477399 444701078 441696649 437885721 433960839 429242291 421650248 411480246
14263 411480246 399040472 385719771 370907733 355721914 340142410 324825808 309554950
$$ packed form
14316G1706211K889237L072588K873982L020533L341487L573876L702623L903442
14308I8083979L810315M745308M421012M613937N186754N508310N501623O104822
14300A37976060O077639O871773P346929P320825Q303516Q204504Q669459R591527
14292B00362232J0113227J0205397J0943607J1642660J1978140J2400455J2830559
14285B80476277J3443886J3276760J4223885J4247062J4423195J4305413J4272675
14278C78669153J3557144J3220815J2097272J0824313Q691958N182706J347520
14271D43590881Q86518K23679l004429l810928l924882m718548p592043j0170002
14263D11480246j2439774j3320701j4812038j5185819j5579504j5316602j5270858
$$ plain form
14256 309554950 294530893 279844007 267067773 254057279 241127367 228808088 217297223
14249 217297223 206532441 195798648 186198871 176764238 167920206 160300815 152786058 145940688
14241 145940688 138476741 132233232 126569762 120903255 115725787 110126465 105883511 101100573
14233 101100573 96804860 93059580 89849627 85803397 82819230 79178129 76358967 73522090
14225 73522090 70650645 68056409 65892258 63464151 61145634 59424118 57023921 55311747
14217 55311747 53545786 51496534 50338324 48888733 47307883 45512437 44235396 43020239
14209 43020239 41411912 40581466 40097795 38930106 37864123 36474822 35342061 34317522
14201 34317522 33811566 33000324 31706391 31085689 30265521 29129880 28589395 28064828 27332614
$$ packed form
14256C09554950j5024057j4686886j2776234j3010494j2929912j2319279j1510865
14249B17297223j0764782j0733793r599777r434633q844032p619391p514757o845370
14241A45940688p463947o243509n663470n666507n177468n599322m242954m782938
14233A01100573m295713l745280l209953m046230k984167l641101k819162k836877
14225G3522090k871445k594236k164151k428107k318517j721516k400197j712174
14217E5311747j765961k049252j158210j449591j580850j795446j277041j215157
14209D3020239j608327q30446m83671j167689j065983j389301j132761j024539
14201C4317522n05956q11242j293933o20702q20168j135641n40485n24567p32214
$$ plain form
14192 27332614 26738801 26069690 25751007 24614102 24373397 23892500 23062484 22477034 22155296
14183 22155296 21624568 21122556 20481078 20264569 19899475 19564388 19268553 18764309 18262878
14174 18262878 17691190 17652566 16956789 17020871 16403538 16206774 15762857 15334362 15081380 14888539
14164 14888539 14521761 14447005 13840017 13891628 13461716 13400311 12878223 13095030 12706626 12255024
14154 12255024 12651932 12508116 12301808 11475881 11449607 11303458 11128151 11019515 10494014
14145 10494014 10637508 10474439 10609516 9839624 10023077 9534782 9843678 9629913 9445143
14136 9445143 9293418 9132324 8933207 8771886 8927605 8543903 8489759 8108727 8272867 8066946
14126 8066946 8156392 7760720 7915446 7627482 7659071 7641824 7052703 7223355 7479451 7154598
$$ packed form
14192B7332614n93813o69111l18683j136905k40705m80897q30016n85450l21738
14183B2155296n30728n02012o41478k16509l65094l35087k95835n04244n01431
14174A8262878n71688l8624o95777O4082o17333j96764m43917m28495k52982j92841
14164A4888539l66778p4756o06988N1611m29912o1405n22088K16807l88404m51602
14154A2255024L96908j43816k06308q25927k6274j46149j75307j08636n25501
14145A0494014J43494j63069J35077p69892J83453m88295L08896k13765j84770
14136I445143j51725j61094j99117j61321J55719l83702n4144l81032J64140k05921
14126H066946Q9446l95672J54726k87964L1589j7247n89121J70652K56096l24853
$$ plain form
14116 7154598 7003815 7052389 6985595 6840544 6560935 6600020 6449965 6319022 6348492 6185321
14106 6185321 6332760 6102628 6065068 6064419 5952267 5855640 5966005 6022575 5763778 5655359
14096 5655359 5314543 5614467 5377427 5527441 5446755 5182191 5077473 5243554 4771002 5270220
14086 5270220 5068417 4878666 4787836 4902874 4755670 4783864 4779160 4546772 4746180 4540956
14076 4540956 4740001 4479156 4170557 4087679 4608470 3838284 4267155 4148920 4039615 4137824
14066 4137824 3998376 3834138 3715810 4019844 3982625 3931543 3940138 3567605 4022828 3651711
14056 3651711 3962686 3398998 3823153 3362679 3508875 3445571 3264518 3576987 3199444 3082550
14046 3082550 3610712 3523373 3247638 3197565 3116896 2909270 2810416 2971467 3088207 2892221
$$ packed form
14116G154598j50783M8574o6794j45051k79609L9085j50055j30943K9470j63171
14106F185321J47439k30132l7560o49j12152r6627J10365N6570k58797j08419
14096E655359l40816K99924k37040J50014q0686k64564j04718J66081m72552M99218
14086E270220k01803j89751r0830J15038j47204K8194m704k32388J99408k05224
14076D540956J99045k60845l08599q2878N20791p70186M28871j18235j09305R8209
14066D137824j39448j64238j18328L04034l7219n1082Q595l72533M55223l71117
14056C651711L10975n63688M24155m60474J46196o3304j81053L12469l77543j16894
14046C082550N28162q7339k75735n0073q0669k07626r8854J61051J16740j95986
$$ plain form
14036 2892221 2888091 3111177 2944130 2782829 2951512 3023511 2743031 2924224 2839427 2608067
14026 2608067 2712982 2693826 2518040 2655247 2663544 2838154 2493925 2132352 2475854 2549471
14016 2549471 2503544 2170016 2186699 2467790 2188226 2048446 2211439 2308587 2341470 2137128
14006 2137128 1980470 2502151 2381365 2216991 2176359 2044576 2542128 2410435 2158400 2080557
13996 2080557 2419125 2396087 2005476 2130672 2447446 2372771 2849264 3630327 6597005 13358028
13986 13358028 31023109 40919484 25598118 13641775 8673890 5687960 4447764 4041931
13978 4041931 3178540 3231783 3013118 2963916 2459256 2742957 2524729 2396522 2407476 2120329
13968 2120329 2149777 2176245 2056075 2342801 2052306 2028751 2094214 1885869 2221609 2007090
$$ packed form
14036B892221m130K23086j67047j61301J68683P1999k80480J81193q4797k31360
14026B608067J04915j9156j75786J37207Q297J74610l44229l61573L43502P3617
14016B549471m5927l33528J6683K81091k79564j39780J62993R7148L2883k04342
14006B137128j56658N21681j20786j64374m0632j31783M97552j31693k52035p7843
13996B080557L38568k3038l90611J25196L16774p4675M76493P81063K966678O761023
13986A3358028J7665081R896375j5321366j1956343m967885k985930j240196m05833
13978D041931q63391N3243k18665m9202n04660K83701k18228j28207J0954k87147
13968B120329K9448K6468j20170K86726k90495k3555O5463k08345L35740k14519
$$ plain form
13958 2007090 2085060 1892165 1679957 1787393 2167976 1909440 1597449 1660129 1700059 1827215
13948 1827215 1883811 2177218 1767501 1787810 1789217 2131540 1391383 1951254 1774665 1533921
13938 1533921 1553817 1480797 1378660 1923218 1699329 1663306 1896082 1435941 1468230 1712575
13928 1712575 1342549 1419848 1420292 1539295 1481707 1425072 1403680 1360854 1387822 1383300 1225118
13917 1225118 1569061 1649303 1248829 1500810 1169457 1468384 1177629 1364754 1396429 1453640
13907 1453640 1379439 1247413 1398068 1521380 1381448 1174761 1244242 1151328 1376929 1195691
13897 1195691 1031231 1235142 1006014 1154356 1232952 1256556 1022625 1427448 1491930 798207
13887 798207 867589 939099 1241514 1010933 882708 790876 1109367 1062726 952770 962773
$$ packed form
13958B007090P7970j92895k12208J07436L80583k58536l11991O2680L9930J27156
13948A827215N6596K93407m09717K0309J407L42323p40157N59871j76589k40744
13938A533921J9896p3020j02137N44558k23889l6023K32776m60141L2289K44345
13928A712575l70026P7299M44J19003n7588n6635k1392m2826K6968m522j58182
13917A225118L43943Q0242m00474K51981l31353K98927k90755J87125L1675N7211
13907A453640p4201j32026J50655J23312j39932k06687O9481r2914K25601j81238
13897A195691j64460K03911k29128J48342P8596K3604k33931M04823O4482o93723
13887G98207O9382P1510L02415k30581j28225r1832L18491m6641j09956J0003
$$ plain form
13877 962773 1066082 1251971 905183 948645 1113171 1178682 1044783 1184444 1129760 1157408
13867 1157408 1030940 1202689 825264 815090 1161593 922970 870200 1027513 1135786 912866
13857 912866 1090716 870117 802456 961063 895567 874259 1085327 1096054 1510840 895004
13847 895004 898240 1277588 700504 848255 1144414 760034 669305 832916 1026000 1119260
13837 1119260 673641 811283 869758 846098 1122382 856932 844112 810207 982369 829928
13827 829928 1139027 792177 628632 720152 586006 995034 638676 795721 906039 803007
13817 803007 660907 645517 846255 815030 561310 748495 1215469 817680 484915 542391
13807 542391 526098 687552 781182 633148 678013 489589 543302 743031 952679 700819
$$ packed form
13877I62773J03309J85889l46788M3462J64526O5511j33899J39661n4684K7648
13867A157408j26468J71749l77425j0174L46503k38623n2770J57313J08273k22920
13857I12866J77850k20599o7661J58607o5496k1308K11068J0727M14786o15836
13847H95004L236L79348n77084J47751K96159l84380r0729J63611J93084R3260
13837A119260m45619J37642N8475k3660K76284k65450j2820l3905J72162j52441
13827H29928L09099l46850j63545R1520j34146M09028l56358J57045J10318j03032
13817H03007j42100j5390K00738l1225k53720J87185M66974l97789l32765N7476
13807E42391j6293J61454R3630j48034M4865j88424N3713J99729K09648k51860
$$ plain form
13797 700819 794180 1066317 684664 648642 795330 641840 720789 669169 1041707 442294
13786 730907 642247 516804 720630 842438 1107540 493745 985239 785945 754536 506637
13776 506637 525456 501946 783354 819567 265146 817117 903303 778490 965104 604830
13766 604830 408505 746563 680508 564282 606878 668225 551834 732480 573362 248626
13755 835830 384250 314821 784686 537525 369283 526460 768597 667150 662463 663526
13745 663526 656204 563851 746009 407295 755755 606248 527404 674662 519471 539584
13735 539584 546506 379065 472226 861215 466096 755857 496963 606482 385247 712366
13725 712366 668011 359829 429067 400029 812745 616986 219050 583940 347553 710315
$$ packed form
13797G00819R3361K72137l81653l6022J46688j53490P8949n1620L72538D42294
13786G30907q8660j25443K03826J21808K65102D93745M91494j99294l1409k47899
13776E06637J8819k3510K81408L6213B65146N51971Q6186j24813J86614l60274
13766F04830j96325L38058o6055j16226M2596O1347j16391J80646j59118B48626
13755H35830C84250o9429M69865k47161j68242J57177K42137j01447m687J063
13745F63526p322r2353J82158l38714L48460j49507p8844J47258j55191K0113
13735E39584O922j67441R3161L88989l95119K89761k58894J09519k21235L27119
13725G12366m4355l08182O9238k9038M12716j95759B19050L64890k36387L62762
$$ plain form
13715 710315 561230 271992 442585 181345 609640 730314 475395 578380 430063 737095
13705 737095 371600 487800 472144 262740 450483 690256 476192 859440 572153 563891
13695 563891 516563 265034 504880 667382 521012 276497 487786 949012 287359 286289
13685 286289 506919 531296 501003 490114 398275 419839 633364 186729 121079 465839 374586
13674 374586 556495 646470 428964 699406 233590 829387 117363 333997 353835 393455
13664 393455 854227 642185 310879 237546 215267 435574 522482 286204 300135 248424
13654 248424 270288 382507 341405 607535 567019 143591 422415 402229 459640 446685 569355
13643 569355 348532 607795 225391 498943 770561 238432 203633 37812 245476 620073
$$ packed form
13715G10315j49085B71992J70593A81345M28295J20674k54919J02985j48317L07032
13705G37095l65495J16200j5656k09404J87743K39773k14064L83248k87287q262
13695E63891m7328k51529K39846J62502j46370k44515K11289M61226B87359j070
13685B86289K20630K4377l0293j0889r1839K1564K13525A86729o5650L44760r1253
13674C74586J81909Q9975k17506K70442B33590N95797A17363K16634J9838L9620
13664C93455M60772k12042C10879p3333k2279K20307Q6908k36278J3931n1711
13654B48424K1864J12219m1102K66130m0516A43591K78824k0186N7411j2955J22670
13643E69355k20823K59263B25391K73552K71618B38432l4799C7812K07664L74597
$$ plain form
13633 620073 370131 610984 223501 375032 528686 361271 228023 398916 249467 328059
13623 328059 280643 429469 530934 540727 302020 265600 472474 534274 452642 166080 77330
13611 511999 146822 325850 510125 346170 289063 113912 378959 650135 332750 601435
13601 601435 -91919 458137 23393 178037 503931 344498 618468 1179 481184 275967
13591 275967 722809 223538 444174 432642 547997 81637 186598 265631 111678 22748
13580 331010 137773 300740 313629 287881 550467 89802 126117 225765 45307 406137 12475
13568 461734 102131 -82712 166534 296153 411679 135773 399356 110555 -75193 405023
13557 355714 279910 329380 355255 418650 493219 52173 543510 326791 213886 649537 332666
$$ packed form
13633F20073k49942K40853B23501J51531J53654j67415j33248J70893j49449P8592
13623C28059m7416J48826J01465R793k38707l6420K06874O1800q1632A66080G7330
13611E11999A46822J79028J84275j63955n7107A13912K65047K71176l17385K68685
13601F01435i1919D58137B3393J54644L25894j59433K73970A179M80005k05217
13591B75967M46842B23538K20636j1532J15355H1637J04961P9033A11678B2748
13580C31010A37773J62967J2889k5748K62586H9802L6315R9648D5307L60830A2475
13568D61734A02131h2712A66534J29619J15526A35773K63583A10555g5193D05023
13557C55714p5804M9470K5875O3395P4569E2173M91337k16719j12905M35651l16871
$$ plain form
13546 332666 420223 297144 304029 231995 373227 397102 290729 305213 437764 421769 236957
13535 236957 277463 -98675 378277 185332 74364 190830 174506 206089 339053 338832 398522
13524 398522 95571 316715 124047 186968 289878 174089 253760 450916 134126 -55637
13513 425066 145959 465718 702424 -127443 30830 428110 218515 129621 128989 133159 170146
13502 170146 236283 438787 351283 450827 216945 679548 192759 432474 -93503 -55434
13492 -55434 -19790 455866 326731 -27637 154334 402209 233877 78907 171325 109531 167512
13481 167512 248131 320419 158320 261607 228774 232166 315126 88613 465289 226590 57535
13469 2088 363635 103750 190093 -173946 325829 211934 337156 -105195 10725 326857
$$ packed form
13546C32666Q7557j23079O885p2034J41232K3875j06373J4484J32551j5995j84812
13535B36957M0506i8675C78277A85332G4364J16466j6324L1583J32964k21N9690
13524C98522I5571K21144A24047O2921J02910j15789P9671J97156A34126e5637
13513D25066A45959L19759K36706a27443C0830L97280k09595q8894o32M170L6987
13502A70146O6137K02504q7504R9544B16945M62603A92759K39715i3503L8069
13492e5434a9790D55866j29135b7637A54334K47875j68332G8907R2418o1794N7981
13481A67512Q0619P2288A58320J03287l2833L392Q2960H8613L76676B26590E7535
13469B088L61547A03750Q6343a73946C25829j13895J25222a05195A0725L16132
$$ plain form
13459 326857 397201 228035 -23075 429391 223598 684542 378187 -7632 151232 252971
13449 252971 167357 407169 370030 550398 316350 82674 137822 95781 392628 263934
13439 263934 67658 156215 93599 -96740 190240 101548 254499 115071 -70291 208768 -187504
13427 81293 500993 248614 -49453 -123672 87796 72082 543787 202852 292981 76473 119327
13416 119327 -89516 218102 272957 601003 -17228 264110 322379 241741 -284247 65936 239044
13405 239044 -14061 374294 222472 133317 204806 347543 340395 60713 2925 38429 141959
13394 141959 211911 200844 11813 90712 74657 205785 303286 251898 131287 449586 198021
13382 106840 23311 366101 223638 107264 314646 -70217 152853 193407 521453 -46262
$$ packed form
13459C26857P0344j69166b3075D29391k05793M60944l06355g632A51232J01739
13449B52971q5614K39812l7139J80368k34048H2674N5148m2041K96847j28694
13439B63934F7658Q8557o2616i6740A90240q8692J52951A15071g0291B08768a87504
13427H1293M19700B48614d9453p4219H7796j5714M71705B02852R0129G6473M2854
13416A19327h9516B18102N4855L28046a7228B64110N8269q0638b84247F5936J73108
13405B39044a4061C74294j51822q9155P1489J42737p148F0713B925L5504J03530
13394A41959O9952j1067A1813P8899j6055J31128R7501n1388j20611L18299A98021
13382A06840B3311L42790j42463A07264K07382g0217A52853M0554L28046d6262
$$ plain form
13371 325821 78845 90206 124693 118941 388439 52077 297674 32784 85767 258105 353359
13360 353359 54234 420788 747831 279121 164109 36103 270910 197065 24551 52362
13350 52362 -115601 89108 -38852 280306 29911 172918 258687 581411 380536 211362
13340 211362 208412 336725 256542 358871 -49893 346103 -36290 67486 59224 -11397 257009
13328 111772 77236 131388 316426 -198462 130161 330797 62035 -40352 257597 -110578
13317 188695 380230 211811 -238422 459116 14206 102969 -35963 9463 320047 85242 164459
13306 164459 59126 186957 16613 335464 570596 400060 149628 132863 330608 408072
13296 408072 226117 150435 248963 386111 144167 -86662 298017 -48866 219263 101861
$$ packed form
13371C25821G8845J1361L4487n752K69498E2077K45597C2784N2983J72338R5254
13360C53359E4234L66554L27043B79121j15012C6103K34807p3845B4551K7811
13350E2362a15601H9108c8852B80306B9911J43007Q5769L22724k00875j69174
13340B11362k950J28313q0183J02329d9893C46103c6290F7486q262a1397B57009
13328A11772l4536N4152J85038a98462A30161K00636F2035d0352B57597a10578
13317A88695J91535j68419b38422D59116A4206Q8763c5963I463L10584H5242P9217
13306A64459E9126J27831A6613L18851K35132j70536A49628j6765J97745P7464
13296D08072j81955p5682R8528J37148A44167h6662B98017d8866B19263A01861
$$ plain form
13285 176743 -65914 225329 117610 191334 21781 20968 252714 -42059 -206000 -24390 371186
13273 164738 -84550 26840 168802 -7957 -407034 -234969 -63284 343491 199823 309587
13263 309587 176426 290414 78306 186973 -197956 -19128 317965 -98378 -112329 333798
13252 176656 196704 -19917 -13654 125918 72686 72720 85278 170258 124717 404674 -7297 -69350
13240 -69350 -205393 177750 85377 -190563 123749 46420 287068 -47562 38119 -2678 94906
13228 212814 -108729 386294 -48093 302846 -136534 -121539 230877 238870 23551 -180335
13217 -24510 -147652 -232361 24078 214015 52543 188903 -34411 115495 -11716 -276940 81910
13205 74324 190682 38672 -153744 74532 14349 -322059 -24213 -133974 94384 -192913 -75861
$$ packed form
13285A76743f5914B25329j07719P3724B1781q13K31746d2059j63941b4390C71186
13273A64738h4550B6840J41962g957l99077J72065f3284C43491j43668J09764
13263C09587j33161J13988G8306J08667a97956a9128C17965i8378j3951C33798
13252A76656K0048a9917O263A25918n3232L4J2558Q4980m5541K79957g297o2053
13240f9350j36043A77750H5377a90563A23749D6420K40648d7562C8119b678I4906
13228B12814a08729C86294d8093C02846a36534J4995B30877P993B3551a80335
13217b4510j23142q4709B4078J89937E2543J36360c4411A15495a1716k65224H1910
13205G4324J16358C8672a53744G4532A4349c22059b4213j09761I4384a92913g5861
$$ plain form
13193 19406 -70311 -91476 -142235 299443 48983 136151 164348 105136 160631 71608 -104508
13181 -177913 158323 64594 265281 88248 170527 67497 379590 15838 1868 1515 420734
13170 420734 145195 204207 -72338 -49528 -24695 -55760 122836 -2816 137678 105245 -131441
13158 -233626 -52589 43777 247805 166617 -122133 65156 339330 -185385 -203347 124493
13147 -154550 76899 4897 67052 316 181376 -186726 179728 386018 -314263 -130079 219859
13135 161575 223058 -28694 370394 100795 187803 -215549 209546 -93329 -48426 209329
13124 -322695 49965 7188 124107 -103746 212168 1378 58131 156832 183765 68627 75932
13113 75932 387746 186239 258538 -86390 133815 354847 379965 405712 275351 205797 123379
$$ packed form
13193A9406g0311k1165n0759B99443D8983Q7168K8197n9212N5495G1608a04508
13181a77913A58323F4594K00687H8248Q2279F7497L12093A5838A868l53M19219
13170D20734A45195N9012g2338K2810b4695l1065A22836b816A37678l2433a31441
13158b33626e2589D3777K04028q1188a22133F5156K74174a85385j7962A24493
13147a54550G6899D897O2155C16J81060a86726A79728K06290c14263a30079B19859
13135A61575O1483b8694C70394A00795Q7008b15549B09546i3329M4903B09329
13124c22695D9965G188J16919a03746B12168A378N6753R8701K6933F8627P305
13113G5932L11814A86239P2299h6390A33815K21032K5118K5747j30361o9554q2418
$$ plain form
13102 123379 -102548 108813 40734 85626 116241 15231 -210498 379604 -93336 48979 107414
13091 107414 -4108 155548 -12834 93188 137243 -8282 31670 158780 46606 -82266 30382
13079 202114 118334 80420 306305 397850 -170542 -42059 94776 -66332 296579 172620 -295459
13067 53849 -104132 260807 -20563 458133 24998 505307 65438 -172612 260969 105485
13056 -227012 240909 127681 44365 -155610 203301 80661 34055 -146148 -62548 163334
13045 206770 219589 413086 -15535 546581 68491 -63 50816 -119027 -21848 -38568 -241771
13034 -241771 -4149 208374 -8302 -117710 167524 172654 -45376 131503 245819 144535 397181
13023 397181 112952 30456 116938 -65027 34307 112935 173452 352761 328644 399075 -120898
$$ packed form
13102A23379a02548A08813D0734M4892L0615A5231b10498C79604i3336D8979N8435
13091A07414d108A55548a2834I3188M4055h282C1670J27110D6606h2266C0382
13079B02114q3780l7914K25885R1545a70542d2059I4776f6332B96579j23959b95459
13067E3849a04132B60807b0563D58133B4998M80309F5438a72612B60969A05485
13056b27012B40909j13228D4365a55610B03301H0661C4055a46148f2548A63334
13045B06770J2819J93497a5535E46581F8491f3E0816a19027b1848j6720k03203
13034b41771d149B08374h302j09408A67524N130d5376A31503J14316j01284K52646
13023C97181A12952C0456Q6482f5027C4307P8628O0517J79309k4117P0431a20898
$$ plain form
13011 17535 -69597 63712 190814 126766 246484 177080 -26176 206723 87285 -120643 173464
12999 280875 231995 -88257 1346 356291 4865 14383 -156031 -78602 29214 161192 -167689
12987 79680 138826 273122 -56539 5818 29023 147980 -217053 18242 -374526 17777 -2303
12975 212596 100021 182063 -109816 460379 41987 -137434 267744 -153684 88541 76126
12965 76126 257162 110458 -196607 166298 -385134 98025 178984 245180 219642 -52012 270168
12953 45483 174223 147917 1845 124669 6376 31733 -2142 -163540 227350 -112491 -14400
12941 130609 3298 -143612 -110133 43604 -101853 110441 150509 187579 -40128 110299 -31112
12929 -3531 -65078 443875 -160561 -61707 5967 -154172 35873 -359234 74336 153657 35608
$$ packed form
13011A7535f9597F3712J27102o4048J19718o9404b6176B06723H7285a20643A73464
12999B80875m8880h8257A346L54945D865R518a56031P7429B9214J31978a67689
12987G9680N9146J34296e6539E818K3205J18957b17053A8242c74526A7777b303
12975B12596A00021Q2042a09816D60379D1987a37434B67744a53684H8541j2415
12965G6126J81036A10458a96607A66298c85134I8025Q0959O6196k5538e2012B70168
12953D5483J28740k6306A845J22824F376K5357b142j61398B27350a12491a4400
12941A30609C298a43612L3479D3604a01853A10441M0068L7070d0128A10299c1112
12929c531o1547D43875a60561f1707E967a54172C5873c59234G4336P9321C5608
$$ plain form
12917 -160361 101239 -60461 -190657 -355949 -101902 -329407 -48582 75620 203112 383480
12907 383480 167786 35349 -64196 135185 63166 -130216 214993 323135 -148793 12613
12896 276906 52380 -37229 -192368 -36284 93418 351951 197621 199206 85546 107047 -82348
12884 -112285 28114 29426 157302 223569 -8726 243433 -213376 331157 -391798 174766 257817
12873 257817 67273 14001 129700 183758 15150 260076 -139145 -4615 -457413 -20096 -246316
12862 -246316 -360154 -56045 310351 -88193 166524 88221 -8075 277402 -315826 -217443 -262785
12851 -262785 14684 -148080 69319 -52144 -55429 -382622 128275 -103907 -165844 -195722 472335
12839 346158 87585 229773 -62304 50097 80949 40215 31169 -95793 251016 -73473 -26747
$$ packed form
12917a60361A01239f0461j30196j65292a01902k27505d8582G5620J27492J80368
12907C83480A67786C5349f4196A35185F3166a30216B14993J08142a48793A2613
12896B76906E2380c7229j55139c6284I3418K58533j54330J585H5546K1501h2348
12884a12285B8114J312J27876O6267h726B43433b13376C31157c91798A74766Q3051
12873B57817F7273A4001J15699N4058A5150K44926a39145d615m52798b0096k26220
12862b46316j13838e6045C10351h8193A66524p8303h075B77402c15826R8383m5342
12851b62785A4684a48080F9319e2144l285l27193A28275a03907o1937k9878D72335
12839C46158H7585J42188f2304E0097L0852D0215r046i5793B51016g3473b6747
$$ plain form
12827 118100 -246580 59264 178701 255044 -12062 -142189 335831 -251947 -96426 -41313
12816 -172186 49879 82102 -158735 253164 9641 -350663 -77575 30127 73932 176810 -359540
12804 81906 393721 311416 99990 -114104 70313 -270184 -45510 56032 -82437 208688 140921
12793 140921 71701 301560 -180920 -310952 121860 112071 143245 -98744 -169901 -174061 33065
12781 -34126 156426 25129 -173903 2254 -30286 139285 -594710 246801 319745 -134174 61880
12769 -285631 -99830 -107831 73379 150669 45026 -128485 174106 -38664 152021 -47860 125852
12757 56892 -240753 -284931 42673 -95990 227701 229405 -251448 120592 32918 147367 57880
12745 -244113 -165361 211064 -104575 165955 -142423 -24640 32413 105078 151287 7908 262775
$$ packed form
12827A18100b46580E9264J19437P6343a2062j30127C35831b51947i6426d1313
12816a72186D9879L2223a58735B53164I641c50663g7575C0127M3805J02878c59540
12804H1906L11815q2305I9990a14104G0313b70184d5510E6032h2437B08688o7767
12793A40921o9220K29859a80920j30032A21860r789L1174i8744p1157m160C3065
12781c4126A56426B5129a73903B254c0286A39285e94710B46801P2944a34174F1880
12769b85631i9830q001G3379P7290D5026a28485A74106c8664A52021d7860A25852
12757E6892b40753m4178D2673i5990B27701J704b51448A20592C2918J14449E7880
12745b44113P8752B11064a04575A65955a42423b4640C2413P2665M6209G908K54867
$$ plain form
12734 262775 12687 211909 -27831 225450 -99300 -34906 116237 141299 97962 9388 -205364
12722 -196120 -40045 235129 -358599 -26240 -130769 94613 -6895 19271 220137 -37775 -278495
12711 -278495 270176 297510 423941 192037 459168 499936 -145621 117352 306290 267179
12701 267179 210685 236974 -252759 300795 159065 196243 19884 310939 -253099 -173554
12691 -173554 180921 -109871 105594 -140530 122258 -240863 -220223 97738 182734 478 266619
12680 266619 202057 135699 -108549 17682 275135 206858 305616 159503 111083 39991 50268
12669 50268 -73140 222390 225721 -288905 99108 253151 139913 50252 73278 -18329 -177272
12658 -177272 215988 22612 55144 114058 421856 12694 179440 63356 -20490 152971 44819
$$ packed form
12734B62775A2687J99222b7831B25450i9300c4906A16237K5062m3337I388b05364
12722a96120d0045B35129c58599b6240j04529I4613f895A9271K00866c7775k40720
12711b78495B70176K7334J26431A92037K67131M0768a45621A17352J88938l9111
12701B67179n6494K6289b52759C00795j41730L7178A9884K91055b53099P9545
12691a73554A80921a09871A05594a40530A22258b40863K0640I7738Q4996D78K66141
12680B66619o4562o6358a08549A7682K57453o8277R8758j46113m8420C9991J0277
12669E0268g3140B22390L331b88905I9108J54043j13238E0252K3026a8329j58943
12658a77272B15988B2612L2532N8914L07798A2694J66746F3356b0490A52971D4819
$$ plain form
12646 -31931 -160722 83868 -97707 -96825 -74717 435737 -159958 -208039 111320 14504 109065
12635 109065 270710 -312971 39288 -4015 4858 49647 194355 184685 118080 125032 289348
12624 289348 233713 -250674 188942 -95630 137362 263133 254879 -51455 37200 114547 -114166
12612 -159999 -261205 103840 -776 181 317572 -31663 -117884 31293 57923 65087 196257 74917
12599 217455 -923 292069 92854 -91166 275097 -75377 -214240 -255556 135107 169099 122761
12588 122761 82031 -46272 -253334 -422848 -181912 -16175 69409 -19449 -124647 310361
12577 103948 271300 -143011 -167620 -278448 117562 -201799 197327 317443 244496 137471
12567 137471 118345 115771 -76967 26097 -98369 22622 87586 13877 214141 40760 -36800
$$ packed form
12646c1931j28791H3868i7707Q82K2108D35737a59958m8081A11320A4504R4561
12635A09065J61645c12971C9288d015D858M4789J44708r670o6605O952J64316
12624B89348n5635b50674A88942i5630A37362J25771q254e1455C7200P7347a14166
12612a59999j01206A03840g76A81L17391c1663q6221C1293K6630P164J31170G4917
12599B17455i23B92069I2854i1166B75097g5377j38863m1316A35107L3992m6338
12588A22761m0730d6272k07062j69514a81912a6175F9409a9449j05198C10361
12577A03948J67352a43011k4609j10828A17562b01799A97327J20116p2947j07025
12567A37471j9126k574g6967B6097i8369B2622O4964A3877K00264D0760c6800
$$ plain form
12555 68594 -108872 -228989 -29931 70849 -355870 73401 -198883 -102735 -329153 57074 155281
12544 155281 -139503 216876 94027 -108844 -71974 -327041 251960 -112559 165571 -43027
12533 -346682 -253181 60097 394529 222870 28463 -22255 -43534 -442995 -59324 -1102 -114660
12522 -114660 -6209 250837 344737 178900 -119685 -55312 -45130 126643 79887 35451 317078
12511 317078 -130482 231969 71840 139923 -139975 -239268 54758 56610 -263029 -423525 94980
12499 14485 -140977 -10735 97788 -210595 234792 -55002 -253818 31689 -131910 82239 176115
12488 176115 -260705 17670 11843 -136862 161809 -139175 -68205 -68426 462580 51542 493492
12477 493492 -412612 52309 163814 -25709 150042 -42893 50071 -118258 -84478 -134840 -132774
$$ packed form
12555F8594a08872j20117b9931G0849c55870G3401a98883R6148k26418E7074R8207
12544A55281a39503B16876I4027a08844L6870k55067B51960a12559A65571d3027
12533c46682R3501F0097L34432j71659B8463b2255k1279l99461e9324a102j13558
12522a14660f209B50837R3900j65837a19685e5312J0182A26643m6756C5451K81627
12511C17078a30482B31969G1840O8083a39975r9293E4758J852b63029j60496I4980
12499A4485a40977a0735I7788b10595B34792e5002j98816C1689a31910H2239R3876
12488A76115b60705A7670n827a36862A61809a39175f8205k21D62580E1542M41950
12477D93492d12612E2309J11505b5709A50042d2893E0071a18258L3780n0362K066
$$ plain form
12466 -132774 117699 -82480 -216361 -9622 -10600 9353 166824 -59884 -116898 -114185 -87008 8799
12453 123204 -159958 51331 -387003 -247375 -131111 66882 86685 -198241 -109065 -149109
12443 -149109 262450 -15361 -103812 157784 60625 -112762 -46016 -36233 99036 -160473 140821
12431 113737 151880 66069 98869 164883 180732 -265176 267309 175169 -31261 43622 318913
12420 318913 59699 195879 -63191 -5255 125711 353165 13668 198800 108858 102777 231356
12409 231356 -211939 104213 -54540 -141383 -50955 269593 123417 -98318 239802 91396
12398 -185603 -306700 -77843 -236894 102988 -173739 -29465 -11324 -265993 60755 -167481
12387 17475 -128777 -142282 19159 -88555 -155775 267935 9067 -14308 280367 -24477 -177363
$$ packed form
12466a32774A17699h2480j33881i622r78I353J57471e9884n7014K713K7177H799
12453A23204a59958E1331c87003J39628J16264F6882J9803a98241Q9176m0044
12443a49109B62450a5361q8451A57784F0625a12762d6016R783I9036a60473A40821
12431A13737L8143F6069L2800O6014J5849b65176B67309r2140c1261D3622K75291
12420C18913E9699J36180f3191e255A25711K27454A3668J85132q9942o081J28579
12409B31356b11939A04213e4540q6843e0955B69593A23417i8318B39802I1396
12398a85603j21097g7843j59051A02988a73739b9465a1324k54669F0755a67481
12387A7475a28777j3505A9159h8555o7220B67935I067a4308B80367b4477j52886
$$ plain form
12376 -177363 38660 -214444 -162153 152378 151540 -48906 -134741 -97111 -199989 39921 -125666
12364 -150197 -21001 -63784 -38883 102794 -119570 66284 -143661 133493 279473 264060
12354 264060 168264 201584 86077 -52723 -4093 -104841 3380 -77953 -274294 -212115 220623
12342 -28727 -157507 106947 -316466 -214085 -79754 23931 -61339 -15036 95748 181467 -382078
12330 -429028 -138061 89875 -227866 79605 -38523 44516 -35933 -161113 -103041 69474 457586
12319 457586 480754 -144323 20315 250159 81672 -162489 23902 378880 -171080 52380
12308 9347 -110665 -14802 -136629 -71770 -197026 -2087 -163221 161811 -279057 57048 -5090
12296 119933 -99504 185023 155528 -57038 158456 199858 81608 -51190 185632 148534 -134563
$$ packed form
12376a77363C8660b14444N2291A52378q38d8906q5835L7630j02878C9921a25666
12364a50197b1001m2783K4901A02794a19570F6284a43661A33493J45980j5413
12354B64060r5796L3320H6077e2723d093j00748C380g7953j96341O2179B20623
12342b8727j28780A06947c16466J02381g9754B3931f1339a5036I5748Q5719c82078
12330d29028a38061H9875b27866G9605c8523D4516c5933j25180N8072F9474L88112
12319D57586K3168a44323B0315K29844H1672a62489B3902L54978a71080E2380
12308I347a10665a4802j21827O4859j25256b087j61134A61811b79057E7048e090
12296A19933i9504A85023k9495e7038A58456M1402H1608e1190A85632l7098a34563
$$ plain form
12284 43696 233516 13906 178860 143538 6045 166420 409962 108122 212523 402974
12274 402974 139373 128855 295201 -24814 -274142 -24628 -157797 -18331 6995 -290483 137488
12262 -29499 -51743 255088 37647 351939 -228757 73158 -219731 -75493 109724 225586
12252 225586 -47851 212579 146960 -18954 326300 -156551 -41164 -155531 176621 159711
12242 159711 307273 5452 163338 59493 150162 130972 312416 177184 -160414 61615 286250
12231 286250 -54488 28408 48101 46071 213460 -146241 310807 188918 85095 237687 109346
12219 174009 402739 144007 265751 93485 130887 77379 230870 -193977 88695 121636
12209 121636 -31800 283587 100705 314026 98591 232989 345586 245813 48714 155839
$$ packed form
12284D3696J89820A3906J64954l5322F045J60375K43542A08122J04401J90451
12274D02974A39373j0518J66346b4814k49328b4628j33169a8331F995b90483A37488
12262b9499k2244B55088C7647L14292b28757G3158b19731g5493A09724J15862
12252B25586d7851B12579o5619a8954C26300a56551d1164j14367A76621j6910
12242A59711J47562E452J57886E9493R0669j9190J81444j35232a60414F1615K24635
12231B86250e4488B8408J9693k030J67389a46241C10807j21889H5095J52592A09346
12219A74009K28730A44007J21744I3485L7402n3508J53491a93977H8695L2941
12209A21636c1800B83587A00705K13321I8591J34398J12597r9773D8714J07125
$$ plain form
12199 155839 234518 -1952 -43801 189582 212768 160337 357774 -117594 -228975 -71585 100121
12187 -109166 169686 46725 -148475 164293 546 111166 -1129 293815 346620 -64915 366173
12175 314606 338795 -119784 187216 -10654 324801 156555 113592 73519 71752 209683 240553
12164 240553 303890 67463 32110 177169 35354 -21586 197315 114146 264995 106953 52388
12152 -213818 75652 117607 26578 38825 -17896 -148881 255426 102491 -10041 313706 2412
12140 -92094 14936 122012 134583 -63093 197723 183351 -205963 -182312 -60921 84641 319673
12129 319673 -136540 -182726 438542 -189835 -192305 156256 -235903 -7436 86010 250176 -203967
12117 26102 -173575 166483 668 43152 232740 249957 221141 39668 -249126 -275162 -212381
$$ packed form
12199A55839P8679a952m1849A89582K3186n2431J97437a17594j11381g1585A00121
12187a09166A69686D6725a48475A64293E46J10620a129B93815N2805f4915C66173
12175C14606K4189a19784A87216a0654C24801A56555m2963m0073j767J37931L0870
12164B40553O3337F7463C2110J45059C5354b1586A97315q3169J50849A06953E2388
12152b13818G5652M1955B6578J2247a7896j30985B55426A02491a0041C13706B412
12140i2094A4936J07076J2571f3093A97723j4372b05963K3651f0921H4641K35032
12129C19673a36540m6186D38542a89835k470A56256b35903g436H6010J64166b03967
12117B6102a73575A66483F68M2484J89588J7217k8816C9668b49126k6036O2781
$$ plain form
12106 -212381 -58604 137525 -256870 71770 -5399 222139 -69051 -148475 120220 10236 -235628
12094 -97459 -217996 143509 231724 116283 -40911 -15631 -27998 126842 -134722 -136566 -475661
12083 -475661 297888 317204 -95409 59196 -97521 197930 -61044 565842 1852835 973165
12073 973165 300065 260376 -39544 167145 14846 75306 101920 43589 -52212 150713 -161428
12061 149499 28876 305560 -69298 117716 -109380 -26599 -149816 -101000 -27420 -167465
12051 -167465 163335 -22991 57501 368693 167605 53329 -304777 -59950 131164 -105990
12040 -254503 -102141 -149175 -262 -71398 -89548 248045 -103519 -16053 -15079 260300 32002
12028 254223 -4745 36476 133755 -244848 -78653 15729 192270 117266 -4970 82517 -213879
$$ packed form
12106b12381e8604A37525b56870G1770e399B22139f9051p9424A20220A0236b35628
12094i7459j20537A43509Q8215j15441d0911a5631j2367A26842a34722j844l39095
12083d75661B97888J9316i5409E9196i7521A97930f1044E65842J286993q79670
12073I73165C00065l9689c9544A67145A4846O0460K6614D3589e2212A50713a61428
12061A49499B8876K76684f9298A17716a09380b6599j23217M8816b7420j40045
12051a67465A63335b2991E7501L11192A67605E3329c04777e9950A31164a05990
12040b54503a02141m7034b62p1136j8150B48045a03519a6053R74B60300C2002
12028B54223d745C6476R7279b44848g8653A5729J76541p5004d970H2517b13879
$$ plain form
12016 -132627 -170779 -45301 38862 -120602 -194883 23925 50796 119955 -217091 -437109 10005
12004 146988 -137693 -70924 -61485 226760 -140194 -71296 -100669 -157860 -232375 -128607 -330017
11993 -330017 28144 -127712 -76429 -234612 -289684 -363474 -63858 217588 -53106 -22478 -78398
11982 -78398 -166331 16749 177487 -66135 99869 355340 -36764 -128415 -188910 -10074 -159648
11971 -159648 -96209 137517 23714 -117418 242646 -281002 -233985 113953 80438 50426
11961 50426 -138597 -170387 -185178 158119 -251748 330651 42846 63130 -74743 -169289 152162
11949 -102252 -72620 -204840 -148384 -27307 -300821 -110077 -465904 -21786 157192 -261271
11938 361151 213037 47113 270243 50645 -136167 -144307 -227558 46222 -61632 135342 83733
$$ packed form
12016a32627l8152d5301C8862a20602p4281B3925K6871O9159b17091k20018A0005
12004A46988a37693O6769R439B26760a40194O8898k9373n7191p4515J03768k01410
11993c30017B8144a27712N1283j58183n5072p3790f3858B17588e3106b2478n5920
11982g8398q7933A6749J60738f6135I9869K55471c6764r1651o0495a0074j49574
11971a59648O3439A37517B3714a17418B42646b81002M7017A13953l3515l0012
11961E0426a38597l1790j4791A58119b51748C30651D2846K0284g4743r4546A52162
11949a02252K9632j32220N6456b7307k73514a10077l55827b1786A57192b61271
11938C61151j48114D7113K23130E0645a36167q140q3251D6222f1632A35342n1609
$$ plain form
11927 83733 32961 252634 -169141 30581 -150259 -379652 140744 215327 -206157 -74981
11916 -63202 -212372 63593 -178151 -263561 11242 13346 -303900 -38531 11924 -142074 96463
11904 277297 -351467 -70577 310043 -16007 504734 280491 -56728 -35020 -103107 -93094 -109476
11893 -109476 39029 -173337 -147883 207897 163161 53589 -184597 -45691 58892 -12004 -44753
11882 -44753 -74277 -27617 376865 57592 120094 -191917 360994 -322521 -126623 27303 41473
11871 41473 157375 -23091 454975 -179753 57620 -70331 150281 3210 88592 -182135 -221052
11860 -221052 -76783 -52327 -6443 33958 79533 33389 -104599 10427 -94285 151164 -163719
11848 -26216 -12680 191576 -107011 -195282 -153209 -141087 40505 55356 153590 -199326 -157957
$$ packed form
11927H3733C2961K19673a69141C0581a50259k29393A40744P4583b06157g4981
11916f3202j49170F3593a78151q5410A1242K104c03900c8531A1924a42074I6463
11904B77297c51467g0577C10043a6007E04734k24243e6728K1708o8087J0013j6382
11893a09476C9029a73337K5454B07897m4736E3589a84597d5691E8892a2004l2749
11882d4753k9524b7617C76865E7592O2502a91917C60994c22521a26623B7303J4170
11871D1473J15902b3091D54975a79753E7620g0331A50281C210Q5382a82135l8917
11860b21052g6783K4456f443C3958M5575C3389a04599A0427i4285A51164a63719
11848b6216a2680A91576a07011q8271M2073J2122D0505J4851R8234a99326M1369
$$ plain form
11837 -157957 -80327 -111341 -245965 -42883 130400 -96154 115860 284985 50841 63159 -62517
11825 20055 43123 -86135 17607 -9681 -23510 -117719 -398498 -105067 143341 -108255 -416588
11814 -416588 283615 48528 -106899 -130158 -166536 104588 40888 57636 174237 165758 -125873
11802 240690 272183 136634 233082 108000 -7566 3401 -118670 -121387 -336461 -75978 17735
11790 120876 116450 74552 22902 358278 -280417 -224825 3461 -140500 59843 -81506 179342
11778 -60094 169790 94469 167543 -31520 -55461 -488154 118133 -458 328321 5953 -307892
11766 215884 -193533 131155 -140123 61960 154399 90751 142341 -65234 73461 -95372 -151397
11755 -151397 111613 24954 -125149 -371484 107369 163084 163345 177179 105490 -112103 192425
$$ packed form
11837a57957P7630l1014j34624d2883A30400i6154A15860J69125E0841J2318f2517
11825B0055K3068h6135A7607i681j3829r4209k80779a05067A43341a08255l08333
11814d16588B83615D8528a06899k3259l6378A04588D0888J6748J16601q479a25873
11802B40690L1493j35549R6448A08000g566C401a18670k717k15074g5978A7735
11790A20876m426m1898B2902L35376b80417N5592C461a40500E9843h1506A79342
11778f0094A69790p5321P3074c1520k3941m32693A18133d58C28321E953c07892
11766B15884a93533A31155a40123F1960R2439o3648N1590f5234G3461i5372n6025
11755a51397A11613B4954a25149k46335A07369N5715K61J3834p1689a12103A92425
$$ plain form
11743 2571 -7685 -93259 -160549 41159 270323 -157028 -136104 -82235 373016 -149741 -225803
11732 -225803 11677 -35081 -197638 -264986 83702 166626 -170413 -87772 -35947 -87749 232402
11720 -73908 411767 54691 189970 -318277 -201344 302108 259327 48364 -106160 -47988
11709 51088 130042 172765 -213928 -191472 35772 -341466 -149286 67684 11504 -365910 77520
11697 -316036 104679 10101 47590 365415 148713 -25517 93645 2949 -278984 -191000 219993
11685 -100143 100124 285190 195176 4300 168728 232791 327679 -23471 79112 184376 79852
11673 328380 156838 287682 -71371 7006 -153091 -38146 -320370 6419 309051 -281617 166383
11661 21032 -14861 85543 -284891 267041 -110578 -99990 -123271 24102 -102946 -204247 240788
$$ packed form
11743B571g685q5574o7290D1159K29164a57028K0924N3869C73016a49741p6062
11732b25803A1677c5081j62557o7348H3702Q2924a70413Q2641c5947n1802B32402
11720g3908D11767E4691J35279c18277J16933C02108m2781D8364a06160d7988
11709E1088P8954M2723b13928K2456C5772c41466a49286F7684A1504c65910G7520
11697c16036A04679A0101L7489L17825A48713b5517I3645B949b78984Q7984B19993
11685a00143A00124J85066r0014D300J64428O4063R4888b3471G9112J05264G9852
11673C28380A56838J30844g1371G006a53091c8146k82224F419L02632b81617A66383
11661B1032a4861H5543b84891B67041a10578J0588k3281B4102a02946j01301B40788
$$ plain form
11649 -83990 129421 143053 18689 352316 -145037 137998 87687 -218062 220422 -98194
11638 -62837 -53848 -5955 36032 -22463 -320889 61975 -244589 -120266 256540 -24195 134968
11626 -10028 326385 155760 250575 -220536 -381826 133956 -108536 210529 -27204 -196843
11616 -196843 282988 -18534 456 14175 146682 253317 116857 -88036 -446262 -75269 64161
11604 -252042 -436030 128711 -203828 171086 398 140127 162716 -152331 -140918 -122271 36732
11592 93795 -150664 -149420 146485 385986 -1322 312113 306764 179722 243659 -50866 -115985
11581 -115985 310757 13534 224877 -112743 -41888 -88819 193929 232376 424932 145880
11570 135461 -112027 277629 247059 207548 8109 143291 66180 41212 -70172 -90759 163884
$$ packed form
11649h3990A29421J3632A8689L33627a45037A37998n0311b18062B20422i8194
11638f2837Q989e955C6032b2463k98426F1975b44589a20266B56540b4195A34968
11626a0028C26385A55760R4815b20536j61290A33956a08536B10529b7204j69639
11616a96843B82988a8534D56J3719J32507J06635A16857h8036l58226g5269F4161
11604b52042j83988A28711b03828A71086C98J39729K2589a52331J1413J8647C6732
11592I3795a50664J244A46485K39501a322C12113n349j27042O3937e0866o5119
11581a15985C10757A3534K11343a12743d1888m6931A93929L8447J92556A45880
11570A35461a12027B77629l0570l9511H109J35182F6180k4968g0172k0587A63884
$$ plain form
11558 46617 233726 159793 235522 4942 -166677 37940 -289685 298979 211018 168112 3489
11546 -18128 194490 94775 29514 91124 320513 73520 74389 -49329 113387 299526 40048
11534 348344 284214 626553 384000 -154411 55890 499094 130729 -80984 32419 192934
11524 192934 85670 169075 -227626 287772 267064 136516 114979 248314 55204 -267320
11513 16283 297593 105571 177623 312786 52385 290082 -75542 68154 168274 169200 -60673
11501 16283 -291979 392493 415805 491680 -78966 79595 -35486 251458 14246 349684 255193
11490 255193 187904 232767 253352 -69016 470565 253644 7561 -31923 187953 248792 417716
11479 417716 375741 157015 376017 155667 147167 211842 248853 159186 -114879 97967 -183015
$$ packed form
11558D6617J87109p3933P5729D942a66677C7940b89685B98979q7961m2906C489
11546a8128A94490I4775B9514O1610K29389G3520Q69d9329A13387J86139D0048
11534C48344o4130L42339k42553a54411E5890M43204A30729h0984C2419J60515
11524A92934H5670Q3405b27626B87772k0708j30548k1537J33335E5204b67320
11513A6283K81310A05571P2052J35163E2385K37697g5542F8154J00120R26f0673
11501A6283b91979C92493K3312P5875g8966G9595c5486B51458A4246L35438r4491
11490B55193o7289M4863K0585f9016D70565k16921G561c1923A87953O0839J68924
11479D17716m1975A57015K19002A55667q500O4675L7011q9667a14879I7967a83015
$$ plain form
11467 145408 489802 236169 -107526 111280 293051 317371 -46062 310373 144964 282699
11457 282699 279890 3586 222461 47699 45479 -159290 6202 -220379 184291 483532 112359
11445 166787 108253 -36802 139708 3582 148349 -81387 153814 159552 211302 203023 -298055
11433 -71790 -133053 229605 -19396 -163138 -41067 -396369 93290 30666 -20634 -65987 -119462
11422 -119462 253232 54856 207214 -213369 114507 -77333 -9342 35506 142192 89308 -135579
11410 155209 -58538 -4555 49277 228063 160303 -183678 188542 -12754 -35208 62099 73940
11399 73940 -171720 -221525 105958 -95799 96000 -190058 35887 66303 -86680 -57566 -117100
11388 -117100 264705 -363196 -227535 -401114 111301 -357784 -134211 -41798 -144134 -176406
$$ packed form
11467A45408L44394B36169a07526A11280J81771K4320d6062C10373A44964J37735
11457B82699k809C586K18875D7699k220a59290F202b20379A84291K99241A12359
11445A66787n8534c6802A39708C582J44767h1387A53814N738N1750q279b98055
11433g1790o1263B29605a9396j43742d1067l55302I3290C0666b0634m5353n3475
11422a19462B53232E4856J52358b13369A14507g7333i342C5506J06686n2884a35579
11410A55209e8538d555D9277J78786o7760a83678A88542a2754k2454F2099J1841
11399G3940a71720m9805A05958i5799I6000a90058C5887L0416h6680K9114n9534
11388a17100B64705c63196J35661j73579A11301c57784a34211d1798j02336l2272
$$ plain form
11378 -176406 41174 77534 69923 103034 -152915 99927 122742 142249 -47541 -60549 -111521
11367 -111521 -145849 223642 -1253 -77455 -52928 -142322 95057 -128153 259166 -22758 196959
11355 -15514 -87062 -101723 -176463 193968 88378 -255179 306179 355215 -60112 -225486 -188354
11344 -188354 -121437 -480018 446147 -18967 -135930 -65215 -151865 61187 145501 -90205 -178140
11333 -178140 -57023 8148 158925 -135102 -100309 -26590 -45793 -223845 -143580 -78591 74086
11321 -43522 127762 -18119 9244 -1464 121119 -133951 143988 -52759 -48703 75469 -149861
11309 61542 -323339 76480 -35294 178826 103221 -160160 21453 -21781 183500 -38606 -33832
11298 -33832 109349 153850 -96149 -309348 -391822 -7052 -311238 69572 -99381 93578 287894
$$ packed form
11378a76406D1174L6360p611L3111a52915I9927K2815J9507d7541j3008n0972
11367a11521l4328B23642a253p6202K4527q9394I5057a28153B59166b2758A96959
11355a5514p1548j4661p4740A93968H8378b55179C06179M9036f0112j65374L7132
11344a88354O6917l58581D46147a8967j16963f5215q6650F1187Q4314i0205q7935
11333a78140e7023H148J50777a35102L4793b6590j9203j78052Q0265O4989G4086
11321d3522A27762a8119I244a464A21119a33951A43988e2759M056G5469a49861
11309F1542c23339G6480c5294A78826p5605a60160B1453b1781A83500c8606M774
11298c3832A09349M4501i6149k13199q2474g052l04186F9572i9381I3578J94316
$$ plain form
11287 287894 -3662 146308 -248166 146996 228689 -118936 13474 50164 -93761 -116179 43080
11275 -122564 -24782 38144 150981 -51309 -394159 51362 182790 -13561 79326 -210317 95447
11263 47863 10349 -75947 19826 182334 -88527 -163602 34810 251799 212677 18694 -595004
11251 -67721 -30422 -92887 -195935 -25261 146774 277654 -182571 -171821 -447330 -152378
11240 -69887 -124646 32491 41275 -317205 -256570 -175223 -70848 -75637 -245424 46529 230183
11229 230183 -34849 153437 -157307 63161 -280174 -184424 -8635 188893 -35697 -47683 92130
11217 227142 244913 -202110 -215484 -36620 -261796 -188885 149276 -40211 -25187 -159316 -236751
11206 -236751 9827 41200 188958 -289503 -111911 10822 -102851 -265339 -101030 -191693
$$ packed form
11287B87894c662A46308b48166A46996Q1693a18936A3474L6690i3761k2418D3080
11275a22564b4782C8144J12837e1309l42850E1362J31428a3561G9326b10317I5447
11263D7863A0349g5947A9826J62508h8527p5075C4810K16989l9122A8694e95004
11251f7721c0422o2465j03048b5261A46774J30880a82571J0750k75509a52378
11240f9887n4759C2491Q784c17205O0635Q1347g0848m789j69787D6529J83654
11229B30183c4849A53437a57307F3161b80174R5750h635A88893c5697j1986I2130
11217B27142J7771b02110j3374c6620k25176P2911A49276d0211J5024j34129p7435
11206b36751I827L1373J47758b89503a11911A0822a02851j62488a01030r0663
$$ plain form
11196 -191693 -82797 -178040 33262 126995 -305945 78434 -94970 11550 -195551 14133 -12866
11184 -32835 -162975 221503 -61682 187687 -2561 -501371 -16917 55348 6370 90772 -60859
11172 -278956 23195 -302995 26499 57594 -259045 -317161 -222712 -80725 209356 -37877 45384
11160 82885 221014 149046 162168 108008 147868 -87769 -55368 -59555 149931 29960 -226670
11148 300193 12902 -110237 257064 -44944 -17715 -31585 -65677 -330857 159578 4559 -208921
11136 -33227 -61299 315757 174894 282494 79312 231352 346932 -75774 211452 88064
11125 45420 -170281 -208768 292355 -53950 -62510 70265 30668 77505 -53775 -64754 88451
11113 -75054 -114307 63818 249221 -109673 -71113 -11302 193932 61303 -129574 -15356 175479
$$ packed form
11196a91693h2797r5243C3262R3733c05945G8434i4970A1550a95551A4133a2866
11184c2835j30140B21503f1682A87687b561m98810a6917E5348F370Q4402f0859
11172b78956B3195c02995B6499L1095b59045n8116R4449h0725B09356c7877D5384
11160H2885J38129p1968J3122n4160L9860h7769L2401m187A49931B9960b26670
11148C00193A2902a10237B57064d4944a7715j3870l4092k65180A59578D559b08921
11136c3227k8072C15757j40863J07600G9312J52040J15580g5774B11452H8064
11125D5420a70281l8487B92355e3950q560G0265C0668M6837e3775j0979H8451
11113g5054l9253F3818J85403a09673L8560a1302A93932F1303a29574a5356A75479
$$ plain form
11101 92583 -133246 49768 78235 194940 4756 67811 43453 145104 -43008 69701 283476
11090 283476 123025 401544 9683 95728 276873 419174 134212 204960 146065 358350
11080 358350 66308 462564 406673 117632 -22680 372271 24981 153655 390540 120757
11069 362670 417051 687971 289227 483098 491095 237421 413457 290942 624956 753733
11059 753733 612191 698818 473383 863709 779480 174883 580819 698926 660598 803878
11049 803878 525074 810507 820165 748002 900859 717504 549934 857097 814471 772055
11039 772055 880010 499401 477129 583773 756137 1001677 664778 658530 535632 460950
11029 460950 650886 626218 796368 871650 618322 692490 945348 292858 783988 683915
$$ packed form
11101I2583a33246D9768K8467J16705D756O3055k4358J01651d3008F9701K13775
11090B83476A23025K78519I683Q6045J81145J42301A34212P0748n8895K12285
11080C58350F6308L96256n5891A17632b2680C72271B4981J28674K36885A20757
11069C62670N4381K70920B89227J93871P997B37421J76036j22515L34014J28777
11059G53733j41542Q6627k25435L90326q4229A74883M05936J18107l8328J43280
11049H03878k78804K85433R658p2163J52857j83355j67570L07163m2626m2416
11039G72055J07955l80609k2272J06644J72364K45540l36899o248j22898p4682
11029D60950J89936k4668J70150P5282k53328P4168K52858B92858M91130j00073
$$ plain form
11019 683915 629758 645759 461399 695834 624851 359254 776264 536194 560426 560105 568378
11008 568378 448817 717474 548783 596371 432223 697800 586991 574822 956317 839548
10998 839548 869285 504116 509538 656416 573222 828744 808492 469015 961305 643095
10988 643095 811704 702694 1197634 973608 1245070 1127283 1164133 1088855 1227245 1172722
10978 1172722 1319842 1573504 1397712 1966254 2501609 2201430 2790245 2595447 2723473
10969 2723473 2764737 2710781 2495448 1858801 1974546 2036564 1771576 1659176 1904622 1960330
10959 1960330 2130128 2110932 2210128 1807397 1931160 1728844 1561738 977800 1076342 864208
10949 864208 581082 614802 545581 452089 590008 153520 370948 97225 219994 325347
$$ packed form
11019F83915n4157J6001j84360K34435p0983k65597M17010k40070K4232l21Q273
11008E68378j19561K68657j68691M7588j64148K65577j10809j2169L81495j16769
10998H39548K9737l65169N422J46878q3194K55522k0252l39477M92290l18210
10988F43095J68609j09010M94940k24026K71462j17787L6850p5278J38390n4523
10978A172722J47120K53662j75792N68542N35355l00179N88815j94798J28026
10969B723473M1264n3956k15333o36647J15745O2018k64988j12400K45446N5708
10959A960330J69798j9196R9196m02731J23763k02316j67106n83938R8542k12134
10949H64208k83126L3720o9221r3492J37919A53520K17428I7225J22769J05353
$$ plain form
10939 325347 286018 -89468 282359 -42268 -116839 72862 82752 -125429 17266 35493 122764
10928 122764 -403817 -145369 384425 -26319 -263754 -56877 221675 18864 115132 363299
10918 363299 -177746 19064 167376 17488 -302257 -144363 175151 101703 128785 18866
10907 129585 -57177 16763 363219 -109605 -53548 402616 27514 -206053 119884 117061 -98985
10895 -66460 4815 42506 -35241 416431 -35489 69366 -243116 141654 -266303 -146589 276188
10883 -417015 -43264 -412369 -326488 -424767 -30785 193739 -66850 -91692 -241322 -330509 -135873
10871 -8002 50201 294761 229565 -11115 -106732 274488 -93899 -93868 158126 358939 -101688
10859 162286 201371 -183054 133703 -241316 152368 175380 -169706 353543 -37 8249 74887
$$ packed form
10939C25347l9329h9468B82359d2268p4571G2862R890a25429A7266J8227Q7271
10928A22764d03817a45369C84425b6319k37435e6877B21675A8864R6268K48167
10918C63299a77746A9064J48312A7488c02257a44363A75151p3448K7082A8866
10907A29585e7177A6763L46456a09605e3548D02616B7514b06053A19884k823i8985
10895f6460D815L7691c5241D16431c5489F9366b43116A41654b66303J19714B76188
10883d17015d3264l69105Q5881r8279c0785A93739f6850k4842j49630q9187a35873
10871h002E0201K44560o5196a1115r5617B74488i3899L1A58126K00813a01688
10859A62286L9085a83054A33703b41316A52368K3012a69706C53543c7H249O6638
$$ plain form
10848 74887 -192241 15422 129141 93735 -76415 3966 -170110 -127093 52005 145475 292134
10837 292134 -121165 33244 -55666 -90905 12751 247156 -112979 -180071 -34893 -64577 204553
10825 -189788 66778 325778 -9601 -159583 67734 -181021 -224961 196508 -256051 196655
10814 70253 141408 268057 131864 -129512 -27576 -110141 249542 -177205 -229895 -48432 112644
10802 -250955 -404207 10753 191082 -116232 101835 -109396 -159668 -468 -20244 43514 -22987
10790 -155715 -280370 -340377 86380 -111386 -7935 7831 12537 -276038 -225595 132361 -59017
10778 -303441 -70034 -161853 -25389 -110261 177338 -105119 92911 -49848 143575 -57585 -29750
10767 -29750 161954 144509 -270037 -19776 176646 -111496 234128 -50054 -150664 27279
$$ packed form
10848G4887a92241A5422J13719l5406g6415C966a70110M3017E2005R3470J46659
10837B92134a21165C3244e5666l5239A2751K34405a12979o7092c4893k9684B04553
10825a89788F6778K59000i601j49982F7734a81021m3940A96508b56051A96655
10814G0253P1155J26649A31864a29512b7576q2565B49542a77205n2690d8432A12644
10802b50955j53252A0753J80329a16232A01835a09396n0272d68j9776D3514b2987
10790a55715j24655o0007H6380a11386g935G831M706b76038N0443A32361e9017
10778c03441g0034r1819b5389q4872A77338a05119I2911d9848A43575e7585K7835
10767b9750A61954j7445b70037a9776A76646a11496B34128e0054j00610B7279
$$ plain form
10756 -34061 383862 -174236 -41432 -61640 135927 -124209 126235 -129629 -47610 -225015
10746 -225015 196572 -24628 89385 -178763 -52014 -29636 91829 69761 73430 -61766 -135067
10735 -135067 -202417 132756 10688 -234567 71648 -257163 86770 -259372 -184581 198979
10724 -98144 -173077 149203 189082 90415 -15230 -163520 127591 -432791 -145996 -13614 -99862
10713 -99862 -146900 190784 129082 128082 -252457 -118730 -117507 -91777 -157107 -88631 -188880
10702 -188880 212277 -425750 -290738 -359444 -147024 -72488 -210829 -34125 -104259 209322
10691 -100333 -204014 -285767 -5326 -151713 324211 -103533 -127974 -49940 217771 -115783
10680 -29155 -112512 -56805 -36504 97071 180207 -148339 -187110 -318991 -127144 -29327 -52086
$$ packed form
10756c4061C83862a74236d1432k0208A35927a24209A26235a29629d7610j77405
10746b25015A96572b4628H9385a78763e2014K2378I1829k2068L669f1766p3301
10735a35067o7350A32756A0688b34567G1648b57163H6770b59372P4791A98979
10724i8144p4933A49203L9879I0415a5230j48290A27591d32791a45996a3614q6248
10713i9862m7038A90784o1702j000b52457a18730J223K5730o5330O8476j00249
10702a88880B12277d25750J35012o8706a47024g2488j38341c4125p0134B09322
10691a00333j03681q1753e326j46387C24211a03533k4441d9940B17771a15783
10680b9155q3357N5707K0301I7071Q3136a48339l8771j31881a27144b9327k2759
$$ plain form
10669 -52086 -129687 -125835 -347019 229731 9129 -121628 -321731 -159798 -145937 -117226 -76210
10658 -76210 -121823 172402 121994 -109555 -91974 51505 -105459 -178558 -179543 146497 109109
10647 109109 12555 -45728 70704 141164 -41415 -18134 -179562 163697 -22045 105001 16652
10635 -43536 3782 -124898 -81463 38796 89784 -261316 56587 206660 -135472 -13195 131514
10623 -53138 -67637 -49747 6795 86364 62760 -101210 133598 188949 -91606 48130 -59681
10611 90637 -96312 12589 -150638 -304030 -100017 30341 -34254 -40291 206786 -300079 -133245
10599 -149120 -23785 -26059 92259 -75685 -371962 -173649 21391 -50434 -255803 -460833 -261657
10588 -261657 201474 -327325 110333 49549 -157478 -13750 28543 -315400 -146572 283819
$$ packed form
10669e2086p7601L852k21184B29731I129a21628k00103a59798J3861K8711M1016
10658g6210m5613A72402n0408a09555J7581E1505a05459p3099r85A46497l7388
10647A09109A2555d5728G0704P0460d1415a8134j61428A63697b2045A05001A6652
10635d3536C782a24898M3435C8796N0988b61316E6587J50073a35472a3195A31514
10623e3138j4499J7890F795P9569k3604a01210A33598N5351i1606D8130e9681
10611I0637i6312A2589a50638j53392a00017C0341c4254o037B06786c00079a33245
10599a49120b3785k274I2259g5685k96277a73649B1391e0434k05369k05030J99176
10588b61657B01474c27325A10333D9549a57478a3750B8543c15400a46572B83819
$$ plain form
10577 -96717 -172744 28183 137311 -31044 279870 -433629 -1130 -141040 -286849 -331358 114681
10565 -92403 -248198 399486 -176179 88939 -144891 -61048 125313 97395 36142 -113906
10554 -72762 240026 281781 43823 31568 -96714 -334736 22129 -59977 61344 -46323 -188160
10543 -188160 -136031 61074 237599 81292 224000 142902 -116638 -192640 -292890 295875
10532 -148726 -383440 -90241 33267 -162715 137860 162121 -276591 15063 257392 321976
10522 321976 -143527 -101169 178457 64837 -12862 -58701 224295 -151457 76390 -61692 18577
10510 -46482 -134480 -136888 -350122 -305915 243033 -68714 179770 -130478 -225908 -82294 -278006
10499 -278006 224418 -33631 -94402 17101 109260 -84894 -88201 -146186 -136181 -248897 -241138
$$ packed form
10577i6717p6027B8183J09128c1044B79870d33629a130j39910j45809m4509A14681
10565i2403j55795C99486a76179H8939a44891f1048A25313k7918C6142a13906
10554g2762B40026M1755D3823j2255i6714k38022B2129e9977F1344d6323j41837
10543a88160N2129F1074J76525H1292J42708q1098a16638p6002j00250B95875
10532a48726k34714i0241C3267a62715A37860K4261b76591A5063K42329O4584
10522C21976a43527M2358A78457F4837a2862m5839B24295a51457G6390f1692A8577
10510d6482q7998k408k13234M4207B43033f8714A79770a30478r5430h2294j95712
10499b78006B24418c3631o0771A7101R2159h4894l307n7985J0005j12716P759
$$ plain form
10488 -241138 -67121 173783 9720 61089 46348 153524 545680 169022 523524 491160 354327
10477 354327 -10062 190037 -26635 265724 244894 -72507 -155359 299058 152241 59490 -55499
10465 -55483 520102 232417 35166 246248 -185735 -249271 267407 -122604 -125536 132777
10454 63864 138829 -437590 213506 -115855 24414 -379476 81013 -167156 183279 -65189
10443 -16585 89795 -73486 -17827 158798 -78759 89269 -138569 46178 -126833 -72871 22137
10431 187551 201056 -44672 -5989 62163 -73727 -140052 -64818 -45803 -77301 -35788 -458035
10420 -458035 -144224 -188975 141330 166137 63836 -48985 -58463 -86620 229856 -147629 285911
10408 -205020 -147732 41938 111423 -53225 39215 -136761 -213392 190848 -60725 -48733 -197120
$$ packed form
10488b41138f7121A73783I720N1369j4741J07176L92156A69022L54502l2364j36833
10477C54327a0062A90037b6635B65724k0830g2507q2852B99058j46817E9490e5499
10465e5483E20102B32417C5166K11082a85735o3536B67407a22604k932A32777
10454F3864P4965d37590B13506a15855B4414c79476H1013a67156A83279f5189
10443a6585H9795g3486a7827A58798g8759H9269a38569D6178a26833N3962B2137
10431A87551J3505d4672e989F2163g3727o6325f4818J9015l1498c5788m22247
10420d58035a44224m4751A41330K4807F3836d8985r478k8157B29856a47629B85911
10408b05020N7288D1938O9485e3225C9215a36761p6631A90848f0725J1992j48387
$$ plain form
10397 -197120 19522 86949 -21685 81260 84933 180310 66134 85112 119362 -8907 195652 232852
10385 232852 -145534 257706 -188728 71005 300153 356825 248301 234493 74422 362024
10375 362024 -98130 377818 309916 57097 330390 513679 419004 405058 331058 641863 394162
10364 394162 114080 164402 406120 157533 293761 165223 186551 -53253 225561 177175
10354 177175 253367 216871 388885 286925 617380 338356 295664 215793 617279 507608
10344 507608 669994 241550 795255 564204 48073 387700 357652 222090 95216 229824
10334 229824 -17032 193176 412145 179667 -10101 -151271 13994 -66153 -58976 170316 23399
10322 -161553 277978 150417 351012 188410 -145013 189417 286727 180724 -109777 -295967
$$ packed form
10397a97120A9522O7427b1685H1260L673R5377F6134J8978L4250h907A95652L7200
10385B32852a45534B57706a88728G1005K29148N6672j08524j3808G4422K87602
10375C62024i8130C77818o7902E7097K73293J83289r4675j3946p4000L10805k47701
10364C94162A14080N0322K41718A57533J36228j28538K1328e3253B25561m8386
10354A77175P6192l6496J72014j01960L30455k79024m2692p9871M01486j09671
10344E07608J62386B41550N53705k31051D8073L39627l0048j35562I5216J34608
10334B29824a7032A93176K18969A79667a0101j41170A3994f6153P177A70316B3399
10322a61553B77978j27561K00595j62602a45013A89417R7310j06003a09777j86190
$$ plain form
10312 -295967 -10243 138295 286948 -34063 267931 58974 67775 93520 -290517 68934 186725
10301 186725 -175948 -308954 -197003 -288147 -167994 -189919 9420 -62123 104383 101877 271765
10290 271765 30485 26527 -10288 -183737 342761 -1686 9169 159087 -89203 -135664 -174546
10279 -174546 22754 101110 -245598 -74842 -10720 -74773 -195240 -76980 173351 -2375 -75011
10268 -75011 -103358 84201 58641 46752 321801 -22447 485628 448314 54097 349262 583385
10257 583385 654968 320642 289322 412974 230682 41056 160064 -81908 214948 -283423
10246 37792 -283962 -212331 54006 105634 -137905 -75944 126957 -133230 -6884 -77160 -8387
10234 -136158 -122638 98456 14795 122382 -165983 293301 113823 46264 -84744 -162843 -6904
$$ packed form
10312b95967a0243A38295J48653c4063B67931E8974Q801K5745b90517F8934J17791
10301A86725a75948j33006J11951r1144J20153k1925I420f2123A04383k506J69888
10290B71765C0485l958a0288j73449C42761a686I169J49918h9203m6461l8882
10279a74546B2754P8356b45598g4842a0720o4053j20467g6980A73351b375p2636
10268g5011k8347H4201k5560j1889K75049b2447D85628l7314E4097K95165K34123
10257E83385P1583C20642l1320J23652j82292D1056J19008h1908B14948b83423
10246C7792b83962P1631E4006N1628a37905O1961A26957a33230f884p0276h387
10234a36158J3520I8456A4795J07587a65983B93301A13823D6264h4744p8099f904
$$ plain form
10222 -27203 72580 -158581 -130670 -421093 106320 -63555 48275 8380 -2085 79665 270859
10211 270859 -120922 -164575 -289728 156818 -363592 -114002 28153 121616 187598 45903
10200 -233628 -210194 94723 158107 -270436 10247 85220 50659 -144017 190625 -203192 -38536
10188 251298 -40741 56764 -165489 -214292 62998 -233963 57692 41084 -93684 33368 -206379
10176 -161643 -142198 -349921 -32983 -93182 -159201 169680 -21424 81350 -36214 -181239 184718
10164 126311 215187 -190629 143158 -368647 -12594 277034 -51036 -238194 185389 -152795
10153 -235718 -50935 -175721 233955 -29438 86808 -122593 -183572 168434 -103468 140978
10142 -138595 9449 -50277 224465 -163458 22256 55700 194723 14880 -13494 -57944 97911
$$ packed form
10222b7203G2580a58581K7911k90423A06320f3555D8275H380b085G9665J91194
10211B70859a20922m3653j25153A56818c63592a14002B8153R3463O5982D5903
10200b33628K3434I4723O3384b70436A0247P4973l4561a44017A90625b03192c8536
10188B51298d0741E6764a65489m8803F2998b33963E7692j6608i3684C3368b06379
10176a61643J9445k07723c2983o0199o6019A69680b1424H1350c6214j45025A84718
10164A26311Q8876a90629A43158c68647a2594B77034e1036j87158A85389a52795
10153b35718e0935j24786B33955b9438H6808a22593o0979A68434a03468A40978
10142a38595I449e0277B24465a63458B2256L3444J39023A4880a3494m4450I7911
$$ plain form
10130 -156450 -251306 46877 296932 -276040 -142294 -259698 -141710 -58224 -512314 271292
10119 -261151 -214392 -241583 -105111 71871 -156031 -301616 137571 -266646 -343498 -40484
10108 -79492 -134117 -69969 247163 -3398 -129579 -87950 -106396 -5120 13346 -213941 130342
10096 -40187 -164461 182441 -161997 -31179 -189467 -212382 -31084 58805 144060 -37691 56766
10084 132185 -446222 -125219 -92694 -135715 -68006 -112208 -229690 -286057 34746 -288281 427
10072 -202081 54139 80927 -37222 -166855 203814 44377 -89412 -165959 223851 -91593 50606
10060 -101484 38160 -39858 112764 -150707 -90224 -88670 -10764 125225 12092 -147864 -137610
10049 -137610 -9002 -316229 -169080 117708 -11188 -86354 -107531 344851 -83905 -146779 6996
$$ packed form
10130a56450r4856D6877K50055b76040J33746j17404J17988e8224m54090B71292
10119b61151M6759k7191a05111G1871a56031j45585A37571b66646p6852d0484
10108g9492n4625O4148B47163c398j26181M1629j8446e120A3346b13941A30342
10096d0187j24274A82441a61997c1179j58288k2915c1084E8805Q5255c7691E6766
10084A32185d46222a25219L2525m3021O7709m4202j17482n6367C4746b88281D27
10072b02081E4139K6788c7222j29633B03814D4377h9412p6547B23851i1593E0606
10060a01484C8160c9858A12764a50707O0483J554a0764A25225A2092a47864J0254
10049a37610i002l07227J47149A17708a1188p5166k1177C44851h3905o2874F996
$$ plain form
10037 -171038 -4384 -278447 85766 -80831 -13890 -128594 -216580 -58948 -95202 -104262 -42567
10025 3074 269979 -306002 -180826 66795 58711 -52723 -71731 -41022 35398 13163 120303
10014 120303 250865 160652 -2098 -47119 -69958 -81704 172983 -206542 116824 20923 -51801
10002 -113147 -9116 10832 63784 -67168 -337174 58438 -93094 -104030 -145090 70477 97667
9991 97667 -240752 -46394 -127949 88945 -29485 -217825 -93727 -106880 21141 78817 -12071
9979 28969 -112370 -324778 263510 -26403 -162719 116872 244633 33014 -102398 -19176
9968 216826 -116569 59759 47186 -5672 124640 -158219 304745 -181574 109632 -120665
9957 28968 -310293 -244358 -368787 -139227 -210850 -109069 136969 -3867 103789 -115290 -44116
$$ packed form
10037a71038d384k74063H5766h0831a3890j14704q7986e8948l6254r060d2567
10025C074K66905c06002J25176F6795q084e2723j9008L0709C5398A3163J07140
10014A20303J30562r0213b098m5021k2839j1746A72983b06542A16824B0923e1801
10002a13147i116A0832N2952f7168k70006E8438i3094j0936m1060G0477K7190
9991I7667b40752d6394q1555H8945b9485j88340i3727j3153B1141N7676a2071
9979B8969a12370k12408B63510b6403j36316A16872J27761C3014a02398a9176
9968B16826a16569E9759j2573e672A24640a58219C04745a81574A09632a20665
9957B8968c10293O5935j24429a39227p1623J01781A36969c867A03789a15290d4116
$$ plain form
9945 -139030 148116 -228941 -5507 258031 -119680 51788 467363 220826 -317566 105639
9934 265672 6209 150760 71593 -157060 509511 -24389 -59746 13445 -92088 -119545 -306982
9923 -306982 -433534 16252 11119 -5624 -367022 35728 177777 75819 -37702 187196 -132995
9911 -222684 -44443 -294309 398181 -71494 159298 136090 214409 1900 176607 42977 -349187
9899 -144418 -101779 32539 68576 -187034 -217532 163900 -433712 7739 -218407 -73913 -318853
9888 -318853 29532 -25860 40391 -125510 -172940 -101214 -35276 -297358 29125 -132038 -25641
9876 170468 -118934 -481399 -246379 -6616 -411464 -142402 -284677 72435 56968 13478 -133571
9864 50159 210186 103447 -93159 -71150 14296 -135850 -43352 -119295 -288110 -159027 139814
$$ packed form
9945a39030A48116b28941e507B58031a19680E1788M15575B20826c17566A05639
9934B65672F209J44551G1593a57060E09511b4389l5357A3445i2088k7457j87437
9923c06982j26552A6252n133e624l61398C5728J42049G5819c7702A87196a32995
9911b22684d4443k49866C98181g1494A59298k3208P8319A900J74707D2977c49187
9899a44418M2639C2539L6037a87034l0498A63900d33712G739b18407g3913k44940
9888c18853B9532b5860D0391a25510m7430P1726c5276k62082B9125a32038b5641
9876A70468a18934l62465K35020f616m04848a42402j42275G2435j5467A3478a33571
9864E0159J60027A03447i3159K2009A4296a35850d3352p5943j68815J29083A39814
$$ plain form
9852 133226 -106723 -199716 -11000 -174555 -120339 78352 22127 -371965 -1153 10537 -5221
9840 161917 29222 -321440 89727 8553 -243420 204901 92335 -265587 22403 318349 38729
9828 13969 -52811 81663 -47632 18398 -228900 -290097 -178893 -160196 -38457 6323 -266685
9816 -132108 -32251 54343 -191413 196221 -11548 18289 -52882 194508 175404 -191827 -380370
9805 -380370 84786 100415 279946 26399 -67096 -104687 153901 -291064 89751 -252732 -98496
9793 -165765 2050 139790 -324225 -102674 -100203 78392 -206359 -144623 -14965 -166221 257021
9781 -200186 -229896 -324632 -145852 -29509 -45195 -199648 -101646 -125703 -404677 225018 -323173
9769 122920 -444566 16176 -351856 -95563 -73177 -330540 73566 3213 -20350 -299389 -103743
$$ packed form
9852A33226a06723r2993a1000j63555N4216G8352B2127c71965a153A0537e221
9840A61917B9222c21440H9727H553b43420B04901I2335b65587B2403K95946C8729
9828A3969e2811H1663d7632A8398b28900o1197J11204J8697c8457F323b66685
9816a32108c2251E4343a91413A96221a1548A8289e2882A94508j9104a91827j88543
9805c80370H4786J5629J79531B6399f7096l7591A53901b91064H9751b52732i8496
9793a65765B050J37740c24225a02674K471G8392b06359O1736a4965j51256B57021
9781b00186k9710r4736a45852b9509j5686j54453R8002k4057k78974B25018c23173
9769A22920d44566A6176c51856i5563K2386k57363G3566C213b0350k79039a03743
$$ plain form
9757 -37530 30479 97309 55304 55475 -254675 -25347 -111271 -348703 246962 -20983 -153442
9746 -153442 -253198 428401 822 318201 -26778 11056 -36468 113043 -350901 114009 -113829
9734 128422 4089 21227 -24245 -373496 45230 227424 46817 -25931 -174013 153794 -147848
9722 -125885 -13087 153369 -185096 -149443 -489645 -252643 -48637 -281797 -101700 60160
9711 20821 -617 -7474 -47557 -118985 -97514 -447112 127157 -5252 -312665 200450 -28151 -197148
9699 -197148 135992 -9019 184088 9430 257403 -196307 -209581 154174 -30061 -121972 393348
9687 -171227 -553887 -101993 -429369 -86288 -166293 -164487 -11020 -180971 -431072 253393 54749
9675 -184349 -88503 -80350 40540 -259004 -16839 141217 232984 185441 66091 127221 93391
$$ packed form
9757c7530C0479O6830m2005J71b54675b5347q5924k37432B46962b0983j32459
9746a53442r9756D28401H22L17379b6778A1056c6468A13043c50901A14009a13829
9734A28422D089J7138b4245l49251D5230J82194D6817b5931j48082A53794a47848
9722a25885a3087A53369a85096L5653l40202K37002d8637k33160a01700F0160
9711B0821f17o857m0083p1428K1471l49598A27157e252l07413B00450b8151j68997
9699a97148A35992i019A84088I430K47973a96307j3274A54174c0061r1911C93348
9687a71227l82660a01993l27376h6288q0005J806a1020j69951k50101B53393E4749
9675a84349h8503Q153D0540b59004a6839A41217R1767m7543F6091O1130l3830
$$ plain form
9664 93391 -69448 -123948 -42592 -282145 353991 -144215 245335 113577 -46139 -247673 -181281
9653 -181281 175955 -126737 205191 -156556 -217546 -122911 -298879 161362 -12684 -318457
9643 -318457 -62115 153553 255897 90913 365 -326091 45406 -77478 -37830 -118421 72864
9631 -273729 88694 -148862 77556 -87960 -104476 114336 -380923 -283759 -222936 -201319 -112553
9620 -112553 -106387 -20721 -171755 10100 -170169 -241202 -266321 156434 -30053 -53220 -107133
9609 -107133 70282 -177637 -244668 -88373 32943 -129017 -2597 80090 -371658 -612 -138397
9598 -138397 53353 -40408 -227128 -302967 21419 -40123 -105138 379127 -328846 -299723 -91745
9586 -77486 304842 -61585 -208101 -9884 -197993 111671 -43188 212215 119061 -366367 -359211
$$ packed form
9664I3391f9448n4500d2592k39553C53991a44215B45335A13577d6139k01534O6392
9653a81281A75955a26737B05191a56556o0990R4635j75968A61362a2684l05773
9643c18457f2115A53553J02344I0913C65c26091D5406g7478c7830q0591G2864
9631b73729H8694a48862G7556h7960j6516A14336c80923R7164O0823K1617Q8766
9620a12553O166b0721j51034A0100a70169p1033k5119A56434c0053k3167n3913
9609a07133G0282a77637o7031h8373C2943a29017b597H0090c71658f12j37785
9598a38397E3353d0408j86720p5839B1419d0123o5015C79127c28846K9123i1745
9586g7486C04842f1585j46516i884j88109A11671d3188B12215r3154c66367P156
$$ plain form
9575 -359211 -309418 339195 -258760 -45703 -90713 -72059 9862 30603 -154546 109852 47646
9563 -207452 -49073 -47325 134284 -85874 137839 -11893 -274033 7522 -15022 142322 202701
9552 202701 -29048 -163451 -99293 -90062 -122364 -208478 178782 -82693 174438 -94710 -73878
9541 -73878 37363 -184915 -113381 -32432 -231612 -195863 409037 27971 4387 -373252 228423
9529 -369840 135088 -60749 140799 -35999 110263 -244177 -169554 -201311 -270423 -80075 -70944
9518 -70944 -111436 139836 -84630 106405 -103915 9855 -52906 7469 -149491 -88566 44516
9506 103648 -47393 -326792 -228943 8564 128 208899 141891 53570 -118634 -90725 -323032
9495 -323032 -126693 145668 37681 -46511 -189749 133123 53526 82995 379726 -209643
$$ packed form
9575c59211M9793C39195b58760d5703m5010J8654I862K0741a54546A09852D7646
9563b07452d9073J748A34284h5874A37839a1893k62140G522a5022A42322O0379
9552B02701b9048j34403O4158R231l2302q6114A78782h2693A74438i4710K0832
9541g3878C7363a84915P1534c2432j99180L5749D09037B7971D387c73252B28423
9529c69840A35088f0749A40799c5999A10263b44177P4623l1757o9112h0075R131
9518g0944m0492A39836h4630A06405a03915I855e2906G469a49491O0925D4516
9506A03648d7393k79399R7849H564A28K08771o7008E3570a18634K7909k32307
9495c23032a26693A45668C7681d6511j43238A33123E3526K9469K96731b09643
$$ plain form
9484 50130 -105085 18974 118923 -150196 260755 1852 27435 102143 -178916 125614 -113020
9472 -164034 28254 142507 24896 -25791 34837 -266936 48862 -170694 -99058 240932 1002
9460 158630 -32546 -57247 -114980 91607 18160 229767 -125761 -57857 19874 266108 -63324
9448 10937 -306907 -172194 242744 174730 -201524 -66338 -95634 -153639 47276 -165256 -151352
9437 -151352 -21744 -8126 -343407 -182207 -129341 55729 -159309 -466615 -17990 -34302 -58102
9426 -58102 257748 -308634 -140403 -15459 -297078 25761 5093 94542 -275181 -258412 -107433
9414 -196631 -159580 138893 114199 -229065 16542 -144288 -191647 -24969 -227813 -35465 32161
9402 10307 -215892 -276591 93490 170350 -180521 222372 151790 -461711 -108028 -165276 -72289
$$ packed form
9484E0130a05085A8974R9949a50196B60755A852K5583P4708a78916A25614a13020
9472a64034B8254J14253B4896b5791C4837b66936D8862a70694P1636B40932A002
9460A58630c2546k4701n7733I1607A8160K11607a25761e7857A9874K46234f3324
9448A0937c06907J34713B42744o8014b01524f6338k9296n8005D7276a65256J3904
9437a51352b1744h126l35281J61200N2866E5729a59309l07306a7990j6312k3800
9426e8102B57748c08634a40403a5459k81619B5761E093Q9449b75181J6769a07433
9414a96631L7051A38893k4694b29065A6542a44288m7359b4969k02844c5465C2161
9402A0307b15892o0699I3490P6860a80521B22372p0582d61711a08028n7248g2289
$$ plain form
9390 -293494 -132268 -102264 96108 -178991 -43832 -206734 78596 -223156 153569 -172520
9379 186809 -53736 -23072 141370 -243487 -39108 72944 9167 -127327 33563 -409504 -263722
9368 -263722 -359781 -42436 -257569 6208 -51988 93478 -190950 103605 -18909 -89647 26493
9356 -229247 -102045 239070 -89144 25541 38230 -35652 105693 -208746 -203010 -227216 -202407
9345 -202407 34669 -239519 -502086 -52566 40262 -115911 156189 -299027 42016 -68898 -271917
9334 -271917 27160 -230395 133897 -356142 -12373 -176590 132514 -60976 -37642 226833
9323 17414 -104580 -94657 5432 21165 -180038 134111 284067 -306706 -118656 -347120 4664
9311 -6193 -14303 169658 -221087 -56418 -94680 -267011 214156 -2685 -27081 -29098 -2202 18916
$$ packed form
9390b93494a32268L0004I6108a78991d3832j62902G8596b23156A53569a72520
9379A86809e3736b3072A41370b43487c9108G2944I167a27327C3563d09504J45782
9368b63722r6059d2436k15133F208e1988I3478a90950A03605a8909p0738B6493
9356b29247a02045B39070h9144B5541J2689c5652A05693b08746N736k4206K4809
9345b02407C4669b39519k62567e2566D0262a15911A56189b99027D2016f8898k03019
9334b71917B7160b30395A33897c56142a2373j64217A32514f0976K3334B26833
9323A7414a04580R923E432J5733a80038A34111J49956c06706a18656k28464D664
9311f193q110A69658b21087e6418l8262j72331B14156b685k4396k017b202A8916
$$ plain form
9298 -296329 -307231 241348 44579 54723 -71028 8639 -177625 -152317 94309 -200661 -19494
9286 -107020 -103253 -8603 -29416 141241 150900 170193 201406 40669 -128488 241106 10570 -324107
9273 -177432 -250904 14943 130264 71308 -147657 -188619 60890 238871 -28761 -226153 -90754
9261 -9634 -18134 -333815 -66266 -145894 156476 -272729 32917 129897 -48039 99720 -283702
9249 3163 56191 42119 -191544 310520 111436 -58229 32541 126408 -159309 -238423 -18981
9237 -273100 -99273 121469 -246165 -116956 212249 122920 183388 68015 240799 -145616
9226 -115166 -162582 -148783 13562 -271013 58294 11325 -130204 -168504 -260262 -49415 265092
9214 -136019 80577 -195056 6421 -109775 12880 380903 -145113 438590 124244 -31496 -65633
$$ packed form
9298b96329j0902B41348D4579J0144g1028H639a77625K5308I4309b00661a9494
9286a07020L767h603k0813A41241R659J9293L1213D0669a28488B41106A0570c24107
9273a77432p3472A4943J15321n8956a47657m0962F0890J77981b8761j97392i0754
9261i634q500l15681f6266p9628A56476b72729C2917R6980d8039I9720b83702
9249C163N3028j4072a91544C10520A11436e8229C2541R3867a59309p9114a8981
9237b73100i9273A21469b46165a16956B12249q9329O0468F8015J72784a45616
9226a15166m7416J3799A3562b71013E8294A1325a30204l8300r1758d9415B65092
9214a36019H0577a95056F421a09775A2880L68023a45113D38590A24244c1496l4137
$$ plain form
9203 -65633 102655 -67179 -138258 91989 374858 -135214 -49716 -15181 35350 -233998 146835
9191 -345785 -164555 -66074 -143417 79160 185553 -304550 130174 -175484 34192 411066
9181 411066 -302918 -14636 -66659 -136202 54234 127237 256039 96310 298441 -239635 126968
9169 78892 165874 -131825 -132279 -213807 12643 12553 -145535 84583 119831 81173 115605 125034 -198037
9155 75806 -170610 -288394 64128 6133 -95188 -69801 -246686 -240174 -218604 72587 -101974
9143 132113 223023 -105587 -191965 -146872 -261667 -47760 91896 -142818 -190077 -106979 -328157
9132 -328157 82658 -45447 -505504 13013 -349743 -254915 -291509 -45612 374143 -184106 -153769
9121 -153769 -111704 -230334 -37796 -84592 -379277 -172831 -33098 61215 37783 43361 -108007
$$ packed form
9203f5633A02655f7179p1079I1989K82869a35214d9716a5181C5350b33998A46835
9191c45785a64555f6074p7343G9160J06393c04550A30174a75484C4192L76874
9181D11066c02918a4636n2023o9543E4234P3003J28802I6310K02131b39635A26968
9169G8892Q6982a31825m54q1528A2643r0a45535H4583L5248l8658L4432R429a98037
9155G5806a70610j17784F4128F133i5188K5387j76885O512K1570G2587a01974
9143A32113R0910a05587q6378M5093j14795d7760I1896a42818m7259Q3098k21178
9132c28157H2658d5447m60057A3013c49743R4828l6594d5612C74143a84106L0337
9121a53769M2065j18630c7796m6796k94685a72831c3098F1215k3432N578a08007
$$ plain form
9109 -112089 -87843 -399169 153042 -138154 113045 -214483 -140379 26380 -65455 -291372
9099 -291372 185360 276364 -462073 -396399 -98174 -105074 117080 118971 242794 -198692 -264325
9088 -264325 -8480 233654 -42128 -407888 -238775 -70586 -81487 -8859 232314 -168786 -184528
9077 -184528 276764 -362024 174501 119654 49633 114716 -419541 -296107 -142224 71873
9066 -218709 12409 -56794 95704 115781 159201 -140018 -294795 -284516 225786 103464 35220
9054 149289 49121 -78720 -111516 -25148 -173827 -92254 253870 -201551 -85987 -133229 -143089
9043 -143089 182143 66281 152961 -342664 171910 -255883 -96932 239365 -68686 -237207
9033 -237207 84762 -6356 11883 -139594 71815 13914 -233512 -46251 116205 -81516 552724
$$ packed form
9109a12089K4246l11326A53042a38154A13045b14483P4104B6380f5455k25917
9099b91372A85360R1004d62073O5674i8174o900A17080J891J23823a98692o5633
9088b64325h480B33654d2128l65760J69113g0586j0901h859B32314a68786j5742
9077a84528B76764c62024A74501n4847D9633O5083d19541J23434a42224G1873
9066b18709A2409e6794I5704K0077M3420a40018j54777J0279B25786A03464C5220
9054A49289D9121g8720l2796b5148j48679Q1573B53870b01551h5987m7242r860
9043a43089A82143F6281Q6680c42664A71910b55883i6932B39365f8686j68521
9033b37207H4762f356A1883a39594G1815A3914b33512d6251A16205h1516E52724
$$ plain form
9021 1429 -266517 -202283 -101444 62620 -64760 208692 -126192 -171341 -86524 196890 -163069
9009 -16000 11847 85492 -96551 -30736 228006 -243661 -217487 -225180 -166886 56040 -77694 -321737
8997 -321737 -3363 25326 -217407 -540580 -88684 -164683 -32830 -16484 178361 -74847 77217
8985 -59914 45964 27035 -128337 96375 101013 -146865 147285 -47904 -256902 3127 -346999
8973 -159576 10149 -80237 282448 -169284 -495408 -187423 -248124 -60203 -100858 -355376 121882
8961 -176048 -96896 -44593 -127577 -420328 -175180 61067 -85283 -104759 -66476 -191299 -50350
8949 207848 -284467 64114 70726 -61609 -106486 -246092 72953 240635 -166982 -59052 -196011
8938 -196011 -108652 24443 -496402 276879 -65024 -46098 -96469 -218217 244458 -115561 -5463
$$ packed form
9021A429b66517O4234J00839F2620f4760B08692a26192m5149Q4817A96890a63069
9009a6000A1847P3645i6551c0736B28006b43661K6174p693N8294E6040g7694k44043
8997c21737c363B5326b17407l23173h8684p5999c2830J6346A78361g4847G7217
8985e9914D5964j8929a28337I6375M638a46865A47285d7904k08998C127c46999
8973a59576A0149h0237B82448a69284l26124a87423o0701f0203m0655k54518A21882
8961a76048P9152d4593q2984k92751a75180F1067h5283j9476L8283j24823e0350
8949B07848b84467F4114O612f1609m4877j39606G2953J67682a66982e9052j36959
8938a96011Q7359B4443d96402B76879f5024J8926n0371j21748B44458a15561e463
$$ plain form
8926 152807 -30823 43092 31796 249099 634661 471564 253604 -37440 433 18276 -120515
8914 158410 -218844 -291454 -74460 -204725 120586 -184092 140702 203433 -9701 -297199 -86642
8902 -8962 -47047 125848 -287887 -40215 -68339 -164601 -320321 2058 192710 6743 7707 -4877
8889 -160804 -78315 -437 -176969 -4820 -141461 -246299 213033 -172686 20576 -116062 -197570
8878 -197570 -254219 -6049 -235576 -51622 -206066 -153193 122837 172970 -13296 -398104 -176192
8866 -167494 -169604 -58542 -94461 -312809 -137521 -114071 9303 21638 24402 -277059 -124424
$$ packed form
8926A52807c0823D3092j1296K17303L85562j63097k17960c7440D33J7843a20515
8914A58410b18844p2610g4460j30265A20586a84092A40702O2731i701k87498h6642
8902h962l8085A25848b87887d0215k8124r6262j55720B058J90652F743R64d877
8889a60804g8315d37j76532d820j36641j04838B13033a72686B0576a16062q1508
8878a97570n6649f049k29527e1622j54444N2873A22837N0133a3296l84808a76192
8866a67494k110e8542l5919k18348a37521K3450I303J2335K764b77059a24424
$$ [...]
##END NTUPLES=NMR SPECTRUM
##END=
