##TITLE=AC1729_SEN00002_9275740_F0xnw3EYGm
##JCAMPDX= 6.0         $$ Bruker NMR JCAMP-DX V2.0
##DATA TYPE= NMR SPECTRUM
##DATA CLASS= NTUPLES
##ORIGIN= BRUKER
##OWNER= Administrator
$$ 1.72 TOPSPIN		Version 2.1
$$ 2015-07-14 20:24:34.104 -0700  Administrator@X
$$ Compression mode = diff/dup
##.OBSERVE FREQUENCY= 400.02188249412
##.OBSERVE NUCLEUS= ^1H
##.ACQUISITION MODE= SIMULTANEOUS (DQD)
##.ACQUISITION SCHEME= undefined
##.AVERAGES= 64
##.DIGITISER RES= 22
##SPECTROMETER/DATA SYSTEM= spect
##.PULSE SEQUENCE= noesygpps1d.comp
##.SOLVENT NAME= COFFEE_meoh
##.SHIFT REFERENCE= INTERNAL, COFFEE_meoh, 1, 14.96088
##AUDIT TRAIL= $$ (NUMBER, WHEN, WHO, WHERE, PROCESS, VERSION, WHAT)
$$ ##TITLE= Audit trail, TOPSPIN		Version 2.1
$$ ##JCAMPDX= 5.01
$$ ##ORIGIN= Bruker BioSpin GmbH
$$ ##OWNER= Administrator
$$ $$ E:\/data/COFFEE/nmr/AC1729_SEN00002_9275740_F0xnw3EYGm/12/pdata/1/auditp.txt
$$ ##AUDIT TRAIL=  $$ (NUMBER, WHEN, WHO, WHERE, PROCESS, VERSION, WHAT)
(   1,<2015-07-14 20:24:29.057 -0700>,<Administrator>,<X>,<go>,<TOPSPIN 2.1>,
      <created by zg
	started at 2015-07-14 20:12:59.416 -0700,
	POWCHK enabled, PULCHK disabled,
       configuration hash MD5:
       21 0F 79 D6 B3 7B B4 F6 88 20 88 DB 03 48 BD 9F
       data hash MD5: 64K
       A2 CC D8 F6 DA BF A7 83 1A 11 04 77 7A AC 5F 03>)
(   2,<2015-07-14 20:24:32.213 -0700>,<Administrator>,<X>,<proc1d>,<TOPSPIN 2.1>,
      <Start of raw data processing
       efp LB = 0.3 FT_mod = 6 PKNL = 1 PHC0 = 0 PHC1 = 0 SI = 128K 
       data hash MD5: 128K
       E7 1F 3C D5 A5 BC 60 4F 10 22 CA 80 16 5D 0E 05>)
(   3,<2015-07-14 20:24:33.213 -0700>,<Administrator>,<X>,<proc1d>,<TOPSPIN 2.1>,
      <pk PHC0 = -86.28113 PHC1 = 0 
       data hash MD5: 128K
       1F 22 78 35 72 47 EE CC 35 2E C3 2E 33 CF 9F 62>)
(   4,<2015-07-14 20:24:33.619 -0700>,<Administrator>,<X>,<proc1d>,<TOPSPIN 2.1>,
      <abs ABSG = 1 
       data hash MD5: 128K
       93 EA 3C 6E 78 EC 6E 88 32 DD C4 67 A8 CB F8 F5>)
(   5,<2015-07-14 20:24:33.713 -0700>,<Administrator>,<X>,<proc1d>,<TOPSPIN 2.1>,
      <abs ABSG = 2 
       data hash MD5: 128K
       C9 44 0A 0E CE CE 0D 52 01 69 A6 E7 1C 47 56 27>)
(   6,<2015-07-14 20:24:33.791 -0700>,<Administrator>,<X>,<proc1d>,<TOPSPIN 2.1>,
      <abs ABSG = 3 
       data hash MD5: 128K
       47 3F 3D 46 97 35 43 11 24 6E 8D 4E 7F 07 70 59>)
(   7,<2015-07-14 20:24:33.854 -0700>,<Administrator>,<X>,<proc1d>,<TOPSPIN 2.1>,
      <abs ABSG = 4 
       data hash MD5: 128K
       11 19 56 9A 2B 59 34 60 94 F2 EB D8 F0 44 2E 17>)
(   8,<2015-07-14 20:24:33.932 -0700>,<Administrator>,<X>,<proc1d>,<TOPSPIN 2.1>,
      <abs ABSG = 5 
       data hash MD5: 128K
       BC 2B 04 9D CE A2 12 68 0F E4 D2 7E 2E 93 45 65>)
$$ ##END=
$$ 
$$ $$ hash MD5
$$ $$ 74 8F 46 25 CE 4E 43 6C 43 93 F5 BA C3 53 88 19
##$RELAX= 
##$RELAX= 
##$RELAX= 
##$RELAX= 
##$RELAX= 
##$RELAX= 
##$RELAX= 
##$RELAX= 
$$ Bruker specific parameters
$$ --------------------------
##$DU= <E:\>
##$EXPNO= 12
$$ [...]
##$TP07= 0
##$TPNAME0= <>
##$TPNAME1= <>
##$TPNAME2= <>
##$TPNAME3= <>
##$TPNAME4= <>
##$TPNAME5= <>
##$TPNAME6= <>
##$TPNAME7= <>
##$TPOAL= (0..7)
0.5 0.5 0.5 0.5 0.5 0.5 0.5 0.5
##$TPOFFS= (0..7)
0 0 0 0 0 0 0 0
##$TUNHIN= 0
##$TUNHOUT= 0
##$TUNXOUT= 0
##$USERA1= <user>
##$USERA2= <user>
##$USERA3= <user>
##$USERA4= <user>
##$USERA5= <user>
##$V9= 5
##$VALIST= <valist>
##$VCLIST= <CCCCCCCCCCCCCCC>
##$VD= 0
##$VDLIST= <DDDDDDDDDDDDDDD>
##$VPLIST= <PPPPPPPPPPPPPPP>
##$VTLIST= <TTTTTTTTTTTTTTT>
##$WBST= 2048
##$WBSW= 25
##$XGAIN= (0..3)
0 0 0 0
##$XL= 0
##$YL= 0
##$YMAX_a= 6042713
##$YMIN_a= -11400585
##$ZGOPTNS= <>
##$ZL1= 120
##$ZL2= 120
##$ZL3= 120
##$ZL4= 120
##$ABSF1= 14.96088
##$ABSF2= -5.597301
##$ABSG= 5
##$ABSL= 3
##$ALPHA= 0
##$AQORDER= 0
##$ASSFAC= 0
##$ASSFACI= 0
##$ASSFACX= 0
##$ASSWID= 0
##$AUNMP= <proc_prof1d_extract.lims>
##$AXLEFT= 0
##$AXNAME= <>
##$AXNUC= <1H>
##$AXRIGHT= 0
##$AXTYPE= 0
##$AXUNIT= <>
##$AZFE= 0.1
##$AZFW= 0.1
##$BCFW= 0
##$BC_mod= 0
##$BYTORDP= 0
##$COROFFS= 0
##$CY= 15
##$DATMOD= 1
##$DC= 0
##$DFILT= <>
##$DTYPP= 0
##$F1P= 0
##$F2P= 0
##$FCOR= 0.5
##$FTSIZE= 131072
##$FT_mod= 6
##$GAMMA= 0
##$GB= 0
##$INTBC= 1
##$INTSCL= 1
##$ISEN= 128
##$LB= 0.3
##$LEV0= 0
##$LPBIN= 0
##$MAXI= 10000
##$MC2= 0
##$MEAN= 0
##$ME_mod= 0
##$MI= 0
##$NCOEF= 0
##$NC_proc= -2
##$NLEV= 6
##$NOISF1= 0
##$NOISF2= 0
##$NSP= 0
##$NTH_PI= 0
##$NZP= 0
##$OFFSET= 14.96088
##$PC= 1
##$PHC0= -86.28113
##$PHC1= 0
##$PH_mod= 1
##$PKNL= yes
##$PPARMOD= 0
##$PPDIAG= 0
##$PPIPTYP= 0
##$PPMPNUM= 2147483647
##$PPRESOL= 1
##$PSCAL= 4
##$PSIGN= 0
##$PYNMP= <proc.py>
##$REVERSE= no
##$SF= 400.020009684771
##$SI= 131072
##$SIGF1= 0
##$SIGF2= 0
##$SINO= 400
##$SIOLD= 131072
##$SPECTYP= <>
##$SREGLST= <1H.CDCl3>
##$SSB= 0
##$STSI= 131072
##$STSR= 0
##$SW_p= 8223.68421052631
##$SYMM= 0
##$S_DEV= 0
##$TDeff= 65536
##$TDoff= 0
##$TI= <>
##$TILT= no
##$TM1= 0
##$TM2= 0
##$TOPLEV= 0
##$USERP1= <user>
##$USERP2= <user>
##$USERP3= <user>
##$USERP4= <user>
##$USERP5= <user>
##$WDW= 1
##$XDIM= 131072
##$YMAX_p= 421553207
##$YMIN_p= -10945
##$CURPLOT= <Network HP LaserJet P1505>
##$CURPRIN= <$Network HP LaserJet P1505>
##$DFORMAT= <normdp>
##$LAYOUT= <+/1D_H.xwp>
##$LFORMAT= <normlp>
##$PFORMAT= <normpl>
##$SURQMSG= 1
$$ End of Bruker specific parameters
$$ ---------------------------------
##NTUPLES= NMR SPECTRUM
##VAR_NAME=  FREQUENCY,     SPECTRUM/REAL,   SPECTRUM/IMAG
##SYMBOL=    X,             R,               I
##VAR_TYPE=  INDEPENDENT,   DEPENDENT,       DEPENDENT
##VAR_FORM=  AFFN,          ASDF,            ASDF
##VAR_DIM=   131072,        131072,          131072
##UNITS=     HZ,            ARBITRARY UNITS, ARBITRARY UNITS
##FACTOR=    0.0627417313425164, 1,          1
##FIRST=     8223.62146879497, 663,          -48317
##LAST=      0,             1255,            -48296
##MIN=       0,             -10945,          0
##MAX=       8223.62146879497, 421553207,    0
$$ Real data points
##PAGE= N=1
##DATA TABLE= (X++(R..R)), XYDATA
$$ [...]
63956G13893L4238L8907M4176N0146N7117O5420P5263Q6839J00371J15824J32670
63945A514864J50230J68140J86230K04065K20933K36277K49772K60922K68846
63936C460279K72515K70982K63400K49214K28568K02299J71414J36656R8760N8850
63926E412937J8225k2309o2624j02500j40800j75602k05189k28816k46499k58379
63916C988444k64553k65344k61390k53449k42269k28630k13209j96384j78392
63907A884824j59807j41614j24681j09288r5214q2229p0472o0455n2562m6504
63897I41998m1402l6674l2555k9465k7134k4978k3098k2170k2178k2118k1259
63886F38967j9989j8999j8174j6915j5110j3194j1471r908q365o604m331j680
$$ y = [713893, 748131, 787038, 831214, 881360, 938477, 1003897, 1079160, 1165999, 1266370, 1382194, 1514864, 1665094, 1833234, 2019464, 2223529, 2444462, 2680739, 2930511, 3191433, 3460279, 3732794, 4003776, 4267176, 4516390, 4744958, 4947257, 5118671, 5255327, 5354087, 5412937, 5431162, 5408853, 5346229, 5243729, 5102929, 4927327, 4722138, 4493322, 4246823, 3988444, 3723891, 3458547, 3197157, 2943708, 2701439, 2472809, 2259600, 2063216, 1884824, 1725017, 1583403, 1458722, 1349434, 1254220, 1171991, 1101519, 1041064, 988502, 941998, 900596, 863922, 831367, 801902, 774768, 749790, 726692, 704522, 682344, 660226, 638967, 618978, 599979, 581805, 564890, 549780, 536586, 525115, 515207, 506842, 500238, 495907, 494227]
63874D94227N75J835K541L641N387P126Q276Q971R719J0771J1910J2604J2408
63861E89991J1481J0589J0276J0194R620Q422P048N668L911J536j047l159m490
63848F60040n358o451q222j0330j1881j2491j2894j4029j5771j7148j7690j7870
63836E09905j8168j8379j8078j7264j6238j5267j4595j4382j4335j3754j2328
63825C37117j0623r417q775q120p119o113n584n490n304m683l876l404l379l354
63811B51876k886k040j225p48o96j030j548j892j881j709j661j732j785j819j860
63796B27364j819j748j949k452k736k432j991k006k218j900j102o01o88p86m91
63781B02445j78k66n70p35p67p96p34n03j74K67Q18J033L27j006j790j347l32
$$ y = [494227, 494802, 496637, 499178, 502819, 508206, 515332, 523608, 532579, 542298, 553069, 564979, 577583, 589991, 601472, 612061, 622337, 632531, 642151, 650573, 657621, 663289, 667200, 668736, 667689, 664530, 660040, 654682, 648231, 640009, 629679, 617798, 605307, 592413, 578384, 562613, 545465, 527775, 509905, 491737, 473358, 455280, 438016, 421778, 406511, 391916, 377534, 363199, 349445, 337117, 326494, 317077, 308302, 300182, 293063, 286950, 281366, 275876, 270572, 265889, 262013, 258609, 255230, 251876, 248990, 246950, 245725, 244977, 244281, 243251, 241703, 239811, 237930, 236221, 234560, 232828, 231043, 229224, 227364, 225545, 223797, 221848, 219396, 216660, 214228, 212237, 210231, 208013, 206113, 205011, 204410, 203722, 202936, 202445, 202267, 202001, 201431, 200696, 199929, 199133, 198399, 197896, 197722, 197989, 198807, 199840, 200167, 199161, 197371, 196024, 195692]
63764A95692K46K07l3k35k90J07R88J710J646J032N60M28L84M32P10Q97N28j92
63746B04817n11j58L94P28R49J213J383J361J374J651K093K442K567K458K159
63731B24920J841J789K175K843L374L327K669J997K085L065M238M883M896M545
63717B68647L965L285K763K382J645K82j176k093k597l078l267k684j780j569
63703B64725k101k322j660p63l35j35L09Q88J324J836K627L319L484L288L042
63688B77526K591J831J331J651K312K278J316J32o96j180j343j002l17J65K54
63673B86849L67P76J156J193J173J529K139K473K259J668J023N30K03j84r44k030
63657C00180k970l446l768m450n372n820n422m646m101l607k475o80P51R29K82
$$ y = [195692, 195938, 196145, 196112, 195877, 195587, 195694, 196682, 198392, 200038, 201070, 201630, 202058, 202442, 202874, 203584, 204481, 205009, 204817, 204306, 204148, 204542, 205270, 206219, 207432, 208815, 210176, 211550, 213201, 215294, 217736, 220303, 222761, 224920, 226761, 228550, 230725, 233568, 236942, 240269, 242938, 244935, 247020, 250085, 254323, 259206, 264102, 268647, 272612, 275897, 278660, 281042, 282687, 282969, 281793, 279700, 277103, 274025, 270758, 268074, 266294, 264725, 262624, 260302, 258642, 257879, 257544, 257409, 257718, 258606, 259930, 261766, 264393, 267712, 271196, 274484, 277526, 280117, 281948, 283279, 284930, 287242, 289520, 290836, 290968, 290272, 289092, 287749, 286747, 286430, 286595, 286849, 287216, 287992, 289148, 290341, 291514, 293043, 295182, 297655, 299914, 301582, 302605, 303135, 303338, 303154, 302210, 300180, 297210, 293764, 289996, 285546, 280174, 274354, 268932, 264286, 260185, 256578, 254103, 253423, 254174, 255103, 255385]
63642B55385K3N62J135J118R47J268J827J987J931K442L563M445M642M725N229
63627B91229N801N947N948O389P196P876Q380R064R906J0551J1071J2060J3787
63614D05205J5847J7799J9664K1638K3659K5620K7584K9550L1205L2127L2098
63603F81996L1007K8615K4692J9318J3017O666J229k616m840n961o561o919p121
63590G72522p394q261j0272j3450j6924j9522k0969k2229k4151k6113k6626k5209
63578E51402k2813k0362j7753j4703j1699r310p190m703k111k99O19J481K761
63565D45320L952M524M831N533O600P443P800Q013Q471R208J0103J1226J2782
63552E45806J4801J7084J9508K2253K5574K9317L2884L5716L7559L8033L6261
$$ y = [255385, 255408, 255970, 257105, 258223, 259170, 260438, 262265, 264252, 266183, 268625, 272188, 276633, 281275, 286000, 291229, 297030, 302977, 308925, 315314, 322510, 330386, 338766, 347830, 357736, 368287, 379358, 391418, 405205, 421052, 438851, 458515, 480153, 503812, 529432, 557016, 586566, 617771, 649898, 681996, 713003, 741618, 766310, 785628, 798645, 805311, 806540, 803924, 799084, 793123, 786562, 779643, 772522, 765128, 756867, 746595, 733145, 716221, 696699, 675730, 653501, 629350, 603237, 576611, 551402, 528589, 508227, 490474, 475771, 464072, 454762, 447572, 442869, 440758, 440459, 441078, 442559, 445320, 449272, 453796, 458627, 464160, 470760, 478203, 486003, 494016, 502487, 511695, 521798, 533024, 545806, 560607, 577691, 597199, 619452, 645026, 674343, 707227, 742943, 780502, 818535, 854796]
63541H54796L1430K3801J4875O511j33m864q068j0117j1029j0648r216p586o705
63528H63047o999q474j1133j4880j9119k3006k6145k8687l0727l1972l2205l1574
63516E98126l0295k8362k5862k3138k0538j8166j6122j4592j3444j2125j0370
63505C85112q705p802p463o790n344l713k724k478k343j777q66j18J34k3l00n33
63489C34267p07p85p38o81p65q62n82K81J462K441K829K549J894J437J560J995
63473C45595K071J608J200J329J553R80n66k281l310l530l409l391l609l903l975
63458C26362l591k756j708p52j25P8L5J79Q44J911K980L851M662N509O269O907
63442C50655P692Q836J0083J0987J1565J2412J4037J6332J8808K1109K3013K4097
$$ y = [854796, 886226, 910027, 924902, 931413, 931280, 926416, 918348, 908231, 897202, 886554, 877338, 869752, 863047, 856048, 847574, 836441, 821561, 802442, 779436, 753291, 724604, 693877, 661905, 629700, 598126, 567831, 539469, 513607, 490469, 469931, 451765, 435643, 421051, 407607, 395482, 385112, 376407, 368605, 361142, 354352, 349008, 345295, 342571, 340093, 337750, 335973, 335107, 334989, 335123, 335100, 334800, 334267, 333560, 332775, 332037, 331356, 330591, 329729, 329147, 329428, 330890, 333331, 336160, 338709, 340603, 342040, 343600, 345595, 347666, 349274, 350474, 351803, 353356, 354336, 353770, 351489, 348179, 344649, 341240, 337849, 334240, 330337, 326362, 322771, 320015, 318307, 317555, 317430, 317508, 317543, 317722, 318566, 320477, 323457, 327308, 331970, 337479, 343748, 350655, 358347, 367183, 377266, 388253, 399818, 412230, 426267, 442599, 461407, 482516, 505529, 529626]
63430E29626K3758K1722J8359J4470J0986Q833Q612J0126J2442J4749J7052J9843
63418G10578K3319K7273L1456L5485L8446L9255L7547L3874K8894K2838J5944
63407A044909Q916K558k744o885r665j1009j1366j1529j2117j3420j5551j8423
63395I43674k1690k4968k8079l0879l3048l4232l4348l3549l2057l0150k8076
63384F12598k5740k2763j9165j5728j3154j1158q944o423m279k766j138J299M171
63371D86810O544Q164R624J1375J3100J4185J4542J4717J5349J6744J8852K1432
63359F51438K4086K6377K8194K9927L1996L4167L5625L5747L4457L1697K7020
63348I90731K0255J2321M867r72n128q004r888j0998j1745j2506j3362j4246j5286
$$ y = [529626, 553384, 575106, 593465, 607935, 618921, 627754, 636366, 646492, 658934, 673683, 690735, 710578, 733897, 761170, 792626, 828111, 866557, 905812, 943359, 977233, 1006127, 1028965, 1044909, 1053825, 1056383, 1053639, 1046754, 1037089, 1026080, 1014714, 1003185, 991068, 977648, 962097, 943674, 921984, 897016, 868937, 838058, 805010, 770778, 736430, 702881, 670824, 640674, 612598, 586858, 564095, 544930, 529202, 516048, 504890, 495946, 489523, 485244, 482478, 481340, 482639, 486810, 493354, 501518, 511142, 522517, 535617, 549802, 564344, 579061, 594410, 611154, 630006, 651438, 675524, 701901, 730095, 760022, 792018, 826185, 861810, 897557, 932014, 963711, 990731, 1010986, 1023307, 1028174, 1027202, 1022074, 1014070, 1004182, 993184, 981439, 968933, 955571, 941325, 926039]
63335I26039j6799j9031k1935k5183k8325l0936l2653l3114l2033k9527k6236
63324F30267k2906j9835j6807j3601j0370p645o050n937p087q838j0645j2367
63312D88179j3849j4565j4122j2971j2029j1511j0677q977o893n340m500l812
63300C68933k900k036j595j441j106m95j47p09k204l922n065n414n318n232n330
63285C26019n467n319m711l887l315l024k398j029M69R68J43j202k134k372k037
63270B90704j215j31P18J028J030J017Q84N24L61R01J864K375K107J778K257L503
63254C09705M696N213N171N024M944M791M549M495M835N440O116O924P955Q954
63240C88812R569J0030J1062J2925J4907J6116J6579J7169J8529K0384K1929K2593
$$ y = [926039, 909240, 890209, 868274, 843091, 814766, 783830, 751177, 718063, 686030, 656503, 630267, 607361, 587526, 570719, 557118, 546748, 539103, 533053, 527116, 520029, 511191, 500546, 488179, 474330, 459765, 445643, 432672, 420643, 409132, 398455, 389478, 382585, 377245, 372745, 368933, 366033, 363997, 362402, 360961, 359855, 359360, 359213, 358504, 356300, 352378, 347313, 341899, 336581, 331349, 326019, 320552, 315233, 310522, 306635, 303320, 300296, 297898, 296869, 297338, 298306, 298449, 297247, 295113, 292741, 290704, 289489, 289358, 290076, 291104, 292134, 293151, 294035, 294559, 294920, 295821, 297685, 300060, 302167, 303945, 306202, 309705, 314401, 319614, 324785, 329809, 334753, 339544, 344093, 348588, 353423, 358863, 364979, 371903, 379858, 388812, 398381, 408411, 419473, 432398, 447305, 463421, 480000, 497169, 515698, 536082, 558011, 580604]
63228E80604K2416K1847K1358K1161K1190K1313K1449K1596K1773K2009K2260
63217H18976K2383K2299K2075K1696K0775J8861J6001J2695R135M929j89n725
63205I83911j0844j5162j8773k1671k3591k4439k4513k4178k3499k2202j9940
63194G55099j6682j2984r673p093m807k281L93K780M922P367J0319J3250J5506
63181G56116J6978J7980J8764J9379J9861K0329K0918K1699K2522K2954K2545
63170I80045K1319J9808J8427J6910J4545J0939O342J301l823q885j3742j8229
63158A044957k2364k6346l0172l3344l5234l5706l5261l4498l3611l2423l0757
63147F95241k8633k6193k3598k0935j8194j5458j3073j1394j0321r329q113o941
$$ y = [580604, 603020, 624867, 646225, 667386, 688576, 709889, 731338, 752934, 774707, 796716, 818976, 841359, 863658, 885733, 907429, 928204, 947065, 963066, 975761, 984896, 989825, 989636, 983911, 973067, 957905, 939132, 917461, 893870, 869431, 844918, 820740, 797241, 775039, 755099, 738417, 725433, 715760, 708667, 703860, 701579, 701972, 704752, 709674, 717041, 727360, 740610, 756116, 773094, 791074, 809838, 829217, 849078, 869407, 890325, 912024, 934546, 957500, 980045, 1001364, 1021172, 1039599, 1056509, 1071054, 1081993, 1088335, 1089636, 1085813, 1076928, 1063186, 1044957, 1022593, 996247, 966075, 932731, 897497, 861791, 826530, 792032, 758421, 725998, 695241, 666608, 640415, 616817, 595882, 577688, 562230, 549157, 537763, 527442, 518113, 510000, 503059]
63135E03059o161n644m945l829k430j052OO64J318K543M278N700O260O435O865
63120E13067P194O588N171L995L512L057K076J013N05M45M47N90J056J467J283
63105E51466O35J02p2q2m0K4j80r12j797k088j614r73o84o11l87PL47N51P03Q33
63085E45228Q31N90K18J04O39J713K713L198L405L782M277M559M739N285O212
63070E87493O939P123P142P502Q268R310J0680J2388J4100J5520J6887J8720K1147
63057G43219K3834K6410K8770L1003L3316L5961L9067M2402M5511M8034M9885
63046A147412N1143N1875N1995N1391N0300M9437M9412M9948N0124M9510M8733
63035A701280M8631M9131M9378M8626M6708M3694L9484L3689K5783J5533L588
$$ y = [503059, 496898, 491254, 486309, 482480, 480050, 478998, 479004, 479668, 480986, 483529, 487807, 493507, 499767, 506202, 513067, 520261, 526849, 532020, 536015, 539527, 542584, 544660, 545673, 546178, 546623, 547070, 547660, 548716, 550183, 551466, 552101, 552203, 552131, 552049, 552009, 552033, 551853, 550941, 549144, 547056, 545442, 544469, 543785, 543174, 542787, 542794, 543141, 543692, 544395, 545228, 546059, 546649, 546867, 546971, 547610, 549323, 552036, 555234, 558639, 562421, 566698, 571257, 575996, 581281, 587493, 594432, 601555, 608697, 616199, 624467, 633777, 644457, 656845, 670945, 686465, 703352, 722072, 743219, 767053, 793463, 822233, 853236, 886552, 922513, 961580, 1003982, 1049493, 1097527, 1147412, 1198555, 1250430, 1302425, 1353816, 1404116, 1453553, 1502965, 1552913, 1603037, 1652547, 1701280, 1749911, 1799042, 1848420, 1897046, 1943754, 1987448, 2026932, 2060621, 2086404, 2101937, 2105525]
63024B105525q587j9751k9763l9171m8127n6031o2054o5564o6264o4461o1176
63013A584576n7418n3238m7951m1329l4049k6803j9640j2408n363J173P358J3509
63001A308417J9454K4689K9093L2946L6283L8652L9715L9783L9532L9331L9090
62990A686985L8704L8309L7978L7313L5688L2877K9177K4759J9238J2158L658
62979A996844n634j5289k5167l5028m4422n3008o0521o6454p0249p1881p1892
62968A477299p0672o8214o4695o0777n6952n3007m8570m3947l9924l6884l4462
62957H99195l2029k9309k6574k4336k2818k1642k0289j8778j7658j7211j7080
62946F51471j6817j6379j5851j5201j4540j4145j3847j2887j0974q978p938p687
$$ y = [2105525, 2096938, 2077187, 2047424, 2008253, 1960126, 1904095, 1842041, 1776477, 1710213, 1645752, 1584576, 1527158, 1473920, 1425969, 1384640, 1350591, 1323788, 1304148, 1291740, 1286377, 1287550, 1294908, 1308417, 1327871, 1352560, 1381653, 1414599, 1450882, 1489534, 1529249, 1569032, 1608564, 1647895, 1686985, 1725689, 1763998, 1801976, 1839289, 1874977, 1907854, 1937031, 1961790, 1981028, 1993186, 1996844, 1991210, 1975921, 1950754, 1915726, 1871304, 1818296, 1757775, 1691321, 1621072, 1549191, 1477299, 1406627, 1338413, 1273718, 1212941, 1155989, 1102982, 1054412, 1010465, 970541, 933657, 899195, 867166, 837857, 811283, 786947, 764129, 742487, 722198, 703420, 685762, 668551, 651471, 634654, 618275, 602424, 587223, 572683, 558538, 544691, 531804, 520830, 511852, 503914, 496227]
62934D96227p129n770m230l266k959k946k901k688k384k270k366k152j193j3L37
62919D54297m29j513k189k568k967l157k834k393k640l644m459m171l048k374
62905D15911l021m308m639l308j341k76m67r80r39m05M5Q6j26j88J29N18M16j64
62887C96943m43K3N01R7p46p64K13R77P68K29J24J67j49m32p1N38M31n26j497
62868C96383j830j622j212p93n57o29p37m10M07J191J487J366J202J203J239J116
62852C97804Q97R12J324J766J690J118O76P44R81Q99N77M28N63P34O86L24l19
62835D11804j005j391j422j370j274p35M19J604K025J571P86J98nJ80O72J296
62819D13353J970K744L487L869L827L698L620L227K388J731J957K917L911M587
$$ y = [496227, 489098, 483328, 479098, 475832, 472873, 469927, 467026, 464338, 461954, 459684, 457318, 455166, 453973, 453960, 454297, 453868, 452355, 450166, 447598, 444631, 441474, 438640, 436247, 433607, 429963, 425504, 421333, 418285, 415911, 412890, 408582, 403943, 400635, 399294, 399018, 398551, 397571, 396632, 396227, 396272, 396358, 396232, 396044, 396173, 396691, 397107, 396943, 396500, 396523, 397024, 397121, 396375, 395611, 395824, 396801, 397569, 397798, 397922, 398089, 397940, 397508, 397437, 397975, 398406, 397880, 396383, 394553, 392931, 391719, 390926, 390369, 389740, 389003, 388593, 389000, 390191, 391678, 393044, 394246, 395449, 396688, 397804, 398701, 399613, 400937, 402703, 404393, 405511, 406187, 406931, 407912, 408811, 409388, 409816, 410379, 411113, 411799, 412123, 411804, 410799, 409408, 407986, 406616, 405342, 404607, 405026, 406630, 408655, 410226, 411012, 411210, 411205, 411385, 412057, 413353, 415323, 418067, 421554, 425423, 429250, 432948, 436568, 439795, 442183, 443914, 445871, 448788, 452699, 457286]
62805D57286N071N481N910O588P478Q002P820P590Q220R575J0735J1389J2134
62792E63279J3390J4940J6654J8850K1642K4602K7441L0443L4021L8282M3261
62781H46805M8969N4990O0574O5448P0045P4713P9084Q2463Q4341Q4295Q1894
62770A633621P7088P0337O2060N2228M0679K7550J3175j944j6888l0500m2170
62759A885236n2094o0533o7253p1985p5061p7060p8132p7998p6426p3397o9068
62748A106229o3956n8946n4729n1210m7695m3631l9089l4623l0779k7596k4567
62737F29408k1293j8114j5744j4282j3044j1478r751q184o646m880l076j670p97
62724E00449k27K98Q98J526J958K105K372L350N029O798Q398J0262J2629J4947
$$ y = [457286, 462357, 467838, 473748, 480336, 487814, 495816, 503636, 511226, 519446, 529021, 539756, 551145, 563279, 576669, 591609, 608263, 627113, 648755, 673357, 700798, 731241, 765262, 803544, 846805, 895774, 950764, 1011338, 1076786, 1146831, 1221544, 1300628, 1383091, 1467432, 1551727, 1633621, 1710709, 1781046, 1843106, 1895334, 1936013, 1963563, 1976738, 1974794, 1957906, 1927406, 1885236, 1833142, 1772609, 1705356, 1633371, 1558310, 1481250, 1403118, 1325120, 1248694, 1175297, 1106229, 1042273, 983327, 928598, 877388, 829693, 786062, 746973, 712350, 681571, 653975, 629408, 608115, 590001, 574257, 559975, 546931, 535453, 525702, 517518, 510872, 505992, 502916, 501246, 500449, 500222, 500520, 501418, 502944, 504902, 507007, 509379, 512729, 517758, 524556, 532954, 543216, 555845, 570792]
62710E70792J6680J8220K0448K3629K7295L0960L4525L8167M2195M6816N1734
62699I21461N6394O0787O5524P0746P5563P9123Q1589Q3335Q3782Q1963P7762
62688A738029P1622O3380N2577L9692K5889J1536l818j9808l4854m7782n8806
62677A837657o8313p5729q0348q2494q3092q2597q1032p8573p5342p1061o5687
62666I93389o0031n5037n0623m5959m0806l5874l1877k8836k6339k3977k1448
62655E72582j8682j5978j3753j2103j0875j0092r873j0009r991r548q782p835
62643D35061o779n818n170m644l752k382j002p1L63M14J44k53n45r36j884l133
62627C99613l514k338n53K35k98j026r93l58L75J216K304L379M115M615N011N026
$$ y = [570792, 587472, 605692, 626140, 649769, 677064, 708024, 742549, 780716, 822911, 869727, 921461, 977855, 1038642, 1104166, 1174912, 1250475, 1329598, 1411187, 1494522, 1578304, 1660267, 1738029, 1809651, 1873031, 1925608, 1965300, 1991189, 2002725, 1998907, 1979099, 1944245, 1896463, 1837657, 1769344, 1693615, 1613267, 1530773, 1447681, 1365084, 1284052, 1205479, 1130137, 1059076, 993389, 933358, 878321, 827698, 781739, 740933, 705059, 673182, 644346, 618007, 594030, 572582, 553900, 537922, 524169, 512066, 501191, 491099, 481226, 471217, 461226, 451678, 442896, 435061, 428282, 422464, 417294, 412650, 408898, 406516, 405514, 405443, 405806, 406220, 406364, 406111, 405566, 404630, 402746, 399613, 396099, 393761, 393208, 393443, 393145, 392119, 391126, 390768, 391143, 392359, 394663, 398042, 402157, 406772, 411783, 416809]
62611D16809M508M096M668O120P401P841P924Q581J0102J1973J3537J4672J5918
62598E34150J8025K1121K4418K7040K9115L1627L5042L8535M0842M1498M0870
62587H82283L9225L6338L2112K7154K2322J7632J1952M221n002j3685k0309k5280
62575A008963k9902l4380l7659l8982l8695l7417l5429l3211l1532l0413k8828
62564F32515k6147k3215k1151j9731j7960j5709j3746j2333j0925r213p544o133
62552D48708m809l647l051l016k957k512j813r44J22R61R74M17K84Q81J392J263
62536D32253R99J080J123Q58J003K174L670M491M899N851P259Q226Q730R840J2055
62521E04511J4675J7109J9701K2822K6043K8869L1579L4740L8323M1825M4840
$$ y = [416809, 421317, 425413, 430081, 436201, 443602, 451443, 459367, 467948, 478050, 490023, 503560, 518232, 534150, 552175, 573296, 597714, 624754, 653869, 685496, 720538, 759073, 799915, 841413, 882283, 921508, 957846, 989958, 1017112, 1039434, 1057066, 1069018, 1073239, 1068237, 1054552, 1034243, 1008963, 979061, 944681, 907022, 868040, 829345, 791928, 756499, 723288, 691756, 661343, 632515, 606368, 583153, 562002, 542271, 524311, 508602, 494856, 482523, 471598, 462385, 454841, 448708, 443899, 440252, 437201, 434185, 431228, 428716, 426903, 425959, 426081, 427042, 428016, 428433, 428717, 429598, 430990, 432253, 433252, 434332, 435455, 436313, 437316, 439490, 443160, 447651, 452550, 458401, 465660, 473886, 482616, 492456, 504511, 519186, 536295, 555996, 578818, 604861, 633730, 665309, 700049, 738372, 780197, 825037]
62510H25037M7156M8585M9168M9224M8795M7300M3990L8652L1656K3715J5737
62499A269015Q485J980m389j0904j6862k1198k3361k3338k1289j7704j3493r343
62487A117599n096k19N293J0972J6558K2072K7364L2216L6740M0883M3592M3288
62475A391262L9549L3623K6928J9625J1126J506q353j7835k7076l6291m5069n2522
62463A336473n7955o1233o2666o2734o1865o0311n8071n4851n0335m4678l8755
62452G23019l3596k9433k5590k1464j7370j4131j1998j0331q398o162m112k499
62440E37935j076M23J786K637L052L516M146M356L622K258J040J83p63k101l648
62425E57366n213o784q033q256p303o056n560n953o636p136p291o895n857m659
$$ y = [825037, 872193, 920778, 969946, 1019170, 1067965, 1115265, 1159255, 1197907, 1229563, 1253278, 1269015, 1277500, 1279480, 1275091, 1264187, 1247325, 1226127, 1202766, 1179428, 1158139, 1140435, 1126942, 1117599, 1112503, 1112284, 1117577, 1128549, 1145107, 1167179, 1194543, 1226759, 1263499, 1304382, 1347974, 1391262, 1430811, 1464434, 1491362, 1510987, 1522113, 1523619, 1515266, 1497431, 1470355, 1434064, 1388995, 1336473, 1278518, 1217285, 1154619, 1091885, 1030020, 969709, 911638, 856787, 806452, 761774, 723019, 689423, 659990, 634400, 612936, 595566, 581435, 569437, 559106, 550708, 544546, 540434, 537935, 536859, 537282, 539068, 541705, 544757, 548273, 552419, 556775, 560397, 562655, 563695, 563878, 563115, 561014, 557366, 552153, 545369, 537336, 529080, 521777, 515721, 510161, 504208, 497572, 490436, 483145, 476250, 470393, 465734]
62411D65734m062m301m910n333n296m728l788l014k868l065k783j759o69k47l92
62396D18519m57r0N28J095J523J912K334K697K799K566K209J966J858J906K400
62381D43765L612N245O596P300P539P522P215O744O591P130Q245R560J0767J1653
62367E49484J2198J2833J4194J6388J8887K1368K4170K7637L1479L5222L8949
62356H02809M3037M7378N1358N4470N6480N7070N5806N2501M7293M0404L2080
62345A340686K2814J3421M755k703r165j5453k2195k8961l4531l8272m0754m2719
62333A146923m3994m3963m2635m0459l7448l3390k8820k4868k1954j9468j7003
62322G92921j5113j4377j4344j4052j3244j2476j2215j2270j2159j1705j1164
$$ y = [465734, 461672, 457371, 452461, 447128, 441832, 437104, 433316, 430302, 427434, 424369, 421586, 419827, 419158, 418911, 418519, 418062, 417972, 418500, 419595, 421118, 423030, 425364, 428061, 430860, 433426, 435635, 437601, 439459, 441365, 443765, 447377, 452622, 459218, 466518, 474057, 481579, 488794, 495538, 502129, 509259, 517504, 527064, 537831, 549484, 561682, 574515, 588709, 605097, 623984, 645352, 669522, 697159, 728638, 763860, 802809, 845846, 893224, 944582, 999052, 1055532, 1112602, 1168408, 1220909, 1268202, 1308606, 1340686, 1363500, 1376921, 1381676, 1378973, 1369808, 1354355, 1332160, 1303199, 1268668, 1230396, 1189642, 1146923, 1102929, 1058966, 1016331, 975872, 938424, 905034, 876214, 851346, 829392, 809924, 792921, 777808, 763431, 749087, 735035, 721791, 709315, 697100, 684830, 672671, 660966, 649802]
62311F49802j0834j0631j0108r054p914p342p313p176o604o076o080o333o232
62298E48105n818n752o338p047p133o373n108l749k540j608j025o61j86O81J846
62283D97294K899L484L593L492L445L583L887M215M476M785N343O113O852P527
62269E60988Q441R803J1452J3246J5293J7543J9491K0881K2373K4896K8499L2537
62257G85443L6770M1472M6399N0649N3906N6850N9688O1082N9365N4485M7822
62246A353931M0375L2022K2573J2673L299n126j2786k0038k7130l4129m0837m6870
62234A277957n1838n5353n6967n6472n4344n1479m8352m4723m0373l5752l1560
62223G50744k7945k4562k1213j8051j5152j2416r984q281p424o948o384n767n239
$$ y = [649802, 638968, 628337, 618229, 609175, 601261, 593919, 586606, 579430, 572826, 566750, 560670, 554337, 548105, 542287, 536535, 530197, 523150, 516017, 509644, 504536, 500787, 498247, 496639, 495614, 494953, 494767, 495448, 497294, 500193, 503677, 507270, 510762, 514207, 517790, 521677, 525892, 530368, 535153, 540496, 546609, 553461, 560988, 569429, 579232, 590684, 603930, 619223, 636766, 656257, 677138, 699511, 724407, 752906, 785443, 822213, 863685, 910084, 960733, 1014639, 1071489, 1131177, 1192259, 1251624, 1306109, 1353931, 1394306, 1426328, 1448901, 1461574, 1464873, 1459747, 1446961, 1426923, 1399793, 1365664, 1324827, 1277957, 1226119, 1170766, 1113799, 1057327, 1002983, 951504, 903152, 858429, 818056, 782304, 750744, 722799, 698237, 677024, 658973, 643821, 631405, 621421, 613140, 605716, 598768, 592384, 586617, 581378]
62210E81378m510l227j688o02j57J09N16R09J257J928K973L798L994M103M877
62195E95658O183P211P593P641P613P448P245P369P928Q611R126R384R260Q727
62181G06997Q293Q541R135Q945P571O056N585O035O417O408O772Q321J1108J4595
62167H20779J8259K2003K6137L0915L5806L9570M1378M1674M1439M0692L8305
62156A196957L3374K6375J8729J1593N255n71o262j2010j7723k3047k7583l1240
62144A173847l4291l6866l8442l8178l6000l3011l0405k8174k5434k1924j8498
62133H32624j5923j3914j1727r224o806m763l254k602k949l678l807k994j741
62120G49242n89M35J460K355K788K497J453m5j429k310k857l529m448n301n778
$$ y = [581378, 576868, 573641, 571953, 571351, 571194, 571303, 571819, 572728, 573985, 575913, 578886, 582684, 586678, 590781, 595658, 601841, 609052, 616645, 624286, 631899, 639347, 646592, 653961, 661889, 670500, 679626, 689010, 698270, 706997, 715290, 723831, 732966, 741911, 749482, 755538, 761123, 767158, 773575, 779983, 786755, 795076, 806184, 820779, 839038, 861041, 887178, 918093, 953899, 993469, 1034847, 1076521, 1117960, 1158652, 1196957, 1230331, 1256706, 1275435, 1287028, 1292283, 1291712, 1285450, 1273440, 1255717, 1232670, 1205087, 1173847, 1139556, 1102690, 1064248, 1026070, 990070, 957059, 926654, 898480, 873046, 851122, 832624, 816701, 802787, 791060, 781836, 775030, 770267, 767013, 764411, 761462, 757784, 753977, 750983, 749242, 748653, 749088, 750548, 752903, 755691, 758188, 759641, 759596, 758167, 755857, 753000, 749471, 745023, 739722, 733944]
62105G33944n893n904o252p383r247j1023j1851j1754j1377j0795r355o887m358
62092F21865k744j826p36O98J906K679L497M666N793O506P152Q351J0049J1529
62078F79385J2307J2742J3682J5622J8181K0335K1269K1125K0851K1214K2098
62067H78811K2964K3747K4896K6557K8265K9571L0498L1071L0812K9167K6235
62056A182594K2519J8142J2854O796P21m753r686j4399j8890k2934k6505k9801
62044A116658l2968l5977l8673m0776m1964m2075m1152l9346l6875l4107l1329
62033G01416k8456k5236k1825j8833j6716j5370j4424j3520j2331j0748r292q775
62021E05890r229r637r147q135p548p559p485o864n958n194m607l938l022j963
$$ y = [733944, 728051, 722147, 715895, 708512, 699265, 688242, 676391, 664637, 653260, 642465, 633110, 626223, 621865, 619121, 617295, 616559, 617257, 619163, 621842, 625339, 630005, 635798, 642304, 649456, 657807, 667856, 679385, 691692, 704434, 718116, 733738, 751919, 772254, 793523, 814648, 835499, 856713, 878811, 901775, 925522, 950418, 976975, 1005240, 1034811, 1065309, 1096380, 1127192, 1156359, 1182594, 1205113, 1223255, 1236109, 1242905, 1243626, 1238873, 1229187, 1214788, 1195898, 1172964, 1146459, 1116658, 1083690, 1047713, 1009040, 968264, 926300, 884225, 843073, 803727, 766852, 732745, 701416, 672960, 647724, 625899, 607066, 590350, 574980, 560556, 547036, 534705, 523957, 514665, 505890, 496661, 487024, 477877, 469742, 462194, 454635, 447150, 440286, 434328, 429134, 424527, 420589, 417567, 415604]
62007D15604j105p60p61n07L90J687K941M023M879N203M817M147L762L576L034
61992D50930J993R47M05M06N73L03q81k753m389n176n495n954o348o131n545n330
61976D07555n490n345m799m541m853n159n061m832m613m042l097k423k251j935
61962C49114j092l99m99r43j012r41j287j671j216M5J209J840K320K921L378L544
61946C55311L732M276N247O685Q538J0357J1588J2230J2761J3389J3839J3922
61934D71875J3767J3526J3287J3235J3342J3028J1764J0024Q819Q214P112M872
61922F02865K264L28r80k319l732m716n187n530n743n322m006k097Q5K482M937
61907E73329P049Q632R889J0936J1504J1374J0792J0057Q930O816L598rk992m886
$$ y = [415604, 414499, 413739, 412978, 412471, 412861, 414548, 417489, 421512, 426391, 431594, 436411, 440558, 444320, 447896, 450930, 452923, 453870, 454275, 454681, 455254, 455557, 454676, 451923, 447534, 442358, 436863, 430909, 424561, 418430, 412885, 407555, 402065, 396720, 391921, 387380, 382527, 377368, 372307, 367475, 362862, 358820, 355723, 353300, 351049, 349114, 348022, 347623, 347124, 346181, 345169, 344228, 342941, 341270, 340054, 340099, 341308, 343148, 345468, 348389, 351767, 355311, 359043, 363319, 368566, 375251, 383789, 394146, 405734, 417964, 430725, 444114, 457953, 471875, 485642, 499168, 512455, 525690, 539032, 552060, 563824, 573848, 582667, 590881, 597993, 602865, 605129, 605457, 604477, 602158, 598426, 593710, 588523, 582993, 577250, 571928, 567922, 565825, 565910, 568392, 573329, 580378, 589010, 598899, 609835, 621339, 632713, 643505, 653562, 662492, 669308, 672906, 672897, 669905, 665019]
61893F65019o066p286q831j0171j0574j0027r298q888q404p267n793n031n558
61880E61825o926q336r404j0117j0522j0728j0862j0741r945q469o952n864m896
61867D48063l523j921o75J46R84J959K772L407M311N693P296Q983J0942J3116
61853E01553J5095J6863J8924K1271K2962K3378K3301K3925K5109K5524K4384
61842G42289K2184J9707J7081J4022J0411O264J657l001o924r475j0626j0738
61830G92851j0088q729o637l826n21K800N620P717R120R804R706Q995P950O439
61816H31201L873o0m798r284j2801j5316j7116j8371j8994j8880j8130j7125j6290
61803F67909j5816j5635j5616j5669j5624j5215j4261j2845j1327j0093r275q661
$$ y = [665019, 658953, 651667, 642836, 632665, 622091, 612064, 602766, 593878, 585474, 578207, 572414, 567383, 561825, 554899, 546563, 537159, 527042, 516520, 505792, 494930, 484189, 474244, 465775, 458823, 452959, 448063, 444540, 442619, 441944, 442090, 443074, 445033, 447805, 451212, 455523, 461216, 468512, 477495, 488437, 501553, 516648, 533511, 552435, 573706, 596668, 620046, 643347, 667272, 692381, 717905, 742289, 764473, 784180, 801261, 815283, 825694, 831958, 833615, 830614, 823690, 814215, 803589, 792851, 782763, 774034, 767397, 763571, 763050, 765850, 771470, 779187, 788307, 798111, 807817, 816812, 824762, 831201, 835074, 835014, 830216, 820932, 808131, 792815, 775699, 757328, 738334, 719454, 701324, 684199, 667909, 652093, 636458, 620842, 605173, 589549, 574334, 560073, 547228, 535901, 525808, 516533, 507872]
61791E07872p988p328o924o629n862m385k832k064k178k565k728k588k061j054
61777D50686M6M84J6p78j254j332j176p89k89r1l08l21M30J544K162K196K416
61760D53642L290M403N182N588N788N647M998M147L623L430K909J477p02k828
61746E00594m163m574m452m239m119m105m207m384m393l975l178k351j762j392
61732D49300j179j165j272j117m41L99P74O49P04J374K179K390K079J922K071
61717D58667J950J348J037J678K684K792J672K22p06j170j615k166k790l611m590
61702D55402n220n090m476m029l945l898l654l364l306l634m321n044n178m391
61688C95852l215k614k890l324l090k188j328j100j482j994k189k005j777j785
$$ y = [507872, 499884, 492556, 485632, 479003, 473141, 468756, 465924, 463860, 461682, 459117, 456389, 453801, 451740, 450686, 450732, 451216, 451232, 450454, 449200, 447868, 446692, 445903, 445614, 445523, 445215, 444894, 445324, 446868, 449030, 451226, 453642, 456932, 461335, 466517, 472105, 477893, 483540, 488538, 492685, 496308, 499738, 502647, 504124, 503422, 500594, 496431, 491857, 487405, 483166, 479047, 474942, 470735, 466351, 461958, 457983, 454805, 452454, 450692, 449300, 448121, 446956, 445684, 444567, 444126, 444525, 445299, 445948, 446652, 448026, 450205, 452595, 454674, 456596, 458667, 460617, 461965, 463002, 464680, 467364, 470156, 471828, 472050, 471344, 470174, 468559, 466393, 463603, 459992, 455402, 450182, 445092, 440616, 436587, 432642, 428744, 425090, 421726, 418420, 414786, 410465, 405421, 400243, 395852, 392637, 390023, 387133, 383809, 380719, 378531, 377203, 376103, 374621, 372627, 370438, 368433, 366656, 364871]
61674C64871j905j840j574j349j174p98k13J60J05lK83P67R12P48R98K165L751
61657C65904M696M512L751L279L319L429L313L207L253K968J903N87J50Q52J712
61642D06835J811J372J128J156J051Q60J083J816K505K675K368J786R74j0r62
61627D26448j767k506l250l977m732n537o055n770m617l142j949j245r93j112
61613C79796j404j609j748k040k427k549k440k679l510m290m333l896l700l779
61599C39392l553k953k716l332m300m740m341l482k697k295k255k224j809j050
61585B97645m60m01o47p32n86n17p31j073j256j183r90q64q71q63o14n5O47J251
61567B87700J584J540J117N48K76N48J093J364J111O14L30M54Q01J031R12N59
$$ y = [364871, 362966, 361126, 359552, 358203, 357029, 356231, 356018, 356178, 356283, 356280, 356563, 357330, 358242, 358990, 359988, 362153, 365904, 370600, 375112, 378863, 382142, 385461, 388890, 392203, 395410, 398663, 401631, 403534, 404121, 404271, 405123, 406835, 408646, 410018, 411146, 412302, 413353, 414213, 415296, 417112, 419617, 422292, 424660, 426446, 427420, 427410, 426448, 424681, 422175, 418925, 414948, 410216, 404679, 398624, 392854, 388237, 385095, 383146, 381901, 380908, 379796, 378392, 376783, 375035, 372995, 370568, 368019, 365579, 362900, 359390, 355100, 350767, 346871, 343171, 339392, 335839, 332886, 330170, 326838, 322538, 317798, 313457, 309975, 307278, 304983, 302728, 300504, 298695, 297645, 297185, 296784, 296137, 295405, 294819, 294302, 293571, 292498, 291242, 290059, 289069, 288205, 287334, 286471, 285857, 285802, 286449, 287700, 289284, 290824, 291941, 292489, 292765, 293313, 294406, 295770, 296881, 297495, 297825, 298279, 299080, 300111, 301023, 301582]
61551C01582L95P67J487J963J859J489J286J149O63r8n15k78K46P21J397K393
61535C16506K960K288Q66J06M51P59qj253j655r92j94J41L61Q31J164P57l31j428
61517C21329j915j717j242r69r96r42m47L39R55J223J325J369J246R57P24O83
61501C21922P38Q19R88J194J238J089R34Q57P11N07N35R23J335J387J138Q84P12
61484C37911M77J71l1oK65Q23J698K700L382L342K519J287J96m72r02j396j858
61467C50106j860j269n07o0J8p0l06p98j371j609j363r62p63o77l47K90Q72J109
61449C40433J145J246J304J043O69Q06J631K502K788K680K718K799K335J302M69
61434C65870M94J219K042K529K551K197J753J469J240P99K64N3K42M67N80Q68
$$ y = [301582, 301977, 302744, 304231, 306194, 308053, 309542, 310828, 311977, 312640, 312542, 312027, 311749, 311995, 312716, 314113, 316506, 319466, 321754, 322620, 322726, 323177, 323936, 323928, 322675, 321020, 320028, 319834, 319975, 320336, 321167, 322331, 323088, 322757, 321329, 319414, 317697, 316455, 315486, 314490, 313548, 313101, 313440, 314395, 315618, 316943, 318312, 319558, 320515, 321239, 321922, 322660, 323479, 324467, 325661, 326899, 327988, 328922, 329779, 330490, 330997, 331532, 332455, 333790, 335177, 336315, 337199, 337911, 338388, 338559, 338528, 338522, 338787, 339610, 341308, 344008, 347390, 350732, 353251, 354538, 354734, 354262, 353360, 351964, 350106, 348246, 346977, 346470, 346410, 346428, 346358, 346052, 345254, 343883, 342274, 340911, 339949, 339186, 338509, 338162, 338452, 339324, 340433, 341578, 342824, 344128, 345171, 345840, 346646, 348277, 350779, 353567, 356247, 358965, 361764, 364099, 365401, 365870, 366364, 367583, 369625, 372154, 374705, 376902, 378655, 380124, 381364, 382163, 382427, 382480, 382722, 383189, 383769, 384637]
61418C84637J469K105K644L335M144M451L837K752J881J214L32p28j481j687j522
61403D07383j207q07l91NM15O65L35p21k040l050l595l649k991j735p56q35j605
61386C85421k029j788j439j312j080n12M6K21O4j71k24K65J429K577K615J383
61370C85466M6j81O68J627J900J352L06o26p89n5R78J599J631J313Q82O00Q72
61353C97589J804K903L613M077M818N726O016N346M460M293M792N083M633L768
61339D58921L113K952L250L814M196L878K927K145K034J975J000p45k093k430
61325D84937k365k564k789k514j842j175n13K17O33M57K22O78J709K622L297M151
61309D85161N130N734O066O907Q480R965J0565J0353R702Q634P124N446L748J793
$$ y = [384637, 386106, 388211, 390855, 394190, 398334, 402785, 406622, 409374, 411255, 412469, 412801, 412073, 410592, 408905, 407383, 406176, 405369, 404978, 404983, 405398, 406063, 406398, 405677, 403637, 400587, 396992, 393343, 390352, 388617, 387861, 387026, 385421, 383392, 381604, 380165, 378853, 377773, 377261, 377307, 377528, 377592, 377421, 377197, 377462, 378891, 381468, 384083, 385466, 385512, 385331, 385999, 387626, 389526, 390878, 391184, 390558, 389769, 389714, 390692, 392291, 393922, 395235, 396117, 396717, 397589, 399393, 402296, 405909, 409986, 414804, 420530, 426546, 431892, 436352, 440645, 445437, 450520, 455153, 458921, 462034, 464986, 468236, 472050, 476246, 480124, 483051, 485196, 487230, 489205, 490205, 489460, 487367, 484937, 482572, 480008, 477219, 474705, 472863, 471688, 471175, 471392, 472025, 472482, 472704, 473382, 475091, 477713, 481010, 485161, 490291, 496025, 502091, 508998, 517478, 527443, 538008, 548361, 558063, 566697, 573821, 579267, 583015, 584808]
61295E84808m30k327l448m128m930n811o408o734p032p236p151o963p003p129
61281E08078o939o440n949n323l985j892L1Q27N97K73M54Q83J060J007J117J463
61265D85262J703J751K056K964M084M754M919N095N554O017O165N945N340M343
61251E45952L238K439J884J138K23k15J80Q75J127P68J6r48j807k044j630j342
61235E49854j766k334k092j100l30k46l29p5L51P14J329K541L986M842M745M145
61219E64235L807M100M787N353N529N456N360N136M417L088J606P22Q70J737K519
61204F18722K677K471K544L104L756M222M826N975P488Q786R574J0036J0434J0794
61190G05409J0899J0338Q792O531M450L198K416J311j66j268j660k010l032m428
$$ y = [584808, 584378, 582051, 578603, 574475, 569545, 563734, 557326, 550592, 543560, 536324, 529173, 522210, 515207, 508078, 501139, 494699, 488750, 483427, 479442, 477550, 477581, 478408, 479005, 479278, 479732, 480615, 481675, 482682, 483799, 485262, 486965, 488716, 490772, 493736, 497820, 502574, 507493, 512588, 518142, 524159, 530324, 536269, 541609, 545952, 549190, 551629, 553513, 554651, 554874, 554659, 554839, 555714, 556841, 557609, 557625, 556677, 554870, 552826, 551196, 549854, 548088, 545754, 543662, 542562, 542232, 541986, 541657, 541582, 541933, 542647, 543976, 546517, 550503, 555345, 560090, 564235, 568042, 572142, 576929, 582282, 587811, 593267, 598627, 603763, 608180, 611268, 612874, 613596, 614466, 616203, 618722, 621399, 623870, 626414, 629518, 633274, 637496, 642322, 648297, 655785, 664571, 674145, 684181, 694615, 705409, 716308, 726646, 735438, 741969, 746419, 749617, 752033, 753344, 753178, 751910, 750250, 748240, 745208, 740780]
61176G40780n340n581n754o200o445o025n356n276n955o739p091p122p078o858
61162F53960o393o092o362o900p001o437n608m845m087l236k306j185K28J581
61148E95317K340K548K736K890K286O91r99j829j927j958j976j590q78k75L48
61133E97724J636L740N970P639Q756R729J0835J2145J3572J4822J5634J6222J7248
61120G35672J9148K1648K4061K5916K7262K8469K9799L1141L2259L3200L4252
61109A042827L5343L5836L5227L3802L2217L0629K8706K6361K3909K1398J8319
61098A364574J4274R630N216J502j658m603p449j0222j3149j6541k0256k3503
61086A297815k5495k6293k6722k7427k8202k8367k7561k6104k4754k4124k4067
$$ y = [740780, 735440, 729859, 724105, 717905, 711460, 705435, 700079, 694803, 688848, 682109, 675018, 667896, 660818, 653960, 647567, 641475, 635113, 628213, 621212, 614775, 609167, 604322, 600235, 596999, 594693, 593508, 593736, 595317, 597657, 600205, 602941, 605831, 608117, 608808, 607809, 605980, 604053, 602095, 600119, 598529, 597651, 597376, 597724, 599360, 603100, 609070, 616709, 625465, 635194, 646029, 658174, 671746, 686568, 702202, 718424, 735672, 754820, 776468, 800529, 826445, 853707, 882176, 911975, 943116, 975375, 1008575, 1042827, 1078170, 1114006, 1149233, 1183035, 1215252, 1245881, 1274587, 1300948, 1324857, 1346255, 1364574, 1378848, 1388478, 1393694, 1395196, 1393538, 1388935, 1381486, 1371264, 1358115, 1341574, 1321318, 1297815, 1272320, 1246027, 1219305, 1191878, 1163676, 1135309, 1107748, 1081644, 1056890, 1032766, 1008699]
61075A008699k3681k2206j9943j7872j6465j5390j4360j3602j3190j2659j1638
61064H27693j0330q964p458o006n243n217m929l699k248j526j066K61K258L558
61050G77084L715L831M891O616Q336R993J1711J3110J3777J3976J4437J5654J7611
61037I14742J9901K1976K3603K5099K6806K8446K9523L0268L1471L3397L5477
61026A220709L7207L8631L9833M0748M1766M3851M7719N3300O0156O7826P5757
61015A767503Q3629R2017J02119J14903J31282J53094J82911K22704K73923L38926
61005C463011M20577N19868O35973P69952R26373J108538J312105J522626J713594
60996A2392617J840850J843691J669394J315237Q52042L99010O4227j01556j08522
$$ y = [1008699, 985018, 962812, 942869, 924997, 908532, 893142, 878782, 865180, 851990, 839331, 827693, 817363, 808399, 800941, 794935, 789692, 784475, 779546, 775847, 773599, 772073, 771007, 771268, 773526, 777084, 780799, 784630, 789521, 796137, 804473, 814466, 826177, 839287, 853064, 867040, 881477, 897131, 914742, 934643, 956619, 980222, 1005321, 1032127, 1060573, 1090096, 1120364, 1151835, 1185232, 1220709, 1257916, 1296547, 1336380, 1377128, 1418894, 1462745, 1510464, 1563764, 1623920, 1691746, 1767503, 1851132, 1943149, 2045268, 2160171, 2291453, 2444547, 2627458, 2850162, 3124085, 3463011, 3883588, 4403456, 5039429, 5809381, 6735754, 7844292, 9156397, 10679023, 12392617, 14233467, 16077158, 17746552, 19061789, 19913831, 20312841, 20377068, 20275512, 20166990]
60987B0166990n641J34627K21416J64816q1966m87982r54423j366849j648561
60978A6142427j778814j777009j678453j519729j332986j142807r64536q05595
60970E142498o68413n52544m55809l75558l09776k56980k15419j82798j56908
60961A968293j36178j19503j05764r3747q2611p2303o3327n5973m9841m4106l8306
60950A106634l2758k8329k5667k4680k4595k4501k3761k2097j9683j7294j5902
60939H47367j5791j6241j6408j6204j5997j5827j5487j5078j4813j4434j3562
60928F77525j2538j2028j1886j1354j0431j0008j0271j0122q748o894n787n564
60916E61894n517n277m920m460l982l908m307m417l673k775k779l436l502k614
$$ y = [20166990, 20161349, 20295976, 20517392, 20682208, 20600242, 20112260, 19157837, 17790988, 16142427, 14363613, 12586604, 10908151, 9388422, 8055436, 6912629, 5948093, 5142498, 4474085, 3921541, 3465732, 3090174, 2780398, 2523418, 2307999, 2125201, 1968293, 1832115, 1712612, 1606848, 1513101, 1430490, 1358187, 1294860, 1238887, 1189046, 1144940, 1106634, 1073876, 1045547, 1019880, 995200, 970605, 946104, 922343, 900246, 880563, 863269, 847367, 831576, 815335, 798927, 782723, 766726, 750899, 735412, 720334, 705521, 691087, 677525, 664987, 652959, 641073, 629719, 619288, 609280, 599009, 588887, 580139, 573245, 567458, 561894, 556377, 551100, 546180, 541720, 537738, 533830, 529523, 525106, 521433, 518658, 515879, 512443, 508941, 506327]
60902E06327j815j965k577k596j757p56l89q10j470j741j730k207l445m530m396
60887D74143l291k494k709l438l960m184m362m530m571m397l904l088k251j717
60873D25247j372q99m15l30n02k10Q26J989K632K944L519M426N156N283M812L976
60857D57082L003K132J606J498J581J443R40M65N06Q69P03m25j842k553k400k004
60841D62604j856k060k707l832n018n745o132o756p642q105p732o948o343n963
60827C85765n513m832l927k933k144j767j569j275j222j966l158l664l078k294
60813C46423k090k029j407o26o18j331j757j394p67m76m47l61j98l4K71Q58J550
60796C35567J998K029J766J498J467J665J810J639J210P57L50j03n65p70n75j82
$$ y = [506327, 504512, 502547, 499970, 497374, 495617, 494861, 494472, 493662, 492192, 490451, 488721, 486514, 483069, 478539, 474143, 470852, 468358, 465649, 462211, 458251, 454067, 449705, 445175, 440604, 436207, 432303, 429215, 426964, 425247, 423875, 422976, 422561, 422231, 421729, 421519, 422345, 424334, 426966, 429910, 433429, 437855, 443011, 448294, 453106, 457082, 460085, 462217, 463823, 465321, 466902, 468345, 469285, 469750, 470256, 471125, 471828, 471403, 469561, 467008, 464608, 462604, 460748, 458688, 455981, 452149, 447131, 441386, 435254, 428498, 420856, 412751, 405019, 398071, 391728, 385765, 380252, 375420, 371493, 368560, 366416, 364649, 363080, 361805, 360583, 358617, 355459, 351795, 348717, 346423, 344333, 342304, 340897, 340271, 339653, 338322, 336565, 335171, 334404, 333928, 333481, 333120, 332922, 332888, 333159, 334017, 335567, 337565, 339594, 341360, 342858, 344325, 345990, 347800, 349439, 350649, 351406, 351756, 351653, 351088, 350318, 349743, 349561]
60780C49561O2ol09p41j289j926k410k345j539l23N75N48m39j798k687k626j890
60763C30418j190q23l70N37J404J310J65j016j192l52O85J175R47L72N0L76J166
60746C33662J908K418K887L285L156K311J205J99r92k571l776l589k213j001q03
60731C36086j053q54k44J66K85N78J112J334Q98K23m0K29P06J144J441J386Q23
60714C44220Q9k14l3mn63j299j564j295q41l07K63L35n78j868k214j384p84j610
60696C30349l128l599k541j174o79r13j071q88p43q64r70o37J91J115J617J509
60680C17574J122R37J126J507J901K350K890L356L528L398L109K663J836N23q93
60665C46927j699j557r57q24j583k800l650l569k499q74N00R61O73N63J195K014
$$ y = [349561, 349623, 349617, 349308, 348567, 347278, 345352, 342942, 340597, 339058, 338735, 339310, 339858, 339419, 337621, 334934, 332308, 330418, 329228, 328405, 328035, 328572, 329976, 331286, 331451, 330435, 329243, 328891, 329576, 330751, 331698, 332070, 332120, 332496, 333662, 335570, 337988, 340875, 344160, 347316, 349627, 350832, 351031, 350039, 347468, 343692, 340103, 337890, 336889, 336086, 335033, 334179, 333935, 334101, 334386, 334964, 336076, 337410, 338308, 338531, 338491, 338720, 339426, 340570, 342011, 343397, 344220, 344309, 344095, 344062, 344058, 343495, 342196, 340632, 339337, 338496, 338189, 338452, 338787, 338209, 336341, 334127, 332743, 331959, 330349, 327221, 323622, 321081, 319907, 319228, 318315, 317244, 316356, 315613, 314749, 313779, 313142, 313333, 314448, 316065, 317574, 318696, 319633, 320759, 322266, 324167, 326517, 329407, 332763, 336291, 339689, 342798, 345461, 347297, 347820, 346927, 345228, 343671, 342714, 341890, 340307, 337507, 333857, 330288, 327789, 326915, 327415, 328376, 329049, 329612, 330807, 332821]
60649C32821K141J710J765K796L995M269L499K360J259j9j670l367m507m732m131
60634C38189l104k096j293n81Q8L89pp68j041m89K06K19k39j73Q31K004K299J539
60616C35973M24k90l56m0J03l18j017j180m22N69P92K26j97J37Q43J334J630K010
60598C40221K279J989J210N38L84O64J159J762K255K313J932J502J253Q72J5j027
60582C59321j566j327o64PO13J173J529J633J815K451L450M441N351O472P895
60567C92594R216R952J0055R850R600R274Q582P215N151K790O47j094k550l720
60553D67562m399m570m466m102l169j671j83R26K071L754N624O891P601Q687J0695
60538D91251J3052J4819J5721J6206J6838J7826J8885J9279J8238J5565J1753
$$ y = [332821, 334962, 336672, 338437, 341233, 345228, 349497, 352996, 355356, 356615, 356596, 354926, 351559, 347052, 342320, 338189, 335085, 332989, 331696, 331115, 331203, 331592, 331585, 330817, 329776, 329287, 329493, 329712, 329473, 329300, 330131, 332135, 334434, 335973, 336397, 336107, 335751, 335711, 335814, 335496, 334479, 333299, 332877, 333446, 334238, 334464, 334267, 334404, 335247, 336581, 338211, 340221, 342500, 344489, 345699, 346237, 346621, 347285, 348444, 350206, 352461, 354774, 356706, 358208, 359461, 360333, 360348, 359321, 357755, 356428, 355764, 355771, 356384, 357557, 359086, 360719, 362534, 364985, 368435, 372876, 378227, 384699, 392594, 401810, 411762, 421817, 431667, 441267, 450541, 459123, 466338, 471489, 474279, 474926, 473832, 471282, 467562, 463163, 458593, 454127, 450025, 446856, 445185, 445002, 445928, 447999, 451753, 457377, 464268, 471869, 480556, 491251, 504303, 519122, 534843, 551049, 567887, 585713, 604598, 623877, 642115, 657680, 669433]
60527F69433P504L282p26m516q113j1224j3154j3496j2786j2008j1424j0502r077
60514E73193p772o941n985m245k064k37J172K688M372N772O975Q807J1768J5329
60500F02832J8789K2266K6345L0970L5318L8682M1049M2604M3165M2428M0496
60489I84944L7767L4450L0553K6256K1749J6624J0001J587p883j7523k7022l6029
60477A075474m3467m8373n1076n2528n2694n0715m6713m2192l8223l4312k9717
60466E85464k4960k1165j8550j6498j4683j3230j1985j0539q901p454o313n301
60454D25885m503m242m482m781m801m473l793k887k211k094k200j922j263q00
60440C81433q31j108j421j792k073j951j490j146j102j052q20o45o38m95m0M05
$$ y = [669433, 676937, 680219, 679493, 674977, 666864, 655640, 642486, 628990, 616204, 604196, 592772, 582270, 573193, 565421, 558480, 552495, 548250, 546186, 545949, 547121, 549809, 554181, 559953, 566928, 575735, 587503, 602832, 621621, 643887, 670232, 701202, 736520, 775202, 816251, 858855, 902020, 944448, 984944, 1022711, 1057161, 1087714, 1113970, 1135719, 1152343, 1162344, 1163931, 1156048, 1138525, 1111503, 1075474, 1032007, 983634, 932558, 880030, 827336, 776621, 729908, 687716, 649493, 615181, 585464, 560504, 539339, 520789, 504291, 489608, 476378, 464393, 453854, 444953, 437499, 431186, 425885, 421382, 417140, 412658, 407877, 403076, 398603, 394810, 391923, 389712, 387618, 385418, 383496, 382233, 381433, 380602, 379494, 378073, 376281, 374208, 372257, 370767, 369621, 368519, 367467, 366647, 366002, 365364, 364869, 364829, 365234]
60424C65234M93L68L88N99P50O70L90M7j49q9Q8J82L08P70J531K183K472K490
60406C78725K253J578O66K28P01J626K174K022J461R83J051J867K993L552L223
60391D05103K706K746L106L100K795K809L134L053K364J779J830K052J805J253
60377D39635J012J222J513J638J638J600J665K053K620K671J799O44K22O01J003
60362D61536J151J615K640L499L570L281L422M071M907O036P605R000R343Q682
60348E30358P815O970N573L420J101r39k938m963o400o828o709o573o093m808
60334E08986l278k665l284m323m924m946m621m097l481k974k726k690k652k305
60320D60020j497n41M0L43J198L070N248O736P559Q418R319R561R037Q592Q739
$$ y = [365234, 365727, 366095, 366483, 367082, 367832, 368502, 368892, 368939, 368790, 368701, 368789, 368971, 369279, 370049, 371580, 373763, 376235, 378725, 380978, 382556, 383222, 383450, 384151, 385777, 387951, 389973, 391434, 392417, 393468, 395335, 398328, 401880, 405103, 407809, 410555, 413661, 416761, 419556, 422365, 425499, 428552, 430916, 432695, 434525, 436577, 438382, 439635, 440647, 441869, 443382, 445020, 446658, 448258, 449923, 451976, 454596, 457267, 459066, 459710, 459932, 460533, 461536, 462687, 464302, 466942, 470441, 474011, 477292, 480714, 484785, 489692, 495728, 503333, 512333, 521676, 530358, 538173, 545143, 550716, 554136, 555237, 554298, 551360, 546397, 539997, 533169, 526460, 519887, 513794, 508986, 505708, 503043, 499759, 495436, 490512, 485566, 480945, 476848, 473367, 470393, 467667, 464977, 462325, 460020, 458523, 457982, 458022, 458365, 459563, 462633, 467881, 474617, 482176, 490594, 499913, 509474, 518511, 527103, 535842]
60305E35842Q909Q406P514P007P017O952O245M766K623L1k699n344p900j0321
60291E69048j2284j3395j3532j2812j1393r488p501n837m600l639k846k288k024
60278D67409j930j832j779k044k716l370l434k934k601k945l549l625l039k306
60264D29305j803j495j398j719k323k642k284j476o98k31j83m83p21l48P03J898
60248D14102K725L084K971K268J176L95L76P31P41K95m9J65P35J000M40p33j516
60231D28906r70P04K329L109L346L598L772L601L429L710M066L729K859K555L396
60216D72139M720N574N784N763N832O087O551P035P153O844O655P065P765Q000
60202E62967P527O780O177N690N212M814M435L662K270P81N6L25Q85Q87M7j346
$$ y = [535842, 544751, 553157, 560671, 567678, 574695, 581647, 587892, 592658, 595281, 595312, 592613, 587269, 579369, 569048, 556764, 543369, 529837, 517025, 505632, 496144, 488643, 482806, 478206, 474567, 471721, 469433, 467409, 465479, 463647, 461868, 459824, 457108, 453738, 450304, 447370, 444769, 441824, 438275, 434650, 431611, 429305, 427502, 426007, 424609, 422890, 420567, 417925, 415641, 414165, 413467, 413236, 413053, 412570, 411849, 411501, 412204, 414102, 416827, 419911, 422882, 425150, 426326, 426721, 427097, 427828, 428569, 428864, 428815, 428980, 429715, 430715, 431155, 430422, 428906, 427936, 428640, 430969, 434078, 437424, 441022, 444794, 448395, 451824, 455534, 459600, 463329, 466188, 468743, 472139, 476859, 482433, 488217, 493980, 499812, 505899, 512450, 519485, 526638, 533482, 540137, 547202, 554967, 562967, 570494, 577274, 583451, 589141, 594353, 599167, 603602, 607264, 609534, 610315, 610371, 610696, 611581, 612468, 612515, 611169]
60186F11169k771l673l792l583l992n301o480o312m985l938m063m752m963m511
60172E48053l842l139k253j305o99o28j009j756k662l151k676j459m07j55n17
60157E22395r53j213j368j487j501j228n33M12J031Q55J43k80N9Q25J388J512
60141E20057J364J212J338K021L195M338N000N320N721O233O492O382O203O114
60127E80990N834N110M145L260K432J508P59P43J558K589L112K944K443K019J796
60112F21242J615J291Q63O20O88P81M98j23p62j362k128k916l195k824k342k133
60096F09813j883j275p28o82o74qQ75P70m46j392j033q8j5j212k848m047m533
60079E90594m408l942l520l344l211k873k515k535k972l544m094m687n293n738
$$ y = [611169, 608398, 604725, 600933, 597350, 593358, 588057, 581577, 575265, 570280, 566342, 562279, 557527, 552564, 548053, 544211, 541072, 538819, 537514, 536815, 536187, 535178, 533422, 530760, 527609, 524933, 523474, 523067, 522912, 522395, 521442, 520229, 518861, 517374, 515873, 514645, 514112, 514524, 515555, 516410, 516553, 516273, 516332, 517157, 518545, 520057, 521421, 522633, 523971, 525992, 529187, 533525, 538525, 543845, 549566, 555799, 562291, 568673, 574876, 580990, 586824, 591934, 596079, 599339, 601771, 603279, 604038, 604781, 606339, 608928, 612040, 614984, 617427, 619446, 621242, 622857, 624148, 625011, 625631, 626319, 627100, 627598, 627475, 626713, 625351, 623223, 620307, 617112, 614288, 611946, 609813, 607930, 606655, 605927, 605245, 604571, 604563, 605438, 606208, 605762, 604370, 603337, 603249, 603234, 602022, 599174, 595127, 590594, 586186, 582244, 578724, 575380, 572169, 569296, 566781, 564246, 561274, 557730, 553636, 548949, 543656, 537918]
60065E37918n922n898n806n912o415o981o724n192l176j999k037k405k196j424
60051D75831o06Q8Q37J660K372K958L643M486N202N449N254N005N044N338N591
60036E28152N579N246M607L708K726J820R52Kr01j545k167l367n275p212q480
60021E23845r136r585r791r442q676p978p471o821n854m723l532k328j496j499
60007D35513k088k365j899j220r69j057j062r73j037j149r44l88K12O65J041J361
59991D23641J466J260Q93P42J227K420L763M441M280L882L643L085J674m1q92
59976D55484o04j24l45j140j925k473k803k749k233j654j450j423r69J07J334
59961D37033K122K223J770J231J154J556J638O49r13j595p10P71J381P87j43n55
$$ y = [537918, 531996, 526098, 520292, 514380, 507965, 500984, 494260, 489068, 485892, 483893, 481856, 479451, 477255, 475831, 475225, 475313, 476150, 477810, 480182, 483140, 486783, 491269, 496471, 501920, 507174, 512179, 517223, 522561, 528152, 533731, 538977, 543584, 547292, 550018, 551838, 552790, 552792, 551891, 550346, 548179, 544812, 539537, 532325, 523845, 514709, 505124, 495333, 485891, 477215, 469237, 461766, 454945, 449091, 444368, 440836, 438508, 437012, 435513, 433425, 431060, 429161, 427941, 426972, 425915, 424853, 423880, 422843, 421694, 420750, 420362, 420574, 421239, 422280, 423641, 425107, 426367, 427260, 428002, 429229, 431649, 435412, 439853, 444133, 448015, 451658, 454743, 456417, 456376, 455484, 454880, 454756, 454411, 453271, 451346, 448873, 446070, 443321, 441088, 439434, 437984, 436561, 435592, 435699, 437033, 439155, 441378, 443148, 444379, 445533, 447089, 448727, 449376, 448463, 446868, 446158, 446929, 448310, 449097, 448954, 448399]
59945D48399k91M24J330K026K015J160q7j055j398j188p05j15O21J634K846L932
59929D59548M639N038N250N084M259K861J274k83j776k928l224k578j598r59p50
59914D73857o50m86k49K47J282K739L980M349L813K986K512K432K190J369K62
59899E00633m83o77p47j036j308j154n96n1J44J6j01K79J456L134M484M931M746
59882E13670M618M693M495L774L044K966L461L802L544K996K646K413J795O37
59868E58554o39j596k206k596k669k335j783j241o54P0O70Q02N74M22N89J090
59852E47052K032L451N027O390P682R089J0041R639P906N775L753J619l49j025
59838F18082k0J374J788J567J859K498K126K33k054l440l782l670l521l441l495
$$ y = [448399, 448108, 448532, 449862, 451888, 453903, 455063, 454976, 453921, 452523, 451335, 450630, 450515, 451136, 452770, 455616, 459548, 464187, 469225, 474475, 479559, 483818, 486679, 487953, 487670, 485894, 482966, 479742, 477164, 475566, 474607, 473857, 473207, 472721, 472472, 472719, 474001, 476740, 480720, 485069, 488882, 491868, 494380, 496812, 499002, 500371, 500633, 500150, 499473, 498726, 497690, 496382, 495228, 494632, 494581, 494725, 494741, 494640, 494919, 496375, 499509, 503993, 508924, 513670, 518288, 522981, 527476, 531250, 534294, 537260, 540721, 544523, 548067, 551063, 553709, 556122, 557917, 558554, 557915, 556319, 554113, 551517, 548848, 546513, 544730, 543489, 542835, 542905, 543575, 544377, 544951, 545373, 545962, 547052, 549084, 552535, 557562, 563952, 571634, 580723, 590764, 600403, 608309, 614084, 617837, 619456, 619107, 618082, 618062, 619436, 621224, 622791, 624650, 627148, 629274, 629507, 627453, 624013, 620231, 616561, 613040, 609599, 606104]
59823F06104l713m085m699n593o446o762o486o004n572n014m138l069k088j359
59809E41076q91n96l37j40k43p41j304j513j349j059p70m84l07k68j36J86L68
59792E31492J56r7M8L30K11j76k62q9k62q15j061p73n73r06j388j627j837k151
59774E20220k066j251k88J06J84O34J304J396Q19N14J117K098K549K415K406K922
59758E35079L595L934M057M451N237O022O486O747O981P053O835O606O758P243
59744F17084P653P709P273O228M790L769L773M245M007K778J452P03J59o79j482
59729F69462j667j317r51p36n43n03q98j605k148k244j990j623j402j589k160
59714F48086k680k747k495k308k169j690p14M57J481K313L003L394L259K745K515
$$ y = [606104, 602391, 598306, 593607, 588014, 581568, 574806, 568320, 562316, 556744, 551730, 547592, 544523, 542435, 541076, 540185, 539589, 539252, 539112, 538869, 538128, 536824, 535311, 533962, 532903, 532133, 531649, 531342, 531074, 530938, 531124, 531492, 531648, 531551, 531599, 531929, 532140, 531964, 531702, 531613, 531351, 530536, 529475, 528702, 528129, 527223, 525835, 524208, 522371, 520220, 518154, 516903, 516615, 516721, 516905, 517539, 518843, 520239, 521058, 521572, 522689, 524787, 527336, 529751, 532157, 535079, 538674, 542608, 546665, 551116, 556353, 562375, 568861, 575608, 582589, 589642, 596477, 603083, 609841, 617084, 624737, 632446, 639719, 645947, 650737, 654506, 658279, 662524, 666531, 669309, 670761, 671464, 671623, 670944, 669462, 667795, 666478, 665527, 664791, 664248, 663745, 662847, 661242, 659094, 656850, 654860, 653237, 651835, 650246, 648086, 645406, 642659, 640164, 637856, 635687, 633997, 633283, 633740, 635221, 637534, 640537, 643931, 647190, 649935, 652450]
59699F52450L207M688O018O453O279O342O871P259O994O204N078L416J215q00
59685G21674j739j554r88o80p26j036j628k451l189l494l422l525m329n606o461
59670F80846o364n907o001o540o469n327l895l100k901k690k186j395k06J274
59656F29139K405K681K488K598L078L355L230L028K847K301J212rr92j954l322
59641F52085n040o556p422p695p794q014q245q132p476o417n266m388m102m443
59627E61095m952n049m710m455m582m814m846m743m588m261l881l963m663n301
59613D96287n152m334l431k622j792j116p91m32M86J692K325K059J415R12O10
59598D86116N25Q43J471J922J901J606J334J171J174J415J666J436N86m13j039
$$ y = [652450, 655657, 660345, 666363, 672816, 679095, 685437, 692308, 699567, 706561, 712765, 717843, 721259, 722474, 721674, 719935, 718381, 717393, 716713, 715987, 714951, 713323, 710872, 707683, 704189, 700767, 697242, 692913, 687307, 680846, 674482, 668575, 662574, 656034, 649565, 644238, 640343, 637243, 634342, 631652, 629466, 628071, 627865, 629139, 631544, 634225, 636713, 639311, 642389, 645744, 648974, 652002, 654849, 657150, 658362, 658353, 657361, 655407, 652085, 647045, 640489, 633067, 625372, 617578, 609564, 601319, 593187, 585711, 579294, 574028, 569640, 565538, 561095, 556143, 551094, 546384, 541929, 537347, 532533, 527687, 522944, 518356, 514095, 510214, 506251, 501588, 496287, 491135, 486801, 483370, 480748, 478956, 477840, 477049, 476617, 477103, 478795, 481120, 483179, 484594, 485506, 486116, 486641, 487484, 488955, 490877, 492778, 494384, 495718, 496889, 498063, 499478, 501144, 502580, 503166, 502753, 501714]
59583E01714j303j611k225k972l377l082k277j678j833k518l071l173l009k788
59569D66797k518k256k143k154k083j811j313n71K65P48N78O9k62m07o61q48m08
59552D51022P26J957K801L330L675L784L758L956M491N120N819O944Q632J0541
59538E16556J2444J4579J6978J8809J8716J5746R996K823l593p535q957r008q382
59525E89172o748l978j054Q55J583J652J295M63o03j511k220k920l626m354n296
59510E62710o323o764o320n819o250p281p622o791n601m839m323l579k698k043
59496D86457j641j345j211j293j295q12J66J148J574J280P33P68J817L303M168
59481D93817M027L510L362L614L912M197M613N021N027M479L564K495J391M63
$$ y = [501714, 500411, 498800, 496575, 493603, 490226, 487144, 484867, 483189, 481356, 478838, 475767, 472594, 469585, 466797, 464279, 462023, 459880, 457726, 455643, 453832, 452519, 451948, 452213, 452961, 453539, 453608, 453346, 452939, 452278, 451430, 451022, 451748, 453705, 456506, 459836, 463511, 467295, 471053, 475009, 479500, 484620, 490439, 497383, 506015, 516556, 529000, 543579, 560557, 579366, 598082, 613828, 623824, 626647, 623054, 615519, 606562, 597554, 589172, 582424, 578446, 577392, 578247, 579830, 581482, 582777, 583240, 582637, 581126, 578906, 575986, 572360, 568006, 562710, 556387, 549623, 543303, 537484, 531234, 523953, 516331, 509540, 503939, 499100, 494777, 491198, 488500, 486457, 484816, 483471, 482260, 480967, 479672, 478860, 479026, 480174, 481748, 483028, 483761, 484529, 486346, 489649, 493817, 497844, 501354, 504716, 508330, 512242, 516439, 521052, 526073, 531100, 535579, 539143, 541638, 543029, 543492]
59467E43492j5k3J36J78J09O7J14K19L87O75J112J706K465L385M379N228N691
59450E69305N703N524N535N794N829N072L476J536k86j940l495m740n343n349
59436E86621n160m935m292k890j174j76m40j355j760j127M2J021J750K770M402
59421E73297O354Q180R848J1638J3622J5521J7041J8234J9469K1143K3255K5023
59409G62625K4958K1717J5224O944j023p056j0337j0561p866l085K351P082J0344
59396H11317J1714J0619O561L3p169j2997j6564j8238j8497j7269j4647j1603
59384G23260r397q351p809p230o733o495o182n333m007k716j899j546j288p59
59370F53515q4J24m58j216j212m10L27N75R27J964L284M122M375M482M670M910
$$ y = [543492, 543477, 543454, 543590, 543768, 543877, 543944, 544058, 544277, 544664, 545339, 546451, 548157, 550622, 554007, 558386, 563614, 569305, 575008, 580532, 586067, 591861, 597690, 602762, 606238, 607774, 607488, 605548, 602053, 597313, 591970, 586621, 581461, 576526, 572234, 569344, 568170, 567994, 567554, 566199, 564439, 563312, 563354, 564375, 566125, 568895, 573297, 579651, 587831, 597679, 609317, 622939, 638460, 655501, 673735, 693204, 714347, 737602, 762625, 787583, 809300, 824524, 831468, 830445, 823389, 813052, 802491, 794625, 791540, 793891, 800973, 811317, 823031, 833650, 840211, 840244, 833075, 820078, 803514, 785276, 766779, 749510, 734863, 723260, 713863, 705512, 697703, 690473, 683740, 677245, 671063, 665730, 661723, 659007, 657108, 655562, 654274, 653515, 653431, 653555, 653097, 651881, 650669, 650259, 650586, 651161, 652088, 654052, 657336, 661458, 665833, 670315, 674985, 679895]
59354F79895N326O086P126Q382R986J1719J2796J2815J2527J2909J3781J4175
59342H07523J3811J3224J2632J1662J0267Q833P173M536R74k227m163n548p580
59329H71117j0250j2506j3711j4128j4168j3919j3461j3036j2820j2728j2548
59318G27842j2113j1417j0697j0230r984r632r011q287p543o505m967l189j589
59305F22678k40J092K623M418O440Q429R923J0465R690P206K870k609p788j1507
59291F63690j3555j4208j3596j1983j0185r035q434p461n496k887n25R97J755
59278E69077K241K819L491M210N309P172R435J1026J1368J1104J1245J1918J2427
59265F72842J2237J1394J0070Q366O529M902L546K329J364R32Q70N24n26j934
$$ y = [679895, 685221, 691307, 698433, 706815, 716801, 728520, 741316, 754131, 766658, 779567, 793348, 807523, 821334, 834558, 847190, 858852, 869119, 877952, 885125, 889661, 890635, 888408, 884245, 878697, 871117, 860867, 848361, 834650, 820522, 806354, 792435, 778974, 765938, 753118, 740390, 727842, 715729, 704312, 693615, 683385, 673401, 663769, 654758, 646471, 638928, 632423, 627456, 624267, 622678, 622438, 623530, 626153, 630571, 637011, 645440, 655363, 665828, 675518, 682724, 685594, 682985, 675197, 663690, 650135, 635927, 622331, 610348, 600163, 591128, 582694, 575233, 569737, 566850, 566325, 567322, 569077, 571318, 574137, 577628, 581838, 587147, 594319, 603754, 614780, 626148, 637252, 648497, 660415, 672842, 685079, 696473, 706543, 714909, 721438, 726340, 729886, 732215, 733579, 734511, 735381, 735905, 735379, 733445]
59251G33445l006l401l228k679j842q48L0N71Q41J105J430J491R97K41j58r8j90
59234G24701q56j668j972j882k125l050m268n311o138o912p608q086q323q424
59220F58078q482q486q260p623o668n748n021m235l209k337k103k267k048j186
59206E90405l35j90n78p25r1J214K627L492L510L060K909L398M020M100L655L298
59190F23769L351L481L266K796K503K580K797K785K322J399K70o15q90o47l50
59175F48817l78p47j356k176l070l694l850l748l619l322k704k060j756j530q66
59160F13941k2J62m11q14o27q18k366m617o010o101n849n987o146n804n183m772
59144E58576m539m196l815l719l977m341m578m543m137l428k737k370k329k368
$$ y = [733445, 730439, 727038, 723810, 721131, 719289, 718441, 718471, 719042, 719883, 720988, 722418, 723909, 724906, 725147, 724989, 724891, 724701, 723845, 722177, 720205, 718323, 716198, 713148, 708880, 703569, 697431, 690519, 682911, 674825, 666502, 658078, 649596, 641110, 632850, 625227, 618559, 612811, 607790, 603555, 600346, 598009, 595906, 593639, 591591, 590405, 590070, 589880, 589302, 588577, 588486, 589700, 592327, 595819, 599329, 602389, 605298, 608696, 612716, 616816, 620471, 623769, 627120, 630601, 633867, 636663, 639166, 641746, 644543, 647328, 649650, 651049, 651319, 650704, 649814, 649167, 648817, 648439, 647692, 646336, 644160, 641090, 637396, 633546, 629798, 626179, 622857, 620153, 618093, 616337, 614807, 613941, 613919, 614081, 613670, 612856, 612229, 611411, 609045, 604428, 598418, 592317, 586468, 580481, 574335, 568531, 563348, 558576, 554037, 549841, 546026, 542307, 538330, 533989, 529411, 524868, 520731, 517303, 514566, 512196, 509867, 507499]
59130E07499k233j738q72O1O39Q64J267K237L496M531N364O427P730Q657Q770
59115E52699Q434Q340Q661Q975Q932Q614Q183P543O594N662N280N491N627N044
59101F54079L927L061K777K440J243p10k426l115k902k382j806j149o58p66j386
59086F50227j843j730j452j562j920k018j914k234l255m529n548o331p117p809
59072F00965q051p615o573n233m067l464l330l173k750k404k561l134l657l870
59058E41083l850l689l412l091k784k369j725j081q88j214j460q81N70K038K475
59043E19722J614K32o04n31J3N24R67J459J867K024K142K569L202L521L348L197
59027E45266L667M714N792O641P589R005J0728J2224J3119J3360J2899J1666R876
$$ y = [507499, 505266, 503528, 502656, 502717, 503356, 504220, 505487, 507724, 511220, 515751, 521115, 527542, 535272, 543929, 552699, 561133, 569473, 578134, 587109, 596041, 604655, 612838, 620381, 626975, 632637, 637917, 643408, 649035, 654079, 658006, 661067, 663844, 666284, 667527, 666817, 664391, 661276, 658374, 655992, 654186, 653037, 652379, 651613, 650227, 648384, 646654, 645202, 643640, 641720, 639702, 637788, 635554, 632299, 627770, 622222, 615891, 608774, 600965, 592914, 585299, 578726, 573493, 569426, 565962, 562632, 559459, 556709, 554305, 551744, 548610, 544953, 541083, 537233, 533544, 530132, 527041, 524257, 521888, 520163, 519082, 518194, 516980, 515520, 514639, 515209, 517247, 519722, 521336, 521568, 520964, 520433, 520446, 520970, 521937, 523396, 525263, 527287, 529429, 531998, 535200, 538721, 542069, 545266, 548933, 553647, 559439, 566080, 573669, 582674, 593402, 605626, 618745, 632105, 645004, 656670, 666546]
59014F66546P997O273M471K337N7j963l480m350m441l979l653l858m045l351j706
58999F52855J94J846L135L759L296J992P13j19q53j682k168k068j871k043k332
58984F54654k376k390k658k827k434j687j072m63O66K327L973N340O746Q458J0181
58969F76438J1277J1364J0736J0263J0578J1292J1315J0177Q560P289O330N168
58957G90787L647J920%k076m046n874p940j0235j1888j2236j1912j2001j2467
58944G05679j2334j1230r809q698p886p221o690o125n311m447l871l374k510j526
58930F14647j150j399j416p27K00P88J032J030O43J1k38J62O19M45k86j006j375
58913F11980j343r11j94M87J000J618K668M098N582O823P679Q192Q624R172R667
$$ y = [666546, 674543, 680816, 685287, 687624, 687681, 685718, 682238, 677888, 673447, 669468, 665815, 661957, 657912, 654561, 652855, 653049, 654895, 658030, 661789, 665085, 667077, 667790, 667671, 666818, 665136, 662968, 660900, 659029, 656986, 654654, 652278, 649888, 647230, 644403, 641969, 640282, 639210, 638747, 639413, 641740, 645713, 651053, 657799, 666257, 676438, 687715, 699079, 709815, 720078, 730656, 741948, 753263, 763440, 772000, 779289, 785619, 790787, 794434, 796354, 796354, 794278, 790232, 784358, 776418, 766183, 754295, 742059, 730147, 718146, 705679, 693345, 682115, 672306, 663608, 655722, 648501, 641811, 635686, 630375, 625928, 622057, 618683, 616173, 614647, 613497, 612098, 610682, 609955, 610155, 610943, 611975, 613005, 613648, 613659, 613421, 613583, 614202, 614647, 614361, 613355, 611980, 610637, 609726, 609532, 610019, 611019, 612637, 615305, 619403, 624985, 631808, 639487, 647679, 656303, 665475, 675142]
58898F75142R875R951J0189J0360R955R113Q632Q920R552J0158J0954J2086J2993
58885H07880J3060J2424J1656J0988J0301R569Q791P683N977L849J717k21j902
58872I01772l079l549l619l892m527n044m998m622m574n173o036o539o496o252
58858H33372o224o608p571r204j1065j2146j1911j1021j0529j0464r998q833p637
58845G10161o969o544n987n630o031p113q322r275r840r817r119q199p780q003
58831F01532q165p506o098m719l827k978j569N1P96L37k34K76J663K767L049L022
58815E78397L269L819M451M898M710L632K218J419J500J868K037J991J615O06
58801F16430p88j786k169k575l333l837l626l324l790m816n451n258m603l923
$$ y = [675142, 685017, 694968, 705157, 715517, 725472, 734585, 743217, 752137, 761689, 771847, 782801, 794887, 807880, 820940, 833364, 845020, 856008, 866309, 875878, 884669, 892352, 898329, 902178, 903895, 903674, 901772, 898693, 895144, 891525, 887633, 883106, 878062, 873064, 868442, 863868, 858695, 852659, 846120, 839624, 833372, 827148, 820540, 812969, 803765, 792700, 780554, 768643, 757622, 747093, 736629, 726631, 717798, 710161, 703192, 696648, 690661, 685031, 679000, 671887, 663565, 654290, 644450, 634633, 625514, 617315, 609535, 601532, 593367, 585861, 579763, 575044, 571217, 568239, 566670, 566721, 567517, 567854, 567620, 567896, 569559, 572326, 575375, 578397, 581666, 585485, 589936, 594834, 599544, 603176, 605394, 606813, 608313, 610181, 612218, 614209, 615824, 616430, 615642, 613856, 611687, 609112, 605779, 601942, 598316, 594992, 591202, 586386, 580935, 575677, 571074, 567151]
58787E67151l285k588j722n74Q19K239L531M710N709O319O572O753O919O732N938
58772F15223M609K783L75k305m522n953p079q321r297r337q388o975n599m574
58758E50640m050l839l423k537j493o96j50L29P46J074J347J490J373J189J274
58743E43274J415J018K27J15J280K971M105M525M607M364L749L322L677M454M830
58728E87933M742M850N359N713N502M992M667M702N029N443N651N579N636O370
58714F62168P798R258R915R267P501N471M022L126J954L3k228m414o848r855j2747
58699F84421j4381j4627j4521j4977j5849j6354j5991j4956j3844j2982j2015
58688E23924j0375q189o271n130m481m001l908m329m750m664m300m014l478k195
$$ y = [567151, 563866, 561278, 559556, 558982, 559801, 562040, 565571, 570281, 575990, 582309, 588881, 595634, 602553, 609285, 615223, 619832, 622615, 622990, 620685, 616163, 610210, 603131, 594810, 585513, 576176, 567788, 560813, 555214, 550640, 546590, 542751, 539328, 536791, 535298, 534602, 534452, 534781, 535527, 536601, 537948, 539438, 540811, 542000, 543274, 544689, 545707, 545934, 546049, 547329, 550300, 554405, 558930, 563537, 567901, 571650, 574972, 578649, 583103, 587933, 592675, 597525, 602884, 608597, 614099, 619091, 623758, 628460, 633489, 638932, 644583, 650162, 655798, 662168, 669966, 679224, 689139, 698406, 705907, 711378, 715400, 718526, 720480, 720513, 718285, 713871, 707023, 697168, 684421, 670040, 655413, 640892, 625915, 610066, 593712, 577721, 562765, 548921, 535939, 523924, 513549, 505360, 499089, 493959, 489478, 485477, 481569, 477240, 472490, 467826, 463526, 459512, 456034, 453839]
58674D53839m83Q39J543K049K636L256L980M982O175P343Q469R417R636Q822P541
58659E30044O422N107K794l48l307n575p380q551q404p059n829n636n874n486
58645D80918m588m130m368m503l867k749j805j164n47J08N78R07J455K209K458
58630D60912J701M93j40m2L3l06n91m55l36o99j197j158m84M33J356K236K949
58613D64705L405L711L901L855L716L917M426M485L582K218J295J162J622K391
58599E08391K977K726J548K19n74j005j398j398n67O91J604K109K705L550M429
58584E26007N313O304P268Q075Q823R316Q885P413O020N847O632P302P544P843
58570F28592Q425R223J0531J2643J5020J6832J8196J9935K2209K4349K5957K7148
$$ y = [453839, 453356, 454195, 455738, 457787, 460423, 463679, 467659, 472641, 478816, 486159, 494628, 504045, 513681, 522503, 530044, 536466, 541573, 544367, 544019, 540712, 535137, 527757, 519206, 510802, 503743, 497914, 492278, 486404, 480918, 476330, 472200, 467832, 463329, 459462, 456713, 454908, 453744, 453197, 453305, 453883, 454790, 456245, 458454, 460912, 462613, 463106, 462966, 462924, 462957, 462651, 462060, 461605, 461269, 460570, 459373, 458215, 457731, 458164, 459520, 461756, 464705, 468110, 471821, 475722, 479577, 483293, 487210, 491636, 496121, 499703, 501921, 503216, 504378, 506000, 508391, 511368, 514094, 515642, 515861, 515287, 514282, 512884, 511486, 510919, 511610, 513214, 515323, 518028, 521578, 526007, 531320, 537624, 544892, 552967, 561790, 571106, 579991, 587404, 593424, 599271, 605903, 613205, 620749, 628592, 637017, 646240, 656771, 669414, 684434, 701266, 719462, 739397, 761606, 785955, 811912, 839060]
58558H39060K7741K7144K5145K2100J8295J3836R192N037J571j398l762n238o035
58545I72688o747p661q796j0282j2070j3521j4261j5042j6856j9381k1286k1931
58533H04854k1792k1337k0503j9296j7906j6195j3949j1609r923q851p715o351
58521F29427n231m524l910l313k933k634k176j927k372l058l042k317j705j417
58507E88868q70jM40J39k96l30q3K72P39J030P58K63K93Q21J086R75J277K376
58489E97757L629M422M963N736O836Q062R200J0142J1186J2947J5334J7136J7477
58476G24827J7101J7092J6877J4933J1160O933K970j200n594r197j1429j2677
58464G71796j3121j2340j0397p959n117j439K585N602P314Q890J1022J2922J3799
$$ y = [839060, 866801, 893945, 919090, 941190, 959485, 973321, 982513, 987550, 989121, 987723, 983961, 978723, 972688, 965941, 958280, 949484, 939202, 927132, 913611, 899350, 884308, 867452, 848071, 826785, 804854, 783062, 761725, 741222, 721926, 704020, 687825, 673876, 662267, 652344, 643493, 635778, 629427, 624196, 619672, 615762, 612449, 609516, 606882, 604706, 602779, 600407, 597349, 594307, 591990, 590285, 588868, 587998, 587997, 588437, 588576, 588280, 587950, 587867, 588139, 588878, 589908, 590666, 590929, 591222, 592043, 593129, 594104, 595381, 597757, 601386, 605808, 610771, 616507, 623343, 631405, 640605, 650747, 661933, 674880, 690214, 707350, 724827, 741928, 759020, 775897, 790830, 801990, 808923, 811893, 810693, 805099, 795902, 784473, 771796, 758675, 746335, 735938, 727979, 722862, 721423, 724008, 729610, 736924, 745814, 756836, 769758, 783557]
58451G83557J3927J3660J2559J0236P006L261r32n211q870j1637j3577j4237j3172
58438G76570j1274j0087r611q356n808l224j574l47J029K237L174M527O460Q098
58424G51814Q937R476R972R845Q875P554N921L483O40j447k815m678p042q285
58410G92250p851p308p801q427q127p277o283m591k314r14q77n41J272L216L685
58395G38112L434M111N568O409O208N507M643L935M000M619M398K761R94J70n56
58380G94313k103l509l426k276j220k69J008K018K245K672M416O787Q386R182
58366H18224R945J0592J0763J1089J2240J3496J3825J3560J3549J3451J2451J0883
58354I64068R581Q370O639M714L378K669K301K438K960L005K374K329L775N858
$$ y = [783557, 797484, 811144, 823703, 833939, 840945, 844206, 843274, 838063, 829193, 817556, 803979, 789742, 776570, 765296, 755209, 745598, 737242, 731434, 728210, 726636, 726289, 727318, 729555, 732729, 737256, 743716, 751814, 760751, 770227, 780199, 790044, 798919, 806473, 812394, 815877, 816517, 815070, 812255, 807577, 800535, 792250, 784399, 777091, 769290, 760863, 752736, 745459, 739176, 734585, 732271, 731357, 730480, 729939, 731211, 734427, 738112, 741546, 745657, 751225, 757634, 763842, 769349, 773992, 777927, 781927, 786546, 790944, 793705, 794699, 794869, 794313, 792210, 788701, 785275, 782999, 781779, 781510, 782518, 784536, 786781, 789453, 793869, 800656, 809042, 818224, 828169, 838761, 849524, 860613, 872853, 886349, 900174, 913734, 927283, 940734, 953185, 964068, 973649, 982019, 988658, 993372, 996750, 999419, 1001720, 1004158, 1007118, 1010123, 1012497, 1014826, 1018601, 1024459]
58340A024459P475Q822J0293J1290J1583J2266J3923J5347J5613J5739J6585J6891
58328A180286J5458J3519J2769J2559J1354R509Q284P392O006M941N260N838M979
58315A298154L523L768N966Q391J0229J1977J3556J4353J4728J5422J6018J5875
58303A431960J5819J6891J8329J8824J8832J9526K0443K0428J9915K0038K0459
58292A641464K0402K0730K2533K4677K5236K4578K4512K5297K5998K6808K8444
58281A910679L0063L0443L0468L1833L4113L5653L6624L8538M1411M3927M5787
58270B309539M7603M9175N0094N1072N2642N3782N3990N5111N8721O3384O6997
58259B912110O9994P3551P6701P8223P9329Q1340Q2862Q2595Q2613Q5254Q9133
$$ y = [1024459, 1031934, 1040756, 1051049, 1062339, 1073922, 1086188, 1100111, 1115458, 1131071, 1146810, 1163395, 1180286, 1195744, 1209263, 1222032, 1234591, 1245945, 1255454, 1263738, 1271130, 1277136, 1282077, 1287337, 1293175, 1298154, 1301677, 1305445, 1311411, 1319802, 1330031, 1342008, 1355564, 1369917, 1384645, 1400067, 1416085, 1431960, 1447779, 1464670, 1482999, 1501823, 1520655, 1540181, 1560624, 1581052, 1600967, 1621005, 1641464, 1661866, 1682596, 1705129, 1729806, 1755042, 1779620, 1804132, 1829429, 1855427, 1882235, 1910679, 1940742, 1971185, 2001653, 2033486, 2067599, 2103252, 2139876, 2178414, 2219825, 2263752, 2309539, 2357142, 2406317, 2456411, 2507483, 2560125, 2613907, 2667897, 2723008, 2781729, 2845113, 2912110, 2982104, 3055655, 3132356, 3210579, 3289908, 3371248, 3454110, 3536705, 3619318, 3704572, 3793705]
58248C793705R2054R5340J01047J07459J11962J16049J22597J30512J37096J43520
58238D951341J52618J63374J73063J82686J94762K07874K19342K31075K46611
58229F722746K64578K81528K98893L20228L43946L66253L89133M17578M50872
58220I855755M84816N20722N63628O13357O66207P23926P91857Q70015R55614
58211A6045897J052502J167949J302250J452710J625858J833926K081709K370415
58203B8933216K713229L134056L654171M296760N103781O132288P434850R057390
58195G0459741J1047102J3437719J6231535J9421292K3015834K6987422L1154610
58188B11755255L5097022L8120034L9229809L7231921L1168050K0994585P956531
$$ y = [3793705, 3885759, 3981099, 4082146, 4189605, 4301567, 4417616, 4540213, 4670725, 4807821, 4951341, 5103959, 5267333, 5440396, 5623082, 5817844, 6025718, 6245060, 6476135, 6722746, 6987324, 7268852, 7567745, 7887973, 8231919, 8598172, 8987305, 9404883, 9855755, 10340571, 10861293, 11424921, 12038278, 12704485, 13428411, 14220268, 15090283, 16045897, 17098399, 18266348, 19568598, 21021308, 22647166, 24481092, 26562801, 28933216, 31646445, 34780501, 38434672, 42731432, 47835213, 53967501, 61402351, 70459741, 81506843, 94944562, 111176097, 130597389, 153613223, 180600645, 211755255, 246852277, 284972311, 324202120, 361434041, 392602091, 413596676, 421553207]
58181D21553207n796852j8122698k7615869l3753061l6652965l6824856l4997631
58174B27789275l1940847k8296064k4516629k0903454j7638746j4794696j2365879
58167G7332960j0322310q630537p242245o098068n151233m372195l731693l197674
58159B8587005k749481k378391k072377j813898j593002j408774j256515j125315
58151A4189252j009232r09411q23943p46006o73162o08770n53056n01658m53775
58142G910239m13076l79667l49326l21399k99468k83371k68285k52570k39130
58133E103947k28125k15698k01177j88450j78804j68905j57348j46932j38894
58124C479614j30815j21848j14446j09242j03556r6562r0926q7621q3965p8445
$$ y = [421553207, 415756355, 397633657, 370017788, 336264727, 299611762, 262786906, 227789275, 195848428, 167552364, 143035735, 122132281, 104493535, 89698839, 77332960, 67010650, 58380113, 51137868, 45039800, 39888567, 35516372, 31784679, 28587005, 25837524, 23459133, 21386756, 19572858, 17979856, 16571082, 15314567, 14189252, 13180020, 12270609, 11446666, 10700660, 10027498, 9418728, 8865672, 8364014, 7910239, 7497163, 7117496, 6768170, 6446771, 6147303, 5863932, 5595647, 5343077, 5103947, 4875822, 4660124, 4458947, 4270497, 4091693, 3922788, 3765440, 3618508, 3479614, 3348799, 3226951, 3112505, 3003263, 2899707, 2803145, 2712219, 2624598, 2540633, 2462188]
58114B462188p3032o9107o5261o0703n6909n4466n1970m9249m8061m8461m8131
58103A836838m6308m4882m4605m3769m1677l9922l9159l7870l5442l3313l2100
58092A397791l0557k8326k6719k6041k4912k2951k1304k0084j8284j6600j7067
58081A144946j9261k0234j9014j7927j8475j9179j8733j8186j8502j8698j7877
58070I38860j6870j6477j6129j5391j4774j4275j3093j1419j0520j0454r912q686
58058G80860q060q317q243p648p929r480j0870j1264j1353j1343j0413q786p944
58045F59210q074p631o138n093n326n788n719n725o016n720m779m318m538m398
58031E79947l994m798o892q439q662q908r836j0148r154q096p756p157n881n311
$$ y = [2462188, 2389156, 2320049, 2254788, 2194085, 2137176, 2082710, 2030740, 1981491, 1933430, 1884969, 1836838, 1790530, 1745648, 1701043, 1657274, 1615597, 1575675, 1536516, 1498646, 1463204, 1429891, 1397791, 1367234, 1338908, 1312189, 1286148, 1261236, 1238285, 1216981, 1196897, 1178613, 1162013, 1144946, 1125685, 1105451, 1086437, 1068510, 1050035, 1030856, 1012123, 993937, 975435, 956737, 938860, 921990, 905513, 889384, 873993, 859219, 844944, 831851, 820432, 809912, 799458, 789546, 780860, 772800, 764483, 756240, 748592, 740663, 731183, 720313, 709049, 697696, 686353, 675940, 667154, 659210, 651136, 643505, 637367, 632274, 626948, 621160, 615441, 609716, 603700, 597980, 593201, 588883, 584345, 579947, 575953, 571155, 564263, 555824, 547162, 538254, 528418, 518270, 509116, 501020, 493264, 486107, 480226, 474915]
58017D74915o112o753o008m868m513m312l426k532k413k407j666n87J61O61Q73
58002D31013K75p51q40K32J105J156J313J762J223n08j658j456j686l686o056
57987D21438p073p278p804q053p122n791n119m499l136j901j773j819q04M71N04
57972C60241l12m98M2L66M57R48J491J307P78P89J058O50k99r56j331j972k626
57955C60133k556j945j597j643j631j482j339j022n72p00j665k476k215j353p49
57940C37188k28O43J404J615K089L698N667O509O121N565N239M641L568K287P71
57925C86777j114k958m310n364o280o469n491m087l239k860k390j953j800j475
57911C36987o58m7q0L09K058L926L797J600p78k193l170m269n197n778o328o803
$$ y = [474915, 468803, 462050, 456042, 451174, 446661, 442349, 438923, 436391, 433978, 431571, 429905, 429318, 429479, 430140, 431013, 431288, 430537, 429697, 429929, 431034, 432190, 433503, 435265, 436488, 435980, 434322, 432866, 431180, 427494, 421438, 414365, 407087, 399283, 391230, 384108, 378317, 373198, 368699, 365563, 363662, 361889, 360070, 359266, 359737, 360241, 359929, 359431, 359473, 359839, 360296, 361244, 362735, 364042, 364820, 365609, 366667, 367317, 367018, 366062, 364731, 362759, 360133, 357577, 355632, 354035, 352392, 350761, 349279, 347940, 346918, 346346, 345646, 343981, 341505, 339290, 337937, 337188, 336960, 337603, 339007, 340622, 342711, 346409, 352076, 358585, 364706, 370271, 375510, 380151, 383719, 386006, 386777, 385663, 382705, 378395, 373031, 366751, 360282, 354791, 350704, 347465, 344605, 342215, 340262, 338462, 336987, 336329, 336282, 336202, 336511, 338569, 342495, 346292, 347892, 347114, 344921, 341751, 337482, 332285, 326507, 320179, 313376]
57895C13376o679n905n035m328l568k675j731n47Q88J889J888J442J438J671J378
57880B93502P42O25R57Q34J40k42M2L15J91K55J003K050K756K997K944K752K670
57863C14533K948L471L876M024L998L849L811M422N726O688O228M639L200K543
57849C73956K237J853J536J410J168M83n91j787k847l691m548n653o569o368m930
57834C45659l455l028l261l094k324j461o25L43J112J251J194J673K436K585K100
57819C41105J932K509L203L448L426L386L058K061M37j478l268m539n200n572
57805C44508n852n708m863l812l340l580m041m332m284l676k556j535j162j214
57791B94553j205j176j354j444j094o91q67j483j886j916j813j450m65R95K449
$$ y = [313376, 306697, 300792, 295757, 291429, 287861, 285186, 283455, 282908, 283796, 285685, 287573, 289015, 290453, 292124, 293502, 294244, 294869, 295826, 296660, 296800, 296558, 296600, 296915, 297106, 297361, 298364, 300414, 303170, 306167, 309111, 311863, 314533, 317481, 320952, 324828, 328852, 332850, 336699, 340510, 344932, 350658, 357346, 363574, 368213, 371413, 373956, 376193, 378046, 379582, 380992, 382160, 382643, 382052, 380265, 377418, 373727, 369179, 363526, 356957, 350589, 345659, 342204, 339176, 335915, 332821, 330497, 329036, 328411, 328754, 329866, 331117, 332311, 333984, 336420, 339005, 341105, 343037, 345546, 348749, 352197, 355623, 359009, 362067, 364128, 364565, 363087, 359819, 355280, 350080, 344508, 338656, 332948, 328085, 324273, 320933, 317353, 313312, 308980, 304696, 301020, 298464, 296929, 295767, 294553, 293348, 292172, 290818, 289374, 288280, 287589, 286722, 285239, 283353, 281437, 279624, 278174, 277709, 278704, 281153]
57776B81153L759M913N510N217M483L902L240J966L71p98j507k233k891l070l078
57761C00937l595m398m523l696k606j781j238j081j435j753j271j57P49J263J908
57746B77323K723L153L147L316L821M169M190M256M470M548M498M480M116L013
57732C31223J871J797K550K781K098J520J659J882J681J484J566J408P65K25J31
57717C54641q5q44j663k034k111k097j837j553j891k747l055k427j872k206k734
57702C25485k457j575q44k60N46J284J467J434J858K472K304J074m01j250j391
57687C29746j311j429j734j866j581j094p22l10N17J655K755M062O207R025J1568
57672C55488J3645J6358K0630K5994L1386L6363M0755M3650M3403L8481K8162
$$ y = [281153, 284912, 289825, 295335, 300552, 305035, 308937, 312177, 314143, 314514, 313716, 312209, 309976, 307085, 304015, 300937, 297342, 292944, 288421, 284725, 282119, 280338, 279100, 278019, 276584, 274831, 273560, 273403, 274152, 275415, 277323, 280046, 283199, 286346, 289662, 293483, 297652, 301842, 306098, 310568, 315116, 319614, 324094, 328210, 331223, 333094, 334891, 337441, 340222, 342320, 343840, 345499, 347381, 349062, 350546, 352112, 353520, 354285, 354510, 354641, 354556, 353712, 352049, 350015, 347904, 345807, 343970, 342417, 340526, 337779, 334724, 332297, 330425, 328219, 325485, 323028, 321453, 320609, 320349, 320895, 322179, 323646, 325080, 326938, 329410, 331714, 332788, 332387, 331137, 329746, 328435, 327006, 325272, 323406, 321825, 320731, 320009, 319699, 320216, 321871, 324626, 328688, 334895, 343920, 355488, 369133, 385491, 406121, 432115, 463501, 499864, 540619, 584269, 627672, 666153, 694315]
57661F94315J3147m056k0052l2443m0606m4657m4702m1465l6630l1585k6534k1434
57649C63298j7070j4261j2577j0848q603o238m131k395j315j203j788k299k120
57636B78450j183J26J142J358R52N22J61n89j671k191j691r69r75j494j692j398
57620B68858j094r83r16r21j122j312j203q94n60q9M72N43k27j218j538j139n72
57603B56085mO89J172R17J78j85P2K10m93j929l484m682n386n664n571m965l710
57586B23250k175j207j209j610j609j128o17l07j58k36n45p74p18p43j222j799
57570B07193j782j169o13n49q71j383j949k277k089j526r62m89JM05N75O80R65
57553A94160J243J185R41R34J220J523J792K018J727M71j191k002j531o96m43
$$ y = [694315, 707462, 703406, 683354, 650911, 610305, 565648, 520946, 479481, 442851, 411266, 384732, 363298, 346228, 331967, 319390, 308542, 299939, 293701, 289570, 287175, 285860, 284657, 282869, 280570, 278450, 277267, 277393, 278535, 279893, 280845, 281367, 281528, 280939, 279268, 277077, 275386, 274417, 273442, 271948, 270256, 268858, 267764, 266781, 265865, 264944, 263822, 262510, 261307, 260413, 259853, 259764, 260236, 260779, 260552, 259334, 257796, 256657, 256085, 256081, 256770, 257942, 258859, 259037, 258852, 258924, 259134, 258641, 256712, 253228, 248546, 243160, 237496, 231925, 226960, 223250, 221075, 219868, 218659, 217049, 215440, 214312, 213695, 213388, 213230, 212994, 212449, 211675, 210957, 210214, 208992, 207193, 205411, 204242, 203629, 203080, 202209, 200826, 198877, 196600, 194511, 192985, 192023, 191534, 191535, 191940, 192515, 193195, 194160, 195403, 196588, 197529, 198463, 199683, 201206, 202998, 205016, 206743, 207214, 206023, 204021, 202490, 201794, 201351]
57538B01351n92l79L37R69J035O38J67j15j74j36j70l63n98o21k56L26P44R06
57520B03069J189J867K461K237J315O91R43J508J603J292J153J299J384J282J165
57505B24458J030O78J32l45n81o14o15q47j439j987j824r55k84m59r92j112r16
57488B13328j012j390j531j337j139q95l26K72K28l48n21N2M88r6j329k063j793
57471B00588j073o98q74j138r36j86O91J219J290J072P78O41Q16J110J051N35
57455B04886O8J3j9n31j230j383q87l50j44nL42P23Q49P33O29P67J148J491J448
57436B08548J133J094J534J914J755J409J490J884K020J868J868K029J880J394
57422B31820J099J176J199R34P55R79J374J565J505J312J102J118J575K208K469
$$ y = [201351, 200759, 200380, 200717, 201686, 202721, 203359, 203526, 203411, 203237, 203101, 202931, 202568, 201970, 201349, 201093, 201419, 202163, 203069, 204258, 206125, 208586, 210823, 212138, 212829, 213772, 215280, 216883, 218175, 219328, 220627, 222011, 223293, 224458, 225488, 226166, 226298, 225953, 225372, 224758, 224143, 223296, 221857, 219870, 218046, 217091, 216807, 216348, 215356, 214244, 213328, 212316, 210926, 209395, 208058, 206919, 206024, 205698, 205970, 206198, 205850, 205329, 205381, 205869, 205773, 204444, 202381, 200588, 199515, 198817, 197943, 196805, 195869, 195683, 196374, 197593, 198883, 199955, 200733, 201374, 202190, 203300, 204351, 204886, 204954, 204967, 204948, 204417, 203187, 201804, 200917, 200567, 200423, 200418, 200760, 201483, 202332, 203065, 203694, 204461, 205609, 207100, 208548, 209681, 210775, 212309, 214223, 215978, 217387, 218877, 220761, 222781, 224649, 226517, 228546, 230426, 231820, 232919, 234095, 235294, 236228, 236983, 237962, 239336, 240901, 242406, 243718, 244820, 245938, 247513, 249721, 252190]
57407B52190K279K102K134J965J344O73M10L93K02j57l05q5K48L92M12P63J813
57390B66773L249M130L867L028K703L169L714L784L689L948M423M504L802K475
57376C17258J114M18O51J238J213K73q79j389j181q60j018j715k444k485j573
57361C08621k38P67J419K370L879N247N660N273N095N824P094P944P815P053O344
57346C80167N928N581N315N477N990O039N092L732K922K730K568K341K503L076
57332D39461L588M006M778N667N616M247K701K235K674K946K721K600K924L219
57318D89383L043K771L136M251N397N826N555N199N151N248N315N567O150O683
57304E58675O753O625O865P429P743P642P574P809Q047P996P854Q034Q748R926
$$ y = [252190, 254469, 256571, 258705, 260670, 262014, 262687, 263097, 263490, 263692, 263535, 263230, 263145, 263393, 263785, 264197, 264960, 266773, 270022, 274152, 278019, 281047, 283750, 286919, 290633, 294417, 298106, 302054, 306477, 310981, 314783, 317258, 318372, 318790, 319441, 320679, 321892, 322165, 321286, 319897, 318716, 317856, 316838, 315123, 312679, 310194, 308621, 308383, 309150, 310569, 312939, 316818, 322065, 327725, 332998, 338093, 343917, 351011, 358955, 366770, 373823, 380167, 386095, 391676, 396991, 402468, 408458, 414497, 419589, 423321, 426243, 428973, 431541, 433882, 436385, 439461, 443049, 447055, 451833, 457500, 463116, 467363, 470064, 472299, 474973, 477919, 480640, 483240, 486164, 489383, 492426, 495197, 498333, 502584, 507981, 513807, 519362, 524561, 529712, 534960, 540275, 545842, 551992, 558675, 565428, 572053, 578918, 586347, 594090, 601732, 609306, 617115, 625162, 633158, 641012, 649046, 657794, 667720]
57290F67720J1135J1636J1082J0165J0021J0913J2052J2761J3124J3407J3598
57279G97614J3793J4397J5408J6096J5813J4855J4137J4219J4889J5458J5392
57268I62071J4922J4913J5824J6987J7487J7416J7502J7694J7297J6557J6789
57257A145459J8396K0012K0363J9970K0145K1069K1906K2234K2350K2526K2842
57246A377272K3500K4542K5472K5776K5655K5625K5710K5639K5553K5782K6230
57235A656756K6646K7267K8464K9822L0413L0016K9439K9471L0052L0634L0997
57224A979977L1438L2363L3812L5404L6800L8097L9518M0780M1340M1316M1502
57213B392347M2132M2387M1602M0302L9364L8784L8037L7150L6546L6104L5419
$$ y = [667720, 678855, 690491, 701573, 711738, 721759, 732672, 744724, 757485, 770609, 784016, 797614, 811407, 825804, 841212, 857308, 873121, 887976, 902113, 916332, 931221, 946679, 962071, 976993, 991906, 1007730, 1024717, 1042204, 1059620, 1077122, 1094816, 1112113, 1128670, 1145459, 1163855, 1183867, 1204230, 1224200, 1244345, 1265414, 1287320, 1309554, 1331904, 1354430, 1377272, 1400772, 1425314, 1450786, 1476562, 1502217, 1527842, 1553552, 1579191, 1604744, 1630526, 1656756, 1683402, 1710669, 1739133, 1768955, 1799368, 1829384, 1858823, 1888294, 1918346, 1948980, 1979977, 2011415, 2043778, 2077590, 2112994, 2149794, 2187891, 2227409, 2268189, 2309529, 2350845, 2392347, 2434479, 2476866, 2518468, 2558770, 2598134, 2636918, 2674955, 2712105, 2748651, 2784755, 2820174]
57202B820174L4776L4958L6059L7325L8244L9147M0527M2402M4415M6099M6975
57191C261101M6984M6761M7036M7708M8048M7734M7124M6448M5427M3866M2063
57180C770300M0400L8996L7895L7219L6874L6559L6234L6263L6810L7492L7804
57169D182846L7746L7741L8031L8296L7946L6744L5109L3615L2186L0187K7416
57158D567863K4596K2505K1021J9405J7275J4771J2115R553P501O039M394J620
57146D728658k121n555p703q691r083q890p560m679o08L332N427M837K357m05
57132D689316k638m726p202r871j2129j3675j4609j5151j5473j5579j5345j4770
57120D548148j4152j3694j3073j1724r421o167j644M601J2405K0958K9653L8639
$$ y = [2820174, 2854950, 2889908, 2925967, 2963292, 3001536, 3040683, 3081210, 3123612, 3168027, 3214126, 3261101, 3308085, 3354846, 3401882, 3449590, 3497638, 3545372, 3592496, 3638944, 3684371, 3728237, 3770300, 3810700, 3849696, 3887591, 3924810, 3961684, 3998243, 4034477, 4070740, 4107550, 4145042, 4182846, 4220592, 4258333, 4296364, 4334660, 4372606, 4409350, 4444459, 4478074, 4510260, 4540447, 4567863, 4592459, 4614964, 4635985, 4655390, 4672665, 4687436, 4699551, 4709104, 4716605, 4722644, 4727038, 4728658, 4726537, 4720982, 4713279, 4704588, 4695505, 4686615, 4679055, 4674376, 4673768, 4677100, 4682527, 4687364, 4689721, 4689316, 4686678, 4681952, 4674750, 4664879, 4652750, 4639075, 4624466, 4609315, 4593842, 4578263, 4562918, 4548148, 4533996, 4520302, 4507229, 4495505, 4486084, 4479917, 4478273, 4482874, 4495279, 4516237, 4545890, 4584529]
57108D584529M8507N9891P3452Q9799J09389J33058J62703K00914K49843L11007
57098F023092L86265M78097N88303P16726Q61277J018141J180995J340707J487462
57089A4081065J614156J717833J797958J853412J880521J872502J820085J713500
57081B8351032J545440J313321J019660O72024K84828j18675n09318q61570j163118
57072C0533624j415442j624914j793580j917664j992183k014984j987631j915198
57064A5872028j806124j670850j519524j360913j202890j052440r14391p90877
57056E554019o82314n88377n07852m38616l78582l26385k81057k41610k07401
57047A901825j78220j53619j32598j14345r8743q5750p4795o5278n7151n0382
$$ y = [4584529, 4633036, 4692927, 4766379, 4856178, 4965567, 5098625, 5261328, 5462242, 5712085, 6023092, 6409357, 6887454, 7475757, 8192483, 9053760, 10071901, 11252896, 12593603, 14081065, 15695221, 17413054, 19211012, 21064424, 22944945, 24817447, 26637532, 28351032, 29896472, 31209793, 32229453, 32901477, 33186305, 33067630, 32558312, 31696742, 30533624, 29118182, 27493268, 25699688, 23782024, 21789841, 19774857, 17787226, 15872028, 14065904, 12395054, 10875530, 9514617, 8311727, 7259287, 6344896, 5554019, 4871705, 4283328, 3775476, 3336860, 2958278, 2631893, 2350836, 2109226, 1901825, 1723605, 1569986, 1437388, 1323043, 1224300, 1138550, 1063755, 998477, 941326, 890944]
57037H90944m4282l8028l1517k5172j9112j2959o272J253R638J8039K4594K7507
57025G94633K6195K0909J1533k203j9046l5584m8011n4517n5823n3757m9759m4633
57013D89937l9070l3815k9311k5477k2022j8822j5859j2991j0121p499n556m409
57001B64985l801l500l429l446l386l379l673m026l817k966k231k120j975p96
56987B22440J297L098L879M220M990N951N840L755L1m336q676j2642j5541j6428
56973A97878j5199j3026j1241r984q499o497m536l119k006o07J508M524Q302J2117
56959A49615J5050J6872J8044J8700J8096J5424J0648M270l057j0159j5240j7107
56947B21156j6388j4858j3526j2027r746o911m218j932K40K577N054P648J0651
$$ y = [890944, 846662, 808634, 777117, 751945, 732833, 719874, 713602, 714855, 724493, 742532, 767126, 794633, 820828, 841737, 853270, 851067, 832021, 796437, 748426, 693909, 638086, 584329, 534570, 489937, 450867, 417052, 387741, 362264, 340242, 321420, 305561, 292570, 282449, 274950, 269394, 264985, 261184, 257684, 254255, 250809, 247423, 244044, 240371, 236345, 232528, 229562, 227331, 225211, 223236, 222440, 223737, 226835, 230714, 234934, 239924, 245875, 251715, 255470, 255501, 251165, 242489, 229847, 214306, 197878, 182679, 169653, 158412, 148428, 139929, 133432, 128896, 125777, 123771, 123164, 124672, 129196, 137498, 149615, 164665, 181537, 199581, 218281, 236377, 251801, 262449, 266719, 263662, 253503, 238263, 221156, 204768, 189910, 176384, 164357, 154611, 147700, 143482, 141550, 141790, 144367, 149421, 157069, 167720]
56934A67720J4477J9009K3262K5923K6269K4409K0633J4876P110j893j0474j6924
56922C14397k0543k1950k2380k2532k2135k0685j8388j5978j3825j1729r659q028
56910A06565p021o176n027l769k912k507k155j546o16N91J886K846L169L018K836
56895H9182K933L456M531O109P836R408J0976J2869J5023J6926J8024J7902J6112
56882B31287J2312O793O94m503p856r406r818r523q391o268l659j436J84J944
56868A92354M664Q293J2062J5344J8245K1485K5726L0727L5106L7249L6452L2848
56856D70555K6388J6799M839p178j6834k3302k7099k8647k7843k4875k0585j5839
56844C26379j0912n634J33O330J2817J9567K6770L4513M2348M9375N4863N8311
$$ y = [167720, 182197, 201206, 224468, 250391, 276660, 301069, 321702, 336578, 343688, 341795, 331321, 314397, 293854, 271904, 249524, 226992, 204857, 184172, 165784, 149806, 135981, 124252, 114593, 106565, 99544, 93368, 88341, 84572, 81660, 79153, 76998, 75452, 74836, 75427, 77313, 80159, 83328, 86346, 89182, 92115, 95571, 100102, 106211, 114047, 123455, 134431, 147300, 162323, 179249, 197273, 215175, 231287, 243599, 250392, 251086, 246583, 238727, 229321, 219503, 209980, 201589, 195321, 191662, 190226, 190410, 192354, 197018, 205311, 217373, 232717, 250962, 272447, 298173, 328900, 364006, 401255, 437707, 470555, 496943, 513742, 518581, 511403, 494569, 471267, 444168, 415521, 387678, 362803, 342218, 326379, 315467, 309833, 309966, 316296, 329113, 348680, 375450, 409963, 452311, 501686, 556549, 614860]
56832F14860N8675N4071M3013K5961N400j5441l3722m7379n5396n8034n6445n1902
56820D83661m5410l7799k9722k1572j3579n954J312Q544J5949K3206K9893L6096
56808D44625M1950M6641M8374M5562L7732K5329R310q593k5639l8951m6949m9907
56796E29484m9093m5576m0051l3470k7185k2068j7800j3498q861m216L51N203
56784B73220J0342J5168J9230K2482K4441K3853J9889J3162M946m033j3265k1420
56772C88015k6786k8806k8417k6852k4689k2103j9329j6635j4267j2514j1434
56761A56183j0563r305p660o118m934l958l196k883k910k689j862p72m6Kn28j294
56745I7467j822j765j214o34m18o55j111j325q64R1O78K89n13n82L86J486J779
$$ y = [614860, 673535, 727606, 770619, 796580, 801980, 786539, 752817, 705438, 650042, 592008, 535563, 483661, 438251, 400452, 370730, 349158, 335579, 329625, 330937, 339481, 355430, 378636, 408529, 444625, 486575, 533216, 581590, 627152, 664884, 690213, 699523, 690930, 665291, 626340, 579391, 529484, 480391, 434815, 394764, 361294, 334109, 312041, 294241, 280743, 271882, 267666, 268017, 273220, 283562, 298730, 317960, 340442, 364883, 388736, 408625, 421787, 426733, 422700, 409435, 388015, 361229, 332423, 304006, 277154, 252465, 230362, 211033, 194398, 180131, 167617, 156183, 145620, 136315, 128655, 122537, 117603, 113645, 110449, 107566, 104656, 101967, 100105, 99333, 99287, 99289, 98761, 97467, 95645, 93880, 92666, 92032, 91614, 90959, 89848, 88523, 87659, 87750, 88428, 88717, 88204, 87622, 88008, 89494, 91273]
56728I1273J293O62K92J43N7M7L33J091K107K830K941K753K640K388J531K28p62
56711A11847r36m16M13J136J233M69o07j101r10p60j006r88j8J544K622K586J721
56694A16829P61K49K33L79M29N24Q87J312J351J024Q73J221J803K243K448K377
56678A34943J828P78l53j027j001l56N91J264J168M15l44o45o32n92n23m06n09
56661A34599j099j943k413k047r38K65Q25N61O2K6M23O69N32L65M46N69M84K67
56643A31653N2j97l75j69M73J080J222J000P09L47j91o73o68r5O57J095J030O65
56625A37615L93L39J71m48j283j676j342o55j97l22j119k314l091k624j083M18
56609A22782J055J074J011Q21K40m24o35m78n50r99j283r86l92MK05O08J331J933
$$ y = [91273, 92566, 93228, 93520, 93663, 93720, 93767, 94100, 95191, 97298, 100128, 103069, 105822, 108462, 110850, 112381, 112609, 111847, 110911, 110495, 110908, 112044, 113277, 113746, 113139, 112038, 111128, 110368, 109362, 108374, 108356, 109900, 112522, 115108, 116829, 117590, 117839, 118072, 118451, 118880, 119404, 120291, 121603, 122954, 123978, 124851, 126072, 127875, 130118, 132566, 134943, 136771, 137549, 137196, 136169, 135168, 134812, 135403, 136667, 137835, 138250, 137906, 137261, 136629, 136037, 135514, 135108, 134599, 133500, 131557, 129144, 127097, 126159, 126424, 127249, 127810, 127872, 127898, 128321, 128990, 129522, 129887, 130333, 130902, 131386, 131653, 131705, 131508, 131133, 130964, 131437, 132517, 133739, 134739, 135448, 135795, 135604, 134931, 134263, 134168, 134825, 135920, 136950, 137615, 138008, 138347, 138518, 138070, 136787, 135111, 133769, 133114, 132917, 132595, 131476, 129162, 126071, 123447, 122364, 122782, 123837, 124911, 125922, 126743, 126983, 126559, 125924, 125446, 124896, 123897, 122614, 121628, 121236, 121240, 121445, 122053, 123384, 125317]
56591A25317J875J182M84L60P57J194J393J435J390J111N40l6k63j05J35J84Q6
56574A37039J35N23J081J507J818K371L259M027M286M368M926O061P291Q268R142
56559A96102J0138J1201J2002J2069J1013Q895O218L328J94k804m472l980k251
56546B57653j152j383k050k250k118k100k234k535l205l967m022l178k353k419
56532B22687l108l650l833l928l982l873l676l444k895j831n95K36M71K87p6m29
56516A88361o86j006j565k098k152j848j828k208k311j744j008o69n65l69k57
56501A68047m51o42m88k43k51k82K8N09P82Q48Q16N01j43o07m94j81j71k53RL75
56481A67709L58J79M49J073J330R22K26m20r41j085n34M08R65Q92P63J120J710
$$ y = [125317, 127192, 128374, 128858, 129218, 129975, 131169, 132562, 133997, 135387, 136498, 137038, 137002, 136739, 136634, 136769, 136953, 137039, 137174, 137697, 138778, 140285, 142103, 144474, 147733, 151760, 156046, 160414, 165340, 171401, 178692, 186960, 196102, 206240, 217441, 229443, 241512, 252525, 261420, 267638, 270966, 271160, 268356, 263884, 259904, 257653, 256501, 255118, 253068, 250818, 248700, 246600, 244366, 241831, 238626, 234659, 230637, 227459, 225106, 222687, 219579, 215929, 212096, 208168, 204186, 200313, 196637, 193193, 190298, 188467, 187872, 188108, 188579, 188866, 188790, 188361, 187675, 186669, 185104, 183006, 180854, 179006, 177178, 174970, 172659, 170915, 169907, 169238, 168673, 168304, 168047, 167596, 166954, 166466, 166223, 165972, 165690, 165718, 166227, 167009, 167857, 168673, 169174, 169031, 168424, 167930, 167749, 167578, 167325, 167334, 167709, 168067, 168246, 168695, 169768, 171098, 172020, 172246, 171826, 170885, 169800, 169266, 169674, 170639, 171531, 172294, 173414, 175124]
56464A75124J852J225J91n03l20N65J400J614J335J041R14P72M46n5n34o91l38
56447A84038L17R46J607K493L175K754J119o91j721j993j818j110L6P82N21k14
56431A90241n17l79l20k78J73Q33R80M64j13k32P6M80O40M29K32N87J267J331
56413A95894N44r5R4L20k90j057p91K32P53N79O26J150J361Q23%o92j118q29M71
56394A97975J828J855P89L43J184J980J501L00l86l30J4M70R72J075N51q4k13
56377B09824J40O17J072J369J273R71J086J661J818J046J87L59J321J752J003
56362B25499j80o90k22O69J327J524J443J320J268J374J702K058K034J598J282
56347B42006J358J207J25j435k225j744p38n6K46N54J079J793K528L024L207L475
$$ y = [175124, 176976, 178201, 178392, 177889, 177569, 178134, 179534, 181148, 182483, 183524, 184438, 185210, 185656, 185601, 185067, 184376, 184038, 184355, 185301, 186908, 189401, 192576, 195330, 196449, 195758, 194037, 192044, 190226, 189116, 189152, 189934, 190455, 190241, 189724, 189345, 189025, 188747, 188920, 189753, 190733, 191197, 191084, 190852, 190928, 191408, 192048, 192477, 192709, 193296, 194563, 195894, 196438, 196343, 196437, 196757, 196467, 195410, 194619, 194851, 195604, 196183, 196809, 197959, 199320, 200143, 200143, 199451, 198333, 197504, 197975, 199803, 201658, 202447, 202790, 203974, 205954, 207455, 207755, 207369, 207039, 207053, 207523, 208495, 209570, 210121, 210037, 209824, 209964, 210581, 211653, 213022, 214295, 215266, 216352, 218013, 219831, 220877, 221064, 221423, 222744, 224496, 225499, 225319, 224629, 224407, 225076, 226403, 227927, 229370, 230690, 231958, 233332, 235034, 237092, 239126, 240724, 242006, 243364, 244571, 244696, 243261, 241036, 239292, 238554, 238498, 238744, 239298, 240377, 242170, 244698, 247722, 250929, 254404]
56331B54404M158M869M911M314L798L676L505K907K136J601J396J397J354R22
56317B95348O8n79m13K02L99J08O3N43R63R40Q93J287J979K629L179L614L828
56300C15051L927M175M492M495M150L815L662L563L533L670L727L496L450M137
56286C69343N076N205M467L967M339N018N383N666O308P218Q050Q620Q850Q882
56272D56392R272J0323J1395J1758J1976J3258J5459J7107J7604J7979J9082K0511
56260F32116K1921K3995K7224L0976L4690L8968M4502N0807N7017O3208P0022
56249A095446P7591Q5642R4039J02538J10456J17264J22993J27565J30326J30706
56239B194566J28660J23977J15929J04199Q9439P2438N3435L2779J1427r759l0394
$$ y = [254404, 258562, 263431, 268342, 272656, 276454, 280130, 283635, 286542, 288678, 290279, 291675, 293072, 294426, 295348, 295416, 294837, 294424, 294626, 295025, 295133, 295196, 295739, 296702, 297642, 298535, 299822, 301801, 304430, 307609, 311223, 315051, 318978, 323153, 327645, 332140, 336290, 340105, 343767, 347330, 350863, 354533, 358260, 361756, 365206, 369343, 374419, 379624, 384091, 388058, 392397, 397415, 402798, 408464, 414772, 421990, 430040, 438660, 447510, 456392, 465664, 475987, 487382, 499140, 511116, 524374, 539833, 556940, 574544, 592523, 611605, 632116, 654037, 678032, 705256, 736232, 770922, 809890, 854392, 905199, 962216, 1025424, 1095446, 1173037, 1258679, 1352718, 1455256, 1565712, 1682976, 1805969, 1933534, 2063860, 2194566, 2323226, 2447203, 2563132, 2667331, 2756770, 2829208, 2882643, 2915422, 2926849, 2917090, 2886696]
56228B886696m9802o6714q0458r1535j00446j06748j10032j10933j10375j08591
56218A951062j05524j01509r6799r1260q5193p9568p4706o9662o3796n8038n3622
56207A071385n0305m6945m3108l9183l5505l2287k9892k8246k6549k4314k2088
56196F92963k0334j8430j5741j2956j1209j0453r731q616p366o074m687l572l124
56183E60670l063k826k319j728j028k59K23L26M62P26N93kj76O00J636K198K674
56166E58707L663M863N717O362O985P209P039P478R067J0783J1534J1826J2733
56153F63966J4161J5405J6623J8309K0065K1341K2753K5296K8761L2297L6015
56142I14992M0718M6564N3188O0536O8219P4566P7729P7311P3936O8000O0193
$$ y = [2886696, 2836894, 2770180, 2689722, 2598187, 2497741, 2390993, 2280961, 2170028, 2059653, 1951062, 1845538, 1744029, 1647230, 1555970, 1470777, 1391209, 1316503, 1246841, 1183045, 1125007, 1071385, 1021080, 974135, 931027, 891844, 856339, 824052, 794160, 765914, 739365, 715051, 692963, 672629, 654199, 638458, 625502, 614293, 603840, 594109, 585493, 578127, 572053, 567366, 563794, 560670, 557607, 554781, 552462, 550734, 549706, 549447, 549670, 549996, 550458, 551184, 551777, 551775, 551599, 552199, 553835, 556033, 558707, 562370, 567233, 572950, 579312, 586297, 593506, 600545, 608023, 617090, 627873, 639407, 651233, 663966, 678127, 693532, 710155, 728464, 748529, 769870, 792623, 817919, 846680, 878977, 914992, 955710, 1002274, 1055462, 1115998, 1184217, 1258783, 1336512, 1413823, 1487759, 1555759, 1615952]
56131A615952N2441M6609M2648L9293L6098L3281L0206K5657J9416J2216M512
56120A958329l390j0543j6255k1471k7948l6264m5823n6037o6122p4336p9082
56109A521058q0428p9220p5373o8661o0458n2721m5660l8244l0629k4169j9237
56098I46258j4928j0887p697n382l246j230N8O68J341K298L231M192N223N675
56084I25574N291N233O479Q023Q502Q671J0016J1760J1884J0691J0532J2007J3258
56071A047921J3339J3609J4996J6333J6447J5999J6168J7000J7915J8601J8842
56060A227170J8585J8436J9060K0010K0290J9883J9471J9044J8306J7961J8889
56049A437105K0425K1239K1476K2238K3373K3817K3734K4206K5165K5649K5788
$$ y = [1615952, 1668393, 1715002, 1757650, 1796943, 1833041, 1866322, 1896528, 1922185, 1941601, 1953817, 1958329, 1954939, 1944396, 1928141, 1906670, 1878722, 1842458, 1796635, 1740598, 1674476, 1600140, 1521058, 1440630, 1361410, 1286037, 1217376, 1156918, 1104197, 1058537, 1020293, 989664, 965495, 946258, 931330, 920443, 912746, 907364, 904118, 902888, 902946, 903614, 904955, 907253, 910484, 914676, 919899, 925574, 930865, 936098, 942577, 950600, 959102, 967773, 977789, 989549, 1001433, 1012124, 1022656, 1034663, 1047921, 1061260, 1074869, 1089865, 1106198, 1122645, 1138644, 1154812, 1171812, 1189727, 1208328, 1227170, 1245755, 1264191, 1283251, 1303261, 1323551, 1343434, 1362905, 1381949, 1400255, 1418216, 1437105, 1457530, 1478769, 1500245, 1522483, 1545856, 1569673, 1593407, 1617613, 1642778, 1668427, 1694215]
56038A694215K6423K7275K7658K8389L0651L3581L5496L6885L9414M2592M4414
56027B066993M4858M5572M6524M6347M5794M7313N0995N4407N6704N9451O3082
56016B628040O6092O8311P1458P5787P9466Q1986Q4902Q8666R1979R4847R8889
56005C530423J04079J08543J12187J17024J23496J29984J36334J44119J53088
55996D659277J61274J69046J78881J90772K02179K13016K25984K41446K56790
55987F498665K71704K89046L09636L31230L53580L79305M08703M39220M71035
55978I752124N07612N49888N95800O46397P05844P74603Q49776R33216J031684
55969A6346944J147834J279516J429645J608039J822069K075594K379758K754912
$$ y = [1694215, 1720638, 1747913, 1775571, 1803960, 1834611, 1868192, 1903688, 1940573, 1979987, 2022579, 2066993, 2111851, 2157423, 2203947, 2250294, 2296088, 2343401, 2394396, 2448803, 2505507, 2564958, 2628040, 2694132, 2762443, 2833901, 2909688, 2989154, 3071140, 3156042, 3244708, 3336687, 3431534, 3530423, 3634502, 3743045, 3855232, 3972256, 4095752, 4225736, 4362070, 4506189, 4659277, 4820551, 4989597, 5168478, 5359250, 5561429, 5774445, 6000429, 6241875, 6498665, 6770369, 7059415, 7369051, 7700281, 8053861, 8433166, 8841869, 9281089, 9752124, 10259736, 10809624, 11405424, 12051821, 12757665, 13532268, 14382044, 15315260, 16346944, 17494778, 18774294, 20203939, 21811978, 23634047, 25709641, 28089399, 30844311]
55961C0844311L220127L793341M506056N406581O545141P966161R712762J1818253
55953H3812733J4289274J7118130K0311579K3864421K7660372L1373002L4410410
55946B52839921L5880418L4645806K9666801K0640455Q507908m703242j6709375
55939C60768692k5870148l1562997l3994749l3818358l1835579k8809869k5346818
55932A49530174k1855065j8581666j5660130j3136097j0994156r196778p706334
55925E2399948o480342n469614m632388l941057l371470k897098k497960k164441
55917B0945578j887314j652668j450270j277899j133107j008378q97997q02298
55909A0835647p21270o50606n87393n33294m88646m49186m11845l78378l50267
$$ y = [30844311, 34064438, 37857779, 42363835, 47770416, 54315557, 62281718, 71994480, 83812733, 98102007, 115220137, 135531716, 159396137, 187056509, 218429511, 252839921, 288720339, 323366145, 353032946, 373673401, 382181309, 377478067, 360768692, 334898544, 303335547, 269340798, 235522440, 203686861, 174876992, 149530174, 127675109, 109093443, 93433313, 80297216, 69303060, 60106282, 52399948, 45919606, 40449992, 35817604, 31876547, 28505077, 25607979, 23110019, 20945578, 19058264, 17405596, 15955326, 14677427, 13544320, 12535942, 11637945, 10835647, 10114377, 9463771, 8876378, 8343084, 7854438, 7405252, 6993407, 6615029, 6264762]
55900F264762l25102l00849k78821k59681k41142k22308k05879j93389j82283
55891D055308j70209j58316j47976j38050j27770j18701j11578j04597r6936r0661
55881B790514q7160q4883q2549q1220q1228q0310p7014p3085p0302o7763o4370
55870A940630o1270n9648n8473n6471n4125n2022m9435m6262m4064m3396m2292
55859A373172l9183l5282l2421l0449k8443k6602k5271k3756k1777k0496k0775
55848A068717k1803k2628k3461k4461k4808k4130k3231k2521k1262j9290j7742
55837H23380j7185j6750j5866j5094j4468j3026j0831r486r604r767q994q226
55825F74083q257q238p562p255q156r448j0241j0984j1995j2327j1391j0094r208
$$ y = [6264762, 5939660, 5638811, 5359990, 5100309, 4859167, 4636859, 4430980, 4237591, 4055308, 3885099, 3726783, 3578807, 3440757, 3312987, 3194286, 3082708, 2978111, 2881175, 2790514, 2703354, 2618471, 2535922, 2454702, 2373474, 2293164, 2216150, 2143065, 2072763, 2005000, 1940630, 1879360, 1819712, 1761239, 1704768, 1650643, 1598621, 1549186, 1502924, 1458860, 1415464, 1373172, 1333989, 1298707, 1266286, 1235837, 1207394, 1180792, 1155521, 1131765, 1109988, 1089492, 1068717, 1046914, 1024286, 1000825, 976364, 951556, 927426, 904195, 881674, 860412, 841122, 823380, 806195, 789445, 773579, 758485, 744017, 730991, 720160, 710674, 701070, 691303, 682309, 674083, 665826, 657588, 650026, 642771, 634615, 625167, 614926, 603942, 591947, 579620, 568229, 558135, 548927]
55812E48927q176o694n713n653n324l905k351j504n65J229L035L974M685N787
55798E27752O363N559M212L391K613J112m90j310j805k679l451l619m010n342
55784E28296o672o911o865q056j0428j2782j4596j5819j5838j4338j2480j1562
55772C91949j1103r712p356n244l966l115k392j800j118k00N05O23N03M58Q4q29
55756C47287j623j884k279l341m431n005n764p313q764r071q775q899r045q229
55742B62864o906o358o530o148m792l384k668k454k300j985j459j099j560k641
55728B12580l019k044r66j236k390k925k548k159k155k190k242k482k475j745
55714A82004q34o15q89q25l26J80Q03J780K555K557K359K646K679J360o97j901
$$ y = [548927, 540751, 534057, 528344, 522691, 517367, 513462, 511111, 509607, 509042, 510271, 513306, 517280, 521965, 527752, 534115, 539674, 543886, 547277, 549890, 551002, 550512, 549202, 547397, 544718, 541267, 537648, 533638, 528296, 521624, 514713, 507848, 499792, 489364, 476582, 461986, 446167, 430329, 415991, 403511, 391949, 380846, 371134, 363778, 358534, 354568, 351453, 349061, 347261, 346143, 345943, 346448, 347071, 347574, 348032, 348116, 347287, 345664, 343780, 341501, 338160, 333729, 328724, 322960, 315647, 306883, 297812, 289037, 280138, 271093, 262864, 255958, 249600, 243070, 236922, 232130, 228746, 226078, 223624, 221324, 219339, 217880, 216781, 215221, 212580, 209561, 207517, 206551, 205315, 202925, 200000, 197452, 195293, 193138, 190948, 188706, 186224, 183749, 182004, 181170, 180555, 179666, 178841, 178515, 178695, 179498, 181278, 183833, 186390, 188749, 191395, 194074, 195434, 194737, 192836]
55698A92836k131k596l499l773l269l190m021m672m294l401k586j579j64J077
55684A54738J670J878J999J994K158L075M486N313N234N181N708O045N442M431
55670B09352L894L754L497L244L311L184K070K73q84p53k52p75k488m130m536
55655B18761l998l783m385m892m333l026j972j440r44l36r3m85j198j866k402
55640A83608k801l124l615m327m742m363l573l246l539l776l473k803k054j369
55626A36803j057j372j831j525l25P94R67L33m62j085j505j633j426j108j015
55611A24553j287j777k104j875j159o30q79j622k017j682j029n96n24o33o77m73
55595A05589j11J6l28q49j104j025p77l80P2J15m92j167j091l20L61N67O52R76
$$ y = [192836, 190705, 188109, 184610, 180837, 177568, 174378, 170357, 165685, 161391, 157990, 155404, 153825, 153661, 154738, 156408, 158286, 160285, 162279, 164437, 167512, 171998, 177311, 182545, 187726, 193434, 199479, 204921, 209352, 213246, 217000, 220497, 223741, 227052, 230236, 232306, 232579, 231695, 230942, 230690, 229915, 227427, 223297, 218761, 214763, 210980, 206595, 201703, 197370, 194344, 192372, 190932, 189988, 189652, 189559, 189074, 187876, 186010, 183608, 180807, 177683, 174068, 169741, 164999, 160636, 157063, 153817, 150278, 146502, 143029, 140226, 138172, 136803, 135746, 134374, 132543, 131018, 130693, 131487, 132454, 132787, 132325, 131240, 129735, 128102, 126676, 125568, 124553, 123266, 121489, 119385, 117510, 116351, 115721, 114842, 113220, 111203, 109521, 108492, 107896, 107372, 106739, 106062, 105589, 105478, 105494, 105166, 104317, 103213, 102188, 101411, 101031, 101103, 101218, 100726, 99559, 98468, 98148, 98509, 99076, 99728, 100704]
55577A00704J555K403L630N040O211P022P671Q125Q129P778P475P201O344M467
55563A83755J856p92k927m326n112n634o082o228n860n276m953m875m648m136
55549A24762l557l024k526k194k127k020j515q26m82m87l25K04O84P48N52M93
55533A08360P40J127J287R56L40m4j16m57j405k357k554k205k094k358k391j920
55517I4909j458j583k260k961l114k573j832j561j668j371m66J81j8l58LO37O61
55500G5168L09M26Q87Q98N17M83O64J92q38j322r26n39o09n33q5o6p91j241n22
55481G2072P48J389J161O11J16j98j89L8J01k8J18O41R75P40K59j45o03j058j019
55462G5729m48q4l40o62n28k97l87m15L1M58K03m14n47j00K81K21j10n23r45j191
$$ y = [100704, 102259, 104662, 108292, 113332, 119543, 126565, 134236, 142361, 150490, 158268, 165743, 172944, 179288, 183755, 185611, 184819, 181892, 177566, 172454, 166820, 160738, 154510, 148650, 143374, 138421, 133546, 128898, 124762, 121205, 118181, 115655, 113461, 111334, 109314, 107799, 106973, 106491, 106004, 105679, 105883, 106567, 107315, 107867, 108360, 109100, 110227, 111514, 112470, 112810, 112766, 112650, 112193, 110788, 108431, 105877, 103672, 101578, 99220, 96829, 94909, 93451, 91868, 89608, 86647, 83533, 80960, 79128, 77567, 75899, 74528, 74062, 74243, 74225, 73867, 73870, 74507, 75168, 75477, 75903, 76790, 77688, 78205, 78688, 79352, 79544, 78706, 77384, 76458, 75919, 75310, 74777, 74692, 74626, 73835, 72594, 72072, 72820, 74209, 75370, 75981, 76097, 75899, 75710, 75748, 75849, 75821, 75939, 76580, 77555, 78295, 78554, 78409, 77806, 76748, 75729, 75281, 75197, 74857, 74195, 73667, 73370, 72983, 72568, 72599, 73057, 73260, 72846, 72299, 72199, 72480, 72701, 72591, 72068, 71123, 69932]
55442F9932j131r97r97q42j26R22J603J595J255J057J021P68Q0o68p96k13K44
55425G2707j80j037j225n63P7J45Q5L37O49P12P39Q97R32P30O19O71M55q5l29
55406G6336J3L07jn52q37r82j115q14K7N78K54k03J25P77O74j1j27N29Q54J57
55386G5989q80j271r47n14l63l50j00N16J049P77k78j012m37J017K003J894J261
55369G8354Q08N52K02k25m40k75J10L25R5l39m03QK64j60r27j302j121p87o22
55350G4117o64q63r79n15O33J658J574M07q19j299j124q22o55m68L4Q54J450J175
55332G3694J20p70p64j58K85K69m3m88q28o41P3O10N16L60P51J058K11j421k164
55313G0670j233L30J175J133P72K96k96o23k68M72Q43N91J85M4j5l90j001j301
$$ y = [69932, 68801, 67804, 66807, 65965, 65839, 66761, 68364, 69959, 71214, 72271, 73292, 74060, 74140, 73472, 72676, 72463, 72707, 72527, 71490, 70265, 69702, 69779, 69924, 70009, 70346, 70995, 71707, 72446, 73343, 74275, 75005, 75624, 76295, 76750, 76665, 76336, 76349, 76656, 76655, 76103, 75266, 74284, 73169, 72355, 72382, 72960, 73214, 73011, 73136, 73913, 74587, 74576, 74449, 74978, 75832, 75989, 75109, 73838, 72891, 72377, 72014, 71664, 71564, 72080, 73129, 73906, 73628, 72616, 72179, 73196, 75199, 77093, 78354, 79162, 79714, 79916, 79691, 79251, 78976, 79086, 79411, 79506, 79167, 78764, 78772, 79036, 78876, 77949, 76647, 75526, 74739, 74117, 73453, 72590, 71611, 71096, 71729, 73387, 74961, 75368, 74549, 73250, 72126, 71304, 70649, 70181, 70215, 71069, 72519, 73694, 73814, 73044, 72280, 72122, 72407, 72676, 72633, 72145, 71317, 70676, 70749, 71359, 71875, 72235, 72986, 74044, 74255, 72834, 70670, 69437, 69767, 70942, 72075, 72847, 73143, 72847, 72224, 71956, 72428, 73271, 73862, 74047, 74091, 74076, 73686, 72685, 71384]
55295G1384r69l17J55M02P03R79P36k15j299j768j458q02l59m22q20r37k90P52
55277F5455J274R61M41K46J43r7n4N77J191J051L68j41l73o51q29n13J7J23n0
55258F9139K55J100J667J465R51O03K74k07m97k50L08O77O51L22j41n15o09m71
55240G4722l13k40k27k95l76j92L39P32N30N3j2L26M39J85J29M86O01p0j043j346
55220G4428p07K11O29M58K62M79P67L77o58j220m73Q40J239M07n28o65l49l34
55202G5163o27o51j02P83J470J439N23q12j742j828j297o19q8J44j8m78r41j065
55184F9254o18L67J365J663J164O03N66O93M03p1j09J81J77j41k41j07k55o46
55166G4248n63J85R05J123J168J340J342R31L82j11p85j630k068j735j040m95
$$ y = [71384, 70415, 70098, 70253, 70655, 71358, 72337, 73073, 72858, 71559, 69791, 68333, 67531, 67172, 66750, 65930, 64993, 64703, 65455, 66729, 67690, 68131, 68377, 68520, 68423, 68369, 68946, 70137, 71188, 71556, 71415, 71042, 70391, 69562, 69049, 69066, 69189, 69139, 69394, 70494, 72161, 73626, 74577, 75180, 75454, 75247, 74750, 74500, 74808, 75485, 76136, 76458, 76317, 75802, 75193, 74722, 74409, 74169, 73942, 73647, 73271, 73079, 73418, 74150, 74680, 74733, 74721, 75047, 75486, 75671, 75800, 76286, 76887, 76817, 75774, 74428, 73721, 73932, 74561, 75019, 75281, 75760, 76527, 76904, 76246, 75026, 74553, 75393, 76632, 77039, 76511, 75846, 75497, 75163, 74536, 73885, 73783, 74566, 76036, 77475, 77998, 77186, 75444, 73616, 72319, 71700, 71612, 71756, 71738, 71260, 70319, 69254, 68636, 69003, 70368, 72031, 73195, 73798, 74364, 75057, 75460, 75389, 75280, 75461, 75638, 75497, 75256, 75149, 74894, 74248, 73685, 73870, 74775, 75898, 77066, 78406, 79748, 80679, 81061, 80950, 80165, 78535, 76467, 74732, 73692, 73197]
55150G3197j48ol14r05r80j55Q63J170P99L63Q9j42k10J09O16Q64P94P53R63J240
55130G8960J146L35r77j894j711q43l98o44p32j68L91L25J43N67J228J207M66
55113G7401j75k82j88k38l49l12m1M50R80J214J048P38M15j47q44r06J99J834
55095H0797K817K687J808O08n47j036m26P46J352J009M29L38N91N64L7n48o26
55078I0600j17M31M89K39L54R15J143N19l32m31K42Q15P10J12n29r72j143j083
55060I1962r08o07p4M28K74o31j421j260m11K59M62M93M43K17J09M53Q18M33n87
55041I0452j276j119n54r9K03L35J28j92r3M15O76M29J96K97K53k72o71k25P14
55022H9597J159Q10K47j04m69j052j468j197l65K77J84l89p38m74J61P47J031
$$ y = [73197, 73049, 73043, 72729, 71824, 70844, 70689, 71552, 72722, 73521, 73884, 73973, 73831, 73621, 73730, 74346, 75210, 76004, 76757, 77720, 78960, 80106, 80441, 79464, 77570, 75859, 75016, 74618, 73974, 73242, 73074, 73465, 73790, 73933, 74500, 75728, 76935, 77401, 77226, 76944, 76756, 76518, 76169, 75857, 75816, 76266, 77246, 78460, 79508, 80246, 80661, 80514, 79670, 78764, 78963, 80797, 83614, 86301, 88109, 88717, 88170, 87134, 86708, 87454, 88806, 89815, 90244, 90582, 91173, 91737, 91774, 91226, 90600, 90483, 90914, 91403, 91642, 91996, 92911, 94054, 94573, 94241, 93810, 94052, 94867, 95577, 95689, 95160, 94188, 93045, 91962, 91054, 90447, 90373, 90801, 91075, 90444, 89023, 87763, 87352, 87611, 88073, 88566, 89009, 89226, 89335, 89788, 90606, 91039, 90452, 89176, 88057, 87503, 87404, 87607, 87942, 88070, 87878, 87785, 88200, 88876, 89305, 89501, 89798, 90051, 89779, 89108, 88883, 89597, 90756, 91566, 91813, 91709, 91240, 90188, 88720, 87523, 87158, 87435, 87619, 87230, 86492, 86018, 86179, 86926, 87957]
55005H7957Q96K80n77j196j355j255r97l36O45J199Q54K09R8L50K08k83l88j8
54987H6291K02K46P97J813K128J172o4m83l35m05n40j24O16Q77N63K52J39r5m02
54968I2648l37O2K53J36K16O05O91J48m16k93L38P98R14J083J485J682J134j09
54950A01038j309j671j152n42n95j101j189m96L59O26L07n6j96l37o65r90r48
54933I1083m10L57Q71Q32M90M20Q96J607K138K484K804L003K930K925L544M685
54917A20659N531N565N194M943M511L235J282l08r21j065j576k596l699m609n304
54902A30842n584n091l872k534j674j381j312j162q25l69K6J40n2k48o0N87J336
54885A08767J749J695J381J129J186J603K182K567K620K645L039L684M038L871
$$ y = [87957, 88853, 89133, 88556, 87360, 86005, 84750, 83753, 83417, 84062, 85261, 86115, 86324, 86422, 86772, 86980, 86697, 86309, 86291, 86493, 86739, 87536, 89349, 91477, 92649, 92585, 92102, 91767, 91362, 90822, 90698, 91314, 92191, 92754, 93006, 93145, 93050, 92648, 92311, 92373, 92626, 92762, 92978, 93583, 94274, 94422, 94006, 93713, 94051, 94849, 95763, 96846, 98331, 100013, 101147, 101038, 99729, 98058, 96906, 96364, 95769, 94668, 93479, 92983, 93342, 93968, 94275, 94219, 94023, 93686, 93021, 92031, 91083, 90673, 91030, 91901, 92733, 93223, 93643, 94539, 96146, 98284, 100768, 103572, 106575, 109505, 112430, 115974, 120659, 126190, 131755, 136949, 141892, 146403, 149638, 150920, 150612, 149691, 148626, 147050, 144454, 140755, 136146, 130842, 125258, 120167, 116295, 113761, 112087, 110706, 109394, 108232, 107407, 107038, 107064, 107204, 107152, 106904, 106844, 107431, 108767, 110516, 112211, 113592, 114721, 115907, 117510, 119692, 122259, 124879, 127524, 130563, 134247, 138285, 142156]
54871A42156L536L235K542J085n58j383j327j340k056k979l354l219l122l197
54857A30019l086k598j991j680j889k437k733k227j150m90q62j718k086j793j414
54842A01865j334j362j273j081q01m03j21k68p59j156j276j238r70k15Q30J416
54826I1854J196P22O70R24Q56K94l08n35m32k55j00P5K75M50N62N51L27q6m31
54807I6609l73J16O21P78P61R33J123P43j98q33o30k58n42r86l68J266K348J832
54789A02942N47r6J3j03q29j441j214l44M16O28M53L47N80R61J088Q93Q32J298
54771A06971K077K634K799K892L178L555L824L947L939L782L567L520L723L891
54757A54299L671K966J842K55j766l713m780m685m065l762l910m014l764l279
$$ y = [142156, 145692, 148927, 151469, 152554, 151996, 150613, 149286, 147946, 145890, 142911, 139557, 136338, 133216, 130019, 126933, 124335, 122344, 120664, 118775, 116338, 113605, 111378, 110228, 109738, 108876, 107158, 105072, 103279, 101865, 100531, 99169, 97896, 96815, 96014, 95611, 95490, 95222, 94463, 93307, 92031, 90793, 89823, 89608, 90438, 91854, 93050, 93772, 94442, 95366, 96222, 96516, 96208, 95673, 95241, 94986, 94886, 94961, 95236, 95686, 96248, 96799, 97126, 97040, 96609, 96236, 96352, 96973, 97751, 98512, 99445, 100568, 101311, 101113, 100280, 99650, 99392, 98850, 97864, 97496, 98762, 101110, 102942, 103489, 103393, 103406, 103303, 102474, 101033, 99819, 99475, 99891, 100519, 100972, 101319, 101899, 102860, 103948, 104841, 105673, 106971, 109048, 111682, 114481, 117373, 120551, 124106, 127930, 131877, 135816, 139598, 143165, 146685, 150408, 154299, 157970, 160936, 162778, 163033, 161267, 157554, 152774, 148089, 144024, 140262, 136352, 132338, 128574, 125295]
54743A25295k648j776q63n20j050j889k166j560m58M86P16N9r08j153k85R50J646
54726A13876J819J960K025J710J427J923K961L465L149K932L413L848L292J901
54712A49701M56p79j957k940l453l602l623l376k702k003j833k177k555k636k265
54697A14256j301m3N20k59j567j910r34K30N28Q3l91n40m33k23j37l94q76j179
54679A05430j107p51j25P62J388R98l09j392j433r75j037j627j820j091J01J018
54663I8030J386J360J173R93Q00L21o21j601j815r99J49P45O90N62O85P25L10
54646A02893k70l41K98J043J110L74n36q94n57l4P4k91n73j85P74J524J395N81
54628A06385l3J38P24P93p2j305j939j616q13j47K41M62M18lm67m24L6J65l47
$$ y = [125295, 122647, 120871, 120008, 119488, 118438, 116549, 114383, 112823, 112365, 112851, 113567, 113626, 112718, 111565, 111280, 112230, 113876, 115695, 117655, 119680, 121390, 122817, 124740, 127701, 131166, 134315, 137247, 140660, 144508, 147800, 149701, 150157, 149378, 147421, 144481, 141028, 137426, 133803, 130427, 127725, 125722, 123889, 121712, 119157, 116521, 114256, 112955, 112912, 113432, 113173, 111606, 109696, 108762, 108992, 109520, 109603, 109212, 108672, 108239, 108016, 107879, 107485, 106609, 105430, 104323, 103572, 103447, 104209, 105597, 106595, 106286, 104894, 103461, 102486, 101449, 99822, 98002, 96911, 97012, 98030, 99416, 100776, 101949, 102942, 103742, 104063, 103442, 101841, 100026, 99027, 99176, 99921, 100611, 101173, 101858, 102583, 102893, 102623, 102282, 102580, 103623, 104733, 105107, 104571, 103677, 103120, 103086, 103160, 102869, 102296, 102111, 102885, 104409, 105804, 106385, 106352, 106490, 107214, 108007, 107935, 106630, 104691, 103075, 102262, 102115, 102356, 102818, 103236, 103233, 102766, 102342, 102378, 102543, 102196]
54609A02196p53j93J011J689J313N47K02K68K86J55J22J66J7k53j24O69J603J843
54591A10764J200L43K2K07K29k99r38r07qJ130J675J297L00o99j161r08k40K75
54573A12282L23J39J61M17M75Np22j080p48k2N27N79K79m1j93k57l52m37l85k19
54553A10731q5N0M19J009J318R26K32J33Q98J772J963J565J160Q47K77m81q11
54536A21923m33K6k62j289k163k066j050J40Q72J163J312J257O32m28j039n22
54520A18073O46J293Q79r7q58j046o68J9M64K05n13q80n11J36M79M67K58k18r17
54501A17211j321r51q0N28N11K08J51M98R63J094O97L5m59o26n70l05J55M19P5
54482A18233n07m26M49J134R82O84J131J950K116J587J287J668K203K427K464
$$ y = [102196, 101443, 101250, 102261, 103950, 105263, 105810, 106012, 106280, 106566, 106721, 106843, 107009, 107026, 106773, 106649, 107318, 108921, 110764, 111964, 112307, 112329, 112536, 112765, 112466, 111528, 110621, 110613, 111743, 113418, 114715, 115015, 114316, 113155, 112247, 112007, 112282, 112605, 112744, 112905, 113322, 113797, 113802, 113080, 112000, 111252, 111230, 111757, 112336, 112615, 112574, 112381, 112124, 111772, 111335, 110950, 110731, 110646, 110696, 111115, 112124, 113442, 114368, 114600, 114733, 115631, 117403, 119366, 120931, 122091, 122938, 123215, 122734, 121923, 121490, 121516, 121254, 119965, 117802, 115736, 114686, 114826, 115698, 116861, 118173, 119430, 120062, 119634, 118595, 118073, 118719, 120012, 120891, 120794, 119936, 118890, 118222, 118241, 118705, 118910, 118397, 117517, 117006, 117142, 117621, 118088, 118346, 118128, 117211, 115890, 114939, 114859, 115387, 115898, 116106, 116257, 116755, 117718, 118812, 119509, 119544, 119085, 118459, 117889, 117584, 117739, 118158, 118233, 117726, 117300, 117749, 118883, 119865, 120549, 121680, 123630, 125746, 127333, 128620, 130288, 132491, 134918, 137382]
54467A37382K397J893Q59j69o16n43l59k69j98n2J76L64K87j57p32j097j149r42
54449A37075m72J28M13J04m42o88o74q04r80p32j04K13j80r17j424j455r87j81
54431A27893M71M92P5j13J01K31nk84l22k31j04J67M61M77M10P95J427J333K17
54412A33491r19j092n18J30P30J258J138O5j083j227n44l0K3J11M13O94J170K240
54394A36050L344L211J618q4n75N6Q51J153P89j51j170j470q30m3ro49j162j056
54376A39873n43lM72R56J417J736J876K009K305K643K598J984J183P06N16J95
54360A59923k96n00j31N13R83J087P39j03j164j856j913j690j632j682j570j372
54344A49336j407j746k202k626k866k531j348K41J252J200O27L80N56N45J2n86
$$ y = [137382, 139779, 141672, 142531, 142362, 141746, 141203, 140844, 140575, 140377, 140325, 140501, 140865, 141152, 140995, 140263, 139166, 138017, 137075, 136603, 136731, 137144, 137248, 136806, 136118, 135444, 134640, 133660, 132928, 132824, 133037, 132857, 131940, 130516, 129061, 128074, 127893, 128364, 128856, 128931, 128818, 128919, 129150, 129145, 128861, 128539, 128308, 128204, 128371, 128832, 129309, 129719, 130514, 131941, 133274, 133491, 132572, 131480, 130962, 131092, 131822, 133080, 134218, 134283, 133200, 131973, 131429, 131399, 131422, 131533, 131946, 132640, 133810, 136050, 139394, 142605, 144223, 144139, 143564, 143620, 144471, 145624, 146413, 146262, 145092, 143622, 142792, 142749, 142740, 142091, 140929, 139873, 139330, 139327, 139799, 140755, 142172, 143908, 145784, 147793, 150098, 152741, 155339, 157323, 158506, 159212, 159728, 159923, 159627, 159127, 158996, 159509, 160492, 161579, 162318, 162215, 161051, 159195, 157282, 155592, 153960, 152278, 150708, 149336, 147929, 146183, 143981, 141355, 138489, 135958, 134610, 134851, 136103, 137303, 137930, 138310, 138866, 139411, 139423, 138837]
54328A38837o47k64n7l00o24o25m30l76m79n23m72m86o08p81j084j551j788j224
54310A26518J08J362J727J257O93N79P88Q18M21j69n90q01j039j347j387r75m31
54293A27532j60n0K03M58L14r8j84K10N37M37K22K32K86K47N10J299J913J467
54275A35375K30n50k05O12Q99M69j38m25k98P7L87L25q0l57q8N48R77R26P00O78
54255A40062Q40R40R68J131J418J480J085M30j02l68m71m90m38l63l02j81M0K31
54237A45910K34Q0j34l90n77m43MK46p8n13l57K38L89k15q73r23n95m37n34o52
54217A40380o84n95l68k64o74j358j490q56k97m45p41m16K02L13L2O1L52K15l94
54198A32973p76o98o24o69l82K66P10Q45J179J689J588O68j36j75k6k68l28N25
$$ y = [138837, 138190, 137926, 137869, 137569, 136945, 136320, 135890, 135514, 135035, 134512, 134040, 133554, 132946, 132165, 131081, 129530, 127742, 126518, 126626, 127988, 129715, 130972, 131665, 132244, 133032, 133850, 134271, 134102, 133512, 132711, 131672, 130325, 128938, 127963, 127532, 127372, 127322, 127525, 127983, 128297, 128199, 128015, 128225, 128762, 129199, 129421, 129653, 129939, 130186, 130696, 131995, 133908, 135375, 135605, 135055, 134850, 135462, 136361, 136830, 136692, 136267, 135969, 136046, 136433, 136758, 136678, 136321, 136233, 136781, 137758, 138684, 139384, 140062, 140902, 141842, 142810, 143941, 145359, 146839, 147924, 148354, 148252, 147884, 147413, 146923, 146485, 146122, 145820, 145639, 145679, 145910, 146144, 146224, 146090, 145700, 145123, 144680, 144684, 144930, 144852, 144339, 143982, 144220, 144609, 144394, 143521, 142598, 142003, 141566, 141032, 140380, 139696, 139101, 138733, 138469, 137795, 136437, 134947, 134091, 133794, 133349, 132608, 132192, 132394, 132707, 132739, 132800, 133152, 133367, 132973, 132197, 131499, 130875, 130206, 129824, 130090, 130800, 131645, 132824, 134513, 136101, 136769, 136633, 136458, 136432, 136164, 135836, 136361]
54180A36361J785K367K113J617J026J35o74p21j87O3j60k01J36J16p00j650j801
54163A39625j104k25L36N43N58N08M21J84k39n83n78m20n53j012j393j472j381
54146A33215j118m62M72J148J271J082Q05L95M5K42R26J211N68k71l10K87O33
54129A40139N95Q62J536J769J130M39N94J249J356P01J18K97J045J859K604L356
54113A59649L954M076L670K989K240J388L11r47k088k695k597k183k173k883l746
54098A58965l872l013j774q35l06Q1M58P00P02M99K04j18n32j176j914k152j395
54081A44522m7Q20P74N63J033J919K339K084J744J705J789J837J937J987J710
54066A66716J227J018J078P85j08r75j204r77p32l69L47J065J257J102J238J773
$$ y = [136361, 138146, 140513, 142626, 144243, 145269, 145404, 144730, 144009, 143822, 143885, 143725, 143524, 143660, 143776, 143076, 141426, 139625, 138521, 138296, 138632, 139175, 139733, 140241, 140662, 140846, 140607, 140024, 139446, 139026, 138473, 137461, 136068, 134596, 133215, 132097, 131635, 132107, 133255, 134526, 135608, 136413, 136808, 136853, 137095, 138021, 139232, 139800, 139529, 139219, 139506, 140139, 140734, 141596, 143132, 144901, 146031, 146470, 147064, 148313, 149669, 150370, 150488, 150785, 151830, 153689, 156293, 159649, 163603, 167679, 171349, 174338, 176578, 177966, 178277, 177330, 175242, 172547, 169950, 167767, 165594, 162711, 158965, 155093, 152080, 150306, 149471, 149165, 149246, 149704, 150404, 151106, 151605, 151809, 151691, 151159, 149983, 148069, 145917, 144522, 144475, 145295, 146069, 146632, 147665, 149584, 151923, 154007, 155751, 157456, 159245, 161082, 163019, 165006, 166716, 167943, 168961, 170039, 170824, 170716, 169741, 168537, 167560, 166828, 166459, 166806, 167871, 169128, 170230, 171468, 173241]
54050A73241K177K196K213K527K862K861K713K897L445L861L762L455L664M693
54036B16567O010O806O880O713O737O845O711O246N559M757L960L238K448J413
54022B90890L85l7K43N60L17k57o29q11j217j981k961m101n229n801n466m731
54006B59174m391m487m472m229m098m034l587k831k445k598k615k050j363j115
53992B14859j114r67q12r27j080q83m70j86J41R77K223L167L401L303L436L753
53976B28821L588K430N64j146k226l074m282n612o203n643m415l170k170j544
53962A95918j378j292o16O11J477J444J144J275J480J125O20Q80J769K242J976
53947B08675J856K591L716M320M103L357K525K076K300K967L546L921M428N024
$$ y = [173241, 175418, 177614, 179827, 182354, 185216, 188077, 190790, 193687, 197132, 200993, 204755, 208210, 211874, 216567, 222577, 229383, 236263, 242976, 249713, 256558, 263269, 269515, 275074, 279831, 283791, 287029, 289477, 290890, 291275, 291238, 291481, 292041, 292358, 292101, 291472, 290661, 289444, 287463, 284502, 280401, 275172, 269371, 263905, 259174, 254783, 250296, 245824, 241595, 237497, 233463, 229876, 227045, 224600, 222002, 219387, 217337, 215974, 214859, 213745, 212778, 211966, 211039, 209959, 209076, 208606, 208420, 208561, 209538, 211761, 214928, 218329, 221632, 225068, 228821, 232409, 234839, 235403, 234257, 232031, 228957, 224675, 219063, 212860, 207217, 202802, 199632, 197462, 195918, 194540, 193248, 192632, 193243, 194720, 196164, 197308, 198583, 200063, 201188, 201808, 202688, 204457, 206699, 208675, 210531, 213122, 216838, 221158, 225261, 228618, 231143, 233219, 235519, 238486, 242032, 245953, 250381, 255405]
53933B55405N086M375L572L416L716L772L455L328L774M563N258N676N859N874
53919C17129N820N893O288O963P548P727P757Q328R575J0523J0017Q071N768L860
53905D21267K213O50m86j013j454k295l236l692l705l790m223m925n821o741p305
53890C75444p393p477p924q320q100p538p343p433p057o085n286n112n016m375
53876B80985l408k760k659k907l318l789m150m296m236l915l334k839k813k988
53862B33573k705k048j958k826l699l528k613k013k006j979j571j003m73k0Jp90
53846B04342j920k311j658q47o72q32n98O0N89P35P19O87N16R5m50r46j296j433
53828A94780j223n73L02Q68P21K07J97J004J830J749R55M18N04O93O74Q20J333
$$ y = [255405, 260491, 264866, 268438, 271854, 275570, 279342, 282797, 286125, 289899, 294462, 299720, 305396, 311255, 317129, 322949, 328842, 335130, 342093, 349641, 357368, 365125, 373453, 383028, 393551, 403568, 411639, 417407, 421267, 423480, 424130, 423644, 422631, 421177, 418882, 415646, 411954, 408249, 404459, 400236, 395311, 389490, 382749, 375444, 368051, 360574, 352650, 344330, 336230, 328692, 321349, 313916, 306859, 300774, 295488, 290376, 285360, 280985, 277577, 274817, 272158, 269251, 265933, 262144, 257994, 253698, 249462, 245547, 242213, 239374, 236561, 233573, 230868, 228820, 226862, 224036, 220337, 216809, 214196, 212183, 210177, 208198, 206627, 205624, 205151, 205131, 205132, 204342, 202422, 200111, 198453, 197606, 196934, 196102, 195504, 195564, 196153, 196888, 197607, 198294, 198810, 198905, 198455, 197509, 196213, 194780, 193557, 192984, 193286, 194154, 194875, 195082, 195279, 196283, 198113, 199862, 200817, 201235, 201739, 202432, 203106, 203926, 205259]
53811B05259J730J676J693K409L655M812N664O345O773O793O596O528O587O553
53797B73073O372O057N480M720M230M179L997L199K245J853J796J264K47m65o92
53782C17555j177k258l202l383l271l609m254m543m448m564n155n792n959n559
53768B60381m790l908l206k922l071l410l651l690l626l555l351k804j994j374
53754B15029j302j639k013k292k442k160j148K77J334J582J188M63l94j049j144
53739B04290p69m00k07R4N40P12M61K90N99J026R58M21l4k0M41J124J730J920
53721B13176J625J138Q10P45Q53R79Q99N12J46K57P73J184J319J522J946K288
53705B30172K454K767L178L077K348J905K507L670M404M470M217L745L072K703
$$ y = [205259, 206989, 208665, 210358, 212767, 216422, 221234, 226898, 233243, 240016, 246809, 253405, 259933, 266520, 273073, 279445, 285502, 290982, 295702, 299932, 304111, 308108, 311307, 313552, 315405, 317201, 318465, 318712, 318247, 317555, 316378, 314120, 310918, 307535, 304264, 300655, 296401, 291858, 287410, 282846, 277691, 271899, 265940, 260381, 255591, 251683, 248477, 245555, 242484, 239074, 235423, 231733, 228107, 224552, 221201, 218397, 216403, 215029, 213727, 212088, 210075, 207783, 205341, 203181, 202033, 202310, 203644, 205226, 206414, 206877, 206483, 205434, 204290, 203521, 203121, 202914, 203008, 203548, 204260, 204721, 205011, 205610, 206636, 207594, 208015, 207981, 207961, 208402, 209526, 211256, 213176, 214801, 215939, 216749, 217494, 218347, 219326, 220225, 220737, 220883, 221140, 221913, 223097, 224416, 225938, 227884, 230172, 232626, 235393, 238571, 241648, 243996, 245901, 248408, 252078, 256482, 260952, 265169, 268914, 271986, 274689]
53691B74689L015L441L143K248J529J045J15j409k719l008k208p46O70J172M78
53676B81455n09o54j38j43r77j592j211m07j16l79o37n82k28L28P10L93n45j288
53658B73480j299r64q48q52o02k08M3K76P60J270J372J150J140J595K267K792
53642B81372K970K745K260J929K046K315K055J010k22o61M5J184J666J252P62
53627C02728Q90J236J011M14M45J454K653L291L494L637L623L259K791K559K567
53612C36052K751L204L752L836L310K821K916L235L178K847K651K427J809J138
53598C75927J137J696J876J206K73j93k26l26o95j084j189j017q96j150j711k163
53582C71465k311k376k476k289j640j057j198j919k468k484k263k081j832j442
$$ y = [274689, 277704, 281145, 284288, 286536, 288065, 289110, 289225, 287816, 285097, 282089, 279881, 279135, 279805, 280977, 281455, 280946, 280292, 280154, 280011, 279034, 277442, 276231, 275824, 275708, 275329, 274692, 274110, 273882, 274210, 274920, 275313, 274768, 273480, 272181, 271217, 270369, 269517, 268915, 268707, 268750, 269026, 269786, 271056, 272428, 273578, 274718, 276313, 278580, 281372, 284342, 287087, 289347, 291276, 293322, 295637, 297692, 298702, 298480, 297819, 297864, 299048, 300714, 301966, 302728, 303618, 304854, 305865, 306279, 306724, 308178, 310831, 314122, 317616, 321253, 324876, 328135, 330926, 333485, 336052, 338803, 342007, 345759, 349595, 352905, 355726, 358642, 361877, 365055, 367902, 370553, 372980, 374789, 375927, 377064, 378760, 380636, 381842, 382115, 381922, 381696, 381370, 380675, 379591, 378402, 377385, 376489, 375339, 373628, 371465, 369154, 366778, 364302, 362013, 360373, 359316, 358118, 356199, 353731, 351247, 348984, 346903, 345071, 343629]
53568C43629j123j028j014q26l22M23R82P33m12j579j737r13k6L84O88J251J733
53551C40843J675J272J042J054R52O42N11R12J682K358K682K856L201L675L935
53536C69292L871L879M366N256O204P104Q002Q678Q811Q554Q565R335J0765J2388
53522D75070J3716J4402J4425J4218J4251J4512J4717J5032J6022J7719J9340
53511F43424K0324K1139K2560K4385K5515K5378K4725K4721K5482K5922K5059
53500I08634K3192K1529K0772K0473J9860J8906J8222J8119J8255J8182J7885
53489A124029J7604J7467J7411J7333J7175J6958J6729J6480J6170J5902J5904
53478A309162J6139J6127J5415J4040J2270J0132P585N005K908J204p61l335o192
$$ y = [343629, 342506, 341478, 340464, 339638, 339316, 339739, 340721, 341454, 341042, 339463, 337726, 336813, 336787, 337171, 337859, 339110, 340843, 342518, 343790, 344832, 345886, 346838, 347480, 347991, 348903, 350585, 352943, 355625, 358481, 361682, 365357, 369292, 373163, 377042, 381408, 386664, 392868, 399972, 407974, 416652, 425463, 434017, 442582, 451917, 462682, 475070, 488786, 503188, 517613, 531831, 546082, 560594, 575311, 590343, 606365, 624084, 643424, 663748, 684887, 707447, 731832, 757347, 782725, 807450, 832171, 857653, 883575, 908634, 931826, 953355, 974127, 994600, 1014460, 1033366, 1051588, 1069707, 1087962, 1106144, 1124029, 1141633, 1159100, 1176511, 1193844, 1211019, 1227977, 1244706, 1261186, 1277356, 1293258, 1309162, 1325301, 1341428, 1356843, 1370883, 1383153, 1393285, 1400870, 1405875, 1408783, 1409987, 1409226, 1405891, 1399699]
53465A399699q911j1386j3481j4802j5137j4861j4612j4764j5407j6509j7831
53454A241998j8915j9453j9619j9830k0265k0679k0654k0056j9262j8787j8522
53443A025956j7680j5811j3547j1785j0429q760o900n838n797n599m238k273q74
53430I16425j88N65J777L171M604O279Q122R624J0509J1147J2141J3803J5940
53417A013919J8004J9481K0390K1233K2294K3338K4223K5413K7323K9512L1212
53406A276342L2378L3582L4988L6234L7321L8819M0993M3385M5560M7693M9969
53395A717264N1934N2957N3154N3326N4043N5027N5526N5131N4124N3068N2099
53384B307653N0896M9279M7476M5503M2817L9083L5052L1867K9506K6670K2336
$$ y = [1399699, 1390788, 1379402, 1365921, 1351119, 1335982, 1321121, 1306509, 1291745, 1276338, 1259829, 1241998, 1223083, 1203630, 1184011, 1164181, 1143916, 1123237, 1102583, 1082527, 1063265, 1044478, 1025956, 1008276, 992465, 978918, 967133, 956704, 947944, 941044, 935206, 929409, 923810, 919572, 917299, 916425, 916237, 916802, 918579, 921750, 926354, 932633, 940755, 950379, 960888, 972035, 984176, 997979, 1013919, 1031923, 1051404, 1071794, 1093027, 1115321, 1138659, 1162882, 1188295, 1215618, 1245130, 1276342, 1308720, 1342302, 1377290, 1413524, 1450845, 1489664, 1530657, 1574042, 1619602, 1667295, 1717264, 1769198, 1822155, 1875309, 1928635, 1982678, 2037705, 2093231, 2148362, 2202486, 2255554, 2307653, 2358549, 2407828, 2455304, 2500807, 2543624, 2582707, 2617759, 2649626, 2679132, 2705802, 2728138]
53373B728138J6865J1287O142J316l533q868j5177k2434k9855l6557m2225m6825
53361B558274n0020n1432n1423n1127n1508n2565n3466n3394n2208n0399m8416
53350A992316m6284m4030m2249m1624m1924m2117m1680m1107m0809m0254l8804
53339A531434l6759l4772l2739l0203k7548k5675k4509k2908k0329j7636j5818
53328A242538j4717j3632j2580j2194j2736j3785j4779j5326j5126j4096j2593
53317A090974j1204j0223r474q613p425n903m211k533q96P88K456L862M906N784
53303A048288O759P935R365J1048J2797J4375J5880J7603J9462K1039K2345K3938
53291A230834K5882K7319K7587K7266K7261K7345K6497K4491K2219K0321J8442
$$ y = [2728138, 2745003, 2756290, 2762432, 2763748, 2760215, 2751347, 2736170, 2713736, 2683881, 2647324, 2605099, 2558274, 2508254, 2456822, 2405399, 2354272, 2302764, 2250199, 2196733, 2143339, 2091131, 2040732, 1992316, 1946032, 1902002, 1859753, 1818129, 1776205, 1734088, 1692408, 1651301, 1610492, 1570238, 1531434, 1494675, 1459903, 1427164, 1396961, 1369413, 1343738, 1319229, 1296321, 1275992, 1258356, 1242538, 1227821, 1214189, 1201609, 1189415, 1176679, 1162894, 1148115, 1132789, 1117663, 1103567, 1090974, 1079770, 1069547, 1060073, 1051460, 1044035, 1038132, 1033921, 1031388, 1030492, 1031280, 1033736, 1037598, 1042504, 1048288, 1055047, 1062982, 1072347, 1083395, 1096192, 1110567, 1126447, 1144050, 1163512, 1184551, 1206896, 1230834, 1256716, 1284035, 1311622, 1338888, 1366149, 1393494, 1419991, 1444482, 1466701, 1487022, 1505464]
53280A505464J5964J2839R463O302L788J973J51k507n802q677j0733j2719j5164
53267A500342j7464j8975k0243k2246k4861k6977k7887k7882k7607k7571k8118
53256A230511k9120k9768k9271k7874k6659k6280k6432k6519k6303k5786k4988
53245I31511k4117k3574k3578k3906k4088k3724k2673k1251k0068j9403j8824
53234F86305j7751j6248j4770j3351j1651r766q338p720p641p792q207q866r459
53221E44745r819j0110j0374j0431j0464j1039j2195j3036j2829j1964j1248j0669
53209D10567r639q158o948o353n952n355m831m802n255n913o654p367p727p545
53195C18068p141o983p045o879o347n810n423m746l431k073j727k583l613l812
$$ y = [1505464, 1521428, 1534267, 1543730, 1550032, 1553820, 1555793, 1555944, 1553437, 1547635, 1538958, 1528225, 1515506, 1500342, 1482878, 1463903, 1443660, 1421414, 1396553, 1369576, 1341689, 1313807, 1286200, 1258629, 1230511, 1201391, 1171623, 1142352, 1114478, 1087819, 1061539, 1035107, 1008588, 982285, 956499, 931511, 907394, 883820, 860242, 836336, 812248, 788524, 765851, 744600, 724532, 705129, 686305, 668554, 652306, 637536, 624185, 612534, 602768, 594430, 586710, 579069, 571277, 563070, 554204, 544745, 534926, 524816, 514442, 504011, 493547, 482508, 470313, 457277, 444448, 432484, 421236, 410567, 400928, 392770, 385822, 379469, 373517, 368162, 363331, 358529, 353274, 347361, 340707, 333340, 325613, 318068, 310927, 303944, 296899, 290020, 283673, 277863, 272440, 267694, 264263, 262190, 260463, 257880, 254267, 250455]
53181B50455l298k849k719k497j940j374j159j209j198j011q12q58j181j396r59
53166B25995J13R71Q23q7q25r87j000j215j388j224q08k99K40M69q8j195j849
53149B17646j507q01n19n12l06j32m78r53o45M29J219J089N40K89L70M54M51L62
53131B16996P3k85j90N96J548J971J842J646J587J469J293J435K056K667K615
53116B37319J841R45M85M38L84J06k16l40l37n14j041j715k154k171j934j714
53100B29382j481r65k02K43p6p85j064p42m79p56j218j257q78n46m97n45m40q2
53082B17612M30P64N80j0m88o06o71q78r07n88m43q72j287q74J6K17n71j392j447
53063B08585j027p40o75p05r03j161r50m5R92J508J561J550J485J208R43J016
$$ y = [250455, 247157, 244308, 241589, 239092, 237152, 235778, 234619, 233410, 232212, 231201, 230389, 229531, 228350, 226954, 225995, 226108, 227079, 227902, 227815, 226990, 226003, 225003, 223788, 222400, 221176, 220368, 220069, 220309, 220778, 220690, 219495, 217646, 216139, 215338, 214819, 214307, 214001, 213869, 213391, 212438, 211793, 212222, 213441, 214530, 215070, 215359, 215729, 216183, 216634, 216996, 217069, 216784, 216594, 217190, 218738, 220709, 222551, 224197, 225784, 227253, 228546, 229981, 232037, 234704, 237319, 239160, 240105, 240590, 241028, 241412, 241518, 241302, 240962, 240625, 240111, 239070, 237355, 235201, 233030, 231096, 229382, 227901, 226936, 226734, 226977, 226901, 226116, 225052, 224310, 223831, 223075, 221857, 220600, 219722, 219176, 218679, 218134, 217694, 217612, 218042, 218806, 219386, 219376, 218888, 218282, 217611, 216733, 215826, 215238, 214795, 213923, 212636, 211762, 211778, 211995, 211424, 210032, 208585, 207558, 206818, 206143, 205438, 204535, 203374, 202424, 202379, 203371, 204879, 206440, 207990, 209475, 210683, 211626, 212642]
53047B12642J172R19M00K15M25M09j48p74r56q86j028j346j410j056n02J3L36
53030B08425K80j79n52j62R92K041K143J315J73q12j435j467q17O0M82L47K04
53013B11038M00O44N36J14m02q90j129p90O4Q65J318J709K064J682J97j429j887
52996B14104j217m95k04R7N37O04K69K95R85J669J883K106K632K709J678L02j06
52979B27848N91J423J751J710J471J039P65J093J703J688Q15j00k82J31N60P43
52963B42949O74L65j6p6L00O72N14k10j163k074k739k887k408j632j105j072j332
52946B28760j532j410r38l57j9p9l59o49r44j236j273p95N0Q04J170J206J010
52929B23409N86M8l08l17j33l5r5k51m82o96o13q0N53P20L33j42l81n75r38j214
$$ y = [212642, 213814, 214733, 215133, 215348, 215773, 216182, 216034, 215260, 214304, 213418, 212390, 211044, 209634, 208578, 208076, 208089, 208425, 208705, 208526, 207974, 207812, 208804, 210845, 212988, 214303, 214476, 213664, 212229, 210762, 209945, 210005, 210487, 210834, 211038, 211438, 212082, 212618, 212732, 212330, 211440, 210311, 209521, 209585, 210450, 211768, 213477, 215541, 217223, 217420, 215991, 214104, 212887, 212392, 212188, 212285, 212822, 213426, 213695, 213990, 214975, 216644, 218527, 220633, 223265, 225974, 227652, 227954, 227848, 228439, 229862, 231613, 233323, 234794, 235833, 236598, 237691, 239394, 241082, 241897, 241797, 241515, 241646, 242206, 242949, 243623, 243988, 243972, 243896, 244196, 244868, 245382, 245172, 244009, 241935, 239196, 236309, 233901, 232269, 231164, 230092, 228760, 227228, 225818, 224880, 224523, 224504, 224425, 224066, 223417, 222473, 221237, 219964, 219169, 219219, 220023, 221193, 222399, 223409, 223995, 224043, 223735, 223418, 223285, 223250, 223155, 222904, 222422, 221726, 221113, 221033, 221586, 222306, 222639, 222497, 222116, 221541, 220603, 219389]
52909B19389j068o85n71p92q59m45J80N47N00K06j12k42j2N52J160J517J608J590
52891B22463J497J219P12J55k19l85n34q01j044j049q61p10n66j12O84J300J270
52874B23019R02R25J524K160K299J948J422R57O84O87R34J354J949K591K833K284
52858B48472J190J80n79j446k526l395l797m056m412m516l998l149k556k422k545
52843B10445k745k790k287j148oL69l7n50p01o51p33r21q48j79R45J834J826J133
52825B02956P51J224J836J511K20r91j326j015p40p46p47m42Q0M74N71O01P87
52808B05004R21O63K39K29N47L70o01j535j627j219j056j081q05m48o52j263j454
52791A96232r40k84Q7K46K13r3k87J77R95J228O40rk01k14j93K37J041J395Q90
$$ y = [219389, 218321, 217636, 217065, 216273, 215414, 214969, 215149, 215696, 216196, 216402, 216290, 216048, 216036, 216588, 217748, 219265, 220873, 222463, 223960, 225179, 225891, 226046, 225827, 225442, 224908, 224107, 223063, 222014, 221153, 220443, 219877, 219765, 220449, 221749, 223019, 223921, 224846, 226370, 228530, 230829, 232777, 234199, 235156, 235840, 236527, 237461, 238815, 240764, 243355, 246188, 248472, 249662, 249842, 249263, 247817, 245291, 241896, 238099, 234043, 229631, 225115, 221117, 217968, 215412, 212990, 210445, 207700, 204910, 202623, 201475, 201469, 201838, 201801, 201251, 200550, 199899, 199166, 198245, 197397, 197218, 198163, 199997, 201823, 202956, 203707, 204931, 206767, 208278, 208498, 207507, 206181, 205166, 204426, 203680, 202933, 202491, 202571, 203045, 203616, 204217, 205004, 205925, 206588, 206827, 207056, 207603, 207973, 207372, 205837, 204210, 202991, 201935, 200854, 200049, 199601, 198949, 197686, 196232, 195292, 195008, 195095, 195341, 195554, 195461, 195174, 195351, 196346, 197574, 198214, 198205, 198004, 197790, 197597, 197834, 198875, 200270, 201160]
52772B01160J96j4J4j11j23J39O1p07j305q71n6j47j055j477q82n0M45J010J930
52753A98157K547K190J196M44L13N11O37N54M66P34J450K145K268J959J842K040
52737B19453J972J303N32K98N43P37N72J36l26n10k22L18N02Np87j240j179r09
52719B21198p15o35n82m36j50N7j67q51j530j824j862j929j819j122N8J062J462
52702B10215J451J363J130N36k42o53l82K76O49K84o68j565j807j305n00J41N59
52685B09482R75J386J384O57m11r17l84O52J164O89l11j028j001k89O09R92M97
52668B14146l67n44L74J557J863J176L96K76P67J439J999K230J985J511J390J850
52652B32048K415K578K410K118J421m8j840k932k911k423k207k234k053j546r46
$$ y = [201160, 201356, 201342, 201356, 201245, 201122, 201261, 201322, 200615, 199310, 198439, 198383, 198236, 197181, 195704, 194822, 194772, 195217, 196227, 198157, 200704, 202894, 204090, 204534, 204847, 205358, 205995, 206549, 207015, 207749, 209199, 211344, 213612, 215571, 217413, 219453, 221425, 222728, 223260, 223558, 224101, 224838, 225410, 225546, 225220, 224710, 224488, 224806, 225308, 225313, 224526, 223286, 222107, 221198, 220483, 219848, 219266, 218830, 218680, 218737, 218570, 217719, 216189, 214365, 212503, 210574, 208755, 207633, 207691, 208753, 210215, 211666, 213029, 214159, 214695, 214453, 213800, 213418, 213694, 214343, 214627, 213959, 212394, 210587, 209282, 208782, 208923, 209482, 210457, 211843, 213227, 213884, 213473, 212556, 212172, 212824, 213988, 214677, 214366, 213338, 212337, 212048, 212657, 213649, 214146, 213779, 213235, 213609, 215166, 217029, 218205, 218601, 218877, 219644, 221083, 223082, 225312, 227297, 228808, 230198, 232048, 234463, 237041, 239451, 241569, 242990, 242942, 241102, 238170, 235259, 232836, 230629, 228395, 226342, 224796, 223850]
52637B23850m21M1M42P80J100J312J193P56M40O44J254J845K180K148J504J76
52621B39244j273k026j936j632j582j556j208p80p75j172j346p80L77J383J507
52606B26445O23n69j089n74L54P55L81j10L5P99J462J498J178J076J139P11l81
52589B33733j251r66K31J289J781K203K816K975K125P29k85o31o59n62k61J19
52573B43386K62J49R0J96K80K68K89L09R5l62p45q32p16m81j24J12k38j175j926
52554B38837j768r63m81q10j430j518q77mN68Q25J076J457J665J317M26n30j073
52537B36717j110q26l69J97O91Q44O53N09P26J069R84M28L4K71O84M69l71r70
52519B40630p87k96j64k40P1P81J292J375J465J902K405K576K522K598K793K723
$$ y = [223850, 223429, 223470, 223912, 224692, 225792, 227104, 228297, 229053, 229493, 230137, 231391, 233236, 235416, 237564, 239068, 239244, 237971, 235945, 234009, 232377, 230795, 229239, 228031, 227251, 226476, 225304, 223958, 223178, 223555, 224938, 226445, 227068, 226499, 225410, 224836, 225190, 225945, 226326, 226216, 226251, 227050, 228512, 230010, 231188, 232264, 233403, 234114, 233733, 232482, 231516, 231747, 233036, 234817, 237020, 239836, 242811, 244936, 245665, 245380, 244749, 244090, 243528, 243267, 243386, 243648, 243797, 243887, 244083, 244363, 244631, 244920, 245229, 245324, 244962, 244217, 243385, 242669, 242188, 242064, 242176, 241938, 240763, 238837, 237069, 236106, 235625, 234815, 233385, 231867, 230990, 230986, 231554, 232379, 233455, 234912, 236577, 237894, 238320, 237790, 236717, 235607, 234781, 234412, 234609, 235300, 236144, 236797, 237306, 238032, 239101, 240085, 240513, 240547, 240818, 241502, 241971, 241600, 240630, 239843, 239547, 239383, 239143, 239214, 239995, 241287, 242662, 244127, 246029, 248434, 251010, 253532, 256130, 258923, 261646]
52503B61646K107R84l91j620k234k045j505j379j958k748l071k796k322j947j572
52488B39149j087p27p66r93q99l84J00K27K47M54O53N20K75M42J075J753K275
52471B42314K788L115K720J595O55P52J689K613L077L138K839K192J606J603K030
52456B74726K087J328J67p82j408j927k378k677k832k832k526j987j749k219l002
52441B51989l198k478j405o55l01q1Qk38p11r40o27k2L37J84k51n38m60j40K28
52422B40701O34J108J401J133L86j28J39R03J455J714K270L359M377M716M701
52407B68869N078N907O513O545O363O257N740M099J342j717m165n535n767n162
52393B94367m339l877l776l474k556j254j74L23K83j08o18r09p19j92K67N57J014
$$ y = [261646, 263753, 264737, 264346, 262726, 260492, 258447, 256942, 255563, 253605, 250857, 247786, 244990, 242668, 240721, 239149, 238062, 237335, 236569, 235576, 234677, 234293, 234393, 234620, 234867, 235321, 235974, 236494, 236769, 237211, 238286, 240039, 242314, 245102, 248217, 250937, 252532, 253187, 253939, 255628, 258241, 261318, 264456, 267295, 269487, 271093, 272696, 274726, 276813, 278141, 278308, 277526, 276118, 274191, 271813, 269136, 266304, 263472, 260946, 258959, 257210, 254991, 251989, 248791, 246313, 244908, 244253, 243952, 243871, 243879, 243641, 242930, 241990, 241363, 241341, 241678, 241862, 241611, 241073, 240613, 240473, 240701, 241335, 242443, 243844, 244977, 245363, 245235, 245374, 246277, 247732, 249446, 251716, 255075, 259452, 264168, 268869, 273947, 279854, 286367, 292912, 299275, 305532, 311272, 315371, 316713, 314996, 310831, 305296, 299529, 294367, 290028, 286151, 282375, 278901, 276345, 275091, 274917, 275240, 275523, 275415, 274797, 273888, 273169, 272977, 273244, 273801, 274815]
52376B74815J846K726L259L535L901M362M665M850N199N606N536M784L795L000
52362C31879K279J344K81o19j275j635j515r19k90L2K47O04Q09N42K49O65J656
52345C34334K332K287J999J916J933J971K281K915L540M119N094O562P933Q785
52331C88001R390R975J0211J0141J0744J2722J5242J6914J7602J8313J9481K0502
52319E59238K0885K0851K0634K0056J9025J7704J6155J4523J3632J4320J5993
52308G53016J6833J5981J4542J3897J3937J3772J3279J2897J2364J0946Q751O801
52296I07016N669M807L416J386q46k841m404n649o905q234r154r146q404p595
52282H59116o961o172n010l600j911K94K776M704N596N935O529P603Q861J0032
$$ y = [274815, 276661, 279387, 282646, 286181, 290082, 294444, 299109, 303959, 309158, 314764, 320300, 325084, 328879, 331879, 334158, 335502, 335783, 335164, 333889, 332254, 330739, 329820, 329530, 329562, 329809, 330413, 331222, 331764, 332013, 332678, 334334, 336666, 338953, 340952, 342868, 344801, 346772, 349053, 351968, 355508, 359627, 364721, 371283, 379216, 388001, 397391, 407366, 417577, 427718, 438462, 451184, 466426, 483340, 500942, 519255, 538736, 559238, 580123, 600974, 621608, 641664, 660689, 678393, 694548, 709071, 722703, 737023, 753016, 769849, 785830, 800372, 814269, 828206, 841978, 855257, 868154, 880518, 891464, 900215, 907016, 912685, 917492, 920908, 922294, 921448, 918607, 914203, 908554, 901649, 893415, 884261, 875115, 866711, 859116, 852155, 845983, 840973, 837373, 835462, 835756, 838532, 843236, 848832, 854767, 861296, 868899, 877760, 887792]
52268H87792J0962J1492J1711J2075J2835J3536J3521J2844J2262J2311J2834
52257A024175J3367J3620J3484J2945J2159J1345J0502R414Q036O620N262L554
52245A144483J023k145n121p289q810j0191j1471j2215j2288j2226j2478j2680
52233A038592j2128j0921j0001r899r940r121p410n712m656l988l195k278j671
52220I47672j600j740j461l22J517L297M190M006L362L083L477M221M862N270
52206I79834N588N860N920N639N150M677M270L950L999M765O087P219P478O830
52192A057266N757M781M241M211M362M154L443K622J890P23j392l959n857o687
52178A075555p122p806q598r110r429r746r703q678o683m594l323l004k990k587
$$ y = [887792, 898754, 910246, 921957, 934032, 946867, 960403, 973924, 986768, 999030, 1011341, 1024175, 1037542, 1051162, 1064646, 1077591, 1089750, 1101095, 1111597, 1121011, 1129047, 1135667, 1140929, 1144483, 1145506, 1143361, 1138240, 1130951, 1122141, 1111950, 1100479, 1088264, 1075976, 1063750, 1051272, 1038592, 1026464, 1015543, 1005542, 995643, 985703, 976582, 969172, 963460, 958804, 954816, 951621, 949343, 947672, 946072, 944332, 942871, 942549, 944066, 947363, 951553, 955559, 958921, 962004, 965481, 969702, 974564, 979834, 985422, 991282, 997202, 1002841, 1007991, 1012668, 1016938, 1020888, 1024887, 1029652, 1035739, 1042958, 1050436, 1057266, 1063023, 1067804, 1072045, 1076256, 1080618, 1084772, 1088215, 1090837, 1092727, 1093450, 1092058, 1088099, 1082242, 1075555, 1068433, 1060627, 1052029, 1042919, 1033490, 1023744, 1014041, 1005363, 998680, 994086, 990763, 987759, 984769, 982182]
52164I82182j660n12O72J933L024L350K827K371K828L639L493K263J209R83O26
52149A009228p38k217k218o77R51J603J459J019M85J28K58N26J58p38r35K86K054
52132A010632L142L682M834P020R473J1535J3535J6094J9040K1533K3121K4163
52120A167804K5184K6107K6426K6073K5669K5699K5732K4895K3036K0915J9191
52109A436731J7662J5771J3414J0872Q320N809L595J974Q06l75j693k710l092
52096A507084l264m103o012q483j0640j2100j3180j4341j5563j6482j6875j6872
52084A369169j6562j5747j4175j1987r750q006o769n437l301k62K944N386O789
52071A292292P697Q897J0739J2981J5024J6351J6872J6873J6538J5707J4308J2746
$$ y = [982182, 980522, 980010, 980682, 982615, 985639, 988989, 991816, 994187, 997015, 1000654, 1004147, 1006410, 1007619, 1008602, 1009228, 1008490, 1006273, 1004055, 1003378, 1004329, 1005932, 1007391, 1008410, 1008895, 1009023, 1009281, 1009807, 1009965, 1009227, 1008292, 1008578, 1010632, 1013774, 1017456, 1022290, 1029310, 1038783, 1050318, 1063853, 1079947, 1098987, 1120520, 1143641, 1167804, 1192988, 1219095, 1245521, 1271594, 1297263, 1322962, 1348694, 1373589, 1396625, 1417540, 1436731, 1454393, 1470164, 1483578, 1494450, 1502770, 1508579, 1512174, 1514148, 1514954, 1514579, 1512886, 1510176, 1507084, 1503820, 1499717, 1493705, 1485222, 1474582, 1462482, 1449302, 1434961, 1419398, 1402916, 1386041, 1369169, 1352607, 1336860, 1322685, 1310698, 1300948, 1292942, 1286173, 1280736, 1277435, 1277173, 1280117, 1285503, 1292292, 1299989, 1308886, 1319625, 1332606, 1347630, 1363981, 1380853, 1397726, 1414264, 1429971, 1444279, 1457025]
52059A457025J1519J0577R562Q527P830P272O049L841J319p60k512m556p196j0308
52045A498189j3592j6488j8350j9236k0109k1614k3028k3164k2013k0680j9827
$$ y = [1457025, 1468544, 1479121, 1488683, 1497210, 1505040, 1512312, 1518361, 1522202, 1523521, 1522761, 1520249, 1515693, 1508497, 1498189, 1484597, 1468109, 1449759, 1430523, 1410414, 1388800, 1365772, 1342608, 1320595, 1299915, 1280088]
$$ [...]
##END NTUPLES=NMR SPECTRUM
##END=
