##TITLE=AC1729_SEN00002_9275740_F0xnw3EYGm
##JCAMPDX= 6.0         $$ Bruker NMR JCAMP-DX V2.0
##DATA TYPE= NMR SPECTRUM
##DATA CLASS= NTUPLES
##ORIGIN= BRUKER
##OWNER= Administrator
$$ 1.72 TOPSPIN		Version 2.1
$$ 2015-08-08 00:04:41.484 -0700  Administrator@X
$$ Compression mode = diff/dup
##.OBSERVE FREQUENCY= 400.02188249412
##.OBSERVE NUCLEUS= ^1H
##.ACQUISITION MODE= SIMULTANEOUS (DQD)
##.ACQUISITION SCHEME= undefined
##.AVERAGES= 8
##.DIGITISER RES= 22
##SPECTROMETER/DATA SYSTEM= spect
##.PULSE SEQUENCE= zg30
##.SOLVENT NAME= COFFEE_meoh
##.SHIFT REFERENCE= INTERNAL, COFFEE_meoh, 1, 14.98509
##AUDIT TRAIL= $$ (NUMBER, WHEN, WHO, WHERE, PROCESS, VERSION, WHAT)
$$ ##TITLE= Audit trail, TOPSPIN		Version 2.1
$$ ##JCAMPDX= 5.01
$$ ##ORIGIN= Bruker BioSpin GmbH
$$ ##OWNER= Administrator
$$ $$ E:\/data/COFFEE/nmr/AC1729_SEN00002_9275740_F0xnw3EYGm/30/pdata/1/auditp.txt
$$ ##AUDIT TRAIL=  $$ (NUMBER, WHEN, WHO, WHERE, PROCESS, VERSION, WHAT)
(   1,<2015-08-08 00:04:34.063 -0700>,<Administrator>,<X>,<go>,<TOPSPIN 2.1>,
      <created by zg
	started at 2015-08-08 00:03:28.094 -0700,
	POWCHK enabled, PULCHK disabled,
       configuration hash MD5:
       21 0F 79 D6 B3 7B B4 F6 88 20 88 DB 03 48 BD 9F
       data hash MD5: 64K
       33 0C 10 FD 95 95 CD 0D 2C BB 31 14 C5 BF 2E F5>)
(   2,<2015-08-08 00:04:37.281 -0700>,<Administrator>,<X>,<proc1d>,<TOPSPIN 2.1>,
      <Start of raw data processing
       efp LB = 0 FT_mod = 6 PKNL = 1 PHC0 = 0 PHC1 = 0 SI = 32K 
       data hash MD5: 32K
       9F D7 6A 82 36 F7 57 19 7D 23 9E 92 51 9D 1C 19>)
(   3,<2015-08-08 00:04:37.578 -0700>,<Administrator>,<X>,<proc1d>,<TOPSPIN 2.1>,
      <pk PHC0 = 90.5658 PHC1 = 0 
       data hash MD5: 32K
       89 8A 17 C4 CD C3 B9 29 59 80 AE 90 EF 7F 85 54>)
(   4,<2015-08-08 00:04:37.703 -0700>,<Administrator>,<X>,<proc1d>,<TOPSPIN 2.1>,
      <abs ABSG = 1 
       data hash MD5: 32K
       DB 71 0F 15 FA 83 61 A6 4F F2 8B F9 7E 1E F5 19>)
(   5,<2015-08-08 00:04:37.766 -0700>,<Administrator>,<X>,<proc1d>,<TOPSPIN 2.1>,
      <abs ABSG = 2 
       data hash MD5: 32K
       F6 FB 30 64 83 69 55 A2 BC F6 5F D6 1B 26 0A A2>)
(   6,<2015-08-08 00:04:37.828 -0700>,<Administrator>,<X>,<proc1d>,<TOPSPIN 2.1>,
      <abs ABSG = 3 
       data hash MD5: 32K
       28 8B 49 95 A0 DB A6 5D A2 CA 1D 15 40 4B D7 92>)
(   7,<2015-08-08 00:04:37.891 -0700>,<Administrator>,<X>,<proc1d>,<TOPSPIN 2.1>,
      <abs ABSG = 4 
       data hash MD5: 32K
       EA B4 20 FB EE A0 40 A9 80 40 12 93 DA 2E 6E 48>)
(   8,<2015-08-08 00:04:37.984 -0700>,<Administrator>,<X>,<proc1d>,<TOPSPIN 2.1>,
      <abs ABSG = 5 
       data hash MD5: 32K
       92 BA 5C E0 03 23 93 BC 5A 75 6A 83 B9 65 56 10>)
$$ ##END=
$$ 
$$ $$ hash MD5
$$ $$ D0 26 9D 05 23 9F C3 3E 0C 2A 10 86 D2 83 7B 09
##$RELAX= 
##$RELAX= 
##$RELAX= 
##$RELAX= 
##$RELAX= 
##$RELAX= 
##$RELAX= 
$$ Bruker specific parameters
$$ --------------------------
##$DU= <E:\>
##$EXPNO= 30
##$NAME= <AC1729_SEN00002_9275740_F0xnw3EYGm>
$$ [...]
##$TP= (0..7)
150 150 150 150 150 150 150 150
##$TP07= 0
##$TPNAME0= <>
##$TPNAME1= <>
##$TPNAME2= <>
##$TPNAME3= <>
##$TPNAME4= <>
##$TPNAME5= <>
##$TPNAME6= <>
##$TPNAME7= <>
##$TPOAL= (0..7)
0.5 0.5 0.5 0.5 0.5 0.5 0.5 0.5
##$TPOFFS= (0..7)
0 0 0 0 0 0 0 0
##$TUNHIN= 0
##$TUNHOUT= 0
##$TUNXOUT= 0
##$USERA1= <user>
##$USERA2= <user>
##$USERA3= <user>
##$USERA4= <user>
##$USERA5= <user>
##$V9= 5
##$VALIST= <valist>
##$VCLIST= <CCCCCCCCCCCCCCC>
##$VD= 0
##$VDLIST= <DDDDDDDDDDDDDDD>
##$VPLIST= <PPPPPPPPPPPPPPP>
##$VTLIST= <TTTTTTTTTTTTTTT>
##$WBST= 2048
##$WBSW= 25
##$XGAIN= (0..3)
0 0 0 0
##$XL= 0
##$YL= 0
##$YMAX_a= 503604
##$YMIN_a= -435840
##$ZGOPTNS= <>
##$ZL1= 120
##$ZL2= 120
##$ZL3= 120
##$ZL4= 120
##$ABSF1= 14.98509
##$ABSF2= -5.573092
##$ABSG= 5
##$ABSL= 3
##$ALPHA= 0
##$AQORDER= 0
##$ASSFAC= 0
##$ASSFACI= 0
##$ASSFACX= 0
##$ASSWID= 0
##$AUNMP= <proc_prof1d_extract_pilot.lims>
##$AXLEFT= 0
##$AXNAME= <>
##$AXNUC= <1H>
##$AXRIGHT= 0
##$AXTYPE= 0
##$AXUNIT= <>
##$AZFE= 0.1
##$AZFW= 0.1
##$BCFW= 0
##$BC_mod= 0
##$BYTORDP= 0
##$COROFFS= 0
##$CY= 15
##$DATMOD= 1
##$DC= 0
##$DFILT= <>
##$DTYPP= 0
##$F1P= 0
##$F2P= 0
##$FCOR= 0.5
##$FTSIZE= 32768
##$FT_mod= 6
##$GAMMA= 0
##$GB= 0
##$INTBC= 1
##$INTSCL= 1
##$ISEN= 128
##$LB= 0
##$LEV0= 0
##$LPBIN= 0
##$MAXI= 10000
##$MC2= 0
##$MEAN= 0
##$ME_mod= 0
##$MI= 0
##$NCOEF= 0
##$NC_proc= -8
##$NLEV= 6
##$NOISF1= 0
##$NOISF2= 0
##$NSP= 0
##$NTH_PI= 0
##$NZP= 0
##$OFFSET= 14.98509
##$PC= 1
##$PHC0= 90.5658
##$PHC1= 0
##$PH_mod= 1
##$PKNL= yes
##$PPARMOD= 0
##$PPDIAG= 0
##$PPIPTYP= 0
##$PPMPNUM= 2147483647
##$PPRESOL= 1
##$PSCAL= 4
##$PSIGN= 0
##$PYNMP= <proc.py>
##$REVERSE= no
##$SF= 400.02
##$SI= 32768
##$SIGF1= 0
##$SIGF2= 0
##$SINO= 400
##$SIOLD= 32768
##$SPECTYP= <>
##$SREGLST= <1H.CDCl3>
##$SSB= 0
##$STSI= 32768
##$STSR= 0
##$SW_p= 8223.68421052631
##$SYMM= 0
##$S_DEV= 0
##$TDeff= 65536
##$TDoff= 0
##$TI= <>
##$TILT= no
##$TM1= 0
##$TM2= 0
##$TOPLEV= 0
##$USERP1= <user>
##$USERP2= <user>
##$USERP3= <user>
##$USERP4= <user>
##$USERP5= <user>
##$WDW= 1
##$XDIM= 32768
##$YMAX_p= 405155907
##$YMIN_p= -714226
##$CURPLOT= <Network HP LaserJet P1505>
##$CURPRIN= <$Network HP LaserJet P1505>
##$DFORMAT= <normdp>
##$LAYOUT= <+/1D_H.xwp>
##$LFORMAT= <normlp>
##$PFORMAT= <normpl>
##$SURQMSG= 1
$$ End of Bruker specific parameters
$$ ---------------------------------
##NTUPLES= NMR SPECTRUM
##VAR_NAME=  FREQUENCY,     SPECTRUM/REAL,   SPECTRUM/IMAG
##SYMBOL=    X,             R,               I
##VAR_TYPE=  INDEPENDENT,   DEPENDENT,       DEPENDENT
##VAR_FORM=  AFFN,          ASDF,            ASDF
##VAR_DIM=   32768,         32768,           32768
##UNITS=     HZ,            ARBITRARY UNITS, ARBITRARY UNITS
##FACTOR=    0.250966925370066, 1,           1
##FIRST=     8223.43324360094, -94904,       -8588
##LAST=      0,             9804,            -149991
##MIN=       0,             -714226,         0
##MAX=       8223.43324360094, 405155907,    0
$$ Real data points
##PAGE= N=1
##DATA TABLE= (X++(R..R)), XYDATA
$$ [...]
19609C54389A6900K85690a79083H8060a33205A2856a89898A24795b17077A67989
19598e1329p8172f0373l65958o8081A71003e09394b7370k0206r395H9629J4979
19587A04608l8582J39258b06020j01328I9810a15877D1856c13565Q7402L5766
19577a90397i182p666n18323e6526A11616L1945K21051c8316F0029a48217r423
19566a57640q872B50774b65535A11234a7264C3842j6684a21021e705j21451B46104
19554H2175D001d02917a36019A89779b20686A16465J92129a8153E1667a53062
19543b01068A42635a22444J925J2858j41073D3887a98470C97108C2406a3061n093
19532a8154A29864C8407a02139l31554a47722L7681k0249d5434p9275p6368C4239
$$ y = [354389, 16900, 302590, -179083, 88060, -133205, 12856, -189898, 124795, -217077, 167989, -51329, -129501, -60373, -426331, -494412, 171003, -509394, -27370, -47576, -56971, 89629, 104608, 66026, 205284, -206020, -307348, 99810, -115877, 41856, -313565, -226163, -190397, -9182, -16848, -535171, -56526, 111616, 143561, 364612, -38316, 60029, -148217, -157640, -166512, 250774, -265535, 111234, -17264, 33842, 17158, -121021, -5705, -127156, 246104, 82175, 4001, -402917, -136019, 189779, -220686, 116465, 308594, -18153, 51667, -153062, -201068, 142635, -122444, -120519, -107661, -248734, 43887, -198470, 397108, 32406, -13061, -18154, 129864, 38407, -102139, -433693, -147722, -110041, -130290, -45434, -124709, -201077, 34239]
19520G8353A8266K17386a22962C07103a2420k21387b1218B19525g5993G2106f4526
19508D1129f4779B0344l903P6063m4175i8006l5740B73643f1476B5087a99876
19496c22075e704A52178E0247i603A11318A4946e45103b10926a8671n5003k3213
19485i6887q0088A90657b24964o1606B06437a49614j91997A63259d6734A93907
19474A44360a65660C31449a53176G1119A1270b8998D2531B1113J80029G0573A4983
19462e916m4615B19004b49901D2642a61552j42828Q2759b2514k97754a06728K1187
19451h5541d2178n594j81116I171d1156B75559h5024n6772J9320D9011a70540
19439d8651J5098j04048A23267C8109c43979a14707k6032n7204k46808a32433
$$ y = [78353, 18266, 235652, -122962, 307103, -12420, -233807, -21218, 219525, -75993, 72106, -64526, 41129, -64779, 20344, 16441, 92504, 48329, -98006, -133746, 273643, -61476, 25087, -199876, -322075, -5704, 152178, 50247, -9603, 111318, 14946, -545103, -210926, -18671, -73674, -96887, -176975, 190657, -224964, -286570, 206437, -149614, -341611, 163259, -46734, 193907, 144360, -165660, 331449, -153176, 71119, 11270, -28998, 42531, 21113, 201142, 70573, 14983, -5916, -50531, 219004, -249901, 42642, -161552, -304380, -221621, -22514, -320268, -106728, -85541, -42178, -47772, -228888, 9171, -41156, 275559, -85024, -141796, -122476, 49011, -170540, -48651, -33553, -137601, 123267, 38109, -343979, -114707, -140739, -197943, -444751, -132433]
19428A14179f691k01660A36526c0452G0028N7476b4832j13503O2621j02794a6073
19416c90848E1182b47466a11923C29561b37358M0502b0966D6977b04854j4456
19406b19310C5367a18471C5333J2584R6309i4148F8146a48834d3279B46647a45023
19394I6891a32351A81887A8820a23840G4855a14654j52932Q4195g1290j09836
19384a81126r8213a25717N6500b7862G7732M5409b30482h1038k9846J7620B6882
19372A45693a62317A49884j3288C5497b68561d5887A98782A8533b54961L4956
19362b20005G0704e6767I6967F151e973A50265a44719j52257e8207C16717c08976
19350c8677B7509Q1150M0050c96903H0939i1266J7282g244n6831E2954d2200B04537
$$ y = [114179, -6691, -208351, 136526, -30452, 70028, 127504, -24832, -138335, -75714, -178508, -16073, -390848, 51182, -247466, -111923, 329561, -237358, -196856, -20966, 46977, -204854, -219310, 35367, -118471, 35333, 47917, 144226, -94148, 68146, -148834, -43279, 246647, -145023, 96891, -132351, 181887, 18820, -123840, 74855, -114654, -267586, -183391, -71290, -181126, -279339, -125717, -69217, -27862, 77732, 123141, -230482, -81038, -110884, -93264, 26882, 145693, -162317, 149884, 136596, 35497, -268561, -45887, 198782, 18533, -254961, -220005, 70704, -56767, 96967, 6151, -5973, 150265, -144719, -296976, -58207, 316717, -308976, -38677, 27509, 108659, 148709, -396903, 80939, -91266, -73984, -7244, -64075, 52954, -42200, 204537]
19337B656N1516J29629a25703C27207J06599c45971r4593b2729k37286o5175A87246
19325A00921h5611G3918b31558o9988B62367f9985A3031L09039A10985a5335j11255
19314a26590j77477B40384J0231b98093J33408k07150a37366j68117H3124R2358
19304A75482B1449a51516j8985D5400A6462b62013i9989p3456d3370A43938d44798
19292A4270a03767b095k85657b7648m36436a81724A54994l352P8118F3978b10786
19280e0340N412j6713k26106r249K0559I6767d2966p1350j7156k32351d4497q8540
19268a33037j16997E8839a31194k9254b1802C3218c18680M5526B73835C6470b09077
19256a52612C62492b1787A64337m6687b46473B09083a78752P6296k50247A57410
$$ y = [2656, 54172, 183801, -125703, 327207, 433806, -345971, -440564, -22729, -260015, -325190, 187246, 100921, -85611, 73918, -231558, -301546, 262367, -69985, 13031, 322070, 110985, -15335, -126590, -304067, 240384, 250615, -298093, -164685, -371835, -137366, -305483, 83124, 175482, 21449, -151516, -170501, 45400, 16462, -262013, -99989, -173445, -43370, 143938, -444798, 14270, -103767, -2095, -287752, -27648, -464084, -181724, 154994, 151642, 229760, 63978, -210786, -50340, -44928, -61641, -287747, -296996, -276437, 96767, -42966, -114316, -131472, -363823, -44497, -133037, -250034, 58839, -131194, -160448, -21802, 33218, -318680, -273154, 273835, 36470, -209077, -152612, 362492, -21787, 164337, 117650, -246473, 209083, -178752, -102456, -352703, 157410]
19245a36878l774B5812Q4070a68729C30321A40439b32862P6239h562l8423l1795
19234g8780j267D8378J42155a92170l01420C5932c39804B99349I820b39922a15891
19222I0118K17548a93127b2658H9220J99837b19151p6072B71991j33018b42459
19211A39085o8718k118B7136a46894b5566A4091d52133c6243n7927j05070C4715
19199a55005A39314j5629h4859k80329A89396b96092D7937O899a57958c3796q3310
19188a17106B686J12374J08438b2866D0108e0940A35762c7077a517n2700l7268
19177i1485D4610a57410l80201J81265a44559j33936d3473E8407h1696n6577B80527
19165b21521b5164l38111a09553A10241a69887A91662a06295B00596c19539A18149
$$ y = [-136878, -140652, 25812, 109882, -168729, 330321, 140439, -232862, -156623, -8562, -46985, -78780, -80047, 48378, 190533, -192170, -493590, 35932, -339804, 299349, 9820, -239922, -115891, 90118, 307666, -193127, -22658, 89220, 289057, -219151, -295223, 271991, 138973, -242459, 139085, 70367, 68249, 27136, -146894, -25566, 14091, -452133, -36243, -94170, -199240, 34715, -155005, 139314, 123685, -84859, -365188, 189396, -296092, 47937, 54836, -157958, -33796, -117106, 2686, 115060, 223498, -22866, 40108, -50940, 135762, -37077, -1517, -54217, -91485, 44610, -157410, -537611, -356346, -144559, -278495, -43473, 58407, -81696, -138273, 280527, -221521, -25164, -363275, -109553, 110241, -169887, 191662, -106295, 200596, -319539, 118149]
19154D726R4233l4354J54415G4058E611k113b48030F14292C8020h2499L2851F3573
19141a60762m7078G3908K6800e5152k39311P2237A36642b25227k0483C3110m66
19130C2644c90926a4192j95003M8728j79833A15090e3688j49443b7910n2250p654
19119h7814A02760J7984g1653l34922i5006K0946k3420c2878B4690K41910C8760
19107a65105B04957c76742B98734a59609N3252J2958J5483j82232B55191d8122
19096c28k32711B00427a90658Q3111a3938l48443a1409k60063a00759p6987I965
19084b78359a2155J238B16366a00410J2456k84012a66354j25793A5505a55881
19073A89270a10077e2773j52125M2596A25448a6669A60827a9114k28963R903B9860
$$ y = [4726, 98959, 64605, 219020, 74058, 5611, 3498, -248030, 614292, 38020, -82499, -49648, 63573, -160762, -207840, 73908, 100708, -55152, -294463, -222226, 136642, -225227, -245710, 33110, 32644, -390926, -14192, -209195, -160467, -340300, 115090, -53688, -203131, -27910, -80160, -87814, 102760, 120744, -71653, -406575, -95006, -74060, -97480, -32878, 24690, 266600, 38760, -165105, 204957, -376742, 298734, -159609, -106357, -93399, -77916, -260148, 255191, -48122, -328, -233039, 200427, -190658, -107547, -13938, -362381, -11409, -271472, -100759, -177746, 9965, -278359, -12155, -10917, 216366, -100410, -87954, -371966, -166354, -292147, 15505, -155881, 189270, -110077, -52773, -204898, -162302, 125448, -16669, 160827, -19114, -248077, -238174, 29860]
19061A50026a13966p3588G8756A4754P6903L2604a85190j64761g6849p2173I0285
19049D0495c25653I7034b04119c641l24521g895r9897Q700l6567A59341h6906
19037H1544a17430e5750A80756J20864a9174I1229a16075k8526b2953C7821c01083
19025B76563a78618A32290J14720j16282J00505k4813b28709B15933i9541m257
19015a03798n371C27402d29728A28120b21014O0190b0522l02800Q0766g5363A13040
19003D6317a05263H9107R4305E1911b79049J38656j02538H1519j936Q1195a37719
18991a54697A90286d56833B6660c4501o840A4350a08166M6655k6913n8054A193
18979a48672H8741R7103j6092E3426c9106A04166b23602A57690p7208b07792J02568
$$ y = [150026, -113966, -187554, 78756, 14754, 91657, 124261, -185190, -349951, -76849, -149022, 90285, 40495, -325653, 97034, -204119, -3641, -328162, -7895, -107792, -99092, -135659, 159341, -86906, 81544, -117430, -55750, 180756, 301620, -19174, 91229, -116075, -144601, -22953, 37821, -301083, 276563, -178618, 132290, 247010, 130728, 231233, 206420, -228709, 215933, -99541, -103798, -109169, 327402, -429728, 128120, -221014, -160824, -20522, -323322, -242556, -75363, 113040, 46317, -105263, 89107, 183412, 51911, -279049, -140393, -242931, 81519, 79583, 160778, -137719, -154697, 190286, -456833, 26660, -34501, -41341, 14350, -108166, -61511, -88424, -146478, 1193, -148672, 88741, 185844, 169752, 53426, -39106, 104166, -223602, 157690, 80482, -207792, -105224]
18968a05224A16313K4586o7882j9758J32245G7980K179J752i3706H878M67K48026
18956B57371a13483a7369q7427D2938q263j2347N4042c3833D239c8930C11309
18944B58807j05928b00518A05312C0709b9997k83895f7295C8002J18398K53684
18934D10084e24921a66534K2642j63058b65F6830e952C2425n214N3058c3335J1711
18922b1624q578j8153h63C2189a1054B94748F1627b964j3402A430a3610k7612
18910d1222k54879A391b707A35824n8686b61009g9017E1803J78101c07856A17038
18898d3065o2981E2474Q6157b09798D8270O621b76518d6743E503K5065a14021
18886a41122p3988f4089J6340j32387a7794E9014b26764h279r625m6583G9339
$$ y = [-105224, 116313, 140899, 73017, 53259, 185504, 77980, 80159, 81911, -93706, 8878, 9345, 257371, -113483, -17369, -104796, 42938, 34675, 22328, 76370, -33833, 4239, -38930, 311309, 258807, 152879, -200518, 105312, 30709, -29997, -313892, -67295, 38002, 156400, 410084, -524921, -166534, -143892, -306950, -265, 66830, -5952, 32425, 27211, 80269, -33335, -21624, -30202, -48355, -863, 32189, -11054, 294748, 61627, -2964, -16366, 1430, -13610, -41222, -296101, 1391, -2707, 135824, 77138, -261009, -79017, 51803, 229904, -307856, 117038, -43065, -106046, 52474, 138631, -209798, 48270, 54891, -276518, -46743, 5503, 30568, -114021, -141122, -215110, -64089, -47749, -180136, -17794, 59014, -226764, -8279, -17904, -64487, 79339]
18874a26241q9466a07836M4475h250k58891M1216c7390C5276b86742I1301a59314
18862B9253A0994a35812H4811c31922c0721C42362B7996d02833B20221i2941B09513
18850c32608B8503b45676f9493l5780j00013C7452a61954H6805K5472P0238a18853
18838a30207G509M3258a47365C03214e01244A33391K30170g7059j63j21798A63500
18826c40058f9468B10964a26772A18729d0472l01912B78820A29957E3961Q8634
18816A42595b29396q1640a21055D4396c07470B3592g5078k57973O8458g2671k5784
18805i8455C4435b82802A20440C766L45790a41178I7377a53453A81332c5564I2855
18793a53199E1023O1124a81701f620r3391d0629D7746K1300a0535I8175a28309
$$ y = [-126241, -215707, -107836, -63361, -8250, -267141, -225925, -37390, 35276, -286742, 91301, -159314, 29253, 10994, -135812, 84811, -331922, -30721, 342362, 27996, -402833, 220221, -92941, 209513, -332608, 28503, -245676, -69493, -105273, -205286, 37452, -161954, 86805, 112277, 182515, -118853, -130207, 7509, 50767, -147365, 303214, -501244, 133391, 363561, -77059, -77222, -199020, 163500, -340058, -69468, 210964, -126772, 118729, -40472, -342384, 278820, 129957, 53961, 142595, -229396, -311036, -121055, 44396, -307470, 23592, -75078, -333051, -264593, -72671, -98455, 34435, -282802, 120440, 3766, 349556, -141178, 97377, -153453, 181332, -35564, 92855, -153199, 51023, 112147, -181701, -6620, -100011, -40629, 47746, 69046, -10535, 98175, -128309]
18781E9196N3551J04786g2289A61412A7595f4466j82004m4367J19742j1882j23457
18770c06434f1218m8897b0870n6149A11712a41502J6305o3812F795K4463J61846
18759A93104E740a4931G8433a31669b3557j10975a6757A6753a65844j44785A89457
18747a70317l767d9055D5108i4283r9782J6468O7698E7285J01767J2105c29487
18735c20113Q1971a442q7277n3239I6266c41614J41712b8466p0055j06265f1595
18723a44788L4957J5203j47577a12539A34423P3836b62181G979R3703a40694A64881
18711B09787N0299C6644J6593h5920o3835q6254d4378j28004C4869A3754d5406
18699h0834j07031r2467J24709m2283F5547a69660I2000N1556C1526A0965O0032
$$ y = [59196, 112747, 217533, -72289, 161412, 17595, -64466, -246470, -290837, -171095, -182977, -306434, -61218, -110115, -20870, -77019, 111712, -141502, -125197, -189009, 6795, 31258, 193104, 5740, -14931, 78433, -131669, -23557, -134532, -16757, 16753, -165844, -310629, 189457, -170317, -174084, -49055, 45108, -94283, -194065, -177597, -109899, 57285, 159052, 171157, -329487, -320113, -238142, -1442, -88719, -141958, 96266, -341614, -199902, -28466, -98521, -204786, -61595, -144788, -109831, -94628, -242205, -112539, 134423, 208259, -262181, 7979, 101682, -140694, 164881, 209787, 260086, 36644, 53237, -85920, -149755, -236009, -44378, -172382, 34869, 13754, -45406, -80834, -187865, -280332, -155623, -197906, 65547, -169660, 92000, 143556, 31526, 10965, 70997]
18688G0997g0366m2545b9780o5851L9421A88966G9741a90058B16069D4606K21500
18677B66106a40431l83715F7011a28046L1958A95689n2552c9097l4482H2253A9368
18665a15452j34666I0643b50964A36494n5269c1892m0684L3084j12088n2927B97809
18653C4627a79239A27878a87373A63762P389b30838N0263A78459L2787H837e4042
18641C18817F1461a48194d1326j05132A08881a56522I1519a18462r2176A79906
18630A69328e4062j64637j42911a76611A40375c61881h5092H9834J10162d566
18619G7609J5495l4878a43831A82143b42507D1636a28838a3695l8578B12097o0731
18608A51366a08786J4257B6519J05005B2181b66451M5346G9014J364d5892l7348
$$ y = [70997, -70366, -112911, -29780, -95631, -56210, 188966, 79741, -190058, 216069, 44606, 266106, -140431, -524146, 67011, -128046, -96088, 195689, 143137, -39097, -73579, 82253, 19368, -115452, -250118, 90643, -250964, 136494, 81225, -31892, -72576, -39492, -151580, -204507, 297809, 34627, -179239, 127878, -187373, 163762, 171151, -230838, -180575, 178459, 211246, 8837, -54042, 318817, 61461, -148194, -41326, -146458, 108881, -156522, 91519, -118462, -210638, 179906, 169328, -54062, -218699, -361610, -176611, 140375, -361881, -85092, 89834, 199996, -4566, 77609, 93104, 58226, -143831, 182143, -242507, 41636, -128838, -13695, -52273, 212097, 151366, -108786, -94529, 26519, 131524, 22181, -266451, -221105, 79014, 80378, -45892, -83240]
18597h3240b1500A03348b7831l37106J52247O8675f7613b830E7780c6973j19076
18586a56049J8220A13936b31016A12425g730E9464M6166a03161k1699N3699m7825
18575a18986A37750D8110J00422F2707J53352o1584b73214d4047H298a95828E5886
18563a26419N5988j62146A99759b1381k02205j18183B27515e9264E6684a38240
18552a68567j04593o7449J66504C14676a86052A5784J72823h0400F0686b37988
18541C08b33475C9183a14297C7702K30242b04083b9282A85501B7251g3211G0172
18529c42m50439a335j62326O8886L4596j70758M0404j56613f1890A83726O3232
18518B46958c3294G4295f2095q7225B608e0881j34691A49466d8128j17457B54264
$$ y = [-83240, -21500, 103348, -27831, -364937, -212690, -144015, -67613, -2830, 57780, -36973, -156049, -137829, 113936, -231016, 112425, -7730, 59464, 105630, -103161, -124860, -71161, -118986, 137750, 48110, 148532, 62707, 216059, 154475, -273214, -44047, 8298, -195828, 55886, -126419, -70431, -232577, 199759, -21381, -223586, -341769, 227515, -59264, 56684, -138240, -168567, -273160, -340609, -174105, 314676, -186052, 15784, 188607, -80400, 60686, -237988, 308, -233475, 39183, -114297, 37702, 267944, -204083, -29282, 185501, 27251, -73211, 70172, -342, -450781, -1335, -163661, -94775, -60179, -230937, -190533, -347146, -61890, 183726, 246958, -33294, 74295, -62095, -149320, 2608, -50881, -185572, 149466, -48128, -165585, 254264]
18506H3987e8692F2093b52282a12852B0468N1070h6638O212K0758a6979m0607
18495e7586A27694A1146b17440B47083b33789R3869m6517f7475A27314l8081C1963
18483A11296J65610d2603r2576j75500J25840M2572C5119K09222i2598K3103b9988
18471a05392A13198k7079d936r967l36422a10891b1930j70776o0574A87780a43355
18459G3015a16335k45342i1827j21646d4871F2354a1113n8499K6922A95309a1044
18447c9692k85699C57546C5671C58b64543h5578A41235a47538K8677E3180c65048
18435a9924A7137N7392J21886q0040a01718B76286a00442n8331E5471b06520A03802
18423A01101g1162K9355j77394B11687G625k41M0798N9127E3108b12558P4442
$$ y = [83987, -58692, 62093, -252282, -112852, 20468, 71538, -86638, -80426, -59668, -16979, -57586, 127694, 11146, -217440, 247083, -233789, -139920, -186437, -67475, 127314, 89233, 31963, 111296, 276906, -42603, -135179, -310679, -184839, -142267, 35119, 244341, -92598, -69495, -29988, -105392, 113198, 86119, -4936, -14903, -351325, -110891, -21930, -192706, -253280, 187780, -143355, 73015, -116335, -361677, -91827, -213473, -44871, 62354, -11113, -69612, -42690, 195309, -11044, -39692, -325391, 357546, 35671, 358, -264543, -85578, 141235, -147538, -118861, 53180, -365048, -19924, 17137, 74529, 196415, 116375, -101718, 276286, -100442, -158773, 55471, -206520, 103802, 101101, -71162, -41807, -219201, 211687, 7625, 7384, 48182, 107309, 53108, -212558, -138116]
18412a38116c9267l88050K00854B41330H6176J43540F7078a80455d667A64441
18401a55956L1532E2479a58712G4739c24259i9158L6337k90769f6484A71040k8222
18390A42818d1745N526E5803a52486A62761c71296G4592f1039C3814a20008n1549
18379a71557O6410K3786j27490G1564e1230mN76A97902c0702J5130k60867A76174
18366H1128b2131k28504j103e529n4513j14014c1838A82090a38449A43746a13921
18354G043b36392g6712j42889D394a24004E7687a45655B42462h7625B89494C6751
18342A07159g8972B54495p784c0449j5500A95862a84492A4807J38679h2027b8714
18330b09553j00712A4960k106a27121I3750a47171j08441A31884e76D05519j45689
$$ y = [-138116, -39267, -427317, -226463, 241330, 86176, 229716, 67078, -180455, -4667, 164441, -155956, -124424, 52479, -158712, 74739, -324259, -99158, -62821, -353590, -66484, 171040, 142818, -41745, -36219, 55803, -152486, 162761, -371296, 74592, -61039, 33814, -120008, -171557, -105147, -81361, -208851, 71564, -51230, -51234, -50658, 197902, -30702, -15572, -276439, 176174, 81128, -22131, -250635, -251738, -5529, -60042, -174056, -31838, 182090, -138449, 143746, -113921, 7043, -236392, -76712, -219601, 4394, -124004, 57687, -145655, 242462, -87625, 289494, 36751, 107159, -78972, 254495, 246711, -30449, -45949, 195862, -184492, 14807, 153486, -82027, -28714, -209553, -310265, 14960, 12854, -127121, 93750, -147171, -255612, 131884, -576, 405519, 259830]
18319B59830h1754l997L9236j76344O9272G4882j7377a09298n33J1127b6894A2631
18306g8693H4064J18938a42142r080L0841M5166j28998g6071q8339k65047A44836
18294B63698q5818c25629a6604A17214i1553A43500b41829d5974B04125b88115
18283H9341e310j18867e6289a2333j26045m997a1500k74201a24251H9040k5654
18272F3386a04283l0487B01777G9949P3461c30164B8166K19066C9040J86597H4766
18260B4411P60L1994b37820A08745b66654J04329I275f6925C37287a17053A07078
18248F5399A4811b96910A43077F2871i8991m5169M948A50832C5153J8607R6786
18237A50546b2545r0120c8392k89277O4029Q9699G5483C0934c04554J22538j32489
$$ y = [259830, -81754, -85751, -46515, -222859, -153587, 74882, 57505, -109298, -109831, -98704, -26894, 12631, -78693, 84064, 203002, -142142, -151222, -120381, -75215, -204213, -76071, -164410, -429457, 144836, 263698, 177880, -325629, -16604, 117214, -91553, 143500, -241829, -45974, 204125, -288115, 89341, -5310, -124177, -56289, -12333, -138378, -143375, -11500, -285701, -124251, 89040, 63386, -104283, -134770, 201777, 79949, 153410, -330164, 28166, 247232, 39040, 225637, 84766, 24411, 25171, 57165, -237820, 108745, -266654, -162325, 9275, -66925, 337287, -117053, 107078, 65399, 14811, -296910, 143077, 62871, -98991, -144160, -139212, 150832, 35153, 53760, 150546, -22545, -112665, -38392, -327669, -263640, -173941, 75483, 30934, -304554, -182016, -314505]
18226c14505a38525f9185A46430p0984F556Q3367L28143A70133A9206b96969B9263
18214G0670L6690d00852j0574K7202C9420i979n490A73800a74311H2010b14570
18202a39719O5816j50271kJ485B97368i585B80284h2486q9215p0427A61297E9640
18189b08967b7663E0502h7643b1822B3172K25051f2435J1349l4649B50693C563
18177a02516B6726C279M0498d8231k87168N6638e5872E2692Q8158a75848A61590
18165c1707B80311a07134d204k640q1434D9501J88138a07956k22880A09535k3558
18154H5977l9524c10927c9481H4143a94952k06314h386n5593q2601A63259a4661
18142A63793b97088a03610n4304A57487a96028m7857A53991d86912A9411b65329
$$ y = [-314505, -138525, -69185, 146430, 75446, 6556, 89923, 418066, 170133, 19206, -296969, 29263, 70670, 107360, -400852, -411426, -384224, 39420, -9979, -15469, 173800, -174311, 82010, -214570, -139719, -73903, -224174, -224176, -222691, 297368, -9585, 280284, -82486, -171701, -242128, 161297, 59640, -208967, -27663, 50502, -87643, -21822, 23172, 248223, -62435, -51086, -85735, 250693, 3563, -102516, 26726, 3279, 43777, -48231, -335399, -278761, -55872, 52692, 140850, -175848, 161590, -31707, 280311, -107134, -4204, -6844, -88278, 49501, 237639, -107956, -330836, 109535, 85977, 46453, -310927, -39481, 84143, -194952, -401266, -8386, -63979, -146580, 163259, -14661, 163793, -297088, -103610, -157914, 157487, -196028, -243885, 153991, -486912, 19411, -265329]
18131H6216b60369c0369A34523a85857h5467j22086B40764b20118B3898M0396
18121F4294i5080A95395D1040D065J0713b5723j74346E4741b23309J10466l53185
18110d66028c6617i009I4879c7963E2347i974j47648K247A88693J4278c7536H5895
18097b26036A1519J96931F1750b25613p4597A04210a25295j20788h2601B4577
18086D4031c46031I7930L90775A75399c4612B48613i8324D6964h2776A56521n5338
18075A01183b11940c1413k01048O7024A227g1647l81861a44237E0243b73467d9199
18063B15267n2655a70269a1366C2803h7137K9295K7731k17776A21293b8870B9033
18051B35869k6002a89973m40J7448L0303n0343A40427o8195f2358A011a97859
$$ y = [86216, -260369, -30369, 134523, -185857, -85467, -207553, 240764, -220118, 23898, 64294, -95080, 195395, 41040, 4065, 14778, -25723, -200069, 54741, -223309, -112843, -466028, -36617, -9009, 94879, -37963, 52347, -9974, -157622, -155375, 188693, 202971, -37536, 85895, -226036, 11519, 208450, 61750, -225613, -300210, 104210, -125295, -246083, -82601, 24577, 44031, -346031, 97930, 488705, 175399, -34612, 248613, -98324, 46964, -82776, 156521, 101183, -211940, -31413, -232461, -165437, 1227, -71647, -453508, -144237, 50243, -273467, -49199, 215267, 162612, -170269, -11366, 32803, -87137, -57842, -30111, -247887, 121293, -28870, 29033, 235869, 209867, -189973, -190413, -172965, -142662, -193005, 140427, 72232, -62358, 1011, -197859]
18039G7960b88893d8303j91313A29185b1635o7248B60826f7582A512J53490l5916
18028A19086D2252K28960j16626I71c07491a53496B33548F7547b25112a8105j22053
18017a40158E121K6814g501A26543P3246G7124b74346P7333E8072d8994n3828
18006a02822F1445J43321N0229A16183a71456G1438c88399C75256a6191B00919
17995b15475A05651b18893B0785J47404b28643B61386d2741j66480A37045a15381
17984B7126h5546b4180m2931I8923c1752B32146a48028a6218B38239q9500K63498
17973D12237A88871b00166p812a653k92325C6871R4717N4675a53356B63357j3605
17962B49752L1196B221N5754a07403e3607A47514e5699B5574J28927J24140A18901
$$ y = [77960, -288893, -48303, -239616, 129185, -21635, -88883, 260826, -67582, 1512, 155002, 119086, 42252, 271212, 154586, 971, -307491, -153496, 233548, 67547, -225112, -18105, -140158, 5121, 31935, -7501, 126543, 199789, 77124, -274346, -197013, 58072, -48994, -102822, 61445, 204766, 254995, 116183, -171456, 71438, -388399, 375256, -16191, 200919, -215475, 105651, -218893, 20785, 168189, -228643, 261386, -42741, -209221, 137045, -115381, 27126, -85546, -24180, -67111, 98923, -31752, 232146, -148028, -16218, 238239, 148739, 412237, 188871, -200166, -207978, -1653, -293978, 36871, 131588, 186263, -153356, 263357, 249752, 280948, 2221, 57975, -107403, -53607, 147514, -55699, 25574, 154501, 278641, 118901]
17950B19691a0006j13110A49174c5598B48487E1243i7744H8936m4101a72596C70396
17938a29946A98984h2674B5419K54717H3886Ac1220A98318E4813A5201b99504
17926h7269k42264H1967L113P5996c1524B31466d1360k90914a61142E1932b09935
17914H2476a06630o2931B7845a61015A46904i5532j70083a03810o6965A13346
17903a89518C80437a8775A90P5130M4692b91022a39270e6492k23932a17718d0893
17891A88376i682A77480K49726i8193l56879a72191I817b7555j5428E7489c1672
17879C85829a49234N9268k9531L9473A90882G6842R018a66734j2905g4628B89452
17867B4621b346m7879j56015e4175O571A9360b07443Q8703p6309g7090j57200
$$ y = [219691, -10006, -123116, 149174, -35598, 248487, 51243, -97744, 88936, 44835, -172596, 370396, -129946, 198984, -82674, 25419, 280136, 83886, 1, -31220, 198318, 54813, 15201, -299504, -87269, -329533, 81967, 85080, 161076, -31524, 231466, -41360, -332274, -161142, 51932, -209935, 82476, -106630, -169561, 27845, -161015, 146904, -95532, -265615, -103810, -170775, 113346, -189518, 380437, -18775, 190, 75320, 120012, -291022, -139270, -56492, -280424, -117718, -40893, 188376, -9682, 177480, 427206, -98193, -455072, -172191, 9817, -27555, -42983, 57489, -31672, 385829, -149234, -89966, -119497, -80024, 190882, 76842, 85860, -166734, -179639, -74628, 289452, 24621, -2346, -50225, -206240, -54175, -47604, 19360, -207443, -118740, -195049, -77090, -234290]
17856b34290O9741e6909H58J01170b42118j25141A25255a10129E2613a78780D5127
17844B06425a82700o612A67239O5290c1430E2211G801d43325D6776a44225G561
17832b86709A25260D6072h5706B20353K21959a25342a2400F2929A70a42870j78447
17821c21317J28561q68a2803A21826A302K1340n847a40047C80969D9102a30804
17809b11903i4394C09248E2787J41633a32955B03152D3968a67339A71673D5237
17798B55477f9073B63434H3145P9088a25978B72491G2592J84606q5989E9901c1432
17786i5094B6860b7142r1731j68787B67474I2672i8627p0669G2600l5083N9009
17775I6526a86938e9796A90363l7514a16578F4942a69718j03652A11905a16643
$$ y = [-234290, -164549, -56909, 858, 102028, -242118, -367259, 125255, -110129, 52613, -178780, 45127, 206425, -182700, -189312, 167239, 232529, -31430, 52211, 7801, -443325, 46776, -144225, 7561, -286709, 125260, 46072, -85706, 220353, 442312, -125342, -12400, 62929, 170, -142870, -321317, -192756, -193624, -12803, 121826, 1302, 22642, 16795, -140047, 380969, 49102, -130804, -211903, -94394, 309248, 52787, 194420, -132955, 203152, 43968, -167339, 171673, 45237, 255477, -69073, 263434, 83145, 162233, -125978, 272491, 72592, 257198, 171209, 59901, -31432, -95094, 26860, -27142, -118873, -287660, 267474, 92672, -98627, -169296, 72600, 37517, 96526, -186938, -59796, 190363, 152849, -116578, 64942, -169718, -273370, 111905, -116643]
17764H6625b39199d9850j95228A67956J9490q5684a5234j92498B261d7076K1202
17753b5874P517B9915b78594A62585p831g1652G9325P4484E8231Q0405k7515e0883
17740C3022P227J18281l5793h365p9426c7598j03923d3141B02673c15870A33152
17728e5199E8627h1518k4241B32552g8545D7576P2592a33517A96835a58965b6365
17716E345J40031b57087C11109E4070a43431p9208A42417i0872A54926j2139o6414
17705G6373k0466j6769K31673r7255H2098f0182B49534b55056A07281C760R7379
17694A01139h2597B27989a12844m6061P088d7101k0256A3825g4127K751A46890
17682D4370J94511a3780C9813a9200o314j44417o6007H407P5084J34392D8203
$$ y = [86625, -239199, -49850, -245078, 167956, 187446, 101762, -15234, -207732, 2261, -47076, -25874, -18357, 29915, -278594, 162585, 154754, -71652, 79325, 153809, 58231, 138636, 111121, -50883, 33022, 40249, 158530, 122737, -8365, -87791, -37598, -141521, -43141, 202673, -315870, 133152, -55199, 58627, -81518, -105759, 232552, -78545, 47576, 120168, -133517, 196835, -158965, -26365, 5345, 145376, -257087, 311109, 54070, -143431, -222639, 142417, -90872, 154926, 142787, 76373, 55907, 39138, 270811, 173556, 82098, -60182, 249534, -255056, 107281, 3760, 101139, -82597, 227989, -112844, -158905, -151817, -47101, -67357, 13825, -74127, -71376, 146890, 44370, 238881, -13780, 39813, -19200, -25514, -169931, -235938, 8407, 83491, 217883, 48203]
17670A82643O5431a87204A08721L17390E4999M1176g8543p5665J7105C13750a76696
17658a14805k7462j47237C59205F7366a15508A5897c35348a21979j12884N4828
17648a80035A11735a13313J3077p1931B34520K03630f60B07506h890I2277g8889
17636e9531B240i0787l9384B76014b00138F3147J20886L96137b36235A061K41926
17625B42987G6411f1191l7023C34534D2359d0575j91057d3374A61400G001k452
17614D549N1623b66429g9478A28184k902J50740c38062A64150J59601D5863k2577
17603B3286K04840k3036q6297b26507D4159Q6149b43131I4027G255a18005p1881
17592a89886D1962f7189j8586B90665e4698J0506r2022A32172D7290a98505M8701
$$ y = [182643, 248074, -187204, 108721, 426111, 54999, 96175, -78543, -154208, -137103, 313750, -176696, -114805, -142267, -289504, 359205, 67366, -115508, 15897, -335348, -121979, -234863, -180035, 111735, -113313, -100236, -172167, 234520, 438150, -660, 207506, -8890, 92277, -78889, -59531, 2240, -90787, -130171, 276014, -200138, 63147, 184033, 580170, -236235, 1061, 242987, 76411, -61191, -98214, 334534, 42359, -40575, -231632, -43374, 161400, 7001, 4549, 56172, -266429, -79478, 128184, 125282, 276022, -338062, 164150, 323751, 45863, 23286, 228126, 205090, 118793, -226507, 44159, 130308, -243131, 94027, 7255, -118005, -189886, 41962, -67189, -85775, 290665, -54698, -44192, -136214, 132172, 47290, -198505, -149804]
17581a49804M3734H4289H751e6656C78610i1366A50175a25104B5511h5520c641
17569E3433O91K31204a00485B40833a0992F5897d2534G215L29079H5105j5878
17558F9227b13577A62762a63485D3581h7321k9641E9923J57470f151I2986f2033
17546C21066d1136A25317J70938D8066a72192M5982A1101C640a04467O506G3976
17534F8080L06820b09338M195A34920i556a548k9624A95182a89670a1067A56882
17522f1679J4279D26184I827Q731J34878B9362K50233A361e3190j69341A6284
17510E6670e5501l0093C3192K74042A41678d6139k46508A43362J17968H5412a05402
17498C6208L17472A21554A1510c11443A40443m5859e0431n8922F497L82519A77079
$$ y = [-149804, -106070, 84289, 8751, -56656, 378610, -91366, 150175, -125104, 25511, -85520, -3641, 53433, 54124, 285328, -100485, 240833, -10992, 65897, -42534, 7215, 336294, 85105, 69227, -213577, 162762, -163485, 43581, -87321, -116962, 59923, 217393, -6151, 92986, -62033, 321066, -41136, 125317, 296255, 48066, -172192, -126210, 11101, 3640, -104467, -97961, 73976, 68080, 374900, -209338, -205143, 134920, -9556, -1548, -31172, 195182, -189670, -11067, 156882, -61679, -47400, 426184, 9827, 18558, 153436, 29362, 279595, 1361, -53190, -222531, 16284, 56670, -55501, -85594, 33192, 307234, 141678, -46139, -292647, 143362, 261330, 85412, -105402, 36208, 353680, 121554, 11510, -311443, 140443, 94584, -50431, -109353, 6497, 389016, 177079]
17486E0533J97539a84429A27879K77508j04707A21197g5154A28368g2232A29548
17475A98829a01285A9840a00336D87N5411N1621C7460i0988F776K92731r2187
17464B07320O5535H4924b9468e392A93158N9630m1958J33518A42046M5213J77183
17453C64442j61490H9342M8932k0915A633M3640J20757a52539B73683m2599B6537
17441I212M9846B6200Q5080n2488K9980j2630K12341J81890c69B69217j00245
17430A68972O5726N1141H0688J90019A22446J09579r9395k5973O9578k6443K03944
17419C53736p5833B413K00235O2863J7752r3314C3886K64259j2621j04231p0565
17408A10728J15832l4365a47295A63091l1790g4072A59809K7944O1461A7978R5892
$$ y = [50533, 248072, -184429, 127879, 405387, 300680, 121197, -75154, 128368, -72232, 129548, 198829, -101285, 19840, -100336, 487, 55898, 107519, 37460, -90988, 6776, 299507, 207320, 272855, 84924, -29468, -5392, 193158, 252788, 210830, 344348, 142046, 187259, 364442, 202952, 89342, 138274, 117359, 1633, 45273, 166030, -152539, 273683, 231084, 26537, 9212, 59058, 26200, 111280, 58792, 88772, 76142, 288483, 470373, -369, 269217, 168972, 234698, 285839, 80688, 270707, 122446, 232025, 132630, 106657, 176235, 149792, 353736, 277903, 2413, 202648, 265511, 283263, 189949, 33886, 298145, 285524, 181293, 110728, 226560, 192195, -147295, 163091, 131301, -74072, 159809, 187753, 249214, 17978, 113870]
17397A13870b9019B68281A5131b18654B77946L7129m6094c1935A61811K18366
17387C80177E7477J59005P6995L7763k0185q7165a37295B36198C8111a7750A8877
17375A61874E3807Q4819a4368I56K89914c23797a09866q586C12697r4635a4945
17363i4472n1706B18975a06719A14023a18238A06539J85237j15592K63335I4353
17352A49172P2181j7281j2147Q5423r2996c99072B05458r8348J43395d0460A62374
17340C10020l6997d7244A69948M909d7543D3064K3960K96658H3240K72177A04543
17328A89321L61157A05790J87461C3455L22378h0698C72770A51012D2891M69161
17318E12052j49347p4223E7253J05153G5074J03362J84990N8946j78282c4220
$$ y = [113870, -29019, 268281, 15131, -218654, 277946, 315075, 268981, -31935, 161811, 380177, 57477, 216482, 293477, 331240, 311055, 223890, -137295, 236198, 38111, -17750, 18877, 161874, 53807, 138626, -14368, 956, 290870, -323797, -109866, -118452, 312697, 218062, -14945, -94472, -146178, 218975, -106719, 114023, -118238, 106539, 291776, 176184, 439519, 94353, 149172, 221353, 204072, 191925, 277348, 184352, -399072, 205458, 107110, 250505, -40460, 162374, 310020, 273023, -47244, 169948, 174857, -47543, 43064, 67024, 363682, 83240, 355417, 104543, 189321, 550478, 105790, 293251, 33455, 355833, -80698, 372770, 151012, 42891, 512052, 362705, 288482, 57253, 162406, 75074, 178436, 363426, 422372, 244090, -34220]
17307C5667J97517e4519A82424b4713k06939B90052e5885D08002m4210E3124b03011
17295b3304B9036Q2845O6496h4565r0757l7517G7954L1880R5030K77502g1904
17283a10565H3329e5289A3520J28349c4664a4517k50623D42139A55788j3671c6253
17271B33592a17646A45244E8587J18224f3376b7818B87269K10323C4829M70397
17261E05226b1338m8567B55460j07684C6346c3334A05028d9406D15773O7677a8559
17249G8374g7479B19674G8341k2825J2354K42759A40222M1000d9486B58661J4728
17238B73389a40148D02213m4141C5253a6431A14091J15070b53977A79153H1330
17227A52408B0933M1251L25710j91445l7733b24536B27828b4356A78388q8125
$$ y = [35667, 233184, -54519, 182424, -24713, -231652, 290052, -55885, 408002, 363792, 53124, -203011, -23304, 29036, 111881, 178377, -84565, -175322, -212839, 77954, 109834, 204864, 482366, -71904, -110565, 83329, -55289, 13520, 141869, -34664, -14517, -265140, 442139, 155788, 142117, -36253, 233592, -117646, 145244, 58587, 176811, -63376, -27818, 287269, 497592, 34829, 505226, -21338, -69905, 255460, 147776, 36346, -33334, 105028, -49406, 415773, 483450, -18559, 78374, -77479, 219674, 78341, 55516, 67870, 310629, 140222, 181222, -49486, 258661, 273389, -140148, 402213, 358072, 35253, -16431, 114091, 229161, -253977, 179153, 81330, 152408, 20933, 62184, 387894, 196449, 158716, -224536, 227828, -24356, 178388, 90263]
17217I0263j5664K65001p1671D695N01934k29146A22114B7869a83820A29591K1323
17206A50914o7520j519a06494A67571J92404r7892M3093R2020A30730J51610M9698
17195C32038A20418L5908K27636a49466C00352A3305K88321q9653k7508k8035
17185A56430J71350J30640F0119L65102J32993B76631a69048A39198L4132Q4361
17175B57691J83205A62783J89663j20485j04273O4647m8214J08175n2116Q4247
17165B84427A189J53836o1282R398K80895j12134n6477K5276J64532A2356R8178
17154A10534d1620C72977Q9538n9562C1778M71901A42444o78R8833L8554P5097
17143C54250Q7340A10073L24354M3053B07245L73362j92857r9305A08740J30719
$$ y = [90263, 74599, 339600, 267929, 4695, 506629, 277483, 122114, 27869, -183820, 129591, 150914, 83394, 81875, -106494, 167571, 359975, 262083, 305176, 397196, 130730, 282340, 332038, 120418, 156326, 383962, -149466, 300352, 13305, 301626, 211973, 184465, 156430, 327780, 458420, 60119, 425221, 558214, 276631, -169048, 139198, 173330, 257691, 440896, 162783, 352446, 231961, 127688, 192335, 144121, 252296, 200180, 284427, 1189, 155025, 93743, 103141, 384036, 271902, 215425, 240701, 405233, 12356, 110534, -41620, 372977, 462515, 402953, 31778, 503679, 142444, 141766, 240599, 279153, 354250, 441590, 110073, 434427, 477480, 207245, 580607, 387750, 288445, 108740, 239459]
17133B39459J96722q0911j59705K45086M0112F2965K95568P0299o2330A29477
17122B98649J31837B14909K0903K88939l1513k13345Q7626l5500K443A25032c499
17110E92535k77838J23201r1909j45823j0917o4944M40032A04725a23181C97407
17099C16275M31j4663P7560J3827j84663J50043A61296L35181A22473R2872M56601
17088F71946A82643K02811K48661j69585k1184O7300k17131l8059L4730K54995
17078E45181k01225M2580J66389j77897A52337L55729j87688j6069J45120R1116
17068E40545B46737M51556C40785N3070j28055J34896L0934O5658l4664o5213
17058C97411K24022k46184q5388H3117L35565C7354K60922J20444J29463P4568
$$ y = [239459, 436181, 355270, 195565, 440651, 480763, 62965, 358533, 428832, 366502, 129477, 298649, 430486, 214909, 235812, 524751, 493238, 279893, 367519, 332019, 334462, 125032, -3499, 592535, 314697, 437898, 345989, 200166, 189249, 124305, 564337, 104725, -123181, 397407, 316275, 316706, 302043, 379603, 393430, 208767, 358810, 161296, 496477, 122473, 215345, 671946, 182643, 385454, 634115, 464530, 443346, 510646, 293515, 255456, 290186, 545181, 343956, 386536, 552925, 375028, 152337, 508066, 320378, 304309, 449429, 540545, 246737, 698293, 340785, 393855, 265800, 400696, 431630, 497288, 462624, 397411, 621433, 375249, 289861, 83117, 418682, 37354, 298276, 418720, 548183, 622751]
17048F22751j25426j36686J23062j5440J3746p889j73567l9408Q7291l6960K8781
17037C40255j64349L33024K70361j28567K4554k08059A71293K18840K43622K20617
17027H54372l94442N9650o3844k0097A87818m7131N32853k90649R6836j65036
17017C14691L60697N986j65993p0315J51317B56769J45018J79923J28589j6302
17007F93997M3618k84812l4182j43354K88607q1461q0813K89214m233k74890J80288
16996E91979J37354j15000A57156L79186M06320l86124p124J64017l17664K99377
16986F95144J9666k01090L50670j59047J18541j60962l22424J38413N11664j24045
16976H66530J71310j79436R936k85851J18265K20331j60774R5050k62112K56148
$$ y = [622751, 497325, 360639, 483701, 468261, 482007, 474118, 300551, 261143, 348434, 311474, 340255, 175906, 508930, 779291, 650724, 675278, 467219, 171293, 390133, 633755, 854372, 459930, 519580, 455736, 435639, 187818, 140687, 673540, 382891, 479727, 314691, 675388, 681374, 515381, 445066, 596383, 256769, 401787, 581710, 710299, 693997, 737615, 452803, 418621, 275267, 563874, 482413, 401600, 690814, 686581, 411691, 591979, 729333, 614333, 157156, 536342, 942662, 556538, 549414, 713431, 395767, 695144, 714810, 513720, 864390, 705343, 823884, 662922, 340498, 478911, 990575, 866530, 1037840, 858404, 868340, 582489, 700754, 921085, 760311, 855361, 593249, 849397]
16966H49397l12823n383M66452l62007K34593p3378j5839k59885K10332L98495
16956A129954j48181K04374m2712r2492m16726Q5643M77750o3221o7129l21230
16946G46030L82308j11793j68700j37193M29162k93975M85256j37543n2162l40633
16936H00757N53795m9412k86969k50590K80869j11669K55346J80676l68763J142
16926A005182L13970m02713L94265j987j78311K15268k34217K65277k61066j94820
16916I20848K00053L65205r8670j12825J47188j29714P3535q1110k76742L44771
16906A352539l5459N0453j17609K00440l3106J06371j17469J85060j34866J03232
16896A559586k03860L43654J83133k61494m3386J8037O3166J76551k64515J27005
$$ y = [849397, 536574, 531191, 997643, 635636, 870229, 796851, 781012, 521127, 731459, 1129954, 981773, 1186147, 1143435, 1050943, 634217, 719860, 1197610, 1134389, 1067260, 746030, 1128338, 1016545, 847845, 710652, 1139814, 845839, 1331095, 1193552, 1141390, 800757, 1354552, 1305140, 1018171, 767581, 1048450, 936781, 1192127, 1372803, 1004040, 1005182, 1319152, 916439, 1310704, 1308717, 1130406, 1345674, 1111457, 1376734, 1115668, 920848, 1120901, 1486106, 1387436, 1274611, 1421799, 1292085, 1365620, 1284510, 1007768, 1352539, 1317080, 1367533, 1249924, 1450364, 1417258, 1523629, 1406160, 1591220, 1456354, 1559586, 1355726, 1699380, 1882513, 1621019, 1577633, 1595670, 1658836, 1835387, 1570872, 1697877]
16886A697877Q1566j28891J67755K54001o8685l46665J88487j88229K68716R1523
16876B017455l54941O13106p4585j43621J88145L2392k86246k4861K71869l3910
16866B204803o2851J12436J29167j89741R9525J59761j49065J09K59455n7842
16856B505757l7897Q5213K21278n7099M4683j83213K68929k58217K91611j83677
16846B697368M36745k07544J62820j50575r4535K34126j19437J33898j9716K85632
16836C358782K81425l01464L26099k69404J7776J48208K16667M4543j09097J97135
16826C910670o0476K5149J44134m8034L39358O9031j3304r048L22839R7374q3776
16815D693917j0050M3644N20541l63300K45210j96002Q39616n08085M74211N55788
$$ y = [1697877, 1779443, 1650552, 1818307, 2072308, 2003623, 1656958, 1845445, 1657216, 1925932, 2017455, 1662514, 2275620, 2201035, 2057414, 2245559, 2277951, 1991705, 1966844, 2238713, 2204803, 2141952, 2254388, 2383555, 2193814, 2293339, 2453100, 2304035, 2304144, 2563599, 2505757, 2467860, 2553073, 2774351, 2717252, 2761935, 2578722, 2847651, 2589434, 2881045, 2697368, 3134113, 2926569, 3089389, 2938814, 2844279, 3078405, 2958968, 3092866, 3073150, 3358782, 3640207, 3338743, 3664842, 3395438, 3413214, 3561422, 3778089, 3822632, 3713535, 3910670, 3850194, 3875343, 4019477, 3971443, 4310801, 4379832, 4366528, 4357480, 4680319, 4777693, 4693917, 4683867, 4727511, 5248052, 4884752, 5129962, 4933960, 5773576, 5265491, 5739702, 6295490]
16805F295490o83602K86210M05692j30838Q8524K58713m4865N10300j48241J83016
16795G020399M15706J77499o6696K13712M39465j23039O95054j16317K52117K87125
16785I195025N9816K87372L21053N45178R9831l79615L23607P03645R4570J178652
16775A2429134j36957K63920M97169K60648P96495O3013P02224N30786N28397
16766A5934829O73593K22058M50942Q89663N83234J146580M03452L68687J517220
16757B2190258N39667R15268J113203R77051Q89640J002567J077682J692698Q83061
16748C1281095J706015J245429J774617J516695J906433J867014K307840K046523
16740D5651661K442704K118465K539737L168727K595338L386546L539329L462224
$$ y = [6295490, 5611888, 5898098, 6303790, 6172952, 6261476, 6520189, 6475324, 6985624, 6837383, 7020399, 7436105, 7613604, 7546908, 7760620, 8200085, 8077046, 8772100, 8655783, 8907900, 9195025, 9254841, 9542213, 9863266, 10408444, 10508275, 10128660, 10452267, 11155912, 11250482, 12429134, 12292177, 12556097, 13053266, 13313914, 14110409, 14173422, 14875646, 15406432, 15934829, 16608422, 16830480, 17281422, 18171085, 18754319, 19900899, 20304351, 20673038, 22190258, 22729925, 23645193, 24758396, 25735447, 26625087, 27627654, 28705336, 30398034, 31281095, 32987110, 34232539, 36007156, 37523851, 39430284, 41297298, 43605138, 45651661, 48094365, 50212830, 52752567, 55921294, 58516632, 61903178, 65442507, 68904731]
16732F8904731L644974L807681M438837L958236N175404M397607N073281N123812
16724A04524563M946745N127548N067576M876288M947317M155707L851627L387815
16716A40885186K468257J964241R52796k5690p18916j650016k623955l121368
16708A38130535l890795m254311n098203n109725n256035n713902n279348n390828
16700I8137388n170748n076533m834927m762253m511798l809035m300413l531687
16692F2139994l722140l122306l053781k977074k215568k462846k346387k105722
16684D0134170k464520j708121j876089j486549j423730j470985j183864j294900
16676B7225412j226747j432803q43860j260724q63909p90778q71972p78563n76185
$$ y = [68904731, 72549705, 76357386, 80796223, 84754459, 89929863, 94327470, 99400751, 104524563, 109471308, 114598856, 119666432, 124542720, 129490037, 133645744, 137497371, 140885186, 143353443, 145317684, 146270480, 146244790, 145525874, 143875858, 141251903, 138130535, 134239740, 129985429, 124887226, 119777501, 114521466, 108807564, 103528216, 98137388, 92966640, 87890107, 83055180, 78292927, 73781129, 69972094, 65671681, 62139994, 58417854, 55295548, 52241767, 49264693, 47049125, 44586279, 42239892, 40134170, 37669650, 35961529, 34085440, 32598891, 31175161, 29704176, 28520312, 27225412, 25998665, 24565862, 23722002, 22461278, 21597369, 20806591, 19934619, 19156056, 18579871]
16667A8579871j143929l48421n70971k10549j302353n19421j82975k75243p62061
16658A3263948o57267j36795l09404p52290j76793j41747l78274l47498l36633
16649A0027247k45781p33403N7253n70582K7033l05756r9604m11284L34443m64460
16639G615106m53086j38315j34547n0948l46080N7726l66304R7375l40141k97860
16629E642926k68239L69609l53162K9983l95897k4325J06620k94312N0087k37657
16619D625633j84964O0872o5927K4406l28364m2668N5681j32015o2488L9768O4995
16608D054929j44047l45044k0260j15004k3858j04244j55564l15370J51941n7255
16598B926224j0137j9691m61507K61301m9174J2246k08401m7883L43808m10384
$$ y = [18579871, 17435942, 17087521, 16516550, 16306001, 15003648, 14484227, 14301252, 14026009, 13263948, 12606681, 12469886, 12160482, 11408192, 11231399, 11089652, 10711378, 10363880, 10027247, 9781466, 9048063, 9105316, 8534734, 8561767, 8256011, 8156407, 7745123, 8079566, 7615106, 7162020, 7023705, 6889158, 6838210, 6492130, 6549856, 6183552, 6280927, 5940786, 5642926, 5374687, 5744296, 5391134, 5421117, 5025220, 5000895, 5107515, 4813203, 4863290, 4625633, 4440669, 4501541, 4435614, 4460020, 4131656, 4088988, 4144669, 4012654, 3950166, 3989934, 4054929, 3910882, 3565838, 3545578, 3430574, 3406716, 3302472, 3146908, 2831538, 2983479, 2926224, 2916087, 2896396, 2434889, 2696190, 2647016, 2659262, 2450861, 2402978, 2746786, 2336402]
16588B336402L69729k38112j5231Q615k45905J03402o7118o616k94017J84995
16578B136144K2592j0945k54028J37511M1760k7624j30945j06247L26333m459
16568B130092l66767j18657L73183j73975J28155m99270J95962L8633O0433j59208
16558A608581j31303K50859j78996O4640j14281k02880o81K00784R0293j11902
16548A475114j76413J26866l23431M4122J27776J49327l79081L26423o7920O7989
16538A370772L56136o34361p6992k5454K37758M4675q2580k201R3809K45866m58008
16527A069420K4302l03203K75103k43459j76102R2214K49018O357j2932k84186
16517F96532J43704m0582J744L04339k08607O8947j44137K4001J78867l0146k98248
$$ y = [2336402, 2706131, 2468019, 2452788, 2461403, 2215498, 2318900, 2251782, 2245166, 1951149, 2136144, 2158736, 2147791, 1893763, 2031274, 2073034, 2045410, 1914465, 1808218, 2134551, 2130092, 1763325, 1644668, 2017851, 1843876, 1972031, 1472761, 1668723, 1707356, 1767789, 1608581, 1477278, 1728137, 1549141, 1613781, 1499500, 1296620, 1295939, 1496723, 1587016, 1475114, 1298701, 1425567, 1102136, 1146258, 1274034, 1423361, 1044280, 1370703, 1302783, 1370772, 1726908, 1092547, 1015555, 990101, 1227859, 1272534, 1189954, 1187753, 1281562, 1527428, 1069420, 1093722, 790519, 1065622, 822163, 646061, 738275, 987293, 993650, 980718, 696532, 840236, 799654, 801398, 1105737, 897130, 966077, 821940, 845941, 1024808, 994662, 696414]
16506F96414J76032p5839J57304j52759J29239m54777L53073k61734J38355m0566
16496F64742J89081J00213l46984p1416J54704K19583j79803m8605j1561J63880
16486H33834j84398J97918D03291J04131j3508M95531m34092K88097l56843j7325
16476D69282N1624L41990l93660J1412J07413j07223K3221j24646J84604j38183
16466D25834Q7709K11971B99386O21647k45404Q0809K4747C16443L07099k18655
16456D04887l8722J45442Q7356K16507j74991j04619Q8136A76662M70089k48050
16446C98701L83880k88241j65736o4242Q9983o2422l1307J29566A38629K16940
16436C55569R9369K0297p7021J10858B6452L26061J50902j94346J30238M2303
$$ y = [696414, 872446, 796607, 953911, 801152, 930391, 475614, 828687, 566953, 705308, 664742, 853823, 954036, 607052, 535636, 690340, 909923, 730120, 681515, 669954, 833834, 649436, 847354, 403291, 507422, 493914, 989445, 555353, 843450, 486607, 469282, 520906, 862896, 469236, 480648, 588061, 480838, 504059, 379413, 564017, 425834, 513543, 725514, 299386, 921033, 675629, 756438, 781185, 316443, 623542, 404887, 366165, 511607, 598963, 815470, 640479, 535860, 623996, 176662, 646751, 398701, 782581, 494340, 328604, 264362, 354345, 291923, 260616, 390182, 138629, 355569, 454938, 475235, 398214, 509072, 26452, 352513, 503415, 309069, 439307, 481610]
16426D81610o3136L7233P1960A74371N5297L9229K59223j0426j05287J30162j15959
16415D26610j98814o7462J6341J58213j41798J7969N458J14846H4273L24337n7253
16404C51357h3848C11828q3886L2778p2035K83464B19747q9323M00200A34648
16393F4536K57457j23897L2818O8586N6130p2628R185b3938D5107K18984O9182
16382C33273o1697K94276j76822j41028C1826O0763J29441K65448q6557q0296
16372C20625A30304J94650r3325F2558K910K81189n4442M367E5690O02175C05486
16360B47240j19004M1279M05308B65806J11527E5953K26595G6052J02184J87136
16350C65372j51294C2361M28495k05376J63944j87723J27296D7931J7230b2133
$$ y = [481610, 418474, 455707, 527667, 174371, 229668, 268897, 528120, 517694, 412407, 542569, 426610, 227796, 160334, 176675, 334888, 193090, 211059, 216517, 331363, 84273, 408610, 351357, -83848, 311828, 227942, 260720, 188685, 472149, 219747, 130424, 530624, 134648, 64536, 321993, 198096, 230914, 299500, 355630, 283002, 292187, -23938, 45107, 264091, 333273, 271576, 565852, 389030, 248002, 31826, 92589, 222030, 487478, 400921, 320625, 130304, 324954, 231629, 62558, 65468, 346657, 292215, 296582, 55690, 657865, 305486, 247240, 128236, 169515, 574823, 265806, 377333, 55953, 282548, 76052, 178236, 365372, 214078, 32361, 460856, 255480, 419424, 231701, 358997, 47931, 65161, -22133]
16339A65028n6564d5851G9395J28848J45737A32453b59948B97454f6272I2457
16328A92939J55311J13756B08187a15163A24452i2131L4301C43398B031J76880
16318A78911K30588F6432b9790D60677e5815B05694a8515k31849d4276A81789
16307A5326K39288K17258A64285R9069e7050C600J52262J6016K6207M8247C0592
16295a16122A6654c2688H4961J15547e7008H992O5814J38777f0148C30309o7910
16284B62399A5042P5808M03312A32220k166i6679H5629J31006N8058j18821a93675
16272B02265H4460L0596L0272K25113g0863B92397f2182A48951a93460A27470
16261A87502J5369n1750J71077D9356K7917J0233J03089e4052l270a4803A20715
$$ y = [165028, 108464, -45851, 79395, 208243, 353980, 132453, -259948, 297454, -66272, 92457, 192939, 348250, 462006, 208187, -115163, 124452, -92131, -57830, 343398, 2031, 178911, 409499, 66432, -29790, 460677, -55815, 205694, -18515, -250364, -44276, 181789, 15326, 254614, 471872, 164285, 263354, -57050, 3600, 155862, 171878, 198085, 246332, 30592, -116122, 16654, -32688, 84961, 200508, -57008, 8992, 74806, 213583, -60148, 330309, 262399, 15042, 90850, 494162, 132220, 130054, -96679, 85629, 216635, 274693, 155872, -193675, 202265, 84460, 115056, 145328, 370441, -70863, 292397, -62182, 148951, -193460, 127470, 187502, 202871, 151121, 322198, 49356, 77273, 87506, 190595, -54052, -57322, -14803, 120715]
16249A63084a52626A08932J2323a74540I6864c0986A03522a54028B25196J2441
16239B37637a34264M5554A3877J34948B5679R2005a98004F7510B25L68537G5494
16227b5711J2351A05666C7815K56534a4248k3014j31358B14822a72209E0327F470
16215B07906b332r0355B86307E7234j4326A4751J2278J82303i8358j38034C5803
16203b5156D2513a274l5595D8866J35168A7781q873J67576a67226B09104h6150
16191a48312c3496D4693J08731b84349h7427k1271D9276b46682P6465e9404k6889
16180h6293A18716J2784k9574a17723C8526b8497j03642o4386Q3488j15069A79486
16168h208p6509J5274m6205H6606L22507A14884c35920a2806j1264m7762j6319
$$ y = [163084, -152626, 108932, 121255, -174540, 96864, -30986, 103522, -154028, 225196, 237637, -134264, -88710, 13877, 148825, 25679, 117684, -198004, 67510, 225, 368762, 75494, -25711, -13360, 105666, 37815, 294349, -14248, -37262, -168620, 214822, -172209, 50327, 6470, 207906, -2332, -92687, 286307, 57234, 42908, 14751, 27029, 209332, -98358, -236392, 35803, -25156, 42513, -1274, -36869, 48866, 184034, 17781, 8908, 176484, -167226, 209104, -86150, -148312, -33496, 44693, 153424, -284349, -87427, -108698, 49276, -246682, -170217, -59404, -86293, 118716, 131500, 101926, -117723, 38526, -28497, -132139, -196525, -113037, -228106, 179486, -8208, -84717, -69443, -115648, 86606, 409113, 114884, -335920, -12806, -24070, -71832, -88151]
16157h8151C67354C204K3470K45406a25576c6579C06113a22787C26086A19929
16146C01184L5819c42602I6910a45600B33871j10159M0643m3070b74608A51168
16135A23174R0580d5450A58429G0256b52057A25805M2774a38875c947B56677o8929
16124A87748b20307g1873B15146l6518D9102K2427J78657I9619K2393b8146C20041
16112a88911C27230B0107L9950J61829i5236H4953b93329A30962b33268B31288
16101a10111q229A07126J09139b06222k48424F499a52283j5029B61944a75569
16090A19070b15497B784O6924l998J3992l0767a69519E6327L31387b60807I3453
16078a12251j29765J20721E4756K13743e4205k00859N3538A98297q9002B8783
$$ y = [-88151, 367354, 3204, 26674, 272080, -125576, -36579, 306113, -122787, 326086, 119929, 301184, 337003, -342602, 96910, -145600, 233871, 123712, 164355, 121285, -274608, 151168, 123174, 213754, -45450, 158429, 70256, -252057, 125805, 168579, -138875, -3947, 256677, 187748, -220307, -71873, 215146, 178628, 49102, 71529, 250186, 99619, 122012, -28146, 320041, -188911, 327230, 20107, 60057, 221886, -95236, 84953, -293329, 130962, -233268, 231288, -110111, -118340, 107126, 216265, -206222, -454646, 6499, -152283, -167312, 261944, -175569, 119070, -215497, 2784, 69708, 65710, 79702, 48935, -169519, 56327, 387714, -260807, 93453, -112251, -242016, -121295, 54756, 268499, -54205, -255064, -201526, 198297, 109295, 28783]
16067E6246I837J25517n2599j2933b39091A58713h7689B1118i1483j85336P8080
16056a98739j19421e9619A0382h9001j14659i0499H0128a2214q5265L3891k7996
16045i1584F0617J93860f63736a29513E8057a93735f2246E5349P7461a54580K7796
16034a26784G7008e0603j42630F9270b09907j806A70Q1408K3064K5966o1716a73290
16021c03211e3466C09430a52403d5081k64342a43977B00586g7790D9823c60492
16010a49909C8139c32337a50386A72962g4011k03625E8647e1646B22610H2960
15999E0427J10526a8476j80647d5178o7003H9243a44378m8222E19139D9733k633
15988D7100j4881J41278M1279F1413J9673N9249K12410j50114b49j78497F3959
$$ y = [56246, 9837, 135354, 82755, 69822, -239091, 158713, -87689, 21118, -91483, -276819, -198739, -318160, -59619, 10382, -89001, -203660, -90499, 80128, -12214, -97479, -63588, -91584, 60617, 254477, -663736, -129513, 58057, -193735, -62246, 55349, 132810, -154580, -126784, 77008, -50603, -193233, 69270, -209907, -211713, 170, 81578, 104642, 130608, 68892, -173290, -303211, -53466, 309430, -152403, -45081, -309423, -143977, 200586, -77790, 49823, -360492, -149909, 38139, -332337, -150386, 172962, -74011, -277636, 58647, -51646, 222610, 82960, 50427, 160953, -18476, -199123, -45178, -112181, 89243, -144378, -192600, 519139, 49733, 47100, 32219, 173497, 214776, 61413, 81086, 140335, 352745, 202631, -249, -178746, 63959]
15976A55977F4418b46088A05999d7981J5292A26380j6879R0255P2382a48500C7844
15964g3033I1334A6437N7716h7929B189a31059d1708C7161c86722A99374a36289
15952A79437L6361a2549j03332l5059F0208e35H1489b79313D3153J01459A5288
15940d8870A68778b89176A24750e8546C8849K9823r204d09441f8357B2751M4916
15929F7667P0410a89697j38337J22884K0001A98437D431a25523A21933a37765
15918f9269p266A07058b38960f7207A91497C3766f9878j17813e1923A39943e7236
15906c31429A23042n9542J7208c141A49599a12914B47841G9696i6627C2555a24055
15894a65410r880A02886c0619A18246e8047I7702c3680j08443j37838J05021C41124
$$ y = [155977, 64418, -246088, 105999, -47981, -32689, 126380, 109501, 199756, 272138, -148500, 37844, -73033, 91334, 16437, 74153, -87929, 2189, -131059, -41708, 37161, -386722, 199374, -136289, 179437, 215798, -12549, -115881, -150940, 60208, -535, 81489, -279313, 43153, 144612, 15288, -48870, 168778, -289176, 124750, -58546, 38849, 68672, 59468, -409441, -68357, 22751, 67667, 138077, -189697, -328034, -205150, -185149, 198437, 4431, -125523, 121933, -137765, -69269, -76535, 107058, -238960, -67207, 191497, 33766, -69878, -187691, -51923, 139943, -57236, -331429, 123042, 63500, 80708, -3141, 149599, -112914, 247841, 79696, -96627, 32555, -124055, -165410, -175290, 102886, -30619, 118246, -58047, 97702, -33680, -142123, -279961, -174940, 341124]
15882a15095C73404j54507b34905a02383h867A68615i6641q5747A1492a3231m4080
15871e7311F9680d8615n8063k63999A45215c60569a70140e6748j38487A15818
15860a55751j60759G8712j6647d1160D7560c1372l7400j88935G6740b3430B56966
15848c19681C57820B5132O4235a82119O1285q7779P8219B1293b26853A51672i7761
15836a08852E2831b64468M1512d399l07489A14513k0374f8738b8830k03361J08618
15825a23573j92302a8055A6243c2904A61783B1608i7285j8706l2204B16408B9100
15813B9318i3796A58435b04543i839k49339L8318h7918p323A32385J98387G8405
15801b51393P7711M287A24062L18264h6893K7811j7936j18390c4423B24513a45256
$$ y = [-115095, 373404, 218897, -234905, -102383, -8867, 168615, -96641, -182388, 11492, -13231, -57311, 69680, -48615, -106678, -370677, 145215, -360569, -170140, -56748, -195235, 115818, -155751, -316510, 78712, 62065, -41160, 47560, -31372, -68772, -257707, 76740, -23430, 256966, -319681, 357820, 25132, 89367, -182119, -120834, -208613, -130394, 21293, -226853, 151672, -97761, -108852, 52831, -264468, -222956, -4399, -311888, 114513, 94139, -68738, -28830, -232191, -123573, -315875, -18055, 16243, -32904, 161783, 21608, -97285, -115991, -148195, 216408, 29100, 29318, -93796, 158435, -204543, -9839, -259178, -220860, -87918, -95241, 132385, 330772, 78405, -251393, -173682, -169395, 124062, 442326, -86893, -59082, -77018, -195408, -34423, 224513, -145256]
15789c36565a46185e0259H0994a82242A75373a90028f6348q6083f4485R983p3608
15778a28110C32610h4924G1382b80280L5995h9787I6053J72379j23761F6968b51745
15766B6190a23773b5055q2024C9289a59121G58P2646K9881Q2194k7181F9419J87330
15754B56749C9903J4485Q953a03754B84060F7025a77821l8919a2420F8416K5218
15743I3634A5204D477K54813a73505K3564B75337b30839A4071b53231c4986m3915
15732g8901A90990K09550j78281e4962l1117E9979J28696i7309E7082h1630I7017
15720A18309K78633b16903P5120B33288a63227B68069E021K55804N315A2909b46726
15708h0369k4283j42376a13437j9486b7148r8237J861A78811p964h734l28030
$$ y = [-336565, -146185, -50259, 80994, -182242, 175373, -190028, -66348, -152431, -64485, -54502, -128110, 332610, -84924, 71382, -280280, -244285, -89787, 96053, 268432, 144671, 66968, -251745, 26190, -123773, -25055, -107079, 39289, -159121, 758, 73404, 103285, 185479, 158298, 69419, 256749, 39903, 54388, 63341, -103754, 284060, 67025, -177821, -216740, -12420, 68416, 93634, 15204, 4477, 259290, -173505, -149941, 275337, -230839, 14071, -253231, -34986, -78901, 190990, 400540, 222259, -54962, -86079, 59979, 188675, -97309, 57082, -81630, 97017, 118309, 396942, -216903, -141783, 233288, -163227, 268069, 5021, 260825, 266140, 12909, -246726, -80369, -104652, -247028, -113437, -132923, -27148, -125385, -123524, 178811, 170847, -8734, -336764]
15697c36764r7760c4928B28531M4760g3782D0471b296B31775o1073e873H2937
15685b55795j0964B03493I9322g7906A92419c13911A58081g4714k72849a29396
15674c8008r7027j16431A16452E500J76926c1249d186r0041A09801n2477a02998
15662A30712e4858p2197O3070j36348F8842a61385B303f1435o8722K9103j004
15651a02058c5320j9528k1959E6572l294j7864f9526K6109B56092o0503c5644
15639a24461B31780b38029a13710g990r0260J0972H9573m2411a94730j7805A1968
15627A58887b38738e4814N125B54669B9024A1761g2358p2044A4013K82217H9305
15615G8005a99789r812Q4772J7401l7457m1623A9262J22471a69458j94a0638l9168
$$ y = [-336764, -434524, -34928, 228531, 273291, -73782, 40471, -2296, 231775, 170702, -5873, 82937, -255795, -266759, 203493, 99322, -77906, 192419, -313911, 158081, -74714, -347563, -129396, -38008, -135035, -251466, 116452, 5500, 182426, -31249, -4186, -94227, 109801, 57324, -102998, 130712, -54858, -127055, -63985, -200333, 68842, -161385, 2303, -61435, -130157, -101054, -102058, -35320, -54848, -76807, 56572, 53278, 35414, -69526, -43417, 256092, 195589, -35644, -124461, 231780, -238029, -113710, -7990, -98250, -87278, 89573, 47162, -194730, -212535, 11968, 158887, -238738, -54814, -49689, 254669, 29024, 11761, -72358, -144402, 14013, 296230, 89305, 78005, -199789, -209601, -124829, -107428, -144885, -186508, 19262, 141733, -169458, -169652, -10638, -49806]
15603d9806j59135A87050a7565m7282m1558B61550f0921B49789a43217k2080B6988
15591d1227A28537a8092r9064l5721I5309a19005A48072C5370a44840M000e9190
15579c21538i7287b277B86604a58465c3487O262A07449c90336A35632E7909a75754
15567B46971C011g9097J0309C75451b28936B292a07006A67860A0406e4909j45128
15556b00037i2425j25609j18542D0553a06496n1389e702n9381A51966a12544M1967
15545g0577C4759a13048J0563G3251e391B16641J2002c8392p2756A32638b363
15533A7806J02001n0131O9657N7156C4612A4887b2876n0364A95611j984p86d34205
15520A02206Q9286k2985o8678b08074M2873c5118F1928a00341A20747a70838D4742
$$ y = [-49806, -208941, 187050, -17565, -64847, -106405, 261550, -60921, 249789, -143217, -165297, 26988, -41227, 128537, -18092, -117156, -152877, 95309, -119005, 148072, 35370, -144840, -140840, -59190, -321538, -97287, -2277, 286604, -158465, -33487, -27225, 107449, -390336, 135632, 57909, -175754, 246971, 3011, -79097, -68788, 375451, -228936, 2292, -107006, 167860, 10406, -54909, -200037, -92425, -218034, -336576, 40553, -106496, -157885, -5702, -65083, 151966, -112544, -70577, 34759, -113048, -102485, 73251, -5391, 216641, 228643, -38392, -111148, 132638, -2363, 17806, 119807, 69676, 139333, 196489, 34612, 14887, -22876, -73240, 195611, 193627, 192841, -434205, 102206, 191492, 168507, 99829, -208074, -165201, -35118, 61928, -100341, 120747, -170838, 44742]
15508a49651A74940G41L2073b52228J2440B91321B1938K29907b71714B1756L06718
15497C28474A06171g1707r825D15563a30002j05626A36542e8676C16620j16600
15487B00020b37306A74580M0710j7920j57h1853A97840i7062J0721c8037D4835
15475F3435n202L7406C1012a94734A79811a3652k92723E4635e1862k7895k35680
15464c15437D74J6033b50132d5416l21922a38266q5517B29427n6580m8097K2798
15453A47548L9282a82671A0046h8659j29805B26035c82494a60687A74744a59960
15442g1992H5179M4089b12343d6226j21391o8134a0833j47018P3534B23185e527
15430a09556A6703f8378B59842a72024k48669B47423D1737b08196f2542I3331
$$ y = [-149651, 174940, 741, 32814, -252228, -239788, 291321, 21938, 251845, -271714, 21756, 328474, 106171, -71707, -81532, 415563, -130002, -235628, 136542, -58676, 316620, 200020, -237306, 174580, 215290, 197370, 197213, -81853, 197840, -97062, -86341, -38037, 44835, 63435, 58233, 95639, 31012, -194734, 179811, -13652, -306375, 54635, -51862, -79757, -315437, 474, 16507, -250132, -45416, -367338, -138266, -223783, 229427, 172847, 124750, 147548, 186830, -182671, 10046, -88659, -218464, 226035, -382494, -160687, 174744, -159960, -71992, 85179, 129268, -212343, -46226, -167617, -235751, -10833, -157851, -84317, 223185, -5527, -109556, 16703, -68378, 259842, -172024, -420693, 247423, 41737, -208196, -62542, 93331]
15419i8016j6941C39493b57431H7498O8602b0460h311j7804p5374n1104B8398
15407b03709j12349f5168r8228g1050j86563J16817A27935c5809J058I2478O817
15396I9295b50289F7669N3392C0564M2229g7814b9092q500R463m0700o5220r7345
15384b31394P0169A66968a37365c6013B70256e429k85375b195p1684k98365i286
15372I6001J33567b32182E1117c47618B06499i629j92473C3480b96588A87619
15361a0497j02925a3684j02650K219A34015b10709e5861a8405A76504L0790J351
15350B08645a09366k651J8343A95582C023a06400m520A58464a8255r0844B77775
15338a62654p5907M2279I0184K47551H2801B2987K12569D0507O2764a03582A5179
$$ y = [-98016, -114957, 339493, -257431, 87498, 156100, -20460, -8311, -26115, -101489, -152593, 28398, -203709, -316058, -65168, -163396, -71050, -257613, -140796, 127935, -35809, -34751, 92478, 99295, -250289, 67669, 121061, 30564, 72793, -77814, -29092, -37592, -28129, -68829, -134049, -231394, -161225, 166968, -137365, -36013, 270256, -5429, -290804, -2195, -73879, -372244, -9286, 96001, 229568, -232182, 51117, -347618, 206499, -9629, -202102, 33480, -296588, 187619, -10497, -113422, -13684, -116334, -114115, 134015, -210709, -55861, -18405, 176504, 207294, 208645, -109366, -112017, -93674, 195582, 3023, -106400, -110920, 158464, -18255, -109099, 277775, -162654, -238561, -196282, 90184, 337735, 82801, 22987, 235556, 40507, 103271, -103582, 15179]
15326c6175B96419e3083A75903a25775A73915P7753h731F3587b80850A56641R1353
15315B47994J04418A28829g7931B14870g9288A22494j3964e9416B5554b70635
15304E9871b1206G6394a67385A65526n2784K67859a5205A08392a49123k3825b9067
15292H1237h850m01543A07664k2910a17560A80288a45819d9872H2564L16109b00490
15280e9581E9908J54519a1762j68918B7284M9172k4978a23660G12P4928a42720
15268a40645m6220B00148B7488J97901a08223B95662B3915K25890a23044A4598
15257a59385G3319L08595A17158f4238j31032D9434c5998j0408B61075M15523
15247F76598Q41446F59337K61646L44953F6856J48132C7822b33342D62558A63073
$$ y = [-36175, 296419, -53083, 175903, -125775, 173915, 251668, -8731, 63587, -280850, 156641, 247994, 352412, 128829, -77931, 214870, -79288, 122494, 108530, -59416, 25554, -270635, 59871, -21206, 76394, -167385, 165526, 112742, 380601, -15205, 108392, -149123, -172948, -29067, 81237, -8850, -410393, 107664, 84754, -117560, 180288, -145819, -49872, 82564, 398673, -200490, -59581, 59908, 214427, -11762, -180680, 27284, 76456, 51478, -123660, 712, 75640, -142720, -140645, -186865, 200148, 27488, 225389, -108223, 295662, 23915, 249805, -123044, 14598, -159385, 73319, 381914, 117158, -64238, -195270, 49434, -35998, -46406, 261075, 676598, 1518044, 659337, 920983, 1265936, 66856, 214988, 37822, -233342, 462558, 163073]
15236D3924J60775K2868a69755D40572A16461i0067B17415a08000c5925k1215
15226e7140a7905C37583a88508A78256E6182O0616L9428J91387B2037r219Q1106
15215I3924Q2820M9950A04484e7693C23568J18657A25332K16072a5590l6445A98648
15203f4330I2902g4589m0387j34939B72964h21j71823a2939B04916J10873h6240
15191H8474e1297D950g2316D3598g3496b1551B0498b37621A40846b3867D9483
15179A43412K7341o1912a63998C0108H422a04026A53234N7857e5892B03025J09414
15168C12439j23003P2119B4001n477a24005A3719N7440a39055H0614K12437C419
15156A82972N4968B8515J00752a3394A29799M6273F3747a76087P5796d114A63056
$$ y = [43924, 204699, 227567, -169755, 440572, 116461, -90067, 217415, -108000, -35925, -57140, -17905, 337583, -188508, 178256, 56182, 116798, 156226, 347613, 22037, 12818, 93924, 176744, 226694, 104484, -57693, 323568, 442225, 125332, 341404, -15590, -52035, 198648, -64330, 92902, -74589, -114976, -249915, 272964, -821, -172644, -12939, 204916, 315789, -86240, 88474, -51297, 4950, -72316, 43598, -73496, -21551, 20498, -237621, 140846, -23867, 49483, 143412, 170753, 108841, -163998, 30108, 8422, -104026, 153234, 211091, -55892, 203025, 312439, 189436, 261555, 24001, 18524, -124005, 13719, 71159, -139055, 80614, 293051, 3419, 182972, 237940, 28515, 129267, -13394, 129799, 176072, 63747, -176087, -100291, -4114, 163056]
15144G3082K12997J18213A75060l8317a58788A52141k2750J79652J4000A36005
15133A33966o3952j8638d0295D85957c89191G534a51665A65126A6852o937M1364
15122E1279j0139p479K11615C8965o876K44112a42198b1066l8554I5127J4614
15111A09741l8253M5943D2065J76324J74323A78270E8970A9602J31072j0186E7870
15099i4818H321h622A23889l5941b67050J17375E14191a65308K2903N093e3418
15087A84862n0720J55332G07L4724N9194a53611A26038O4332J222H4114b737C22951
15074a98874B14970r2794F0176K28646g5972C76723i0780k37655B99345d8535
15063B43558n3485f5369r0830A87773a01294B71489m8834A5674J26456j3828J19155
$$ y = [73082, 286079, 404292, 175060, 136743, -158788, 152141, 129391, 309043, 323043, 136005, 133966, 70014, 51376, -40295, 485957, -389191, 7534, -151665, 165126, 16852, 9915, 51279, 41140, 33661, 245276, 38965, 32089, 276201, -142198, -21066, -59620, 95127, 109741, 71488, 117431, 42065, 218389, 392712, 178270, 58970, 19602, 150674, 140488, 57870, -94818, 8321, -8622, 123889, 87948, -267050, -149675, 514191, -165308, -142405, -137312, -53418, 184862, 134142, 289474, 707, 35431, 94625, -153611, 126038, 190370, 191592, 84114, -2737, 322951, -198874, 214970, 122176, 60176, 288822, -75972, 376723, -90780, -328435, 299345, -48535, 243558, 190073, -65369, -156199, 187773, -101294, 271489, 222655, 15674, 142130, 128302, 247457]
15052B47457A12368J56972K162h3A41054J08720m001C7039g0866B51773b123B95948
15039B61076R8077j50935A8389Q0831O2539g8168p0289A91398p4301J51418b35970
15027A35156P3127J69593I3792a74690A32953K63716a6441G6961Q2671M5118g0915
15015H2931p622a7309A36937K8586M4158B2552R6728J29113J17364J06334j91629
15004B80462q5621b9292B16905A00700J18388D9899J73145i7934B04639O9254
14994B73893J71520A42508e225A45867K04871j1303j29074c8066C09255j052E3721
14982C12004A34556b3311C99439A38362a96464L6260D81539g2328B58749L04305
14972E63054H8592K77240H4058K04151J51725j59192N8275l0397C8447J5801L60817
$$ y = [247457, 112368, 269340, 271502, -83, 141054, 249774, 245773, 37039, -70866, 251773, -2123, 295948, 261076, 359153, 208218, 18389, 99220, 161759, -78168, -148457, 191398, 117097, 268515, -235970, 135156, 208283, 377876, 93792, -174690, 132953, 396669, -16441, 76961, 159632, 204750, -70915, 82931, 75309, -17309, 136937, 165523, 209681, 22552, 119280, 248393, 365757, 472091, 280462, 194841, -29292, 216905, 100700, 219088, 49899, 223044, -97934, 204639, 273893, 445413, 142508, -5225, 145867, 350738, 339435, 210361, -38066, 309255, 308203, 53721, 312004, 134556, -23311, 399439, 138362, -196464, -160204, 481539, -72328, 258749, 563054, 88592, 365832, 84058, 288209, 439934, 280742, 339017, 308620, 38447, 54248, 415065]
14961D15065a6255j3747H7644P8130L53372B33204J83553G7073L86922j86995
14951B77000K4741G5589K57222B6865L22664h5944C489M32974A88221A1491J10053
14940A21544J3263J74473E9678K47685k6048E3578K30623o815p6249N2583j3567
14929B40153A7895L19578A49580L25844A63192K5988J99464j05988p7626D818
14918B16312M14529j16646j75434c4705B30417o3955J57275j02842o4098K48751
14908D05548j04629Q3926A68205J11604K64776I3429J01144K20195j99005R9713
14898C15476P3582I1472C1744L93654H6661D1689g8384F9724L25403o4579A02421
14886C17939A25979J92366P0335K5442A12784B7934M36031j75772j09913C4450
$$ y = [415065, -16255, -30002, 87644, 165774, 519146, 233204, 416757, 77073, 463995, 277000, 301741, 75589, 332811, 26865, 349529, -85944, 3489, 436463, 188221, 11491, 121544, 134807, 309280, 59678, 307363, 281315, 53578, 284201, 277386, 201137, 253720, 240153, 17895, 337473, 149580, 475424, 163192, 189180, 388644, 282656, 205030, 4818, 216312, 630841, 514195, 338761, -34705, 230417, 166462, 323737, 220895, 156797, 405548, 300919, 384845, 168205, 279809, 544585, 93429, 194573, 414768, 215763, 315476, 389058, 91472, 31744, 425398, 86661, 41689, -78384, 69724, 395127, 330548, 102421, 317939, 125979, 318345, 388680, 414122, 112784, 27934, 463965, 288193, 178280, 34450]
14875B77577O1043o5842j06672L28684k41258H9372L8246M2068J52755m463l9403
14864B78575J89975j35437j33861p529J33701J12684j03846A12377J66650n7646
14854B21381q7039K9733J26670J92097N527p3026j92819A00587J82741J83143
14844D66471A38010M04832j94357J29857C1959M09965j32176K07567I6602N3869
14834A50471K80759k2311j57217F1004L19781n376N0136L7413j02639j39712J7155
14823B37762J74576j88524J92428A76545L37631j25154r3375J38741j3938j50453
14813B69997j22276M82950B3969N01561k31777J56627q5709K7405A72401K49139
14803D21540P0250j63762N3372J19667j04467n066r1689J4831j9110Q2962K23344
$$ y = [277577, 338620, 272778, 166106, 494790, 253532, 89372, 127618, 169686, 322441, 317978, 278575, 468550, 333113, 199252, 191723, 325424, 438108, 334262, 112377, 279027, 221381, 134342, 164075, 290745, 482842, 488369, 415343, 222524, 100587, 283328, 466471, 138010, 542842, 348485, 478342, 31959, 441924, 309748, 517315, 96602, 150471, 431230, 408919, 251702, 61004, 380785, 375409, 425545, 462958, 360319, 220607, 237762, 412338, 223814, 416242, 176545, 514176, 389022, 295647, 434388, 420450, 269997, 147721, 630671, 23969, 525530, 293753, 450380, 364671, 392076, 172401, 421540, 491790, 328028, 381400, 501067, 396600, 391534, 299845, 314676, 295566, 378528, 601872]
14792F01872j0580A21648K63099J36323p1499J04225q4173J17911O051k52053
14782C41532K1132j53554N86282k93644L2291n7614p8321J83945j0143J26839
14772F98745q3964A73347L23071J27547k78241N2674m7237J99338O3378j36239
14762D77638K37127l49939o3584l0713L53254k63417J94891j26515K00612q3638
14752E45716j56461K41526q950j72540O3082m4219K45196k42854j79100J89409
14742D80805J02674j6189j795r4679k7876L47081l54779j51837A40038L48628
14732D88666K13897j71691j07571K33831O4200C60594J90647o289P4714L4760
14722F54426K16375j93642o7968K99291k43770l04377K55151k0607m7310J55183
$$ y = [601872, 591292, 121648, 384747, 521070, 449571, 553796, 469623, 587534, 593585, 341532, 362664, 209110, 795392, 501748, 534039, 476425, 398104, 582049, 571906, 698745, 614781, 173347, 496418, 623965, 345724, 398398, 351161, 550499, 613877, 477638, 714765, 364826, 301242, 270529, 623783, 360366, 555257, 428742, 629354, 545716, 389255, 630781, 621831, 449291, 512373, 468154, 713350, 470496, 291396, 480805, 583479, 567290, 565495, 470816, 442940, 790021, 435242, 283405, 140038, 488666, 702563, 530872, 423301, 657132, 721332, 360594, 551241, 544952, 619666, 654426, 870801, 677159, 609191, 908482, 664712, 360335, 615486, 594879, 547569, 702752]
14712G02752j10907j89843K49451n1858B66110L02959K36575k78983J81653m8313
14702F60001K5761K3622Q3380j59113J3128j28250J24016L7449J41233k20735
14692F00492J94574L1378j44159j6357k8488k19313K89785j20985J5501L2340
14682F34768L3678L00915D43949K35996j00788j62889L67954o2798O947m45k25303
14671E02623L03113k55753N10176m01645K42314j85536L7189J55877j70697n4496
14661F83165j6233M3843j14992K56384j54274M69256j83857r9229j95992j8336
14651F69735J77967K90356j46151k49774J71550l9681k37957L83309k6732k05117
14641G87505K1350J47309J78696j72756r4345J66980l60459L01837P5433m5739
$$ y = [702752, 591845, 402002, 651453, 599595, 266110, 569069, 805644, 526661, 708314, 660001, 685762, 709384, 792764, 633651, 646779, 518529, 642545, 679994, 821227, 600492, 795066, 826444, 682285, 665928, 637440, 418127, 707912, 586927, 602428, 634768, 668446, 969361, 443949, 679945, 579157, 416268, 784222, 721424, 728371, 727926, 502623, 805736, 549983, 1060159, 658514, 900828, 715292, 752481, 908358, 737661, 683165, 666932, 710775, 595783, 852167, 697893, 1167149, 983292, 884063, 688071, 669735, 847702, 1138058, 991907, 742133, 913683, 874002, 636045, 1019354, 992622, 787505, 808855, 956164, 1134860, 962104, 867759, 1034739, 674280, 976117, 1051550, 1005811]
14631A005811j03733n2561J09486q6335r5191K38251k89010M1381K21710r77R3476
14620A082308J29169j53866o875J56662j27340l82344J56151J68806L26934m69944
14610H79661K62612J35553j1970l13528J69585P4376K37393l84627K03765k07224
14600A045596n1405K58396q9805L23866l83300P2649K24785j04592k8223m4683
14590A223284L08572k89447L57898k01785k46838M19078j02114J14079n3058L2241
14580A561910k01099L55688J00184l93794Q9433N1270K5472J73621k33467J13469
14570A642687p3118J71626M4889Q9989K39393l25819n9583N48213o84901M94495
14560B087871J14511j39605J81503Q7628k80320O67275O0975K37836K18489N45311
$$ y = [1005811, 902078, 849517, 959003, 872668, 777477, 1015728, 726718, 768099, 989809, 988832, 1082308, 1211477, 1057611, 1050736, 1207398, 1080058, 697714, 853865, 1022671, 1349605, 879661, 1142273, 1277826, 1265856, 952328, 1121913, 1196289, 1433682, 1049055, 1252820, 1045596, 994191, 1252587, 1162782, 1486648, 1103348, 1175997, 1400782, 1296190, 1267967, 1223284, 1531856, 1242409, 1600307, 1398522, 1151684, 1570762, 1468648, 1582727, 1529669, 1561910, 1360811, 1716499, 1816683, 1422889, 1512322, 1563592, 1589064, 1762685, 1529218, 1642687, 1569569, 1741195, 1786084, 1876073, 2115466, 1789647, 1730064, 2278277, 1593376, 2087871, 2202382, 2062777, 2244280, 2331908, 2051588, 2718863, 2779838, 3017674, 3236163, 3781474]
14550C781474N01830J583395K719603O198744J7114313M737223A8231252G830073
14541C159773j384962k58101j84855l3009p4259m6341J16816J85473J09411P8863
14531A668809q060k84409K58919M10539m86087K1298Q3050L73219j60966K03105
14521B079417l75774j01277K34303j22178K11457q3797J7636o4788L09206j62806
14511A941399J77637N5146k99362L55518K598k31813J32285R3125r828j64817
14501B051888L90553k19991K45244k57909M56072k41133j37873P6978J76307Q8507
14491B628643k51771Q1933K37908k47011J27668J10201J19944k51635N20025J81137
14481C257042j18198m49385P8189N5665P7087M56692k35764m9382J13534Q8564
$$ y = [3781474, 4283304, 5866699, 8586302, 14785046, 31899359, 36636582, 18231252, 7830073, 3159773, 1774811, 1516710, 1331855, 1298846, 1224587, 1178246, 1295062, 1480535, 1589946, 1668809, 1660749, 1376340, 1635259, 2045798, 1559711, 1581009, 1664059, 2037278, 1876312, 2079417, 1703643, 1602366, 1836669, 1714491, 1925948, 1842151, 1859787, 1794999, 2104205, 1941399, 2119036, 2174182, 1874820, 2230338, 2232936, 2001123, 2133408, 2226533, 2216705, 2051888, 2442441, 2222450, 2467694, 2209785, 2665857, 2424724, 2286851, 2363829, 2540136, 2628643, 2376872, 2458805, 2696713, 2449702, 2577370, 2687571, 2807515, 2555880, 3075905, 3257042, 3138844, 2689459, 2767648, 2823313, 2900400, 3357092, 3121328, 3071946, 3185480, 3274044]
14471C274044K3021r7506L7422K5068j73724K23159p218J88485J48400j97389
14461C443762J59696K29783m61818L61943j40368l13738P75535L1762O5693j72519
14451C979731N6837O2471k46274J83668j75910K02720N0946O9836K63827J4150
14441D462002O0793l115K10656n5385j37348L85786j17350M22134l13315K51017
14431E165875j12710K54041k3778R7067J13296M2853L4440J3878M37110m89101
14421E532971N4831J98962r2432M50245R6349J9047J37282j98313J86820M42342
14411F828104j09832J2306k8030K65092K17465R5174J39437j26425K61151J959
14401G556401J07148M80872j59853J33520J34170J27374K34722R3017K28634R0212
$$ y = [3274044, 3297065, 3199559, 3236981, 3262049, 3088325, 3311484, 3304266, 3492751, 3641151, 3443762, 3603458, 3833241, 3371423, 3733366, 3592998, 3279260, 4054795, 4086557, 4152250, 3979731, 4036568, 4099039, 3852765, 4036433, 3860523, 4063243, 4114189, 4184025, 4447852, 4462002, 4522795, 4519680, 4730336, 4674951, 4537603, 4923389, 4806039, 5228173, 4914858, 5165875, 5053165, 5307206, 5283428, 5380495, 5493791, 5536644, 5571084, 5584962, 6022072, 5532971, 5587802, 5786764, 5694332, 6144577, 6240926, 6259973, 6397255, 6198942, 6385762, 6828104, 6718272, 6730578, 6702548, 6967640, 7185105, 7280279, 7419716, 7293291, 7554442, 7556401, 7663549, 8144421, 7984568, 8118088, 8252258, 8379632, 8614354, 8707371, 8936005, 9026217]
14391I026217k46890L46063M56399j21321P9244M52136Q5933M48029l3398k18825
14381A0273587O99736M50336j55592O8744M27836J53991M56437L67893k2005L1391
14371A2752354M85693J59803K86138Q7107L27388L71480M68119J75479L59239
14362A5472800N73987J06914L47825L51621M87100L48785N62918N58421L25797
14353A9136168N59066m7899R21736M30816Q73111M9432O94392J78211J241628
14344B4036661K24264O17764P20267O23191Q86883O02719J000847Q18613P99473
14335C0330682R81959P81443Q56892J166053R88727J139486J161820J113454J531617
14326D0052133J180661J382049J695074J239173J641235J599913K040990J768698
$$ y = [9026217, 8779327, 9125390, 9581789, 9460468, 9539712, 9991848, 10077781, 10525810, 10492412, 10273587, 10973323, 11423659, 11268067, 11336811, 11764647, 11918638, 12375075, 12742968, 12720963, 12752354, 13238047, 13397850, 13683988, 13771095, 14098483, 14469963, 14938082, 15113561, 15472800, 16046787, 16153701, 16501526, 16853147, 17340247, 17689032, 18251950, 18810371, 19136168, 19695234, 19647335, 20569071, 20999887, 21872998, 21922430, 22616822, 22795033, 24036661, 24260925, 24878689, 25598956, 26222147, 27109030, 27711749, 28712596, 29531209, 30330682, 31312641, 32094084, 32950976, 34117029, 35105756, 36245242, 37407062, 38520516, 40052133, 41232794, 42614843, 44309917, 45549090, 47190325, 48790238, 50831228, 52599926]
14318E2599926J978885K347455K416732K358890K339373K750896K623613L130222
14310G2545992K590560L305549L438182L221186M045229L883931M096639M428485
14302A01555753N033776M717783N389708N773768O193877O216479P206489P082521
14294A49170154Q025216P939776R055686R167178R502820R935458J0848648J1263145
14286B24908081J2456954J2057286J3147563J3451921J3688839J4453760J4155099
14279C18319503J4175414J3982352J3466881J2340585J1920163R692833O892854
14272D00790585L076874J196761R1687k028886k657078l175186p263356j0592316
14264C79439085j2373732j4179994j4951176j5713066j5816111j5622337j5598764
$$ y = [52599926, 54578811, 56926266, 59342998, 61701888, 64041261, 66792157, 69415770, 72545992, 75136552, 78442101, 81880283, 85101469, 89146698, 93030629, 97127268, 101555753, 106589529, 111307312, 116697020, 122470788, 128664665, 134881144, 142087633, 149170154, 157195370, 165135146, 174190832, 183358010, 192860830, 202796288, 213644936, 224908081, 237365035, 249422321, 262569884, 276021805, 289710644, 304164404, 318319503, 332494917, 346477269, 359944150, 372284735, 384204898, 393897731, 400790585, 403867459, 405064220, 405155907, 403127021, 400469943, 397294757, 390031401, 379439085, 367065353, 352885359, 337934183, 322221117, 306405006, 290782669, 275183905]
14257B75183905j4844699j4334530j3922634j1870477j2381535j1606915j1036397
14250A85186718j0572013r194823r162090q304200q120635p080568o755040o288429
14242A19708920o241486n627080n303481m970542l988584m272032m196683l882563
14234H1226469l506502l550313k708858k913149k788398k980018k426650k459682
14226E7892899j986997k254247j938457j751142j739949j829328j493288j520730
14218D3378761j822940j107917j217187j147919j344606r71623j220627j189141
14210C3356801q61189j056741j155429m00966o92794j062121q62301p76520p74094
14201B5714646n54347n29691q37936o81570o16324o05982l92868l67754m44740
$$ y = [275183905, 260339206, 246004676, 232082042, 220211565, 207830030, 196223115, 185186718, 174614705, 165419882, 156257792, 147953592, 139832957, 132752389, 125997349, 119708920, 113467434, 107840354, 102536873, 97566331, 93577747, 89305715, 85109032, 81226469, 77719967, 74169654, 71460796, 68547647, 65759249, 62779231, 60352581, 57892899, 55905902, 53651655, 51713198, 49962056, 48222107, 46392779, 44899491, 43378761, 41555821, 40447904, 39230717, 38082798, 36738192, 35766569, 34545942, 33356801, 32495612, 31438871, 30283442, 29882476, 29189682, 28127561, 27265260, 26488740, 25714646, 25160299, 24630608, 23792672, 23111102, 22494778, 21888796, 21495928, 21128174, 20683434]
14192B0683434r65897l50992p06959n3215m66645q30587k42310k24293m20129
14183A6422407j54639l48568o93423J20527n58343l69548j69277k43286n44743
14174A3461107k47698k74189r7994l02814m47408j82913j57490j91388j89576
14165A1369637n62337L3649J1251n98039M967q2921k85280l00595N6837k3582
14155I623587m41473M8255j68592l59877K41802p69275L93601l70641j22604J50916
14145H225699m01807j60061l33656M29212l02055K8861l26127n93101P00738l69673
14135F898030J32963m68310K03300J56039m93319Q6791k45495p7730j56069L0013
14125F066213j50756J0075M5122m05539J67468l11745J74161j58244k63047J07129
$$ y = [20683434, 19717537, 19366545, 18659586, 18606371, 18139726, 17309139, 17066829, 16842536, 16422407, 16267768, 15919200, 15225777, 15346304, 14787961, 14418413, 14249136, 14005850, 13461107, 13213409, 12939220, 12841226, 12538412, 12091004, 11908091, 11750601, 11559213, 11369637, 10807300, 10840949, 10852200, 10254161, 10259128, 10176207, 9890927, 9590332, 9647169, 9623587, 9182114, 9230369, 9061777, 8701900, 8943702, 8174427, 8568028, 8197387, 8074783, 8225699, 7823892, 7663831, 7330175, 7759387, 7457332, 7486193, 7160066, 6566965, 7267703, 6898030, 7030993, 6562683, 6765983, 6922022, 6428703, 6515494, 6269999, 6192269, 6036200, 6066213, 5915457, 5925532, 5970654, 5565115, 5732583, 5420838, 5594999, 5436755, 5173708, 5280837]
14115E280837k30432j07546k739r9809p3492o3600Q3165q9221L746m43830J67610
14104D424689J16563k70307P3167j42618k1294J15487m42674M48273m81143L71178
14094D191321j56444k6440J7290m48518M08162j90699o2818n6523k20692J53857
14084C608496K58723o42807L32315k64948J97804l51214k0643L42116n15109J21898
14074C066631L16305k59997p8603l04795K07182j9676M14218k61479j77356n4487
14064B847943m2493j04849K45424n9194J54891k65087Q8857o8330J49681j07441
14054B839402m80910K71332J76472k66261j96299J08039J0199Q9491k51824N6868
14044B356509Q6585m08303J54467M3861J59373Q2538n83594M85110m41125M58288
$$ y = [5280837, 5050405, 4942859, 4940120, 4840311, 4766819, 4703219, 4786384, 4697163, 4700909, 4257079, 4424689, 4541252, 4270945, 4344112, 4201494, 4180200, 4295687, 3853013, 4301286, 3820143, 4191321, 4034877, 4008437, 4025727, 3577209, 3985371, 3794672, 3731854, 3675331, 3454639, 3608496, 3867219, 3224412, 3556727, 3291779, 3489583, 3138369, 3117726, 3459842, 2944733, 3066631, 3382936, 3122939, 3044336, 2739541, 2946723, 2927047, 3341265, 3079786, 2902430, 2847943, 2805450, 2700601, 2946025, 2886831, 3041722, 2776635, 2865492, 2797162, 2946843, 2839402, 2358492, 2629824, 2806296, 2540035, 2343736, 2451775, 2461974, 2551465, 2299641, 2356509, 2443094, 2034791, 2189258, 2233119, 2392492, 2475030, 1891436, 2376546, 1935421, 2393709]
14034B393709j9882j68529k07797l9177Q1384K89247r7310k08031O09489o78631
14024A954472O5355o690j02867r9111j05925N7383J27987K1897r3632J14357N0317
14013A983543o6587j13098M5496j86475K0846k4720j1806j92199O06268l77015
14003A684253p0243J65255o5422k07829Q1332J2372J15642j23212K35028n1243
13993A775933l4041J74020k69399N37484M40779K057343M785412J5960443J3087173
13984C8515147j6545827I850737m611039j241628o71348p99295j54973m41842
13976A930612r5481J42375L46433o45214J13839L00011j66614k04568Q3506j60183
13966A644716L8871q7224k01206Q7372k32992L98742q6543n1756o0552O7547o3917
$$ y = [2393709, 2373827, 2205298, 1997501, 1958324, 2039708, 2328955, 2231645, 2023614, 2633103, 1954472, 2019827, 2013137, 1910270, 1811159, 1705234, 1762617, 1890604, 1912501, 1818869, 1933226, 1983543, 1916956, 1803858, 1849354, 1662879, 1683725, 1659005, 1647199, 1455000, 2061268, 1684253, 1614010, 1779265, 1713843, 1506014, 1587346, 1599718, 1715360, 1592148, 1827176, 1775933, 1741892, 1915912, 1646513, 2183997, 2624776, 4682119, 9467531, 25427974, 38515147, 21969320, 9850737, 5239698, 3998070, 3326722, 2527427, 2372454, 1930612, 1835131, 1977506, 2323939, 1678725, 1792564, 2092575, 1925961, 1721393, 1804899, 1644716, 1683587, 1596363, 1395157, 1482529, 1249537, 1648279, 1561736, 1509980, 1449428, 1516975, 1453058]
13955A453058j15162L25332k28605l01987M10795l49591L03617j12103l6052j51232
13945A198070K51198m81373K47719p6327J02684n7231j41235M5236j45109M82579
13935A426211J6071l52337r9297L82683j94689n9307k5194J61553k8787k65455
13925I61452o683p8017L65253k49255j7237R6598J07353j13905J46318J53523
13915A365400l10155J62384l42352j89536M96756j93049j69148K48357p8117J32728
13905A123268k27671K65631K15984l76751K59800l93706O7456L16855n36925J2763
13895G26704J6813K57664J92698n34196K33591J1092J35287n01455j20800O74245
13885A091643l51640K04864m51332K03294J93238j45023K74447D90659J80694
$$ y = [1453058, 1337896, 1663228, 1434623, 1132636, 1543431, 1193840, 1497457, 1385354, 1349302, 1198070, 1449268, 967895, 1215614, 1139287, 1241971, 1184740, 1043505, 1088741, 943632, 1426211, 1442282, 1089945, 990648, 1373331, 1178642, 1119335, 1094141, 1255694, 1226907, 961452, 954769, 876752, 1242005, 992750, 975513, 1072111, 1179464, 1065559, 1211877, 1365400, 1055245, 1217629, 875277, 685741, 1182497, 989448, 820300, 1068657, 990540, 1123268, 895597, 1161228, 1377212, 1000461, 1260261, 866555, 934011, 1250866, 713941, 726704, 743517, 1001181, 1193879, 659683, 893274, 904366, 1039653, 538198, 417398, 1091643, 740003, 944867, 493535, 696829, 890067, 745044, 1019491, 490659, 671353]
13876F71353K98337j68238P0257Q8911j00897o4151J0239J36113k51603N94280
13866A284601n00904p3781K26888k10186n2184k7908P5885M9910j20110K49053
13856I01264k9752l59272k151L51592l7337k53685j54757K22869P6019p4514J06045
13845G46321j9968q5209N3123K67021l12558j35174J79088k94986Q6890k7376
13835D57172J63981K6151j8577L23607l53830n270J00979l0167K72961l65847
13825E71160B41033L17858J11978q5821p3762O2551J32812j13013j08611J03269
13815E88294j19722M8276L37571m23748J54540n8112j28016Q5568K6036k50642
13805B60045L43696j31309K25759k1360B84988L4815J13232k4318K9719L80802
$$ y = [671353, 969690, 801452, 871709, 960620, 859723, 795572, 805811, 941924, 690321, 1284601, 783697, 709916, 936804, 726618, 674434, 646526, 722411, 772321, 652211, 901264, 871512, 512240, 510089, 861681, 824344, 570659, 415902, 638771, 714790, 640276, 746321, 726353, 641144, 694267, 961288, 648730, 513556, 692644, 397658, 484548, 457172, 621153, 647304, 628727, 952334, 598504, 593234, 694213, 664046, 937007, 571160, 241033, 558891, 670869, 585048, 511286, 573837, 706649, 593636, 485025, 588294, 468572, 516848, 854419, 430671, 585211, 527099, 399083, 484651, 510687, 260045, 603741, 472432, 698191, 676831, 284988, 319803, 433035, 408717, 438436, 819238]
13795H19238J3743k90495p3022j32908M18192C20481N2057m2428J79027n0258
13785D58879J55486P1701B59332R6253N3804J41382K46152C36642K5011K87243
13775F48896J31931k33402A70640M68822B91768M81905o5251l03394L507j68940
13765B39595K48853j40056L16603o7436M8415k01298j33165m6495O9702H8893
13754D46706j57652l0825L29964j87927l3615m2168J90090k50123L78557k21280
13744D21727A88658K15664k3015o8670K47738j93784K38903B38319L95482A88509
13733E65569N4614j10703r8596q5916L12695j43328R8977q6418j67128L96810
13723G36576j75564j22306k3681J88816A35167J81908j1705J6271j50271N6093
$$ y = [819238, 832981, 542486, 469464, 336556, 754748, 320481, 372538, 330110, 509137, 458879, 614365, 686066, 259332, 355585, 409389, 550771, 796923, 336642, 361653, 648896, 780827, 547425, 170640, 639462, 291768, 773673, 708422, 405028, 408535, 239595, 488448, 348392, 664995, 597559, 645974, 444676, 311511, 265016, 334718, 88893, 446706, 289054, 258229, 588193, 400266, 366651, 324483, 514573, 264450, 643007, 421727, 188658, 404322, 381307, 312637, 560375, 366591, 605494, 238319, 633801, 188509, 565569, 620183, 509480, 410884, 324968, 637663, 494335, 593312, 506894, 339766, 736576, 561012, 438706, 415025, 603841, 135167, 317075, 305370, 321641, 171370, 227463]
13713B27463J05958K3738A05017L54280L3438j03022B2831M78907J19723j46319
13703D75142L3153n7432J77599A34908i6329A79157R9604r679J23278L6392j43475
13692B85277K42126A93085L00538B03676E0659M79110A85249J11510J76698B26707
13681C39733M2242a49352B90739H0909P7332O4179L482J60950G2250L54899n942
13670D21207A42886N23941k87748B1584L44387a522B56668A24302M5404m3246
13660A26460J22218m5423p0499L14858j17519K03996m1786k19675j03237M5977
13650B15370J09769p7329R7967M0053l6495J05350j08543A69760J40442j38990
13640A71212J21684j10052p6082L39222A55416K16232K429j57748I5843K08133
$$ y = [227463, 333421, 357159, 105017, 459297, 492735, 389713, 22831, 501738, 621461, 475142, 508295, 450863, 628462, 134908, -96329, 179157, 278761, 269082, 392360, 428752, 285277, 527403, 193085, 493623, 203676, 50659, 529769, 185249, 296759, 473457, 226707, 339733, 381975, -149352, 290739, 80909, 158241, 222420, 225902, 386852, 72250, 427149, 421207, 142886, 666827, 379079, 21584, 365971, -1522, 256668, 124302, 169706, 126460, 248678, 203255, 132756, 447614, 330095, 534091, 492305, 272630, 169393, 215370, 325139, 247810, 345777, 385830, 349335, 454685, 346142, 169760, 310202, 171212, 292896, 182844, 106762, 445984, 155416, 371648, 374077, 216329, 95843, 303976]
13630C03976j20781G9114K78340q4885o628J62517J14164p4842B12380J03371
13620C15751j04120p7492K43963A07580J41865N8416j2800N0781J78679k52273
13610B72248L64248A49670B4206J43402K31734A86758L3970O7127p6565E7774
13599B94245j19492J6846K31332j47846J30634o4345j66179O1084P5146h9433
13588B49630e8081B94400b659B07303b49070A84326Q0308K03546j85042I0397
13577C97828A54541o0847J26494J68665j76078m0025J34473j6138Q0611j32348
13567B39348J951P5237a92550A91952b6382j67663B06692L5948O987n5595o4919
13556A29113m0783P8989e7270A4365P889R7862E5108K68094L0116j04484g6478
$$ y = [303976, 183195, 79114, 357454, 272569, 265941, 428458, 542622, 467780, 212380, 315751, 211631, 134139, 378102, 107580, 249445, 307861, 295061, 345842, 524521, 272248, 636496, 149670, 24206, 167608, 399342, 186758, 220728, 287855, 211290, 57774, 294245, 174753, 191599, 422931, 275085, 405719, 341374, 175195, 236279, 311425, -89433, 249630, -58081, 294400, -2659, 207303, -249070, 184326, 264634, 468180, 283138, 90397, 397828, 154541, 93694, 220188, 388853, 212775, 172750, 307223, 291085, 371696, 239348, 241299, 316536, -192550, 191952, -26382, -194045, 206692, 242640, 249627, 194032, 129113, 88330, 167319, -57270, 14365, 22254, 120116, 55108, 323202, 353318, 248834, -76478]
13544C86699o4472K8615A59411N7928R8614M0786j13356C3406J02778O200L5434
13533A77818Q9829A1343a00432A33079Q676f6834D74442j78536J32145A45977
13522C47058h194B08752j02882K02776c5332B94748J16387A55278n6000L00209
13512C99487c6159A85123J81982j33752j13008J8818K8038E7352K32045q2984
13502B06413r2048J85379E4213A9283M3897J58920J6967j18530J15468C8637a10438
13490B40262j00150M655a11127A92665D1528L06916A72704K06179n3750A04337
13479D290O4743a1429j8493C69703C2414K22181H8731A5588J71502r2811J2377
13468A06656f790A514L28412n2260f5119A09005M5597e8817J2000j56045b7881
$$ y = [386699, 322227, 350842, 159411, 217339, 315953, 356739, 243383, 33406, 136184, 142384, 177818, 267647, 11343, -100432, 133079, 141755, -66834, 474442, 295906, 428051, 145977, 347058, -8194, 208752, 105870, 308646, -35332, 294748, 411135, 155278, 99278, 399487, -36159, 185123, 367105, 233353, 120345, 139163, 167201, 57352, 289397, 206413, 114365, 299744, 54213, 19283, 63180, 222100, 239067, 120537, 236005, 38637, -110438, 240262, 140112, 144767, -111127, 192665, 41528, 348444, 172704, 378883, 325133, 104337, 4290, 69033, -11429, -29922, 369703, 32414, 254595, 88731, 15588, 187090, 94279, 106656, -6790, 1514, 329926, 277666, -65119, 109005, 154602, -58817, -46817, -202862, -27881]
13456B75672N1843A04912a4299C21338j55016J76687A65535a70428A36226d8843
13445A96468m1548J75600A48625k041O4894o2360N3666B9700K08151h6808k19836
13434c06644C6033a31810B32061K76430a69875g8099n4401B06176j00149L52793
13424D58820A82433e4581C40028B0919R8644J50470H1831J61334a8297j7326A12340
13412B27833l733J61119j67417M5890H2324K15798A47498P3164k4843m8921K08327
13401C55225a54066G9414L1355i4896L2844A92656B8584J45122D2363P6685J7564
13390A36612F1785K17175j9179a95043A68950l0849b25569C46730m2343J86616
13380D91003k17860K49401B54662F5912J36383G1487J06859m8423e2463J1705
$$ y = [275672, 327515, 104912, -14299, 321338, 166322, 343009, 165535, -170428, 136226, -48843, 196468, 154920, 330520, 148625, 146584, 211478, 149118, 202784, 29700, 237851, -86808, -306644, 36033, -131810, 232061, 508491, -169875, -78099, -132500, 206176, 106027, 458820, 182433, -54581, 340028, 20919, 119563, 270033, 81831, 243165, -18297, -35623, 112340, 227833, 224100, 385219, 217802, 263692, 82324, 298122, 147498, 220662, 195819, 146898, 355225, -154066, 79414, 110769, -94896, -62052, 192656, 28584, 173706, 42363, 119048, 136612, 61785, 278960, 259781, -195043, 168950, 138101, -225569, 346730, 304387, 491003, 273143, 522544, 254662, 65912, 202295, 71487, 178346, 129923, -52463, -40758]
13370d0758C28090l8218R894J26494A05148c1356A11944a55920A29604a07884
13359B26998I0184K03k445J31171E0633P9034d0049A09154K09766I0061J33676
13348B23737I4771l0178b4619B12330p9127J4683J04115E1709Q6243K19941j68659
13337A89234J23844j2704J07398I6873C7181h6200A46125O5968C8891o264a28239
13325c1815A98944J56856Q7394a9874A27156B1018d4107G8685a4987D09837j65907
13314B43930I0829a02020D07223j80608b5948L381A31542g5891E9649a4764k12356
13303b27120R2254A84703L0021k3116a9924A53268B0915a22213A4021J80730C9911
13291d9037B2317K32088a36312A71777J23738I7178D6721b8730D81198c365j55927
$$ y = [-40758, 328090, 289872, 299766, 426260, 105148, -31356, 111944, -155920, 129604, -107884, 226998, 90184, 90387, 87942, 219113, 50633, 129667, -40049, 109154, 318920, 90061, 223737, 94771, 64593, -24619, 212330, 133203, 147886, 252001, 51709, 137952, 357893, 189234, 313078, 300374, 407772, 96873, 37181, -86200, 146125, 212093, 38891, 32627, -128239, -31815, 198944, 355800, 443194, -19874, 127156, 21018, -44107, 78685, -14987, 409837, 243930, 90829, -102020, 407223, 226615, -25948, -22567, 131542, -75891, 59649, -14764, -227120, -134866, 184703, 214724, 191608, -19924, 153268, 20915, -122213, 14021, 194751, 39911, -49037, 22317, 254405, -136312, 171777, 295515, 97178, 46721, -28730, 481198, -3365, -159292]
13280a59292D24145a05057L6400B26235r5513j0345A5692K90757I1917K03857
13270B95774a36090f6039J5287D80029I2521P6866l937q2323h2794j30829E4191
13258D10517j06460c6656B15183J3132I7127c2335j0071J7244B63025b28625F8260
13246A30327O1042K4431H4704a15108C46863q9722D2408A4887N8858K39507j1170
13235C02082e2901F9305O4787K10965A61120P8602A11510K13658a37140k8092
13225a65232j8132M1699C32676H9040a18918F789b1996I7648d12809a2967k8196
13214d1163A59783a54011C2134a8722r1035B00052a4172D03428c1450I22g6930
13202f0850l9455c6091a3228c74k2533m9799H6519J15317A5925J60554b63031
$$ y = [-159292, 424145, -105057, -68657, 226235, 130722, 120377, 15692, 306449, 91917, 295774, -136090, -66039, -50752, 480029, 92521, 169387, 165450, 83127, -82794, -213623, 54191, 410517, 304057, -36656, 215183, 228315, 97127, -32335, -42406, -25162, 263025, -228625, 68260, 130327, 191369, 215800, 84704, -115108, 346863, 257141, 42408, 14887, 73745, 313252, 302082, -52901, 69305, 134092, 345057, 161120, 239722, 111510, 325168, -137140, -165232, -183364, -141665, 332676, 89040, -118918, 6789, -21996, 97648, -412809, -12967, -41163, 159783, -154011, 32134, -18722, -109757, 200052, -14172, 403428, -31450, 922, -76930, -60850, -100305, -36091, -13228, -374, -22907, -72706, 86519, 201836, 15925, 176479, -263031]
13190C6832e2846J0503k14897d4021C71231f3116E3155J27904C2729l212J34865
13179A64382e2657A6284J49059C5679J62637a10306A61119P9939L26245a72670
13168C02438m2936J25104f8522A97231o6268a61795L217A43752K62785d9371K612
13157d6759n7356B21268K33241k23381g466p3206l4160k06409J29299B72433a3697
13145B67274A2448K63295A24554N7967C7893a03834j18602a1421J572r3096b9820
13133B33851R0054c5670C38076G0512a02077o5600A27442N6521i5224F5021i8519
13121a42184A9361K5380M2637J48728A14861e3514B74450G3768b04930B36763
13110f0377A52128g1803A07170K36321A37562j4012L10801A42347o5579a42952
$$ y = [36832, -52846, -42343, -257240, -44021, 371231, -63116, 53155, 181059, 32729, 29517, 164382, -52657, 16284, 165343, 35679, 198316, -110306, 161119, 241058, 567303, -172670, 302438, 259502, 384606, -68522, 197231, 130963, -161795, -158578, 143752, 406537, -49371, -46759, -104115, 221268, 454509, 231128, -7466, -80672, -114832, -321241, -191942, 272433, -13697, 267274, 12448, 275743, 124554, 182521, 37893, -103834, -222436, -11421, -9849, -102945, -29820, 233851, 323905, -35670, 338076, 70512, -102077, -167677, 127442, 183963, -95224, 65021, -98519, -142184, 19361, 44741, 87378, 236106, 114861, -53514, 274450, 73768, -204930, 236763, -60377, 152128, -71803, 107170, 343491, 137562, 123550, 434351, 142347, 76768, -142952]
13099A06815A1578c53684D2343C403N1930a80795e8057j19403E1106m752h3269
13087A38633e6600A5850b9891B6865M2455a36191I1238j2127P8356k272n0861
13076A04334a50377A11407h2473j021n9714e3902j7823F5437J82425I0689d2032
13064A8262g4021j3471A74128D9859b7242F1594r144b04461c9714r303I5848b79423
13051b05753I2753D518a31910D5642K9669K56273A21032B5545K9594C719b9644
13039A67050a76822d9774g801B10474c96878B92841a00077G7877R2801B8091J36021
13028A64112b9035j35878C32485A11506B0099c2632r669J4537A62983Q206b5733
13016B08501I4360c6343A42942a10072B26791K9334b04801D39795c66770B0839
$$ y = [106815, 11578, -353684, 42343, 3403, 55333, -180795, -58057, -177460, 51106, 46354, -83269, 138633, -56600, 15850, -29891, 26865, 69320, -136191, 91238, 79111, 157467, 155195, 104334, -150377, 111407, -82473, -83494, -143208, -53902, -71725, 65437, 247862, 90689, -42032, 18262, -74021, -87492, 174128, 49859, -27242, 61594, 52450, -204461, -39714, -49017, 95848, -279423, -205753, 92753, 4518, -131910, 45642, 75311, 331584, 121032, 25545, 55139, 3719, -29644, 167050, -176822, -49774, -7801, 210474, -396878, 292841, -100077, 77877, 170678, 28091, 164112, -29035, -164913, 332485, 111506, 20099, -32632, -42301, -27764, 162983, 171189, -25733, 208501, 94360, -36343, 142942, -110072, 226791, 256125, -204801, 439795, -366770, 20839]
13005B23848b31641g5381B52896J04808b72994C39143j25248o2104P6645I4966
12994a35538j09990I4159J79482b69242A25183h7980C095Q2289a69443B54460
12983a31907G9741a91430D6095a71511A24978g0510j24903B6710c17918C21474
12972B7352G02a17296E952N9979J28418a7633j50155j372C98270c71461A89333
12960G5162K4115m6936L1013c51798C1008b05063j46203I4087Q2399b01974k8373
12949b30347a1725A19716f02k21098A6711O9165b65309a0953j67933B42762a36813
12937A87147B6384K3729c5161A88674j4668C2864a06206G701R5432a34599A25617
12925c9992I6745a4191B78798F5339g8507n2874B13412G6297j3411K61364a50904
$$ y = [223848, -231641, -75381, 252896, 357704, -272994, 339143, 213895, 151791, 228436, 94966, -135538, -245528, 94159, 273641, -269242, 125183, -87980, 3095, 85384, -169443, 254460, -131907, 79741, -191430, 46095, -171511, 124978, -70510, -195413, 26710, -317918, 321474, 27352, 702, -117296, 5952, 65931, 194349, -17633, -167788, -169160, 398270, -371461, 189333, 75162, 99277, 52341, 83354, -351798, 31008, -205063, -351266, 94087, 176486, -201974, -230347, -11725, 119716, -602, -221700, 16711, 85876, -265309, -10953, -178886, 242762, -136813, 187147, 26384, 50113, -35161, 188674, 174006, 32864, -106206, 7701, 103133, -134599, 125617, -39992, 96745, -14191, 278798, 65339, -78507, -131381, 213412, 76297, 62886, 324250, -150904]
12913a81574l2566A51058a56322P7471k735F3137a37324A88144F507a77932Q0877
12902i7055A02537g6897C20078A35425J9643M851a7491r7967J3624J3484F9880
12890A90728c23026a310j74714e4417C6297K19575E0382A5692h3411A37057a47753
12878a06947E1577a4415r1453L1660p6761f8777C43860D61b23946B1736b48170
12866a92159j76306I6471K02417I4285B3165c2679A46209J45561N0120b62218
12855a21092I0026J75912d0051j54486G3392J47265N2214b45799N2391J2114l3848
12844b15142A39352A6292a06652C40810n9975a7788B12896f0428j59735N4139
12834a66024A24742L8881b6081j02745k3979n0683B17152C4116L9274c0496o0539
$$ y = [-181574, -214140, 151058, -156322, -78851, -81586, 63137, -137324, 188144, 6507, -177932, -97055, 102537, -76897, 320078, 135425, 155068, 159919, -17491, -115458, -101834, -88350, 69880, 190728, -323026, -1310, -176024, -54417, 36297, 255872, 50382, 15692, -83411, 137057, -147753, -106947, 51577, -14415, -105868, -74208, -150969, -68777, 343860, 461, -223946, 21736, -248170, -192159, -368465, 96471, 298888, 94285, 23165, -32679, 146209, 291770, 341890, -262218, -121092, 90026, 265938, -40051, -194537, 73392, 220657, 272871, -245799, -193408, -181294, -215142, 139352, 16292, -106652, 340810, 280835, -17788, 212896, -60428, -220163, -166024, 124742, 163623, -26081, -128826, -152805, -203488, 217152, 34116, 73390, -30496, -91035]
12823i1035j09191C066b78151B00688a35890A35426i3414B12418f4429n313a7965
12811I5196a27641I8592a47982D0395f3774j88160K6747p2475e7622I0025C9890
12799i6215A95757a45367C0618L65103d2196G0162b86442D42398b9906k03081
12789b32987A33640h3158B01626a03307G9175l360h5321b2815k73803a33720N4562
12778g9158o3834A69101D7180a42128R854B47208C0115b5063p3290R641c7832
12766C47593A14534R8708j8577r3700k4561g4938B38878c0040j74642j3215e0428
12754g4472A86990h7397C76169g8115A13950b74581L8534j53600o4152c9790n2120
12743i1910M4327j94486A57858O8550a82543F0716b06749d9906j36178B26093
$$ y = [-91035, -200226, 3066, -278151, 200688, -135890, 135426, -93414, 212418, -64429, -69742, -17965, 95196, -127641, 98592, -147982, 40395, -63774, -251934, -225187, -297662, -57622, 90025, 39890, -96215, 195757, -145367, 30618, 395721, -42196, 70162, -286442, 442398, -29906, -232987, 133640, -83158, 201626, -103307, 79175, 75815, -85321, -22815, -296618, -133720, -79158, -142992, 169101, 47180, -142128, -132274, 247208, 30115, -25063, -98353, -88712, -37832, 347593, 114534, 213242, 194665, 100965, 76404, -74938, 238878, -30040, -204682, -217897, -50428, -74472, 186990, -87397, 376169, -78115, 113950, -274581, -236047, -389647, -453799, -39790, -91910, -47583, -242069, 157858, 226408, -182543, 60716, -206749, -49906, -186084, 226093]
12732A0404Q9627L5320J61015f8280A36593F4444a58232C77448A39373g1498c0917
12720e0682A63981b0508j95614F4886c7138p2090m44440c4527l9374B51754D5719
12708A69831N3199e2792H7035K91372A17954E2651Q6852Q1048F4234b6042A74262
12696b24882N3762A73P8980b84792a26931B3583Q8063k0898a30742D7362b97102
12684B13138a04878A99348b1330B54842I322J7391j1096a5130B7120K38059H3765
12672C28486a63089B88215A5668J25948K7129N8232I8997J3924i032C03906E6413
12660A35049a30125K6879j89967c720D0431L9624c5050j16448H2223i4952I3632
12648B9994a47214B02644B3377d0776C610R079a70631L5582b5689j84471C91797
$$ y = [10404, 100031, 135351, 296366, -68280, 136593, 64444, -158232, 377448, 139373, -71498, -30917, -50682, 163981, -20508, -216122, 64886, -37138, -109228, -553668, -34527, -73901, 251754, 45719, 169831, 223030, -52792, 87035, 378407, 117954, 52651, 139503, 220551, 64234, -26042, 174262, -224882, -171120, 173, 79153, -284792, -126931, 23583, 111646, 90748, -130742, 47362, -297102, 213138, -104878, 199348, -21330, 254842, 9322, 26713, 15617, -15130, 27120, 265179, 83765, 328486, -163089, 288215, 15668, 141616, 168745, 226977, 98997, 112921, -9032, 303906, 56413, 135049, -130125, -103246, -293213, -3720, 40431, 80055, -35050, -151498, 82223, -94952, 93632, 29994, -147214, 202644, 23377, -40776, 3610, 12689, -170631, -135049, -25689, -210160, 391797]
12636d3470j35381g4122h985j22953A20597m4923K92862A19406e4659D3966J55418
12625A99384H6954J1829J52540G6187b83876B63715l0140b01461B49090E8226
12614B56604b54275Q0743B11443N3812B7934d7268B73094e7728A07285c17601
12603C64827A69474j5201a62742L2849J2132j86453a37481A57198E6266L79407
12593D35673C8017K34232j29772J29978h9422k108A32268E0762J66489a61898
12582A3779a93154D7875K3355R3672G3317a22366d6012J3473j53732N8217p8978
12571b07032h4106j60185J04770B06046F7974i208j17889C31404j56107K49594
12561D24891a81894c0917A84858d5869B03005q4712J44538m4484q2234G18K21102
$$ y = [-43470, -178851, -74122, -8985, -131938, 120597, 75674, 368536, 119406, -54659, 43966, 199384, 86954, 98783, 251323, 76187, -283876, 263715, 233575, -201461, 249090, 58226, 256604, -254275, -173532, 211443, 265255, 27934, -47268, 273094, -57728, 107285, -317601, 364827, 169474, 154273, -162742, -129893, -117761, -304214, -137481, 157198, 56266, 435673, 38017, 272249, 142477, 272455, -89422, -91530, 132268, 50762, 217251, -161898, 13779, -193154, 47875, 71230, 164902, 73317, -122366, -46012, -32539, -186271, -128054, -207032, -84106, -244291, -139521, 206046, 67974, -9208, -127097, 331404, 175297, 424891, -181894, -30917, 184858, -45869, 203005, 118293, 262831, 218347, 136113, 718, 221820]
12550B21820f7432n813j06824F7575A7479L2745a34820e6858j44313J00024j69223
12539b70370H3466B5836L09945e0024GN9303a1288r2113c1059A33326C9244G651
12526B75451b70071B4089P8028a04453G1629b60427N1863Q8364d0482A28271K32100
12515C60371B6593L46545i9503B01313D330f1914H2132a43055A84979Q166c02621
12503B57139a96604B27102b02703B12617d5548k72565P777D7395P9839L8877i9363
12491B87410E0416a11016D3097b73561A43277o2034L0188D4136A6411g4240n2163
12480a26403K9055j1199d8195H6537J98952a35050N9563B4209Q5467m8429a1511
12468B535J1015h8193C07323A17276g2586n5318J4268D73709b27756b3959M207
$$ y = [221820, -67432, -73245, -180069, 67575, 17479, 50224, -134820, -56858, -201171, -101147, -270370, 83466, 25836, 335781, -50024, 7, 59310, -11288, -103401, -31059, 133326, 39244, 7651, 275451, -270071, 24089, 102117, -104453, 71629, -260427, -208564, -120200, -40482, 128271, 360371, 26593, 373138, -99503, 201313, 4330, -61914, 82132, -143055, 184979, 193145, -302621, 257139, -196604, 227102, -202703, 212617, -45548, -318113, -310336, 47395, 127234, 166111, -99363, 287410, 50416, -111016, 43097, -273561, 143277, 81243, 111431, 44136, 16411, -74240, -126403, -97348, -108547, -48195, 86537, 285489, -135050, -75487, 24209, 109676, 61247, -11511, 2535, 13550, -88193, 307323, 117276, -72586, -127904, -113636, 473709, -227756, -23959, -19752]
12457a9752j3394i538G8115d6939A42698A650d4398q3207A37092A0068a10396
12445A01073k7608K16468B5450d9932C34293F5294a76000a1946B59412k5966B4616
12433I3554h9786D16143i2846d0618k1717m4663m19032a37287K2478A05435a14995
12421A36789b49828A20512a65593A91741N3928c31210A82218q3837m701i5559
12410f0902A85406i9648J4991A88746b83105k0729B4310d3026k5987R628A02869
12398a1856E0226d8332j5383B20770f0345j57234L912N921O0948q794B33006F3455
12385c22185C12350I6392m1020J76817b7544k04565a11970C689K35877D3625a70167
12373b0809A7022d42238L0489R4523M4867C2247a07174B35956I240b07945B43578
$$ y = [-19752, -33146, -9538, 78115, -46939, 142698, 1650, -44398, -127605, 137092, 10068, -110396, 101073, 73465, 289933, 25450, -49932, 334293, 65294, -176000, -11946, 259412, 233446, 24616, 93554, -89786, 416143, -92846, -40618, -62335, -106998, -526030, -137287, -114809, 105435, -114995, 136789, -249828, 120512, -165593, 191741, 245669, -331210, 182218, 98381, 93680, -95559, -60902, 185406, -99648, -84657, 188746, -283105, -303834, 24310, -43026, -69013, -59385, 102869, -11856, 50226, -48332, -63715, 220770, -60345, -217579, -213667, -207746, -146798, -155592, 233006, 63455, -322185, 312350, 96392, 55372, 232189, -27544, -232109, -111970, 3689, 239566, 43625, -170167, -20809, 17022, -442238, -411749, -317226, -272359, 32247, -107174, 235956, 9240, -207945, 243578]
12361b40952f0173D5774a03195k27746A8664a62655B6690N5720J39583I84a71825
12349B9262P5215g1721C80756b059n673l5435j09400a7320C5797J4406M6609a53324
12336C33174b92205C05482j47969C9088b09330b4137l691h559l17334e4596j86290
12325b40886B00126c30719i4999D07394b53348A39138F3566A9912a09666b8794
12314C4334a21533A77268o8436N4253G5791J7576k2114N141l7423a37462n9591
12303a97053L4150O238G4279J05540c5932j80930G8328J0557K86871f8279j06254
12292a74533C34788j05304r4876O5405B2603b8027I1088N2549b253A8902c4190
12280e8314G5328J08624L6335L23426k23840j35096C9143I389a48955e2876n2200
$$ y = [-240952, -60173, 45774, -103195, -330941, 18664, -162655, 26690, 82410, 221993, 984, -171825, 29262, 104477, -71721, 380756, -2059, -7732, -43167, -152567, -17320, 35797, 50203, 96812, -153324, 333174, -292205, 305482, 157513, 39088, -209330, -24137, -27828, -8559, -325893, -54596, -240886, 200126, -330719, -94999, 407394, -253348, 139138, 63566, 19912, -109666, -28794, 34334, -121533, 177268, 108832, 163085, 75791, 93367, 71253, 76394, 38971, -137462, -197053, -162903, -156665, 74279, 179819, -35932, -216862, 78328, 88885, 375756, -68279, -174533, 334788, 229484, 134608, 200013, 22603, -28027, 91088, 143637, -2253, 18902, -34190, -58314, 75328, 183952, 220287, 543713, 319873, 184777, 39143, 9389, -148955, -52876, -105076]
12269a05076A19918a02828F9791h2047B77072A22940E3709j7190K60274b88716
12258B04088J02675A15549J16517a34629A19974a44495C66008A70340h3651A53364
12247F3547J64925o9164a02981G4116b17517A92497k4191a87391C7754J77255
12237B15009J86252N577a640r7628B08380J40103A34987E9935Q6604R1259j08735
12226A29063K09312r7061m9068g9533A08268J03440n7350C2249J84607i8805B67734
12214C02534E3548L1167P7365M6518A6847a59560C73417d6117n1120A51380A0204
12202B26817H3815K38426G8725e9209l0648d3498A75753f7987l9039A04143K90753
12191C94896A08807O3453C2885K48407J26220A39004J63845n7469l1742m2924
$$ y = [-105076, 119918, -102828, 69791, -82047, 277072, 122940, 53709, 36519, 296793, -288716, 204088, 306763, 115549, 232066, -134629, 119974, -144495, 366008, 170340, -83651, 153364, 63547, 228472, 159308, -102981, 74116, -217517, 192497, 168306, -187391, 37754, 215009, 401261, 406838, -1640, -99268, 208380, 348483, 134987, 59935, 146539, 237798, 129063, 338375, 241314, 192246, -79533, 108268, 211708, 154358, 32249, 216856, -98805, 267734, 302534, 53548, 84715, 162080, 208598, 16847, -159560, 373417, -46117, -97237, 151380, 10204, 226817, 83815, 322241, 78725, -59209, -89857, -43498, 175753, -67987, -107026, 104143, 394896, 108807, 172260, 32885, 281292, 407512, 139004, 302849, 245380, 213638, 170714]
12181A70714O3602I856Q9956a73827e3754A25390a20975N3216B11208c2289j9127
12170e1416J835A11706M5931a45138B08560e5768E6329J27097a52388N8549D4650
12158e716A96378a11605K30C9131c23688B6463M41509b7546j3503C55054H1109
12146c00568e4047A722Q9074b95309i6000L9669B967a81557B01513a59527p9050
12135b38577e3414k80293O4937A01958c9537G8826g9518k2451j55651A57238o257
12124A50981B8599a3605A5243c3743B3532a28005A50645C6343h7232A10698A2525
12112G2382e01276a3540j3829m3662J4174C0540d8421m2795C6914L84988I9906
12100b72187A35221K61635A97981l565c15938A00189h7172a7601A23727a82399
$$ y = [170714, 234316, 9856, 99812, -173827, -53754, 125390, -120975, -67759, 211208, -32289, -51416, -49581, 111706, 157637, -145138, 208560, -55768, 56329, 183426, -152388, -93839, 44650, -5716, 196378, -111605, -111375, 39131, -323688, 26463, 467972, -27546, -41049, 355054, 81109, -300568, -54047, 1722, 90796, -295309, -96000, -56331, 2967, -181557, 201513, -159527, -238577, -53414, -333707, -268770, 101958, -39537, 78826, -79518, -101969, -257620, 157238, 150981, 28599, -13605, 15243, -33743, 23532, -128005, 150645, 36343, -87232, 110698, 12525, 72382, -501276, -13540, -27369, -71031, -56857, 30540, -48421, -91216, 36914, 421902, 99906, -272187, 135221, 396856, 197981, 194416, -315938, 100189, -87172, -17601, 123727, -182399]
12089B75649A36093D5067j3014a49169G3207k360K9682L74532J84210O36033j40781
12078A154523C54619c1957A76008d00238J76659j3539Q2712j28126A03964c0782
12067A58131M4453c13571H9355l3828b80736g1270F350a87696o0640F9334L6507
12056A05841N8650b62403B25551i1093J6371B52767b90187a40137q6293A49350
12045B36214e3643f438l84104A36121g6032B05848h6297j76139f1787e868A59680
12033g0615n83A87910k1251h9375B86084b21153D3595N6219a82815k5760g5236
12021b33010B5742O7690j0069B6002J63479p0349b40986B26967a22624k9228K5520
12010a26332A2044a17345c393j0459A29413f8331B72305b01705g5990A07588k8308
$$ y = [275649, 136093, 45067, 32053, -149169, 73207, 70847, 100529, 475061, 659271, 1295304, 1154523, 354619, -31957, 176008, -400238, -223579, -237118, -154406, -282532, 103964, -30782, 158131, 202584, -313571, 89355, 55527, -280736, -71270, 6350, -187696, -248336, 69334, 105841, 164491, -262403, 225551, -91093, -74722, 252767, -290187, -140137, -226430, 149350, 236214, -53643, -6438, -390542, 136121, -76032, 205848, -86297, -262436, -61787, -5868, 159680, -70615, -71198, 187910, 166659, -89375, 286084, -221153, 43595, 99814, -182815, -208575, -75236, -233010, 25742, 93432, 83363, 26002, 189481, 119132, -240986, 226967, -122624, -151852, -126332, 12044, -117345, -3393, -13852, 129413, -68331, 272305, -201705, -75990, 107588, 79280]
11999G9280a4610A00064a38655A89334c0007a1205k74732A99941E2265l658c35116
11987A3268e2634j7397B52335B5726d2687q1560A08613B8087J27401l673J361
11976A53176a0392b873B01427c05253a05364i278j82344E4770K88397b79501o930
11965b86431B40108a43517j14680C44324B878h1268B42399b12958O2557O3566
11955h6835o614M0082l14866B7991J59801h9570B86753d4694k6387n1549I3418
11943D9920P0173c29895C3531b10122G7902c6275B7650L80752f0163a4097A9856
11931H2863C3443a65354A4574a60139l4935B3857e0072A7767O4766b50492B99027
11919B0315a22146C8971I028a13225c4236F1811J5114K5454a29222c9897j108
$$ y = [79280, -14610, 100064, -138655, 189334, -30007, -11205, -285937, 199941, 52265, 48607, -335116, 13268, -52634, -70031, 252335, 25726, -42687, -124247, 108613, 28087, 155488, 151815, 153176, -10392, -2873, 201427, -305253, -105364, -9278, -191622, 54770, 343167, -279501, -286431, 240108, -143517, -258197, 344324, 2878, -81268, 242399, -212958, -150401, -86835, -93449, -53367, -368233, 27991, 187792, -89570, 286753, -44694, -71081, -122630, 93418, 49920, 120093, -329895, 33531, -210122, 77902, -36275, 27650, 408402, -60163, -14097, 19856, 82863, 33443, -165354, 14574, -160139, -195074, 23857, -50072, 17767, 82533, -250492, 299027, 20315, -122146, 38971, 9028, -113225, -34236, 61811, 76925, 102379, -129222, -39897, -41005]
11908d1005I162e2950F3497M0391P128b69965A80790B4139d4227k20843G3581
11896A22451K40608D0699b099p6710C93557b95124C6672L13698i6643c8717H5212
11884e0138A70996c26098J44510A93862C6518k858K6295a09381I0718a72832k0594
11873a93426Q8620M8005d897E7523R678i6463l1585k21213A5487b5638m8608a6028
11860c60942n3132f5853j0232K6070l4890F9084f951B14845b22359I132L28693
11849C37825C3745a20517B27975d277l08981c4212m05k6908j5202D073a78334
11837B13755B4725a9997l38934a22577j26107A64098i6710D0024n391O2011a6872
11825a19235r5723J1902A4703d0596A51072c9994l26027A01073c02497g881n1013
$$ y = [-41005, 9162, -52950, 63497, 103888, 111016, -269965, 180790, 24139, -44227, -265070, 73581, 122451, 363059, 40699, -2099, -78809, 393557, -295124, 36672, 350370, -96643, -38717, 85212, -50138, 170996, -326098, -181588, 193862, 36518, 33660, 59955, -109381, 90718, -172832, -193426, -104806, -56801, -4897, 57523, 67201, -96463, -128048, -349261, 15487, -25638, -74246, -16028, -360942, -414074, -65853, -76085, -50015, -84905, 69084, -6951, 214845, -222359, 9132, 337825, 33745, -120517, 227975, -4277, -313258, -34212, -34617, -61525, -76727, 4073, -178334, 213755, 24725, -19997, -358931, -122577, -248684, 164098, -96710, 40024, 34633, 96644, -16872, -119235, -214958, -203056, 14703, -40596, 151072, -39994, -366021, 101073, -302497, -7881, -58894]
11814e8894k8241B75648b24663B84203b58487a03270a6257j0611J1849B13346
11803I6711j0564B9132a62519f6950I6346k162a65823e2632j62445O2199C0008
11791b04196J1613a663B7722J43296a71183N3804b5737q7246d5464k85221g2624
11779H7690b2741d474A6776a06038B28823a98812Q1335l3341P5372b2929j48160
11768a71089d8385B05969g5578A08041a76372D1176a08441B5725a40243k17224
11758c57467h1694j17211A92593A5931i7123k73508Q2621F599c8275j04808A78028
11746G7296d3566j33022B14256b9076A06484K9337N5131b337A46158a91855i1538
11734D9814a25657I5563a35499n0816A1970L10869b06984P9610j81562a4627A1687
$$ y = [-58894, -87135, 275648, -224663, 284203, -258487, -103270, -16257, -26868, -15019, 213346, 96711, 86147, 29132, -162519, -66950, 96346, 94184, -165823, -52632, -215077, -152878, 30008, -204196, -192583, -1663, 27722, 171018, -171183, -117379, -25737, -112983, -45464, -330685, -72624, 87690, -22741, -4474, 16776, -106038, 228823, -198812, -117477, -150818, -75446, -22929, -171089, -48385, 205969, -75578, 108041, -176372, 41176, -108441, 25725, -140243, -357467, -81694, -198905, 192593, 15931, -97123, -370631, -288010, 6599, -38275, -143083, 178028, 77296, -43566, -176588, 214256, -29076, 106484, 135821, 190952, -2337, 146158, -191855, -91538, 49814, -125657, 95563, -135499, -186315, 11970, 322839, -206984, -127374, -308936, -14627, 11687]
11722B41348a46600B7013i0964C8165a2264B77067b18729R8219N1697H7954a9681
11710C10990a17423I4540J02888o9455a31342A54798n9838c5429B38686A409e0078
11698A46364a97276d2557k35359Q0663B15180c11242J20600A55694k5109K0032
11688A50617a25674n1792o362Q2751C83507G7658K0974c0893A18840a19942c0122
11676A00020m921I700e068B15357q8585D5424J83969c7512B48751b65251G5354
11664a24128d3652l6500k0648A79262b01150c2059A11958Q3069G5951J25060r5617
11653A05394d540H9594i8486R308J4698A33400R3136b0795C79446c4473A85851
11641c52296D2449d013o2237B829J01891a32469A41099i6568J5624C38038A06127
$$ y = [241348, -146600, 27013, -90964, 38165, -12264, 277067, -218729, -120510, -68813, 87954, -19681, 310990, -117423, 94540, 197428, 127973, -131342, 154798, 94960, -35429, 238686, 1409, -50078, 146364, -197276, -42557, -277916, -197253, 215180, -311242, -190642, 155694, 130585, 150617, -125674, -177466, -183828, -101077, 383507, 77658, 98632, -30893, 118840, -119942, -30122, 100020, 95099, 9700, -5068, 215357, 126772, 45424, 229393, -37512, 248751, -265251, 75354, -124128, -43652, -80152, -100800, 179262, -201150, -32059, 111958, 195027, 75951, 201011, 105394, -4540, 89594, -98486, -89178, -74480, 133400, 226536, -20795, 379446, -34473, 185851, -352296, 42449, -4013, -66250, 2829, 104720, -132469, 141099, -96568, -80944, 338038, 106127]
11629B45790Q9873a7373B73931l6052k9370K6106a95930A73642b35138o4861d5916
11617B01332a0198E2039a80796E1352R2999d3789B8834n190b2283A23800b95069
11605D9820Q9237m2260a62269f2353A19480a47632C54206j64464b26208D03843
11594B02882L1699b1939B21020H3475J69921e7196A86231k6131g7307A59397O4475
11583B23872Q8426j49932J03523a94627J2563B65874a15709A08437J66240j25711
11573A48966c2310B20070c2215A58455J34227I2714K4529g1286D5029O3040J73638
11562B81707c1799c841j13374K6953k07753A53089b69036B63087o6483b70503
11551A32739a8430B76022b19205C4117b49644R3779C50146g0702n9245G9478A1439
$$ y = [245790, 335663, -17373, 273931, 237879, 208509, 234615, -195930, 173642, -235138, -299999, -45916, 201332, -10198, 52039, -180796, 51352, 144351, -43789, 28834, 23644, -22283, 123800, -295069, 49820, 139057, 96797, -162269, -62353, 119480, -147632, 354206, 189742, -226208, 403843, 202882, 234581, -21939, 221020, 83475, 253396, -57196, 186231, 160100, -77307, 159397, 223872, 312298, 162366, 265889, -194627, -182064, 265874, -115709, 108437, 274677, 148966, -32310, 220070, -32215, 158455, 292682, 92714, 117243, -71286, 45029, 108069, 281707, -31799, -3841, -117215, -90262, -298015, 153089, -269036, 263087, 196604, -270503, 132739, -18430, 276022, -219205, 34117, -249644, -155865, 350146, -70702, -129947, 79478, 11439]
11539A55139G7033L67778B14236D3939J12522J01227b06194H5415b5862j2107
11529c7969n5395K0522A83702q9608j5873j7036J37908e33044i2786k7702b1605
11517e481p5308A48529Q8414D936d1941A15795f6325C7099N103O9116C3903R6248
11505A30151a28945A41093c7249A25607c38877A52481J45684f7511r115I7652
11494I8613c1501C0182r363K33917k7579a98648A98797K3220J2611a60793b0392
11482i4290A81191b7582G4703j6365b16025d2009B35582a7759C38538L2091a44813
11470F8314J4712P7298a01392D6737d321j40924n170c9633k4614A68430p5170
11459I3260B2532a05072I1979K9383b37570A17522a15568F4457b76253J14591
$$ y = [155139, 77033, 444811, 214236, 43939, 156461, 257688, -206194, 85415, -25862, -37969, -93364, -72842, 183702, 94094, 78221, 61185, 199093, -533044, -92786, -120488, -21605, -5481, -80789, 148529, 236943, 4936, -41941, 115795, -66325, 37099, 42202, 111318, 33903, 130151, -128945, 141093, -37249, 125607, -338877, 152481, 298165, -67511, -76626, 97652, 98613, -31501, 30182, 20819, 254736, 227157, -198648, 198797, 222017, 234628, -160793, -20392, -94290, 181191, -27582, 74703, 58338, -216025, -42009, 235582, -17759, 338538, 370629, -144813, 68314, 83026, 160324, -101392, 46737, -4321, -145245, -150415, -39633, -64247, 168430, 93260, 22532, -105072, 91979, 121362, -237570, 117522, -115568, 64457, -276253, -161662]
11449a61662M9329c5279H5100e722A35265f1518D6541g99C02562f4263c976F6718
11436g7485A27507b77936B09441b6419j82182Q5957A18233a3127A56704d0137
11425B93265e6811C90760j09912L663J9620e0133A61304a92089H2223i4446A59943
11413e6113j18975A28515a9049j22864b5380l75428B75106m9675C0036j2803N1228
11402F8461K43131G2138a5570n3564C17973a01080l2305B77039a29279B98237
11391g3314J3361B35107j8185p7796b30453A9870c5568j97531N5879A83471a94250
11379D2429a19252E3655Q619A9495f2564R406A36788K48064a25243A71811O4962
11368B36773a08360A15720d9849D70198H9360O6884C4951J00379A0907i5482a8387
$$ y = [-161662, -112333, -35279, 85100, -5722, 135265, -61518, 46541, -799, 302562, -64263, -3976, 66718, -77485, 127507, -277936, 209441, -26419, -208601, -122644, 118233, -13127, 156704, -40137, 293265, -56811, 390760, 280848, 284511, 304131, -50133, 161304, -192089, 82223, -94446, 159943, -56113, -175088, 128515, -19049, -141913, -25380, -400808, 275106, 225431, 30036, 17233, 68461, 311592, 72138, -15570, -69134, 317973, -101080, -133385, 277039, -129279, 298237, -73314, -59953, 235107, 216922, 139126, -230453, 19870, -35568, -233099, -177220, 183471, -194250, 42429, -119252, 53655, 62274, 19495, -62564, -53158, 136788, 384852, -125243, 171811, 236773, -108360, 115720, -49849, 470198, 89360, 156244, 34951, 135330, 10907, -95482, -18387]
11356D36335C5053j0869f0842j10154I4334i2706A91621k5587F8524B2456a14162
11344E5184J70747d7077j7725A70075c11359J35598b360j57785M0198e2426k61284
11333c13710c2631A62070a4726A26123b63249H826e216C2506L5707n781d6100
11321B4686a99194q3905A10173O3599g4898G0466a17725k9745A08603a12782D6521
11309g2790H2733a28156A49208a47808M8364K2608r3932j24185Q5987A06266J07781
11298B14047g2814n2808F5600a62919R358k65676a99414O0975o7070J8834g6972
11286C0200J75487h6925n1885I4851a56134A6450e9204k0983o7932q0413B67769
11274G0700O4390M2660a68107C23172a32623j27821l5556J43935M0755A48401
$$ y = [436335, 35053, 24184, -60842, -170996, 94334, -92706, 191621, 166034, 68524, 22456, -114162, 55184, 225931, -47077, -64802, 170075, -311359, -175761, -2360, -160145, -119947, -52426, -313710, -32631, 162070, -14726, 126123, -263249, 8826, -5216, 32506, 68213, 62432, -46100, 24686, -199194, -283099, 110173, 173772, -74898, 70466, -117725, -147470, 108603, -112782, 46521, -72790, 82733, -128156, 149208, -147808, -99444, -76836, -170768, -294953, -208966, 106266, 214047, -72814, -125622, 65600, -162919, -153561, -419237, -199414, -138439, -205509, -186675, -76972, 30200, 205687, -86925, -138810, 94851, -156134, 16450, -59204, -80187, -148119, -228532, 267769, 70700, 135090, 177750, -168107, 323172, -132623, -260444, -296000, -152065, -111310, 148401]
11263A85726A8087a60826C53510a43870C7060a60300F1612a85664G8801i6907
11252A33975J86977A16630i2385O48i111A54283h8202j28624H8343f7348j18187
11241a85535j78094J75277j28025J23999D1150a37624B48204b53456A40542d0874
11230D193e6111r7660F094P3035a28810K7920j41421D07171A5129J10604a75086
11218a1763G418c09274d1398H5942e3282p4832d7066o3614l013b9676A69554i3080
11205a65622I3193d50688f6356D9868b5406A04870C3118f1697A67875c29259A43886
11193b13665H645M5833n230p299c80741F6182d16811h9021A9144L02050G4392
11181a42662A26559D4254j319K5424i0901l700F7008g3710j3371L4694j82096
$$ y = [185726, 18087, -160826, 353510, -143870, 37060, -160300, 61612, -185664, 78801, -96907, 133975, 320952, 116630, -92385, -91737, -9111, 154283, -88202, -216826, 88343, -67348, -185535, -363629, -188352, -316377, -192378, 41150, -137624, 248204, -253456, 140542, -40874, 4193, -56111, -153771, 6094, 79129, -128810, -100890, -242311, 407171, 15129, 125733, -175086, -11763, 7418, -309274, -41398, 85942, -53282, -128114, -47066, -110680, -113693, -29676, 169554, -93080, -165622, 93193, -450688, -66356, 49868, -25406, 104870, 33118, -61697, 167875, -329259, 143886, -213665, 8645, 54478, 49248, 41949, -380741, 66182, -416811, -89021, 19144, 321194, 74392, -142662, 126559, 44254, 42935, 68359, -90901, -94601, 67008, -73710, -87081, -52387, -234483]
11170b34483D5129e06844a7738A5380g7231J0041A79123i3555p3524I0482b05690
11158A53517c16831B05831h080C3023K8432P343a39380r0263h3546j6988A93708
11146B06862g0257p1064B01229b08192j29384p1298H0074k2461f2598A93321e1052
11134d8511A10833c2950p406H5884e2769F211a76164B2702K7026b42319A91093
11122B06280B9767K1484a27056A40730e8500b4716D86732A55565C6578a05227
11111A18373M7288B5933K5286M5968A5241P8157N9948e7507J0843A22826e4214
11099C6723J36970K8349m0788b76274A91970c777C3170b4621D41543A76748L60768
11088E37516B39121J25049e10F36315k47368M5748A6126a6724D2154M06561j14686
$$ y = [-234483, 45129, -506844, -17738, 15380, -77231, -67190, 179123, -93555, -167079, 90482, -205690, 153517, -316831, 205831, -8080, 33023, 61455, 68798, -139380, -229643, -83546, -100534, 193708, 206862, -70257, -141321, 201229, -208192, -337576, -408874, 80074, 57613, -62598, 193321, -51052, -48511, 110833, -32950, -40356, 85884, -52769, 6211, -176164, 22702, 49728, -242319, 191093, 206280, 29767, 51251, -127056, 140730, -58500, -24716, 486732, 155565, 36578, -105227, 118373, 165661, 25933, 51219, 97187, 15241, 93398, 153346, -57507, -46664, 122826, -54214, 36723, 173693, 202042, 161254, -276274, 191970, -3777, 33170, -24621, 441543, 176748, 537516, 239121, 364170, -510, 636315, 388947, 434695, 16126, -16724, 42154, 448715, 334029]
11077C34029f7273A47986J90104n4386m7949p5012J62522p7255J7446J30986j54012
11066B40430m1757J51690A45868Q0019J29045M5860N5219j21128M40084C30262
11055G07561l32045o2754J54837K71142j53184M373J25671j35520o2653k37659
11045B79769K78240L91987l54990n7666J10400J73202k10085j61373L3498j44362
11035C38620M41328M8605k17372k32786j05233K84323n3238j49991j70603M10336
11025E93989J46680l21394o8263L88940l55295L06191J34438k35230k64100L80646
11015G06602j37939r9747N3210r6842R8703j03748m5434j20497n263K20042K74
11004D69361l7099Q6012j37080J82423J37310j99994j4983k41563N51289C70844
$$ y = [334029, -67273, 147986, 338090, 283704, 235755, 160743, 323265, 246010, 263456, 394442, 240430, 198673, 350363, 145868, 225887, 354932, 400792, 456011, 334883, 774967, 330262, 707561, 375516, 312762, 467599, 738741, 585557, 589930, 715601, 580081, 517428, 279769, 558009, 949996, 595006, 537340, 647740, 820942, 610857, 449484, 482982, 338620, 779948, 828553, 611181, 378395, 273162, 557485, 504247, 354256, 183653, 593989, 740669, 419275, 351012, 739952, 384657, 690848, 825286, 590056, 325956, 706602, 568663, 468916, 522126, 425284, 523987, 420239, 374805, 254308, 249045, 469087, 469361, 432262, 518274, 381194, 563617, 700927, 500933, 485950, 244387, 795676, 370844]
10993E82848K44259j38077C42094K11252J35221j08690J02469K88129p6501k23064
10983F70910K24522K2320M2529J04098k20147L58436q7144L41850j85397M88180
10973A760157Q5883L40381j1665K72782Q7788o8296n08183l06146j24843N9700
10963A587558k82083J20742l24640L47351k22084K62656K68241j14449l85299
10954A257993J12545j30689m97991J56385k40339K34471j93076k17077J70389
10945F52611k08329p4692n5054R2352j88842J00885I6118j327K06667j19068m2303
10934A40087D7168K21622r242l7841a44189H0092j710a81577C3251R1903C126
10922B61248b35205N8095C46521a31887C30503D6910C055O9780f7280C9565K9033
$$ y = [582848, 827107, 689030, 342094, 553346, 688567, 579877, 682346, 970475, 893974, 670910, 895432, 917752, 960281, 1064379, 844232, 1202668, 1115524, 1457374, 1271977, 1760157, 1846040, 2186421, 2174756, 2447538, 2535326, 2467030, 1958847, 1652701, 1527858, 1587558, 1305475, 1426217, 1101577, 1448928, 1226844, 1489500, 1757741, 1643292, 1257993, 1370538, 1239849, 741858, 898243, 657904, 892375, 699299, 482222, 652611, 444282, 369590, 314536, 406888, 218046, 318931, 96118, 94791, 301458, 182390, 140087, 47168, 268790, 259548, 221707, -144189, 80092, 78382, -181577, 33251, 125154, 3126, 261248, -235205, -177110, 346521, -131887, 330503, 46910, 3055, 72835, -67280, 39565, 68598]
10911F8598a56985A55550a66562A88665d0646j49171j21812i8872B37957d1143
10900b19518O7841c0271E5473i1840B5638c6918j42840A30474d022A67150n6220
10889A10930f6353j8767o1611k2063E5935n842J63950b97364J20981B9966J0229
10878D0195J51404G5481b22461D7408i4109B39204a90786A76277i0814A51381
10867h6879l03614C3492d709D3869b38713A59937l8075i6463o0654e4199k49078
10856c03277k1148D56533a70637P0216F3114a24161G0563J31629L9941j19671
10846A22462b33279J0922A17976d7094G7543p583a83672C63197C5121a18826A55527
10834C7582h3448A60735K5197a3236l50432a7656k43495d5731B34627c08397A33900
$$ y = [68598, -156985, 155550, -166562, 188665, -40646, -189817, -311629, -98872, 237957, -41143, -219518, -151677, -30271, 55473, -91840, 25638, -36918, -179758, 130474, -4022, 167150, 110930, -66353, -85120, -146731, -168794, 55935, 50093, 214043, -297364, -176383, 29966, 40195, 191599, 75481, -222461, 47408, -94109, 239204, -190786, 176277, -90814, 151381, -86879, -390493, 33492, -4709, 43869, -238713, 159937, 121862, -96463, -157117, -54199, -303277, -324425, 456533, -170637, -100421, 63114, -124161, 70563, 202192, 242133, 122462, -233279, -222357, 117976, -47094, 77543, 69960, -183672, 363197, 35121, -118826, 155527, 37582, -83448, 160735, 185932, -13236, -363668, -17656, -261151, -45731, 234627, -308397, 133900]
10822c24104L5986A55497b64038i7343n5822m0711K3419j96731G4217L1386J36169
10811B41772b04195B20818f1212q3025b811A63871O1552a11574C66454b39479
10800f5264k42323L5948I8033K1328g320A17848l4857L2690f2790G5414l3794
10789D1620a96397O0673A0458J73778C2387e2981F9106B4520d781j93919K0991
10778a77709o4428D19c3515k30983e9828G5333e1735o4386C06a22730N9484j15566
10766a78812A94529a014m8611D02582A30311d0331p918B7731A0272a57477B77520
10754c47565H9963c86339B67063a81640j26990g0317p8922j7430j66090E792i3927
10742I8777M0388b54718a8245C988a37169F3297M7427b02187j7494A79160O8046
$$ y = [-324104, -288118, 155497, -264038, -97343, -153165, -193876, -170457, -367188, 74217, 105603, 241772, -204195, 220818, -61212, -144237, -2811, 163871, 225423, -111574, 366454, -239479, -65264, -307587, -271639, 98033, 119361, -7320, 117848, 82991, 115681, -62790, 75414, 41620, -196397, -135724, 10458, 184236, 32387, -52981, 69106, 24520, -4781, -198700, -177709, -242137, 419, -33515, -264498, -59828, 75333, -51735, -116121, 306, -122730, -63246, -178812, 194529, -1014, -49625, 402582, 130311, -40331, -48249, 27731, 10272, -157477, 277520, -347565, 89963, -386339, 267063, -181640, -308630, -70317, -149239, -166669, -332759, 5792, -93927, 98777, 139165, -254718, -18245, 3988, -137169, 63297, 110724, -202187, -219681, 179160, 247206]
10731B47206a08242B59269h3119a38l2630A1985M609a70839l0875L0285m5818
10720b17247J2083B10073a29215A20000N8755A7936P2803a3103B01593D0137i2191
10708a58283B45145q1991a71007b2004F7892d697B8175b14819H7689c61717B4743
10696b15530j5611c1444g439k72508J39835f8604m5481j03091j15052h8475A44278
10684c0880A31723a25933c9279A03696B2551b04064i7403c3966A45784b8319D0034
10672A92571L4979a55340D4357j2481a72118f1440j3907C1924a0335C01891D8073
10660c4775H5987c19053G2273O9865a72784M3237j005q8055Q3961e8772B19422
10648A04824a64611f9700A64596l8500L5353L4371d9188F7650a53510A87790l461
$$ y = [247206, -108242, 259269, -83119, -138, -32768, 11985, 16594, -170839, -201714, -171429, -217247, -205164, 210073, -129215, 120000, 178755, 17936, 90739, -13103, 201593, 40137, -92191, -158283, 245145, 163154, -171007, -22004, 67892, -4697, 28175, -214819, 87689, -361717, 24743, -215530, -231141, -31444, -7439, -279947, -140112, -68604, -114085, -217176, -332228, -88475, 144278, -30880, 131723, -125933, -39279, 103696, 22551, -204064, -97403, -33966, 145784, -28319, 40034, 192571, 227550, -155340, 44357, 31876, -172118, -61440, -75347, 31924, -10335, 301891, 48073, -34775, 85987, -319053, 72273, 142138, -172784, -129547, -130552, -218607, -134646, -58772, 219422, 104824, -164611, -69700, 164596, 126096, 161449, 195820, -49188, 67650, -153510, 187790, 184329]
10637A84329a97653n5448A77541a68854A71309a92835n0577d6934O741J7027D5043
10625A07279d8615q1196q0204r0241i6478I9366N7432a28888A87022h6158B2380
10613b93622E697a87062r2746R1952L4019q8938a899B56062B1443a37503F8636
10601b24873G8440K91562I9630c5926l2755A7569J18233a89212c1455j70665p7210
10590b79330h2078j67256c2251m03796R7829A56892B6079L1944A2613a85833Q5941
10579i9892L811j09777k09833b0455A90586E7894O9333a42869a5777k35448L9903
10568b11322A22601J6713L5486E1858a98373N7591J1163O270M6853C25123A39351
10556a97117I847a6384r6187A14441d7294A47860D4070c8137B30577B1904J10915
$$ y = [184329, -197653, -253101, 177541, -168854, 171309, -192835, -243412, -46934, -40193, -23166, 45043, 107279, -48615, -129811, -210015, -300256, -96478, 99366, 156798, -128888, 187022, -86158, 22380, -293622, 5697, -187062, -279808, -187856, -153837, -242775, -1899, 256062, 21443, -137503, 68636, -224873, 78440, 370002, 99630, -35926, -68681, 17569, 135802, -189212, -31455, -202120, -279330, -82078, -249334, -32251, -436047, -338218, 156892, 26079, 58023, 12613, -185833, -99892, -96081, -205858, -415691, -20455, 190586, 57894, 127227, -142869, -15777, -251225, -211322, 122601, 139314, 174800, 51858, -198373, -140782, -129619, -123349, -76496, 325123, 139351, -197117, 9847, -16384, -112571, 114441, -47294, 147860, 44070, -38137, 230577, 21904, 132819]
10545A32819b08095j06695a9848A08655m4420P7392b75557c328j60756d7942q4397
10534a32339A16833b2738j59779j06477a1919r1299I6938K8443a48115E0522g9188
10522b73341B69045d5271k74740A31343B3124J72646a13397r415H2323b4339j0904
10511c5243G5765c15890Q0316A39406F728L03302c92065J72120E9496J12627b10388
10499B03397b59051j7589K0517g9544B84899b49011j20404b4169A54686a80270
10488a78228Q0174C21470b00716G3365g43C1432a33280F13596k78127p5510H7035
10476A40290K3835J419C271a41521C8136L171a30821M222j90690J38746B89945
10464A24882f3239K8463k41228J21950B628L1917M888A6296b13465F3513f3224
$$ y = [132819, -208095, -314790, -19848, 108655, 64235, 141627, -275557, -3328, -164084, -47942, -132339, 116833, -22738, -182517, -288994, -11919, -103218, 96938, 125381, -148115, 50522, -79188, -273341, 269045, -45271, -320011, 131343, 23124, 195770, -113397, -122812, 82323, -24339, -35243, 75765, -315890, -235574, 139406, 6728, 310030, -392065, -219945, 59496, 172123, -210388, 203397, -259051, -276640, -256123, -79544, 284899, -249011, -369415, -24169, 154686, -180270, -178228, -98054, 321470, -200716, 73365, -743, 31432, -133280, 613596, 335469, 259959, 87035, 140290, 164125, 165544, 3271, -141521, 38136, 41307, -130821, -126599, -317289, -178543, 289945, 124882, -63239, -34776, -276004, -154054, 2628, 34545, 39433, 16296, -213465, 63513, -63224]
10452a11041n1196q3876h6984A90637G7385l545M9612J75434j28271b53834A22059
10440h5043r436H25P5878a41752F6481A6257a39078j55696H3806J40331R4947
10429C19084e2007j27080k39331a04638F7100R6300g6442C7526f6527K6928k5799
10418f5398A17039a99574Q054A28519a33947p7100A59986a54538a3119j20705
10408a33824K2281j08462J01971G8583a35511F2496K08129a89354G485R1622h4017
10396A90206a9822D8086J45036n5737O3530J27313j35680F8828K90242C0047O148
10385C6195a45532O0938A27590J30432f002F3783R5802J63293A38317K58617f4639
10373B18347j03406h5179H0954J42743B6369O7598L30456A38697J11554o9386
$$ y = [-111041, -162237, -246113, -86984, 190637, 77385, 73840, 123452, 298886, 170615, -253834, 122059, -85043, -94479, 825, 76703, -141752, 66481, 16257, -139078, -294774, 83806, 224137, 319084, -52007, -179087, -418418, -104638, 67100, 163400, -76442, 37526, -66527, -39599, -65398, 117039, -199574, -191520, 128519, -133947, -211047, 159986, -154538, -13119, -133824, -111543, -220005, -118034, 78583, -135511, 62496, 270625, -189354, 7485, 99107, -84017, 190206, -19822, 48086, 193122, 137385, 200915, 328228, 192548, 68828, 359070, 30047, 36195, -145532, -84594, 127590, 258022, -6002, 63783, 159585, 322878, 138317, 396934, -64639, 218347, 114941, -85179, 80954, 223697, 26369, 93967, 424423, 138697, 250251, 180865]
10363A80865J77698B8283d0560C82559A66925K0851F9317i5975C9069N7225K47050
10352C43344l8511K15248j96662K63683J38522C45759L76498l26746r7673J66042
10342D63880p0758G9372q962a63700B63962A24707J32329b9031C6669O2313j4515
10331H4467J00418l6274b5805k39282A27913J45137H3968l4426K24006A14751
10320a50311B6589I799K0472K93047C2409d623B19262j05716g0642p4326a6623
10308a07892M3524F6045O3294h440j07833k26810a03421E2993P2622O381K99698
10297D31694a57263K4951e7985F6375d1191E268K62225o6535B7368c33581h276
10285E6963a42173j45030d0342k13877C4352e6338q909j0226r0250D5288Q156
$$ y = [180865, 358563, 28283, -40560, 382559, 166925, 187776, 69317, -95975, 39069, 96294, 343344, 304833, 520081, 323419, 587102, 725624, 345759, 722257, 395511, 297838, 463880, 393122, 79372, 70410, -163700, 263962, 124707, 257036, -29031, 36669, 98982, 84467, 184885, 148611, -25805, -265087, 127913, 273050, 83968, 49542, 273548, 114751, -150311, 26589, 9799, 30271, 323318, 32409, -4623, 219262, 113546, -70642, -144968, -16623, -107892, -64368, 66045, 129339, -8440, -116273, -343083, -103421, 52993, 125615, 131996, 431694, -157263, -132312, -57985, 66375, -41191, 5268, 267493, 200958, 27368, -333581, -8276, 56963, -142173, -287203, -40342, -254219, 34352, -56338, -65247, -75473, -165723, 45288, 53444]
10274E3444J34640i7459m9925J4040A28536J10753c09711R0680F8719a33359M1839
10263i1520H1573K99452A78489c6555A26538N27321A14943L2759j9523Q5904B0384
10251I3748o733l3466e4089k23297i4517j97644E7440K0187i0361H5507K15211
10240C00718a30940k17925a72877C37824b44512r1365o544A71652M6354a82541
10229b42551j13021A17771b03702K1602Q2712G8818l0010a75058c0314j35592
10219a65906r5703N3408e6764j4196l9473J481A43437a87894p3511A85664c12605
10207E561a32313j90290P6945b9163l84497A1600f7694B3300b37585B45175l4454
10196B10721d743A87031a12853B19512B6672b5281B08634A5295b0532k35930D0006
$$ y = [53444, 188084, -97459, -147384, -133344, 128536, 239289, -309711, -219031, 68719, -133359, -91520, 81573, 381025, 178489, -36555, 126538, 653859, 114943, 147702, 128179, 214083, 20384, 93748, 87015, 53549, -54089, -277386, -94517, -292161, 57440, 77627, -90361, 85507, 300718, -130940, -348865, -172877, 337824, -244512, -335877, -342421, 171652, 218006, -182541, -242551, -355572, 117771, -203702, -182100, -99388, 78818, 48808, -175058, -30314, -165906, -261609, -208201, -56764, -70960, -110433, -108952, 143437, -187894, -261405, 185664, -312605, 5561, -132313, -322603, -245658, -29163, -413660, 11600, -67694, 23300, -237585, 245175, 210721, -4743, 187031, -112853, 219512, 26672, -25281, 208634, 15295, -20532, -256462, 40006]
10184I9135O950m357K4344L2124a43408B67316q9403i5156c5556a5898o1247A92529
10171H4396C7862j6068c307D539a63474P1708B01804f0902j31976g3207O097o5257
10159a32367k35683a18529o9441B80382D1504a33890j83836O0075j1833E5941
10148a25108a5911E8153c10j34651A5481a41678l6934l1704A5617a49218A33729
10136E5576c52691M4657d1568A52982k9502a9938k01496e0176G9381c84880i4185
10124B355e553A09723b61005M7745N5596F9654C1886a76542L254O8127j22929
10113b28090O027A01768a81148d2992p5525M4333F9586b02157B9551c47620a19445
10101a93753A084J98060I5963b5220j69699k11485J10432A47113c4576A94995
$$ y = [99135, 106085, 101728, 126072, 158196, -143408, 267316, 177913, -95156, -35556, -15898, -77145, 192529, 84396, 37862, 21794, -3307, 4539, -163474, -91766, 201804, -60902, -192878, -73207, -67110, -132367, -368050, -118529, -187970, 280382, 41504, -133890, -317726, -257651, -269484, 55941, -125108, -15911, 58153, -310, -134961, 15481, -141678, -178612, -210316, 15617, -149218, 133729, 55576, -352691, -308034, -41568, 152982, 123480, -19938, -221434, -50176, 79381, -384880, -94185, 2355, -5553, 109723, -261005, -213260, -157664, 69654, 31886, -176542, -173288, -105161, -228090, -222063, 101768, -181148, -42992, -118517, -74184, 69586, -202157, 29551, -347620, -119445, -193753, 1084, 199144, 95963, -25220, -194919, -406404, -295972, 147113, -34576, 194995]
10090F3483M9948K1264A2392a51554m0869K0649A91228c6893k58911g2551m98800
10079e71351C60147a01766j51164N9052A77772a04664E2047c04138A32327e13399
10068F7998N2885E1068b08380A53138b7978j70979H2978f1740J3789A86798c29110
10056i724k19282b8416l08753i0020O6J4975A10830O7012a72068B25900h2554
10044b6806l02982B6646g8320G7879c2414q2434O005M8525l47827A27411a67559
10032e6517k31820C7829e892A02395m5078a51452j00503B53823b2194m1887D6235
10020e2123j71048B2725f5271j58640J03179H3817c03829B4700i4950M0498A67444
10008c29223A80515k9508a41754r7820A48684O7113f787B22906a60365E3456b51146
$$ y = [63483, 113431, 134695, 12392, -151554, -192423, -171774, 191228, -36893, -295804, -72551, -571351, 360147, -101766, -252930, -193878, 177772, -104664, 52047, -304138, 132327, -513399, 67998, 120883, 51068, -208380, 153138, -27978, -198957, 82978, -61740, -47951, 186798, -329110, -9724, -229006, -28416, -337169, -90020, -89954, -74979, 110830, 177842, -172068, 225900, -82554, -26806, -329788, 26646, -78320, 77879, -32414, -114848, -108843, -60318, -408145, 127411, -167559, -56517, -288337, 37829, -5892, 102395, 57317, -151452, -251955, 253823, -22194, -64081, 46235, -52123, -223171, 22725, -65271, -223911, -120732, 83817, -303829, 24700, -94950, -54452, 167444, -329223, 180515, 151007, -141754, -239574, 148684, 215797, -6787, 222906, -160365, 53456, -251146]
9996B51791a14616m2767k73747E503L21949o2148c63758e1091B83394A0763a07180
9984f7956L3788j68368h9970A28660B7709J43400b27010A8465b4417j06025o6408
9973a96850O4132M5180G3178a53190c4396H8661a02654C6867i704k46809B11918
9961b81750C5599a09100a1928j03363H8434J5042a00802q7947A58923F5664a53473
9949a47655j58566h1928j56737e8365b1662p5294A04683b94611e672E7874k604
9938E5270c6429A33099d4479L037j83493C9999K02093a2463m6603b9136B0349
9926i1555E8945k1793K5091g657C1783O1180a822A11756b1900m5803K2962A57236
9913I0626O3448Q3582j11470c05183B8976b5639j77472c1045j89527B4207b62872
$$ y = [251791, -114616, -157383, -431130, 5503, 327452, 265304, -363758, -51091, 283394, 10763, -107180, -67956, -34168, -202536, -89970, 128660, 27709, 171109, -227010, 18465, -24417, -130442, -196850, -132718, -87538, 73178, -153190, -34396, 88661, -102654, 36867, -9704, -256513, 211918, -281750, 35599, -109100, -11928, -115291, 88434, 103476, -100802, -188749, 158923, 65664, -153473, -147655, -306221, -81928, -238665, -58365, -21662, -96956, 104683, -294611, -5672, 57874, 55270, -36429, 133099, -44479, -41442, -224935, 39999, 242092, -12463, -59066, -29136, 20349, -91555, 58945, 37152, 62243, -7657, 31783, 92963, -1822, 111756, -21900, -67703, -44741, 157236, 90626, 154074, 237656, 126186, -305183, 28976, -25639, -203111, -31045, -220572, 24207, -262872]
9901c56063M777B89233b15897l01743J25019f4593G787f6036j0864j64842d8995
9889b60793f9359E3343J34242A4372A710a75253h3086B4893B264Q213m753b34002
9876g1917A88351h668j33087j96569A10080a35895D8257a13252J9707l18958B796
9864b31283E692c8066B56531i7438B5331a70436l9445m7573O9414G4439a27553
9852I6996M6865i5200c8836A72700a77023F7584J58118F1488a38168J9124B35850
9840C6460K71523C5161a66986D6951a3437B40934a24912A80607F3201b69296I8058
9828b357H9305d4405j3181I9322f8300l5202C8184a90537d5014o0380o09A57500
9815A11357M7338d6223B41205b3040F6903a81668q8247A4873a37307A55785a02756
$$ y = [-356063, -351286, 289233, -215897, -517640, -392621, -64593, 7787, -66036, -76900, -241742, -48995, -260793, -69359, 53343, 187585, 14372, 1710, -175253, -83086, 24893, 2264, 10477, 5724, -234002, -71917, 188351, -8668, -141755, -338324, 110080, -135895, 48257, -113252, -93545, -412503, 2796, -231283, 5692, -38066, 256531, -97438, 25331, -170436, -209881, -257454, -188040, 74439, -127553, 96996, 143861, -95200, -38836, 172700, -177023, 67584, 225702, 61488, -138168, -119044, 235850, 36460, 307983, 35161, -166986, 46951, -13437, 240934, -124912, 180607, 63201, -269296, 98058, -2357, 89305, -44405, -57586, 99322, -68300, -103502, 38184, -190537, -45014, -105394, -106003, 157500, 111357, 158695, -46223, 241205, -23040, 66903, -181668, -269915, 14873, -137307, 155785, -102756]
9803f0875m2598E7749i1569k03422J38310B4305b22413j00203B24345d7951k30619
9792b78570B27338c24691k4154a47811n8557j39487M9774A6224b41910j07150
9782c49060B10374O5313b45402D6732K40782b41668P1301f6176m4994M657q8059
9771a94572f0976j72273r2710C06996G5386a71001g1032J5384D4257e0637m4392
9760i5029j0805l317H0674b79A8625L1169a96679j43862d6079D2474f3385i988
9747a1829m56381a88679A7033a30159N464B87431a32747p4961C5201R3459e7621
9735H208d7445j04140j70583B09447f1173A90411D7558b1302k110k99650J00269
9724b22793P2561C3671a58737P0031o2832c3692j61709R3350j65226a22849o1287
$$ y = [-60875, -103473, 57749, -91569, -294991, -156681, 24305, -222413, -322616, 224345, -47951, -278570, 227338, -324691, -348845, -147811, -206368, -345855, -296081, 16224, -241910, -349060, 210374, 275687, -245402, 46732, 287514, -241668, -170367, -66176, -111170, -106513, -194572, -60976, -233249, -325959, 306996, 75386, -171001, -71032, -55648, 44257, -50637, -95029, -105834, -109151, 80674, -279, 18625, 49794, -196679, -340541, -46079, 42474, -63385, -9988, -11829, -468210, -188679, 17033, -130159, -124695, 287431, -132747, -207708, 35201, 128660, -57621, 8208, -47445, -151585, -322168, 209447, -61173, 190411, 47558, -21302, -23412, -323062, -222793, -150232, 33671, -158737, -88706, -151538, -33692, -195401, -102051, -267277, -122849, -184136]
9713a84136A01351f8626G9509a40304L0450k11521A13249g1685l16650j05786
9703d94121e0473j47216M9196D10452c61809J44682A21141K29595b9155q9763
9693a18918F9715b75548F8987O6231c0007j47756j71483B62722A277h7398j51228
9682b38626j90054J57659B23294I3999c0904G213a20018e6227B6933R6879d1675
9670A58237b47564J02552K783G4313K2103P0557b74090C0473b39184N8304q9382
9659b70262C180a87900h3918n0446F535K74342A9367f0484F44K10430c00232C7625
9646A38937k6843J11599R9741b41715A6541a2113j46977l8245r7686f5121j44027
9635b09148Q794a6091l38815J44081c17j57012e1724A46982a6957C0563d27718
$$ y = [-184136, 101351, -68626, 79509, -140304, -109854, -321375, 113249, -71685, -388335, -494121, -50473, -197689, -148493, 410452, -361809, -217127, 121141, 350736, -29155, -118918, 69715, -275548, 68987, 135218, -30007, -177763, -349246, 262722, 1277, -87398, -238626, -428680, -271021, 223294, 93999, -30904, 7213, -120018, -56227, 26933, 123812, -41675, 158237, -247564, -145012, -142229, 74313, 96416, 166973, -274090, 30473, -239184, -180880, -270262, 3180, -187900, -83918, -134364, 6535, 280877, 19367, -60484, 644, 211074, -300232, 37625, 138937, 112094, 223693, 323434, -241715, 16541, -12113, -159090, -197335, -295021, -65121, -209148, -200354, -16091, -354906, -210825, -317, -157329, -51724, 146982, -16957, 30563, -427718]
9623A091d26165a39842H2146J2988L5814P8273d03998f7476K5824k38279R3532
9612a86399A91345q0897D7851K09156n6180b56340k6877k23212A70118b04701
9601A04504J21555a96491j30208D2361P9108b14554g607q0634l5894J7889o5808
9590a72054e0350J9320l6675j19316F7933a32487f1851B7133j2375P9486K17179
9579C11423j01643e4202J1719m939F9542K36104a35905O0467j25712l4929c5253
9567d1634F8536O3874b4622G0966f296j84235h1146c3278j11960C52370j39339
9556B13031F0646J9742b40875P7587b838k64892L604a3958k61071F8484J17454
9545A85938c16029A6813N925b59133J3500i8636C09815b7549A17140M2382F6994
$$ y = [1091, -426165, -139842, 82146, 95134, 130948, 209221, -403998, -67476, -41652, -279931, -186399, 191345, 110448, 47851, 257007, 200827, -256340, -283217, -506429, 170118, -204701, 104504, 226059, -196491, -326699, 42361, 121469, -214554, -7607, -88241, -124135, -106246, -172054, -50350, -31030, -67705, -187021, 67933, -132487, -61851, 27133, 14758, 94244, 311423, 209780, -54202, -42483, -47422, 69542, 305646, -135905, -75438, -201150, -236079, -35253, -41634, 68536, 132410, -24622, 70966, -6296, -190531, -81146, -33278, -145238, 352370, 213031, 60646, 80388, -240875, -163288, -2838, -267730, -264126, -13958, -275029, 68484, 185938, -316029, 16813, 22738, -259133, -245633, -98636, 309815, -27549, 117140, 159522, 66994]
9533f8539L2002E877c9797l8151k39535a12455D5355L9146a34095E4284B4779
9521b918A73738a54531j8926b5109j37137B84610g7390c7188A88033b1631o6008
9510h7639l05094a36474A29402i2947B09294b92164A35071a15646A55207b41803
9499C31768I9794c5469a1646r5190k24254B29268G002a37508D7775e0229l55802
9488d06031A5967b4407A42065A4653c24616f3095D7224b81683h0696c3869H6715
9476A01267A4698K17974i5688k91616a73217l6119r1555K2376a37603o570q2968
9465b27141A67985a86090I1209c12771b7573n0404o2099d4130A50193l2521n4020
9454F3652a50602P3498A4108b23554c2046G88a57232M9117k2366B02279p6531
$$ y = [-68539, -36537, 5877, -39797, -77948, -317483, -112455, 45355, 84501, -134095, 54284, 24779, -2918, 173738, -154531, -173457, -25109, -162246, 284610, -77390, -37188, 188033, -21631, -87639, -392733, -136474, 129402, -92947, 209294, -292164, 135071, -115646, 155207, -241803, 331768, 99794, -35469, -11646, -106836, -331090, 229268, 7002, -137508, 47775, -50229, -406031, 15967, -24407, 142065, 14653, -324616, -63095, 47224, -281683, -80696, -33869, 86715, 101267, 14698, 232672, -95688, -387304, -173217, -209336, -300891, -278515, -137603, -144173, -227141, 167985, -186090, 91209, -312771, -27573, -77977, -140076, -44130, 150193, 117672, 63652, -150602, -77104, 14108, -223554, -32046, 788, -157232, -108115, -130481, 202279, 125748]
9443A25748g14226f9332k00229O7220a9888A37341a36722C52315A821K3608b54403
9431a57489j07188E37267a01059p1612A99892a69610B441e460A49356B5401d0591
9419a52302M6743c6317H2002C074a6016k79416A83639c50129a16069J2798k47038
9408c50309J28165A21669n5098c00921J25576f0772k1107R967O746D7176c46869
9396A82548b64421a24193a8519j15788n6685d314k15190H4180b55611G2584d1485
9384A33684a52728j0916M4152A38973c51A24087a90732B95661A18300D8856M0458
9373H9314a28546I9880J43454g0207B02338b25040F0045f3006A68323a15018N5849
9362e9169F8024f0410j66634g6330l08438a22555q5210A31672i2916C91b65677
$$ y = [125748, -714226, -69332, -269561, -202341, -19888, 137341, -136722, 352315, 1821, 25429, -254403, -157489, -264677, 537267, -101059, -172671, 199892, -169610, 2441, -5460, 149356, 25401, -40591, -152302, -105559, -36317, 82002, 3074, -16016, -295432, 183639, -350129, -116069, -103271, -350309, -222144, 121669, 66571, -300921, -175345, -60772, -81879, -71912, -65166, 47176, -346869, 182548, -264421, -124193, -18519, -134307, -190992, -4314, -219504, 84180, -255611, 72584, -41485, 133684, -152728, -163644, -119492, 138973, -351, 124087, -190732, 295661, 118300, 48856, 89314, -128546, 99880, 243334, -70207, 202338, -225040, 60045, -63006, 168323, -115018, -59169, 68024, -60410, -227044, -76330, -384768, -122555, -207765, 131672, -92916, 391, -265677]
9350A72540H4605b1648n7799k683H7291a91434n1108A7464L1314A3175a82355
9338I8411e9805j85134F4595i9151A66924J54943a57364d6741o1004A17195a2946
9326a01643l8027O0346E4558F175g64j16441j06329A0140J08807l5782b43694
9314f1860j65584f3374j29571R082C51612I806J58809a56348a3731A61663B0498
9302a04943a6888j13573A3175h8177l05199A65265E6356J06505B3447b09851B96581
9290A5520M8916d14125h988A48650a53450B3606A0632g2774j3259j0105o6370
9279a62508a9317j60653L3895N4042j62268R4331A05908b50691f8025E1800J89434
9268B41234a14310q7533E6867c6476m5546j39750p6258B51059a74532B73382F6084
$$ y = [172540, 84605, -21648, -79447, -82130, 87291, -191434, -242542, 17464, 48778, 13175, -182355, 98411, -59805, -244939, 64595, -99151, 166924, 321867, -157364, -46741, -107745, 117195, -12946, -101643, -139670, -79324, 54558, 6175, -764, -117205, -223534, 10140, 118947, 83165, -243694, -61860, -227444, -63374, -192945, -183863, 351612, 9806, 168615, -156348, -13731, 161663, 20498, -104943, -16888, -130461, 13175, -88177, -393376, 165265, 56356, 162861, 23447, -209851, 296581, 15520, 64436, -414125, -8988, 148650, -153450, 23606, 10632, -72774, -86033, -96138, -162508, -19317, -179970, -146075, -92033, -254301, -159970, 105908, -250691, -68025, 51800, 241234, -114310, -201843, 56867, -36476, -82022, -221772, -298030, 251059, -174532, 273382, 66084]
9256A15698j7128h8677j35843A86158a56297r2734A2080O593g6783K0956k00229
9245b56056a7288o3189F5930a38216E9845J93462a99587A8853P3457d2805j05572
9234a48377k4872I5182B7324a29664A45982b26508B33618a77556j20156f4102
9223I5944h2844G9860b9718j68788D3813e5344l3831l72936J81677a36877e7963
9211a95449k14611a32470c1327p9968M019c3115N311o7266E3702a22476a7847
9199h3370p5450A62690l3070a39261B02649C8224N5191d3914B28408a51824d9588
9187a90422e7978j77167g6051m1193I4372l0357J49592c49744J27509B60981a0301
9175a27840d8542k3836C38705a76425A54313e8216B15529F9700C2010J39040o1981
$$ y = [115698, 98570, -88677, -224520, 186158, -156297, -249031, 12080, 18673, -76783, -55827, -256056, -17288, -80477, 65930, -138216, 59845, 253307, -199587, 18853, 92310, -42805, -148377, -173249, 95182, 27324, -129664, 145982, -226508, 233618, -177556, -297712, -64102, 95944, -82844, 79860, -29718, -198506, 43813, -55344, -89175, -462111, -280434, -136877, -57963, -195449, -410060, -132470, -31327, -111295, -107276, -33115, -27804, -95070, 53702, -122476, -17847, -83370, -158820, 162690, 129620, -139261, 202649, 38224, 93415, -43914, 228408, -151824, -49588, -190422, -57978, -235145, -76051, -117244, 94372, 64015, 213607, -349744, -222235, 260981, -10301, -127840, -48542, -72378, 338705, -176425, 154313, -58216, 215529, 69700, 32010, 171050, 109069]
9164A09069F890a9505D2731b48122d9690n4546J2908D9184a99199B7006h4226
9152b23488P1910b1390j178q3475q5412A28083i1639j55499A41193b03002A54836
9140b23133O3259N0154L7048C09346C1450b3858q1866G0014O3271h7767B6355
9128b02067A89339d18740A20515K16436d78994K25197Q939E2321e34A92056b58603
9116A90165b8054A72685a80134q862D1895d0419j03611b7918D9310f144k11646
9105b17790N7894A14657B1921J3721J00982M6563a85591A44255a34322l704b7849
9093a75475N0195A73806a27459j42417C85359a20656N040j47168R8341M9046A11882
9081A5064a39141j12624e6256j36392H7925a92630N0128A7597J30392a11231j8354
$$ y = [109069, 6890, -19505, 42731, -248122, -49690, -104236, -91328, 49184, -199199, 27006, -84226, -223488, -151578, -21390, -22568, -106043, -191455, 128083, -91639, -247138, 141193, -203002, 154836, -223133, -159874, -109720, -72672, 309346, 31450, -23858, -105724, 70014, 133285, -87767, 26355, -202067, 189339, -418740, 120515, 336951, -478994, -253797, -244858, 52321, -534, 192056, -258603, 190165, -28054, 172685, -180134, -188996, 41895, -40419, -144030, -27918, 49310, -6144, -217790, -159896, 114657, 21921, 35642, 136624, 183187, -185591, 144255, -134322, -138026, -27849, -175475, -125280, 173806, -127459, -269876, 385359, -120656, -115616, -262784, -164443, -115397, 111882, 15064, -139141, -251765, -56256, -192648, 87925, -192630, -142502, 17597, 147989, -111231, -129585]
9070a29585H5698e0454q345B53502I3579l9420b02244G4942J37173e7205j15033
9059a72238j06817a08517D5508b16510k8417h7781A20134C5321a01959M7065q4695
9048a39589J8515A67838b24198E6551b14787A32606b70068C5173b14160N7881
9038a56279m0049j21599J05907L1055A98510h776A32546a58422d4386j7887j88103
9027b50376a23964C701i9004m13878a47386A99114l5891a15011G984b00442f8340
9015h9790p5857H6297P3545b37704B3007N2605c76839A32657h0069G3948a42040
9003a03688A8459a32800c5843j7309d242B0562a85861J7343j27723A65277R1701
8992B56978r4431e2558D9778a75151j65058C36864a77649a8582j59116k2017D1156
$$ y = [-129585, 85698, -50454, -58799, 253502, 93579, 54159, -202244, 74942, 212115, -57205, -172238, -279055, -108517, 45508, -216510, -244927, -87781, 120134, 35321, -101959, -54894, -139589, -121074, 167838, -224198, 56551, -214787, 132606, -270068, 35173, -214160, -156279, -196328, -317927, -212020, -180965, 198510, -8776, 132546, -158422, -44386, -62273, -250376, -123964, 3701, -99004, -512882, -147386, 199114, 163223, -115011, 7984, -200442, -68340, -89790, -165647, 86297, 159842, -237704, 23007, 75612, -376839, 132657, -80069, 73948, -142040, -103688, 18459, -132800, -35843, -53152, -4242, 20562, -185861, -168518, -296241, 165277, 256978, 162547, -52558, 49778, -175151, -340209, 336864, -177649, -18582, -177698, -199715, 41156]
8980I7781a70305M8769r6891k775C0382K0240d42812a16781A38134a83166h7141
8968c4025j22617O9756j30893H8328B8798d569C0449J1900J15538o6806b54149
8956A05522c7100j18192F7638J58432e0100H631i1222m3809l1138O8169M1243
8945e6757B12523B912a56967M2287B38697M8038G6186O2137h0228k03283c8619
8933A30748b70407A35536a5865A94312L9709a86900n2970d8335D3762c73342D88018
8921A71755N6474j8724a97271A40346h4312j10775G1250K0835b8079k7088p5473
8910a30640F767b48589D8043J88236r1649D710d6472C07452g3457A64036a43715
8898d7055E7603b24876a00292K1542r3866B67906k9520a98018d7786l05394A50801
$$ y = [97781, -170305, -121536, -218427, -221202, 30382, 50622, -442812, -116781, 138134, -183166, -87141, -34025, -156642, -86886, -217779, 88328, 28798, -4569, 30449, 42349, 157887, 91081, -254149, 105522, -37100, -155292, 67638, 226070, -50100, 8631, -91222, -135031, -166169, -98000, -56757, 212523, 2912, -156967, -114680, 238697, 286735, 76186, 138323, -80228, -283511, -38619, 130748, -270407, 135536, -15865, 194312, 234021, -186900, -239870, -48335, 43762, -373342, 488018, 171755, 228229, 209505, -197271, 140346, -84312, -195087, 71250, 92085, -28079, -55167, -130640, 6767, -248589, 48043, 236279, 144630, 4710, -46472, 307452, -73457, 164036, -143715, -47055, 57603, -224876, -100292, -78750, -172616, 267906, 238386, -198018, -47786, -353180, 150801]
8886g0827A46089e9222k63821J30177k8827B4927M1324L81570b09584g7448b1553
8874A42563J25351b70233k10R2557d2318j32242A4767f2318P136k7117k94548
8863c76847a41658L561b1132A71575j7327B8404d37306A99264e02814b20892o464
8852b27356j37769O9433A19549e0506A1478L77937b27410a02099r0053A69769
8841A5400a54493b4044C66120a49764j8269b1702A30995g1044H9544a1742B54287
$$ y = [-70827, 146089, -59222, -323043, -192866, -221693, 24927, 66251, 447821, -209584, -77448, -21553, 142563, 267914, -270233, -270443, -177886, -42318, -174560, 14767, -62318, -55182, -82299, -376847, -141658, -138097, -21132, 171575, 154248, 28404, -437306, 199264, -502814, -220892, -227356, -365125, -295692, 119549, -50506, 11478, 389415, -227410, -102099, -192152, 169769, 15400, -154493, -24044, 366120, -149764, -168033, -21702, 130995, -71044, 89544, -11742, 254287]
$$ [...]
##END NTUPLES=NMR SPECTRUM
##END=
