##TITLE=AC1735_SEN00008_9276063_m2krqmUzbs
##JCAMPDX= 6.0         $$ Bruker NMR JCAMP-DX V2.0
##DATA TYPE= NMR SPECTRUM
##DATA CLASS= NTUPLES
##ORIGIN= BRUKER
##OWNER= Administrator
$$ 1.72 TOPSPIN		Version 2.1
$$ 2015-07-17 22:42:25.229 -0700  Administrator@X
$$ Compression mode = diff/dup
##.OBSERVE FREQUENCY= 400.02188249412
##.OBSERVE NUCLEUS= ^1H
##.ACQUISITION MODE= SIMULTANEOUS (DQD)
##.ACQUISITION SCHEME= undefined
##.AVERAGES= 8
##.DIGITISER RES= 22
##SPECTROMETER/DATA SYSTEM= spect
##.PULSE SEQUENCE= zg30
##.SOLVENT NAME= COFFEE_meoh
##.SHIFT REFERENCE= INTERNAL, COFFEE_meoh, 1, 14.98509
##AUDIT TRAIL= $$ (NUMBER, WHEN, WHO, WHERE, PROCESS, VERSION, WHAT)
$$ ##TITLE= Audit trail, TOPSPIN		Version 2.1
$$ ##JCAMPDX= 5.01
$$ ##ORIGIN= Bruker BioSpin GmbH
$$ ##OWNER= Administrator
$$ $$ E:\/data/COFFEE/nmr/AC1735_SEN00008_9276063_m2krqmUzbs/10/pdata/1/auditp.txt
$$ ##AUDIT TRAIL=  $$ (NUMBER, WHEN, WHO, WHERE, PROCESS, VERSION, WHAT)
(   1,<2015-07-17 22:42:18.510 -0700>,<Administrator>,<X>,<go>,<TOPSPIN 2.1>,
      <created by zg
	started at 2015-07-17 22:41:12.213 -0700,
	POWCHK enabled, PULCHK disabled,
       configuration hash MD5:
       21 0F 79 D6 B3 7B B4 F6 88 20 88 DB 03 48 BD 9F
       data hash MD5: 64K
       CB BD C3 3A 78 F4 53 DB 3E F5 3D 6E E0 9D 20 74>)
(   2,<2015-07-17 22:42:21.604 -0700>,<Administrator>,<X>,<proc1d>,<TOPSPIN 2.1>,
      <Start of raw data processing
       efp LB = 0 FT_mod = 6 PKNL = 1 PHC0 = 0 PHC1 = 0 SI = 32K 
       data hash MD5: 32K
       15 11 CD B5 CB 7A 7B CB 3B B9 65 30 C2 03 96 27>)
(   3,<2015-07-17 22:42:21.916 -0700>,<Administrator>,<X>,<proc1d>,<TOPSPIN 2.1>,
      <pk PHC0 = 87.41821 PHC1 = 0 
       data hash MD5: 32K
       B9 67 9F 42 57 E8 BA C6 01 E8 AA C7 B2 0F 8E A4>)
(   4,<2015-07-17 22:42:22.010 -0700>,<Administrator>,<X>,<proc1d>,<TOPSPIN 2.1>,
      <abs ABSG = 1 
       data hash MD5: 32K
       A5 4B 82 81 10 76 0C 9C 56 24 0A 6B BF 16 10 17>)
(   5,<2015-07-17 22:42:22.057 -0700>,<Administrator>,<X>,<proc1d>,<TOPSPIN 2.1>,
      <abs ABSG = 2 
       data hash MD5: 32K
       7A E8 49 25 43 E2 F8 64 97 6F E9 95 B8 B5 85 BA>)
(   6,<2015-07-17 22:42:22.119 -0700>,<Administrator>,<X>,<proc1d>,<TOPSPIN 2.1>,
      <abs ABSG = 3 
       data hash MD5: 32K
       F2 01 D3 03 0D B6 16 A1 52 22 CE 36 39 45 BF 5D>)
(   7,<2015-07-17 22:42:22.166 -0700>,<Administrator>,<X>,<proc1d>,<TOPSPIN 2.1>,
      <abs ABSG = 4 
       data hash MD5: 32K
       25 F6 16 71 2D CD AF 18 7D 3A 76 A8 7A 11 8B A0>)
(   8,<2015-07-17 22:42:22.213 -0700>,<Administrator>,<X>,<proc1d>,<TOPSPIN 2.1>,
      <abs ABSG = 5 
       data hash MD5: 32K
       AE A2 1B 8A 89 45 B1 E8 74 88 7E 7E E1 64 A9 26>)
$$ ##END=
$$ 
$$ $$ hash MD5
$$ $$ C8 44 CC 3D 42 7D 9B 6D 66 C6 00 05 6D 27 36 A3
##$RELAX= 
##$RELAX= 
##$RELAX= 
##$RELAX= 
##$RELAX= 
##$RELAX= 
##$RELAX= 
$$ Bruker specific parameters
$$ --------------------------
##$DU= <E:\>
##$EXPNO= 10
##$NAME= <AC1735_SEN00008_9276063_m2krqmUzbs>
$$ [...]
150 150 150 150 150 150 150 150
##$TP07= 0
##$TPNAME0= <>
##$TPNAME1= <>
##$TPNAME2= <>
##$TPNAME3= <>
##$TPNAME4= <>
##$TPNAME5= <>
##$TPNAME6= <>
##$TPNAME7= <>
##$TPOAL= (0..7)
0.5 0.5 0.5 0.5 0.5 0.5 0.5 0.5
##$TPOFFS= (0..7)
0 0 0 0 0 0 0 0
##$TUNHIN= 0
##$TUNHOUT= 0
##$TUNXOUT= 0
##$USERA1= <user>
##$USERA2= <user>
##$USERA3= <user>
##$USERA4= <user>
##$USERA5= <user>
##$V9= 5
##$VALIST= <valist>
##$VCLIST= <CCCCCCCCCCCCCCC>
##$VD= 0
##$VDLIST= <DDDDDDDDDDDDDDD>
##$VPLIST= <PPPPPPPPPPPPPPP>
##$VTLIST= <TTTTTTTTTTTTTTT>
##$WBST= 2048
##$WBSW= 25
##$XGAIN= (0..3)
0 0 0 0
##$XL= 0
##$YL= 0
##$YMAX_a= 604173
##$YMIN_a= -530312
##$ZGOPTNS= <>
##$ZL1= 120
##$ZL2= 120
##$ZL3= 120
##$ZL4= 120
##$ABSF1= 14.98509
##$ABSF2= -5.573092
##$ABSG= 5
##$ABSL= 3
##$ALPHA= 0
##$AQORDER= 0
##$ASSFAC= 0
##$ASSFACI= 0
##$ASSFACX= 0
##$ASSWID= 0
##$AUNMP= <proc_prof1d_extract_pilot.lims>
##$AXLEFT= 0
##$AXNAME= <>
##$AXNUC= <1H>
##$AXRIGHT= 0
##$AXTYPE= 0
##$AXUNIT= <>
##$AZFE= 0.1
##$AZFW= 0.1
##$BCFW= 0
##$BC_mod= 0
##$BYTORDP= 0
##$COROFFS= 0
##$CY= 15
##$DATMOD= 1
##$DC= 0
##$DFILT= <>
##$DTYPP= 0
##$F1P= 0
##$F2P= 0
##$FCOR= 0.5
##$FTSIZE= 32768
##$FT_mod= 6
##$GAMMA= 0
##$GB= 0
##$INTBC= 1
##$INTSCL= 1
##$ISEN= 128
##$LB= 0
##$LEV0= 0
##$LPBIN= 0
##$MAXI= 10000
##$MC2= 0
##$MEAN= 0
##$ME_mod= 0
##$MI= 0
##$NCOEF= 0
##$NC_proc= -8
##$NLEV= 6
##$NOISF1= 0
##$NOISF2= 0
##$NSP= 0
##$NTH_PI= 0
##$NZP= 0
##$OFFSET= 14.98509
##$PC= 1
##$PHC0= 87.41821
##$PHC1= 0
##$PH_mod= 1
##$PKNL= yes
##$PPARMOD= 0
##$PPDIAG= 0
##$PPIPTYP= 0
##$PPMPNUM= 2147483647
##$PPRESOL= 1
##$PSCAL= 4
##$PSIGN= 0
##$PYNMP= <proc.py>
##$REVERSE= no
##$SF= 400.02
##$SI= 32768
##$SIGF1= 0
##$SIGF2= 0
##$SINO= 400
##$SIOLD= 32768
##$SPECTYP= <>
##$SREGLST= <1H.CDCl3>
##$SSB= 0
##$STSI= 32768
##$STSR= 0
##$SW_p= 8223.68421052631
##$SYMM= 0
##$S_DEV= 0
##$TDeff= 65536
##$TDoff= 0
##$TI= <>
##$TILT= no
##$TM1= 0
##$TM2= 0
##$TOPLEV= 0
##$USERP1= <user>
##$USERP2= <user>
##$USERP3= <user>
##$USERP4= <user>
##$USERP5= <user>
##$WDW= 1
##$XDIM= 32768
##$YMAX_p= 448434142
##$YMIN_p= -641888
##$CURPLOT= <Network HP LaserJet P1505>
##$CURPRIN= <$Network HP LaserJet P1505>
##$DFORMAT= <normdp>
##$LAYOUT= <+/1D_H.xwp>
##$LFORMAT= <normlp>
##$PFORMAT= <normpl>
##$SURQMSG= 1
$$ End of Bruker specific parameters
$$ ---------------------------------
##NTUPLES= NMR SPECTRUM
##VAR_NAME=  FREQUENCY,     SPECTRUM/REAL,   SPECTRUM/IMAG
##SYMBOL=    X,             R,               I
##VAR_TYPE=  INDEPENDENT,   DEPENDENT,       DEPENDENT
##VAR_FORM=  AFFN,          ASDF,            ASDF
##VAR_DIM=   32768,         32768,           32768
##UNITS=     HZ,            ARBITRARY UNITS, ARBITRARY UNITS
##FACTOR=    0.250966925370066, 1,           1
##FIRST=     8223.43324360094, -254177,      -116563
##LAST=      0,             -121186,         43378
##MIN=       0,             -641888,         0
##MAX=       8223.43324360094, 448434142,    0
$$ Real data points
##PAGE= N=1
##DATA TABLE= (X++(R..R)), XYDATA
$$ [...]
19578B68575K4235a88861B3508c9998a0741H8838b4804j56255o5083L0082A14067
$$ 268575 292810 -188861 23508 -39998 -10741 88838 -24804 -181059 -246142 -216060 114067
19566a44997k38355M4132E5858a7976C3251a60132L2889A05280a96896k94299
$$ -144997 -383352 -339220 55858 -17976 33251 -160132 -127243 105280 -196896 -491195
19556d91195a52112M9644D8303r892a45366F8853R9391N9352b69250c6857l23427
$$ -491195 -152112 -102468 48303 38411 -145366 68853 168244 227596 -269250 -36857 -360284
19545c60284i9294q2441F5876a49495A38060D4765J99257O1159a1114B5143j0004
$$ -360284 -99294 -181735 65876 -149495 138060 44765 244022 305181 -11114 25143 15139
19534A5139Q2443b97340I3982m4744B1238P4227J72528D957c3469j2680B1796
$$ 15139 97582 -297340 93982 49238 21238 95465 267993 4957 -33469 -46149 21796
19522B76287b26714j76090A27084a36250e8598B21270c17694l4757A22284h8331
$$ 276287 -226714 -402804 127084 -136250 -58598 221270 -317694 -352451 122284 -88331
19511h5556p7625G1073J00871a18583p3499O7371A17323m2613b75171e9597K8572
$$ -85556 -163181 71073 171944 -118583 -192082 -124711 117323 74710 -275171 -59597 -31025
19500c1025k7827b2620j23942j12656d3931q4726N0156J4663j01228I6252b26991
$$ -31025 -58852 -22620 -146562 -259218 -43931 -128657 -78501 -63838 -165066 96252 -226991
19488A77248d999B0978a07233H5218a58732m2610A60688K2161a54300j66078b225
$$ 177248 -4999 20978 -107233 85218 -158732 -201342 160688 182849 -154300 -320378 -2225
19476D4424J14249a51923J8956p4547f061j13518l03053A16324b16787a08319
$$ 44424 158673 -151923 -132967 -207514 -6061 -119579 -422632 116324 -216787 -108319
19465g4236A59822n5817c3917j87290F2490a05101a1037k14291L1929i5483k477
$$ -74236 159822 104005 -33917 -221207 62490 -105101 -11037 -225328 -193399 -95483 -97960
19454i7960G3233e6233F4836a27488k3809c8949A1811K83677C0933b44706H6479
$$ -97960 73233 -56233 64836 -127488 -151297 -38949 11811 295488 30933 -244706 86479
19442a93769c6822J2631l45652J60443B32302b38497I9775b2854C15746a97315
$$ -193769 -36822 -24191 -369843 -209400 232302 -238497 99775 -22854 315746 -197315
19431C15105a97394Q9001K6820q6191b8635C91259f6375n7295A63309m4694a68018
$$ 315105 -197394 -108393 -81573 -167764 -28635 391259 -66375 -123670 163309 118615 -168018
19419a04945k50968c1870B00568k2218b3464j23243B07968e394C12573B2802a12544
$$ -104945 -355913 -31870 200568 178350 -23464 -146707 207968 -5394 312573 22802 -112544
19407B0082a15639A83909G948J73129a9971E0333a53763k7333g7725B92705h4339
$$ 20082 -115639 183909 7948 181077 -19971 50333 -153763 -181096 -77725 292705 -84339
19395h7058D1320J6896c66757I7097a06194B64850a21584k63217a48971A85017
$$ -87058 41320 58216 -366757 97097 -106194 264850 -121584 -384801 -148971 185017
19384A07027d2544j10932m5235B27262c61840g863m6247o4920b7958A36171a16483
$$ 107027 -42544 -153476 -198711 227262 -361840 -7863 -54110 -119030 -27958 136171 -116483
19372a86303e2464k591o3052A57252b8306m9833b7279l60105a61052H6916b48335
$$ -186303 -52464 -55055 -118107 157252 -28306 -78139 -27279 -387384 -161052 86916 -248335
19360B81043c28748A29791a40955k07085h740j40852D9023c21113E3708r35O4190
$$ 281043 -328748 129791 -140955 -348040 -8740 -149592 49023 -321113 53708 52773 116963
19349A16963I004d52177a03055k17128e4072j6543E5171b03989h745B69380a05057
$$ 116963 9004 -452177 -103055 -320183 -54072 -70615 55171 -203989 -8745 269380 -105057
19337B4788N7121a60227A41170b11194k26879a56322B5550c1059j71938A56481
$$ 24788 81909 -160227 141170 -211194 -438073 -156322 25550 -31059 -202997 156481
19326A40160k9181a54025e367l3745r013j1202A7625d03063f1822B13366b01174
$$ 140160 110979 -154025 -5367 -39112 -48125 -59327 17625 -403063 -61822 213366 -201174
19314a32131k87546f0995E852Q9833f7986F0688a01992n61A91185k3434d4962
$$ -132131 -419677 -60995 5852 95685 -67986 60688 -101992 -102553 191185 167751 -44962
19302D4502f0869A30441b57656h134j36739A02571a83328Q7325A6636J58582h3424
$$ 44502 -60869 130441 -257656 -8134 -144873 102571 -183328 -96003 16636 175218 -83424
19290a27516n9216b7971A63743n0580d54423A90952a90032Q2592p0572e7833B15925
$$ -127516 -186732 -27971 163743 113163 -454423 190952 -190032 -107440 -178012 -57833 215925
19278c54608b0104D4833c6056m19467a03724j9704G1068R3347a78511D28b22996
$$ -354608 -20104 44833 -36056 -455523 -103724 -123428 71068 164415 -178511 428 -222996
19266G6314h487E2761a64697A15023b52415K7825B27001F4597n805f2322D6691
$$ 76314 -8487 52761 -164697 115023 -252415 -224590 227001 64597 58792 -62322 46691
19254a23554j42751a10536p3549k37903g7940j13512k1000d7409j2006k31739
$$ -123554 -266305 -110536 -184085 -421988 -77940 -191452 -212452 -47409 -59415 -291154
19244b91154f3408q0700B85520A33105a31958A22543d24852E6643h2684o7444
$$ -291154 -63408 -144108 285520 133105 -131958 122543 -424852 56643 -82684 -150128
19234a50128N15A82697m2160C3107a49840j99189J24356g2097j84904A97684a99975
$$ -150128 -149613 182697 140537 33107 -149840 -349029 -224673 -72097 -257001 197684 -199975
19222e3001A07078D4434i5301C3572a30714A20786b00723A0063f2766j02552I2840
$$ -53001 107078 44434 -95301 33572 -130714 120786 -200723 10063 -62766 -165318 92840
19210B40478c45861P7153i3119D176J2661g5437j37489A29312B9535a9969C0862
$$ 240478 -345861 -268708 -93119 4176 16837 -75437 -212926 129312 29535 -19969 30862
19198b09247c4341A99830F6195h9288h317l26047k9937B30801a67412A35307C8966
$$ -209247 -34341 199830 66195 -89288 -8317 -334364 -364301 230801 -167412 135307 38966
19186g3764o9186e9830p1161A75323c6394k0877j55708g8053J6724D1229a87775
$$ -73764 -142950 -59830 -130991 175323 -36394 -57271 -212979 -78053 -61329 41229 -187775
19174F308P8508a51885j5238P3386A08132d8262n8295k41834C9756a35547o2967
$$ 6308 84816 -151885 -167123 -93737 108132 -48262 -106557 -348391 39756 -135547 -198514
19163a98514i9197j476k11446B44634I4732C7301d13779C2378f0163j33789H6498
$$ -198514 -99197 -100673 -312119 244634 94732 37301 -413779 32378 -60163 -193952 86498
19151C30761e1039j41053B3173J28469b4200n6121k25717e7480B9594M11118b66557
$$ 330761 -51039 -192092 23173 151642 -24200 -80321 -306038 -57480 29594 440712 -266557
19139e11316b3604j35191A6813a79465K2314j21307A22633e2078J9808k3375C5935
$$ -511316 -23604 -158795 16813 -179465 -157151 -278458 122633 -52078 -32270 -55645 35935
19127A73753D5240N0607a53581b2458k65877f7306C7130a51149R275B7335a05094
$$ 173753 45240 95847 -153581 -22458 -288335 -67306 37130 -151149 -141874 27335 -105094
19115a17233j18317a03685r7479I3787J45209b93723j07875J87595I6039J2363
$$ -117233 -235550 -103685 -201164 93787 238996 -293723 -401598 -214003 96039 108402
19105A08402g2417I2122a92770A60408n9150B0664a52713q4506A68323G3202d43966
$$ 108402 -72417 92122 -192770 160408 101258 20664 -152713 -237219 168323 73202 -443966
19093c9578r5042l1837A58404a1507A3835J6171h3983j94994M1768Q9956C1085
$$ -39578 -134620 -166457 158404 -11507 13835 30006 -83983 -278977 -237209 -147253 31085
19081c75481J33112A32434b50406A88221b11347C7371b5525A97760c8392j01754
$$ -375481 -242369 132434 -250406 188221 -211347 37371 -25525 197760 -38392 -140146
19071a40146O5306b8080n5590A04481c5840a3721o5962L2536Q886o4082b7534
$$ -140146 -74840 -28080 -83670 104481 -35840 -13721 -79683 -47147 -38261 -102343 -27534
19059a37590C15776a00602j83081o2576A91599b81139h7310l85162I1201b1401
$$ -137590 315776 -100602 -283683 -346259 191599 -281139 -87310 -472472 91201 -21401
19048H7195b54870J5982A53110c5838r653F3739c3116B10840i8857q5232p8137
$$ 87195 -254870 -238888 153110 -35838 -45491 63739 -33116 210840 -98857 -184089 -262226
19037b62226J14534f6930A42832j2779e5995B29215c8165B02204g6995o9142A84372
$$ -262226 -147692 -66930 142832 130053 -55995 229215 -38165 202204 -76995 -146137 184372
19025C53575A00268K58881j21539n9517a81713M926P8203A01406f3928A79557
$$ 353575 100268 359149 237610 178093 -181713 -176787 -98584 101406 -63928 179557
19014b78A77456b36854c6557Q411k80007I4169m82a07460M7884B3257a68651k1395
$$ -278 177456 -236854 -36557 -28146 -308153 94169 93687 -107460 -59576 23257 -168651 -190046
19002a90046A33894a99643l2168K9278C83852c02344Q5351c1856o6819a3889D28745
$$ -190046 133894 -199643 -231811 -202533 383852 -302344 -216993 -31856 -98675 -13889 428745
18990d9667j24676A7936f2493a8665B67621c9921j25589a8583o9805d1856J8965
$$ -49667 -174343 17936 -62493 -18665 267621 -39921 -165510 -18583 -88388 -41856 -22891
18979b2891o341A30147a37365A3048J08436n7802a41327I8060N5745f6484b1513
$$ -22891 -29232 130147 -137365 13048 121484 63682 -141327 98060 153805 -66484 -21513
18967c7897C60753E5416A0995K74470a99854Q9816F0692g9851A18070M004e3211
$$ -37897 360753 55416 10995 285465 -199854 -110038 60692 -79851 118070 122074 -53211
18955A680h9824B74600D669a7367k02823b891D8747a09248j8167n4438f8185j2989
$$ 1680 -89824 274600 4669 -17367 -220190 -2891 48747 -109248 -127415 -181853 -68185 -81174
18943h1174J4419A58725J76321a5981G9275b6439P996q1754A48007f3834A60965
$$ -81174 -66755 158725 335046 -15981 79275 -26439 -18443 -100197 148007 -63834 160965
18931A3235a15084A67876b13822P6418b1635B7395K7792J40038F597a44830A69194
$$ 13235 -115084 167876 -213822 -137404 -21635 27395 55187 195225 6597 -144830 169194
18919A37121e5291k16890A08243E650R0423a68071k17566N8333J8290i2100c2829
$$ 137121 -55291 -272181 108243 5650 96073 -168071 -385637 -327304 -309014 -92100 -32829
18907a14363d7480j33587k03923a9512A54978a73120m93B05401b69752P941i327
$$ -114363 -47480 -181067 -384990 -19512 154978 -173120 -173613 205401 -269752 -261811 -9327
18895B45704h5740E4676J58722a53857M3703j1831L3181o7552o1481J01051k98611
$$ 245704 -85740 54676 213398 -153857 -110154 -121985 -88804 -156356 -217837 -116786 -415397
18884d15397a76119p6855i3773l5425b3364j50403a8437j67108A1808J98036d3321
$$ -415397 -176119 -252974 -93773 -129198 -23364 -173767 -18437 -185545 11808 209844 -43321
18872f5313n3671L4737J515r9111N2320G108b58793B4024c60736a30496d4833
$$ -65313 -118984 -84247 -82732 -181843 -129523 7108 -258793 24024 -360736 -130496 -44833
18860g3093A46774E2480K14419a45904E9582e7637j38260P0048A40209J11477
$$ -73093 146774 52480 266899 -145904 59582 -57637 -195897 -125849 140209 251686
18850B51686a02151A02805b17190B04555p2847R0515r3428a58766A77822C9680
$$ 251686 -102151 102805 -217190 204555 131708 222223 128795 -158766 177822 39680
18839b05812a3936B18640c00088B82398a91080N8084K538r7877C3004N4638a10805
$$ -205812 -13936 218640 -300088 282398 -191080 -132996 -130458 -228335 33004 87642 -110805
18827a37764m8712c1936j44183B05935K1413b37988A0391a39211k22264a42864
$$ -137764 -186476 -31936 -176119 205935 227348 -237988 10391 -139211 -361475 -142864
18816e1763j16340m933h3952A9740b33767A15825J36091N3876j07282O1404J0890
$$ -51763 -168103 -173036 -83952 19740 -233767 115825 251916 305792 198510 259914 270804
18805B70804F1157P1943b16725l8899g5744i709F0077d87153a01890l59383A20449
$$ 270804 61157 133100 -216725 -255624 -75744 -9709 60077 -487153 -101890 -461273 120449
18793a82598j63579A34014a03354n9m5806q4657C53500b39590B39649G4925b00078
$$ -182598 -346177 134014 -103354 -103413 -149219 -233876 353500 -239590 239649 74925 -200078
18781B2115a05072D2399a14928B78066j27158D1685a08258k22553d8541e335J620
$$ 22115 -105072 42399 -114928 278066 150908 41685 -108258 -330811 -48541 -5335 -3715
18770c715A14995c00055j49188d2743B4736L58912d2395j94165J12608L0314k26156
$$ -3715 114995 -300055 -449243 -42743 24736 383648 -42395 -236560 -123952 -93638 -319794
18759c19794A03791a24630a1915j06336j66350I2938N2410f7921j60390O9848
$$ -319794 103791 -124630 -11915 -118251 -284601 92938 145348 -67921 -228311 -158463
18749a58463l7976C3806J18247J41893b88177A7210a56075k00356E9184a38960
$$ -158463 -196439 33806 152053 293946 -288177 17210 -156075 -356431 59184 -138960
18738C1286a90902j68481j2858B45654h3437A44749a17109j27151A31790m6164
$$ 31286 -190902 -359383 -372241 245654 -83437 144749 -117109 -244260 131790 85626
18728H5626h2160A45795d053j4961m39853f2088B39993a44283a016j35927o1672
$$ 85626 -82160 145795 -4053 -19014 -458867 -62088 239993 -144283 -1016 -136943 -198615
18717a98615A78456b75622R2301H367a38009A21989a28995A36975a26530K2259
$$ -198615 178456 -275622 -183321 8367 -138009 121989 -128995 136975 -126530 -104271
18707a04271A35851b90801L0250A7822a21856Q582B83722b36335P2871b5316l58647
$$ -104271 135851 -290801 -260551 17822 -121856 -113274 283722 -236335 -163464 -25316 -383963
18696c83963i2370M5193b1839p0706L1987k41307i2640A23134l0693a8455l194
$$ -383963 -92370 -47177 -21839 -92545 -60558 -301865 -92640 123134 92441 -18455 -21649
18685b1649P088k7663A16804a13842H3847g6496A47834C8874c40649A96495E296
$$ -21649 -14561 -42224 116804 -113842 83847 -76496 147834 38874 -340649 196495 5296
18673i0353c1421j64113D4069a26308m0379C3952a25449p9317g4509p0945A62947
$$ -90353 -31421 -195534 44069 -126308 -166687 33952 -125449 -204766 -74509 -145454 162947
18661A36878a98437e4026A59810n7161b1672n7589I0416a61015G2592J1561i5748
$$ 136878 -198437 -54026 159810 102649 -21672 -79261 90416 -161015 72592 84153 -95748
18649a97013c7417j75443m463c3420B8332K48358D3536c12719C12520j53539b16551
$$ -197013 -37417 -212860 -217323 -33420 28332 276690 43536 -312719 312520 158981 -216551
18637b81226J28895k14289d779k57996A80895e0120j00321H7658J68491q8756
$$ -281226 -152331 -366620 -4779 -262775 180895 -50120 -150441 87658 256149 167393
18627A67393p8206k1161P2477b42389o6823E7688b5778B32519D7480c47216N1600
$$ 167393 89187 68026 140503 -242389 -309212 57688 -25778 232519 47480 -347216 -295616
18616b95616B32664k6379d1824A19588b31399B00270b73626a24603l1707J5763
$$ -295616 232664 206285 -41824 119588 -231399 200270 -273626 -124603 -156310 -140547
18606a40547j43202g3767j47926A49600m055P4647d3211k7172B15911c11829g769
$$ -140547 -283749 -73767 -221693 149600 145545 220192 -43211 -70383 215911 -311829 -7769
18594B2438K78b52675m2165a13369G4104a64168c8014j20618a139k26426j2584
$$ 22438 22716 -252675 -294840 -113369 74104 -164168 -38014 -158632 -1139 -227565 -240149
18583b40149l9447A00130a44550k09075J71180b5024B00348d7472p390A37910
$$ -240149 -279596 100130 -144550 -353625 -182445 -25024 200348 -47472 -54862 137910
18572C47512A20712J32401D2806a62410A49352a13256L3123a4709C6069M8108
$$ 347512 120712 253113 42806 -162410 149352 -113256 -80133 -14709 36069 84177
18562H4177a13895A80381g2503c3619j80611B74043c82850J79287A6538a13501
$$ 84177 -113895 180381 -72503 -33619 -214230 274043 -382850 -203563 16538 -113501
18551a42699N6653j03436m5069A83136b08748O730e1564k02023J8155G5230K40712
$$ -142699 -86046 -189482 -234551 183136 -208748 -202018 -51564 -253587 -235432 75230 315942
18540C15942I5443b83343c0272C27949j28946m024I0320J82273a98036b3446I880
$$ 315942 95443 -283343 -30272 327949 199003 194979 90320 272593 -198036 -23446 9880
18528A15140g0478B17961a68185b7597A73428b93091F2607f1308m8741c4991A55463
$$ 115140 -70478 217961 -168185 -27597 173428 -293091 62607 -61308 -110049 -34991 155463
18516I860a48738j5919B6008h1658j44619A2483c24594l465A22375m5241C4657
$$ 9860 -148738 -164657 26008 -81658 -226277 12483 -324594 -328059 122375 77134 34657
18504D9399J62819q4038a08812K6405O662A43549c9373k06994A5197g8889C5464
$$ 49399 212218 128180 -108812 -82407 -75745 143549 -39373 -246367 15197 -78889 35464
18492b582r8339p2978F5357H672b29189E9953c5067m1387j53696Q5300E1708B976
$$ -2582 -100921 -173899 65357 8672 -229189 59953 -35067 -76454 -230150 -144850 51708 2976
18479A88997p9810c44650d4102O052r4510E0717c0048A84697b33460B9317b61504
$$ 188997 109187 -344650 -44102 -38050 -132560 50717 -30048 184697 -233460 29317 -261504
18467h7570M317g684E3254a75858b1409N828m9435Q131m4817b256A64598a17762
$$ -87570 -83253 -7684 53254 -175858 -21409 -15581 -65016 -56885 -101702 -2256 164598 -117762
18454d99034a57836M2756B67578a44041C06479b14676a05814d3653j52198A77379
$$ -499034 -157836 -115080 267578 -144041 306479 -214676 -105814 -43653 -195851 177379
18443a30733j36850C3905o435g7908q4141g9314R446o3733l8219O6499C36212
$$ -130733 -267583 33905 27470 -77908 -162049 -79314 -69868 -133601 -171820 -105321 336212
18431a21012A36661c6298a0265l64915a84805p810A65113E6840J74556b59365
$$ -121012 136661 -36298 -10265 -375180 -184805 -192615 165113 56840 231396 -259365
18420C2774Q1548g0249I402P5138b09082P0909C351a94606o9567D3408b66582
$$ 32774 114322 -70249 9402 84540 -209082 -138173 3351 -194606 -264173 43408 -266582
18408b34533G1219f8686C47334a40080b4639d085j38136D02232j34524j04650
$$ -234533 71219 -68686 347334 -140080 -24639 -4085 -142221 402232 267708 163058
18398A63058a20221C00588a02335B30148d8323A96331e0159B46949E3572O3211
$$ 163058 -120221 300588 -102335 230148 -48323 196331 -50159 246949 53572 116783
18388A16783B2446N2726e61j72808j33221A14941B542J3936a09766k64392J69126
$$ 116783 22446 75172 -561 -173369 -306590 114941 2542 16478 -109766 -374158 -205032
18377b05032L0207g0870A41236o7059p519d9311A98363L948b27317a2553p6873
$$ -205032 -174825 -70870 141236 74177 66658 -49311 198363 202311 -227317 -12553 -89426
18366h9426C873J06216a6281L500j2791n4914D9559K8058a14230G9767a04932
$$ -89426 3873 110089 -16281 -12781 -25572 -80486 49559 77617 -114230 79767 -104932
18354a15694e0439C03447J6400a59151e5493G7523c80326a50631H5127b4772C97391
$$ -115694 -50439 303447 319847 -159151 -55493 77523 -380326 -150631 85127 -24772 397391
18342h9085H8800N4076a14329l4642b4618A9794M4594a41364m3876a331A86348
$$ -89085 88800 142876 -114329 -148971 -24618 19794 64388 -141364 -185240 -1331 186348
18330B46448F2772N8692a24657F5661b91722a6855B35763a97727F8100f2462b0207
$$ 246448 62772 121464 -124657 65661 -291722 -16855 235763 -197727 68100 -62462 -20207
18318a64173g5790D5522c1442l4483o1045n3621A07232a40334j689A37460J13030
$$ -164173 -75790 45522 -31442 -65925 -126970 -180591 107232 -140334 -142023 137460 250490
18307B50490D3455e7209B08842D6504b75523N9041k8777i8202A2766Q6210e7618
$$ 250490 43455 -57209 208842 46504 -275523 -216482 -245259 -98202 12766 98976 -57618
18295A2640a75554j84550i5769j94695o3708A37603c23285a13739A70658P5332
$$ 12640 -175554 -360104 -95769 -290464 -354172 137603 -323285 -113739 170658 245990
18285B45990a9604D28198j47437A36880D7337a29336B69719h6840l4825j54255
$$ 245990 -19604 428198 280761 136880 47337 -129336 269719 -86840 -121665 -275920
18275b75920F3573i0318A97624c73052m9815a64122A60024d53065A34751i8519
$$ -275920 63573 -90318 197624 -373052 -422867 -164122 160024 -453065 134751 -98519
18264a26148A99935d57B43646r8626a62637J4288f2677J3487j40443a0705l16994
$$ -126148 199935 -457 243646 145020 -162637 -148349 -62677 -49190 -189633 -10705 -327699
18253c27699G0430J20267c262q8954c6163D0567i9472d2087j74294j28252a50230
$$ -327699 70430 190697 -3262 -92216 -36163 40567 -99472 -42087 -216381 -344633 -150230
18241A00326c12694B10095d61199a80814Q4840F2023a01640k1499A53146d6723
$$ 100326 -312694 210095 -461199 -180814 -95974 62023 -101640 -123139 153146 -46723
18230A67388o2806P9237c79926J68227C28246G3671a01287j27814H1226c50797
$$ 167388 104582 183819 -379926 -211699 328246 73671 -101287 -229101 81226 -350797
18219D5470c37040A73117C5660d5763B4907i3487j19994H607J43401K9104g6337
$$ 45470 -337040 173117 35660 -45763 24907 -93487 -213481 8607 152008 181112 -76337
18207A85271E5910a46686k8777d394n6614A8272a95747b7041j22972D7031C958
$$ 185271 55910 -146686 -175463 -4394 -61008 18272 -195747 -27041 -150013 47031 3958
18195A54131b30242i3133j88881b4533D1249P6647k7714R0752A9174a99212Q95
$$ 154131 -230242 -93133 -282014 -24533 41249 117896 90182 180934 19174 -199212 -198317
18184a98317d3605D15820i7074j14010A8883f3049j12752B15819d4289g915j06689
$$ -198317 -43605 415820 -97074 -211084 18883 -63049 -175801 215819 -44289 -7915 -114604
18173a14604q4750h439A52776J02454c19924O4051Q647o2991D2936J8140j7603
$$ -114604 -199354 -8439 152776 255230 -319924 -255873 -247226 -310217 42936 61076 43473
18162D3473a7739j45316I8931c50265e712r9065k71194j9456D9374b47625j58226
$$ 43473 -17739 -163055 98931 -350265 -5712 -104777 -375971 -395427 49374 -247625 -405851
18151d05851A22642c7847B83446H579h8524C9123b46286G3063J24094b3876A08969
$$ -405851 122642 -37847 283446 8579 -88524 39123 -246286 73063 197157 -23876 108969
18139a18721K313d2009A02095N2659e143r5466L4797I3820i2616F7945J43251
$$ -118721 -116408 -42009 102095 154754 -5143 -100609 -65812 93820 -92616 67945 211196
18128B11196a49012C103b35350A8962a34802F8802K04535a98231l700h1880B65958
$$ 211196 -149012 3103 -235350 18962 -134802 68802 273337 -198231 -201931 -81880 265958
18116c3500n350j98373j81175i7629A4669R6331J05670a84543h8232J3144c5454
$$ -33500 -38850 -237223 -418398 -97629 14669 111000 216670 -184543 -88232 -75088 -35454
18104C06030A06207e4212A2744J95014c6285n7986E93113H8702a28021D4591a58844
$$ 306030 106207 -54212 12744 207758 -36285 -94271 593113 88702 -128021 44591 -158844
18092a683m65931a72206k25610J94322E148c74212G5761g1188I7691O7710a10650
$$ -1683 -467614 -172206 -397816 -203494 5148 -374212 75761 -71188 97691 165401 -110650
18080b9656C12532a9380q7867d4863j27851A58481k4964e40474a17011B27312
$$ -29656 312532 -19380 -107247 -44863 -172714 158481 133517 -540474 -117011 227312
18069f2595K9968A81231b44672b6665P46k32020h582E4695J41198A3906M08817
$$ -62595 -32627 181231 -244672 -26665 -25919 -257939 -8582 54695 195893 13906 422723
18058D22723c2193m04357J75771B28885L5619e1560H4656a76824C6496i3388J9406
$$ 422723 -32193 -436550 -260779 228885 264504 -51560 84656 -176824 36496 -93388 -73982
18047g3982b2253A74184D415a61402G6062b1746r5945G667b1446B6437J12762
$$ -73982 -22253 174184 4415 -161402 76062 -21746 -117691 7667 -21446 26437 139199
18036A39199l4244f1372I2346b63121C3801J73427p0044K2659K31895h8096l05718
$$ 139199 104955 -61372 92346 -263121 33801 207228 137184 159843 391738 -88096 -393814
18025c93814A65373a10557E0452H229J7623Q0685e1048A187J04710k2650O6946
$$ -393814 165373 -110557 50452 8229 25852 106537 -51048 1187 105897 83247 150193
18014A50193A7655M73017H8500d7037p696B4897a50880D9398J55516c0766j37754
$$ 150193 17655 490672 88500 -47037 -54733 24897 -150880 49398 204914 -30766 -168520
18003a68520d6551C07330j52282a32117C2723h2571L1537B46782l0023A01929
$$ -168520 -46551 307330 155048 -132117 32723 -82571 -51034 246782 216759 101929
17992a60382A65542f3244q7831A74544b04499r8912d0491l1760k93926B1675J01736
$$ -160382 165542 -63244 -151075 174544 -204499 -303411 -40491 -72251 -366177 21675 123411
17981A23411b59184h0187Q918C5994g5944a3396l73548J67621P3356G5140k2311
$$ 123411 -259184 -80187 -71269 35994 -75944 -13396 -386944 -219323 -145967 75140 52829
17970E2829J82368a16895k71955C5600j4543P5428K14118B0532a58307A35303
$$ 52829 235197 -116895 -388850 35600 21057 96485 310603 20532 -158307 135303
17959B52094r1422a09247D4187a75162d736G2212a57436k0897A72755A3474J89217
$$ 252094 160672 -109247 44187 -175162 -4736 72212 -157436 -178333 172755 13474 202691
17948B02691a82475P1750c8384b452B39373b05678A55164C4859b97105P2119A78622
$$ 202691 -182475 -110725 -38384 -2452 239373 -205678 155164 34859 -297105 -224986 178622
17936b29160e8887A9712c31073J11918A7060P6501a70977B06832C5430M8260a26341
$$ -229160 -58887 19712 -331073 -219155 17060 93561 -170977 206832 35430 83690 -126341
17924C44594A6806N1250b11106i3717m7420A4092J65645d0870A46011A7424a0922
$$ 344594 16806 68056 -211106 -93717 -141137 14092 179737 -40870 146011 17424 -10922
17912a27826j8181A10817B005a35093L0429b6813B29908f855D59120B03262b69156
$$ -127826 -146007 110817 2005 -135093 -104664 -26813 229908 -6855 459120 203262 -269156
17900C88584A33436l8734a50196g2157A28043A8631b44505e888c88l50218B51639
$$ 388584 133436 94702 -150196 -72157 128043 18631 -244505 -5888 -388 -350606 251639
17888D2234J39189b91293e897l22466h0178F5698d21804D7684O0350a14432r4498
$$ 42234 181423 -291293 -5897 -328363 -80178 65698 -421804 47684 108034 -114432 -208930
17877b08930b9418J1546j46590b4255o83j48114a2136o303G9340J40978A0543
$$ -208930 -29418 -17872 -164462 -24255 -24938 -173052 -12136 -18439 79340 220318 10543
17865f2914J3820H9500d4487j92979G337i447A84591b67015A53983d4450q318
$$ -62914 -49094 89500 -44487 -237466 7337 -9447 184591 -267015 153983 -44450 -52768
17854e2768A58599b1863P648j19479B69462a09806e1996O700B66773O1081c0392
$$ -52768 158599 -21863 -14215 -133694 269462 -109806 -51996 -45296 266773 327854 -30392
17842A46810Q4147b14996e780j95796R5337p698A7588g944A48124Q1524C7767
$$ 146810 230957 -214996 -5780 -201576 -106239 -113937 17588 -7944 148124 229648 37767
17830c38402I5373K39635h6504F0249a39520j80B23961N4374G4894O1923c577
$$ -338402 95373 335008 -86504 60249 -139520 -139700 223961 278335 74894 136817 -3577
17818A50000L24560k37103h4397a5578B94535F2289b50795R1098A29215f7644
$$ 150000 474560 237457 -84397 -15578 294535 62289 -250795 -159697 129215 -67644
17807b2154k02064e0192A48603c69206J06547J3598n8491B04842g5921D9189e5517
$$ -22154 -224218 -50192 148603 -369206 -262659 -249061 -307552 204842 -75921 49189 -55517
17795g6183A47861F1557O0404D3061f6200p8157p4918i3466B73165p8324e6612
$$ -76183 147861 61557 121961 43061 -66200 -144357 -219275 -93466 273165 194841 -56612
17783C8648d9628k17537A52520g4954C1288Q9124g6410j96351A00045J12754a24788
$$ 38648 -49628 -267165 152520 -74954 31288 120412 -76410 -272761 100045 212799 -124788
17771e5767F1837a74932N9277j5940A49195A5623J02108a94298a680A17136M2165
$$ -55767 61837 -174932 -115655 -131595 149195 15623 117731 -194298 -1680 117136 159301
17760A59301C1151a05817B7770h3970B12827b36731B04343b84813d4108p4370
$$ 159301 31151 -105817 27770 -83970 212827 -236731 204343 -284813 -44108 -118478
17750a18478A78430J127i0930A9865d5905J0228H3036e2336A6519O0807J36763
$$ -118478 178430 179557 -90930 19865 -45905 -35677 83036 -52336 16519 77326 214089
17739B14089J27743m0502q3518c27468J7476a37074D1524J68011f9438D9504g5927
$$ 214089 341832 301330 217812 -327468 -309992 -137074 41524 209535 -69438 49504 -75927
17727B562Q2265Q8417b05766a7088j3019j23602K7594m5127c2812j62060E4575
$$ 2562 84827 173244 -205766 -17088 -30107 -153709 -126115 -171242 -32812 -194872 54575
17715c53200i6448k4581B34969K5644o4541A5150K78598H5008J99332A12581a22920
$$ -353200 -96448 -121029 234969 260613 196072 15150 293748 85008 284340 112581 -122920
17703a14065r2611h4194A8808P4389M8509J11944R0857a20981B19593c2376A3764
$$ -114065 -206676 -84194 18808 93197 141706 253650 344507 -120981 219593 -32376 13764
17691F8357c75024A27697b70483D0898g0439m1470G1726b09303G960c7846d1E9102
$$ 68357 -375024 127697 -270483 40898 -70439 -111909 71726 -209303 7960 -37846 -41 59102
17678A93460c22210E7626b46509A91579J85532I1475A1669J33669l4664K10106
$$ 193460 -322210 57626 -246509 191579 377111 91475 11669 145338 110674 320780
17668C20780A28229J1750I773a65440e5296l2465B80832a91750B1897i1832B35279
$$ 320780 128229 139979 9773 -165440 -55296 -87761 280832 -191750 21897 -91832 235279
17656c52992e7006J5251B16225r298a2965A6641a10669A31461K3112a04873A05287
$$ -352992 -57006 -41755 216225 206927 -12965 16641 -110669 131461 154573 -104873 105287
17644A51787e6435j34493e5469B23136a703A7089R1521a6400q6725j5715G693
$$ 151787 -56435 -190928 -55469 223136 -1703 17089 108610 -16400 -103125 -118840 7693
17632D6937J57423r6611J907D6227J22756e3559j26986E9677h8179c2051C12145
$$ 46937 204360 107749 109656 46227 168983 -53559 -180545 59677 -88179 -32051 312145
17620B91819j22651m2038L3197a60475B10047A9644N6958f6348k01849B8648a37578
$$ 291819 169168 127130 160327 -160475 210047 19644 76602 -66348 -268197 28648 -137578
17608C0525b23274A20643D904M6290K43849b72427B34799i6468O214j35229C04037
$$ 30525 -223274 120643 4904 51194 295043 -272427 234799 -96468 -90254 -225483 304037
17596E2527M9548a49363B37473H8905l109Q3297C899e7649A4808a1636l70046
$$ 52527 102075 -149363 237473 88905 85796 169093 3899 -57649 14808 -11636 -381682
17585c81682a72021f1043l1963l706A04200O5648a5042j53044n8115A5198c61786
$$ -381682 -172021 -61043 -93006 -96712 104200 169848 -15042 -168086 -226201 15198 -361786
17573c4687A26740E07a18124D9864K6838J14945a30298A10741C0221O7263a47721
$$ -34687 126740 507 -118124 49864 76702 191647 -130298 110741 30221 97484 -147721
17561B62002r7876A3859K2251N2416b33406f9421k3128B37158e6826A18947J1164
$$ 262002 164126 13859 36110 88526 -233406 -69421 -92549 237158 -56826 118947 130111
17550A30111g1416n7051L7586c509p1174m9766p9292B02298c0986f147D2881J55677
$$ 130111 -71416 -128467 -90881 -3509 -74683 -124449 -203741 202298 -30986 -6147 42881 198558
17538A98558n8629J13056G2685b68533G560K95001A00553J68028j10525a76032
$$ 198558 139929 252985 72685 -268533 7560 302561 100553 268581 158056 -176032
17527A12936j4478N1069a64B97Q3042a1958B06013g5216C82003K2978E3277L68284
$$ 112936 98458 149527 -164 297 83339 -11958 206013 -75216 382003 404981 53277 421561
17515D21561A06528J07331o9195L9954P7620d540E1336R6146C310R3994b39612
$$ 421561 106528 213859 144664 184618 262238 -4540 51336 147482 3310 97304 -239612
17503d9807j07065B62742j24833j4998i528A13213P5205g1739A08594J05913J233
$$ -49807 -156872 262742 137909 122911 -9528 113213 188418 -71739 108594 214507 215740
17492B15740a44416B19264r8945B5820K86404K5417b21786Q2699F4238K1920B495
$$ 215740 -144416 219264 120319 25820 312224 337641 -221786 -139087 64238 86158 2495
17480E2214a59565A05352L5180K00471J1442C9402L069J06585F9488d714q884
$$ 52214 -159565 105352 140532 341003 352445 39402 42471 149056 69488 -4714 -13598
17469a3598A20299J32925F5368M07894A49118b5594A68328R847N8147J47119A88091
$$ -13598 120299 253224 65368 473262 149118 -25594 168328 178175 236322 383441 188091
17457E6615J17501c3628A56522K03984p4063Q6157A80139q1490K34951J42861
$$ 56615 174116 -33628 156522 360506 286443 372600 180139 98649 333600 476461
17447D76461a43553E30886N195B10403K7898G1291K09426H9822a43B34922F2849
$$ 476461 -143553 530886 536081 210403 238301 71291 280717 89822 -143 234922 62849
17435A63662R1508B7482b6042C40490f8537B57165K96435j42223a01249A33488
$$ 163662 255170 27482 -26042 340490 -68537 257165 553600 411377 -101249 133488
17424E7348b4388B02755Q1144D4878P3165f0119k0768D76772n2093j90965K0595
$$ 57348 -24388 202755 283899 44878 118043 -60119 -80887 476772 424679 233714 254309
17413B54309O3047P7509k0809l7097L51A03706K62532b44132B18826o2445l5644
$$ 254309 317356 394865 374056 336959 337310 103706 366238 -244132 218826 156381 120737
17402A20737L0170K15399a63259D2800J97473a08402B05643o3888J3975J0844
$$ 120737 150907 366306 -163259 42800 240273 -108402 205643 141755 155730 166574
17392A66574o3621K12478a18583A1001N99063a8724A71220k1732Q3554P4111A38610
$$ 166574 102953 315431 -118583 11001 610064 -18724 171220 149488 233042 307153 138610
17380C75531b0352A17528K09026F0380J75183H0579J22761h3416I7873R885L01390
$$ 375531 -20352 117528 326554 60380 235563 80579 203340 -83416 97873 107758 409148
17369D09148A65337n5262R1639o5462A1120h879A87467n4964n8227L5041j2374
$$ 409148 165337 110075 201714 136252 11120 -8879 187467 132503 74276 109317 96943
17358I6943O8374G9329L4333n0127J50330N5529I4109i293p464C7730L5020L8576
$$ 96943 165317 79329 113662 63535 213865 269394 94109 -9293 -16757 37730 72750 111326
17346A11326J61204d7790B8163J50575p8584f4913G9808K92355B6407J68946O1271
$$ 111326 272530 -47790 28163 178738 100154 -64913 79808 372163 26407 195353 256624
17335B56624J4920a41526B99244C2327E943J06385e0822p1339B44217F751J63414
$$ 256624 271544 -141526 299244 32327 5943 112328 -50822 -122161 244217 6751 170165
17324A70165b28628G0381J42141G2510C0848J92137i9109D16359j37702J416O2910
$$ 170165 -228628 70381 212522 72510 30848 222985 -99109 416359 278657 280073 342983
17313C42983l5125H1881P0313c1462H8531L26346A00998D3108a3230F6871M43752
$$ 342983 307858 81881 152194 -31462 88531 414877 100998 43108 -13230 66871 510623
17302E10623A94044j712Q028Q1107b43299C75841r0061g5179d825j69091C39049
$$ 510623 194044 192332 200360 281467 -243299 375841 285780 -75179 -4825 -173916 339049
17290A35611K4378a2181A06251j1053P6630H0535k106N125K33857M8739j61655
$$ 135611 159989 -12181 106251 95198 171828 80535 78429 83554 317411 366150 204495
17279B04495J47097J20620A84872J82595f1320k10286A10802f7151B40990J02189
$$ 204495 351592 472212 184872 367467 -61320 -271606 110802 -67151 240990 343179
17269C43179i93j43502A74538R4532A22323M74259B61146d7604C19622H5608L41426
$$ 343179 -993 -144495 174538 269070 122323 596582 261146 -47604 319622 85608 427034
17258D27034j25400j0793B6131K3984M873M26203J49153f347k56586c4769k2685
$$ 427034 301634 290841 26131 50115 54988 481191 630344 -6347 -262933 -34769 -57454
17247e7454P019A03453Q1434q5271K7959b0758A85602J20820C4147N9169J20236
$$ -57454 -50435 103453 184887 99616 127575 -20758 185602 306422 34147 93316 213552
17236B13552A02137J4160Q1743n97k8273c9989B44196g2207l8315B94761K7523
$$ 213552 102137 116297 198040 197443 169170 -39989 244196 -72207 -110522 294761 322284
17225C22284j36440M7865A11281M4262K92289o6221j367m6915Q624n4450A27472
$$ 322284 185844 233709 111281 155543 447832 381611 380244 333329 341953 287503 127472
17213B13690P8732J57231r8461R7037D1963A9426J05504P6702L7691N2487A25109
$$ 213690 292422 449653 351192 448229 41963 19426 124930 201632 239323 291810 125109
17201C33304o2758l6241k574j09879J87911P101I0241M83344G051J52800J75256
$$ 333304 270546 234305 231731 121852 309763 316864 90241 573585 7051 159851 335107
17190C35107e9706C28727h5396B60623o7187R1638p8741G1304J59964k1538P5966
$$ 335107 -59706 328727 -85396 260623 193436 285074 206333 71304 231268 209730 285696
17179B85696I6486K86709P4592j85655E4027K92870J12336k19187J04849J77059
$$ 285696 96486 383195 457787 272132 54027 346897 459233 240046 344895 521954
17169E21954j70083r0638A20806K05263O6494j8681n8080L1668J74738G1523J22327
$$ 521954 351871 261233 120806 326069 392563 373882 315802 347470 522208 71523 193850
17158A93850q1054L20614l0197J0965A76182K5350O7314L44007A38580J88678
$$ 193850 112796 433410 403213 414178 176182 201532 268846 612853 138580 327258
17148C27258H7682J75287K0369N4543J30878B04324K2782L06413n3350k32278
$$ 327258 87682 262969 283338 337881 468759 204324 227106 533519 480169 247891
17138B47891q6608J96433q8025G5237M80267j37253J9602J33566j87047m1278
$$ 247891 161283 357716 269691 75237 555504 418251 437853 571419 384372 343094
17128C43094Q8675j87457a40228B71348K32362j81235K18595j42651A82402N7177
$$ 343094 431769 244312 -140228 271348 503710 322475 541070 398419 182402 239579
17118B39579L3674L14745k70405J79646j93486R1068R6736J29143l01250K2970
$$ 239579 273253 587998 317593 497239 303753 394821 491557 620700 319450 342420
17108C42420m8661G7218K07301K03130J3941k27698k864K15872J24956j02962
$$ 342420 293759 77218 284519 487649 501590 273892 271028 486900 611856 508894
17098E08894K45175C00046L45350B07172J68002o9613C568N36900R158r311j44964
$$ 508894 754069 300046 645396 207172 375174 305561 3568 540468 549626 540315 395351
17087C95351j02860J12706j82440o602O7909P0014L14648j64874j57210J71966
$$ 395351 292491 405197 222757 216155 284064 354078 668726 503852 346642 518608
17077E18608p2401Q2062Q9512B51732K62865j0496G8963N24976B81503M93184
$$ 518608 446207 528269 617781 251732 514597 504101 78963 603939 281503 774687
17067G74687k81086P5734L7873p0177j78295k3456P142R8270l0255J1431O010
$$ 774687 493601 569335 607208 537031 358736 335280 342422 440692 410437 421868 427878
17056D27878K7369J47870k90526L57518n4368k55468L3132J27810L35627k16127
$$ 427878 455247 603117 312591 670109 615741 360273 393405 521215 856842 640715
17046F40715j96053N4851q6585p443J15060J52365j08718R4582j54733p8625J67683
$$ 640715 444662 499513 412928 405485 520545 672910 564192 658774 504041 425416 593099
17035E93099K96998A40104N95499k97010K62473j78091r2018M31129C14658J62818
$$ 593099 890097 140104 735603 438593 701066 522975 430957 862086 314658 477476
17025D77476K16975k9011K20672q4022k36291J3043O0259O3166j21519r7680j16191
$$ 477476 694451 665440 886112 802090 565799 578842 639101 702267 580748 483068 366877
17014C66877o830L78522K94452j05255l42667l0529K44455l29006L12662j13785
$$ 366877 360047 738569 1033021 927766 585099 554570 799025 470019 782681 668896
17004F68896j08814J24296K18751j16981j70872j2541N29159D81667J77218N8669
$$ 668896 560082 684378 903129 786148 615276 602735 1131894 481667 658885 717554
16994G17554J81231O6950q7768n3089j58296M14771B74930N07063M7065J88300
$$ 717554 898785 965735 877967 824878 666582 1081353 274930 781993 829058 1017358
16984A017358l4665l01334J9956J79046K10679k04127k65280J88792J45372K62466
$$ 1017358 982693 681359 701315 880361 1091040 886913 621633 810425 955797 1218263
16974A218263k39610j26637N9832M33837F33960K84125Q214r1267J05344L16103
$$ 1218263 978653 852016 911848 1345685 633960 918085 926299 835032 940376 1256479
16964A256479m97878J17357k1028J90720P9385j84465M8102Q891j03062m8386
$$ 1256479 758601 875958 854930 1045650 1125035 940570 988672 997563 894501 846115
16954H46115M31535j20363m09377N68428L1688l01333R9369j63876J54718K89278
$$ 846115 1277650 1157287 747910 1316338 1348026 1046693 1146062 982186 1136904 1426182
16944A426182m06149K83896l75739J08702Q6181J22289J7755J6125l37653L85784
$$ 1426182 1020033 1303929 928190 1036892 1123073 1245362 1263117 1279242 941589 1327373
16934A327373j43518r4947J88961J39990Q189o6475j80645R5820J15316K6425
$$ 1327373 1183855 1088908 1277869 1417859 1426048 1359573 1178928 1274748 1390064 1416489
16924A416489k04679J05991l2814J39930j52119j09070K85407K78454k41683P1381
$$ 1416489 1211810 1317801 1284987 1424917 1272798 1163728 1449135 1727589 1485906 1557287
16914A557287k16963J62646K09788k75822M68252j05690j13613o4177J5584j53815
$$ 1557287 1340324 1502970 1712758 1436936 1905188 1799498 1685885 1621708 1637292 1483477
16904A483477J93013Q8548L5030M6467k03015J51198m8488O7785o6638q7702k0097
$$ 1483477 1676490 1765038 1800068 1846535 1643520 1794718 1746230 1814015 1747377 1659675 1639578
16893A639578L3206J37883J57775J95541L6690j77266J51673k41492L30207n5938
$$ 1639578 1672784 1810667 1968442 2163983 2200673 2023407 2175080 1933588 2263795 2207857
16883B207857M9742k21917Q0437J10340k46915K27572M62021k58017j08292J89997
$$ 2207857 2257599 2035682 2116119 2226459 1979544 2207116 2669137 2411120 2302828 2492825
16873B492825p6782p331j33257K57767j38276Q2596J33445j41998o5922L27297
$$ 2492825 2416043 2408712 2275455 2533222 2394946 2477542 2610987 2468989 2403067 2730364
16863B730364J29154l04880J00673J45348J72516q4921L42070q8731j99588J94538
$$ 2730364 2859518 2554638 2655311 2800659 2973175 2888254 3230324 3141593 2942005 3136543
16853C136543J13159q2582K01524N1035n07351M31797m2768J89472o057R8174
$$ 3136543 3249702 3167120 3368644 3419679 2912328 3344125 3301357 3490829 3484772 3582946
16843C582946o2906P9106K45700K30670l85762N35956j12045K9141p557K87186
$$ 3582946 3520040 3599146 3844846 4075516 3689754 4225710 4113665 4142806 4135249 4422435
16833D422435L2024j31878L1361M42788k86451L20098j32335J83769Q9901L19504
$$ 4422435 4454459 4322581 4353942 4796730 4510279 4830377 4698042 4881811 4971712 5291216
16823E291216J27718P035R4573q2068K39079m6771Q6799K1274J32400K90806L4781
$$ 5291216 5418934 5425969 5520542 5438474 5677553 5630782 5717581 5738855 5871255 6162061 6196842
16812F196842J93287J34289K7014L88994M0086O09513m74056L18230L59176j7111
$$ 6196842 6390129 6524418 6551432 6940426 6980512 7590025 7115969 7434199 7793375 7776264
16802G776264J14340K68392M59665k0120L57237M0230Q238M18109L98425J10175
$$ 7776264 7890604 8158996 8618661 8598541 8955778 8996008 9004246 9422355 9820780 9930955
16792I930955j9582N47930J11772K00744N05133J92276K10234K30243N78360N96958
$$ 9930955 9911373 10459303 10571075 10771819 11276952 11469228 11679462 11909705 12488065 13085023
16782A3085023M44523M10927L14525M72235J62156N22328N38825M21818P53263
$$ 13085023 13529546 13940473 14254998 14727233 14889389 15411717 15950542 16372360 17125623
16773A7125623L68938N68759O32890O59154O61829P28932R37860P87826M08369
$$ 17125623 17494561 18063320 18696210 19355364 20017193 20746125 21683985 22471811 22880180
16764B2880180J174681J180190P33997J124666J041459J495128R57091J354913
$$ 22880180 24054861 25235051 25969048 27093714 28135173 29630301 30587392 31942305
16756C1942305J345247J472280J690104J531863J714177J703030K253560K112864
$$ 31942305 33287552 34759832 36449936 37981799 39695976 41399006 43652566 45765430
16748D5765430K179072K636985K541220K653813K806615L256815L152400L518885
$$ 45765430 47944502 50581487 53122707 55776520 58583135 61839950 64992350 68511235
16740F8511235M168447M238707L930605M814008M679466M959627N732194N729042
$$ 68511235 72679682 76918389 80848994 85663002 90342468 95302095 101034289 106763331
16732A06763331N733011O924397N840102O561819O409413O804360O088049O252262
$$ 106763331 112496342 119420739 125260841 131822660 138232073 145036433 151124482 157376744
16724A57376744N768476N008257M632758L566906K854119J835099K75523m52383
$$ 157376744 163145220 168153477 172786235 176353141 179207260 181042359 181317882 180865499
16716A80865499j636008l024129l233492m926797n088924o091290o573384o335983
$$ 180865499 179229491 176205362 172971870 168045073 162956149 156864859 150291475 143955492
16708A43955492p045442o639208o856605o502111o487661o372132n473604n761172
$$ 143955492 136910050 130270842 123414237 116912126 110424465 104052333 98578729 92817557
16700I2817557n286445m872620n047798l941000m323941l754324l732296l385365
$$ 92817557 87531112 82658492 77610694 73669694 69345753 65591429 61859133 58473768
16692E8473768l392045k573221k676173k349945k878332j943439k152247j576167
$$ 58473768 55081723 52508502 49832329 47482384 44604052 42660613 40508366 38932199
16684C8932199k236106j888406j630066j299226j447325r96513j499189j162125
$$ 38932199 36696093 34807687 33177621 31878395 30431070 29434557 27935368 26773243
16676B6773243j209383r77830j040336q10248p71857q75513j052516n86897n33452
$$ 26773243 25563860 24586030 23545694 22735446 21963589 21088076 20035560 19448663 18915211
16667A8915211p80213o61089o52032o39067o33582m14908l84544o73361k00680
$$ 18915211 18134998 17473909 16821877 16182810 15549228 15134320 14749776 14076415 13875735
16658A3875735k43357r52224p8734o13702j85976l33646l80610n30429q3156k50037
$$ 13875735 13632378 12680154 12601420 11987718 11801742 11468096 11087486 10557057 10473901 10223864
16648A0223864k95065n36628K37954o04706m84730J13603l45144j94849j26048
$$ 10223864 9928799 9392171 9630125 9025419 8540689 8654292 8309148 8114299 7988251
16639G988251l44083j47493j33021k79554m9844k05485J4578J923n74832l21083
$$ 7988251 7644168 7496675 7363654 7084100 7034256 6828771 6843349 6845272 6270440 5949357
16629E949357K41185j74301k00330l90922j37491j08522J76406j78049k16752
$$ 5949357 6190542 6016241 5815911 5424989 5287498 5178976 5355382 5177333 4960581
16620D960581L19610n8612n92897J35919k40136q8242J9707l64299M82370o57835
$$ 4960581 5280191 5221579 4628682 4764601 4524465 4436223 4455930 4091631 4574001 3916166
16610C916166J26718J30860l74848N9927j33545j18314L30904k85126k46698j60285
$$ 3916166 4042884 4173744 3798896 3858823 3725278 3606964 3937868 3652742 3406044 3245759
16600C245759l6127J75850k39797L19663k39809l67221J84126j24537K26047J05924
$$ 3245759 3209632 3385482 3145685 3465348 3225539 2858318 3042444 2917907 3143954 3249878
16590C249878l3379m45739j40248J23299k30457M10036m29803R2509j59812k40804
$$ 3249878 3216499 2770760 2630512 2753811 2523354 2933390 2503587 2596096 2436284 2195480
16580B195480J87988o6026k57389J78765J42855j38163L11661k18922j56698l7651
$$ 2195480 2383468 2317442 2060053 2238818 2381673 2243510 2555171 2336249 2179551 2141900
16570B141900k0488k92152O6206L70357l41512m5212K36481l59930J12943J49774
$$ 2141900 2121412 1829260 1895466 2265823 1924311 1879099 2115580 1755650 1868593 2018367
16560B018367l00796j21088k6021K66319J65374k57179N8220N2114m11215J74227
$$ 2018367 1717571 1596483 1570462 1836781 2002155 1744976 1803196 1855310 1444095 1618322
16550A618322j6657k9494k53015K02794p511l06709K87751N9800R2004j85191
$$ 1618322 1601665 1572171 1319156 1521950 1514439 1207730 1495481 1555281 1647285 1462094
16540A462094J45519l08552m4189K2085r9263m4846j22730K31807L93926l75349
$$ 1462094 1607613 1299061 1254872 1276957 1177694 1132848 1010118 1241925 1635851 1260502
16530A260502j38016L38374m6013j97106k05440J29540J55689j43623N5698l3601
$$ 1260502 1122486 1460860 1414847 1217741 1012301 1141841 1297530 1153907 1209605 1176004
16520A176004L527J08923l17580P8803j5299k3535P1913m1927K1036j73301N3014
$$ 1176004 1179531 1288454 970874 1049677 1034378 1010843 1082756 1040829 1061865 888564 941578
16509I41578M3686k65091J03705j16492J09787r0321J65891J89805l15247j50330
$$ 941578 985264 720173 823878 707386 817173 726852 892743 1082548 767301 616971
16499F16971J72997L09277l30494J33284j45034M59488n81918J17866j2112j37328
$$ 616971 789968 1099245 768751 902035 757001 1216489 634571 752437 740325 602997
16489F02997J39565K37233q1619J16474C70322L67941l8361L59805l60022K55642
$$ 602997 742562 979795 898176 1014650 370322 738263 699902 1059707 699685 955327
16479I55327l9059k14419J56182j72959L26191j75569m10972J2402L79115l38168
$$ 955327 916268 701849 858031 685072 1011263 835694 424722 437124 816239 478071
16469D78071L34320j29902Q0533q1342J70765k04482J18646K1403l42597J77284
$$ 478071 812391 682489 763022 681680 852445 647963 766609 788012 445415 622699
16459F22699M7442K47477k87461k23186A77836K73307J66482j81506J02010K52330
$$ 622699 670141 917618 630157 406971 177836 451143 617625 436119 538129 790459
16449G90459k71560K10915m8681j90882K40030j41481j5843K93075B1358L00273
$$ 790459 518899 729814 681133 490251 730281 588800 572957 866032 21358 321631
16439C21631K72762k35966l8443K45935o2555j98138n944L90358k46938L2252
$$ 321631 594393 358427 319984 565919 503364 305226 299282 689640 442702 474954
16429D74954L9818K80459l57204r575J43830K40047C30307J50662K0218j49767
$$ 474954 514772 795231 438027 428452 572282 812329 330307 480969 501187 351420
16419C51420r9748K19319n3100j22212A30937J59378J17560j90552K45080J52615
$$ 351420 251672 470991 417891 295679 130937 290315 407875 217323 462403 615018
16409F15018j15758k45425K17038m941A65681J38207J73827k32745P4561A17165
$$ 615018 499260 253835 470873 465932 165681 303888 477715 244970 319531 117165
16398A76771L25418j24868L0970k0920j57444Q0778K30002k00956K32984B62394
$$ 176771 502189 377321 408291 387371 229927 310705 540707 339751 572735 262394
16387C80530j47421J94671A17889E5606Q5281B7959L67745j12821G1181A3135
$$ 380530 233109 427780 117889 55606 140887 27959 395704 282883 71181 13135
16376F67634B93719k2680b34225D41301O7463j74770o3041J68294b85155I0518
$$ 667634 293719 271039 -234225 441301 508764 333994 270953 439247 -285155 90518
16365D02076E3243L21975j54460R2926E1671a10454a8326B04295M6979a0080A21907
$$ 402076 53243 375218 220758 313684 51671 -110454 -18326 204295 251274 -10080 121907
16353C32464G066K88671J52781j10075o0810O0145A26871L09893c0564B03407
$$ 332464 7066 295737 448518 338443 277633 337778 126871 436764 -30564 203407
16342A99837K4519H341N55841B80755i9134H8723b13888D05209j37082n3615I9391
$$ 199837 224356 8341 564182 280755 -99134 88723 -213888 405209 268127 214512 99391
16330B37214m2328K47464G2729L67313A77954J35975j35697H7646q223L43947
$$ 237214 194886 442350 72729 440042 177954 313929 178232 87646 79423 423370
16320D23370A76540F7096K57458A26423c1290B68682J03714A83604a32301N1608
$$ 423370 176540 67096 324554 126423 -31290 268682 372396 183604 -132301 -80693
16310h0693m601B79559n2732p7746R7108L321a2903A65134a36663d6455B95540
$$ -80693 -85294 279559 226827 149081 246189 249510 -12903 165134 -136663 -46455 295540
16298C97851n5351A64596L55330D6216L6543d9031D31469a09901B92342A42824
$$ 397851 342500 164596 519926 46216 82759 -49031 431469 -109901 292342 142824
16287C72795j56528O9078a86269O2199A10075N5123l1015L2979G3838J22597l7107
$$ 372795 216267 285345 -186269 -124070 110075 165198 134183 167162 73838 196435 159328
16276A59328N6933l1235d0608G4292J38126b5693B07263l1685p6864K35282E7155
$$ 159328 216261 185026 -40608 74292 212418 -25693 207263 175578 98714 333996 57155
16264A50459h0400J1336B04268R5985A29927a63302I0285R6984F5376K68419A14796
$$ 150459 -80400 -69064 204268 300253 129927 -163302 90285 187269 65376 333795 114796
16252B58349g5291B01029J69047c7371A52843o5296N7263J24929j30876b5548
$$ 258349 -75291 201029 370076 -37371 152843 87547 144810 269739 138863 -25548
16241D23952l3305A65602G8017D115L55338E5370J05753G0871J76988c9203B27494
$$ 423952 390647 165602 78017 4115 359453 55370 161123 70871 247859 -39203 227494
16229B35284B5376O5145m2444M4102A6134J7874d8858C71590A24551E8697K18683
$$ 235284 25376 90521 48077 92179 16134 34008 -48858 371590 124551 58697 277380
16218B77380C855J72901c5302A53781a34952D9377O0168J30922b54298I5762h2240
$$ 277380 3855 176756 -35302 153781 -134952 49377 109545 240467 -254298 95762 -82240
16206b15980j51765g6034Q890o5387A99889E0900B3753N2132J4812A9793J57821
$$ -215980 -367745 -76034 -67144 -132531 199889 50900 23753 75885 90697 19793 177614
16195A77614c00890E1895K3304H81J48350b7792A46564m3381D1289a17582D02341
$$ 177614 -300890 51895 75199 881 149231 -27792 146564 103183 41289 -117582 402341
16183B69148B693K67923j23024b05071C7224R0473J45554j08566c53885D0418
$$ 269148 2693 270616 147592 -205071 37224 127697 273251 164685 -353885 40418
16172a29434n9518A11004K34784j64343d3596I4584e6929o5354A16319k6850k7942
$$ -129434 -188952 111004 345788 181445 -43596 94584 -56929 -122283 116319 89469 61527
16161F1527J3675h9454o7708e9393j5565j78086A98749P0022b54065A94868a35786
$$ 61527 75202 -89454 -157162 -59393 -74958 -253044 198749 268771 -254065 194868 -135786
16149g8316B25647p3866m6816J58360j4495A16935K77737b77765A51599b3470
$$ -78316 225647 151781 104965 263325 248830 116935 394672 -277765 151599 -23470
16138i4309j0734A39062o1228a72391o2460G9191P1287a23719k05053A19108R4802
$$ -94309 -105043 139062 77834 -172391 -234851 79191 150478 -123719 -328772 119108 213910
16127B13910f6041A02737J88686F4225M495J25619b15098D0509K17365j20850
$$ 213910 -66041 102737 291423 64225 68720 194339 -215098 40509 257874 137024
16117A37024f1251E3356J16421o9954N441b669k16971A23714j6821b30909H1906
$$ 137024 -61251 53356 169777 99823 105264 -2669 -219640 123714 106893 -230909 81906
16105C2516b35085A50167a05443B65149a01307G5399B8539f1533B45725D8476
$$ 32516 -235085 150167 -105443 265149 -101307 75399 28539 -61533 245725 48476
16094C4397b01909A44405J30753b00750f5406j51928B1387J20792C2552b67394
$$ 34397 -201909 144405 275158 -200750 -65406 -217334 21387 142179 32552 -267394
16083A50680b15494B21928F2593h274n3061j66962B5383M2175Q9381c14053h5026
$$ 150680 -215494 221928 62593 -8274 -61335 -228297 25383 67558 156939 -314053 -85026
16071d22944a4423B1352M2112b15908H5026h7968C5602a76765P9155B33347a60022
$$ -422944 -14423 21352 63464 -215908 85026 -87968 35602 -176765 -97610 233347 -160022
16059A79007p2293B5102a11729B49667E6752a99198b2626a0733k20047k4457B6166
$$ 179007 106714 25102 -111729 249667 56752 -199198 -22626 -10733 -230780 -255237 26166
16047c0223a2570j11329A94538D8141N3664b17832C378L39276b48858g7856o220
$$ -30223 -12570 -123899 194538 48141 101805 -217832 3378 342654 -248858 -77856 -84076
16036h4076B07544b24694d2858B44153c72225A79206H8870L5757N8762K4021h9768
$$ -84076 207544 -224694 -42858 244153 -372225 179206 88870 124627 183389 207410 -89768
16024a0554E2630R5897a5953r9493B34372E8859L61410j32712a5009A90124F3523
$$ -10554 52630 148527 -15953 -115446 234372 58859 420269 287557 -15009 190124 63523
16012i3217A03878a23518p3511B23853Q3838i5513l2033L9359J642q0371g0905
$$ -93217 103878 -123518 -197029 223853 307691 -95513 -127546 -88187 -86545 -166916 -70905
16000I5277A6242J2271f3226j49981C63677c53211g7439B75267a44392A53295
$$ 95277 16242 28513 -63226 -213207 363677 -353211 -77439 275267 -144392 153295
15989b79573N4722B3397N2813a23221A78118j9315Q0685Q7707a25560A42440c51579
$$ -279573 -224851 23397 76210 -123221 178118 158803 239488 327195 -125560 142440 -351579
15977G0541R9088a89449A9436b21400J06241k00171a49158G988d8979C1908A5193
$$ 70541 169629 -189449 19436 -221400 -115159 -315330 -149158 7988 -48979 31908 15193
15965A16246a17339B44748m7003r0910O9360l8829h1958G3904h1030F3039a23453
$$ 116246 -117339 244748 197745 106835 176195 137366 -81958 73904 -81030 63039 -123453
15953a9401O831k36047d0210j03573L7305m7111L7305r4514j84859b2264q8347
$$ -19401 -12570 -248617 -40210 -143783 -106478 -153589 -116284 -210798 -395657 -22264 -110611
15942a10611A8430L9011a70741J9489E2325a43680A01496C9591b45604D93241
$$ -110611 18430 57441 -170741 -151252 52325 -143680 101496 39591 -245604 493241
15931d2237A7029J48962J27078g4016k34743R1142m5098j91799H269e332n6667
$$ -42237 17029 165991 293069 -74016 -308759 -217617 -262715 -454514 8269 -5332 -61999
15920f1999k443P966j45784A2063h806n520H8207N0065e594F6477i7175A83741
$$ -61999 -64442 -56476 -202260 12063 -8806 -14326 88207 138272 -5594 66477 -97175 183741
15907b26404C6422a71376j12505B14389l0338j9176b09698A11819B505a88361
$$ -226404 36422 -171376 -283881 214389 184051 164875 -209698 111819 2505 -188361
15896b00155B5824a95218A1482c0971B37058a0670p3905A20788g1888a4044A9631
$$ -200155 25824 -195218 11482 -30971 237058 -10670 -84575 120788 -71888 -14044 19631
15884A29654M0002i2486m2833A90092B9128b04328c3996A4866a67235E2279i3993
$$ 129654 169656 -92486 -135319 190092 29128 -204328 -33996 14866 -167235 52279 -93993
15872E9729b15766h421A40432c07136G548l01c3192n6432i205B77135j16197E2151
$$ 59729 -215766 -8421 140432 -307136 7548 7247 -33192 -89624 -9205 277135 160938 52151
15859a35855l6248B4219a44364C30132e77671B12758r4567M8697c3123C8757L008
$$ -135855 -172103 24219 -144364 330132 -577671 212758 118191 166888 -33123 38757 41765
15848D1765L237a34695L4007j6559d2022k0194A64188M3717H1062A6993i5688
$$ 41765 45002 -134695 -100688 -117247 -42022 -62216 164188 207905 81062 16993 -95688
15836a32241L4653C0576a5548j45321B9228J82563c64808a21858b3012j11620
$$ -132241 -97588 30576 -15548 -160869 29228 211791 -364808 -121858 -23012 -134632
15826a34632L2695F4619a7759o3559j02973b3301k4607A50296e7223B34615a60715
$$ -134632 -101937 64619 -17759 -81318 -184291 -23301 -47908 150296 -57223 234615 -160715
15814a47772k27934d7406k41791J29969A68448f0050n6732A5331d0605C1994a60662
$$ -147772 -375706 -47406 -289197 -159228 168448 -60050 -116782 15331 -40605 31994 -160662
15802b71735A04598J20445I6158l8944d9745A44080a56612F4126i8151j02018
$$ -271735 104598 225043 96158 57214 -49745 144080 -156612 64126 -98151 -200169
15792b00169B13417B1240f4016A69338e8129A58799a25951j82634h1621L6501
$$ -200169 213417 21240 -64016 169338 -58129 158799 -125951 -308585 -81621 -45120
15782d5120a7978D1671b59055A44665E4677b14606p6043G1258a43586B24661A4541
$$ -45120 -17978 41671 -259055 144665 54677 -214606 -290649 71258 -143586 224661 14541
15770c2959B30042F8885J43166M64374a24999N8538D537K9286b33484E211J09682
$$ -32959 230042 68885 212051 676425 -124999 -66461 4537 33823 -233484 5211 114893
15759A14893g675D9868k2390b53463m0963I9678M3414D3077R3983f4868j87595
$$ 114893 -7675 49868 27478 -253463 -294426 99678 143092 43077 137060 -64868 -252463
15748b52463C4036L8215a79695k50420a69640B38997b34502j83802J2382E6516
$$ -252463 34036 72251 -179695 -430115 -169640 238997 -234502 -418304 -405922 56516
15737D5923J1075a41134j9302H2959M9546n3676b54895a3724B25807q2267k322
$$ 45923 56998 -141134 -160436 82959 132505 78829 -254895 -13724 225807 143540 141218
15726A41218e2996K2596j20295B08175B2358a94976m615B17067a98496A38016
$$ 141218 -52996 -30400 -150695 208175 22358 -194976 -199591 217067 -198496 138016
15715G0614b3600j28648A93697H5475g8511j58417j23197A49702a58970D4755
$$ 70614 -23600 -152248 193697 85475 -78511 -236928 -360125 149702 -158970 44755
15704a27963a8737r5524A0838O6728G606a66016f2172K3773E3444d923r7226l020
$$ -127963 -18737 -114261 10838 77566 7606 -166016 -62172 -38399 53444 -4923 -102149 -105169
15692a05169I466J39405Q2922a2698o5547A92854b00682f4405A76036n1798a50008
$$ -105169 9466 148871 231793 -12698 -78245 192854 -200682 -64405 176036 124238 -150008
15680a1591o2289A67594a57648G4754j9501a56620d6170B0333J25938l064j5825
$$ -11591 -73880 167594 -157648 74754 55253 -156620 -46170 20333 146271 143207 127382
15669A27382C2249G355d26678g0436j19496k0969Q4726d9494A3225c67930a81948
$$ 127382 32249 7355 -426678 -70436 -189932 -210901 -126175 -49494 13225 -367930 -181948
15657B1675d0446C21493B3476J06058A6135e7207G6112Q2010c7117A56601a70367
$$ 21675 -40446 321493 23476 129534 16135 -57207 76112 158122 -37117 156601 -170367
15645a03953A05421L3087N956a73927A1691h2975r9999H7075Q3572a5837A17893
$$ -103953 105421 138508 144464 -173927 11691 -82975 -182974 87075 170647 -15837 117893
15633C9814N5242k678e3541B33406b733C3031a66046R834j51698I7998a05368
$$ 39814 95056 92378 -53541 233406 -2733 33031 -166046 -156212 -307910 97998 -105368
15621B8041g5313G2653A9138a06336H2816a73024A04920L6144c05303h3891p3435
$$ 28041 -75313 72653 19138 -106336 82816 -173024 104920 141064 -305303 -83891 -157326
15610a57326j28806d2047k4587J8396B07483k1834a07398j4672G3022P7225e7041
$$ -157326 -286132 -42047 -66634 -48238 207483 185649 -107398 -122070 73022 150247 -57041
15598d5814j61054j68232D51552C1668a41774C28974E7915i4237H9117e3579G3972
$$ -45814 -206868 -375100 451552 31668 -141774 328974 57915 -94237 89117 -53579 73972
15586f3633B09997J08763J62388E633a30282j5402j32096a14953o0992g5909k1470
$$ -63633 209997 318760 481148 5633 -130282 -145684 -277780 -114953 -175945 -75909 -97379
15575i7379A35906c576A43373a74473e6405B38865a5762r4396g211j45349l0870
$$ -97379 135906 -3576 143373 -174473 -56405 238865 -15762 -110158 -7211 -152560 -183430
15564a83430J807B82467e6726k7667b926B9804R6608a4829A12727J02385c7800
$$ -183430 -181623 282467 -56726 -84393 -2926 29804 126412 -14829 112727 215112 -37800
15552a93308A60377h9285k74881d570F6964a97066Q0191G2138C5572d9333A38191
$$ -193308 160377 -89285 -364166 -4570 66964 -197066 -116875 72138 35572 -49333 138191
15540B2700a03237c7359q2183A2043J53410L3257r5436C1872N7547h9524B67153
$$ 22700 -103237 -37359 -119542 12043 165453 198710 103274 31872 89419 -89524 267153
15528G2559k7669K07534a22975D89355e5238F0204i3076K7405q1570M6604C7924
$$ 72559 44890 252424 -122975 489355 -55238 60204 -93076 -65671 -147241 -100637 37924
15516d9978F8142a00448m7437j99827c4330A11912h0710C3866K389d63893H8337
$$ -49978 68142 -100448 -147885 -347712 -34330 111912 -80710 33866 36255 -463893 88337
15504D2856M98134b5792A88547k6396H0598g1113C2430N8671e2004A08523a30587
$$ 42856 540990 -25792 188547 162151 80598 -71113 32430 91101 -52004 108523 -130587
15492f6777j37033A80526d39D9713a50349B37843r2022J3334b50079A49567D9898
$$ -66777 -203810 180526 -439 49713 -150349 237843 145821 159155 -250079 149567 49898
15480E9053J71891H8634I082a03588a5308n6002F6641a65641A80654L3464b4181
$$ 59053 230944 88634 9082 -103588 -15308 -71310 66641 -165641 180654 214118 -24181
15468A30037J2759a69713o749r5183R956A5296J11657a48423E11865A46938F1733
$$ 130037 142796 -169713 -176462 -271645 -261689 15296 126953 -148423 511865 146938 61733
15456A22767a49224j47593H9668D2652J32737E5674K00307G0287N5670h4819j93577
$$ 122767 -149224 -296817 89668 42652 175389 55674 255981 70287 125957 -84819 -278396
15445b78396P4975O2862k4024M9684a502j8868A05408h7760j07968e6475B08822
$$ -278396 -203421 -140559 -164583 -114899 -1502 -20370 105408 -87760 -195728 -56475 208822
15433A28694c1811H5110a2211k90476I4689f9149m3232k1411d2024A47330F4171
$$ 128694 -31811 85110 -12211 -302687 94689 -69149 -112381 -133792 -42024 147330 64171
15421a84760B67226p4183b04983a7539q4077j04248g0052n5643D61817E0283a16351
$$ -184760 267226 193043 -204983 -17539 -101616 -205864 -70052 -125695 461817 50283 -116351
15409A29860b51107B67953a81662a5863j17166e0058R498D7197J44195A7765K47360
$$ 129860 -251107 267953 -181662 -15863 -133029 -50058 -40560 47197 191392 17765 265125
15398B65125b89713A88094a20682A42908F6327e12755a15186C37770d1995A05249
$$ 265125 -289713 188094 -120682 142908 66327 -512755 -115186 337770 -41995 105249
15387e53A52063F9767b46568d7303r481f096A68269i0981A21428a24789a7221
$$ -553 152063 69767 -246568 -47303 -56784 -6096 168269 -90981 121428 -124789 -17221
15375B3340e7815o5536q8439B22058a45957j28449p1953e8311A11450c25391A48550
$$ 23340 -57815 -123351 -211790 222058 -145957 -274406 -346359 -58311 111450 -325391 148550
15363b3472F0902a15031n0390C7527L2376J52200c99430a59158k6619A6894R4861
$$ -23472 60902 -115031 -165421 37527 69903 222103 -399430 -159158 -185777 16894 111755
15352A11755b626B29426d7003l64642F4232b238p7340H2633M2498l626e829H4020
$$ 111755 -2626 229426 -47003 -411645 64232 -2238 -79578 82633 125131 121505 -5829 84020
15339G1615L4102K4093N5206C4972M0688J989P5219o7854K86778g1944B51725
$$ 71615 105717 129810 185016 34972 75660 77649 152868 85014 371792 -71944 251725
15327A93229F8410i4042A40301b61427D29393I2556J9060K30597q4749a55471
$$ 193229 68410 -94042 140301 -261427 429393 92556 111616 342213 257464 -155471
15316H830P4283J15113b36784B98675C5607P9063J06768c8153B07696g878j43200
$$ 8830 83113 198226 -236784 298675 35607 114670 221438 -38153 207696 -7878 -151078
15305a51078q592C09095A34117l3847C468L03506d65229A28840a12494J7617A03271
$$ -151078 -159670 309095 134117 100270 3468 306974 -465229 128840 -112494 -94877 103271
15293A47364a5630F5995J34383M4777m1698O8467a86A42629b15189b5214A67589
$$ 147364 -15630 65995 200378 245155 203457 271924 -186 142629 -215189 -25214 167589
15281H3441a58105D64381E169J63334K20274i6300c6740J6020A28818N2598J67299
$$ 83441 -158105 464381 5169 168503 388777 -96300 -36740 -20720 128818 181416 348715
15270C48715d2489A07286R5366a14558D20661A81922a11149B73433a252A26819
$$ 348715 -42489 107286 202652 -114558 420661 181922 -111149 273433 -1252 126819
15259A73439l5870F2239J91203c001D24150B5652Q4427b08593B01200H6709J12491
$$ 173439 137569 62239 253442 -3001 424150 25652 110079 -208593 201200 86709 199200
15248A99200P18104P83679n91575R8061l09913C20796J19282E2297a62454h610
$$ 199200 917304 1700983 1109408 1207469 897556 320796 440078 52297 -162454 -8610
15237C08542j11907I0931K49960j69907b57914H151J3350b05019R1255D06317
$$ 308542 196635 90931 340891 170984 -257914 8151 21501 -205019 -113764 406317
15226A19045m7738K75634B0744J56889M6041b33255j5574e306E5098J87941a71312
$$ 119045 71307 346941 20744 177633 223674 -233255 -248829 -5306 55098 243039 -171312
15214g0177J051o9798A40190K07143k3659D7059J07622A4861J05306Q4941r4917
$$ -70177 -69126 -138924 140190 347333 323674 47059 154681 14861 120167 205108 110191
15203A10191A5631f1953D79038A81859e8127k1306F0118d1114A0866J41994F097
$$ 110191 15631 -61953 479038 181859 -58127 -79433 60118 -41114 10866 152860 6097
15191I4914a44145I3098l1283Q1552F2158f700o5732A87979A8026J31111m6602
$$ 94914 -144145 93098 61815 143367 62158 -6700 -72432 187979 18026 149137 102535
15180A02535K2911c9816j19396m2237d9877m3248L9299A32602B5240J75118b66796
$$ 102535 125446 -39816 -159212 -201449 -49877 -93125 -53826 132602 25240 200358 -266796
15168C22009A54102P2670h9449h372A24198b85702A59257K9574O1207A6867J25354
$$ 322009 154102 226772 -89449 -8372 124198 -285702 159257 188831 250038 16867 142221
15157A42221M3784J74251j60580c75101A30817K76838A21982J0882o5980a70372
$$ 142221 186005 360256 199676 -375101 130817 407655 121982 132864 66884 -170372
15146A64606C3416a41224A70670Q4256D7974a47446a7855B14930h4886F8467c3896
$$ 164606 33416 -141224 170670 254926 47974 -147446 -17855 214930 -84886 68467 -33896
15134B10968a30608K0504B99723j34872J38395K10314k12297A38119K30667A29067
$$ 210968 -130608 -110104 299723 164851 303246 513560 301263 138119 368786 129067
15123b24650F7876J781L8934n1049b00921A82512a10805a9597K227D62073A46473
$$ -224650 67876 69657 108591 57542 -200921 182512 -110805 -19597 -17370 462073 146473
15111C1632J68172D3136a2135A42261a65129C92323G5903P9306h3156B07412J2745
$$ 31632 199804 43136 -12135 142261 -165129 392323 75903 155209 -83156 207412 220157
15100B20157K41543a77475G3276L84522L3068a713B42749i8843j71748A51833
$$ 220157 461700 -177475 73276 457798 490866 -1713 242749 -98843 -270591 151833
15089H5570e6946B89913b48706B1197J66542M5316a8236r1549A29023R0398C3994
$$ 85570 -56946 289913 -248706 21197 187739 233055 -18236 -109785 129023 219421 33994
15077i2828A30066Q3627P030k7517L8373F9217b61788A87753F7221L293F841K21465
$$ -92828 130066 213693 220723 193206 231579 69217 -261788 187753 67221 70514 6841 228306
15065B28306K5436a56434A25791a34614H8677k6888M0524L72003A19969P3677
$$ 228306 253742 -156434 125791 -134614 88677 61789 102313 474316 119969 193646
15055A93646C9041J89107f1604A0019J87186J07421o6315c403k11832C11493j6050
$$ 193646 39041 228148 -61604 10019 197205 304626 238311 -3403 -215235 311493 295443
15044B95443m1166m5370J19267G2935J66792R8379F5691M5927j1019K10626D0050
$$ 295443 254277 208907 328174 72935 239727 338106 65691 111618 100599 311225 40050
15032A51844G0554C3857O7819J89227H8767M81651A96688l4485o0591K68949M625
$$ 151844 70554 33857 101676 290903 88767 570418 196688 162203 101612 370561 375186
15021C75186B8446R8917N4291D1047J36619O5547q4761L371K9597D0198J60025
$$ 375186 28446 127363 181654 41047 177666 243213 158452 161823 191420 40198 200223
15010B00223J4298J33237A18885J12707C8478K83706a07349C68004J4976k4677
$$ 200223 214521 347758 118885 231592 38478 322184 -107349 368004 382980 358303
15000C58303j69193Q7425i2705E12100b3480C42482k7497o6766K7702Q994m8973
$$ 358303 189110 276535 -92705 512100 -23480 342482 314985 248219 275921 284915 235942
14989B35942M08521a3523B90996a35911A352P2709N3433J51116J09013A29206
$$ 235942 644463 -13523 290996 -135911 1352 74061 127494 278610 387623 129206
14978B20385C9789L30719M1695G057R2859K88202F3937J60931J03427m7776C7505
$$ 220385 39789 370508 412203 7057 99916 388118 63937 224868 328295 280519 37505
14966D65294A45483C3464N2260M43546k45163Q0992j58110q4555M776l5201L60200
$$ 465294 145483 33464 85724 529270 284107 365099 206989 122434 127210 92009 452209
14955D52209A12912J83351b7523D37716j75974E9009b7125G9742L16215o1945
$$ 452209 112912 296263 -27523 437716 261742 59009 -27125 79742 395957 334012
14945C34012H3645P5171J84624J94482A20150j7246K7688K69668j54399R9796
$$ 334012 83645 158816 343440 537922 120150 102904 130592 400260 245861 345657
14935C45657J00691B04100J73593D507M16934B6695K0550Q3382N0930Q7975J2015
$$ 345657 446348 204100 377693 4507 421441 26695 47245 130627 181557 269532 281547
14924B81547A32261P6242J53286J38577j00180m9641k2424O4209J22008Q5958
$$ 281547 132261 208503 361789 500366 400186 350545 328121 392330 514338 600296
14914F00296k53646K57951B1774K45309P0911J26825j88236A10210J46701j9225
$$ 600296 346650 604601 21774 267083 337994 464819 276583 110210 256911 237686
14904B37686J38249I5803J99027E5651L60304j48982N3771K14535j50760j35792
$$ 237686 375935 95803 294830 55651 415955 266973 320744 535279 384519 248727
14894B48727J85094A67843L8011n7462L88152j30605o8794M0936I0350M09929
$$ 248727 433821 167843 205854 148392 536544 405939 337145 378081 90350 500279
14884E00279j01237r8505n6782L04719B12304J46696j75191N25200A83517O9320
$$ 500279 399042 300537 243755 548474 212304 359000 183809 709009 183517 252837
14874B52837J07675K195j41522M5829k5918J52533K3670j80367j08637K01984
$$ 252837 360512 362707 221185 267014 241096 393629 417299 236932 128295 330279
14864C30279R048L27696k76156K04777n9406k191j3007k16308J23754A50190L94213
$$ 330279 339327 667023 390867 595644 536238 534047 521040 304732 428486 150190 544403
14853E44403j58644K68019K5656B29596P6884K10807M5660A93384M96393A84280
$$ 544403 385759 653778 679434 229596 306480 517287 562947 193384 689777 184280
14842E78408J998r7931n7784M0034F6431M79379j90415j44404M64655k96749M4299
$$ 578408 580406 482475 424691 464725 66431 545810 355395 210991 675646 378897 423196
14831D23196k10972K15800L5418A72585K38348K29556j13443J55571j20406B39540
$$ 423196 212224 428024 463442 172585 410933 640489 527046 682617 562211 239540
14820F95565B78439M3002K16275j97549A51807K83670L8615J39437A58913Q1038
$$ 695565 278439 321441 537716 340167 151807 435477 474092 613529 158913 239951
14810B39951F5419P42353j88366K21805A52341L62717J00533k10387O5079J89045
$$ 239951 65419 807772 619406 841211 152341 515058 615591 405204 470283 659328
14800F59328n3737j14816j2851j19446K00235o6772K0247j16159K11543J48749
$$ 659328 605591 490775 477924 358478 558713 491941 512188 396029 607572 756321
14790G56321j56456B71773N19891k71773J08269j0922k71380J19737J43801P4207
$$ 756321 599865 271773 791664 519891 628160 617238 345858 465595 609396 683603
14780F83603p6590A49457O34333k82609j1122J7286J49595K36148C29497L20745
$$ 683603 607013 149457 783790 501181 490059 507345 656940 893088 329497 650242
14770F50242k6258M5655j54832p962L22923l09164p9263L27306j08773L3296k50600
$$ 650242 623984 669639 514807 506845 829768 520604 441341 768647 659874 693170 442570
14759D42570K77599l14886J50860K76059o376R8753j99080k87002m3142L20168
$$ 442570 720169 405283 556143 832202 825826 924579 725499 438497 395355 715523
14749G15523m1603O9072J38275r0515p7193k92517L1155L8200J56311j7732k2989
$$ 715523 673920 742992 881267 790752 713559 421042 452197 490397 646708 628976 605987
14738F05987J93307P0954k07289N3210K31376k8199k37203r9803O4087P3231Q0813
$$ 605987 799294 870248 662959 716169 947545 919346 682143 582340 646427 719658 800471
14727H00471J28278L28549m67099k88274L74140r6079O7680Q4299j51661L6977
$$ 800471 928749 1257298 790199 501925 876065 779986 847666 931965 780304 817281
14717H17281r2451j7845p4424J34084N422J41719l07341Q9100K64050l1825l6476
$$ 817281 724830 706985 632561 766645 772067 913786 606445 695545 959595 927770 891294
14706H91294j38878N8772m8716p1086j1033J22738K96169p0581l19612J29958
$$ 891294 752416 811188 762472 691386 680353 803091 1099260 1028679 709067 839025
14696H39025J17024J1009j47993j71499J15065J23744j39503M49745m05096J30966
$$ 839025 956049 967058 819065 647566 762631 886375 746872 1196617 791521 922487
14686I22487k9628J28669l98865K3932j78183J34048J78643O5266o6657J50940
$$ 922487 892859 1021528 622663 646595 468412 602460 781103 846369 779712 930652
14676I30652J04300l21476M2185M17793E30651L61806J58630J34859k03600L3887
$$ 930652 1034952 713476 755661 1173454 530651 892457 1051087 1185946 982346 1016233
14666A016233k96070N51286l59485L57807m92931L78931j33506J67569k32385
$$ 1016233 720163 1271449 911964 1269771 776840 1155771 1022265 1189834 957449
14657I57449J39594O2525N5631j03845l2548o4615K15331K38072m63968m8881
$$ 957449 1097043 1159568 1215199 1111354 1078806 1014191 1229522 1467594 1003626 954745
14647I54745J94465L9835M8224j36642N7721m86418O03802j16012j69062M58158
$$ 954745 1149210 1189045 1237269 1100627 1158348 671930 1275732 1159720 990658 1448816
14637A448816j42049k79726k9056J06470M156j18012J93343K00190K8916j45029
$$ 1448816 1306767 1027041 997985 1104455 1108611 990599 1183942 1384132 1413048 1268019
14627A268019j08687L49320j58427K80568l17620m5213L13893j58064p2146J24887
$$ 1268019 1159332 1508652 1350225 1630793 1313173 1267960 1581853 1423789 1351643 1476530
14617A476530j88355K28859K15436j16903o50l88500n854K00507j57423J13723
$$ 1476530 1288175 1517034 1732470 1615567 1614917 1226417 1220563 1421070 1263647 1377370
14607A377370K49724o338r7546j72545M66430l4665k73625L87461j47715j85365
$$ 1377370 1627094 1620756 1523210 1350665 1817095 1782430 1508805 1896266 1748551 1563186
14597A563186L50284m02348K71178k58054M55484J14090n09116L49738k95447
$$ 1563186 1913470 1511122 1782300 1524246 1979730 2093820 1584704 1934442 1638995
14588A638995M52615r0529k75503J82623n1743K00193L994J08414j28513J16799
$$ 1638995 2091610 2001081 1725578 1908201 1856458 2056651 2060645 2169059 2040546 2157345
14578B157345m3175l76991L53860k94882O48196j71812p7128l24044M82613j24236
$$ 2157345 2114170 1737179 2091039 1796157 2444353 2272541 2195413 1871369 2353982 2229746
14568B229746J98044L0688k15587M66860j40923q4034J01554J44371J04160J89112
$$ 2229746 2427790 2458478 2242891 2709751 2568828 2484794 2586348 2730719 2834879 3023991
14558C023991L219o8037R2422J49907J93387N80160L19855Q01852P46709K604079
$$ 3023991 3027210 2959173 3051595 3201502 3394889 3975049 4294904 5096756 5843465 8447544
14548H447544M344229R109734J9495678j490555A8214231H534106D043439j563604
$$ 8447544 12791773 21901507 41397185 39906630 18214231 8534106 4043439 2479835
14540B479835m65330P9025L9397l01829j33862L27436j83762r11k0908Q0455L20588
$$ 2479835 2014505 2093530 2132927 1831098 1697236 2024672 1840910 1839999 1819091 1899546 2220134
14529B220134l02966L35345j8527K9323k08519k74964L90353P6719J18955j01763
$$ 2220134 1917168 2252513 2233986 2263309 2054790 1779826 2170179 2246898 2365853 2264090
14519B264090K86093j95008Q4036J71872n86653M31125Q6189N36746j50662r4100
$$ 2264090 2550183 2355175 2439211 2611083 2024430 2455555 2541744 3078490 2927828 2833728
14509B833728J17545k15664m9428J4231l24261O51459j15556q4891K18851K82333
$$ 2833728 2951273 2735609 2686181 2700412 2376151 3027610 2912054 2827163 3046014 3328347
14499C328347m71748J99494m42K79729j47514K6861J85316k66676N7914R7343
$$ 3328347 2856599 3056093 3055651 3335380 3187866 3214727 3400043 3133367 3191281 3288624
14489C288624J73712l40320M89766l79122M08962k44322M99754m96813K86270
$$ 3288624 3462336 3122016 3611782 3232660 3641622 3397300 3897054 3400241 3686511
14480C686511K33198l53321p5660J21094j13938N47188j69999J41963L30197k93075
$$ 3686511 3919709 3566388 3490728 3611822 3497884 4045072 3875073 4017036 4347233 4054158
14470D054158n931j21502J92839K22455o4032K60753K12055j45637p1503J39883
$$ 4054158 4048227 3926725 4119564 4342019 4277987 4538740 4750795 4605158 4533655 4673538
14460D673538k17297J19819J9913K34871l7223J882k6637N42200l84183M48020
$$ 4673538 4456241 4576060 4595973 4830844 4793621 4795503 4768866 5311066 4926883 5374903
14450E374903k69412J51885R236j15414M13547J17873R7622J29894k2377L3400
$$ 5374903 5105491 5257376 5266612 5151198 5564745 5682618 5780240 5910134 5887757 5921157
14440E921157k80687K10274n3454M74219J48465J8345m0181n6047L77051K23414
$$ 5921157 5640470 5850744 5797290 6271509 6419974 6438319 6398138 6342091 6719142 6942556
14430F942556o067J89907j12932L2768J57129J4371K62107j02824L22965n244
$$ 6942556 6936489 7126396 7013464 7046232 7203361 7217732 7479839 7377015 7699980 7694736
14420G694736m2195k7251M15050n5369M46116m98J43131m456N59494m92148N09879
$$ 7694736 7652541 7625290 8040340 7984971 8431087 8430589 8573720 8569264 9128758 8636610 9146489
14409I146489l4250R18J17682L16979J94764O1005L76126J05330L2650J12972
$$ 9146489 9112239 9113157 9230839 9547818 9742582 9803587 10179713 10285043 10317693 10430665
14399A0430665K21742R4950j9556M01732K36231m3570l4195J54447P42611K54657
$$ 10430665 10652407 10747357 10727801 11129533 11365764 11322194 11287999 11442446 12185057 12439714
14389A2439714K31580q4309N47769o2449K76263O3825M59422K59837j1118P73236
$$ 12439714 12671294 12586985 13134754 13072305 13348568 13412393 13871815 14131652 14120534 14893770
14379A4893770k5354M17324M65529m8096M38877M81976L15893P9900M29695N05610
$$ 14893770 14868416 15285740 15751269 15703173 16142050 16624026 16939919 17019819 17449514 17955124
14369A7955124P8633K91137L52687L89208N08911M71429M83415K63693N07605
$$ 17955124 18033757 18324894 18677581 19066789 19575700 20047129 20530544 20794237 21301842
14360B1301842N53548N71838p7069P07471Q53162M87878O36163M67128O94237
$$ 21301842 21855390 22427228 22350159 23057630 23910792 24398670 25034833 25501961 26196198
14351B6196198O08778Q65908O35875L53216P93320J030645P33354O76280J140905
$$ 26196198 26804976 27670884 28306759 28659975 29453295 30483940 31217294 31893574 33034479
14342C3034479M89251J279590J090102Q82115Q03272J465114P62810J015985J378128
$$ 33034479 33523730 34803320 35893422 36775537 37578809 39043923 39806733 40822718 42200846
14333D2200846J180299J512293J044643J837354J615368J522286J726318J757060
$$ 42200846 43381145 44893438 45938081 47775435 49390803 50913089 52639407 54396467
14325E4396467J638820J775132K219970K129275K329646K337934K327198K753858
$$ 54396467 56035287 57810419 60030389 62159664 64489310 66827244 69154442 71908300
14317G1908300K736542L139290K757992L001928L391043L411391L621189M352065
$$ 71908300 74644842 77784132 80542124 83544052 86935095 90346486 93967675 98319740
14309I8319740M266562M007193M915322M981606N307002N329913O026673O103204
$$ 98319740 102586302 106593495 111508817 116490423 121797425 127127338 133154011 139257215
14301A39257215O582133O793793P392899P856464Q303309Q497717R262244R816088
$$ 139257215 145839348 152633141 160026040 167882504 176185813 184683530 193945774 203761862
14293B03761862R624820J0912573J1295173J1745843J2391447J2418099J3345852
$$ 203761862 213386682 224299255 235594428 247340271 259731718 272149817 285495669
14286B85495669J3253298J3878402J4346030J3953198J4367176J3880169J3557469
$$ 285495669 298748967 312627369 326973399 340926597 355293773 369173942 382731411
14279C82731411J3375127J2767583J1817153J0144824Q748422O360770K488852
$$ 382731411 396106538 408874121 420691274 430836098 439584520 445945290 448434142
14272D48434142p02567p20354k103912n81600m155261n222716q495571j0700577
$$ 448434142 447731575 447011221 444907309 444325709 440170448 434947732 426452161 415751584
14264D15751584j2118017j3962913j4732825j5248962j5299916j5750542j5293668
$$ 415751584 403633567 389670654 374937829 359688867 344388951 328638409 313344741
14257C13344741j4700978j4934432j3807087j2828877j2637184j2317150j1785476
$$ 313344741 298643763 283709331 269902244 257073367 244436183 232119033 220333557
14250B20333557j1065015j0719045r807738r137700r029890p871493p647478p139985
$$ 220333557 209268542 198549497 188741759 179604059 170574169 162702676 155055198 147915213
14242A47915213p029033o601919o182843n568779n047457n063584n092757m496772
$$ 147915213 140886180 134284261 128101418 122532639 117485182 112421598 107328841 102832069
14234A02832069m329468l949695l554610l178580l957642l176661l373879k659585
$$ 102832069 98502601 94552906 90998296 87819716 83862074 80685413 77311534 74651949
14226G4651949k900290k523868k580436j956028k584488k079658j796355k043692
$$ 74651949 71751659 69227791 66647355 64691327 62106839 60027181 58230826 56187134
14218E6187134k114895j769763j455189j816996j044861j448357j370362j560405
$$ 56187134 54072239 52302476 50847287 49030291 47985430 46537073 45166711 43606306
14210D3606306j272510j310014o90975j108692j066260r47876j423292j012657
$$ 43606306 42333796 41023782 40332807 39224115 38157855 37209979 35786687 34774030
14202C4774030q35634j023866n99040n73897j338611r38793o69884n24206p61083
$$ 34774030 33938396 32914530 32315490 31741593 30402982 29464189 28794305 28270099 27509016
14193B7509016m53817p70028o37082j29603j381029k60223o83389m65733n87007
$$ 27509016 27055199 26285171 25648089 25518486 24137457 23877234 23193845 22728112 22141105
14184B2141105l37435n46114l77042n30472m65123k50625n72351k96487m86590
$$ 22141105 21803670 21257556 20880514 20350042 19884919 19634294 19061943 18765456 18278866
14175A8278866m32051j30955n02741k94931k48188k88991j98427o46674l1607
$$ 18278866 17846815 17715860 17213119 16918188 16670000 16381009 16182582 15535908 15504301
14166A5504301k67489j89647o20254l88571j68945o3217m41515K78203q93121
$$ 15504301 15236812 15047165 14426911 14038340 13869395 13806178 13364663 13642866 12749745
14157A2749745k8187r8154n2572m22320J24165l44202l50396j48553j13800m68812
$$ 12749745 12721558 12623404 12570832 12148512 12272677 11928475 11578079 11429526 11315726 10846914
14147A0846914J24043m92197J81737m66162Q9971l45682j34671j07159J45767
$$ 10846914 10970957 10478760 10660497 10194335 10284306 9938624 9803953 9696794 9842561
14138I842561l36000O6002m23578k11201j23175K15068l50439m3383o2693k15937
$$ 9842561 9506561 9572563 9148985 8937784 8814609 9029677 8679238 8635855 8573162 8357225
14128H357225R2555o78130J27638q3264q8354n5888J1821l73347k45025K68098
$$ 8357225 8449780 7771650 7899288 7816024 7727670 7671782 7683603 7310256 7065231 7333329
14118G333329M5818P4980k12476J46331k71750k06135m01507Q7338j15250j26268
$$ 7333329 7379147 7454127 7241651 7387982 7116232 6910097 6508590 6595928 6480678 6354410
14108F354410R3461l86037P1833J56508l56187j25774R0102k0989j57994R8827
$$ 6354410 6447871 6061834 6133667 6290175 5933988 5808214 5898316 5877327 5719333 5818160
14098E818160l15505q0688K13153J50960k05163Q1840n78311J37697M1023K2319
$$ 5818160 5502655 5421967 5635120 5786080 5580917 5662757 5084446 5222143 5263166 5285485
14088E285485J10146k39562m33352K23488j3383k34383Q4462L3415l72219j89272
$$ 5285485 5395631 5156069 4722717 4946205 4932822 4698439 4782901 4816316 4444097 4254825
14078D254825L20484j66817j3815n3975K70221l33914m2778l57747M45953j70136
$$ 4254825 4575309 4408492 4394677 4340702 4610923 4277009 4234231 3876484 4322437 4152301
14068D152301R9886J51715o98215M48441k01054O5294J21001k21712P7486m15497
$$ 4152301 4252187 4403902 3705687 4154128 3953074 4018368 4139369 3917657 3995143 3579646
14058C579646N36533m08639k2148m1702j41315K95205k51709K1280k88997K38011
$$ 3579646 4116179 3707540 3685392 3643690 3502375 3797580 3545871 3567151 3278154 3516165
14048C516165j78107j17982J41525m57400K73581J91849j74160q63o2962j2754
$$ 3516165 3338058 3220076 3361601 2904201 3177782 3369631 3195471 3194608 3131646 3118892
14038C118892k95809L75281j78811N6431J08430n04571M00333k82362L04547j07378
$$ 3118892 2823083 3198364 3019553 3075984 3184414 2679843 3080176 2797814 3102361 2994983
14028B994983j60232K01033k83057j36562M4063j65011J74834l37904J6199K19910
$$ 2994983 2834751 3035784 2752727 2616165 2660228 2495217 2670051 2332147 2348346 2568256
14018B568256J89896k82349J24744n8366Q7005o0927j16612k72078J71493k53731
$$ 2568256 2758152 2475803 2600547 2542181 2629186 2568259 2451647 2179569 2351062 2097331
14008B097331N36699m24700K29770m14987K36573k08046J8733R3505J09636l72382
$$ 2097331 2634030 2209330 2439100 2024113 2260686 2052640 2071373 2164878 2274514 1902132
13998A902132J37183K32761j79204j10548R8428J40901j13131K90318M44248J602874
$$ 1902132 2039315 2272076 2092872 1982324 2080752 2221653 2108522 2398840 2843088 4445962
13988D445962L488849O841081J9473993Q590543k0080622j1271830m355237j815381
$$ 4445962 7934811 14775892 34249885 42840428 22759806 11487976 7132739 5317358
13980E317358j079096q07274j28306O4856l49961n7418m21934j6211k11213j10140
$$ 5317358 4238262 3430988 3302682 3367538 3017577 2960159 2538225 2522014 2310801 2200661
13970B200661k3966P2318J46068r6033K8840m01597K58237k68232L97927j93347
$$ 2200661 2176695 2249013 2395081 2299048 2327888 1926291 2184528 1916296 2314223 2120876
13960B120876j58823K17361j13861k86117L37589j29460l50584J33280k36784
$$ 2120876 1962053 2179414 2065553 1779436 2117025 1987565 1636981 1770261 1533477
13951A533477K81627L56832m86363J17404j22718m8011J60847M3832k5557j36501
$$ 1533477 1815104 2171936 1685573 1802977 1680259 1632248 1793095 1836927 1811370 1674869
13941A674869j96912J70249k63697k28311N82872m6853J04533j51475l64389K69459
$$ 1674869 1477957 1648206 1384509 1156198 1739070 1692217 1796750 1645275 1280886 1550345
13931A550345o6815j85307M18670r2767m94187L73209l3924j07902L607J64517
$$ 1550345 1483530 1298223 1716893 1624126 1129939 1503148 1469224 1361322 1364929 1529446
13921A529446J12474K3193P3670k55549k60279L84615k46426Q5813j95118L4457
$$ 1529446 1641920 1665113 1738783 1483234 1222955 1607570 1361144 1446957 1251839 1286296
13911A286296n4346n5386L9765J09890n4640l1631l8916Q2087K51148j09178p0172
$$ 1286296 1231950 1176564 1216329 1326219 1271579 1239948 1201032 1283119 1534267 1425089 1354917
13900A354917j47298N562J53384k0478l53271J59185J07548K55885j76432q2726
$$ 1354917 1207619 1213181 1366565 1346087 992816 1152001 1259549 1515434 1339002 1256276
13890A256276K4100j12442J96712k51463N0193o0327m3213K75815P1906l24204
$$ 1256276 1280376 1167934 1364646 1113183 1163376 1103049 1059836 1335651 1407557 1083353
13880A083353J15580k56384K72501k16393j09590M26034j71495k3761l03919M38516
$$ 1083353 1198933 942549 1215050 998657 889067 1315101 1143606 1119845 815926 1254442
13870A254442k22022r5745J30560n8115K2719M781J74886j6210o9874q9228K01506
$$ 1254442 1032420 936675 1067235 1009120 1031839 1036620 1211506 1195296 1125422 1036194 1237700
13859A237700q190k1717k90770j50075K37865k46205K07067j11392J98567L5357
$$ 1237700 1229510 1207793 917023 766948 1004813 758608 965675 854283 1052850 1088207
13849A088207k60996J71760J77773k65103K12157j17824k13407K14469O115l460
$$ 1088207 827211 998971 1176744 911641 1123798 1005974 792567 1007036 1013151 1009691
13839A009691m8633J89778l99209J1612K03079R8637o0648k84224O9506N382M91740
$$ 1009691 961058 1150836 751627 763239 966318 1064955 1004307 720083 789589 794971 1286711
13828A286711k65861l24976P1278R2925J89188j68924j28993J20366Q6054j16831
$$ 1286711 1020850 695874 767152 860077 1049265 880341 751348 871714 957768 840937
13818H40937j26275M8596k3140K20054k19837k99923J6949L77253j18474J51670
$$ 840937 714662 763258 740118 960172 740335 440412 457361 834614 716140 867810
13808H67810n4148L38362j43057l3773n8229j84956j46048K1365Q7654K74174
$$ 867810 813662 1152024 1008967 975194 916965 732009 585961 607326 694980 969154
13798I69154j03126J00289j82808k63139P4776N15889n15012K632J22730J43149
$$ 969154 866028 966317 783509 520370 595146 1111035 596023 598655 721385 864534
13788H64534k80446J12247K5770L0800j61729R0394k41510K13532M7175K2198
$$ 864534 584088 696335 722105 752905 591176 681570 440060 653592 700767 722965
13778G22965o4497K43k7781N1453p7399L02609M0489m3958j85506K48149N1216
$$ 722965 658468 658711 630930 682383 604984 907593 948082 904124 718618 966767 1017983
13767A017983l23557J3080J95447k48981L5251k7709L7376k58841J56946J46442
$$ 1017983 694426 707506 902953 653972 689223 661514 698890 440049 596995 743437
13757G43437k36063J36424p8906o777K46412k88148r2020K96479j53940R5360
$$ 743437 507374 643798 564892 558115 804527 516379 424359 720838 566898 662258
13747F62258j77904B31290K63014J46710O6033n2343k0204A00563N37435o2664
$$ 662258 484354 231290 494304 641014 707047 654704 634500 100563 637998 575334
13737E75334r557o8938K6266k46983L96069k46141K25312Q0415k84038K12846
$$ 575334 565777 496839 523105 276122 672191 426050 651362 731777 447739 660585
13727F60585k13323J0890J90458p0886k0239K08760j75347B75965M51845j17977
$$ 660585 447262 458152 648610 577724 557485 766245 590898 275965 727810 609833
13717F09833M73731n15257q1465j84459o6352K26027J44234M5830K3627j03686
$$ 609833 1083564 568307 486842 302383 236031 462058 606292 652122 675749 572063
13707E72063r7503J20308j74297J300K72095j82310K11728k03422A54236M15231
$$ 572063 474560 594868 420571 421871 693966 511656 723384 519962 154236 569467
13697E69467B10110N13872B28085K47216j19586P0517p2964J60470l3855P2653
$$ 569467 210110 723982 228085 475301 355715 426232 353268 513738 479883 552536
13687E52536K55765k81426J1164J227k07216J86632K2934F0422K25979M30335
$$ 552536 808301 526875 538039 539266 332050 518682 541616 60422 286401 716736
13677G16736j78575k50893N6931K93537M5515j36729l0569o061J3614k26355K04642
$$ 716736 538161 287268 344199 637736 683251 546522 515953 509892 523506 297151 501793
13666E01793j51112j69447M41955J1387J03349k30899B47630M8207J21231p6019
$$ 501793 350681 181234 623189 634576 737925 507026 247630 295837 417068 341049
13656C41049q909Q1426L41427l61560j2508M8629o9474f137E91223k9644A15466
$$ 341049 332140 413566 754993 393433 380925 429554 360080 -6137 591223 561579 115466
13644D55842A86920L22700B10916K62245j45785K39254P0922m6913B32677p1980
$$ 455842 186920 509620 210916 473161 327376 566630 637552 590639 232677 160697
13634A60697K86235A17589L25180N575A64913J09037K51397r4617J32611l3707
$$ 160697 446932 117589 442769 448344 164913 273950 525347 430730 563341 529634
13624E29634r9430o5719j57899K46870N2601j18514r3055J73038B22194q5305
$$ 529634 430204 364485 206586 453456 506057 387543 294488 467526 222194 136889
13614A36889J69654K40375C3786N34991j30378K57476B91149O0155F9644N62375
$$ 136889 306543 546918 33786 568777 438399 695875 291149 351304 69644 632019
13604F32019k66362j5038j40953K14153O9854j49139A67764M0487K85754j30394
$$ 632019 365657 350619 209666 423819 493673 344534 167764 208251 494005 363611
13594C63611m2391G2593L78049B07034R3884j29473K4457J13816K30050j75204
$$ 363611 321220 72593 450642 207034 300918 171445 195902 309718 539768 364564
13584C64564A65717M22797k51907r6219N1802R1844O2632j44934A29117J00621
$$ 364564 165717 588514 336607 240388 292190 384034 446666 301732 129117 229738
13574B29738p1130K09534j82118J04391A17210J61016m1817J84734B05526J24960
$$ 229738 158608 368142 186024 290415 117210 278226 236409 421143 205526 330486
13564C30486j198r7894J90411q7010J67861A07645K07565j01084r2464J72777
$$ 330486 329288 231394 421805 334795 502656 107645 315210 214126 121662 294439
13554B94439J523j3229D1004i3885A63534N26333j24810j13724q1318k9315C4768
$$ 294439 295962 282733 41004 -93885 163534 689867 565057 451333 370015 340700 34768
13542F02348k67523q7310r607J50341F5707p909M8053K16390A50130p4209C2947
$$ 602348 334825 247515 237908 388249 65707 57798 105851 322241 150130 75921 32947
13530D49428I4913J78079A11003k3205L3898E0783K67946j0849A51573q380J69510
$$ 449428 94913 272992 111003 87798 121696 50783 318729 307880 151573 143193 312703
13519C12703P3726K47845A36248i6795B85186j37232c2937D2915K54211J80582
$$ 312703 386429 634274 136248 -96795 285186 147954 -32937 42915 297126 477708
13509D77708J94417k58080J1102k11151K2025j4002K10207d0480H8474P0390P6656
$$ 477708 672125 414045 425147 213996 236021 222019 432226 -40480 88474 158864 235520
13498B35520K06027f0724G0552M13962j00585q8406Q1052A61839J73018D3760
$$ 235520 441547 -60724 70552 484514 383929 295523 376575 161839 334857 43760
13487C13787H3874J78137E5580L86853a89039A97149L99990j56712A98399d3139
$$ 313787 83874 262011 55580 442433 -189039 197149 597139 440427 198399 -43139
13476B20452E0570J01564o0723L99608j20744A46975a01076B61813j7687J5410
$$ 220452 50570 152134 91411 491019 370275 146975 -101076 261813 244126 259536
13466B59536j02880P6670h7843B51915e2575D50218C6324K23987G2636a52040
$$ 259536 156656 233326 -87843 251915 -52575 450218 36324 260311 72636 -152040
13455C88038H2508d2456C58682H4245e8417B65114E8655P1421d4859A27366P1233
$$ 388038 82508 -42456 358682 84245 -58417 265114 58655 130076 -44859 127366 198599
13444A98599g1061F79845A5832L06508F8981J12816K16584j83195j05154J88173
$$ 198599 -71061 679845 15832 322340 68981 181797 398381 215186 110032 298205
13434B98205n9788q6706M32382H003Q1629J70931A06546D7624L43219o1230h0702
$$ 298205 238417 151711 584093 8003 89632 260563 106546 47624 390843 329613 -80702
13422b21887f5196C14618m3724A11909M88n4578a4003B01562G6149M58268B55520
$$ -221887 -65196 314618 270894 111909 112397 57819 -14003 201562 76149 534417 255520
13410C89375j45825k6756j486J39147n6602m1829a03228D70370f3749B97256A12801
$$ 389375 243550 216794 215308 354455 297853 256024 -103228 470370 -63749 297256 112801
13398D35267k01405J78601l3261j34227j11164m6581J67410F9567P9079a64605
$$ 435267 233862 412463 379202 244975 133811 87230 254640 69567 148646 -164605
13387C93471R3489B27367j001A04798k5866O7896K28540j06976j04523n7384J01114
$$ 393471 486960 227367 226366 104798 78932 146828 375368 268392 163869 106485 207599
13376B07599j6673h720D81927j95211m4082B1872J86963m7321K34756j50953j14266
$$ 207599 190926 -8720 481927 286716 242634 21872 208835 161514 396270 245317 131051
13365A31051J77059j48129J54349I642K88578J5203A07397o709J83402J06184
$$ 131051 308110 159981 314330 9642 298220 313423 107397 100688 284090 390274
13355C90274I8188k5109c2546B01434j8620M034O8781j00667j7049l8560M2427
$$ 390274 98188 73079 -32546 201434 182814 186848 255629 154962 137913 99353 141780
13344A41780a3784B37843J6892J7125p2445K62295E9775L38223j54441P134o9099
$$ 141780 -13784 237843 254735 271860 199415 461710 59775 397998 243557 250691 181592
13333A81592o2334k7634N9592a65236B41573I0824d8752A71080L38829j84818
$$ 181592 119258 91624 151216 -165236 241573 90824 -48752 171080 509909 325091
13323C25091E7552J23183i082H5021L88323j56839l5408F0337g6369A36152Q702
$$ 325091 57552 180735 -9082 85021 473344 316505 281097 60337 -76369 136152 144854
13312A44854K5250l0352L73800k38711J44883j87380D5708J55846k2911q5665
$$ 144854 170104 139752 513552 274841 419724 232344 45708 201554 178643 92978
13302I2978J85766A03202a18539D7355O2957d4718B57381q2983K71696k19474
$$ 92978 278744 103202 -118539 47355 110312 -44718 257381 174398 446094 226620
13292B26620o3567a78C42583a84216I0225K86250G1703J73316n4171p4375I167
$$ 226620 163053 -178 342583 -184216 90225 376475 71703 245019 190848 116473 9167
13280B0383M9212N4133a9520E9259O5960i3613A93071a23349b2583A37428C1558
$$ 20383 69595 123728 -19520 59259 125219 -93613 193071 -123349 -22583 137428 31558
13268B6627a31887D70656j96942n0233a59734c9427A02906J62067a55100C38565
$$ 26627 -131887 470656 273714 223481 -159734 -39427 102906 264973 -155100 338565
13257A29219K2389L4051i7705j12423A91744Q2068A14027K39746J1629o1403a6258
$$ 129219 151608 185659 -97705 -210128 191744 273812 114027 353773 365402 303999 -16258
13245C70601f9397B91579G1881f2563B75437L7652a0724j13950I0533J67598j16515
$$ 370601 -69397 291579 71881 -62563 275437 313089 -10724 -124674 90533 258131 141616
13234A41616j7258A0687e8806b4645C41013H3258O8847G4002d8569j8826A88031
$$ 141616 124358 10687 -58806 -24645 341013 83258 152105 74002 -48569 -67395 188031
13222c38645A27768K3726K62264a00236B01065r143c5525q3834A22799H345J22971
$$ -338645 127768 151494 413758 -100236 201065 191922 -35525 -119359 122799 8345 131316
13211A31316a2090C7959a2476j48212H4028P1984l486K98106A09647a78021a0359
$$ 131316 -12090 37959 -12476 -160688 84028 156012 152526 450632 109647 -178021 -10359
13199A27081J40986A04319B730J42147m0697K17561a99535d4279C32314A49818
$$ 127081 268067 104319 2730 144877 104180 321741 -199535 -44279 332314 149818
13188B93534G6208j7727K44078k8907K51553b7649A55703a4844I6514J23949a71795
$$ 293534 76208 58481 302559 273652 525205 -27649 155703 -14844 96514 220463 -171795
13176A85785a0784E5145k4834b46210A15438H183f1693A50885b8849C25626A10864
$$ 185785 -10784 55145 30311 -246210 115438 8183 -61693 150885 -28849 325626 110864
13164B43188b44881a9203H44O8197A2696c5754D7643d6402A05877J84655r8658
$$ 243188 -244881 -19203 844 69041 12696 -35754 47643 -46402 105877 290532 191874
13153A91874Q8084g818G4026K13608k0669H2538b717C7476L7271K7432P3088Q7949
$$ 191874 279958 -7818 74026 287634 266965 82538 -2717 37476 74747 102179 175267 263216
13141B63216H9346C3153c7274B66103F8329O0192K6395O3915o9014D176J27058
$$ 263216 89346 33153 -37274 266103 68329 128521 154916 218831 149817 4176 131234
13130A31234M1663k7403j9641J87239a15279B27824H4864O3293b9678A69759a08274
$$ 131234 172897 145494 125853 313092 -115279 227824 84864 148157 -29678 169759 -108274
13118C94133C2310c5035C67528j52529F3652b8475B20759b9743m869j25437B22879
$$ 394133 32310 -35035 367528 214999 63652 -28475 220759 -29743 -34612 -160049 222879
13106B0254b33266g912l36570A45239R2205r7337j316d677A05222R1573k1162
$$ 20254 -233266 -7912 -344482 145239 237444 140107 138791 -4677 105222 196795 175633
13095A75633J45635J67345b08768A91515K03295j02777O7046G9995O2265m660
$$ 175633 321268 488613 -208768 191515 394810 292033 359079 79995 142260 137600
13085A37600J89345a29495A43854i8195a6160j74317j42252J59292C35134A46352
$$ 137600 326945 -129495 143854 -98195 -16160 -190477 -332729 -173437 335134 146352
13074B952J43544j0741c16948G0127b5279k56303C35205B1933M2896a56214B59845
$$ 2952 146496 135755 -316948 70127 -25279 -281582 335205 21933 64829 -156214 259845
13062c4189A57559D2342J50549l3219a05073A25330A6761K92808J51234B0515
$$ -34189 157559 42342 192891 159672 -105073 125330 16761 309569 460803 20515
13051A93100m4218a63656E6344A0859K19412a5462B55458F5088J54218k5423g0045
$$ 193100 148882 -163656 56344 10859 230271 -15462 255458 65088 219306 193883 -70045
13039a3948C5348O7352L21139A0771K6789J19880c85866H4112a52490G6866a12420
$$ -13948 35348 102700 423839 10771 37560 157440 -385866 84112 -152490 76866 -112420
13027b41892A32772B8163a8441G0523K08158j16545F3542L19953c5066j18703
$$ -241892 132772 28163 -18441 70523 278681 162136 63542 383495 -35066 -153769
13017a53769l3475B42440p2651a6504A61480g8227A27773J4841J17359b9030E7404
$$ -153769 -187244 242440 169789 -16504 161480 -78227 127773 142614 259973 -29030 57404
13005A53580p5812b67406A67029A8372G582J00780a78457B79053A27796h2632
$$ 153580 77768 -267406 167029 18372 7582 108362 -178457 279053 127796 -82632
12994A0704J84435a58036n2956H9992b47530A58840M3380E8874J1931K62428I3836
$$ 10704 195139 -158036 -210992 89992 -247530 158840 202220 58874 70805 333233 93836
12982i5331K6953o5073B73734I376J89736c15241b7676B28980a38818H0326g3190
$$ -95331 -68378 -133451 273734 9376 199112 -315241 -27676 228980 -138818 80326 -73190
12970A84138m5220i848A02056a9998D3581d9745C61595j45470I7060k9006J04672
$$ 184138 138918 -9848 102056 -19998 43581 -49745 361595 216125 97060 68054 172726
12959A72726a15260i884j32807O7583D9781K63680j808C1512J18385h7298A89870
$$ 172726 -115260 -9884 -142691 -75108 49781 313461 311653 31512 149897 -87298 189870
12947A13899A3199J85492H7830b4540R657D95884a03672A43824J18692d16945
$$ 113899 13199 198691 87830 -24540 -14883 495884 -103672 143824 262516 -416945
12936b4537A79524J58240c2A15816M5021c807C4744J02960M7440a15493D6523
$$ -24537 179524 337764 -32 115816 160837 -3807 34744 137704 185144 -115493 46523
12924A70980Q0542j08282b9251l4222A38153c9362A88751j3468d4088k16506M7542
$$ 170980 251522 143240 -29251 -63473 138153 -39362 188751 175283 -44088 -260594 -213052
12913b13052h6741a1230A12469K21066F0011J11658b1641A10954L0844J67579
$$ -213052 -86741 -11230 112469 333535 60011 171669 -21641 110954 141798 309377
12903C09377F557L1227K25154b5197j33067C4627q130P968a70563G152a11010
$$ 309377 6557 37784 262938 -25197 -158264 34627 26497 34465 -170563 7152 -111010
12891b6706m0680B97640j47313C1999J65647o1025f9905j57853B7041c53448G9169
$$ -26706 -67386 297640 150327 31999 197646 136621 -69905 -227758 27041 -353448 79169
12879A43306b12084A03500k7122j6192O2801m9062c8428D0621e7557H3261i690
$$ 143306 -212084 103500 76378 60186 122987 73925 -38428 40621 -57557 83261 -9690
12867G3603L2888i2579B26191G8500J51026i0722B7127J0759J40083g192D7656
$$ 73603 106491 -92579 226191 78500 229526 -90722 27127 37886 177969 -7192 47656
12855B63185L3900e7145H4451i3585j11569e0983q1432A01903b41316L684A26330
$$ 263185 297085 -57145 84451 -93585 -205154 -50983 -132415 101903 -241316 -237632 126330
12843b10593a8688B36844B3683Q1557J52448a07196k2683A01879A1060n33i8275
$$ -210593 -18688 236844 23683 105240 257688 -107196 -129879 101879 11060 10527 -98275
12831A2240L97949a98427b7349D61386A59691b84942B17202I1036e0295A02269
$$ 12240 410189 -198427 -27349 461386 159691 -284942 217202 91036 -50295 102269
12820b97735b0379k44454I3086i003m1468m9714k00632D5988d7198j49378K802
$$ -297735 -20379 -264833 93086 -9003 -50471 -100185 -300817 45988 -47198 -196576 -193774
12809a93774c4952G1495c5819k9220A52013P024c46902a45639B12187a3019A18065
$$ -193774 -34952 71495 -35819 -65039 152013 159037 -346902 -145639 212187 -13019 118065
12797a42377D10259I3717b16934G9553A0820J05987b00402A17603D3843b92898
$$ -142377 410259 93717 -216934 79553 10820 116807 -200402 117603 43843 -292898
12786B45000a2851C6711j1029a27186A00146c8061A07499c35244A33639Q932a21378
$$ 245000 -12851 36711 25682 -127186 100146 -38061 107499 -335244 133639 142571 -121378
12774B0385b5209m4068q674A58359G2970Q8737k4549D0416h7639a5108j6649A11377
$$ 20385 -25209 -69277 -77951 158359 72970 161707 137158 40416 -87639 -15108 -31757 111377
12761g561k09691B17212L886f2617o7109A05855e7555A91039i3249j47576K8274
$$ -7561 -217252 217212 221098 -62617 -129726 105855 -57555 191039 -93249 -240825 -212551
12750b12551C49074F4632M31006f3124j03414B01427b59282A85871F016M4897
$$ -212551 349074 64632 495638 -63124 -166538 201427 -259282 185871 6016 50913
12740E0913A8515K78874g0297A35559a23421B94254D0970M1245b45482R9558A9675
$$ 50913 18515 297389 -70297 135559 -123421 294254 40970 82215 -245482 -145924 19675
12728i4633G3569K55648j53385C5777b6836o6436B38378b03921B21784a42862
$$ -94633 73569 329217 175832 35777 -26836 -93272 238378 -203921 221784 -142862
12717a18418a735j3072A26032A2814i3022l411I0713K58262N1451A16416J04950
$$ -118418 -1735 -14807 126032 12814 -93022 -96433 90713 348975 400426 116416 221366
12706B21366E7068c30765D22822j32088k3983J73902E1520f3759k5923E8730b4924
$$ 221366 57068 -330765 422822 290734 266751 440653 51520 -63759 -89682 58730 -24924
12694A35173A4492i8334E86409A73007i4623B94362j28512e3764A25463M0672
$$ 135173 14492 -98334 586409 173007 -94623 294362 165850 -53764 125463 166135
12684A66135o3986Q493J91619J5206A25985J44152Q068J88453j61816L9836a0644
$$ 166135 102149 110642 302261 317467 125985 270137 278205 466658 304842 344678 -10644
12672F7506j2724c5672q1149k91609B27451b3541G9886J73851F4571a60801m1120
$$ 67506 54782 -35672 -116821 -408430 227451 -23541 79886 253737 64571 -160801 -201921
12661b01921Q4830E0988a11993E3933J55862O2623G4777J25075B4337a95727b152
$$ -201921 -117091 50988 -111993 53933 209795 272418 74777 199852 24337 -195727 -2152
12649B28444H9712b53218K3481J3659K3716k4898j7022A72322e9658j30884A9514
$$ 228444 89712 -253218 -229737 -216078 -192362 -217260 -234282 172322 -59658 -190542 19514
12637D7355b49423A47784i875E0036K02002a93083C27932G2256J98880p0763L99206
$$ 47355 -249423 147784 -9875 50036 252038 -193083 327932 72256 271136 200373 599579
12626E99579A03052a82581A61973g0705l0279A73046J9363E4348J49503i5221
$$ 599579 103052 -182581 161973 -70705 -100984 173046 192409 54348 203851 -95221
12615e9736C79161j68875a07811A21687a12822c2034r3663B68821a64454j3405
$$ -59736 379161 210286 -107811 121687 -112822 -32034 -125697 268821 -164454 -177859
12605a77859H7033B669c3297j55817c256A88907K03280o1801a26727D74270j79183
$$ -177859 87033 2669 -33297 -189114 -3256 188907 392187 330386 -126727 474270 295087
12594B95087A23286K46725B8013J87846n2969a48611B07199b20463A41248E6349
$$ 295087 123286 370011 28013 215859 162890 -148611 207199 -220463 141248 56349
12583A8803J35174J29717j33088c0750p9790C0813a69970c4015m6861c4390J0418
$$ 18803 153977 283694 150606 -30750 -110540 30813 -169970 -34015 -80876 -34390 -23972
12572b3972k4070A11453L97409C9948b05180a8637D82616C2335a0161I6279J65857
$$ -23972 -48042 111453 508862 39948 -205180 -18637 482616 32335 -10161 96279 262136
12561B62136j03096b9324j08349B7713J83658A02534J32339R4937c6774m0890
$$ 262136 159040 -29324 -137673 27713 211371 102534 234873 329810 -36774 -77664
12551g7664E65879h2248A69228n1880d51302A6986e11096a04729l0653B3631e5331
$$ -77664 565879 -82248 169228 117348 -451302 16986 -511096 -104729 -135382 23631 -55331
12539a48585B18324i7900r1485b3711q2982F6281M2186P7337E5376J1702K15135
$$ -148585 218324 -97900 -189385 -23711 -106693 66281 108467 185804 55376 67078 282213
12528B82213J97220H3202k5576f2603B48550a68575b3524j73826c1271k8667D3228
$$ 282213 479433 83202 57626 -62603 248550 -168575 -23524 -197350 -31271 -59938 43228
12516F9368J46585a6393A50030p239d3426q5443d8170D850J29985d04669Q3571
$$ 69368 215953 -16393 150030 142791 -43426 -128869 -48170 4850 134835 -404669 -321098
12505c21098A68444b67105B8074a90736O6404b6966B78779F2611M72539b70618
$$ -321098 168444 -267105 28074 -190736 -124332 -26966 278779 62611 535150 -270618
12494B13637k6375a28724b7856H2782a181C43065e4806j20725I8574K4053i0888
$$ 213637 187262 -128724 -27856 82782 -1181 343065 -54806 -175531 98574 122627 -90888
12482a10996c8908I3760N806P8192o5723K27377a04768H4013C6896N6268a95041
$$ -110996 -38908 93760 99566 177758 112035 339412 -104768 84013 36896 93164 -195041
12470A04236b85208B8626K56540a32585l5158A33059a8969q4385d7858C6487K8507
$$ 104236 -285208 28626 285166 -132585 -167743 133059 -18969 -103354 -47858 36487 64994
12459F4994a9078k428B84805i8248l76013f08q9070j46599o3062G596Q0637K41427
$$ 64994 -19078 -21506 284805 -98248 -474261 -608 -89678 -236277 -299339 7596 88233 329660
12447C29660f7929b2565k4435o9820j45363f1615A8444K7834K82952A08568K552
$$ 329660 -67929 -22565 -47000 -116820 -262183 -61615 18444 46278 329230 108568 111120
12436A11120A1078a74777H4272d2124p8924N96L2168r823M2802n2374j86900B6696
$$ 111120 11078 -174777 84272 -42124 -121048 -120452 -88284 -98107 -55305 -107679 -294579 26696
12423A13934b10450D2030a94746c336j58836B21825B5432f530A85696H4163J32085
$$ 113934 -210450 42030 -194746 -3336 -162172 221825 25432 -6530 185696 84163 216248
12412B16248a55617E82645b72599p3820J48243A60374c9724j21901C59411E8184
$$ 216248 -155617 582645 -272599 -346419 -198176 160374 -39724 -161625 359411 58184
12401A23085O7081a69446G8713a19450A28749a25575e4720k50432a5372j18419
$$ 123085 190166 -169446 78713 -119450 128749 -125575 -54720 -305152 -15372 -133791
12391a33791k82346h3847A41409f1485i187k9491C6179M41692c46251i5926j66382
$$ -133791 -416137 -83847 141409 -61485 -9187 -38678 36179 477871 -346251 -95926 -262308
12380b62308C16415H3894a97k73969b5261A59356M1940g5236m4741C42446G270
$$ -262308 316415 83894 -197 -274166 -25261 159356 201296 -75236 -119977 342446 7270
12368i9083A2934i5382A69470M497A0544b54628C7680g3128B5294a10610H2856
$$ -99083 12934 -95382 169470 173967 10544 -254628 37680 -73128 25294 -110610 82856
12356a1355A81833o7364R6270p3030J64296b34690g8805C0407K34313f9056E1913
$$ -11355 181833 114469 210739 137709 302005 -234690 -78805 30407 264720 -69056 51913
12344c27377i289G9344c66094H3189c9815k0723l61103b0445A76028b02036n5160
$$ -327377 -9289 79344 -366094 83189 -39815 -60538 -421641 -20445 176028 -202036 -257196
12333b57196A97564H1632I48f8776B21488a33515C3213K0342d5111A16038E7952
$$ -257196 197564 81632 948 -68776 221488 -133515 33213 53555 -45111 116038 57952
12321g9089A89794B9947q355K49183b20643a6685A33800l5052b52487A7454L8360
$$ -79089 189794 29947 21592 270775 -220643 -16685 133800 98748 -252487 17454 55814
12310E5814a92343M7496l4182p8933B92752G3869g7758C8889b04871A10359B3657
$$ 55814 -192343 -144847 -179029 -257962 292752 73869 -77758 38889 -204871 110359 23657
12298B17925k1980J33122F3724c76614B17640p2243P0180I3626K73305a68697
$$ 217925 195945 329067 63724 -376614 217640 145397 215577 93626 366931 -168697
12287a34754A48242J49590c11151A05084c50546J32921A8686M9246J2909P2047
$$ -134754 148242 297832 -311151 105084 -350546 -217625 18686 67932 80841 152888
12277A52888N1338K24094M8435I7113a85811E6621M4531f5387A9087P2484C0942
$$ 152888 204226 428320 476755 97113 -185811 56621 101152 -65387 19087 91571 30942
12265C17859E9236J10165F0584b03693c4316C309J21237E6389J07634a60677A57285
$$ 317859 59236 169401 60584 -203693 -34316 3309 124546 56389 164023 -160677 157285
12253b25388B73920b7909B04571b02338P9951B79973A15907J64720e2065o4662
$$ -225388 273920 -27909 204571 -202338 -122387 279973 115907 280627 -52065 -116727
12243a16727B2250g0456A24078P3322E2969K62638I1793K63898m5026H4804Q1366
$$ -116727 22250 -70456 124078 197400 52969 315607 91793 355691 310665 84804 166170
12232A66170n1572a34960A68581a04412K4399j3334B83392j06835R3489O4879
$$ 166170 114598 -134960 168581 -104412 -80013 -93347 283392 176557 270046 334925
12222C34925G2211L15554j56146n394J75132j51063a42424B8999a8838G5686R086
$$ 334925 72211 387765 231619 226225 401357 250294 -142424 28999 -18838 75686 84772
12211H4772Q0514o585M8870a09124D32916i0021A88613N4357L5160L67818A91170
$$ 84772 165286 158701 207571 -109124 432916 -90021 188613 242970 278130 645948 191170
12199c8759l1196C65582O208R7031B17538d9440r4884D08429A55022n2330a13525
$$ -38759 -69955 365582 371790 468821 217538 -49440 -144324 408429 155022 102692 -113525
12187C9212M97736A38764L44032a52318e7317E7113A1757J56846J11508c5003
$$ 39212 536948 138764 482796 -152318 -57317 57113 11757 168603 280111 -35003
12176A54405l6110C9602J99151a42294M5415E9956c5709A01811l2913g727A89480
$$ 154405 118295 39602 238753 -142294 -96879 59956 -35709 101811 68898 -7727 189480
12164B07450h5890R27B74033C0751K47631f2606h126A11633a07644A22024a824
$$ 207450 -85890 -84963 274033 30751 278382 -62606 -8126 111633 -107644 122024 -1824
12152b0558j56247B1395a97035B61466g9834j61127k2843A10291O2189b57456
$$ -20558 -176805 21395 -197035 261466 -79834 -240961 -263804 110291 172480 -257456
12141a03885B01111R6002b23991h7214k00676A2655J54899a00840H6142B9349
$$ -103885 201111 297113 -223991 -87214 -287890 12655 167554 -100840 86142 29349
12130B39044E1494J11835h7866B46650a36018M555D05507A61121B3649a78836
$$ 239044 51494 163329 -87866 246650 -136018 -131463 405507 161121 23649 -178836
12119A692J32808K5472d7347j69005j5308A62910a75764e516j19608F8511R1620
$$ 1692 134500 159972 -47347 -216352 -231660 162910 -175764 -5516 -125124 68511 160131
12108A60131d5298h983F9754J49974l5219a2383F2413L7709j3383M6747a80195
$$ 160131 -45298 -8983 69754 219728 184509 -12383 62413 100122 86739 133486 -180195
12096D9547J21687a30572l6335B71777b25106A33552l9153F948J80410q6376a64101
$$ 49547 171234 -130572 -166907 271777 -225106 133552 94399 6948 187358 100982 -164101
12084C07469G7748K98092e1304j71844E5242i7796j0865A87681q4115N09787K66792
$$ 307469 77748 375840 -51304 -223148 55242 -97796 -108661 187681 103566 613353 880145
12073H80145J094718q85284k63043A70811l9454N9012a99977D4359j6560L1195
$$ 880145 1974863 1089579 826536 170811 131357 190369 -199977 44359 27799 58994
12063E8994L45888B976a7250H376c0255B07779F0960R201K83442A38518e0267
$$ 58994 404882 2976 -17250 8376 -30255 207779 60960 70161 353603 138518 -50267
12051G8736K3593b44516I8343P6390a03341C26031A05618d0102N563r0131j22659
$$ 78736 102329 -244516 98343 174733 -103341 326031 105618 -40102 -34539 -124670 -247329
12040b47329J06460d4678C13469j14649K0862F1203M2919a44182e3957j75137
$$ -247329 -140869 -44678 313469 198820 219682 61203 104122 -144182 -53957 -229094
12030b29094a11065F9026N834c67306J54760A79574E6324a86824E7414J91486
$$ -229094 -111065 69026 74860 -367306 -212546 179574 56324 -186824 57414 248900
12020B48900j12703a22249A61644a73713k05913B50294H6499R978g2675p3489
$$ 248900 136197 -122249 161644 -173713 -379626 250294 86499 96477 -72675 -146164
12010a46164A00602A2764C433J08615n4365a9326q1348D8832e3967G0669O5629
$$ -146164 100602 12764 3433 112048 57683 -19326 -100674 48832 -53967 70669 136298
11999A36298R8092d235m4417k38785B7636b9213b584l6260j17176N7613k95602
$$ 136298 234390 -4235 -48652 -287437 27636 -29213 -2584 -38844 -156020 -98407 -394009
11988c94009a82071h4447E1422a98063A93131e9055B05654r3418R2546a05045
$$ -394009 -182071 -84447 51422 -198063 193131 -59055 205654 112236 204782 -105045
11977B27673c07290Q8083e4644A66679B9180a92512D0209b17230j42394J19186
$$ 227673 -307290 -219207 -54644 166679 29180 -192512 40209 -217230 -359624 -240438
11967b40438J4247D1895d5807a5883j03243k5583A08895m1121c3048m9797A55044
$$ -240438 -226191 41895 -45807 -15883 -119126 -144709 108895 67774 -33048 -82845 155044
11955a5380m63142a41853p9438D3690b37621B007b18549B09416L93741A81299
$$ -15380 -478522 -141853 -221291 43690 -237621 2007 -218549 209416 603157 181299
11944b07209g319l14800P3278A75128c76363a69520f2676l5303G9970b64493P0055
$$ -207209 -7319 -322119 -248841 175128 -376363 -169520 -62676 -97979 79970 -264493 -194438
11933a94438Q9356J0019K9329F1152h3866A53625Q0921F9873a07524A98587D117
$$ -194438 -105082 -95063 -65734 61152 -83866 153625 234546 69873 -107524 198587 4117
11921f1561J205j46086R1260B72638G7148d1572G1262J12209o8465b45253b9479
$$ -61561 -60356 -206442 -115182 272638 77148 -41572 71262 183471 115006 -245253 -29479
11909A13906b45829B24929j09378g9025H2661l5322M99060b74013A43305b77272
$$ 113906 -245829 224929 115551 -79025 82661 47339 546399 -274013 143305 -277272
11898a80494I2492L6151b14327O0991B473J72876P2759a94514B14687A5089g8291
$$ -180494 92492 128643 -214327 -153336 2473 175349 248108 -194514 214687 15089 -78291
11886a97648A85945n5671b64109D1913e4407r1261p2603k71102a37959n190C1037
$$ -197648 185945 130274 -264109 41913 -54407 -145668 -218271 -489373 -137959 -143149 31037
11874A18133A7579a62717K337A61004E509a51365o0171A60766c0414D2123L2432
$$ 118133 17579 -162717 -160380 161004 5509 -151365 -211536 160766 -30414 42123 74555
11863G4555N7287f386A15179B5736J69885b05513J0840A73531b41644a6860j65881
$$ 74555 131842 -6386 115179 25736 195621 -205513 -194673 173531 -241644 -16860 -182741
11852a82741H6863J14420b35640B4321J04432a37176k83631e2177j0479n0277
$$ -182741 86863 201283 -235640 24321 128753 -137176 -420807 -52177 -62656 -112933
11842a12933A02849b34906L9464A00347b30895A67507a92552J3605A16227e1619
$$ -112933 102849 -234906 -195442 100347 -230895 167507 -192552 -178947 116227 -51619
11831A90887m2753a07350L3173A65770D6509f6446j7821j23501e219G5223O089
$$ 190887 148134 -107350 -74177 165770 46509 -66446 -84267 -207768 -5219 75223 81312
11820H1312c29082a17739i893n4690A18186M3271E5142a02367K3588A0747J94901
$$ 81312 -329082 -117739 -9893 -64583 118186 161457 55142 -102367 -78779 10747 205648
11809B05648g4437J0501A31189b58118E8867b37187A41180f0923k25816d1806
$$ 205648 -74437 -63936 131189 -258118 58867 -237187 141180 -60923 -286739 -41806
11798B4579c4242B11850g9272j61677R6128g650a265o7808F0610J00337h3621
$$ 24579 -34242 211850 -79272 -240949 -144821 -7650 -1265 -69073 60610 160947 -83621
11786D9929m097O047a73620B17307b68670a3146A76081p7319d915A80261c8693
$$ 49929 45832 51879 -173620 217307 -268670 -13146 176081 98762 -4915 180261 -38693
11774b59835A81199c14837J02098B49245d80345K36774e9925j6024q0207b2625
$$ -259835 181199 -314837 -212739 249245 -480345 -243571 -59925 -75949 -156156 -22625
11763f0099J0575j45561A02180n0176A7501M800R3736d9370j81390G1079J79027
$$ -60099 -49524 -195085 102180 52004 17501 22301 116037 -49370 -230760 71079 250106
11752B50106f1126A63966e3701A25734d6798k9555H452a61779N067A90225E5714
$$ 250106 -61126 163966 -53701 125734 -46798 -76353 8452 -161779 -156712 190225 55714
11740C9393Q5476J11684G2656a2851A60941J32725h736j62810f6029D19944H5029
$$ 39393 124869 236553 72656 -12851 160941 293666 -8736 -171546 -66029 419944 85029
11728H5989C2110i0009o8020i444H9384k6644Q6224a46811A35472h4162a66j75743
$$ 85989 32110 -90009 -158029 -9444 89384 62740 148964 -146811 135472 -84162 -166 -175909
11716a75909B3337a30955C08720a64899G1706a63835f2650A6084M5527b05137
$$ -175909 23337 -130955 308720 -164899 71706 -163835 -62650 16084 61611 -205137
11705I4392c8001k4033j44260G3852b21137A91555J69150j27087F2091c45547
$$ 94392 -38001 -62034 -206294 73852 -221137 191555 360705 233618 62091 -345547
11694A49658B7655M3475d9746B8790J89446a94628H16b2855A17349a0002j21084
$$ 149658 27655 71130 -49746 28790 218236 -194628 816 -22855 117349 -10002 -131086
11683a31086A6535a69148L7912E1235J91948P5994k2477Q4089j15970n5355l4432
$$ -131086 16535 -169148 -131236 51235 243183 319177 296700 380789 264819 209464 175032
11672A75032F6555B407M6907L95315h6109r2383B7445M692h0919F8641b0624l840
$$ 175032 66555 2407 49314 444629 -86109 -178492 27445 32137 -80919 68641 -20624 -24464
11660b4464A40988a15821k95943a50085B14957L4445K06049e2977A60470L6007
$$ -24464 140988 -115821 -411764 -150085 214957 249402 455451 -52977 160470 196477
11650A96477e7332n1420A66372h1562A38396b34418I8592i4432E9551a21034A56040
$$ 196477 -57332 -108752 166372 -81562 138396 -234418 98592 -94432 59551 -121034 156040
11638c09640I4201k7047a80515B17464A3737N4220h4318j0193H3281C7378f9145
$$ -309640 94201 67154 -180515 217464 13737 67957 -84318 -94511 83281 37378 -69145
11626D5863J38016O861D4952L00784F4622a01740C32687A46014a337j17322A08255
$$ 45863 183879 190740 44952 345736 64622 -101740 332687 146014 -1337 -118659 108255
11614a13729A55001c1117E282K9433M7423c89893a41459G3852J94398D6109a38847
$$ -113729 155001 -31117 5282 34715 82138 -389893 -141459 73852 268250 46109 -138847
11602e0393F5718a56955d9992r0549d2489B02144j585E7840K41233I8648K20204
$$ -50393 65718 -156955 -49992 -140541 -42489 202144 200559 57840 299073 98648 318852
11591C18852j53695J84773b88610J00939N9851k46182a48660C017P0586a50925
$$ 318852 165157 349930 -288610 -187671 -127820 -374002 -148660 3017 73603 -150925
11580c8175j27690N8533A86410N1449a54078l1281g6918D9282a57513D9000a71384
$$ -38175 -165865 -107332 186410 237859 -154078 -185359 -76918 49282 -157513 49000 -171384
11568A45235j9208J4892b9239p1845A25360J20142l5908H124g0642n5475j6062
$$ 145235 126027 140919 -29239 -101084 125360 245502 209594 8124 -70642 -126117 -142179
11557a42179b7333A37873o1771c16226A33583a00876A43183a85560e4879B52693
$$ -142179 -27333 137873 76102 -316226 133583 -100876 143183 -185560 -54879 252693
11546B8941J7061O0195d5029k33918b437B08308j5620q8414Q8660J69861E1785
$$ 28941 46002 106197 -45029 -278947 -2437 208308 192688 104274 192934 362795 51785
11534b57488L4629C55091q1419J17965j21608I2379J62658b10300A49169K82366
$$ -257488 -222859 355091 273672 391637 270029 92379 255037 -210300 149169 431535
11524D31535A99389j2062p9465r047A7926K55699F2986g2651I0871R4146F2754
$$ 431535 199389 187327 107862 98815 17926 273625 62986 -72651 90871 185017 62754
11512c01791A64870J64648a19818B07540J23496A60616a00287c9337B16925I4235
$$ -301791 164870 329518 -119818 207540 331036 160616 -100287 -39337 216925 94235
11501A78906O688J84086b71768D07991E1513J30804d1287B02844B0141a82699
$$ 178906 185594 369680 -271768 407991 51513 182317 -41287 202844 20141 -182699
11490B99646G0383J68934C1357R6053e9297B69150R496O1J42121A2999d7791q2245
$$ 299646 70383 239317 31357 127410 -59297 269150 278646 278707 420828 12999 -47791 -130036
11478a30036G6231K26587A10052d396B5961b21802C19598k3746e8372A80388J47500
$$ -130036 76231 302818 110052 -4396 25961 -221802 319598 295852 -58372 180388 327888
11467C27888I5804R3136i1282A99546b7639A33862B0414c3259A22257a04569B11301
$$ 327888 95804 188940 -91282 199546 -27639 133862 20414 -33259 122257 -104569 211301
11455B42716p7068n9951K31131g0884F2208a84657B25692Q1824e9403c94B13919
$$ 242716 165648 105697 336828 -70884 62208 -184657 225692 307516 -59403 -394 213919
11443A0287a3690A67206a65438B14901A7847K64665j29237h1914k5834H8469a76798
$$ 10287 -13690 167206 -165438 214901 17847 282512 153275 -81914 -107748 88469 -176798
11431f735j03469k46622h7688C86210a56928k8751H3697C7387i8777H9876A1830
$$ -6735 -110204 -356826 -87688 386210 -156928 -185679 83697 37387 -98777 89876 11830
11419h1931c2534k40331C8398K2203b94131I1208b0004A5558i7252C32060A04586
$$ -81931 -32534 -272865 38398 60601 -294131 91208 -20004 15558 -97252 332060 104586
11407B59132c16401A01755a28014C61857a31567A99846B6305j881a62044f2051
$$ 259132 -316401 101755 -128014 361857 -131567 199846 26305 24424 -162044 -62051
11396b36550E2943e544k3646F3273a31661I6562J49213n8782E2913a10850j3114
$$ -236550 52943 -5544 -29190 63273 -131661 96562 245775 186993 52913 -110850 -123964
11385a23964F3681a13000j67683J16990A29584R4522f4123A20471f9062l3125
$$ -123964 63681 -113000 -280683 -163693 129584 224106 -64123 120471 -69062 -102187
11375a02187M7894j401B27840J97948C5484K35446a0051A94403J18826A11198
$$ -102187 -54293 -55694 227840 425788 35484 270930 -10051 194403 313229 111198
11364f0565E4318K7989A2734a62055c8179A15993D9062j0126a38826C66816b02425
$$ -60565 54318 82307 12734 -162055 -38179 115993 49062 38936 -138826 366816 -202425
11352A77844P093P769A6819J44502F1205j2721a10516d5027I7659a75320e7193
$$ 177844 184937 192706 16819 161321 61205 48484 -110516 -45027 97659 -175320 -57193
11340a88110G4486J30469b68332a32742B41802j11082k8986h6153A77997m2943
$$ -188110 74486 204955 -268332 -132742 241802 130720 101734 -86153 177997 135054
11330A35054c3542R90l00939J32903e1496I9923a41649C0304Q6119e8810G3354
$$ 135054 -33542 -32552 -333491 -200588 -51496 99923 -141649 30304 116423 -58810 73354
11318c14443A42580K650b5113l1036l0662k30822O3460B30250b4571C9270E230
$$ -314443 142580 145230 -25113 -56149 -86811 -317633 -254173 230250 -24571 39270 5230
11306E1634J68745b64287L9935a04777e167m5060J6427E4682a45340I6672L5008
$$ 51634 220379 -264287 -224352 -104777 -5167 -50227 -33800 54682 -145340 96672 131680
11295A31680d0618k11563C03218a86662a8298B94977D7313d12062A37652j8209
$$ 131680 -40618 -252181 303218 -186662 -18298 294977 47313 -412062 137652 119443
11285A19443b00786A4402a05184b3251j19757F5296K0624a04168B2707i7101j01114
$$ 119443 -200786 14402 -105184 -23251 -143008 65296 85920 -104168 22707 -97101 -198215
11274a98215C46906c342D1006a00214d6145k9851P886l55420a58810m540l7679
$$ -198215 346906 -3342 41006 -100214 -46145 -75996 -68110 -423530 -158810 -163350 -201029
11263b01029a4926n5990L1627H936f2355j1344K9151k58520G2614M4798c77954
$$ -201029 -14926 -70916 -39289 8936 -62355 -73699 -44548 -303068 72614 117412 -377954
11251A48053d15181a65982F3239a38380e4761K4670F229P5659a88681R2148E1874
$$ 148053 -415181 -165982 63239 -138380 -54761 -30091 6229 81888 -188681 -96533 51874
11239C3818J39934d8838A57525a85217L2995c8065m5898j10710O3859O2530j91026
$$ 33818 173752 -48838 157525 -185217 -152222 -38065 -83963 -194673 -130814 -68284 -259310
11228b59310A99779J02554r8465h2641F5406j1608P1843l6129m4545d0857p990
$$ -259310 199779 302333 203868 -82641 65406 53798 125641 89512 44967 -40857 -48847
11217d8847q1348N9698A0902a9801E0139b2637j63672j47609g9914A65498E4846
$$ -48847 -130195 -70497 10902 -19801 50139 -22637 -186309 -333918 -79914 165498 54846
11205i770j28900L4957j33993j31478B86472d92513b14503A96095K2000b32889
$$ -9770 -138670 -103713 -237706 -369184 286472 -492513 -214503 196095 218095 -232889
11194i964j51036B17793c07659H5572c4256B1952L42780a99963d6525m598r143
$$ -9964 -161000 217793 -307659 85572 -34256 21952 364732 -199963 -46525 -51123 -60266
11183f0266B07503g0842m7193C64783B5990a8457A87007B6232M3036c29517J16606
$$ -60266 207503 -70842 -118035 364783 25990 -18457 187007 26232 69268 -329517 -212911
11172b12911A06392b9373G9583R800h1468K8703E2183j4167a14857j40703A13229
$$ -212911 106392 -29373 79583 89383 -81468 -52765 52183 38016 -114857 -255560 113229
11160B3841d2169I8682J1136D9879i9711b6868k49972k2812A30750d9542I2266
$$ 23841 -42169 98682 109818 49879 -99711 -26868 -276840 -299652 130750 -49542 92266
11148b01542j4313p498I5737b6981b642j25379A3858L2481J11337b55392L7027
$$ -201542 -215855 -223353 95737 -26981 -2642 -128021 13858 46339 157676 -255392 -218365
11137b18365F2318O0878K31928H6800c8288L237I8930b3862A13658c10338J51765
$$ -218365 62318 123196 355124 86800 -38288 -35051 98930 -23862 113658 -310338 -158573
11126a58573C8998K78150j25608b12595G915J08511L0039F489R590a44853N1082
$$ -158573 38998 317148 191540 -212595 7915 116426 146465 6489 16079 -144853 -93771
11115i3771G9587h5637I3807C0645f281j1634B08819L3776j2972P1042J30372
$$ -93771 79587 -85637 93807 30645 -6281 -17915 208819 242595 229623 300665 431037
11104D31037b3113a0285l1852B2962e8773A58065K55043J65033B33032K11165
$$ 431037 -23113 -10285 -42137 22962 -58773 158065 413108 578141 233032 444197
11094D44197A61089o5169J6477J82204R1223A28030J91494j10119E1061a45697
$$ 444197 161089 95920 112397 294601 385824 128030 319524 209405 51061 -145697
11083c389B69874q5334J06884p3792O7060m9692O0103j21408M4986J23446l9567
$$ -3389 269874 184540 291424 217632 284692 235000 295103 173695 218681 342127 302560
11072C02560L01611k33712j28474J23561j13939L16610B35793J66903j62824J329
$$ 302560 604171 370459 241985 365546 251607 568217 235793 402696 239872 241201
11062B41201K05603j11115m1494J12212J87436O1567k93230M36570j30700l4486
$$ 241201 446804 335689 294195 406407 593843 655410 362180 798750 668050 633564
11052F33564q4961K88855p0367j04118j77162K07126J7595J82401k87650K68602
$$ 633564 548603 837458 767091 662973 485811 692937 710532 892933 605283 873885
11042H73885m27762J42807q061K17361P6497j63523K45386m42286J46421A91465
$$ 873885 446123 588930 580869 798230 874727 711204 956590 514304 660725 191465
11031F81002k31038K24798k09991J57450k45075K13457N8944P0111j94239o88
$$ 681002 449964 674762 464771 622221 377146 590603 649547 719658 525419 524731
11021E24731B54665K91765K79284P239l86558K91070k14071A32247O20306j72594
$$ 524731 254665 546430 825714 832953 446395 737465 523394 132247 752553 579959
11011E79959M413A47791K83168K64895k21706m2603l6995J33577J63595K24310
$$ 579959 584372 147791 430959 695854 474148 431545 394550 528127 691722 916032
11001I16032C69050K30419K2091J94891k20775j5183J16718j60925K50304j52126
$$ 916032 369050 599469 621560 816451 595676 580493 697211 536286 786590 634464
10991F34464L5947K46757j79528L94992n46516J04832K99684L47179k80228N7665
$$ 634464 670411 917168 737640 1132632 586116 690948 990632 1337811 1057583 1115248
10981A115248J01188L16552k21268j3391N29115M4643l8990M41745K99378q9599
$$ 1115248 1216436 1532988 1311720 1298329 1827444 1872087 1833097 2274842 2574220 2484621
10971B484621K06847L04213j70292j19933j73234k49165r00187N07081l47818
$$ 2484621 2691468 2995681 2825389 2705456 2532222 2283057 1382870 1889951 1542133
10962A542133J39807j35389j39525K21250l57170M19908j26542j1279J7369j07483
$$ 1542133 1681940 1546551 1407026 1628276 1271106 1691014 1564472 1553193 1570562 1463079
10952A463079Q6389o46049L11982E49016J64154l09377A92573K97295b538C17385
$$ 1463079 1549468 903419 1215401 549016 713170 403793 192573 489868 -2538 317385
10941B67695J43799A09326J35373F5257c24188B58142a04087A07209D835i6882
$$ 267695 411494 109326 244699 65257 -324188 258142 -104087 107209 4835 -96882
10930f0183r4529g446j4563H2070G48a36049A59453m2575b72986B8377J63181
$$ -60183 -154712 -7446 -22009 82070 748 -136049 159453 116878 -272986 28377 191558
10919A91558c12097C6707e6608j32978Q8189C32689b1681j73792B38282h8709
$$ 191558 -312097 36707 -56608 -189586 -101397 332689 -21681 -195473 238282 -88709
10908c4309D71922A34751M2122i4734A05254O0470h0158l4381j89958h0673D5186
$$ -34309 471922 134751 176873 -94734 105254 165724 -80158 -114539 -304497 -80673 45186
10896B9189L27495f8670o1403A12074l6483i6263l0598p2821j14407a19594j4512
$$ 29189 356684 -68670 -130073 112074 75591 -96263 -126861 -199682 -314089 -119594 -134106
10885a34106a025n4252H1867K30411A07736a63726C46379f0910f923B18486J5193
$$ -134106 -1025 -55277 81867 312278 107736 -163726 346379 -60910 -6923 218486 233679
10874B33679A01245I990a44097f9369A10872B1227Q2706c5341k03365d7161p1060
$$ 233679 101245 9990 -144097 -69369 110872 21227 103933 -35341 -238706 -47161 -118221
10863a18221A90611K15924j91228i5526B14891n8868c4272b363A36214j3481b266
$$ -118221 190611 406535 215307 -95526 214891 156023 -34272 -2363 136214 122733 -2266
10851C3209a67473A26363a45761B53710c01558k1692A71881c32533a32887B20774
$$ 33209 -167473 126363 -145761 253710 -301558 -323250 171881 -332533 -132887 220774
10840d563D3260b39717g9975N304A40741j7061h3403A48992Q2198J78508B7098
$$ -4563 43260 -239717 -79975 -74671 140741 123680 -83403 148992 231190 409698 27098
10828h3646K9051C4724a03381r1181D4852L1639b09175E8417a33901b2511G7049
$$ -83646 -54595 34724 -103381 -194562 44852 76491 -209175 58417 -133901 -22511 77049
10816c10680a36000A67738M308a27368n1078L7358A23658e1683k00468G7897R4383
$$ -310680 -136000 167738 172046 -127368 -178446 -141088 123658 -51683 -252151 77897 172280
10805A72280H2033a7473B26707b40017d9448o6426D1783h5923j50691B53827K13624
$$ 172280 82033 -17473 226707 -240017 -49448 -115874 41783 -85923 -236614 253827 467451
10794D67451A40954b59017m1315F0521J85285c9156p5358i050B37164G1628a10726
$$ 467451 140954 -259017 -300332 60521 245806 -39156 -114514 -9050 237164 71628 -110726
10782b58071M2415j33651A56481B4969b06337l3704D2788b31203b9936j07087
$$ -258071 -215656 -349307 156481 24969 -206337 -240041 42788 -231203 -29936 -137023
10772a37023j60327B6332e4960C4826J09952f8174A32683E7888R588O3553j8202
$$ -137023 -297350 26332 -54960 34826 144778 -68174 132683 57888 67476 131029 112827
10761A12827a96687H34a87965A90565I009a31677b0094j42847G9741a76323E3718
$$ 112827 -196687 834 -187965 190565 9009 -131677 -20094 -162941 79741 -176323 53718
10749b1741j65588d3153G4071R7810f9835n0114a983k2674j4251j23699j28536
$$ -21741 -187329 -43153 74071 171881 -69835 -119949 -1983 -24657 -38908 -162607 -291143
10738b91143A67000d24032a40898C9481n918j835O4288J85896a00818c9346k77606
$$ -291143 167000 -424032 -140898 39481 33563 31728 96016 281912 -100818 -39346 -316952
10727c16952k6342h0252B75369a19559p3961j55138H6046b96286J3259N8536L1975
$$ -316952 -343294 -80252 275369 -119559 -193520 -348658 86046 -296286 -283027 -224491 -192516
10716a92516e8723A03580b8955j37791P4925B0354L933J88661d58855a69322Q2556
$$ -192516 -58723 103580 -28955 -166746 -91821 20354 24287 212948 -458855 -169322 -86766
10705h6766j77679i0423C4011J21323J38430a2513H864K52505a70570F5632L1868
$$ -86766 -264445 -90423 34011 155334 293764 -12513 8864 261369 -170570 65632 97500
10694I7500e7465B41480j19214a2607m2363j97935c3196A9691a46317d4233j49057
$$ 97500 -57465 241480 122266 -12607 -54970 -252905 -33196 19691 -146317 -44233 -193290
10683a93290A11968m4573j521b04160B9453K1878J58745e6501p2744j73469a2579
$$ -193290 111968 67395 65874 -204160 29453 51331 210076 -56501 -129245 -302714 -12579
10671B40931c97979J94156k60672F1063b18592g572j49155j1303A69207b3549
$$ 240931 -397979 -203823 -464495 61063 -218592 -7572 -156727 -168030 169207 -23549
10660B9422c7643A22143i3798r9152M4831d1494D3601a60273B78699o9290f7489
$$ 29422 -37643 122143 -93798 -192950 -148119 -41494 43601 -160273 278699 209409 -67489
10648a52595M7994E1818c18518A3626c8173A23277g3640F9950a55927I6585l7123
$$ -152595 -104601 51818 -318518 13626 -38173 123277 -73640 69950 -155927 96585 59462
10637E9462K10741c4506m79172a7456j87290A71302c62489A24622m4068b35060
$$ 59462 270203 -34506 -513678 -17456 -204746 171302 -362489 124622 80554 -235060
10626b31844e1709m8255r4039R2164M2706j78540A84144f0423k04580J13152b0833
$$ -231844 -51709 -99964 -194003 -101839 -59133 -237673 184144 -60423 -265003 -151851 -20833
10614A520a09083B42899C1681e577D9370M2343a48731J4054r183C7800d6441a1867
$$ 1520 -109083 242899 31681 -5577 49370 91713 -148731 -134677 -143860 37800 -46441 -11867
10601A04235a31095B8340K01235b01278K3665A61070G6710b15116J07552H3042
$$ 104235 -131095 28340 229575 -201278 -177613 161070 76710 -215116 -107564 83042
10590a04010c4648o9042A89711a49927j25304C38409o5813C0133a56183B2367
$$ -104010 -34648 -103690 189711 -149927 -275231 338409 272596 30133 -156183 22367
10579b99713C1136M0437K7706a58816G5661h6463k58253J36667k69756b7175H8067
$$ -299713 31136 71573 99279 -158816 75661 -86463 -344716 -208049 -477805 -27175 88067
10567b0042E9538c33329J59880D7451a42168f2744r35k73095B45468C3482K26194
$$ -20042 59538 -333329 -173449 47451 -142168 -62744 -63679 -336774 245468 33482 259676
10556B59676a28726m1470d0485A00893b05397R0124j84270b7119r7547G7169j8744
$$ 259676 -128726 -170196 -40485 100893 -205397 -115273 -299543 -27119 -124666 77169 58425
10545E8425d7531j64906N9871J8525C08551a41093E3636L1150A9691i2460B09260
$$ 58425 -47531 -212437 -152566 -134041 308551 -141093 53636 84786 19691 -92460 209260
10533B86821a1164j19153p3362f6580a0846A19327i2559o9716A65398b36894J04739
$$ 286821 -11164 -130317 -203679 -66580 -10846 119327 -92559 -162275 165398 -236894 -132155
10522a32155I4525J2046r235a91991d638q3063D0234g003A1146c6261j48194o2358
$$ -132155 94525 106571 97336 -191991 -4638 -87701 40234 -7003 11146 -36261 -184455 -246813
10510b46813j96795i2076n4413d6764k87489D21470a47762A30312a7908j15104
$$ -246813 -443608 -92076 -146489 -46764 -334253 421470 -147762 130312 -17908 -133012
10500a33012j69108A13494f5937k68502N3484o7611J61570J7832J1859D3579a40569
$$ -133012 -302120 113494 -65937 -334439 -280955 -348566 -186996 -169164 -157305 43579 -140569
10488c10961A92600g59G1408a6864o1379B83079B3016J65107L49192o7536j78900
$$ -310961 192600 -759 71408 -16864 -78243 283079 23016 188123 537315 469779 290879
10477B90879c258C14112q2657j03060L1886l4137b05728E6369h2394k3918A00045
$$ 290879 -3258 314112 231455 128395 160281 126144 -205728 56369 -82394 -106312 100045
10465a6805B70667f116j59072I70P997i3371D37808F265K28596d9053F9807L5022
$$ -16805 270667 -6116 -165188 970 8967 -93371 437808 6265 234861 -49053 69807 104829
10453A04829L06500b0382F8345J3922b3895l91704c3882B4380J59754G7691a50389
$$ 104829 411329 -20382 68345 82267 -23895 -415599 -33882 24380 184134 77691 -150389
10441b71994A6128i0394a4389D2859c4273G4461R0861G1812J3146b94330d1185
$$ -271994 16128 -90394 -14389 42859 -34273 74461 165322 71812 84958 -294330 -41185
10429a82933R494h646B13572F0477b3616r9089A31992h7997G9483J17737b55516
$$ -182933 -173439 -8646 213572 60477 -23616 -122705 131992 -87997 79483 197220 -255516
10417A3878K13217D1325d3989q634F1370h4025I3402b68006g2703L0342q4813
$$ 13878 227095 41325 -43989 -52623 61370 -84025 93402 -268006 -72703 -42361 -127174
10406a27174c6723B25435a50177A39058c30645i6627h82A69467c10505A48733
$$ -127174 -36723 225435 -150177 139058 -330645 -96627 -882 169467 -310505 148733
10395A34791j5567c9732D54787b6476n743B27223a69991A12322K32630j05195
$$ 134791 119224 -39732 454787 -26476 -32219 227223 -169991 112322 344952 239757
10385B39757l2424a35887m0018B72927Q3638q2302a29135L0599A24204P1366L5331
$$ 239757 207333 -135887 -175905 272927 356565 274263 -129135 -98536 124204 195570 230901
10374B30901A15307O2121J55329A08590K02557L0265j12294J88937j78780J62790
$$ 230901 115307 177428 332757 108590 311147 341412 229118 418055 239275 402065
10364D02065P118p9999q9202r9401B5615J34041J40211c74487h6845B77730O9387
$$ 402065 409183 329184 239982 140581 25615 159656 299867 -374487 -86845 277730 347117
10353C47117A45969J11362K49483o9262A41550a1155B96561o9629J47548h6766
$$ 347117 145969 257331 506814 437552 141550 -11155 296561 226932 374480 -86766
10342D20023j74347J39461a94854A09664J90401j37168o7185d9274A78697Q7359
$$ 420023 245676 385137 -194854 109664 300065 162897 95712 -49274 178697 266056
10332B66056J93490I099J37669a22773a7044B65200o1743E5345H454K18592L5355
$$ 266056 459546 9099 146768 -122773 -17044 265200 203457 55345 8454 227046 262401
10321B62401A9106i6558b8031B00051l2501b43592I4900M3900R1585a12945l87384
$$ 262401 19106 -96558 -28031 200051 167550 -243592 94900 138800 230385 -112945 -500329
10310e00329K34356B44430A16906E6239M3247a81177O6148H9242a35921j20140
$$ -500329 -265973 244430 116906 56239 99486 -181177 -115029 89242 -135921 -256061
10300b56061J05285C62083a40368j46942a01663a7758k20254h8360a1801j28988
$$ -256061 -150776 362083 -140368 -287310 -101663 -17758 -238012 -88360 -11801 -140789
10290a40789J5518F1340O5759b63261g4453A33080b83664e7171j00754C0725b23542
$$ -140789 -125271 61340 127099 -263261 -74453 133080 -283664 -57171 -157925 30725 -223542
10278a67000H7726J2835g002j67418A0691L50515a31235a7148A9705a13381b2952
$$ -167000 87726 100561 -7002 -174420 10691 361206 -131235 -17148 19705 -113381 -22952
10266a26014K7193A91992J0622b31691D8257R2574L47621k04182K5195r5539n1452
$$ -126014 -98821 191992 202614 -231691 48257 140831 488452 284270 309465 213926 162474
10255A62474J91304r3018b3088B3616h8475E1124i38l4363l7599p4294A63607
$$ 162474 353778 260760 -23088 23616 -88475 51124 -938 -35301 -72900 -147194 163607
10243B49520j23589b9263j27768A08091b86138A12057b29606a11878m107D48535
$$ 249520 125931 -29263 -157031 108091 -286138 112057 -229606 -111878 -115985 448535
10232b65217b6418A5771a0658j30194e857k75919B9571J60009E9783B2329F974
$$ -265217 -26418 15771 -10658 -140852 -5857 -281776 29571 189580 59783 22329 6974
10220a41060A376c9515o4608j98617e4697B46670c02319g090l05326a4027C3279
$$ -141060 1376 -39515 -104123 -302740 -54697 246670 -302319 -7090 -312416 -14027 33279
10208A79390A6118K34889n0211A1796d0128j69583d2556m85780a18744j66658
$$ 179390 16118 251007 200796 11796 -40128 -209711 -42556 -528336 -118744 -285402
10198b85402A43904a743j1992D2082a83826M0753B2643b9280k85150C2914a21854
$$ -285402 143904 -1743 -13735 42082 -183826 -143073 22643 -29280 -314430 32914 -121854
10186a98984l80333E157K83586r4324a77023f450A21024g2686A54935n8731i208
$$ -198984 -579317 5157 288743 194419 -177023 -6450 121024 -72686 154935 96204 -9208
10174F6760d48900g341q0756K3988j59631I6022C9576b41532p0383h8176A20913
$$ 66760 -448900 -7341 -88097 -64109 -223740 96022 39576 -241532 -311915 -88176 120913
10162e19759b37072g254A69541J16575H3308a4554Q65l1539j06183H2119a15211
$$ -519759 -237072 -7254 169541 286116 83308 -14554 -13689 -45228 -151411 82119 -115211
10150a72685l6073g7559B08491H8171b101j52300K0988B5418b64673R8956j08275
$$ -172685 -208758 -77559 208491 88171 -2101 -154401 -133413 25418 -264673 -165717 -273992
10139b73992D6573i0665O340p0980A21894i629j48770M7991J4637B06132k8457
$$ -273992 46573 -90665 -84325 -155305 121894 -9629 -158399 -110408 -95771 206132 177675
10128A77675a88005m4784l5534D0153b11776j16671B0461a41759e2747A8250i3038
$$ 177675 -188005 -232789 -268323 40153 -211776 -328447 20461 -141759 -52747 18250 -93038
10116a97850b094D2149m58a08513j72306C2223J31736b52524l4708e1789o8138
$$ -197850 -2094 42149 41691 -108513 -280819 32223 163959 -252524 -287232 -51789 -119927
10105a19927j14383d1771A07324d02296i4485m4559l5641G6780M1789a23366A90489
$$ -119927 -234310 -41771 107324 -402296 -94485 -139044 -174685 76780 118569 -123366 190489
10093e54086a60598g5864c0737q3276M5981A93606g3622L902B3386a25933j65403
$$ -554086 -160598 -75864 -30737 -114013 -68032 193606 -73622 -69720 23386 -125933 -291336
10082b91336a16501A9517i1547j30341I5083F32b2132B2301b64673c2097l16506
$$ -291336 -116501 19517 -91547 -221888 95083 632 -22132 22301 -264673 -32097 -348603
10071c48603H9337e2843p866j7161B72701a38351B88372n8654l9003f2508j60667
$$ -348603 89337 -52843 -60709 -77870 272701 -138351 288372 229718 190715 -62508 -223175
10060b23175F9156j2271Q7576h8192A64162J32601a46794q2874b895H7144b684
$$ -223175 69156 56885 144461 -88192 164162 296763 -146794 -229668 -2895 87144 -2684
10048a20450A64884i1384A41772F1182R5410c15761C605c45945B43176R0737b18151
$$ -120450 164884 -91384 141772 61182 156592 -315761 3605 -345945 243176 333913 -218151
10036E6489b22602Q4508m3042m4391o3753G2599b05659O470K3601q6219h780j40109
$$ 56489 -222602 -138094 -181136 -225527 -289280 72599 -205659 -199189 -175588 -261807 -8780 -148889
10024a48889A55063a79498B80126a27597F195a0070A66798J0853b24076j15183
$$ -148889 155063 -179498 280126 -127597 6195 -10070 166798 177651 -224076 -339259
10014c39259H4780a60127d1183a724j01620p807G8796L19M5541b21318q4667e513
$$ -339259 84780 -160127 -41183 -1724 -103344 -111151 78796 79115 124656 -221318 -305985 -5513
10001a54085n8199q2744c9628A68636b12930r1358J44643g8839M949c0790j71705
$$ -154085 -212284 -295028 -39628 168636 -212930 -304288 -159645 -78839 -73890 -30790 -202495
9990b02495j9593I186b08088j12698B64912e2837k1620l0935K6515A40367b3297
$$ -202495 -222088 9186 -208088 -320786 264912 -52837 -74457 -105392 -78877 140367 -23297
9978a34214D8925b81006j8677a02455A74972b19633H0703b99743a12766C5886
$$ -134214 48925 -281006 -299683 -102455 174972 -219633 80703 -299743 -112766 35886
9967B37935b7765l36871B13023q270b08191M5542O8534a089D8927k872J45012
$$ 237935 -27765 -364636 213023 204753 -208191 -162649 -94115 -1089 48927 46055 191067
9956A91067d6148q5379A67143a14345L2027j61042f7722q6027E7361A2165K00166
$$ 191067 -46148 -131527 167143 -114345 -82318 -243360 -67722 -153749 57361 12165 212331
9945B12331b19617K1781Q2684j02575f2643A9454b66914a22903A93782e2678B34553
$$ 212331 -219617 -197836 -115152 -217727 -62643 19454 -266914 -122903 193782 -52678 234553
9933c04402C9801c24521A34490e6179D887J0102K11001j05724J539c03931d6870
$$ -304402 39801 -324521 134490 -56179 4887 14989 225990 120266 121805 -303931 -46870
9921f57k0591C00501j15112b27397K2198A48940b6581k80975h7414j56555a5367
$$ -657 -21248 300501 185389 -227397 -205199 148940 -26581 -307556 -87414 -243969 -15367
9909a66317l64555A5132e907k48837j16911a51636D4604c84462J76525A4220c3794
$$ -166317 -530872 15132 -5907 -254744 -371655 -151636 44604 -384462 -207937 14220 -33794
9897b09088P3949d3262l0564j93945a02398j94521R7097B48441b26576b676A3790
$$ -209088 -135139 -43262 -73826 -267771 -102398 -296919 -199822 248441 -226576 -2676 13790
9885a55218A22978N0384k8203a79209A32846b32131J05697A72838b9468p5295
$$ -155218 122978 173362 145159 -179209 132846 -232131 -126434 172838 -29468 -104763
9875a04763a9904B19327E9240J36374o344D1632O3670h7880n1429j12043R0225
$$ -104763 -19904 219327 59240 195614 189270 41632 105302 -87880 -139309 -251352 -161127
9864a61127j363c5738B00781C8695b24141c7519j52603a824j69643D3093c71152
$$ -161127 -162490 -35738 200781 38695 -224141 -37519 -190122 -1824 -171467 43093 -371152
9852I3194a55623A64835F5890A815e7916k8051j74485N6215h9998b9614n3496
$$ 93194 -155623 164835 65890 1815 -57916 -85967 -260452 -204237 -89998 -29614 -83110
9841h3110j38105c2137m2262n0308E7646c21536d3564j09242j40119d4051r428
$$ -83110 -221215 -32137 -74399 -124707 57646 -321536 -43564 -152806 -292925 -44051 -53479
9830e3479j22173j19972h4011d0322E8945B1502b76108k4139a4024F6460l124
$$ -53479 -175652 -295624 -84011 -40322 58945 21502 -276108 -300247 -14024 66460 63336
9819F3336a37145B58093a01299k420P997j70008b7050o3863D87347B0441f5138
$$ 63336 -137145 258093 -101299 -103719 -95722 -265730 -27050 -90913 487347 20441 -65138
9807d9350I250b98878E2252c8985j12767A16964l5452a35377C66303d6932i533
$$ -49350 9250 -298878 52252 -38985 -151752 116964 81512 -135377 366303 -46932 -9533
9795C6601c56296d7343A60K96673h5036K5360A3729b40587a09428L4741l27925
$$ 36601 -356296 -47343 160 296833 -85036 -59676 13729 -240587 -109428 -74687 -402612
9784d02612a00465k4134L5796b808A2476K58697O3021A53470B017d8319A3087
$$ -402612 -100465 -124599 -88803 -2808 12476 271173 334194 153470 2017 -48319 13087
9772a44277k02214L5996D86307a52539g2531l2702e169E9734b05938P8179A10141
$$ -144277 -346491 -310495 486307 -152539 -72531 -105233 -5169 59734 -205938 -127759 110141
9760D2860b20800J1437i1545H4278I897M5080g3825Q76B04219J5660e21185a6597
$$ 42860 -220800 -209363 -91545 84278 9897 54977 -73825 -72949 204219 219879 -521185 -16597
9747B6125J55133h0394a3124j50068P3560I7691a51244M3326I2999P0716C0834
$$ 26125 181258 -80394 -13124 -163192 -89632 97691 -151244 -107918 92999 163715 30834
9735g1534p4642P0179j97975J34616B00837e31344a11528d3499k5230j34766h8676
$$ -71534 -146176 -75997 -273972 -139356 200837 -531344 -111528 -43499 -68729 -203495 -88676
9723I9309J94758I5763a60515j6581E0193b29613a07880j01577A36682k4609a08047
$$ 99309 294067 95763 -160515 -177096 50193 -229613 -107880 -209457 136682 112073 -108047
9711A69289K48321B6480M8791j5183a75782e6401k24599a20073L093B15399c19931
$$ 169289 417610 26480 75271 60088 -175782 -56401 -281000 -120073 -116980 215399 -319931
9699a94357A02489B8425Q7235a62477M1381N5890Q026B10663a07284j46134M81
$$ -194357 102489 28425 115660 -162477 -121096 -65206 -57180 210663 -107284 -253418 -252937
9688b52937A0642P7601a14703K5508k27959C0218n406a55738J528d1416J8138
$$ -252937 10642 88243 -114703 -89195 -317154 30218 24812 -155738 -154210 -41416 -23278
9677b3278j64084d9723A13736j1193g2257B86793b03384P1237O2152F3012D64
$$ -23278 -187362 -49723 113736 102543 -72257 286793 -203384 -132147 -69995 63012 464
9665E2914a22122B00091b21138c6409G6164i4145B35193F3346A6535a40772A7157
$$ 52914 -122122 200091 -221138 -36409 76164 -94145 235193 63346 16535 -140772 17157
9653c95318A09162D2788C633b68668j03503a1196H9460c10207e2456q6029r9920
$$ -395318 109162 42788 3633 -268668 -372171 -11196 89460 -310207 -52456 -138485 -238405
9642b38405D7038b01281G1690d00640D8077e0190A56371d8162E6680h3699B38692
$$ -238405 47038 -201281 71690 -400640 48077 -50190 156371 -48162 56680 -83699 238692
9630b38406C4236b33254B22917a9427A27790c6372a6253j42663A44081K3674a30901
$$ -238406 34236 -233254 222917 -19427 127790 -36372 -16253 -158916 144081 167755 -130901
9618I8345B2668i4633p0640A49084a18236j51909R2208n5871k3661f2995B62965
$$ 98345 22668 -94633 -165273 149084 -118236 -270145 -177937 -233808 -257469 -62995 262965
9606F5962g7048j63802e3290j71573a6500m4090A16072a53123L5715o7891C827
$$ 65962 -77048 -240850 -53290 -224863 -16500 -60590 116072 -153123 -117408 -185299 3827
9594b57781m795P3357A56832D3244g9500A46652p0688K0076a38984b5788A18849
$$ -257781 -262576 -189219 156832 43244 -79500 146652 75964 96040 -138984 -25788 118849
9582c69231J66506j07544c3116A94923E0001i7788m39337A23976c8593j3959D3420
$$ -369231 -202725 -310269 -33116 194923 50001 -97788 -537125 123976 -38593 -52552 43420
9570a34931c519j38155F2356a61641E7785L67350k00395f4652j79314P1043K9751
$$ -134931 -3519 -141674 62356 -161641 57785 425135 224740 -64652 -243966 -172923 -143172
9559a43172j71l4882E627c11829a22599e0158a6889l6360o6670q5191g1080j0030
$$ -143172 -143343 -178225 5627 -311829 -122599 -50158 -16889 -53249 -119919 -205110 -71080 -81110
9547h1110C27250e1155G458a07207r0416K0438N2709k47679d8973J8753q1422
$$ -81110 327250 -51155 7458 -107207 -197623 -177185 -124476 -372155 -48973 -30220 -111642
9536a11642H3196h7254B8076J94615a7388m9191j85081A91129a19963g890j87350
$$ -111642 83196 -87254 28076 222691 -17388 -66579 -251660 191129 -119963 -7890 -195240
9525a95240h0922A39480b95646a46428A41838a50528B16707b87060A8028i3802
$$ -195240 -80922 139480 -295646 -146428 141838 -150528 216707 -287060 18028 -93802
9514b04446P5568B29075K7904j02810a78941I4380p093b8645A40227f1524l03855
$$ -204446 -128878 229075 256979 154169 -178941 94380 87287 -28645 140227 -61524 -365379
9503c65379g0855B3049d9241D6399J2210a6863G6820a95057l1502d5809A91470
$$ -365379 -70855 23049 -49241 46399 58609 -16863 76820 -195057 -226559 -45809 191470
9491B10107c7203O096l6572D5763Q566k5080b01283C2880K14156c11792i3103
$$ 210107 -37203 -31107 -67679 45763 54329 29249 -201283 32880 247036 -311792 -93103
9479C56110g9125e501I509b63658P7128A4220K48510b69322a09694j54990i2540
$$ 356110 -79125 -5501 9509 -263658 -186530 14220 262730 -269322 -109694 -264684 -92540
9467A79867a13905g652j74583B10476h1199A28144a28112I5510h730q7513K4322
$$ 179867 -113905 -7652 -182235 210476 -81199 128144 -128112 95510 -8730 -96243 -71921
9456g1921j8497j09058c9722j63365B24508b53366Q5594g7673M122D8170b3354
$$ -71921 -90418 -199476 -39722 -203087 224508 -253366 -167772 -77673 -73551 48170 -23354
9444a38288B13353a17140j54959D6658b2619k55536k5001F0777j6650b70907J8462
$$ -138288 213353 -117140 -272099 46658 -22619 -278155 -303156 60777 44127 -270907 -252445
9433b52445A92135F6788b62894J5310B57964a04709a0027F2459Q3289a15945j19886
$$ -252445 192135 66788 -262894 -247584 257964 -104709 -10027 62459 145748 -115945 -235831
9422b35831B4729a30104J1128r3068D67914A96561b53390D684J22209h0752l16370
$$ -235831 24729 -130104 -118976 -212044 467914 196561 -253390 4684 126893 -80752 -397122
9411c97122J61615J15776A34737o3897B3024a01225j75611J27500D9700Q4774
$$ -397122 -235507 -119731 134737 70840 23024 -101225 -276836 -149336 49700 134474
9401A34474a63290J2921A19718B1458Q5032b01074F379d4082j77471J03926o0019
$$ 134474 -163290 -150369 119718 21458 106490 -201074 6379 -44082 -221553 -117627 -177646
9390a77646b1080B0301c5380l04838F8508R8788A778a25622F7012b61525J20159
$$ -177646 -21080 20301 -35380 -340218 68508 167296 1778 -125622 67012 -261525 -141366
9379a41366m3698G169J79348p9540b1354l03666a15332l32551g0104k05001h8389
$$ -141366 -185064 7169 186517 106977 -21354 -325020 -115332 -447883 -70104 -275105 -88389
9367B74721d84883H9675g3437m1897H8052i706B9487n831F967c541D6760c6681
$$ 274721 -484883 89675 -73437 -115334 88052 -9706 29487 23656 6967 -3541 46760 -36681
9354C07684a79176E3685c42775B39603f4250p5454F7098J0383K16838A16484c13188
$$ 307684 -179176 53685 -342775 239603 -64250 -139704 67098 77481 294319 116484 -313188
9342h7154k79130J72829A11624a76797J5485B55576a25971A16422a64989q0428
$$ -87154 -366284 -193455 111624 -176797 -161312 255576 -125971 116422 -164989 -245417
9332b45417h8599I9597a76924A62480A6564J5951c5183n19345a84157b5755F9452
$$ -245417 -88599 99597 -176924 162480 16564 32515 -35183 -554528 -184157 -25755 69452
9320a74402j03410J9014a25247d6475A369O8974b63856A00785d9240j32506E179
$$ -174402 -277812 -258798 -125247 -46475 1369 70343 -263856 100785 -49240 -181746 5179
9308D5667K4650J816e1929j38678D0311b04475l947I2769f3238C7203P7565b238
$$ 45667 70317 72133 -51929 -190607 40311 -204475 -208422 92769 -63238 37203 114768 -2238
9295a2607C55718A28203c88758J68918Q8281n1004i101j77544D20832a70518n7793
$$ -12607 355718 128203 -388758 -219840 -131559 -182563 -9101 -186645 420832 -170518 -228311
9284b28311m9181J33564j16701F545P9317l0882a7883F6809a12767A76205c6811
$$ -228311 -277492 -143928 -260629 6545 85862 54980 -17883 66809 -112767 176205 -36811
9272H1952o70b30565P9177j16174H0640i073C46928a77180b3317l7637k81157
$$ 81952 81282 -230565 -151388 -267562 80640 -9073 346928 -177180 -23317 -60954 -342111
9261c42111B88636b38178C8953b27980b4262k43502C54162A32412j2999i5522
$$ -342111 288636 -238178 38953 -227980 -24262 -267764 354162 132412 119413 -95522
9250a30423j28115m8151m4818a59507A66352l1867g9704a2950A42194b98379A23606
$$ -130423 -258538 -306689 -351507 -159507 166352 134485 -79704 -12950 142194 -298379 123606
9238B5365a13013a4454j41118F4360c10993E0261a02223j31778f0517k3163B3938
$$ 25365 -113013 -14454 -155572 64360 -310993 50261 -102223 -234001 -60517 -83680 23938
9226a68636J9092G7143i1540a2314j99277A75558e8511B00786G669b63734a709
$$ -168636 -149544 77143 -91540 -12314 -211591 175558 -58511 200786 7669 -263734 -1709
9214A44806b4116k68620E4509q801b22135L4103a9054A53649a56663b456A27111
$$ 144806 -24116 -292736 54509 45708 -222135 -188032 -19054 153649 -156663 -2456 127111
9202b15502F1269d906G4428a78170L3868p7014B02157g4775j19440A02927K2743
$$ -215502 61269 -4906 74428 -178170 -144302 -221316 202157 -74775 -194215 102927 125670
9191A25670C3749d2005C3955R7377a06637M7129A27957b36437h4356j1982r081
$$ 125670 33749 -42005 33955 131332 -106637 -59508 127957 -236437 -84356 -96338 -105419
9180a05419k45716a26680B22998g5227l76271d9699k44095B16202a0572A83985
$$ -105419 -351135 -126680 222998 -75227 -451498 -49699 -293794 216202 -10572 183985
9169G4358B4293c62536A15276c17404l7384D2849b06842L1623Q6917q7091j08006
$$ 74358 24293 -362536 115276 -317404 -354788 42849 -206842 -175219 -88302 -175393 -283399
9158b83399h2713K2446j3325F8885B7735a13676A28158a75218H6439a97224D8561
$$ -283399 -82713 -60267 -73592 68885 27735 -113676 128158 -175218 86439 -197224 48561
9146B46260r1732G0584b43337i8263p3026A3094a98342b9855l41073P2996E4444
$$ 246260 154528 70584 -243337 -98263 -171289 13094 -198342 -29855 -370928 -297932 54444
9134G831e21556h4990H1484l8319d3146j6863j5901q5401A10268b12223A21036
$$ 7831 -521556 -84990 81484 43165 -43146 -60009 -75910 -161311 110268 -212223 121036
9122b1838l2560J6956A20239a38924l9121N1830j27473A39042O4691C7702d28098
$$ -21838 -54398 -37442 120239 -138924 -178045 -126215 -253688 139042 203733 37702 -428098
9110h8360n9698A23029b24632n1390a09730e1723j7052F0048L6677A3457K4620
$$ -88360 -148058 123029 -224632 -276022 -109730 -51723 -68775 60048 96725 13457 38077
9099C8077b48081j16933C221b02959A81061b44780B0594b41592a12012B9684a30404
$$ 38077 -248081 -365014 3221 -202959 181061 -244780 20594 -241592 -112012 29684 -130404
9087a20440F9683J60648b37458J586B3874a04025K1880l928c1106A4261n719J29651
$$ -120440 69683 230331 -237458 -235872 23874 -104025 -82145 -86073 -31106 14261 8542 138193
9075A38193l6098b38775a0926k1617k40532J12119O7804j56563B0274J44175a26302
$$ 138193 102095 -238775 -10926 -32543 -273075 -160956 -93152 -249715 20274 164449 -126302
9063a54204O0087n3700A22989c33896A94035f5471k45473a15728k3708j12357
$$ -154204 -94117 -147817 122989 -333896 194035 -65471 -310944 -115728 -139436 -251793
9053b51793e6540j18609a666k55729G7609L38200A2114f9792j67132A50677g6818
$$ -251793 -56540 -175149 -1666 -257395 77609 415809 12114 -69792 -236924 150677 -76818
9041c1641k34108B25743B5601J75375R072a02486I5261a11943q7829Q2606A6050
$$ -31641 -265749 225743 25601 200976 210048 -102486 95261 -111943 -199772 -117166 16050
9029c47927A58264C9728j1789a26657m7387A49808b63513O577A3581J8758i0642
$$ -347927 158264 39728 27939 -126657 -174044 149808 -263513 -256936 13581 32339 -90642
9017a36774d7169N765l44288a78083k25727A58350a15789A45521b00709A5409
$$ -136774 -47169 -41404 -385692 -178083 -403810 158350 -115789 145521 -200709 15409
9006c70417j71871K56155I364a6550m8401k3461M1748A98257h1066f272j47043
$$ -370417 -542288 -286133 9364 -16550 -64951 -88412 -46664 198257 -81066 -6272 -153315
8995a53315N2438a1976n5173B19904E0945a50943l5769P886B0395d28773b36k65667
$$ -153315 -100877 -11976 -67149 219904 50945 -150943 -186712 -178826 20395 -428773 -236 -265903
8983b65903b1704o0948k74686e2090n0848j14795I7219J53581e6722c803B26181
$$ -265903 -21704 -82652 -357338 -52090 -102938 -217733 97219 250800 -56722 -3803 226181
8971b80592H182a84123j4285k7658m6715R1224P9750A49256P5551a83708f5803
$$ -280592 8182 -184123 -198408 -226066 -272781 -181557 -101807 149256 224807 -183708 -65803
8959G5238b43740g7824l1673d6638j13851k16390F0400a82147K3029K3291A69910
$$ 75238 -243740 -77824 -109497 -46638 -160489 -376879 60400 -182147 -159118 -135827 169910
8947A07725f3464B5903b45462g5326l8160A87853I2018J23863b5732p0136n0734
$$ 107725 -63464 25903 -245462 -75326 -113486 187853 92018 215881 -25732 -95868 -146602
8936a46602A84809g120A22370c88555C8095j3750J73425a16640K9658j67469a00294
$$ -146602 184809 -7120 122370 -388555 38095 24345 197770 -116640 -86982 -254451 -100294
8924B23298b75665A65167K66703n2492b9114B2329b82813J29928m6345C120b19414
$$ 223298 -275665 165167 431870 379378 -29114 22329 -282813 -152885 -199230 3120 -219414
8912H2814a71163o9934h5908p8618A92554o971e8324B95999c9333m7661A44484
$$ 82814 -171163 -241097 -85908 -164526 192554 185583 -58324 295999 -39333 -86994 144484
8900C16015a81820e5912D22232a90609A14565b14229A75090G1895a15454N2556
$$ 316015 -181820 -55912 422232 -190609 114565 -214229 175090 71895 -115454 -62898
8890f2898j86429A86262o3133a77038j76823a48866o3692E9264Q5472h8185p02
$$ -62898 -249327 186262 123129 -177038 -353861 -148866 -212558 59264 144736 -88185 -88887
$$ [...]
##END NTUPLES=NMR SPECTRUM
##END=
