##TITLE=AC1736_SEN00009_9276107_yGntWwyj9m
##JCAMPDX= 6.0         $$ Bruker NMR JCAMP-DX V2.0
##DATA TYPE= NMR SPECTRUM
##DATA CLASS= NTUPLES
##ORIGIN= BRUKER
##OWNER= Administrator
$$ 1.72 TOPSPIN		Version 2.1
$$ 2015-07-15 02:53:40.666 -0700  Administrator@X
$$ Compression mode = diff/dup
##.OBSERVE FREQUENCY= 400.02188249412
##.OBSERVE NUCLEUS= ^1H
##.ACQUISITION MODE= SIMULTANEOUS (DQD)
##.ACQUISITION SCHEME= undefined
##.AVERAGES= 8
##.DIGITISER RES= 22
##SPECTROMETER/DATA SYSTEM= spect
##.PULSE SEQUENCE= zg30
##.SOLVENT NAME= COFFEE_meoh
##.SHIFT REFERENCE= INTERNAL, COFFEE_meoh, 1, 14.98509
##AUDIT TRAIL= $$ (NUMBER, WHEN, WHO, WHERE, PROCESS, VERSION, WHAT)
$$ ##TITLE= Audit trail, TOPSPIN		Version 2.1
$$ ##JCAMPDX= 5.01
$$ ##ORIGIN= Bruker BioSpin GmbH
$$ ##OWNER= Administrator
$$ $$ E:\/data/COFFEE/nmr/AC1736_SEN00009_9276107_yGntWwyj9m/10/pdata/1/auditp.txt
$$ ##AUDIT TRAIL=  $$ (NUMBER, WHEN, WHO, WHERE, PROCESS, VERSION, WHAT)
(   1,<2015-07-15 02:53:33.354 -0700>,<Administrator>,<X>,<go>,<TOPSPIN 2.1>,
      <created by zg
	started at 2015-07-15 02:52:27.650 -0700,
	POWCHK enabled, PULCHK disabled,
       configuration hash MD5:
       21 0F 79 D6 B3 7B B4 F6 88 20 88 DB 03 48 BD 9F
       data hash MD5: 64K
       CB 6F E7 18 BD F4 20 0D E6 9F 48 F9 06 96 DC 70>)
(   2,<2015-07-15 02:53:36.729 -0700>,<Administrator>,<X>,<proc1d>,<TOPSPIN 2.1>,
      <Start of raw data processing
       efp LB = 0 FT_mod = 6 PKNL = 1 PHC0 = 0 PHC1 = 0 SI = 32K 
       data hash MD5: 32K
       1C 2B 6D 0E DF 28 EB C3 0C 15 2E F3 BD F7 E1 66>)
(   3,<2015-07-15 02:53:37.025 -0700>,<Administrator>,<X>,<proc1d>,<TOPSPIN 2.1>,
      <pk PHC0 = 88.91785 PHC1 = 0 
       data hash MD5: 32K
       3C 48 64 6E 9A 6D E3 F2 B4 83 5D C4 94 60 7D 9A>)
(   4,<2015-07-15 02:53:37.135 -0700>,<Administrator>,<X>,<proc1d>,<TOPSPIN 2.1>,
      <abs ABSG = 1 
       data hash MD5: 32K
       A7 A6 E5 75 61 62 31 45 C7 30 41 43 99 75 93 44>)
(   5,<2015-07-15 02:53:37.197 -0700>,<Administrator>,<X>,<proc1d>,<TOPSPIN 2.1>,
      <abs ABSG = 2 
       data hash MD5: 32K
       01 B9 03 CA BD 7A 4D 81 2C C2 D5 BF 05 9B 8F 20>)
(   6,<2015-07-15 02:53:37.260 -0700>,<Administrator>,<X>,<proc1d>,<TOPSPIN 2.1>,
      <abs ABSG = 3 
       data hash MD5: 32K
       DC 13 3D B3 FF 9A 41 B1 2A 6C BC 04 83 93 46 57>)
(   7,<2015-07-15 02:53:37.322 -0700>,<Administrator>,<X>,<proc1d>,<TOPSPIN 2.1>,
      <abs ABSG = 4 
       data hash MD5: 32K
       B5 90 51 56 FE 2F 33 D2 66 B6 E2 DF B5 A2 95 54>)
(   8,<2015-07-15 02:53:37.385 -0700>,<Administrator>,<X>,<proc1d>,<TOPSPIN 2.1>,
      <abs ABSG = 5 
       data hash MD5: 32K
       CB 63 5F F1 2F F7 38 B4 EB 5C C7 41 31 68 52 8E>)
$$ ##END=
$$ 
$$ $$ hash MD5
$$ $$ BB 60 DA A0 2F 80 C6 41 FE E6 1A 60 F1 13 31 29
##$RELAX= 
##$RELAX= 
##$RELAX= 
##$RELAX= 
##$RELAX= 
##$RELAX= 
##$RELAX= 
$$ Bruker specific parameters
$$ --------------------------
##$DU= <E:\>
##$EXPNO= 10
##$NAME= <AC1736_SEN00009_9276107_yGntWwyj9m>
$$ [...]
150 150 150 150 150 150 150 150
##$TP07= 0
##$TPNAME0= <>
##$TPNAME1= <>
##$TPNAME2= <>
##$TPNAME3= <>
##$TPNAME4= <>
##$TPNAME5= <>
##$TPNAME6= <>
##$TPNAME7= <>
##$TPOAL= (0..7)
0.5 0.5 0.5 0.5 0.5 0.5 0.5 0.5
##$TPOFFS= (0..7)
0 0 0 0 0 0 0 0
##$TUNHIN= 0
##$TUNHOUT= 0
##$TUNXOUT= 0
##$USERA1= <user>
##$USERA2= <user>
##$USERA3= <user>
##$USERA4= <user>
##$USERA5= <user>
##$V9= 5
##$VALIST= <valist>
##$VCLIST= <CCCCCCCCCCCCCCC>
##$VD= 0
##$VDLIST= <DDDDDDDDDDDDDDD>
##$VPLIST= <PPPPPPPPPPPPPPP>
##$VTLIST= <TTTTTTTTTTTTTTT>
##$WBST= 2048
##$WBSW= 25
##$XGAIN= (0..3)
0 0 0 0
##$XL= 0
##$YL= 0
##$YMAX_a= 596859
##$YMIN_a= -518222
##$ZGOPTNS= <>
##$ZL1= 120
##$ZL2= 120
##$ZL3= 120
##$ZL4= 120
##$ABSF1= 14.98509
##$ABSF2= -5.573092
##$ABSG= 5
##$ABSL= 3
##$ALPHA= 0
##$AQORDER= 0
##$ASSFAC= 0
##$ASSFACI= 0
##$ASSFACX= 0
##$ASSWID= 0
##$AUNMP= <proc_prof1d_extract_pilot.lims>
##$AXLEFT= 0
##$AXNAME= <>
##$AXNUC= <1H>
##$AXRIGHT= 0
##$AXTYPE= 0
##$AXUNIT= <>
##$AZFE= 0.1
##$AZFW= 0.1
##$BCFW= 0
##$BC_mod= 0
##$BYTORDP= 0
##$COROFFS= 0
##$CY= 15
##$DATMOD= 1
##$DC= 0
##$DFILT= <>
##$DTYPP= 0
##$F1P= 0
##$F2P= 0
##$FCOR= 0.5
##$FTSIZE= 32768
##$FT_mod= 6
##$GAMMA= 0
##$GB= 0
##$INTBC= 1
##$INTSCL= 1
##$ISEN= 128
##$LB= 0
##$LEV0= 0
##$LPBIN= 0
##$MAXI= 10000
##$MC2= 0
##$MEAN= 0
##$ME_mod= 0
##$MI= 0
##$NCOEF= 0
##$NC_proc= -8
##$NLEV= 6
##$NOISF1= 0
##$NOISF2= 0
##$NSP= 0
##$NTH_PI= 0
##$NZP= 0
##$OFFSET= 14.98509
##$PC= 1
##$PHC0= 88.91785
##$PHC1= 0
##$PH_mod= 1
##$PKNL= yes
##$PPARMOD= 0
##$PPDIAG= 0
##$PPIPTYP= 0
##$PPMPNUM= 2147483647
##$PPRESOL= 1
##$PSCAL= 4
##$PSIGN= 0
##$PYNMP= <proc.py>
##$REVERSE= no
##$SF= 400.02
##$SI= 32768
##$SIGF1= 0
##$SIGF2= 0
##$SINO= 400
##$SIOLD= 32768
##$SPECTYP= <>
##$SREGLST= <1H.CDCl3>
##$SSB= 0
##$STSI= 32768
##$STSR= 0
##$SW_p= 8223.68421052631
##$SYMM= 0
##$S_DEV= 0
##$TDeff= 65536
##$TDoff= 0
##$TI= <>
##$TILT= no
##$TM1= 0
##$TM2= 0
##$TOPLEV= 0
##$USERP1= <user>
##$USERP2= <user>
##$USERP3= <user>
##$USERP4= <user>
##$USERP5= <user>
##$WDW= 1
##$XDIM= 32768
##$YMAX_p= 444699030
##$YMIN_p= -655976
##$CURPLOT= <Network HP LaserJet P1505>
##$CURPRIN= <$Network HP LaserJet P1505>
##$DFORMAT= <normdp>
##$LAYOUT= <+/1D_H.xwp>
##$LFORMAT= <normlp>
##$PFORMAT= <normpl>
##$SURQMSG= 1
$$ End of Bruker specific parameters
$$ ---------------------------------
##NTUPLES= NMR SPECTRUM
##VAR_NAME=  FREQUENCY,     SPECTRUM/REAL,   SPECTRUM/IMAG
##SYMBOL=    X,             R,               I
##VAR_TYPE=  INDEPENDENT,   DEPENDENT,       DEPENDENT
##VAR_FORM=  AFFN,          ASDF,            ASDF
##VAR_DIM=   32768,         32768,           32768
##UNITS=     HZ,            ARBITRARY UNITS, ARBITRARY UNITS
##FACTOR=    0.250966925370066, 1,           1
##FIRST=     8223.43324360094, 68125,        -122416
##LAST=      0,             -244641,         -217366
##MIN=       0,             -655976,         0
##MAX=       8223.43324360094, 444699030,    0
$$ Real data points
##PAGE= N=1
##DATA TABLE= (X++(R..R)), XYDATA
$$ [...]
19578c25237I4124a09043j49596l28353A0809m717J3834n354c80058a14315o4575
$$ -325237 94124 -109043 -258639 -586992 10809 6092 19926 14572 -380058 -114315 -178890
19567a78890F5495M7866J4952g3251K260j25994n0538A9940a65170L5747m27365
$$ -178890 65495 113361 128313 -73251 -70991 -196985 -247523 19940 -165170 -129423 -556788
19556e56788G4720d95752R2264A65633M2771j00763f9260j5542B96584I2384R8894
$$ -556788 74720 -495752 -403488 165633 208404 107641 -69260 -84802 296584 92384 191278
19545A91278d48906D1190c1402E0898c64998A04333b07046C05752a34990k93423
$$ 191278 -448906 41190 -31402 50898 -364998 104333 -207046 305752 -134990 -428413
19535d28413a79479Q3006A9958c56304G9115a79696C25394b0005A45433J14990
$$ -428413 -179479 -96473 19958 -356304 79115 -179696 325394 -20005 145433 260423
19525B60423d0388p0085A11811f6975I4711a00200N239J5549J5415E3910K27418
$$ 260423 -40388 -110473 111811 -66975 94711 -100200 -94961 -79412 -63997 53910 281328
19514B81328i3817P761p9811A80652h9417I0795a84039a7314j6935j63142R2546
$$ 281328 -93817 -86056 -165867 180652 -89417 90795 -184039 -17314 -34249 -197391 -104845
19503a04845i571j93498A27627L7129B5227a32602a0488l49793e6759q8539G6618
$$ -104845 -9571 -203069 127627 164756 25227 -132602 -10488 -360281 -56759 -145298 76618
19491c27119a54128D4044b72193f4513F9884a59096B2191J72949e3514B84895
$$ -327119 -154128 44044 -272193 -64513 69884 -159096 22191 195140 -53514 284895
19480A78824D7306h9413k80878g7174o5574a1833j25807A83449i543A56209p5207
$$ 178824 47306 -89413 -370291 -77174 -142748 -11833 -137640 183449 -9543 156209 81002
19469H1002i0420c116j20070j024k11246a57638B68353p7165A3282d08080O8822
$$ 81002 -90420 -3116 -123186 -124210 -335456 -157638 268353 191188 13282 -408080 -339258
19458c39258a9793E7615a82582g3739K5928A83852b5791n7485A7038J11994f1359
$$ -339258 -19793 57615 -182582 -73739 -47811 183852 -25791 -83276 17038 129032 -61359
19446b25073m3212J05981C45315M5866i3957E2218b1752j0115j65925D7103J36484
$$ -225073 -268285 -162304 345315 391181 -93957 52218 -21752 -31867 -197792 47103 183587
19435A83587a62712B4472P4993A4187J72205a35156C2292f4610o1034k29663C9046
$$ 183587 -162712 24472 99465 14187 186392 -135156 32292 -64610 -125644 -355307 39046
19423e5115D9394C358b4322n0897J8590k63703i2230D0791J17903b66983R5456
$$ -55115 49394 3358 -24322 -75219 -56629 -320332 -92230 40791 158694 -266983 -171527
19412a71527B4983e2954o6004N5650j55039k323K3769O7601D9685a28805c7286
$$ -171527 24983 -52954 -118958 -63308 -218347 -220670 -196901 -129300 49685 -128805 -37286
19400a51662j41615G4575L85269b88620h1692k2068A82859a57043K381H7190A6053
$$ -151662 -293277 74575 459844 -288620 -81692 -103760 182859 -157043 -154662 87190 16053
19388c01538j2879e1285A1611c16j27979B404a51597c8603j41285l7479A59709
$$ -301538 -314417 -51285 11611 -316 -128295 2404 -151597 -38603 -179888 -217367 159709
19376a25933N6390j43645B6648c07727o4386a67307G8668K25685b27115L3879
$$ -125933 -69543 -213188 26648 -307727 -372113 -167307 78668 304353 -227115 -193236
19366a93236a6080k28478i198k64591b8965j38980B23532A0403Q48a33157a7075
$$ -193236 -16080 -244558 -9198 -273789 -28965 -167945 223532 10403 11251 -133157 -17075
19354e76435e3080A8246a10822d3593p0044a5950B29309E1496j3699j6411a67181
$$ -576435 -53080 18246 -110822 -43593 -113637 -15950 229309 51496 37797 21386 -167181
19342a49022r8240c1579H2855A2376J7587b15718b2958H8259a45430m4099F5288
$$ -149022 -247262 -31579 82855 12376 29963 -215718 -22958 88259 -145430 -189529 65288
19330e2482q1256B2872a35897K391F8199b03993C33712a71158A48940F154b98879
$$ -52482 -133738 22872 -135897 -133506 68199 -203993 333712 -171158 148940 6154 -298879
19318f2789J7299A42151n3443d7417k09009I7129a00110L2933G5798a11692a4375
$$ -62789 -45490 142151 88708 -47417 -256426 97129 -100110 -67177 75798 -111692 -14375
19306h0768r7048j4893k70535a67193e8370p9630B70499e9668F0027g0858D2111
$$ -80768 -177816 -192709 -463244 -167193 -58370 -138000 270499 -59668 60027 -70858 42111
19294a83779B02550a41094A34170c9873p3742N1107l8707C03185E4298Q065A8592
$$ -183779 202550 -141094 134170 -39873 -113615 -62508 -101215 303185 54298 62363 18592
19282c6131j07215E9990b0173j75300p454I2005d3283E5581c06069j0509d4596
$$ -36131 -143346 59990 -20173 -195473 -202927 92005 -43283 55581 -306069 -316578 -44596
19270f3514G9061b00799k75739a81875B46957a05777J734k1984e0493l41791a05679
$$ -63514 79061 -200799 -476538 -181875 246957 -105777 -104043 -126027 -50493 -392284 -105679
19258E8751N6644g6089i563k98797J05130r5640a5037j7134h608j35593q5753
$$ 58751 115395 -76089 -9563 -308360 -203230 -298870 -15037 -32171 -8608 -144201 -229954
19247b29954k0348P6889h1519H2046B3629Q0287O7054f9149A78467J67982d7617
$$ -229954 -250302 -173413 -81519 82046 23629 103916 170970 -69149 178467 346449 -47617
19235a63085g5009F0134b7788j67023g2578j67952Q0168b4122m07701J27369a28218
$$ -163085 -75009 60134 -27788 -194811 -72578 -240530 -160362 -24122 -431823 -304454 -128218
19223D20864a16343j06157A30945a64987A36430E2701g7690k14024J00750b5553
$$ 420864 -116343 -222500 130945 -164987 136430 52701 -77690 -291714 -190964 -25553
19212i9977m4942E7565P5166a83984l3005J619A74180d1844D9774B0821J13305
$$ -99977 -144919 57565 132731 -183984 -216989 -215370 174180 -41844 49774 20821 134126
19201A34126m7662b0680A04698l7215O5c40230a59993H840c09255A16472m4731
$$ 134126 86464 -20680 104698 67483 67548 -340230 -159993 8840 -309255 116472 71741
19190G1741i3606g377j20037M7554j84927B05204f0181k36828g0829c3934l08281
$$ 71741 -93606 -7377 -127414 -79860 -264787 205204 -60181 -297009 -70829 -33934 -342215
19179c42215h6250j73874j80424a54891F4126J40812b12303D002a25456A23874
$$ -342215 -86250 -260124 -440548 -154891 64126 204938 -212303 4002 -125456 123874
19168a70935d9984k2028I5128i5098M1499j83283A55385B3166b52152A0455a80751
$$ -170935 -49984 -72012 95128 -95098 -53599 -236882 155385 23166 -252152 10455 -180751
19156e8317A54559b99641B80588e3899m26968d8246H5773a6776A14085D5831f0127
$$ -58317 154559 -299641 280588 -53899 -480867 -48246 85773 -16776 114085 45831 -60127
19144d36268a1385A38476O4119A2470a74156h6101j49361B74930A2752c52456
$$ -436268 -11385 138476 202595 12470 -174156 -86101 -235462 274930 12752 -352456
19133I1447k1M6432E6194b9522j41778A78423b72295A43841b01586k06258I0387
$$ 91447 91426 137858 56194 -29522 -171300 178423 -272295 143841 -201586 -407844 90387
19121a31456k1336P4548B5285j0023Q8766g4885o4853A90507H532J62156a2953
$$ -131456 -152792 -78244 25285 15262 104028 -74885 -139738 190507 8532 170688 -12953
19109G2617M5838b50915C38082a28168H7315g2900J9478B95328g8783E2929j5347
$$ 72617 118455 -250915 338082 -128168 87315 -72900 -53422 295328 -78783 52929 37582
19098C7582D702J239b3806D5444K11142a14463A59414J7007b09170A76025h7075
$$ 37582 4702 5941 -23806 45444 256586 -114463 159414 176421 -209170 176025 -87075
19086B00290e6683A84674a09204I0683a70872d8868p3431k84240a82779k40110
$$ 200290 -56683 184674 -109204 90683 -170872 -48868 -122299 -406539 -182779 -422889
19076d22889K04459A59935B6952K3294j6276f1365l6145a1501o3905A2936d08824
$$ -422889 -218430 159935 26952 50246 33970 -61365 -97510 -11501 -75406 12936 -408824
19064E8131a05833o5190g9982L7779A46268b55922i4302k68427a46711E9657d18910
$$ 58131 -105833 -171023 -79982 -42203 146268 -255922 -94302 -362729 -146711 59657 -418910
19052C7015b6450E1933Q9725a72377a4774l33653m4014A79861c35235A0931d4513
$$ 37015 -26450 51933 141658 -172377 -14774 -348427 -392441 179861 -335235 10931 -44513
19040a69841l0000M8497K9654d4928C4996a35682B68446a16383c4673B29145d666
$$ -169841 -199841 -151344 -121690 -44928 34996 -135682 268446 -116383 -34673 229145 -4666
19028D8772a0182A39024J72055l6746R6677i7288a7172A67878J45835a66517O981
$$ 48772 -10182 139024 311079 274333 371010 -97288 -17172 167878 313713 -166517 -159536
19017a59536A19403M9842E4011l76c19027a51677j6268G2843A6774g6293r9607
$$ -159536 119403 169245 54011 53635 -319027 -151677 -167945 72843 16774 -76293 -175900
19006a75900P4559k2722q6888J02941A14079c1794k61717H3657a39880f3519j31726
$$ -175900 -101341 -124063 -210951 -108010 114079 -31794 -293511 83657 -139880 -63519 -195245
18995a95245e0947O746J0006p067j49065D9856J13529a28863L6500B60849A05018
$$ -195245 -50947 -44201 -34195 -41262 -190327 49856 163385 -128863 -92363 260849 105018
18983d1148h266B50801I1120b08189l1733j84239A56204D0898J94189H1315a98403
$$ -41148 -8266 250801 91120 -208189 -239922 -424161 156204 40898 235087 81315 -198403
18971b03152f5801j86254C601N9461J46499c665I9240R2227J47456a93017N915
$$ -203152 -65801 -252055 3601 63062 209561 -3665 99240 191467 338923 -193017 -187102
18960a87102C1968a25009I9378j2920d59560A61247c77499a9230j07838d0137
$$ -187102 31968 -125009 99378 86458 -459560 161247 -377499 -19230 -127068 -40137
18949i270j81702A913b65440J15483C9635b2630E3978c40206C8062a81436Q7093
$$ -9270 -190972 1913 -265440 -149957 39635 -22630 53978 -340206 38062 -181436 -94343
18938i4343j10801q4770J27969M4270A04014b40450C72343a59248f4791E8216
$$ -94343 -205144 -289914 -161945 -117675 104014 -240450 372343 -159248 -64791 58216
18927A54386a24136A92182a61260l8483D7623f7921E1751c54316q3281F1712b55130
$$ 154386 -124136 192182 -161260 -199743 47623 -67921 51751 -354316 -437597 61712 -255130
18915h9371j63635A52806M9218k7251m6898i3387J7201j94541P2648k22164A0039
$$ -89371 -253006 152806 202024 174773 127875 -93387 -76186 -270727 -198079 -420243 10039
18903d54095B21253b6518G3850a77184Q1332A50816O2435A3667L41591a4664A7329
$$ -454095 221253 -26518 73850 -177184 -95852 150816 213251 13667 355258 -14664 17329
18891F5951a50349L4841k3516o3001P1959F9246J12532e1636B6106d7689r2566
$$ 65951 -150349 -115508 -139024 -202025 -130066 69246 181778 -51636 26106 -47689 -140255
18880a40255B04696n4110b09586A79937e3799j25635B40426B7350a73626E2375
$$ -140255 204696 150586 -209586 179937 -53799 -179434 240426 27350 -173626 52375
18869A4181J5966K2250a15451B64424o0498l6489B1252a33154E1925b28637O2206
$$ 14181 30147 52397 -115451 264424 203926 167437 21252 -133154 51925 -228637 -166431
18858a66431p1037A04578L4852h4927k2960J2121I7194Q8166j8191e772m30704
$$ -166431 -237468 104578 139430 -84927 -107887 -95766 97194 185360 167169 -5772 -436476
18847d36476B04139b1620k00602N6719C4407i7493E6757b73636B71443b49580
$$ -436476 204139 -21620 -222222 -165503 34407 -97493 56757 -273636 271443 -249580
18836e1776A34339M9336p0905P24L475i8386n7898G6665a62378O5214A31565b88874
$$ -51776 134339 183675 112770 113494 116969 -98386 -156284 76665 -162378 -97164 131565 -288874
18823c848k02874B1319L1953P9453b90472c2240A46596C1725J71875e2284A4976
$$ -3848 -206722 21319 53272 132725 -290472 -32240 146596 31725 203600 -52284 14976
18811A0450e1072F3728K53275a83544I0602B6965g7670B22554a1153j16327l2206
$$ 10450 -51072 63728 317003 -183544 90602 26965 -77670 222554 -11153 -127480 -159686
18800a59686A95978a26448D2162b59025O5820j1511I7556f0622k2943q8432B563
$$ -159686 195978 -126448 42162 -259025 -193205 -204716 97556 -60622 -83565 -171997 2563
18788B55416a27662I8548a62571j09957K0616b0231B05208E4737a78226j83052
$$ 255416 -127662 98548 -162571 -272528 -251912 -20231 205208 54737 -178226 -361278
18778c61278g9294m2534C64a1710F587b61448g2070k65554H0286a69471d0690
$$ -361278 -79294 -121828 364 -11710 6587 -261448 -72070 -337624 80286 -169471 -40690
18766a92214H5988g3932j71497a8661c825F0933c94276D6499b77930B72678j31030
$$ -192214 85988 -73932 -245429 -18661 -3825 60933 -394276 46499 -277930 272678 141648
18755A41648e8974B5864a53407H4424d0234k52800A51622E6270a61733A45608
$$ 141648 -58974 25864 -153407 84424 -40234 -293034 151622 56270 -161733 145608
18744I8527a40542k52659J23846H5916O677J67774c53082a37862L5687r3571D2051
$$ 98527 -140542 -393201 -269355 85916 92593 260367 -353082 -137862 -102175 -195746 42051
18732H1299b04645L2473j7935j3072F4223b31923B25686G8861i8777k93201f1562
$$ 81299 -204645 -172172 -190107 -203179 64223 -231923 225686 78861 -98777 -391978 -61562
18720C8788J60374a14483c808k20089B00349e5813j70997B4443b29197A18073
$$ 38788 199162 -114483 -3808 -223897 200349 -55813 -226810 24443 -229197 118073
18709c25996j5960i0027B91909b31948j43115M6487a34974F0892a39004j91246
$$ -325996 -341956 -90027 291909 -231948 -375063 -328576 -134974 60892 -139004 -330250
18699c30250L5260f2417k83208M9007G7954C8505b76529A08145k8092K7151J09730
$$ -330250 -294990 -62417 -345625 -296618 77954 38505 -276529 108145 80053 107204 216934
18688B16934H1115J62190g7988l06158N5181d0703F6077j164c4945k11227A80075
$$ 216934 81115 243305 -77988 -384146 -328965 -40703 66077 64913 -34945 -246172 180075
18676a4930A14599b93430a39341J1571M7242F4916K8491k1400b09499L1321f0512
$$ -14930 114599 -293430 -139341 -127770 -80528 64916 93407 72007 -209499 -178178 -60512
18664A46133m8849b35194d4275A24914g624o3553D7373c02768A61014J53233b1151
$$ 146133 97284 -235194 -44275 124914 -7624 -71177 47373 -302768 161014 314247 -21151
18652f6708r2775C2361J01723A6329c157l55269N8677A29810h4400K0654H430
$$ -66708 -159483 32361 134084 16329 -3157 -358426 -299749 129810 -84400 -63746 8430
18640A78161n1805b10287Q1655q5427r5672d2827J862o2492n7159P107O0492c0971
$$ 178161 126356 -210287 -128632 -214059 -309731 -42827 -40965 -103457 -160616 -153509 -93017 -30971
18627d5187q6127c7886F39K0328b93982q7034A30045a96960B35570c0027l8849
$$ -45187 -131314 -37886 639 20967 -293982 -381016 130045 -196960 235570 -30027 -68876
18616f8876I7623a91423g4858j45967d1468q1084A66974Q1203a10664K0081b8461
$$ -68876 97623 -191423 -74858 -220825 -41468 -122552 166974 248177 -110664 -90583 -28461
18604b64220J22928L4695j46315f1511m7122o9379A83720a98842B52408A21559
$$ -264220 -141292 -106597 -252912 -61511 -108633 -178012 183720 -198842 252408 121559
18593A68259N4229a15040G8540a96465j24293l2950A04170Q052b32462M8706H6926
$$ 168259 222488 -115040 78540 -196465 -320758 -353708 104170 112222 -232462 -183756 86926
18581a76866J4812M8838C44374j47234a20629k10888a55888D3114b07057B01034
$$ -176866 -162054 -113216 344374 197140 -120629 -331517 -155888 43114 -207057 201034
18570g3676L6158J6552G9820C7934c0813l24849C66735A57947a19972c2152C2897
$$ -73676 -37518 -20966 79820 37934 -30813 -355662 366735 157947 -119972 -32152 32897
18558A28370a44266q4068p6144a29600I5984H220O2688b20439o774j69786a21364
$$ 128370 -144266 -228334 -304478 -129600 95984 8220 70908 -220439 -227213 -396999 -121364
18546c54330g6151A71977G1278j7584b09729d7925r3078G8507K13103b49209O9354
$$ -354330 -76151 171977 71278 53694 -209729 -47925 -141003 78507 291610 -249209 -179855
18535a79855k4077c3096B56417e75979i5751j87885Q9942e4137A42361b8987n5120
$$ -179855 -203932 -33096 256417 -575979 -95751 -283636 -193694 -54137 142361 -28987 -84107
18524h4107j09577l27303a13475D6026k1204a58887n6358g1976n9321j06051J3035
$$ -84107 -193684 -520987 -113475 46026 24822 -158887 -215245 -71976 -131297 -237348 -224313
18513b24313L5827A2288J09833h7013o467R634p9734k6789B41917a3733j34288
$$ -224313 -188486 12288 122121 -87013 -93480 -83846 -163580 -190369 241917 -13733 -148021
18502a48021I5431a65835H2615a45855g1804j52017a04879B6513b25047m4132
$$ -148021 95431 -165835 82615 -145855 -71804 -223821 -104879 26513 -225047 -269179
18492b69179J18780c267k8675A07921b61192P7523f6573k19006B70196a04624
$$ -269179 -150399 -3267 -31942 107921 -261192 -183669 -66573 -285579 270196 -104624
18481a45153A51148B4787F209a11750E0108J95973e5896E1340c58878P7379m5730
$$ -145153 151148 24787 6209 -111750 50108 246081 -55896 51340 -358878 -281499 -327229
18470c27229j10245C9789a4820I5798f1338j29484C00339p514k8778I6927m3780
$$ -327229 -437474 39789 -14820 95798 -61338 -190822 300339 292825 264047 96927 53147
18459E3147P8954b29917c3223F7299g0801D7758Q7276J37030a15365H9830a432
$$ 53147 132101 -229917 -33223 67299 -70801 47758 135034 272064 -115365 89830 -1432
18447f1499d280j82435E814b25584L8610A51351o8080A0972g2725r763D7200A7337
$$ -61499 -4280 -186715 5814 -225584 -186974 151351 83271 10972 -72725 -82488 47200 17337
18434A18246a77157K5233C669c07284b7614h625j14756m1116J9859m0924g0371
$$ 118246 -177157 -151924 3669 -307284 -27614 -8625 -123381 -164497 -144638 -185562 -70371
18422B35639d0374k58810C3922L8068M7438b92119h9976j2227B3056A249h2552
$$ 235639 -40374 -299184 33922 71990 119428 -292119 -89976 -102203 23056 1249 -82552
18410C01036g1505I9117c08218A42623N5643a62j60582B32998a0259A95354p7954
$$ 301036 -71505 99117 -308218 142623 198266 -162 -160744 232998 -10259 195354 117400
18399A17400n2466i3121n884M623A66275A7578a1789k26178a0758j04066j67540
$$ 117400 64934 -93121 -99005 -94382 166275 17578 -11789 -237967 -10758 -114824 -282364
18388b82364A26330j749A3918K0932Q7086a51013A33157a15899a3767k05661a02939
$$ -282364 126330 124581 13918 34850 121936 -151013 133157 -115899 -13767 -219428 -102939
18376a41094E2268a00562A20007a15808M9754k1422j18917g2185B26918m0138
$$ -141094 52268 -100562 120007 -115808 -66054 -87476 -206393 -72185 226918 186780
18366A86780D7751a04541K3086A5327J86838A0155L2180a61819D4542d06428g4654
$$ 186780 47751 -104541 -81455 15327 202165 10155 42335 -161819 44542 -406428 -74654
18354c2638A73248D4894a10649A82966h4838j30635k59326a34459A79760C1826
$$ -32638 173248 44894 -110649 182966 -84838 -215473 -474799 -134459 179760 31826
18343a54454r1527a19958B12418d3095B60612a89818j53727A50063J09732e0970
$$ -154454 -245981 -119958 212418 -43095 260612 -189818 -343545 150063 259795 -50970
18332b40414j21447A10018a20058A09426j1156J14119e6106j7273c0494A61564
$$ -240414 -361861 110018 -120058 109426 98270 212389 -56106 -73379 -30494 161564
18321a68537A42216b35903g107H6973b01466R7541L0730B23421c38319g9675A83598
$$ -168537 142216 -235903 -7107 86973 -201466 -103925 -73195 223421 -338319 -79675 183598
18309a81377c1553a4823q2742G9282i2604m58507C25210A41753a14452M5584j29348
$$ -181377 -31553 -14823 -97565 79282 -92604 -551111 325210 141753 -114452 -68868 -198216
18298a98216P7187B3964b11045q7013A02797a94303A2089M3321J48362b8383C93680
$$ -198216 -121029 23964 -211045 -298058 102797 -194303 12089 55410 203772 -28383 393680
18286b06620K4122J9494k9716h6026F3784g1952n7029b4408G3128a07754e3662
$$ -206620 -182498 -163004 -192720 -86026 63784 -71952 -128981 -24408 73128 -107754 -53662
18274A28118J93136B8927a57505j93374f1427A36897b95582J32451m8410f7659
$$ 128118 321254 28927 -157505 -350879 -61427 136897 -295582 -163131 -211541 -67659
18263a06345k7108A60111a96002a8998A4822e6219B70482F0091a78266b1547l49133
$$ -106345 -133453 160111 -196002 -18998 14822 -56219 270482 60091 -178266 -21547 -370680
18252c70680f3318k55765f0199m2833M8873A6600f5501j30038m8942A32938C8284
$$ -370680 -63318 -319083 -60199 -103032 -54159 16600 -65501 -195539 -244481 132938 38284
18240a17543A00237i0384i917k34784A13994f5561k69222j42486D7058f8604A66144
$$ -117543 100237 -90384 -9917 -244701 113994 -65561 -334783 -477269 47058 -68604 166144
18228g2635j15961N9367k29110I69c57237a26352A28353E8746b13722L2849C19382
$$ -72635 -188596 -129229 -358339 969 -357237 -126352 128353 58746 -213722 -180873 319382
18216A29413l1186a36409A490f6758l6396l18950b06049M6837a4084B72420g9331
$$ 129413 98227 -136409 1490 -66758 -103154 -422104 -206049 -159212 -14084 272420 -79331
18204b2523A20260L0983J49717N473f5313J7334A32985o3532K9498k8832j191
$$ -22523 120260 151243 300960 306433 -65313 -47979 132985 69453 98951 70119 68928
18193F8928M7271a86013j7745M8510A85486a71955e7164q1677F009J6031d7334
$$ 68928 116199 -186013 -203758 -155248 185486 -171955 -57164 -138841 6009 22040 -47334
18181B19082b11490A43212o1482L64416a64949q1834i0836b1318l61402a37548
$$ 219082 -211490 143212 81730 446146 -164949 -246783 -90836 -21318 -382720 -137548
18170d0484m55a8529n8997K515l8540r3548A7469K0518J32656c62564g1207l1765
$$ -40484 -40939 -18529 -77526 -75011 -113551 -207099 17469 37987 170643 -362564 -71207 -102972
18158a02972k6203A53456a30023B9501B856M351e6393C85504a75129G043K1641
$$ -102972 -129175 153456 -130023 29501 2856 7207 -56393 385504 -175129 7043 28684
18147B8684a43430A25441J39545h899A69259Q161g9456j94751A66972m9422f7668
$$ 28684 -143430 125441 264986 -8899 169259 177420 -79456 -274207 166972 117550 -67668
18135a3555F7084c1024q8145B5190a03286j10929L2823M1013o5023q1132C41509
$$ -13555 67084 -31024 -119169 25190 -103286 -214215 -181392 -140379 -205402 -286534 341509
18123a93730D8264d26923a6548G8734H242c65388b1266A02651j7590f8396B54475
$$ -193730 48264 -426923 -16548 78734 8242 -365388 -21266 102651 85061 -68396 254475
18111A89366j5945C7543O2819b21819H6431g4983j46541a7531B44083A21870l9240
$$ 189366 173421 37543 100362 -221819 86431 -74983 -221524 -17531 244083 121870 82630
18100H2630a14315A23149e042j69341a9428q5542A14318A1620J23038a16632H76
$$ 82630 -114315 123149 -5042 -174383 -19428 -104970 114318 11620 134658 -116632 876
18088a2916H9390g107H9150K86B2386k718k038b97273P97B98767a90815J3999
$$ -12916 89390 -7107 89150 89436 22386 19668 17630 -297273 -296476 298767 -190815 -176816
18076a76816A6295a15945a3115k06358o7669E955b08378l43213E5719c44016E5971
$$ -176816 16295 -115945 -13115 -219473 -287142 5955 -208378 -551591 55719 -344016 55971
18064a76581C3764h5587l837B7689O3180a00164m9028Q778r3247b0453B66348
$$ -176581 33764 -85587 -89424 27689 90869 -100164 -149192 -140414 -233661 -20453 266348
18052B4563b91935l8799F6135a25221A7752b18126B81320o4171b22286q8245Q2455
$$ 24563 -291935 -330734 66135 -125221 17752 -218126 281320 217149 -222286 -310531 -228076
18041b28076c784A55747J14358a47258L4171r4958B61396c68234A19030e3352
$$ -228076 -3784 155747 270105 -147258 -113087 -208045 261396 -368234 119030 -53352
18030c29708A31053b74613D2597a04939M6052B4131a90301j96880a40854K6040
$$ -329708 131053 -274613 42597 -104939 -58887 24131 -190301 -387181 -140854 -114814
18020a14814m350L2458A50644f9274a9980n6539B48413a12290A94544f420k9834
$$ -114814 -119164 -86706 150644 -69274 -19980 -76519 248413 -112290 194544 -6420 -36254
18009c6254p4677A5832b42089A08854A4389J66931a1811A75748o6778b98349G5993
$$ -36254 -110931 15832 -242089 108854 14389 181320 -11811 175748 108970 -298349 75993
17997a58263P6495b1195o6002k39640d959A55579a94244j070a1740A6676b13199
$$ -158263 -81768 -21195 -87197 -326837 -4959 155579 -194244 -195314 -11740 16676 -213199
17985d72467b01241J7951D6263c59890A06750b48564i1788k5807A55670b33626
$$ -472467 -201241 -183290 46263 -359890 106750 -248564 -91788 -117595 155670 -233626
17974a38908B99684H8596h276k34010J03201c5500r1272m1077D9351h2106A3017
$$ -138908 299684 88596 -8276 -242286 -139085 -35500 -126772 -167849 49351 -82106 13017
17962c78392b6496G3499C4755b7313B89832b35947p4706R1051I2828A9148J10473
$$ -378392 -26496 73499 34755 -27313 289832 -235947 -310653 -219602 92828 19148 129621
17951A29621m4409B8762K91877a49576n863A34624j8885M0271m6081B1561g9550
$$ 129621 85212 28762 320639 -149576 -155439 134624 115739 156010 109929 21561 -79550
17939d1918j01908L1065g721A59532C8511Q3952D2304g8386o8251c3937B7376
$$ -41918 -143826 -112761 -7721 159532 38511 122463 42304 -78386 -146637 -33937 27376
17927e714k08576j38383J64054C08389j49751a89437A6142a77089h3893A21309
$$ -5714 -214290 -352673 -188619 308389 158638 -189437 16142 -177089 -83893 121309
17916c03278R6982A40625a18398M4788B893a65869j2280h4829A5556b39528F9293
$$ -303278 -206296 140625 -118398 -73610 2893 -165869 -178149 -84829 15556 -239528 69293
17904d5540k1356B2282b60138L4735d1790k823j5091F9468M0844B2461C637J20482
$$ -45540 -66896 22282 -260138 -225403 -41790 -44613 -59704 69468 110312 22461 3637 124119
17892A24119h3236B4687b18719g1087K1680A59068c66005i8553j27791e0301j19435
$$ 124119 -83236 24687 -218719 -71087 -49407 159068 -366005 -98553 -226344 -50301 -169736
17881a69736L9111e7159n8225b6207f920j09574A0112d4221k792E889e1166O280
$$ -169736 -130625 -57159 -115384 -26207 -6920 -116494 10112 -44221 -47013 5889 -51166 -44886
17869d4886j38426j50614C49080E0989i5507B49222J8983a38913A96100o9422
$$ -44886 -183312 -333926 349080 50989 -95507 249222 268205 -138913 196100 126678
17859A26678b15922A33748c10796e1635A2487K80826l5880j24256c75559i7655
$$ 126678 -215922 133748 -310796 -51635 12487 293313 257433 133177 -375559 -97655
17848B1089L56456c45571A71194h9776I8075d3988A3710c08684O9046B40321a5046
$$ 21089 377545 -345571 171194 -89776 98075 -43988 13710 -308684 -239638 240321 -15046
17836C21459A13759a47044k7508D5760a95794d0234o7309I5142J34544H4705Q0918
$$ 321459 113759 -147044 -174552 45760 -195794 -40234 -107543 95142 229686 84705 165623
17825A65623i9995j3295F9246A8492R3855k8646K96870a08170d2444k3648j01263
$$ 165623 -99995 -113290 69246 18492 112347 83701 380571 -108170 -42444 -66092 -167355
17814a67355I5426J35303F4810b85028j3266a25466G3326A7622O4570L53716A43561
$$ -167355 95426 230729 64810 -285028 -298294 -125466 73326 17622 82192 435908 143561
17802b583A74726a17722I1774J85404e5430A61304C103g8892j5598A34317b2775
$$ -2583 174726 -117722 91774 277178 -55430 161304 3103 -78892 -94490 134317 -22775
17790A34411a93949c0893A03225e9894F5951J6094f3979K0527a8943m046A56411
$$ 134411 -193949 -30893 103225 -59894 65951 82045 -63979 -43452 -18943 -22989 156411
17778a15791g472l7142j56354k4830C16998A57218J722G576c32537a18557A31487
$$ -115791 -7472 -44614 -200968 -225798 316998 157218 158940 7576 -332537 -118557 131487
17766A94848a81910O2476k6546K3957A3407J52929g9116j65268l1470C1224J91548
$$ 194848 -181910 -119434 -145980 -122023 13407 166336 -79116 -244384 -275854 31224 222772
17755B22772e7025F9084b12092g4745A44414b58232c9433A9585J22917a65105
$$ 222772 -57025 69084 -212092 -74745 144414 -258232 -39433 19585 142502 -165105
17744d8396B39087C8701c8154A35949c402k58833C37851j17418o8682c47056d2512
$$ -48396 239087 38701 -38154 135949 -3402 -262235 337851 220433 151751 -347056 -42512
17732h6262j4592M9482A432b7794l9088B0170I82L05060d4425j83688C2750f3235
$$ -86262 -100854 -51372 1432 -27794 -66882 20170 982 306042 -44425 -228113 32750 -63235
17719c13675a22642H084a99274j69496G0872c01088h9771A29525F3856K1593m2488
$$ -313675 -122642 8084 -199274 -368770 70872 -301088 -89771 129525 63856 85449 42961
17708D2961c95949B6677e6545k60897F5402E26M9231a1872B86553b0711n1192
$$ 42961 -395949 26677 -56545 -317442 65402 526 49757 -11872 286553 -20711 -71903
17697g1903K2993C21693c1615C786K51629C33d0057j40019G1745J93773a35177
$$ -71903 -48910 321693 -31615 3786 255415 333 -40057 -180076 71745 265518 -135177
17685a96159D9368f2576n5916e1831k0175C7671d61995A20598l7886l6935J01905
$$ -196159 49368 -62576 -118492 -51831 -72006 37671 -461995 120598 82712 45777 147682
17674A47682m408B4552J37509G1223h0950F1682e7056F2905l0442K10140H5950
$$ 147682 143274 24552 162061 71223 -80950 61682 -57056 62905 32463 242603 85950
17662a27149k11548J64032A15945m6014K6564K44122b131A36265a36222c2474
$$ -127149 -338697 -174665 115945 69931 96495 340617 -2131 136265 -136222 -32474
17651b31307B46444a4930G597a29736c0316B89256J6943f3983F9656J04489F6768
$$ -231307 246444 -14930 7597 -129736 -30316 289256 306199 -63983 69656 174145 66768
17639B93700A28907a44492p5904Q3764n0506f8277j52030j8541A0790a70787j4361
$$ 293700 128907 -144492 -220396 -136632 -187138 -68277 -220307 -238848 10790 -170787 -185148
17628a85148B80681b8392B44045g5173B32218B1253d080j22745M6054L5810A67601
$$ -185148 280681 -28392 244045 -75173 232218 21253 -4080 -126825 -80771 -44961 167601
17616H9571a68916P7623l34555B10673j05030l0468J1629k3001J65059K08230
$$ 89571 -168916 -91293 -425848 210673 105643 75175 86804 63803 228862 437092
17606D37092o947g1251C5171J27350C6249L9848e5530A41037k9666a00122A8855
$$ 437092 430145 -71251 35171 162521 36249 76097 -55530 141037 111371 -100122 18855
17594B42115d170j33316A15769c9113l5259K5397l6566A99766I5451g8810A50987
$$ 242115 -4170 -137486 115769 -39113 -74372 -48975 -85541 199766 95451 -78810 150987
17582g5909I3681M975m8047B4472a32438k0179A31397f4758K3561A8576F383J03009
$$ -75909 93681 98656 50609 24472 -132438 -152617 131397 -64758 -41197 18576 6383 109392
17570A09392b92239A59320e4026a6260A32041i6911F5366K02564a13438m6893
$$ 109392 -292239 159320 -54026 -16260 132041 -96911 65366 267930 -113438 -160331
17560a60331j18171j10172B10236c12494g4551I7823A1854c03866g8554n9903
$$ -160331 -278502 -388674 210236 -312494 -74551 97823 11854 -303866 -78554 -138457
17550a38457C8507b92394a05469B16692a1775B56687A03701M2501R2175i16D31181
$$ -138457 38507 -292394 -105469 216692 -11775 256687 103701 146202 238377 -916 431181
17538a09924G6629K54509D0568R8190D8836b76099c5004A08332m8974K91141H9187
$$ -109924 76629 331138 40568 138758 48836 -276099 -35004 108332 59358 350499 89187
17526a36730G2233J05472J28855a94578e4614A50455a08921B11005c4965A76410
$$ -136730 72233 177705 306560 -194578 -54614 150455 -108921 211005 -34965 176410
17515C75788F6241J60647K52319D9801J8941b44592A76714N8353k1038Q8229A10963
$$ 375788 66241 226888 479207 49801 68742 -244592 176714 235067 214029 302258 110963
17503E0572Q4791a24454A38368J26960h3875A15273E2095a15878A67546e7770
$$ 50572 135363 -124454 138368 265328 -83875 115273 52095 -115878 167546 -57770
17492B75538k8542H4285b0464E2874K47365d6751B05745a41980E830N5442b628
$$ 275538 246996 84285 -20464 52874 300239 -46751 205745 -141980 5830 61272 -2628
17480C4150J1044K0037K3819B3443a8147A97726J11316D6160K2042R5705l1107
$$ 34150 45194 65231 89050 23443 -18147 197726 309042 46160 68202 163907 132800
17469A32800n1900B7221J47429B8191Q7375j9127b37098c9729A14609L35260A42741
$$ 132800 80900 27221 174650 28191 115566 96439 -237098 -39729 114609 449869 142741
17457C9261L80229e800A99320R3202J4314j0793L7168K8654a0131j82844C11000
$$ 39261 419490 -5800 199320 292522 306836 296043 333211 361865 -10131 -192975 311000
17445D18418A66556e3921A87787K78839j40239r5473J25572C1481m356J0577K94664
$$ 418418 166556 -53921 187787 466626 326387 230914 356486 31481 27125 37702 332366
17434C32366q3265G4018J04439J7404J08970A29785J05524m1234L34873B08696
$$ 332366 249101 74018 178457 195861 304831 129785 235309 194075 528948 208696
17423g7434A19480D0695J35635j8498J69857n1865r0039G7546J11073A8042M42927
$$ -77434 119480 40695 176330 157832 327689 275824 185785 77546 188619 18042 460969
17412D60969F2747K38285A10183J44725L4740a1249m4158G8813L097J12153b52125
$$ 460969 62747 301032 110183 254908 289648 -11249 -55407 78813 81910 194063 -252125
17400A41625O0314i893A85060q5176J31590r0634N063J2182F5665J20756e0658
$$ 141625 201939 -9893 185060 99884 231474 140840 145903 158085 65665 186421 -50658
17388A76489g1722H6488E28P6786K3286d3307l3140j07031A26519J48921n9177
$$ 176489 -71722 86488 528 77314 100600 -43307 -76447 -183478 126519 275440 216263
17377B16263H6197N5641J31153B084K27533a4214H5692K32696a21408D1189K039
$$ 216263 86197 141838 272991 2084 229617 -14214 85692 318388 -121408 41189 43228
17366D3228a3655j6161B80548G2064C4883a07244C09473A29705K41114a54585
$$ 43228 -13655 -29816 280548 72064 34883 -107244 309473 129705 370819 -154585
17355A26364J03929M7948A36166j1499L47561B6021L0102A7175c3397B32230B4280
$$ 126364 230293 278241 136166 124667 472228 26021 56123 17175 -33397 232230 24280
17343H2827o991a6779L162C79032i1070C12182P4694j60970J31332A07023M24416
$$ 82827 75836 -16779 -13617 379032 -91070 312182 386876 225906 357238 107023 531439
17332E31439A28402F1451O2242A7305L96112j33956Q6167j42451a43126F7409
$$ 531439 128402 61451 123693 17305 413417 279461 365628 223177 -143126 67409
17321a53p2078C24836j57863K84367I2366g6217C4151J67a31007J2423e622A15239
$$ -153 -72231 324836 166973 451340 92366 -76217 34151 34318 -131007 -118584 -5622 115239
17308h061G7633C4122J42678N2916J31504a77047C86110j60044n0590p2172a59888
$$ -8061 77633 34122 176800 229716 361220 -177047 386110 226066 175476 103304 -159888
17296D34031h9226A42097J81541j50967K20513j50205I8431J3720n0504b53146
$$ 434031 -89226 142097 323638 172671 393184 242979 98431 112151 61647 -253146
17285a39585F1433R198h3238J4662A83822d7415j2395C76367A68416p3780O8331
$$ -139585 61433 70631 -83238 -68576 183822 -47415 -59810 376367 168416 94636 162967
17274A62967O6784J2162a68051F4381N6702K15935l7884J32142G6338e3645I5404
$$ 162967 229751 241913 -168051 64381 121083 337018 299134 431276 76338 -53645 95404
17262A15836J14456b4334B69739C5552J53006J64669j25121A865M32521F808a36602
$$ 115836 230292 -24334 269739 35552 188558 353227 228106 1865 434386 6808 -136602
17250A0915l614L50402A15879J92732J56506j83451H4551L6832L65027A21930
$$ 10915 7301 357703 115879 308611 465117 281666 84551 121383 486410 121930
17239c2839I5805J91347j27463J08523K03146l4672a01133D69355E7572c0787
$$ -32839 95805 287152 159689 268212 471358 436686 -101133 469355 57572 -30787
17228a76033B32213A02668Q7009n7526J78187l5035K6885A10445r914c915A51045
$$ -176033 232213 102668 189677 132151 310338 275303 302188 110445 100531 -3915 151045
17216a68880c0475B86313J27064q3545j9459F5177K62393R5976j93846b7316D73517
$$ -168880 -30475 286313 413377 329832 310373 65177 327570 423546 229700 -27316 473517
17204A47382L9521m9501K39885E9014J42949g3241C77800a14484B67590D7278
$$ 147382 186903 137402 377287 59014 201963 -73241 377800 -114484 267590 47278
17193a40772G1753f1139B36406K267K39211B25988F8793L33700m3456j14355a21472
$$ -140772 71753 -61139 236406 238673 477884 225988 68793 402493 359037 244682 -121472
17181A13385J12375E1475J24597J0714L20314k4416E4960J43131J63027j18033
$$ 113385 225760 51475 176072 186786 507100 482684 54960 198091 361118 243085
17171B43085j10192r483M00323A59962Q0007K82641j96117F0305J56262J12142
$$ 243085 132893 123410 523733 159962 239969 522610 326493 60305 216567 328709
17161C28709A7511J71926P9251A25628J33613j05114J21990j23495L8366D107
$$ 328709 17511 189437 268688 125628 259241 154127 276117 152622 190988 4107
17150E41261k03546a4697D84002A93019J72423A56480L07872A48967J50839r7275
$$ 541261 337715 -14697 484002 193019 365442 156480 464352 148967 299806 202531
17140B02531L04441j62499A33959N36342k09486h928A76000L45328j87208m9683
$$ 202531 506972 344473 133959 670301 460815 -8928 176000 521328 334120 284437
17130B84437O8162O3809J32156G2496K66154l8717J62813p8681l619P8684j54093
$$ 284437 352599 416408 548564 72496 338650 299933 462746 384065 380446 459130 305037
17119C05037J57605A43163K63451j94623J18080M00593B81295M40365k12967j09982
$$ 305037 462642 143163 406614 211991 330071 730664 281295 721660 508693 398711
17109C98711r4250q9227K29415j01037p9855J16143J54787B03829L40029G8676
$$ 398711 304461 215234 444649 343612 263757 379900 534687 203829 543858 78676
17098D81111m49O8826j95002P4629M2643j17316O221A42221K66690J65431B05581
$$ 481111 480662 549488 354486 429115 471758 354442 360663 142221 408911 574342 205581
17086D09419L4753r1393o9999L6503K35852k9688k2102j54555R3512J81939l02066
$$ 409419 444172 352779 282780 319283 555135 525447 503345 348790 442302 624241 322175
17075C22175K99677j97264j55544k0995M55422j12319j21584j47004r181N72768
$$ 322175 621852 424588 269044 248049 703471 591152 469568 322564 313383 886151
17065H86151B00031K21870P7214K42016k50870B13996o0503E2386L85785J3957
$$ 886151 200031 421901 499115 741131 490261 213996 153493 52386 438171 452128
17055D52128K32165k39545p7656J76507j89503K45497B07091L77291k25153J85139
$$ 452128 684293 444748 367092 543599 354096 599593 207091 584382 359229 544368
17045E44368k03397J03730K81187o5928p3218j83810N8528B22423K806J26392
$$ 544368 340971 444701 725888 659960 586742 402932 461460 222423 225229 351621
17035C51621M10755k33919r283J50316A61590N81395m2331m6594K40172l16039
$$ 351621 762376 528457 519174 669490 161590 742985 700654 654060 894232 578193
17025E78193K4449k73779Q6801K94218B48400M21965j29621j72938J40565J45616
$$ 578193 602642 328863 415664 709882 248400 670365 540744 367806 508371 653987
17015F53987N5182k05188J52039A55040M90112R6398l4154J31085k26693J0306
$$ 653987 709169 503981 656020 155040 645152 741550 707396 838481 611788 622094
17005F22094m2792J31746r2515L50431M4707l79802J8552C24665O86868j69905
$$ 622094 579302 711048 618533 968964 1013671 633869 652421 324665 1011533 841628
16995H41628L5970j67366j06069J80828R4815k64368J52571K50806m38315Q5563
$$ 841628 877598 710232 604163 784991 879806 615438 768009 1018815 580500 666063
16985F66063K3348P0861L34897j28027q8852m4751Q4543k03080Q4063J51874j49278
$$ 666063 689411 760272 1095169 967142 878290 833539 918082 715002 799065 950939 801661
16974H01661p9858L35316l4929l50344J71186M66629E34917J29264J32450J70585
$$ 801661 721803 1057119 1022190 671846 843032 1309661 534917 664181 796631 967216
16964I67216j90815J95306j09275K31827o4825k90542r8770L75490J98443l06048
$$ 967216 776401 971707 862432 1094259 1029434 738892 640122 1015612 1214055 908007
16954I08007K33201o5781J88589k97407j03948J30422K55172k59227R4661k5976
$$ 908007 1141208 1075427 1264016 966609 862661 993083 1248255 989028 1083689 1057713
16944A057713L0268o0221J12111R7130j50223J14527j84596Q1261R2283J25621
$$ 1057713 1087981 1027760 1139871 1237001 1086778 1201305 1016709 1097970 1190253 1315874
16934A315874m6747J12956j66857m7231J80606m9891K5652J51515k83895m2889
$$ 1315874 1269127 1382083 1215226 1167995 1348601 1298710 1324362 1475877 1191982 1149093
16924A149093P7271L9966J2839k5946K3157l19214K19145J05624J40612L98590
$$ 1149093 1226364 1266330 1279169 1253223 1276380 957166 1176311 1281935 1422547 1821137
16914A821137o73256K60993j84979L72255K06512j89448l3031J11507j17292J24912
$$ 1821137 1147881 1408874 1223895 1596150 1802662 1613214 1580183 1691690 1574398 1699310
16904A699310o9899O798k22908O17409m23488J829J11387n2638R7842O1323K1134
$$ 1699310 1629411 1636209 1413301 2030710 1607222 1609051 1720438 1667800 1765642 1826965 1848099
16893A848099k56551K05488P2948j34053J23153L70254l00753j00621K67664l57507
$$ 1848099 1591548 1797036 1869984 1735931 1859084 2229338 1928585 1827964 2095628 1738121
16883A738121K84404j38146J9115M20085j49018p712J09243j29729O8734K29567
$$ 1738121 2022525 1884379 1903494 2323579 2174561 2166849 2276092 2146363 2215097 2444664
16873B444664k38241p4091K48263l45881K27446J28046k07837K46644L77680K07289
$$ 2444664 2206423 2132332 2380595 2034714 2262160 2390206 2182369 2429013 2806693 3013982
16863C013982l35531J36714j72440J38808j34984L33921r6193K10216m9118L60053
$$ 3013982 2678451 2815165 2642725 2781533 2646549 2980470 2884277 3094493 3045375 3405428
16853C405428j16397j78897J71953J336J1824K0823J20135J52990r0663M0198
$$ 3405428 3289031 3110134 3282087 3283423 3295247 3316070 3436205 3589195 3498532 3538730
16843C538730r3361K84719k8484j2197N21301o96644L60925L19410j5743L95043
$$ 3538730 3445369 3730088 3701604 3689407 4210708 3514064 3874989 4194399 4178656 4573699
16833D573699l00751k3648j89519J16511L68970L74565l01640R8242J49044L70438
$$ 4573699 4272948 4249300 4059781 4176292 4545262 4919827 4618187 4716429 4865473 5235911
16823E235911P3303j4662k1226o0055P5912J62665J87024K64650P488P0809N2543
$$ 5235911 5309214 5294552 5273326 5213271 5289183 5451848 5638872 5903522 5911010 5981819 6034362
16812F034362Q7149J10815K41750j84866K08163O96949J92716L9577K61922j49231
$$ 6034362 6121511 6232326 6474076 6289210 6497373 7194322 7387038 7426615 7688537 7539306
16802G539306N2249J99673J89990J50831K58487J18654M95156J80119J3678K93020
$$ 7539306 7591555 7791228 7981218 8132049 8390536 8509190 9004346 9184465 9198143 9491163
16792I491163O10811j5500J63347M78551K07359n5655M93255K0660P36504J90621
$$ 9491163 10101974 10086474 10249821 10728372 10935731 10880076 11373331 11393991 12130495 12321116
16782A2321116N37011L74517K52492N99844K79693M19786O54695O3364O33189
$$ 12321116 12858127 13232644 13485136 14084980 14364673 14784459 15439154 15502518 16135707
16773A6135707L88208O98317O22628Q06240Q03978M94103N90042N86839Q79607
$$ 16135707 16523915 17222232 17844860 18651100 19455078 19949181 20539223 21126062 22005669
16764B2005669Q44244R94976O52137J156266J051787P74638J163468J605558J011227
$$ 22005669 22849913 23844889 24497026 25653292 26705079 27479717 28643185 30248743 31259970
16755C1259970J303999J274774J782730J479476J726945J742015J976417K176938
$$ 31259970 32563969 33838743 35621473 37100949 38827894 40569909 42546326 44723264
16747D4723264J579479K399674K776013K263537K936678K839386L342909L328424
$$ 44723264 46302743 48702417 51478430 53741967 56678645 59518031 62860940 66189364
16739F6189364L598211L629279M137940M440689M350638M795966N219129N114227
$$ 66189364 69787575 73416854 77554794 81995483 86346121 91142087 96361216 101475443
16731A01475443N519167N698030N974553O273166N820766O483927O230735N729187
$$ 101475443 106994610 112692640 118667193 124940359 130761125 137245052 143475787 149204974
16723A49204974N790564N083068M332728M188085K726089J996893J203853l62146
$$ 149204974 154995538 160078606 164411334 168599419 171325508 173322401 174526254 174164108
16715A74164108p70704k221420l214136m210370m622260n206092o040392o098717
$$ 174164108 173393404 171171984 167957848 163747478 159125218 153919126 147878734 141780017
16707A41780017o685761o150703o740976o390211o334734n923427n716678n218137
$$ 141780017 135094256 128943553 122202577 115812366 109477632 103554205 97837527 92619390
16699I2619390n304872n062570m659812m274220m092248l787873l341080l485541
$$ 92619390 87314518 82251948 77592136 73317916 69225668 65437795 62096715 58611174
16691E8611174l178035l036268k730172k253186k511755k096975k147160j823783
$$ 58611174 55433139 52396871 49666699 47413513 44901758 42804783 40657623 38833840
16683C8833840j960289j854113j608584j265115j470975j329399j440227j181111
$$ 38833840 36873551 35019438 33410854 32145739 30674764 29345365 27905138 26724027
16675B6724027j090461j020517n84337j426278q84334p10116l60158j067016n08646
$$ 26724027 25633566 24613049 24028712 22602434 21718100 21007984 20647826 19580810 19072164
16666A9072164p32026o42255r13737n11902j80459o40019q66537j00945n67114
$$ 19072164 18340138 17697883 16784146 16272244 16091785 15451766 14585229 14484284 13917170
16657A3917170o92648l3029m53614l91742k97165k26329n66716n12274k0366j22854
$$ 13917170 13224522 13191493 12737879 12346137 12048972 11822643 11255927 10743653 10723287 10600433
16647A0600433n38159m96987k99127R5850n51165K19240n83899l37666j25089
$$ 10600433 10062274 9565287 9266160 9362010 8810845 9030085 8446186 8108520 7983431
16638G983431J02342k04229m60228Q9720l18215l34874J97594o39902R7761l54188
$$ 7983431 8085773 7881544 7421316 7511036 7192821 6857947 7055541 6415639 6513400 6159212
16628F159212Q341M3904m22995K52178l22639l46931K94970n18385p3141J6046
$$ 6159212 6167553 6211457 5788462 6040640 5718001 5371070 5666040 5147655 5074514 5090560
16618E090560n0847k80539L90909n52606K13982n68069J52882k2950K8707k61945
$$ 5090560 5039713 4759174 5150083 4597477 4811459 4243390 4396272 4373322 4402029 4140084
16608D140084J03634j78141l68549K37558p1633k5308k51002L43154l12863j90436
$$ 4140084 4243718 4065577 3697028 3934586 3862953 3837645 3586643 3929797 3616934 3426498
16598C426498n7213L00562l76166q0145K06211k07855j16647Q9373k55195N6131
$$ 3426498 3369285 3669847 3293681 3213536 3419747 3211892 3095245 3184618 2929423 2985554
16588B985554j41991O5158k90476J90384j96449j90772M6043K98325l59899l168
$$ 2985554 2843563 2908721 2618245 2808629 2612180 2421408 2467451 2765776 2405877 2402709
16578B402709p2251J25165J14756J3684j58173J8584j79553L43059l05987k47809
$$ 2402709 2330458 2455623 2570379 2584063 2425890 2444474 2264921 2607980 2301993 2054184
16568B054184O2519K6009j51757M94409l55515P5536k32879J17948k76202L81456
$$ 2054184 2116703 2142712 1990955 2485364 2129849 2205385 1972506 2090454 1814252 2195708
16558B195708k93186k85098l4627L45740l39022j6309j7335J11679j77500J73801
$$ 2195708 1902522 1617424 1582797 1928537 1589515 1573206 1555871 1667550 1490050 1663851
16548A663851J81385n25679M73005k71691J7995k22850N72472o48026L51379J42921
$$ 1663851 1845236 1319557 1792562 1520871 1538866 1316016 1888488 1240462 1591841 1734762
16538A734762m08836L0242j13484k5393l7729J6266M30830k55301J6761j91633
$$ 1734762 1325926 1356168 1242684 1217291 1179562 1195828 1626658 1371357 1388118 1196485
16528A196485J93145r2953p0363O6289R3986l16731K01183j51431O0208j68384
$$ 1196485 1389630 1296677 1226314 1292603 1386589 1069858 1271041 1119610 1179818 1011434
16518A011434J66310p2283l38536O46010l55985O6574q7514l31042K18076J72016
$$ 1011434 1177744 1105461 766925 1412935 1056950 1123524 1036010 704968 923044 1095060
16508A095060O1266k8120p8209j56389L27093k91498j72240L01160k12630J59148
$$ 1095060 1156326 1128206 1049997 893608 1220701 929203 756963 1058123 845493 1004641
16498A004641j52299J34148J00913k05580k4585L48238k20837J12272k78349O323
$$ 1004641 852342 986490 1087403 881823 857238 1205476 984639 1096911 818562 824885
16488H24885K26461j14621k12184L0526n4565q7101K00037k22110J96212R4470
$$ 824885 1051346 936725 724541 755067 700502 613401 813438 591328 787540 882010
16478H82010k97058J11218l23781K86219J6379Q3441k31084O51509n18954p8241
$$ 882010 584952 696170 372389 658608 674987 758428 527344 1178853 659899 581658
16468E81658J00641M73M4915k73865L36975j89006n8090r8591K31535C29569M55976
$$ 581658 682299 682772 727687 453822 790797 601791 543701 445110 676645 329569 785545
16457G85545l70856J23078O2130M3083B54627L84448K15315j91436k9474n7227
$$ 785545 414689 537767 599897 642980 254627 639075 854390 662954 633480 576253
16447E76253j57983r0488K27202j32886M02193o0385k11340Q9666O7149k09560
$$ 576253 418270 327782 554984 422098 824291 763906 552566 642232 709381 499821
16437D99821O4163j77950R1153K54636l03654J28419J32339C25421J56330L7323
$$ 499821 563984 386034 477187 731823 428169 556588 688927 325421 481751 519074
16427E19074l3368m8990m9375n5085L44359j54829k7394r152o3464J48448B41959
$$ 519074 485706 436716 387341 332256 676615 521786 494392 485240 421776 570224 241959
16415C38462M10309j66504j11606m4420o1043K27843k51870p0292Q5830K51158
$$ 338462 748771 582267 470661 426241 365198 593041 341171 270879 356709 607867
16405F07867K2192j69032j08473J38348j53984m793J8910I9315K45669j36592
$$ 607867 630059 461027 352554 490902 336918 332125 351035 99315 344984 208392
16395B08392f4709A75997M22887A27389K59996J02489k39808R8482J75411j21467
$$ 208392 -64709 175997 598884 127389 387385 489874 250066 348548 523959 402492
16385D02492A83259J30056m4492J0642L53942B97481p7894J02641k6787q0376
$$ 402492 183259 313315 268823 279465 633407 297481 219587 322228 295441 215065
16375B15065K8149j09518K19674j48744b0117D72907j26986O0189A78863M2660
$$ 215065 243214 133696 353370 204626 -20117 472907 345921 406110 178863 221523
16365B21523N18113C29869H6884K80667j83050l0604K08724L4040R849R996J27801
$$ 221523 739636 329869 86884 367551 184501 153897 362621 396661 406510 416506 544307
16354E44307A82302m3586K70871j22550J8801B9141L39470P639l0611C0255J75032
$$ 544307 182302 138716 409587 287037 305838 29141 368611 376250 345639 30255 205287
16343B05287P9785F7800N36793A39890N5459K80594a4171C9080J15713J76655
$$ 205287 285072 67800 604593 139890 195349 475943 -14171 39080 154793 331448
16333C31448J57644a08483L2274G7413a4157B09191N937J37765A57058l6577i7602
$$ 331448 489092 -108483 -76209 77413 -14157 209191 215128 352893 157058 120481 -97602
16321D51021B08978E6661K38026K4190J04260j47345g2648A58020a7525G1096
$$ 451021 208978 56661 294687 318877 423137 275792 -72648 158020 -17525 71096
16310b83B72762J7677A34724J59510O0328j9482O9010F6944K78684A72118k0676
$$ -283 272762 290439 134724 294234 354562 335080 404090 66944 345628 172118 151442
16299A51442J5607H1138J23874c9503C73788h1222B44407J4460A12163h3978m9989
$$ 151442 167049 81138 205012 -39503 373788 -81222 244407 258867 112163 -83978 -133967
16288a33967A90978a42838C83097B043L61308N082A76271L24171A15667m9778
$$ -133967 190978 -142838 383097 2043 363351 368433 176271 500442 115667 65889
16278F5889K87343m5580D7010J74901G4127N3822b3932C38520c03708C39286M4639
$$ 65889 353232 307652 47010 221911 74127 127949 -23932 338520 -303708 339286 383925
16267C83925p9592I5579K20417H6225J26627J15909n9231C3318b24639e8818A97382
$$ 383925 304333 95579 315996 86225 212852 328761 269530 33318 -224639 -58818 197382
16255D44729j00121D9089M9037K0770K83107e2361A03697j5424B9727M798J21209
$$ 444729 344608 49089 98126 118896 402003 -52361 103697 88273 29727 34525 155734
16244A55734J66446j46183C7838J08628a21762B91262d9719j61670A61474a2938
$$ 155734 322180 175997 37838 146466 -121762 291262 -49719 -211389 161474 -12938
16233A41647J91062a22414B36547j14164a12377B86332J39854j55293a45130B09542
$$ 141647 332709 -122414 236547 122383 -112377 286332 426186 270893 -145130 209542
16222A05914a02426m254D1357A4752J76967e1986B01234a23671A24916A9907K3669
$$ 105914 -102426 -106680 41357 14752 191719 -51986 201234 -123671 124916 19907 43576
16211D3576L5674d497k85308A50974E4936a91345b4323B08615g293A96823k6497
$$ 43576 79250 -4497 -289805 150974 54936 -191345 -24323 208615 -7293 196823 170326
16200A70326p3980e8969B10109J2516g6599C61726h7980B49195c6277D27598c3023
$$ 170326 96346 -58969 210109 222625 -76599 361726 -87980 249195 -36277 427598 -33023
16188B7929O5950c7478j84118A61206j9159F2082K1617B8307j0874J94795d6839
$$ 27929 93879 -37478 -221596 161206 142047 62082 83699 28307 17433 212228 -46839
16176A03955R0246J16158b85343g2006G9032A8629J1423c14960C4261L5268a92049
$$ 103955 194201 310359 -285343 -72006 79032 18629 30052 -314960 34261 69529 -192049
16164A56915a5930B3820J1402J16469A006K97868A37807n0310b8720H795d20825
$$ 156915 -15930 23820 35222 151691 1006 298874 137807 87497 -28720 8795 -420825
16152C04645A44774D2965q500R3539d2583A46547d9155I1485l5536b17948M9126
$$ 304645 144774 42965 34465 128004 -42583 146547 -49155 91485 55949 -217948 -168822
16141a68822D73558B8422K86436a06569M515H8306N7032K20982e0370j47519b0465
$$ -168822 473558 28422 314858 -106569 -102054 88306 145338 366320 -50370 -197889 -20465
16129A98713f8263J4103j50382C64575C6767a20841A1041O2194d1950A29592c20487
$$ 198713 -68263 -54160 -204542 364575 36767 -120841 11041 73235 -41950 129592 -320487
16117D8509i1232I1312B4483N6496a7573A40137B2971i0094A21769b44630F932
$$ 48509 -91232 91312 24483 80979 -17573 140137 22971 -90094 121769 -244630 6932
16105a22302B5557A0277J76019J783p6324J6180Q2585J65815a09848F7625B7888
$$ -122302 25557 10277 186296 188079 111755 127935 210520 376335 -109848 67625 27888
16093A87107I2271O9978h091l05353A47407h3580C3396d99370d7051B5172K64171
$$ 187107 92271 162249 -8091 -313444 147407 -83580 33396 -499370 -47051 25172 289343
16082B89343a17063d8000d362j78476A06412c42818e7761A61360f6483m5633A35962
$$ 289343 -117063 -48000 -4362 -182838 106412 -342818 -57761 161360 -66483 -112116 135962
16070d05546i0611i878m3409K2325H3359N3066L2816k8835F7845K4262a75563
$$ -405546 -90611 -9878 -53287 -30962 83359 136425 169241 140406 67845 92107 -175563
16058b80546a24704E2667j429a29376j32847j03183C97284d5489k44707B57509
$$ -280546 -124704 52667 51238 -129376 -262223 -365406 397284 -45489 -290196 257509
16047C1862f9220a538o8321A04909R8772e31419a16984b8732A98582b24118l3047
$$ 31862 -69220 -1538 -69859 104909 203681 -531419 -116984 -28732 198582 -224118 -257165
16036b57165J04797D3104J28738o243m7634g6467m6428c1619A33464c9993m2974
$$ -257165 -152368 43104 171842 165599 117965 -76467 -122895 -31619 133464 -39993 -82967
16025h2967B19163m0837L33925a60210O236o5054q9041F4675d51686b16640G525
$$ -82967 219163 178326 512251 -160210 -153974 -219028 -308069 64675 -451686 -216640 7525
16013b34794J14646A13465B7854a7172k01599A17515c2829B3813e421B24675r4018
$$ -234794 -120148 113465 27854 -17172 -218771 117515 -32829 23813 -5421 224675 130657
16002A30657i1187K7372B4839J28603F3648a18335A8507J60336K17511j93137
$$ 130657 -91187 -63815 24839 153442 63648 -118335 18507 178843 396354 203217
15992B03217f185A5211h496A17851Q0434b39402A25171Q9184H1931K32085A50908
$$ 203217 -6185 15211 -8496 117851 198285 -239402 125171 214355 81931 314016 150908
15980C00518B1182K47228K03431F0188a71881L8870a9472j67303i0014L5871q9373
$$ 300518 21182 268410 471841 60188 -171881 -133011 -19472 -186775 -90014 -54143 -143516
15969a43516B8343a89773a1648k86212j4568D03925o8573j23313C4404A4221b85569
$$ -143516 28343 -189773 -11648 -297860 -312428 403925 335352 212039 34404 14221 -285569
15957B64396G1394a94886B78989D9657K59161F2859H658O7638d68924J30389j27385
$$ 264396 71394 -194886 278989 49657 308818 62859 8658 76296 -468924 -338535 -465920
15946d65920K14467E4642c4137r1846B32h456m9130E7179b56033j07509d4900
$$ -465920 -251453 54642 -34137 -125983 232 -8456 -57586 57179 -256033 -363542 -44900
15934B84966b78481A60170b56517H3449f3041j07070e5194k47997i0650A22228
$$ 284966 -278481 160170 -256517 83449 -63041 -170111 -55194 -303191 -90650 122228
15923D042a18633L9995J1131j10239f350l54261J41468i0949j535j25071c454
$$ 4042 -118633 -78638 -67507 -177746 -6350 -360611 -219143 -90949 -92484 -217555 -3454
15911A44299R8915H9598m4414J15827a88634k43819H1731k9005b66376A15318
$$ 144299 243214 89598 45184 161011 -188634 -432453 81731 52726 -266376 115318
15900e8674k63103h1942j06109b4136G9061A6381f2989J9992J7867m3767C68576
$$ -58674 -321777 -81942 -188051 -24136 79061 16381 -62989 -42997 -25130 -68897 368576
15888a8783l34079J71583C0624a56578A65049a27518a3022D9036a88968B23059
$$ -18783 -352862 -181279 30624 -156578 165049 -127518 -13022 49036 -188968 223059
15877c35671i167n0322l24170h7440B88029a84151H5021e8400j20652L6514A7300
$$ -335671 -9167 -59489 -383659 -87440 288029 -184151 85021 -58400 -179052 -142538 17300
15865a20990d6721k50598E099b87477K3492A39814b4507k67624H976K84491A2670
$$ -120990 -46721 -297319 5099 -287477 -263985 139814 -24507 -292131 8976 293467 12670
15853D3469A1666L76011d2854I9060D2892a15755c6382O309o6573j7557R485A50673
$$ 43469 11666 387677 -42854 99060 42892 -115755 -36382 -30073 -96646 -114203 -104718 150673
15840b31655B18931a25123A42194C5137N890M0818c87642A08946C6571d4116j25641
$$ -231655 218931 -125123 142194 35137 41027 81845 -387642 108946 36571 -44116 -169757
15829a69757A21341a31877C0824J79505b7649j95047b4265D727c2746k86111F1353
$$ -169757 121341 -131877 30824 210329 -27649 -222696 -24265 4727 -32746 -318857 61353
15817a52663B65317a58520B7879a08190h137r617A33407F5367a56685O7625d0312
$$ -152663 265317 -158520 27879 -108190 -8137 -17754 133407 65367 -156685 -89060 -40312
15805D3191a8569A57034c98984J28138B25557a26227B37443J31852d11314J55376
$$ 43191 -18569 157034 -398984 -270846 225557 -126227 237443 369295 -411314 -255938
15795b55938B3760b1564j70750C3849b45666H1713G949c48084b3387H4650E126
$$ -255938 23760 -21564 -192314 33849 -245666 81713 7949 -348084 -23387 84650 5126
15783A00447b27888A07960a16239H9343B7651b24574A20740O7252G6385a30242
$$ 100447 -227888 107960 -116239 89343 27651 -224574 120740 187992 76385 -130242
15772a79435A0242a39609A47838J42155g7692j60576J19095J1875B37621m9586
$$ -179435 10242 -139609 147838 289993 -77692 -238268 -119173 -107298 237621 188035
15762A88035f0036k5318f416j13682c000A5888M101a9321B1414N5120c53926c4145
$$ 188035 -60036 -85354 -6416 -120098 -3000 15888 19989 -19321 21414 76534 -353926 -34145
15749A43873h4233k88527A57879F4466K18837m7886f8031m936I6301A9085P8274
$$ 143873 -84233 -372760 157879 64466 283303 235417 -68031 -72967 96301 19085 97359
15738I7359a22003f991r704m14477C55124h859H1025d5685k19176M9393d0491
$$ 97359 -122003 -6991 -16695 -431172 355124 -8859 81025 -45685 -264861 -215468 -40491
15726C1139L20766c00451J19025d3113j2762A44631O2606J12271B901c6038m17134
$$ 31139 351905 -300451 -181426 -43113 -55875 144631 207237 319508 2901 -36038 -453172
15715d53172A30550g1011E5152j1540f847p0137p7843N8095M7577A0509d5584
$$ -453172 130550 -71011 55152 43612 -6847 -76984 -154827 -96732 -49155 10509 -45584
15703a00019A42096C426c7797r4728C5876b0889k04456A83715a25000B68286F1274
$$ -100019 142096 3426 -37797 -132525 35876 -20889 -225345 183715 -125000 268286 61274
15691A15030h1880k36612A0163K08886L9876a93920r8918B94452g6485B596J44743
$$ 115030 -81880 -318492 10163 219049 258925 -193920 -292838 294452 -76485 2596 147339
15680A47339K121b49199F6053c42476a43446j6659D539O4671N2432m7540b60652
$$ 147339 149460 -249199 66053 -342476 -143446 -160105 4539 69210 121642 74102 -260652
15668C07807j25820j180J1772a38468N1128i736A41238b38398j08107J01936B45454
$$ 307807 181987 180807 192579 -138468 -87340 -9736 141238 -238398 -346505 -244569 245454
15656b35068e4994m6421b8750l06614a39681A37336a29957j09324a05720C17632
$$ -235068 -54994 -101415 -28750 -335364 -139681 137336 -129957 -239281 -105720 317632
15645D5483a9490B71939i7620A70057a19392r4668p9301a41353C4120K75528A38128
$$ 45483 -19490 271939 -97620 170057 -119392 -214060 -293361 -141353 34120 309648 138128
15633b9710o249F7992d4631P64k5699A2998h5804A46781B3637O7239D5210J36306
$$ -29710 -35959 67992 -44631 -43867 -69566 12998 -85804 146781 23637 90876 45210 181516
15621A81516i1516A0763a2856C32012C3715i6756L2514E7873b65393C9421J18137
$$ 181516 -91516 10763 -12856 332012 33715 -96756 -64242 57873 -265393 39421 157558
15610A57558l6039a21726C40188b44945h1225j02891k1359a6323C78328f0437
$$ 157558 121519 -121726 340188 -244945 -81225 -184116 -205475 -16323 378328 -60437
15599b70167J25355f2182A62558a27673D7487g0286L1379A92014J43082a83082
$$ -270167 -144812 -62182 162558 -127673 47487 -70286 -38907 192014 335096 -183082
15588a66463j59722k93A52683m2654N7272E7253i4585D08071A30559g8972c3409
$$ -166463 -326185 -326478 152683 110029 167301 57253 -94585 408071 130559 -78972 -33409
15576f8128j20662e8674j13714O8002d4676a2825C1056a14289B40095h4489A07294
$$ -68128 -188790 -58674 -172388 -104386 -44676 -12825 31056 -114289 240095 -84489 107294
15564E8839K5128b4757j6437k99896f4691K5086j1726k41611j06858P0568B3870
$$ 58839 83967 -24757 -41194 -341090 -64691 -39605 -51331 -292942 -399800 -329232 23870
15552B43354b56270A68377J13492h3303A02832a87095N2644D8292a47440n0898
$$ 243354 -256270 168377 281869 -83303 102832 -187095 -134451 48292 -147440 -198338
15542a98338f9733A19393P6124H252b12499B64839a85646B93225c1521r1561A20869
$$ -198338 -69733 119393 195517 8252 -212499 264839 -185646 293225 -31521 -123082 120869
15530b91103c6174j75782F9628d6039p5462N8550q3345A90042A1643J3987a66408
$$ -291103 -36174 -211956 69628 -46039 -121501 -62951 -146296 190042 11643 25630 -166408
15518B21933e1783A44261b08969g9349j5030A87737F3799n609A1292J11751k7842
$$ 221933 -51783 144261 -208969 -79349 -94379 187737 63799 58190 11292 123043 95201
15507I5201a37316o5677I6073Q0801F1237k2736O7212c6772G3360c6863r1261
$$ 95201 -137316 -202993 96073 176874 61237 38501 105713 -36772 73360 -36863 -128124
15496a28124L1921C3303a57930a5868j19983B23098h7592q7829b9353A05390I091
$$ -128124 -96203 33303 -157930 -15868 -135851 223098 -87592 -175421 -29353 105390 9091
15484a9386j51906n6268O5379D5455a26160o4200q3058e9935r3706B7411b46137
$$ -19386 -171292 -227560 -162181 45455 -126160 -190360 -273418 -59935 -153641 27411 -246137
15472c63239a20027I5815L7153I909h5052A38005a63684g3257a2353A77566e3848
$$ -363239 -120027 95815 132968 9909 -85052 138005 -163684 -73257 -12353 177566 -53848
15460D9816a36981d3709j776A04519b17886Q1386f395C73385F7878L5469a21576
$$ 49816 -136981 -43709 -45485 104519 -217886 -136500 -6395 373385 67878 103347 -121576
15448a05433l7298g0701r043D4890a3183E8600K94809b0963r3500F5835J19313
$$ -105433 -142731 -70701 -79744 44890 -13183 58600 353409 -20963 -114463 65835 185148
15437A85148d9099k40161A01975b9290A96234b25123A19191b62580H0370d3541
$$ 185148 -49099 -289260 101975 -29290 196234 -225123 119191 -262580 80370 -43541
15426A08869J33828q0216n4169m9611B2668e4507A53464h6736J9275j59762C48447
$$ 108869 242697 162481 108312 58701 22668 -54507 153464 -86736 -67461 -227223 348447
15414A50505J19200c6103E2991k5707b4599G1815J27064e4057C37502b8688D7949
$$ 150505 269705 -36103 52991 27284 -24599 71815 198879 -54057 337502 -28688 47949
15402b02515n8805J13306A62953J50814c96124E0727L1592f1903j3401C36810
$$ -202515 -261320 -148014 162953 313767 -396124 50727 82319 -61903 -75304 336810
15391i9644c72m97583b23682A84426b97434F5968L47434c44E1851M526d3284q4280
$$ -99644 -372 -497955 -223682 184426 -297434 65968 413402 -344 51851 56377 -43284 -127564
15379a27564I524O04548d9338j02419C27888c931j2134k64984J13437e6096j94542
$$ -127564 9524 614072 -49338 -151757 327888 -3931 -16065 -281049 -167612 -56096 -250638
15368b50638A048c9485q8346r8991g9361A36722a05810m160a7213l9994C8525
$$ -250638 1048 -39485 -127831 -226822 -79361 136722 -105810 -109970 -17213 -57207 38525
15356a90038A4449J51438C6755h1831F1538J3775f5330G7319N064a34940E0876
$$ -190038 14449 165887 36755 -81831 61538 75313 -65330 77319 82383 -134940 50876
15344a59366f1855A04067J04589Q0908h7615A10974N2596J4839b08207I6000h1891
$$ -159366 -61855 104067 208656 289564 -87615 110974 163570 178409 -208207 96000 -81891
15332G5344g548o31D6854b9725p3863J7789d2560I8149h9794j58352b2787j17415
$$ 75344 -7548 -8179 46854 -29725 -103588 -85799 -42560 98149 -89794 -248146 -22787 -140202
15320a40202D541a10068B3376d0308N574j51030E2698J13476a51213a8971B13461
$$ -140202 4541 -110068 23376 -40308 -34734 -185764 52698 166174 -151213 -18971 213461
15308H2757b0232B71441a73152j92309I5695a8061A29820a84728A82717c2899
$$ 82757 -20232 271441 -173152 -365461 95695 -18061 129820 -184728 182717 -32899
15297A40041a1703B9689O3055j7282c7193I7555c96784a31982A20953J93003a7622
$$ 140041 -11703 29689 92744 75462 -37193 97555 -396784 -131982 120953 313956 -17622
15285G9573A639J29623J42121F8202J94859D2297J97721j16902m0184J1591m4519
$$ 79573 1639 131262 273383 68202 263061 42297 240018 123116 82932 94523 50004
15274E0004J81222M8453a76665B27685I7837b29634c6396A19959K6489C9169b46196
$$ 50004 231226 279679 -176665 227685 97837 -229634 -36396 119959 146448 39169 -246196
15262A58451B1397J85064a30389f2050G0898J82811N5171n729a43905A52813J14700
$$ 158451 21397 206461 -130389 -62050 70898 253709 308880 303151 -143905 152813 267513
15251B67513g0477G475a8842C16566k6883J062289N14421r13956J122331p79619
$$ 267513 -70477 7475 -18842 316566 289683 1351972 1866393 952437 2074768 1295149
15241A295149F25155k87730c24536A45167K41364b70136d2563H8261b41805j65928
$$ 1295149 625155 337425 -324536 145167 386531 -270136 -42563 88261 -241805 -407733
15231d07733I8943J39213C4544g5967c617r7648B45978a61644C34091F1686B942
$$ -407733 98943 238156 34544 -75967 -3617 -101265 245978 -161644 334091 61686 2942
15219E51380G1451j127K0164g8712A09872l3992R3995c4115N079j69507A87563
$$ 551380 71451 70324 90488 -78712 109872 75880 169875 -34115 -29036 -198543 187563
15207E2323J47261A8583i7998B01051k7669c38066E2008K02287f4818c848j42437
$$ 52323 199584 18583 -97998 201051 173382 -338066 52008 254295 -64818 -3848 -146285
15196a46285G3545n844R7309G89L4255h5945B577a82416A92209J90529A01721
$$ -146285 73545 67701 165010 789 35044 -85945 2577 -182416 192209 382738 101721
15184H7347L6346J49623j32904a54575l4281K218F919L0270A1077b68637B4853
$$ 87347 123693 273316 140412 -154575 -188856 -186638 6919 37189 11077 -268637 24853
15172A08312e05C1903f624B06109H4044C9248J3465Q0412k5429a34050A98022
$$ 108312 -505 31903 -6624 206109 84044 39248 52713 133125 107696 -134050 198022
15160b3071A44688f4229o2649E2608h6490l08050A99817P453c8308N836B08521
$$ -23071 144688 -64229 -126878 52608 -86490 -394540 199817 207270 -38308 -32472 208521
15148A26087d4803A37710J01749l4883M0044l4075r8053R3115P0071F4047k6275
$$ 126087 -44803 137710 239459 204576 244620 210545 112492 205607 275678 64047 37772
15137C7772a47788I6193M8294P7097K20180A50055C304i688A48064h0107B14319
$$ 37772 -147788 96193 144487 221584 441764 150055 3304 -9688 148064 -80107 214319
15125E0116k4506A879K56658b95571C26737q8757c6928B03772G3690e1469E2962
$$ 50116 25610 1879 258537 -295571 326737 237980 -36928 203772 73690 -51469 52962
15113B99229a15069A85420F446J76391A0191J84440N7339g4002H5747Q5597n4741
$$ 299229 -115069 185420 6446 182837 10191 194631 251970 -74002 85747 171344 116603
15102A16603K05398n7093p465F2618d25k8682C54386j55841A1372J05120c3892
$$ 116603 322001 264908 257443 62618 -425 -29107 354386 198545 11372 116492 -33892
15090A4167J48259D4233Q0889M2690b43097N4155E0581K47951c9778D366J53070
$$ 14167 162426 44233 125122 167812 -243097 -188942 50581 298532 -39778 4366 157436
15079A57436K43520A62249o3542J69779d6231Q646q373B05572a84499B77356A20008
$$ 157436 400956 162249 98707 268486 -46231 -37585 -45958 205572 -184499 277356 120008
15067a34458G659Q1040a12520I4630A6627K28795G6884e3644B28722l1026C7766
$$ -134458 7659 88699 -112520 94630 16627 245422 76884 -53644 228722 197696 37766
15055A96868b15690F46663l02880M0403A59214a08909j3326D01151j45043H5391
$$ 196868 -215690 646663 343783 384186 159214 -108909 -122235 401151 256108 85391
15044C37930C8768P8242L07186d5329A33354J05628N811A2992c3812A75066Q4814
$$ 337930 38768 117010 424196 -45329 133354 238982 244793 12992 -33812 175066 259880
15033B59880B832b1965B01217B7353p933K06751J65330C4371J48121e7139E5153
$$ 259880 2832 -21965 201217 27353 19420 226171 391501 34371 182492 -57139 55153
15021B24104K5198G1875J24798n6021O10K9046n502n9687L61309j67953c3772
$$ 224104 249302 71875 196673 140652 141262 170308 164806 105119 466428 298475 -33772
15009C25191g7833k76704C25921H6152M18250A79235N1880a63327H4285J11802
$$ 325191 -77833 -354537 325921 86152 504402 179235 231115 -163327 84285 196087
14999A96087o7539e5474B59650j17605n4559b3705B02453o1360n1398K40009j16593
$$ 196087 128548 -55474 259650 142045 87486 -23705 202453 141093 89695 329704 213111
14988B13111B9592O2773K81096j82111K32244k02854L4542a61117B59532H4337
$$ 213111 29592 92365 373461 191350 423594 220740 255282 -161117 259532 84337
14977E9620N3973m6880J38763R6904j2247I3925f416B03312J35556A43044P101
$$ 59620 113593 66713 205476 302380 290133 93925 -6416 203312 338868 143044 150145
14966A50145a14559E4913J27509Q2561j19070o2932J37639G4496K17887l5795
$$ 150145 -114559 54913 182422 264983 145913 82981 220620 74496 292383 256588
14956B56588G5878J85464C147J09982K33693J9768j78840K03816a33854E2954
$$ 256588 75878 261342 3147 113129 346822 366590 187750 391566 -133854 52954
14945D6724K8006J06376P4854q0270q0784J5819K10441b6155A01943J37591P1314
$$ 46724 74730 181106 255960 175690 94906 110725 321166 -26155 101943 239534 310848
14934C10848N9086J72724B8378K60880B0244J87256L9694K12662I2134K06427
$$ 310848 369934 542658 28378 289258 20244 207500 247194 459856 92134 298561
14924B98561M5538B2699J80295c7295C53504n7369n2652N0268J13267O4226A60124
$$ 298561 344099 22699 202994 -37295 353504 296135 243483 293751 407018 471244 160124
14912A84567K88002c7502C82495J725m1018j34129L12287B21342b1748C22253
$$ 184567 472569 -37502 382495 384220 343202 209073 521360 221342 -21748 322253
14901I8642L68409A87514J26216K86859j53619m3231A50870O6432J44828K07213
$$ 98642 467051 187514 313730 600589 446970 403739 150870 217302 362130 569343
14891E69343k64764j1805A32299M37081B58697J54851A40320R0300j05575J22575
$$ 569343 304579 292774 132299 569380 258697 413548 140320 230620 125045 247620
14881B47620p9416J75105K63999A59344p905K04051K13864B12340r7788J2622
$$ 247620 168204 343309 607308 159344 151439 355490 569354 212340 114552 127174
14871A27174M22877k67880G0318J86002J8306r7825K37451j93175J05205O3645
$$ 127174 550051 282171 70318 256320 274626 176801 414252 221077 326282 389927
14861C89927A05617J45306J11103L7292j89570j5434K33995j1240A52299M24191
$$ 389927 105617 250923 362026 399318 209748 194314 428309 417069 152299 576490
14851E76490A13722J68484J51962l8095J49645q2566J7334P5832j82624q5193
$$ 576490 113722 282206 434168 396073 545718 463152 480486 556318 373694 288501
14841B88501K38703q0892P1093j28274J9752A58339L29102k07921K37729m482
$$ 288501 527204 446312 517405 389131 408883 158339 487441 279520 517249 512767
14831E12767B37350J42098i9574B46974L92108k73171Q7478o3386M624J05799
$$ 512767 237350 379448 -99574 246974 639082 365911 453389 390003 394627 500426
14821E00426B23425K95583l0309d5558B26547M05559n1949k20476j2247K463J71288
$$ 500426 223425 519008 488699 -45558 226547 632106 580157 359681 347434 349897 521185
14810E21185j79658l8024O5708j2392m4819K65074j06652j22339Q4380R7055q7039
$$ 521185 341527 303503 369211 356819 312000 577074 470422 348083 432463 529518 442479
14799D42479K50114B45700k1316K20401p7105K3721M63413k55083j28506N7687
$$ 442479 692593 245700 224384 444785 367680 391401 854814 599731 471225 528912
14789E28912K2361k02999J23914R5851J06498B27453O5328J6228K48951J29690
$$ 528912 551273 348274 472188 568039 674537 227453 292781 309009 557960 687650
14779F87650k22640N7796m8444J74351j02168M89601k67123L2710l40816P58m4961
$$ 687650 465010 522806 474362 648713 546545 1036146 769023 801733 460917 461675 416714
14768D16714K60717k8017j73302K4460M70151D39806j42845K66488j27205J43403
$$ 416714 677431 649414 476112 500572 970723 439806 296961 563449 436244 579647
14758E79647P5490J28295l59905L13746k26687K03836C28724K28189R4632k93815
$$ 579647 655137 783432 423527 737273 510586 714422 328724 556913 651545 357730
14748C57730L08053N518k11281J35507J6874R2481j82216P8428K8350j95376n1723
$$ 357730 665783 671301 460020 595527 612401 704882 522666 601094 629444 434068 382345
14737C82345L84944j07298J41791l31388K00586j36040J063O4616P2315j3594
$$ 382345 767289 659991 801782 470394 670980 534940 536003 600619 672934 659340
14727F59340J79207L45477E23132K67389j89162J73189Q2787j77854O4710K1021
$$ 659340 838547 1184024 523132 790521 601359 774548 857335 679481 744191 765212
14717G65212r0035J01657j35587p0531o40K39508k00679J95401O1000j5031j50653
$$ 765212 675177 776834 641247 570716 570076 809584 608905 804306 865306 850275 699622
14706F99622J06505k68027K25509k5531j68903J20972L32528j19241l5599j63742
$$ 699622 806127 538100 763609 738078 569175 690147 1022675 903434 867835 704093
14696G04093P9244j80992J15869Q9648K21414k67115o6438K47976r1887K4539
$$ 704093 783337 602345 718214 807862 1029276 762161 695723 943699 851812 876351
14686H76351j78339K3498P879M26496k12979j36458K28331J02882l6458K5269
$$ 876351 698012 721510 729389 1155885 942906 806448 1034779 1137661 1101203 1126472
14676A126472j90893p4362j30264J93919j8647m3746K17515l12431J57110R8706
$$ 1126472 935579 861217 730953 924872 906225 862479 1079994 767563 924673 1023379
14666A023379k26657J42371m4155j49375J15522o8148J49757n7005l7956J02003
$$ 1023379 796722 939093 894938 745563 861085 792937 942694 885689 847733 949736
14656I49736J15436k7555D69236M49328R4853L293K10863k66785L36128j4657
$$ 949736 1065172 1037617 469236 918564 1013417 1016710 1227573 960788 1296916 1282259
14646A282259j88944R2368Q468K40075j96455l55770J41019R8095Q1421j88367
$$ 1282259 1093315 1185683 1194151 1434226 1237771 882001 1023020 1121115 1202536 1014169
14636A014169J65434j08727M31526j96997M011k47247q9008L72399J23621k19778
$$ 1014169 1179603 1070876 1502402 1305405 1309416 1062169 973161 1345560 1469181 1249403
14626A249403r106m7745M2077p2378k736l4764J25807o3188N6825K09539k54202
$$ 1249403 1240297 1192552 1234629 1162251 1159515 1124751 1250558 1187370 1244195 1453734 1199532
14615A199532J18657p1390J13091j40280J77556M9883P3972j9147m5463J81620
$$ 1199532 1318189 1246799 1359890 1219610 1397166 1447049 1521021 1501874 1456411 1638031
14605A638031o1597k68932q7923J15067K28363J37391l5429l89573L36535P5502
$$ 1638031 1576434 1307502 1219579 1334646 1563009 1700400 1664971 1275398 1611933 1687435
14595A687435n16172L22482J46726n7494L38388j96479N1222j31119j42975L20373
$$ 1687435 1171263 1493745 1640471 1582977 1921365 1724886 1776108 1644989 1502014 1822387
14585A822387j32333K74866m77189M19375J25972n12205K51286J74087J20284
$$ 1822387 1690054 1964920 1487731 1907106 2033078 1520873 1772159 1946246 2066530
14576B066530n17273L62305N987J84073l98251L87016J04627j45981p2809K33488
$$ 2066530 1549257 1911562 1917549 2101622 1703371 2090387 2195014 2049033 1976224 2209712
14566B209712r4850L61836j54685k08973L02278L5753K32649J21057J59574J11543
$$ 2209712 2114862 2476698 2322013 2113040 2415318 2451071 2683720 2804777 2964351 3075894
14556C075894L5526R6681K02465L45391L31784L29081J079025J588181L576303
$$ 3075894 3111420 3208101 3410566 3755957 4087741 4416822 5495847 7084028 10660331
14547A0660331P455888J7643103Q450585A8762460H488361k931885R59654C180257
$$ 10660331 18116219 35759322 44209907 18762460 8488361 5556476 6516130 3180257
14538B215233l02830J69302k41847l4706k02757J41845M38986j15634K08233l18743
$$ 2215233 1912403 2081705 1839858 1805152 1602395 1744240 2183226 2067592 2275825 1957082
14528A957082N68234j97355j03193K55994j1095l51636M52196j46631K36429k81149
$$ 1957082 2525316 2327961 2224768 2480762 2469667 2118031 2570227 2423596 2660025 2378876
14518B378876R09k09714R1761L7311L71795m13J5439R1992o5259n0003K1897o8225
$$ 2378876 2379785 2170071 2261832 2299143 2670938 2670525 2685964 2777956 2712697 2662694 2684591 2616366
14506B616366K48728K47402j66968j87939k45248L80348J95031N6912k90596M7186
$$ 2616366 2865094 3112496 2945528 2757589 2512341 2892689 3087720 3144632 2854036 2901222
14496B901222K24314L8142k448j41110L0139K41203k95815K42862n1120K68342
$$ 2901222 3125536 3163678 3161230 3020120 3050259 3291462 2995647 3238509 3187389 3455731
14486C455731J74078l06403j3644Q3478J37184p3646J82297k23724L56401k59346
$$ 3455731 3629809 3323406 3309762 3393240 3530424 3456778 3639075 3415351 3771752 3512406
14476C512406O7100O94681l21502o940K02119j70631K05843k32484K48129N0845
$$ 3512406 3579506 4274187 3952685 3945745 4147864 3977233 4183076 3950592 4198721 4249566
14466D249566L2440K77103l44176l4468J99100M54086l94639L02083j12674K59505
$$ 4249566 4282006 4559109 4214933 4180465 4379565 4833651 4439012 4741095 4628421 4887926
14456D887926J64926m24399O8534J97697P3174J58952M3925J2121n6466j41082
$$ 4887926 5052852 4628453 4696987 4894684 4967858 5126810 5170735 5182856 5126390 4985308
14446D985308M90536N6852K24870j44709k90540L35055K47453K06566j55562j46753
$$ 4985308 5475844 5532696 5757566 5612857 5322317 5657372 5904825 6111391 5955829 5809076
14436E809076M68103k87789L53695p8477p0259M40430j33697K86086L6614J98959
$$ 5809076 6277179 5989390 6343085 6264608 6194349 6634779 6501082 6787168 6823782 7022741
14426G022741r478P2709j16059J87391O498J13827L64528l61786P63170J91678
$$ 7022741 7013263 7085972 6969913 7157304 7163802 7277629 7642157 7280371 8043541 8235219
14416H235219k03485J31949J04360j60221O92110j05179R1236Q8637K30792j16731
$$ 8235219 8031734 8163683 8268043 8107822 8799932 8694753 8785989 8874626 9105418 8988687
14406H988687N10081n31889N76456P9761K49075R4264J91468J78036o1492K76160
$$ 8988687 9498768 8966879 9543335 9623096 9872171 9966435 10157903 10335939 10274447 10550607
14396A0550607L55632K53613J8382J72559O935L00842K00134L35222J13350L00394
$$ 10550607 10906239 11159852 11178234 11350793 11357728 11658570 11858704 12193926 12307276 12607670
14386A2607670K16563J14998M75453K34201L26870k97048N32285J31119M58440
$$ 12607670 12824233 12939231 13414684 13648885 13975755 13678707 14210992 14342111 14800551
14377A4800551L40747J69287L91523J84824K43042M00552N92817N2268K93030
$$ 14800551 15141298 15310585 15702108 15886932 16129974 16530526 17123343 17175611 17468641
14368A7468641N25964q8635R90479J56951O23733m8206R69548K58932N58275M13152
$$ 17468641 17994605 17905970 18896449 19053400 19677133 19628927 20598475 20857407 21415682 21828834
14358B1828834M06308N75032M51197R04433L0539N19334R80928J96434R22328
$$ 21828834 22235142 22810174 23261371 24165804 24196343 24715677 25696605 25893039 26815367
14349B6815367O92625N06645R43425Q38705O75945P43729P17864P20010J079088
$$ 26815367 27507992 28014637 28958062 29796767 30472712 31216441 31934305 32654315 33733403
14340C3733403P06918J384966R09371R90142R93519J119279J211654J199940J564262
$$ 33733403 34440321 35825287 36734658 37724800 38718319 39837598 41049252 42249192 43813454
14331D3813454R85243J991745P85378K044386J387278J701528J823697J920880
$$ 43813454 44798697 46790442 47575820 49620206 51007484 52709012 54532709 56453589
14323E6453589J967739K193205K265299K228864K430515K061123K882055K652729
$$ 56453589 58421328 60614533 62879832 65108696 67539211 69600334 72482389 75135118
14315G5135118L233806K798532L150023L453954L640452M339811L662510M775922
$$ 75135118 78368924 81167456 84317479 87771433 91411885 95751696 99414206 104190128
14307A04190128M056097M469009M863163N358652N088466N754372O443648O184382
$$ 104190128 108246225 112715234 117578397 122937049 128025515 133779887 140223535 146407917
14299A46407917O923001P402618P589654Q363787Q417153R307734R626918R889284
$$ 146407917 153330918 160733536 168323190 176686977 185104130 194411864 204038782 213928066
14291B13928066J0857538J1121916J1685123J1989037J2799166J3041170J3512845
$$ 213928066 224785604 235907520 247592643 259581680 272380846 285422016 298934861
14284B98934861J3608479J3716043J4411894J4365547J4485898J3641589J3295583
$$ 298934861 312543340 326259383 340671277 355036824 369522722 383164311 396459894
14277C96459894J2541280J1408448J0233259Q134450M820726N61717J4887N24369
$$ 396459894 409001174 420409622 430642881 438777331 443598057 444159774 444174661 444699030
14269D44699030r33562n844325m312314o682188j0314209j2562830j3726750j4904544
$$ 444699030 443765468 437921143 433608829 426926641 416612432 404049602 390322852 375418308
14261C75418308j5375351j5671312j5545493j5544385j5265747j4585859j4494097
$$ 375418308 360042957 344371645 328826152 313281767 298016020 283430161 268936064
14254B68936064j3681461j3234572j0896313j1693043j1295802j0808516r830775
$$ 268936064 255254603 242020031 231123718 219430675 208134873 197326357 187495582
14247A87495582r299305r002469q195210p453556p179721p075937o638430o321853
$$ 187495582 178196277 169193808 160998598 153545042 146365321 139289384 132650954 126329101
14239A26329101n831281m778592m873931m950416m469894m598954l948334l736373
$$ 126329101 120497820 115719228 110845297 105894881 101424987 96826033 92877699 89141326
14231H9141326l261898l145996l358728l148893k941138k631813l158739k156849
$$ 89141326 85879428 82733432 79374704 76225811 73284673 70652860 67494121 65337272
14223F5337272k190622k475874j429655k039451k293144j719503j899352j694157
$$ 65337272 63146650 60670776 59241121 57201670 54908526 53189023 51289671 49595514
14215D9595514j232799j375839j186360j525865j372997j736842j079838p98704
$$ 49595514 48362715 46986876 45800516 44274651 42901654 41164812 40084974 39286270
14207C9286270q07780j216188j061042j031354j157074q79787o02692m86457j368361
$$ 39286270 38478490 37262302 36201260 35169906 34012832 33133045 32530353 32043896 30675535
14198C0675535m43434q85786n11948r42341n85038j039748m87617n80359o98361
$$ 30675535 30232101 29346315 28834367 27892026 27306988 26267240 25779623 25199264 24500903
14189B4500903m99857q63364n0497m78093q53103k82447n19276l76509m74748
$$ 24500903 24001046 23137682 23087185 22609092 21755989 21473542 20954266 20577757 20103009
14180B0103009j93776p31714n67581r9999m41165k92613m44088m23860l59905
$$ 20103009 19909233 19177519 18609938 18509939 18068774 17776161 17332073 16908213 16548308
14171A6548308l28482k06938l23343j87839k18730k95348k51229o31785N4314
$$ 16548308 16219826 16012888 15689545 15501706 15282976 14987628 14736399 14104614 14158928
14162A4158928j42223l10340m73701j38563k37652k48532j03382l44154j67066
$$ 14158928 14016705 13706365 13232664 13094101 12856449 12607917 12504535 12160381 11993315
14153A1993315m22404K67807n59261k18810O2755j41110l66865k33389P2102k45898
$$ 11993315 11570911 11838718 11279457 11060647 11123402 10982292 10615427 10382038 10454140 10208242
14143A0208242n93935M8191J28943l65310J87237m08060J85576k32021k50273
$$ 10208242 9614307 9662498 9791441 9426131 9613368 9205308 9390884 9158863 8908590
14134H908590m12253N36823m70306L268k01408k57748m2977l58055K57588k04762
$$ 8908590 8496337 9033160 8562854 8566122 8364714 8106966 8063989 7705934 7963522 7758760
14124G758760k81550J58778j21200R8379M1368l25291j11695l4641k32761M2251
$$ 7758760 7477210 7635988 7514788 7613167 7654535 7329244 7217549 7182908 6950147 6992398
14114F992398k45863Q8602l62435K53314l10278n2948k27061Q474J38104j87542
$$ 6992398 6746535 6835137 6472702 6726016 6415738 6362790 6135729 6144203 6282307 6094765
14104F094765O6251O779l47168j15911j54832J82641k66505K36821l76873m8805
$$ 6094765 6161016 6167795 5820627 5704716 5549884 5732525 5466020 5702841 5325968 5277163
14094E277163j55830J54494M2599K5771k34273j20347J90966q3708l21454j7137
$$ 5277163 5121333 5275827 5318426 5344197 5109924 4989577 5180543 5096835 4775381 4758244
14084D758244m7623M3571n0816j602k25391k1921K50357l28009J01829n4713k69541
$$ 4758244 4710621 4754192 4703376 4701774 4476383 4454462 4704819 4376810 4478639 4423926 4154385
14073D154385K33527K6338k23143K29025m47671j92245J24247k1619j22439k4446
$$ 4154385 4387912 4414250 4191107 4420132 3972461 3780216 3904463 3882844 3760405 3735959
14063C735959k0733K54267l62037L52136k85621K74743k17423K8645K37484n52845
$$ 3735959 3715226 3969493 3607456 3959592 3673971 3948714 3731291 3759936 3997420 3444575
14053C444575J15843J84120l97472m2670J30875N1483k36498r9955q4073Q6155
$$ 3444575 3560418 3744538 3347066 3304396 3435271 3486754 3250256 3150301 3066228 3152383
14043C152383k5732j29091L76310j90792j53954R3046k46306j60846j3654K75034
$$ 3152383 3126651 2997560 3373870 3183078 3029124 3122170 2875864 2715018 2701364 2976398
14033B976398j64725K77199j55142J23134m62841N6801M1151K99985k14799L6052
$$ 2976398 2811673 3088872 2933730 3056864 2594023 2650824 2691975 2991960 2777161 2813213
14023B813213k9879l08042l511J55662m7931j81881J13784l397K62986p46980
$$ 2813213 2783334 2475292 2471781 2627443 2579512 2397631 2511415 2508018 2771004 2024024
14013B024024L65835l17944k9284K29894j6607J39953l25194Q3534J60833j90839
$$ 2024024 2389859 2071915 2042631 2272525 2255918 2395871 2070677 2154211 2315044 2124205
14003B124205L34027j18391k8758m96487L37605k87321N05617j51606r9961O1968
$$ 2124205 2458232 2339841 2311083 1814596 2152201 1864880 2370497 2218891 2118930 2180898
13993B180898m0203R515K48193L39815J227677K499850N151069J6639165J8465459
$$ 2180898 2140695 2150210 2398403 2738218 3965895 6465745 11616814 28255979 46721438
13984D6721438k2215386j1469973n603809k119949j128799m46568k50203m20853
$$ 46721438 24506052 13036079 7432270 5312321 4183522 3736954 3486751 3065898
13976C065898Q866k20658k75092l40208J7439K30410j08724j27256m50536P27246
$$ 3065898 3074764 2854106 2579014 2238806 2256245 2486655 2377931 2250675 1800139 2527385
13966B527385k49293O486n5376j15304K77931l49407o2449r9130J45880k8847
$$ 2527385 2278092 2284578 2229202 2113898 2391829 2042422 1979973 1880843 2026723 1997876
13956A997876k64143n243K70899P536k79687K385j31044J91767J07683j88390
$$ 1997876 1733733 1728490 1999389 2006925 1727238 1729623 1598579 1790346 1898029 1709639
13946A709639k01559O49189q2342k82233j76252L0365J20051q0497m05146J88193
$$ 1709639 1508080 2157269 2074927 1792694 1616442 1646807 1766858 1686361 1281215 1469408
13936A469408j54K8844J52440k32494O4464j2434m6785J17416j34353O990j4207
$$ 1469408 1469254 1498098 1650538 1418044 1482508 1470074 1423289 1540705 1406352 1413342 1399135
13925A399135M39624j86998k07969L1574J67165l27401j1952O1309J35756N5546
$$ 1399135 1838759 1651761 1443792 1475366 1642531 1315130 1303178 1364487 1500243 1555789
13915A555789L3825j5836o7698j06601j2182k2293K33831j87804J09913l45720
$$ 1555789 1589614 1573778 1506080 1399479 1387297 1365004 1598835 1411031 1520944 1175224
13905A175224q3725P7333J22770j64626j84244L42445K32105l65698K60088j58397
$$ 1175224 1091499 1168832 1291602 1126976 942732 1285177 1517282 1151584 1411672 1253275
13895A253275j47890K33915j95063P5681J33170k67897J10791j08768j66528M20593
$$ 1253275 1105385 1339300 1144237 1219918 1353088 1085191 1195982 1087214 920686 1341279
13885A341279k04564l42684M82839l69347K69796L32638o08155M13812q2263j19364
$$ 1341279 1136715 794031 1276870 907523 1177319 1509957 901802 1315614 1233351 1113987
13875A113987J37998k00784J00318L8177p5038k52664J34109K98483n07308K07460
$$ 1113987 1251985 1051201 1151519 1189696 1114658 861994 996103 1294586 787278 994738
13865I94738J06627o4659r2820l35378L78239m8153J19671J26476n74027K65828
$$ 994738 1101365 1036706 943886 608508 986747 938594 1058265 1184741 610714 876542
13855H76542n776K10529j29499J68072j36020r3086k5949J17114L19133m43746
$$ 876542 870766 1081295 951796 1119868 983848 890762 864813 981927 1301060 857314
13845H57314l7418K97243k10129J11458k34107K78460j76304J15659j54861q7406
$$ 857314 819896 1117139 907010 1018468 784361 1062821 886517 1002176 847315 759909
13835G59909K75471j71419J26053j64463J62346k12919P0645K21314k8463m23148
$$ 759909 1035380 863961 990014 825551 987897 774978 845623 1066937 1038474 615326
13825F15326J77581R0795K43310l36988K5471J34448k81120j73756N16637k34440
$$ 615326 792907 883702 1127012 790024 815495 949943 668823 495067 1011704 777264
13815G77264N09414m86221k40872O14062m41071K92893k86769M6522R2625M2540
$$ 777264 1286678 800457 559585 1173647 732576 1025469 738700 785222 877847 920387
13805I20387D33072M16524L51278j98621j21713l21499K25755K79344k85258K75065
$$ 920387 433072 849596 1200874 1002253 880540 559041 784796 1064140 778882 1053947
13795A053947j67772j95571O0594J5960o9101j81778N42330m51453L2651k5630
$$ 1053947 886175 690604 751198 767158 698057 516279 1058609 607156 639807 614177
13785F14177J77033J5212J268k9479n5871j1188J59724p9665N421l7999j76960
$$ 614177 791210 806422 807690 778211 722340 711152 870876 791211 796632 758633 581673
13774E81673J40538k13340J24884J09139J60776O7206l78661P1283j12722J57730
$$ 581673 722211 508871 633755 742894 903670 970876 592215 663498 550776 708506
13764G08506k65832K85232A45086N64013A75160J78708L77989k69602K30298k43234
$$ 708506 442674 727906 145086 709099 175160 353868 731857 462255 692553 449319
13754D49319K21538j92444j9452j51664J51901M04507j30287k39702K09234L08379
$$ 449319 670857 478413 458961 307297 459198 863705 733418 493716 702950 1011329
13744A011329k17556o1085l31027L93690l81375J64816P680J71692B75657Q20509
$$ 1011329 793773 732688 401661 795351 413976 578792 586472 758164 275657 1096166
13734A096166D13153J44039k0616R5739M5322j54314J55765m0859R9114j09376
$$ 1096166 413153 557192 536576 632315 677637 523323 679088 638229 737343 627967
13724F27967j35928j36285L8764K87755K7694L3281R226o1788M4590B86915O59447
$$ 627967 492039 355754 394518 682273 709967 743248 752474 690686 735276 286915 946362
13713I46362m01646n5353o1485l4613O6781K28170j30310K38696k42685j82463
$$ 946362 544716 489363 427878 393265 460046 688216 557906 796602 553917 371454
13703C71454K2311J75617J95254j05933k77392J7852K6877o7785K83386k22453
$$ 371454 393765 569382 764636 658703 381311 399163 426040 358255 641641 419188
13693D19188j78811N14304q0726k44216A29306J82513K78191j48173J249N3717
$$ 419188 240377 754681 673955 429739 129306 311819 590010 441837 443086 496803
13683D96803j98263N08823j68004j60720m7698M8697o0536l6552r3834J59009
$$ 496803 298540 807363 639359 478639 430941 479638 419102 382550 288716 447725
13673D47725j80647K12266k2564j48253K14330N8553n6355K76054C48173K13012
$$ 447725 267078 479344 456780 308527 522857 581410 525055 801109 348173 561185
13663E61185n9257L5456l7661p800j01398J79099k22204K59764I0030L50227k4984
$$ 561185 501928 537384 499723 491923 390525 569624 347420 607184 90030 440257 415273
13652D15273j12562J79055K68062A83496K49771M05780q5381j94677k01124O523
$$ 415273 302711 481766 749828 183496 433267 839047 753666 558989 357865 364388
13642C64388r5502K53543F8122J08686L42315N0474O6969q1501B03257o4165L78438
$$ 364388 268886 522429 68122 176808 519123 569597 636566 555065 203257 139092 517530
13631E17530j96725J9245j69112B7332L31248p4762n7620L92204j28887j47726
$$ 517530 320805 340050 170938 27332 358580 283818 226198 618402 489515 341789
13621C41789q3585M262J24641A83754J47072r974K99823B02751J24671k1695H9913
$$ 341789 258204 262466 387107 183754 330826 320852 620675 202751 327422 305727 89913
13609D60656q8015j29122b7308A44850J86123j37269K8495J09166F3204M73741
$$ 460656 372641 243519 -27308 144850 330973 193704 222199 331365 63204 536945
13599E36945j28808p9022K56938k54664n8274J22907K66132C30008j01007J82012
$$ 536945 408137 329115 586053 331389 273115 396022 662154 330008 229001 411013
13589D11013M8192j79179r7602q42J74873j5755J59884q7011j35295J60665k7340
$$ 411013 459205 280026 182424 181582 356455 340700 500584 413573 278278 438943 411603
13578D11603n0250n1430J9633G8184L03794l5572D4506L07368Q653A03584J9043
$$ 411603 361353 309923 329556 78184 381978 346406 44506 351874 360527 103584 122627
13567A22627K24648I9650J14313Q1544m0381J70972Q9399k08485J80610q8098
$$ 122627 347275 99650 213963 295507 255126 426098 515497 307012 487622 399524
13557C99524o1245J14946l2666J40696j10771c8578D32297a7317B00227m8342
$$ 399524 338279 453225 420559 561255 450484 -38578 432297 -17317 200227 151885
13547A51885L36360d88D14576l304a38723C31156o2588K13516j66056C2921K94278
$$ 151885 488245 -488 414576 411272 -138723 331156 268568 482084 316028 32921 327199
13536C27199m491j47662J07225R023J63267K6872r0454j00727A08609K01939J93900
$$ 327199 322708 175046 282271 291294 454561 481433 390979 290252 108609 310548 504448
13525E04448K02116C42052r4920O9407e7640A37808J63263J58155A61232J14317
$$ 504448 706564 342052 247132 316539 -57640 137808 301071 459226 161232 275549
13515B75549m4829L6110N5380O2828F9988J21023N4167K34458N2844j19685q4529
$$ 275549 230720 266830 322210 385038 69988 191011 245178 479636 532480 412795 328266
13504C28266p7453r2411K72269r9998F1664K78473j08901o6166a17665B63562
$$ 328266 250813 158402 430671 330673 61664 340137 231236 165070 -117665 263562
13493A09173K34342P3954F6582K29772J35537j82620k0632M3984D894J02446J20070
$$ 109173 343515 417469 66582 296354 431891 249271 228639 272623 4894 107340 227410
13482B27410a96026c1589A4823J47927M45710B57855j22862L5668K30491A47199
$$ 227410 -196026 -31589 14823 162750 608460 257855 134993 170661 401152 147199
13471A90107K67313A02927J15334D2149L35381F9349d656A19394a34445B37836
$$ 190107 457420 102927 218261 42149 377530 69349 -4656 119394 -134445 237836
13460A41218O8827J32904j56228G6071K67011P774A52873K08089J17994g7876
$$ 141218 210045 342949 186721 76071 343082 350856 152873 360962 478956 -77876
13449A39806l29K78809k09017K99944m2225h843C17412n8842h1395B57657N77
$$ 139806 139477 418286 209269 509213 466988 -8843 317412 258570 -81395 257657 258234
13438B58234J23091A1237K76840a01446A66946j3153K39660F7538b0069C77277
$$ 258234 381325 11237 288077 -101446 166946 153793 393453 67538 -20069 377277
13427F4755Q4672g9091C46887A45843E0903N3722h3578B8444P5743J13113J17986
$$ 64755 149427 -79091 346887 145843 50903 104625 -83578 28444 104187 217300 335286
13416C35286o4418K03451A62434J59929j28306J68112A40018O7098R9459M1677
$$ 335286 270868 474319 162434 322363 194057 362169 140018 207116 306575 348252
13406C48252A71520J49356E9008M6913N7689D1806K17795b35682A57080C4616
$$ 348252 171520 320876 59008 105921 163610 41806 259601 -235682 157080 34616
13395F9730M06645j9797l5542q3521A67944q299i0899B42239c1162E57903A49630
$$ 69730 476375 456578 421036 337515 167944 159645 -90899 242239 -31162 557903 149630
13383A07953e9994A88428p8169D0618M597i6571E58183B18617J59717a12966D51744
$$ 107953 -59994 188428 110259 40618 45215 -96571 558183 218617 378334 -112966 451744
13371D1970N7377N9301J4316k999J50396j17984o1967a01828c2450h672C37967
$$ 41970 99347 158648 172964 169965 320361 202377 140410 -101828 -32450 -8672 337967
13359C17708p7892e8435A80807o5233K9600a53964A05537c9064A38254J30493
$$ 317708 239816 -58435 180807 115574 145174 -153964 105537 -39064 138254 268747
13349B68747I5579O3579M0315n3656A0359M45949E0012N5803J53868Q546Q9960
$$ 268747 95579 159158 199473 145817 10359 456308 50012 105815 259683 268229 358189
13338C58189A75307O5336l1553O817R7449g0081A16122K04234q5888b56563D89067
$$ 358189 175307 240643 209090 215907 313356 -70081 116122 320356 234468 -256563 489067
13326B93435J47723A53609A1164L20917K06060k06565L1018G5765K66393A51450
$$ 293435 441158 153609 11164 332081 538141 331576 362594 75765 342158 151450
13315A44891J55081A07911m4616J83066N3674a8324A44457h7765C07631B8636
$$ 144891 299972 107911 63295 246361 300035 -18324 144457 -87765 307631 28636
13304a09990d5569D3718J7647a5005B7145a10358E77061k73522A00349j8770K3047
$$ -109990 -45569 43718 61365 -15005 27145 -110358 577061 303539 100349 81579 104626
13293A04626F978g9975A75683C2636K9916K94017d0671B913j108L16918r0764
$$ 104626 6978 -79975 175683 32636 62552 356569 -40671 2913 1805 318723 227959
13282B27959C2349K64542K0208o8246o3108G9666d3404B45694f9759A21470L28287
$$ 227959 32349 296891 317099 248853 185745 79666 -43404 245694 -69759 121470 449757
13271D49757A34256n8626c3016B63553E0850a49558A39158f933C02309k9479p8723
$$ 449757 134256 75630 -33016 263553 50850 -149558 139158 -6933 302309 272830 194107
13260A94107D2188J68627P2960c7647j57859A63828p4718C605a19110I7479K00397
$$ 194107 42188 210815 283775 -37647 -195506 163828 89110 3605 -119110 97479 297876
13249B97876o71l4380J07596I3702k847e0611B53449J0389B0878M08681a8352
$$ 297876 297205 262825 370421 93702 90855 -50611 253449 263838 20878 429559 -18352
13237B48996I9813P1355a70808A69306o1166R2079a7620A92242q795k7091Q9129
$$ 248996 99813 171168 -170808 169306 108140 200219 -17620 192242 183447 156356 245485
13226B45485l3083J78300A30440J81609o181a92874D11722a95516A35897a59710
$$ 245485 212402 390702 130440 312049 305868 -192874 411722 -195516 135897 -159710
13215c12018A49599p0060J50773A05569Q2674n1357N7729E2063J11214d8564C13305
$$ -312018 149599 79539 230312 105569 188243 136886 194615 52063 163277 -48564 313305
13203D37191E3188R4555J97023o2244f0688a2704H2822a05849r7372C51966e7338
$$ 437191 53188 147743 344766 282522 -60688 -12704 82822 -105849 -203221 351966 -57338
13191A0704K29908R6211a82787c964C15758j01926A01614b05368e5499k3058l8156
$$ 10704 240612 336823 -182787 -3964 315758 213832 101614 -205368 -55499 -78557 -116713
13180a16713C46737j60480F219K02012j03956k8623a0439A59176b6839A56801
$$ -116713 346737 186257 6219 208231 104275 75652 -10439 159176 -26839 156801
13169B57186d9983H9975J18477i6436A90457e1754B63659D4095P2747K49953o0593
$$ 257186 -49983 89975 208452 -96436 190457 -51754 263659 44095 116842 366795 306202
13158C06202a04105A4119K90613a40057b9628p7083I5913P5961b6891A76121a11821
$$ 306202 -104105 14119 304732 -140057 -29628 -106711 95913 171874 -26891 176121 -111821
13146a39151B39257q2261P2616m3028J72254A29571J15166b20237d6729A33076
$$ -139151 239257 156996 229612 186584 358838 129571 244737 -220237 -46729 133076
13135e1607n8086C34642D6571J35631i5882A24038K4901b59650c5671A43680D7859
$$ -51607 -109693 334642 46571 182202 -95882 124038 148939 -259650 -35671 143680 47859
13123d1806j4310A06270b03048H7925J33358B9873g8841C56201A20478D3219J90593
$$ -41806 -56116 106270 -203048 87925 221283 29873 -78841 356201 120478 43219 233812
13112B33812b5873d154A15749J88366I3528J05981m9987l6036m7662c88508G5109
$$ 233812 -25873 -4154 115749 304115 93528 199509 149522 113486 65824 -388508 75109
13100e8200C3492J4213f2260B4213K14287j19151b37322B80750A5598L61019F5090
$$ -58200 33492 47705 -62260 24213 238500 119349 -237322 280750 15598 376617 65090
13088a62087A66530h8085C0902a19720I1216b38115a12422M737B9896J33855N7918
$$ -162087 166530 -88085 30902 -119720 91216 -238115 -112422 -107685 29896 163751 221669
13077B21669n4735j6107J35350J1258j43091b01897b2542D4187J44865o2201L8535
$$ 221669 166934 150827 286177 297435 154344 -201897 -22542 44187 189052 126851 165386
13066A65386a92456r3331B94609M554A28174N3020q9710J82074a3393A95476j6462
$$ 165386 -192456 -285787 294609 299163 128174 181194 91484 273558 -13393 195476 179014
13055A79014K3905k9328D9192J49893H8241J32702a33704D0695B071K86391A24360
$$ 179014 202919 173591 49192 199085 88241 220943 -133704 40695 2071 288462 124360
13043C05261j39361J14496d2962C16752b36981B85285n8174H841K49174b5589
$$ 305261 165900 280396 -42962 316752 -236981 285285 227111 8841 258015 -25589
13032B97666P4250A50492J03953r5778J10825a48688C78002H2190r170a10309
$$ 297666 371916 150492 254445 158667 269492 -148688 378002 82190 73020 -110309
13021a03082H1289j4195e647A34296M72917B24582B9296R188N5455a70524A23294
$$ -103082 81289 67094 -5647 134296 607213 224582 29296 38484 93939 -170524 123294
13009B26852F2332c2851C14183q3527D4667j2000K89352L2131a3192B19139I4016
$$ 226852 62332 -32851 314183 230656 44667 32667 322019 354150 -13192 219139 94016
12997a4597A05354j3731K20704A27141k3911b0784j61473D02912q9590j55456
$$ -14597 105354 91623 312327 127141 103230 -20784 -182257 402912 313322 157866
12987A57866J43742B122c1209H2879K41919F306Q9442b43400B74238d4559B4772
$$ 157866 301608 2122 -31209 82879 324798 6306 95748 -243400 274238 -44559 24772
12975A47906K10908r5614P0754F6123a15867B52458h4686r6280a1259n0802m2332
$$ 147906 358814 263200 333954 66123 -115867 252458 -84686 -180966 -11259 -62061 -104393
12964a04393m9225A74798h7694a7597B9641M9622h2663A89775M6289a26857M6880
$$ -104393 -153618 174798 -87694 -17597 29641 79263 -82663 189775 236064 -126857 -79977
12953g9977A24750M2320D2434O6545A9477a22638A27115e7139B7501d1599p0432
$$ -79977 124750 167070 42434 108979 19477 -122638 127115 -57139 27501 -41599 -112031
12942a12031A4935j124K4000J69734c5077j22592d9862C12678a26682l0541F2257
$$ -112031 14935 13811 37811 207545 -35077 -157669 -49862 312678 -126682 -157223 62257
12930b7317j44170A22775a78099F3216f1520l9758C56550b10359A6129J02140
$$ -27317 -171487 122775 -178099 63216 -61520 -101278 356550 -210359 16129 118269
12920A18269L2880F6600B2995c647H0026L9910E3874M5157a09362N2800A07940
$$ 118269 151149 66600 22995 -3647 80026 119936 53874 99031 -109362 -56562 107940
12908a69972A80097n5185j5135J44509j03766c95058A10327a33207G7272A4619
$$ -169972 180097 124912 109777 254286 150520 -395058 110327 -133207 77272 14619
12897a28350e8255A23435n3782h8746C88049b8544A05090f4252C4995J37089N2276
$$ -128350 -58255 123435 69653 -88746 388049 -28544 105090 -64252 34995 172084 224360
12886B24360B6372O866J06722E2249L05643a63992f5409j2157J5561G1811C3804
$$ 224360 26372 33238 139960 52249 357892 -163992 -65409 -77566 -62005 71811 33804
12874I0487M2509B7782M37142A05624a59968C3565d2882A99216d2371m3237F71
$$ 90487 132996 27782 464924 105624 -159968 33565 -42882 199216 -42371 -85608 671
12862f7572j30401a7687A03355b50253b9602B77116B5134a28302A02704a21004
$$ -67572 -197973 -17687 103355 -250253 -29602 277116 25134 -128302 102704 -121004
12851B17532a03830D4678i1448C41257E1332L2445J1473J38672I4307P3056l4032
$$ 217532 -103830 44678 -91448 341257 51332 83777 95250 233922 94307 167363 133331
12840A33331K6178K3776o0340K19232q8712p8849M8056K5377b65294a24316D7442
$$ 133331 159509 183285 122945 342177 253465 174616 222672 248049 -265294 -124316 47442
12828A55068D4337d2042m13n7239l54313A00479a01954B35329o0896G3155j8904
$$ 155068 44337 -42042 -42455 -99694 -454007 100479 -101954 235329 174433 73155 54251
12817E4251a69786j07323B5282K9467a28793J2979A39865c96262H7079A9422O7781
$$ 54251 -169786 -277109 25282 54749 -128793 -115814 139865 -396262 87079 19422 87203
12806H7203a35937j12078e1219l2309k09785R1351c7719H4877b54495D1371h2352
$$ 87203 -135937 -248015 -51219 -83528 -293313 -201962 -37719 84877 -254495 41371 -82352
12794C85816g1734B6569P6111e160B6044g7311B6635J14063M1756q0481l3819
$$ 385816 -71734 26569 102680 -5160 26044 -77311 26635 140698 182454 101973 68154
12783F8154a0806B2204a62850A17840b46753A85321G6068c86189a75639a7286
$$ 68154 -10806 22204 -162850 117840 -246753 185321 76068 -386189 -175639 -17286
12772B15693r0884n3922c7793j36578c856q4602A55968k4401f44n6884o8992G2573
$$ 215693 124809 70887 -37793 -174371 -3856 -88458 155968 131567 -644 -57528 -126520 72573
12759b54713n5220d6635A99693d0467F8522J07508B1592J82783B1031a10359n7325
$$ -254713 -309933 -46635 199693 -40467 68522 176030 21592 204375 21031 -110359 -167684
12748a67684f4116l0420A76578F3795R7903e8433A16438L6795P1735J23261q7845
$$ -167684 -64116 -94536 176578 63795 161698 -58433 116438 153233 224968 348229 260384
12737B60384l3532r680o8872J6661r655E8298a13085A28921b2686G1229L06246
$$ 260384 226852 217172 148300 164961 155306 58298 -113085 128921 -22686 71229 377475
12726C77475G0775J38006r3155a5389j33648e682A41047l5132a36988A78531a53390
$$ 377475 70775 208781 115626 -15389 -149037 -5682 141047 105915 -136988 178531 -153390
12714c9628I8728d843l9160I7967J40277G4488e3549C71808A33851J00419r3000
$$ -39628 98728 -4843 -44003 97967 238244 74488 -53549 371808 133851 234270 141270
12703A41270J33353I4003a29360B22716l4571f1189A83635J35289L6268m3764
$$ 141270 274623 94003 -129360 222716 188145 -61189 183635 318924 355192 311428
12693C11428j21624g6813q0389A76061K18779a30094F0075J06745E7452Q502g6480
$$ 311428 189804 -76813 -157202 176061 394840 -130094 60075 166820 57452 65954 -76480
12681C3239K6898g772C92758q4015a2051B25429G7208b5735C57406G407Q736i734
$$ 33239 60137 -7772 392758 308743 -12051 225429 77208 -25735 357406 7407 16143 -9734
12668A26563g8431L0719E7945a70899A25506m6701a03253A68474Q6478E4117O9450
$$ 126563 -78431 -47712 57945 -170899 125506 78805 -103253 168474 254952 54117 123567
12657A23567E9669P3309A4460K66101g0083A12658m0458J21397a68249A06982
$$ 123567 59669 132978 14460 280561 -70083 112658 72200 193597 -168249 106982
12646f3886C82059j62351o8350m3162J83571d8719f705j81832A40330J92983a2879
$$ -63886 382059 219708 151358 108196 291767 -48719 -6705 -188537 140330 333313 -12879
12634c32023A39064a06277C03839O9801j57203r0864b5869B28843F612J51492
$$ -332023 139064 -106277 303839 373640 216437 125573 -25869 228843 6612 158104
12624A58104F4680d1188J4196D15038I7123L9619J15472b04221C568a12595A48172
$$ 158104 64680 -41188 -26992 415038 97123 136742 252214 -204221 3568 -112595 148172
12612A21570L4496k7717b0818p4810G1745i0900C838i1566a8868A23513n5089
$$ 121570 156066 128349 -20818 -95628 71745 -90900 3838 -91566 -18868 123513 68424
12601F8424l0310N1508h8067A71853K07299j84345N0716G9682K06592A17774J53734
$$ 68424 38114 89622 -88067 171853 379152 194807 245523 79682 286274 117774 271508
12590B71508d7401C18574h5806G589a36643I5316a55530e6383A08108O6811N1673
$$ 271508 -47401 318574 -85806 7589 -136643 95316 -155530 -56383 108108 174919 226592
12579B26592c24132A58011n9504e1842D1337d9616G6834a18804B29337a36647
$$ 226592 -324132 158011 98507 -51842 41337 -49616 76834 -118804 229337 -136647
12568a41966H3098k8118J84397f661E9586L0994a79490Q4584A98603E4127a88191
$$ -141966 83098 54980 239377 -6661 59586 90580 -179490 -94906 198603 54127 -188191
12556B83930a68638D9458J69776F6094K52160b5060A2132b1041A83410g235j83343
$$ 283930 -168638 49458 219234 66094 318254 -25060 12132 -21041 183410 -7235 -190578
12545a90578r3532H7283n526c25468F0236c39004a25496E8847j7565I77L26877
$$ -190578 -284110 87283 81757 -325468 60236 -339004 -125496 58847 41282 977 327854
12534C27854A26256m4379M8347n2346Q8144A760J85902n3098b03950f8493b5825
$$ 327854 126256 81877 130224 77878 166022 1760 187662 134564 -203950 -68493 -25825
12522A76355K3615e0885F7747k1162b8319B24354I0548J70033e0397C50751f0031
$$ 176355 199970 -50885 67747 46585 -28319 224354 90548 260581 -50397 350751 -60031
12510b06451A15344m3188G780K71357H6597J47596r6460j7091C9491g5214m0827
$$ -206451 115344 72156 7780 279137 86597 234193 137733 120642 39491 -75214 -116041
12499a16041m1468A15306J65996b04228E3020k6202a9513H6841K5368b55486h3486
$$ -116041 -157509 115306 281302 -204228 53020 26818 -19513 86841 112209 -255486 -83486
12487C2687K39255A9503a10455j14933A37384J31689p4719m995c12099B8175J14837
$$ 32687 271942 19503 -110455 -225388 137384 269073 194354 189359 -312099 28175 143012
12476A43012a6484B59322k457g0125F5034g7513I839a94955C1914b7136I0980
$$ 143012 -16484 259322 256865 -70125 65034 -77513 9839 -194955 31914 -27136 90980
12464C08564p1776A2466P4091F286K46420j15873a62328A6203c14431A10401D76
$$ 308564 236788 12466 86557 6286 252706 136833 -162328 16203 -314431 110401 476
12452F1467j2357K55361A4164b367E6819R220a38257H8720m1378c89942A20697
$$ 61467 49110 304471 14164 -2367 56819 66039 -138257 88720 47342 -389942 120697
12440F0237N3147d18193e0285B72190p3374f4690j18822Q0243F9463g2156J6529
$$ 60237 113384 -418193 -50285 272190 198816 -64690 -183512 -103269 69463 -72156 -55627
12429e5627l0640M1495H2604i0687J8553B0330L21198a05293M1541o0661B09435
$$ -55627 -86267 -44772 82604 -90687 -72134 20330 341528 -105293 -63752 -124413 209435
12417C41012A13764a19883k7961A14879a07547H6722g5844c0599j7054A08066
$$ 341012 113764 -119883 -147844 114879 -107547 86722 -75844 -30599 -47653 108066
12406A64193D8066K02030f303k07087A28810K27513j33287b82094D079J36868
$$ 164193 48066 250096 -6303 -213390 128810 356323 223036 -282094 4079 140947
12396A40947e5683j74354d518A61558m4227b33615d8672O398D1301c00144d796
$$ 140947 -55683 -230037 -4518 161558 117331 -233615 -48672 -42274 41301 -300144 -4796
12384b30911A8170c20640G1339a49380P1582E8777J64328a85524b3322D0441Q1936
$$ -230911 18170 -320640 71339 -149380 -77798 58777 223105 -185524 -23322 40441 122377
12373A22377M6834q1985j9148e0939A21384b15535A46134f7253J3914B4935d5455
$$ 122377 169211 87226 68078 -50939 121384 -215535 146134 -67253 -53339 24935 -45455
12361a93993B14011J8913r6173L4659a06166A36378L7273K26673G0070J23066
$$ -193993 214011 232924 136751 171410 -106166 136378 173651 400324 70070 193136
12351A93136n2932c9169e570F5924a07595c9572F5640J8531g0937G6895j7840
$$ 193136 140204 -39169 -5570 65924 -107595 -39572 65640 84171 -70937 76895 59055
12340E9055a2356B41942p1562i2682b5174m5549b4084j38830l1565A43709J50328
$$ 59055 -12356 241942 170380 -92682 -25174 -70723 -24084 -162914 -194479 143709 294037
12329B94037a96719j66910A39431P1815J03237a8339B70166e1728l10044C38201
$$ 294037 -196719 -363629 139431 211246 314483 -18339 270166 -51728 -361772 338201
12318c24100a54356D8776K04564a37079l1011i609B35926b67217d9649k67793
$$ -324100 -154356 48776 253340 -137079 -168090 -9609 235926 -267217 -49649 -317442
12308c17442B40162A6626h0263L4094B2513B260d39311A18453b6394j23790M2968
$$ -317442 240162 16626 -80263 -46169 22513 2260 -439311 118453 -26394 -150184 -107216
12297a07216H3947P4767m1162a21511j26171H3893J54941A00407m607a62656C4008
$$ -107216 83947 158714 117552 -121511 -247682 83893 238834 100407 95800 -162656 34008
12285A98391E2027L84398e2090A31239M9599l9627a36318A48022B6472D071K05678
$$ 198391 52027 436425 -52090 131239 180838 141211 -136318 148022 26472 4071 209749
12274B09749K06141j16457F7917A6535b2333A30993J81669G512Q8538A1242g1821
$$ 209749 415890 299433 67917 16535 -22333 130993 312662 7512 96050 11242 -71821
12262A08903Q0110a42445B28690a18647j26920Q1550B12692K17839C7793b11H9732
$$ 108903 189013 -142445 228690 -118647 -245567 -164017 212692 430531 37793 -211 89732
12250C74967j85748O15D574R2436a52076M2136F3463c57586J66787G5860b13702
$$ 374967 189219 189834 4574 97010 -152076 -109940 63463 -357586 -190799 75860 -213702
12238C26248a4346I5303L70915j36464d2889E8250J30709J9671d5175A26193K75804
$$ 326248 -14346 95303 466218 329754 -42889 58250 188959 208630 -45175 126193 401997
12227D01997A49306N2769J3804J9644O6125p0174J78527l0633j41571f1663C604
$$ 401997 149306 202075 215879 235523 301648 231474 410001 379368 237797 -61663 3604
12215A66805k1005P9846a59325A96546Q0633N7584i5127A94719D9897D87J80473
$$ 166805 145800 225646 -159325 196546 277179 334763 -95127 194719 49897 487 180960
12204A80960J21812a23010F5737J22663J29958c0428B83680B2672J06782n220
$$ 180960 302772 -123010 65737 188400 318358 -30428 283680 22672 129454 124234
12194A24234K099L9665K57354B10257h9765B55909C2323J60164d4616a6537r5759
$$ 124234 126333 165998 423352 210257 -89765 255909 32323 192487 -44616 -16537 -112296
12183a12296m7836B15822D8461J58606A03217D4563L6256L20222I9561L75934
$$ -112296 -160132 215822 48461 207067 103217 44563 80819 401041 99561 475495
12173D75495A13645J38848a78693C04943A21890n1039J48772I5583b35335C38613
$$ 475495 113645 252493 -178693 304943 121890 70851 219623 95583 -235335 338613
12162e4758B02491J17586G091P3813a79832a5490j89678d6769j92849P5105C2001
$$ -54758 202491 320077 7091 80904 -179832 -15490 -205168 -46769 -239618 -164513 32001
12150A63393l371i8133m4727j08774B77546G5535f1107A05819C7346K18707F6794
$$ 163393 160022 -98133 -142860 -251634 277546 75535 -61107 105819 37346 256053 66794
12138A55545a34010L7050A714J62089f6548A22846a05718p1646l9964L1038c3731
$$ 155545 -134010 -96960 1714 163803 -66548 122846 -105718 -177364 -217328 -186290 -33731
12126e8644p3702G2669b9015C2059L6584c44004A43655k0172a7038j3506G6417
$$ -58644 -132346 72669 -29015 32059 68643 -344004 143655 123483 -17038 -30544 76417
12114A41156a55100B91901i3787A23403d1070B33453b3367k27388H0697k7831
$$ 141156 -155100 291901 -93787 123403 -41070 233453 -23367 -250755 80697 52866
12104E2866i0883K6802a7858D6243a63088A6321a41371O6507F70M1338K96582
$$ 52866 -90883 -64081 -17858 46243 -163088 16321 -141371 -74864 670 42008 338590
12093C38590n6252b4243l28009A53895c9297n8123n868B26635j4760B4107K20891
$$ 338590 282338 -24243 -352252 153895 -39297 -97420 -103288 226635 211875 24107 244998
12082B44998A5880L9049b0245B19759I6958b02760R8415k8698B68436D3817K44529
$$ 244998 15880 54929 -20245 219759 96958 -202760 -104345 -133043 268436 43817 288346
12071B88346b5800B82612B7962O25153N44988M89725E42295Q8017l00698A52735
$$ 288346 -25800 282612 27962 653115 1198103 1687828 542295 630312 329614 152735
12060h3241C30549H0223j5360L3626R3028a08248B01738m1131E4009a24167G7592
$$ -83241 330549 80223 64863 98489 191517 -108248 201738 160607 54009 -124167 77592
12048f1075b0432j10696m6059e5688A04677a522n7527A85992m8150J15420d4255
$$ -61075 -20432 -131128 -177187 -55688 104677 -1522 -59049 185992 137842 253262 -44255
12036a02184B5057M55902D7609d8302k87601B05446h9724F4802a09667A5374b86617
$$ -102184 25057 480959 47609 -48302 -335903 205446 -89724 64802 -109667 15374 -286617
12024e4028A81814k4399b08271H2302a1632C51522a51127A77959R6981J83197
$$ -54028 181814 157415 -208271 82302 -11632 351522 -151127 177959 274940 458137
12014D58137b40774c490F4061b90535G033L98210H063K55612a30472B50765j22599
$$ 458137 -240774 -3490 64061 -290535 7033 405243 8063 263675 -130472 250765 128166
12003A28166i0098k3012A78918b37118F6056d775m2713A37663b10217r569b4653
$$ 128166 -90098 -113110 178918 -237118 66056 -4775 -47488 137663 -210217 -219786 -24653
11991F5651l205B8999J12768a13213H8965a35038j28701G3898a69112P4926j50616
$$ 65651 62446 28999 141767 -113213 88965 -135038 -263739 73898 -169112 -94186 -244802
11980b44802A10038J68111a95602I0778j4835G695L3027b37028R7837H7436L49395
$$ -244802 110038 278149 -195602 90778 75943 7695 40722 -237028 -139191 87436 436831
11969D36831h1355g200k406A24459l2648a22766F8067b92811J23449j43877E2673
$$ 436831 -81355 -7200 -9606 124459 91811 -122766 68067 -292811 -169362 -313239 52673
11957b7391j541j67976g5706A09418g724k44859I7859g7254A8607a06067A46598
$$ -27391 -28932 -196908 -75706 109418 -7724 -252583 97859 -77254 18607 -106067 146598
11945B39275a08254j80102A23088B367c3380A45669a85612O7201D66376a28340
$$ 239275 -108254 -288356 123088 2367 -33380 145669 -185612 -118411 466376 -128340
11934e9552A93175I1510c38946B80658g5897k2595b921D5166L29850b43260N0779
$$ -59552 193175 91510 -338946 280658 -75897 -98492 -2921 45166 375016 -243260 -192481
11923a92481p0338A41496i3095j24512A93299h0533L3841H4751K10a28979k14193
$$ -192481 -262819 141496 -93095 -217607 193299 -80533 -46692 84751 84961 -128979 -343172
11912c43172B43931a37514A09508a51719b6278a2292j80967A23139M2728b55127
$$ -343172 243931 -137514 109508 -151719 -26278 -12292 -193259 123139 165867 -255127
11901b10969h1970F0951g0737B64534H0499Q5884b32275b7340k83123a11165A0147
$$ -210969 -81970 60951 -70737 264534 80499 166383 -232275 -27340 -310463 -111165 10147
11889A89344q1865c7393D6214a05036N1650j34557C26492d9002q7896l08361a80094
$$ 189344 107479 -37393 46214 -105036 -53386 -187943 326492 -49002 -136898 -445259 -180094
11877I6747G962J80343c47405a15073B1011J7182L12837j16637k3577j5504b6071
$$ 96747 7962 188305 -347405 -115073 21011 38193 351030 234393 210816 195312 -26071
11865A39143a94447A7291O8193j1738c91933i7558J0425j96172a3263F4961b16324
$$ 139143 -194447 17291 85484 73746 -391933 -97558 -87133 -283305 -13263 64961 -216324
11853C2433a01591A79666f5300B2124a29583E2372b55583H4580Q2801J39643b4715
$$ 32433 -101591 179666 -65300 22124 -129583 52372 -255583 84580 167381 307024 -24715
11841c04588B1989K8607c17826A22361e9130A65003b64530I810J19882k3897Q3651
$$ -304588 21989 50596 -317826 122361 -59130 165003 -264530 9810 129692 105795 189446
11830A89446J07908g2990k00475J17175j2830Q4283j1678p8234N4834D9664P2630
$$ 189446 297354 -72990 -273465 -156290 -169120 -84837 -96515 -174749 -119915 49664 122294
11819A22294J9346a66508I3844k786K13026E187a60331N6402e559D40704H5344
$$ 122294 141640 -166508 93844 91058 304084 5187 -160331 -103929 -5559 440704 85344
11807B12596C0826c60087i402l50344J79817M1962r3928e9474J1438j14453b7994
$$ 212596 30826 -360087 -9402 -359746 -179929 -137967 -231895 -59474 -48036 -162489 -27994
11795a13725B37160e704l22972d2526e390A14162L21071a82074A43173d1496q6325
$$ -113725 237160 -5704 -328676 -42526 -5390 114162 435233 -182074 143173 -41496 -127821
11784a27821H0169h4727l0789D00342a43655A6669d859B48172I2521a20830B0828
$$ -127821 80169 -84727 -115516 400342 -143655 16669 -4859 248172 92521 -120830 20828
11772e6977B4437e2605E2031d6665k9333A04929a1212l5510D7700a76430I3009
$$ -56977 24437 -52605 52031 -46665 -75998 104929 -11212 -46722 47700 -176430 93009
11760C588A097a34744D13861f7448B26068c32164i3578G9695l488J34372d03232
$$ 3588 1097 -134744 413861 -67448 226068 -332164 -93578 79695 76207 210579 -403232
11748H2027a26997a5392j34062A46063M2837a23029A16664M6966J04986a10318
$$ 82027 -126997 -15392 -149454 146063 188900 -123029 116664 163630 268616 -110318
11737a1925C76988d2968A05646d8586A9127a04905C54477a92139G1800a64190
$$ -11925 376988 -42968 105646 -48586 19127 -104905 354477 -192139 71800 -164190
11726D6828a11156r56I3641d7005E9852h3329p3233A83225J90601a854l83791
$$ 46828 -111156 -112112 93641 -47005 59852 -83329 -156562 183225 373826 -1854 -385645
11715c85645B5572h5313C4473p713J72536J4046A7553f2548j4192A72335f2696
$$ -385645 25572 -85313 34473 26760 199296 213342 17553 -62548 -76740 172335 -62696
11703f8909K6182A10022B7162Q967J9074I149N4719A6674b2482B40552a6867A54190
$$ -68909 -42727 110022 27162 36129 55203 9149 63868 16674 -22482 240552 -16867 154190
11690e8331D3170O7892N1458a17522B77011f4634j9346o273B25096N9271G4963
$$ -58331 43170 111062 162520 -117522 277011 -64634 -83980 -90253 225096 284367 74963
11678I5786J07438a73999K3347B10428J01899C6163i3065c674m2416B87474p5685
$$ 95786 203224 -173999 -150652 210428 312327 36163 -93065 -3674 -46090 287474 211789
11667B11789p560E5489f9082B5230J05451H828K06874d2746A91283b18663G2877
$$ 211789 204229 55489 -69082 25230 130681 8828 215702 -42746 191283 -218663 72877
11655c3065C56137D4504f3523E85240a95430P9863B81119M2786d7341C13994j25040
$$ -33065 356137 44504 -63523 585240 -195430 -115567 281119 323905 -47341 313994 188954
11644A88954C5128c9745A42785f1998q7248D6901g8845C6882i4048Q185B55845
$$ 188954 35128 -39745 142785 -61998 -149246 46901 -78845 36882 -94048 -85863 255845
11632b63705C85325C233c76304G0499d7592A43244J17104A21219j9409k5108K74334
$$ -263705 385325 3233 -376304 70499 -47592 143244 260348 121219 101810 76702 351036
11621C51036f2156A60169D2559K97167B5901Q1721M5320h0539j98932B28387K6923
$$ 351036 -62156 160169 42559 339726 25901 107622 152942 -80539 -279471 228387 255310
11610B55310c9124A05220l419a58864e0071A76169A0298c5701j99507D9200J6965
$$ 255310 -39124 105220 101801 -158864 -50071 176169 10298 -35701 -235208 49200 66165
11599F6165f7709I0398J84146A05373a5432B16800I9482J56731a0186L997C3736
$$ 66165 -67709 90398 274544 105373 -15432 216800 99482 256213 -10186 -6189 33736
11587g5565B47285M7882o3604n5115J3429K1195n9186R4387b41984F8382c7137
$$ -75565 247285 295167 231563 176448 189877 211072 151886 246273 -241984 68382 -37137
11575A3679J06564h4645a6442p7777A5821J61425K12112i5969A33904N6599c2976
$$ 13679 120243 -84645 -16442 -94219 15821 177246 389358 -95969 133904 190503 -32976
11563C34237D8478d00483B9180K6260j263d6307b0213r809A61666a20929A76347
$$ 334237 48478 -400483 29180 55440 54177 -46307 -20213 -30022 161666 -120929 176347
11551a38302B18090h5663A45149R1041j03099K22191a63912E7320M34519A31582
$$ -138302 218090 -85663 145149 236190 133091 355282 -163912 57320 491839 131582
11540C29513I7887M01124a98403B1474e4990A68356c90765C70010j01883D5543
$$ 329513 97887 499011 -198403 21474 -54990 168356 -390765 370010 268127 45543
11529B04439M3043j20396J31621q6366c7499r6711F7081J32515l2205K44583D4193
$$ 204439 247482 127086 258707 172341 -37499 -134210 67081 199596 167391 411974 44193
11517A08746g0818B16077n1947J01420f9684a8121j7962F9478K43137j12461c3240
$$ 108746 -70818 216077 164130 265550 -69684 -18121 -36083 69478 312615 200154 -33240
11505E48599A00772D8652J65548D0653K16680C6428J73306E7553P8752b3943j78965
$$ 548599 100772 48652 214200 40653 257333 36428 209734 57553 136305 -23943 -202908
11494b02908B25912f1921A33957L97620A26617c0350o5434C90745j08663H433
$$ -202908 225912 -61921 133957 531577 126617 -30350 -95784 390745 282082 8433
11483A42443J39402B5634L13275J16866a26744C20594H0062J83515L7356q9830
$$ 142443 281845 25634 338909 455775 -126744 320594 80062 263577 300933 211103
11473B11103L7356b1155B86464J24779j8988q4065p9718A0454J97450B6430L32910
$$ 211103 248459 -21155 286464 411243 392255 308190 228472 10454 207904 26430 359340
11462C59340h7512C48882H7363a83852A00586O7735L769J30452e7330C56867m46
$$ 359340 -87512 348882 87363 -183852 100586 168321 172090 302542 -57330 356867 356421
11451C56421A15645K86798G4999J09707C6084f2879E3512j3217a27882A90415
$$ 356421 115645 402443 74999 184706 36084 -62879 53512 40295 -127882 190415
11440f3922A05402a22774B98136o8751B8049a07922A95662F997P5788d0324a4579
$$ -63922 105402 -122774 298136 229385 28049 -107922 195662 6997 82785 -40324 -14579
11428b22143B4478e7340C8680c9066F7968c0085A69890B8017a60537N2648B9226
$$ -222143 24478 -57340 38680 -39066 67968 -30085 169890 28017 -160537 -107889 29226
11416a93241G4235d175A39084L4187O2790h7880r3881g3364B94470A11763b46371
$$ -193241 74235 -4175 139084 173271 236061 -87880 -181761 -73364 294470 111763 -246371
11404B82199I6952p467d9428l97m3467A45602i1616B03085D9054J21025a37299
$$ 282199 96952 89485 -49428 -49825 -93292 145602 -91616 203085 49054 170079 -137299
11392f713A21858a59435A03333a60695B07345n4146C2388A3980J09362b76657
$$ -6713 121858 -159435 103333 -160695 207345 153199 32388 13980 123342 -276657
11381a01463F1987M24334b28480B96198c8691a0534j2473C5441K6602n181O9449
$$ -101463 61987 486321 -228480 296198 -38691 -10534 -23007 35441 62043 56862 126311
11370A26311l5323m2645J8117K4897d9929F9707b63520A33447a11663c359q2980
$$ 126311 90988 48343 66460 91357 -49929 69707 -263520 133447 -111663 -3359 -86339
11359h6339B23009l129a18289D8001P1531a59431E3136a26260r406j98447A94839
$$ -86339 223009 219880 -118289 48001 119532 -159431 53136 -126260 -135666 -334113 194839
11347I4255f147r5758j46423a04040A98274O7136K138b00707f7830H0877h7311
$$ 94255 -6147 -101905 -248328 -104040 198274 265410 267548 -200707 -67830 80877 -87311
11335f0999k18033N8605A45628h7007d0661A55131a80887L6288j14804H5857i9699
$$ -60999 -279032 -220427 145628 -87007 -40661 155131 -180887 -144599 -259403 85857 -99699
11323b5424k4808B2520b6774A77745b68373e0363c686A70029Q1224a6378j33151
$$ -25424 -50232 22520 -26774 177745 -268373 -50363 -3686 170029 251253 -16378 -149529
11312a49529O4920n2170A4565a8535q8890j62096a05620a9384q8184D8383J49219
$$ -149529 -84609 -136779 14565 -18535 -107425 -269521 -105620 -19384 -107568 48383 197602
11301A97602a44281n1813A11680b28265o6791a43363F3647b63064B4276L2289
$$ 197602 -144281 -196094 111680 -228265 -295056 -143363 63647 -263064 24276 56565
11291E6565J4088b1404j40930O889A65867a32693o0142B58544A16377M5492J20773
$$ 56565 70653 -21404 -162334 -155445 165867 -132693 -192835 258544 116377 161869 282642
11280B82642a57641L9283A69541a086B3258d9332A3451J04367C8705b77417A70790
$$ 282642 -157641 -118358 169541 -1086 23258 -49332 13451 117818 38705 -277417 170790
11268a30313k1050O5504p5330L4801B55626a57805B03427a9754A71908a64959
$$ -130313 -151363 -85859 -161189 -126388 255626 -157805 203427 -19754 171908 -164959
11257b72085e6202q9974k6605a5997j49159A69636a53830N0006A49632q56i289
$$ -272085 -56202 -146176 -172781 -15997 -165156 169636 -153830 -103824 149632 148776 -9289
11245B69636c20307A4600J70008b04406f2165l7168k09395N7220I4534a96708
$$ 269636 -320307 14600 184608 -204406 -62165 -99333 -308728 -251508 94534 -196708
11234a48846d8005A9637a03047l0054H5473c0275D102a00251k40073a5826q0162
$$ -148846 -48005 19637 -103047 -133101 85473 -30275 4102 -100251 -340324 -15826 -95988
11223i5988m33284a85253D9227P6942b4336A0443a86033b6309m8462B88480D3278
$$ -95988 -529272 -185253 49227 126169 -24336 10443 -186033 -26309 -74771 288480 43278
11211E846L8200e4631A35860b79184B7158M2952c0160n9151H1489a91277E8327
$$ 5846 44046 -54631 135860 -279184 27158 70110 -30160 -89311 81489 -191277 58327
11199B5863a13308d0334q5455I6842B4056b25139a5665l06631a5325q4585A14786
$$ 25863 -113308 -40334 -125789 96842 24056 -225139 -15665 -322296 -15325 -99910 114786
11187C8766e1195k05401k1704B88954A39800e7924D51097i143I4126a38190l6306
$$ 38766 -51195 -256596 -278300 288954 139800 -57924 451097 -9143 94126 -138190 -174496
11176a74496M3086B20605p2161Q7734b43330A37897A1231c10007A85014b23530
$$ -174496 -131410 220605 148444 236178 -243330 137897 11231 -310007 185014 -223530
11165A30528M5839M8826b06456c9049B0585h4531A28756K5471B5748b11584E2028
$$ 130528 176367 225193 -206456 -39049 20585 -84531 128756 154227 25748 -211584 52028
11153e2945n1393N070H0026a8811o4400o3302G5837a16704a1455A60696b32685
$$ -52945 -104338 -99268 80026 -18811 -83211 -146513 75837 -116704 -11455 160696 -232685
11141a27344j86372J16225N3587N8762I6941b35950c2494A57598B45K3256e3363
$$ -127344 -313716 -197491 -143904 -85142 96941 -235950 -32494 157598 245 23501 -53363
11129a64960A6378J9224b2111B70991A25662j0570c7335a6285o8755L7102B26350
$$ -164960 16378 35602 -22111 270991 125662 115092 -37335 -16285 -85040 -47938 226350
11117A5755L7148O7157L12244q8509b70607A57945Q6015p6117a33196A81726d5270
$$ 15755 52903 120060 432304 343795 -270607 157945 243960 167843 -133196 181726 -45270
11105C14127j0005J30128b38315B13527K07597A80576n7233K7702N3251m5426
$$ 314127 304122 434250 -238315 213527 421124 180576 123343 151045 204296 158870
11095A58870c08043F5632A3419c4200o6141E02101A51427M6468K19257j65278
$$ 158870 -308043 65632 13419 -34200 -100341 502101 151427 197895 417152 251874
11085B51874q8615J29703A42239C7322K64430j2119f1044B94181J34513j91911
$$ 251874 163259 292962 142239 37322 301752 289633 -61044 294181 428694 236783
11075B36783N2894J58365A80868l3999K29100k4452M830J36534o8190r6177A60076
$$ 236783 289677 448042 180868 146869 375969 351517 356347 492881 424691 328514 160076
11063E62884j3033B11700P0971L4017K6067K21314Q2670k75196L49742j37126
$$ 562884 549851 211700 282671 316688 342755 564069 646739 371543 721285 584159
11053E84159r6523K72196k3149j69128K43815l62188M08305k45649J39909L25133
$$ 584159 487636 759832 736683 567555 811370 449182 857487 611838 751747 1076880
11043A076880o1838l50893J69301N2370j76506p4778J20956K06632k01705K83590
$$ 1076880 1015042 664149 833450 885820 709314 634536 755492 962124 760419 1044009
11033A044009k24161l6374Q4359j03764k09166K81862k37202L91019j48696k06925
$$ 1044009 819848 783474 867833 764069 554903 836765 599563 990582 841886 634961
11023F34961N6348o3176K70455C82663M20273n9080j02934o7355K0688K88346
$$ 634961 691309 628133 898588 382663 802936 743856 640922 573567 594255 882601
11013H82601j50247J65891j87222j32519J36188p9713j8170m6412o9644K41258
$$ 882601 732354 898245 711023 578504 714692 634979 616809 570397 500753 742011
11003G42011J99658K9354R2657l77660n1610M0384J09589N7443J5092j09130p700
$$ 742011 941669 971023 1063680 686020 634410 674794 784383 841826 856918 747788 740088
10992G40088N04791l10503J28341O790l70552j57368P00251j86048O8344o7682
$$ 740088 1244879 934376 1062717 1069507 698955 541587 1241838 1055790 1124134 1056452
10982A056452j35823M01612l5992j00681J00280L20713Q3280O11782J92580j05512
$$ 1056452 920629 1322241 1286249 1185568 1285848 1606561 1689841 2301623 2494203 2388691
10972B388691j9394M01155K96363j3099j21405k45652k43594M4469l87343L2817
$$ 2388691 2369297 2770452 3066815 3053716 2932311 2686659 2443065 2487534 2100191 2133008
10962B133008J17408j34748j45031j04642n7170J14677k41359N25593o0627j97705
$$ 2133008 2250416 2115668 1970637 1865995 1808825 1923502 1682143 2207736 2147109 1949404
10952A949404j82199J38514o94934l75703o8505J00593l42249J6212j64334K04107
$$ 1949404 1767205 1905719 1210785 835082 766577 867170 524921 541133 376799 580906
10942E80906J11742a9529E19145A49112K60095A6033K42990m6265j335C3873a7490
$$ 580906 692648 -19529 519145 149112 409207 16033 259023 212758 211423 33873 -17490
10930c8895A44996P9627H9160O9234j8297J64272j07422b42375C7794d81j0081
$$ -38895 144996 224623 89160 158394 140097 304369 196947 -242375 37794 -481 -10562
10919a0562A78044C1446O2724C336L4812R6984c1143B63656N3834a16276d7138
$$ -10562 178044 31446 94170 3336 38148 135132 -31143 263656 317490 -116276 -47138
10907B67146A979d8843j66238C0743a02154A24348M1262F0094a45845A1922O990
$$ 267146 1979 -48843 -215081 30743 -102154 124348 165610 60094 -145845 11922 18912
10896A8912R3584f3856l20972C22934h3832r0381H1557a22489C61790b15262C46006
$$ 18912 112496 -63856 -384828 322934 -83832 -174213 81557 -122489 361790 -215262 346006
10884A80908j6262b32705e6432j25122Q3937B59951a92282I1809b27449G1476
$$ 180908 164646 -232705 -56432 -181554 -97617 259951 -192282 91809 -227449 71476
10873c83946A01127d1734l1061m56920b11634C0934L9430K3759b12974c2066j61017
$$ -383946 101127 -41734 -72795 -529715 -211634 30934 70364 94123 -212974 -32066 -193083
10862a93083J7428j11762L4939A0118K29320a80967c9047E7239L05421e6833G9340
$$ -193083 -175655 -287417 -252478 10118 239438 -180967 -39047 57239 362660 -56833 79340
10850a72568e4115k12386J1118A93209K0569G8147l4906q805K2735K26604g2439
$$ -172568 -54115 -266501 -255383 193209 213778 78147 43241 34436 57171 283775 -72439
10838a61122g8989A22135b7157A71032a21494D2638c2512j24279E1708G020d9335
$$ -161122 -78989 122135 -27157 171032 -121494 42638 -32512 -156791 51708 7020 -49335
10826B14459j02758D3397b55980E2062a84518C560a08941H4796B8297a16614j21000
$$ 214459 111701 43397 -255980 52062 -184518 3560 -108941 84796 28297 -116614 -237614
10815b37614J13509M851A15481c44260N3680b13D42549b70542d527r484p9452
$$ -237614 -124105 -119254 115481 -344260 -290580 -213 442549 -270542 -4527 -14011 -93463
10804i3463j68002a24037k2842b2021A90139q5351a45195i629E4145f9388D96959
$$ -93463 -261465 -124037 -146879 -22021 190139 104788 -145195 -9629 54145 -69388 496959
10792a10571L5201k56853A1191E342J51354o8456A9073a31157A06659h6214B5523
$$ -110571 -75370 -332223 11191 5342 156696 88240 19073 -131157 106659 -86214 25523
10780E1008b67170g402r2843D262b05743A59970e7919j61697J8921j06084a46427
$$ 51008 -267170 -7402 -100245 4262 -205743 159970 -57919 -219616 -200695 -306779 -146427
10768D7896Q4784c31731A7419c1322a2893F2613b86568f04r1172M419m6683i426
$$ 47896 132680 -331731 17419 -31322 -12893 62613 -286568 -604 -91776 -87357 -134040 -9426
10755b3358B57640c1724a0588B19808b25074k30971G7055L15851a25719I7116
$$ -23358 257640 -31724 -10588 219808 -225074 -456045 77055 392906 -125719 97116
10744A26208a15370C75674g6754H2874b3835F0747a08115m4787p7439N5526A68104
$$ 126208 -115370 375674 -76754 82874 -23835 60747 -108115 -152902 -230341 -174815 168104
10732a86488k83972B04646b1065H6065a82675F3946i604k4865j7325H5664R8193
$$ -186488 -470460 204646 -21065 86065 -182675 63946 -9604 -34469 -51794 85664 183857
10721A83857f3864F0316b33500E6872e5317C59489b5226k44952c6489j334A39788
$$ 183857 -63864 60316 -233500 56872 -55317 359489 -25226 -270178 -36489 -37823 139788
10709B28590a92888B42087h2237A25255a23703G7544e1027A42074b45362J06944
$$ 228590 -192888 242087 -82237 125255 -123703 77544 -51027 142074 -245362 -138418
10699a38418j6444A21149G952e26788f5876n8350k59826A78260i1693A7153a76760
$$ -138418 -154862 121149 7952 -526788 -65876 -124226 -384052 178260 -91693 17153 -176760
10687a41377G8186P3920d6626A64496a80297I4101e7892E0316K6797C0964J01141
$$ -141377 78186 152106 -46626 164496 -180297 94101 -57892 50316 77113 30964 132105
10676A32105n7277J41444a13776F2624k6557a10794k3484o1759P8584G1104g5619
$$ 132105 74828 216272 -113776 62624 36067 -110794 -134278 -196037 -117453 71104 -75619
10664a15224C2604b11441M6459I3284d3746j7344r6385l5567j35291h1575G7331
$$ -115224 32604 -211441 -164982 93284 -43746 -61090 -157475 -193042 -328333 -81575 77331
10652a14852M2639k39656E9890c21765A4287J02276b29569j2207P6184A874J06813
$$ -114852 -72213 -311869 59890 -321765 14287 116563 -229569 -241776 -165592 1874 108687
10641A08687J2428c5301B2382a14001H0941A7238o169J13844b2547A98378C9373
$$ 108687 121115 -35301 22382 -114001 80941 17238 11069 124913 -22547 198378 39373
10629d7083b2147p9195A47197a30130M1233b1978B22479a34360a3562A13018J81117
$$ -47083 -22147 -101342 147197 -130130 -88897 -21978 222479 -134360 -13562 113018 294135
10618B94135H6891k8901J29495a09071j35851I4357b1140r6694C2803L3090e8716
$$ 294135 86891 57990 187485 -109071 -244922 94357 -21140 -117834 32803 65893 -58716
10606b65334r5447B28442a91449O9632B89909a98841A04264d8844D3763e9252
$$ -265334 -360781 228442 -191449 -121817 289909 -198841 104264 -48844 43763 -59252
10595A41827a48194A69716M170D3387d53219B62619R6771f8762K6154j71597L078
$$ 141827 -148194 169716 173886 43387 -453219 262619 359390 -68762 -42608 -214205 -211127
10584b11127K7252Q3926M2490A08281f1550J5713J5322j36909K8310K8540B30055
$$ -211127 -183875 -99949 -57459 108281 -61550 -45837 -30515 -167424 -139114 -110574 230055
10572B44527a14270b3426A67183b30020c8565m77182a64245A82514b15806I6349
$$ 244527 -114270 -23426 167183 -230020 -38565 -515747 -164245 182514 -215806 96349
10561a32640A31396F62c3860j17729a5419A72809G4914e3490a5814I8547B0698
$$ -132640 131396 662 -33860 -151589 -15419 172809 74914 -53490 -15814 98547 20698
10549A47963k5808R7156r7663c48558J27240B75999c3074E8916J51203a62507
$$ 147963 122155 219311 121648 -348558 -221318 275999 -33074 58916 210119 -162507
10538C5757J83063F759a33543D9859Q141c5191A1953l880J12423n5947c4103m1276
$$ 35757 218820 6759 -133543 49859 58000 -35191 11953 8073 120496 64549 -34103 -75379
10526g5379A77428c86146a57461B26772f1395p9972j05583b2733D6350d5707l7002
$$ -75379 177428 -386146 -157461 226772 -61395 -141367 -246950 -22733 46350 -45707 -82709
10515h2709j71811b0777r3068j23432k19776a97662R8209A5232b5098k74150A58569
$$ -82709 -254520 -20777 -113845 -237277 -457053 -197662 -99453 15232 -25098 -299248 158569
10503a95861J5504F1360a2234q8427d8755n05354a6524I0830c53936I8712h8172
$$ -195861 -180357 61360 -12234 -100661 -48755 -554109 -16524 90830 -353936 98712 -88172
10491A62495g9499j31434c6979j2283j26541C08393a97608D6994q559P7754l0480
$$ 162495 -79499 -210933 -36979 -49262 -175803 308393 -197608 46994 38435 116189 85709
10480H5709K20640K95649J69129j45726B98035O3944A77178r846p1523a31617
$$ 85709 306349 601998 771127 625401 298035 361979 177178 167332 95809 -131617
10469A35820a83354A18269r877n3878a18629E3275a91348l3393P7422a7062e5
$$ 135820 -183354 118269 108392 54514 -118629 53275 -191348 -224741 -147319 -17062 -55
10457b17953O4419A89804R4169j21534a46742j949j71745A82551b75529A04419
$$ -217953 -153534 189804 283973 162439 -146742 -148691 -320436 182551 -275529 104419
10446e6885C21711C1496P4467a60423A3248b6027n5839A03870a82978A55124C2471
$$ -56885 321711 31496 105963 -160423 13248 -26027 -81866 103870 -182978 155124 32471
10434a61155B64979E0210K81582a25045A7368O8123b32148C876b6732B62731j16949
$$ -161155 264979 50210 331792 -125045 17368 85491 -232148 3876 -26732 262731 145782
10423A45782J42777b03706L5698A43773d9836q7883I5640J63891E9715g9241A57767
$$ 145782 288559 -203706 -168008 143773 -49836 -137719 95640 259531 59715 -79241 157767
10411h4690j917A75970E2344a25891A06004j1237J5841N0508a71060q9371A21928
$$ -84690 -86607 175970 52344 -125891 106004 94767 110608 161116 -171060 -260431 121928
10399c1664k53116B25214M1716g2824j57267A72778K81694A20406j2588L1228
$$ -31664 -284780 225214 266930 -72824 -230091 172778 454472 120406 107818 139046
10389A39046a5202B30349N3584p114h7051C23679F9871f9051b2184j03996D48984
$$ 139046 -15202 230349 283933 276819 -87051 323679 69871 -69051 -22184 -126180 448984
10377b01831C67649O3736R5211B17580a4360A57354A8994J75335J89654k1230
$$ -201831 367649 431385 526596 217580 -14360 157354 18994 194329 383983 362753
10367C62753K60766B99551M64034j83948A66921k622B931K42576A09343M0478
$$ 362753 623519 299551 763585 579637 166921 164299 2931 245507 109343 149821
10357A49821J82949j53161J00300l8666J26946F8607L61745J52665k81163J34981
$$ 149821 332770 179609 279909 241243 368189 68607 430352 583017 301854 436835
10347D36835A77495M19256n1757j21731m7383O9802B21604J66318A62885j0545
$$ 436835 177495 596751 544994 423263 375880 445682 221604 387922 162885 152340
10337A52340J63745B0009P6730j2491b51674A92611H1258K66039F3900M1483a31140
$$ 152340 316085 20009 96739 84248 -251674 192611 81258 347297 63900 105383 -131140
10325B69905E8440q289L25532q9441j00127j9182J44909E8680L49543B8755L77593
$$ 269905 58440 50151 375683 286242 186115 166933 311842 58680 408223 28755 406348
10314D06348j82122A8173P0998m1417J01861M4702m6114D8266J32810p5169J27015
$$ 406348 224226 18173 89171 47754 149615 194317 148203 48266 181076 105907 232922
10303B32922a24796K5422o234c3604j41810b6546A62743g0657r7970A92128d3576
$$ 232922 -124796 -99374 -105608 -33604 -175414 -26546 162743 -70657 -168627 192128 -43576
10291b1670l9638B88696f6644j52675A22149b55922a05866B32286F610K77998
$$ -21670 -61308 288696 -66644 -219319 122149 -255922 -105866 232286 6610 284608
10281B84608a20096l3480A09102n1858R209J24036B8221a72413N5337A69693C002
$$ 284608 -120096 -153576 109102 57244 66453 190489 28221 -172413 -117076 169693 3002
10269F9901L07340h5226j2015C68286a27018I7725c20417e9153k79979d5308G5884
$$ 69901 377241 -85226 -97241 368286 -127018 97725 -320417 -59153 -339132 -45308 75884
10257D27459J07767B58348P5111E5492a49870D49619a01401B0834k881b28027
$$ 427459 535226 258348 333459 55492 -149870 449619 -101401 20834 17953 -228027
10246a87138b8776k0008j26333j28895A16551J51921f0406h744D27293b11784
$$ -187138 -28776 -48784 -175117 -304012 116551 268472 -60406 -8744 427293 -211784
10235i0524j85628F0203b03738b239k71849C0019c27047A61060i225A03774M266
$$ -90524 -276152 60203 -203738 -2239 -274088 30019 -327047 161060 -9225 103774 108040
10224A08040f0372B63179D1729J2888K29625b34998p9819d3346B6975J25265a8076
$$ 108040 -60372 263179 41729 54617 284242 -234998 -314817 -43346 26975 152240 -18076
10212b90458a25051J6255j63189b4219h58k35496g5361E2868a09576N3678P444
$$ -290458 -125051 -108796 -271985 -24219 -858 -236354 -75361 52868 -109576 -55898 -48454
10201d8454F9125a67411a4587k92876J21480A74834c00116A17018a0314j65513
$$ -48454 69125 -167411 -14587 -307463 -185983 174834 -300116 117018 -10314 -175827
10191a75827A47397a08047B2592J03776a95732P8906k3745j4045J0946J6382F2351
$$ -175827 147397 -108047 22592 126368 -195732 -116826 -140571 -154616 -143670 -127288 62351
10179C6638n657i45j73215g5956A20781n2426d2431j65101i6717j31642B07978
$$ 36638 30981 -945 -174160 -75956 120781 68355 -42431 -207532 -96717 -228359 207978
10167I350b95040C7942R3577J22374a24996A9529a6392j22163B47368d79262b04933
$$ 9350 -295040 37942 131519 253893 -124996 19529 -16392 -138555 247368 -479262 -204933
10155b85197h7063F9204d91586g2777J1883m3501P50j59826J03793k84826B10945
$$ -285197 -87063 69204 -491586 -72777 -60894 -104395 -103645 -263471 -159678 -444504 210945
10143h7623A15220f2215D1600J13563J02746b28904a0812d758F7285a65206j08305
$$ -87623 115220 -62215 41600 155163 257909 -228904 -10812 -4758 67285 -165206 -273511
10132b73511j83189J44819g0427C0436h0455n45H0612a84845d901A2891a07801
$$ -273511 -456700 -311881 -70427 30436 -80455 -81000 80612 -184845 -4901 12891 -107801
10120f7234j72271d6752B70318a83123j43703a01797b5915F3239d9854r9249J5953
$$ -67234 -239505 -46752 270318 -183123 -326826 -101797 -25915 63239 -49854 -149103 -133150
10109a33150E9750D0N8562d9706m0959K904j30140C26034A45770a27809D6221
$$ -133150 59750 40 58602 -49706 -90665 -87761 -217901 326034 145770 -127809 46221
10097h283C0026k025K80437E6881c2731A48092F7293r707A0791a24803A22683
$$ -8283 30026 28001 308438 56881 -32731 148092 67293 57586 10791 -124803 122683
10085c6170m9358k25145j86342a09468k4261m4339a6789p3634A0670c20381P6942
$$ -36170 -85528 -310673 -497015 -109468 -133729 -178068 -16789 -90423 10670 -320381 -243439
10074b43439Q8619k52225a2216a94A45840a10585B9374a97795k2035g1277A75178
$$ -243439 -154820 -407045 -12216 -194 145840 -110585 29374 -197795 -219830 -71277 175178
10062A56066b01396b9987B7274K43844G936e8881q8669j09779Q6910b7325F7909
$$ 156066 -201396 -29987 27274 271118 7936 -58881 -147550 -257329 -170419 -27325 67909
10050E4983Q9824J70520d3001k24680B02660d49631E8506M3639a27954f3027l38634
$$ 54983 144807 315327 -43001 -267681 202660 -449631 58506 102145 -127954 -63027 -401661
10039d01661A29134B3038a26654j93651B6800b30196C10701B8311a51716j10855
$$ -401661 129134 23038 -126654 -320305 26800 -230196 310701 28311 -151716 -262571
10029b62571i6141A65509h3668J1241m8852j03603B5314R5913J2501c27568f3264
$$ -262571 -96141 165509 -83668 -72427 -121279 -224882 25314 121227 133728 -327568 -63264
10017c00950A50988a04940r2074M7777r350l33180b25525f1294E4664i2307m703
$$ -300950 150988 -104940 -197014 -149237 -158587 -491767 -225525 -61294 54664 -92307 -97010
10006i7010A0736b41422l7608O1017Q348A15118a64651L6217A26077K1209e3450
$$ -97010 10736 -241422 -279030 -218013 -209665 115118 -164651 -128434 126077 147286 -53450
9994d48952O8730P7246h0709L9715r3831l8283j70818B40917A10116f9628k2945
$$ -448952 -380222 -302976 -80709 -40994 -134825 -173108 -343926 240917 110116 -69628 -92573
9983i2573k0963j4267A17505b0608l21G2537a33144n074B21499g6549k04964q8443
$$ -92573 -113536 -127803 117505 -20608 -20929 72537 -133144 -138218 221499 -76549 -281513 -369956
9971c69956d2930A92689i1221n9835M4750A62618c15156B56529A2693c60081B60622
$$ -369956 -42930 192689 -91221 -151056 -106306 162618 -315156 256529 12693 -360081 260622
9959a10386A9709a91204a5401F8996O165k7119c48208A2324A467N8881B6252Q4815
$$ -110386 19709 -191204 -15401 68996 75161 48042 -348208 12324 1467 60348 26252 111067
9947A11067d1269k294a2249B63049c19592G124a51985b6418H257K78179c4323
$$ 111067 -41269 -43563 -12249 263049 -319592 7124 -151985 -26418 8257 286436 -34323
9935b29215F2277e0265D5338b7082k59428a23085m6042L5880J3703j97674c2280
$$ -229215 62277 -50265 45338 -27082 -286510 -123085 -169127 -133247 -119544 -317218 -32280
9923e6528J3013j43587n1730A86846g8226k98182B82916B2938J3993Q3716E9214
$$ -56528 -43515 -187102 -238832 186846 -78226 -376408 282916 22938 36931 120647 59214
9911i0542C0171b97434C5136c72061g7475b7201m6972A64760a07310r2783A4343
$$ -90542 30171 -297434 35136 -372061 -77475 -27201 -74173 164760 -107310 -200093 14343
9899b63971A08553a7493G878a9625A57176b04173P3675j13091b5322A51838N1550
$$ -263971 108553 -17493 7878 -19625 157176 -204173 -130498 -243589 -25322 151838 203388
9888B03388f1399A17148i585j64075K6061q8868k2710a03058c6805A61825g4448
$$ 203388 -61399 117148 -9585 -173660 -147599 -236467 -259177 -103058 -36805 161825 -74448
9876a69368h4342m7558c8296j29727B19619Q6360c1185A4205a35052B35904a24688
$$ -169368 -84342 -131900 -38296 -168023 219619 305979 -31185 14205 -135052 235904 -124688
9864c75627A01738a66006I6696a62246K6696j61624P3734A18067l4449a00673
$$ -375627 101738 -166006 96696 -162246 -135550 -297174 -223440 118067 83618 -100673
9853D56583c77952A01139J47513a75889n6629a11156j92828e0104F691c4928I5201
$$ 456583 -377952 101139 248652 -175889 -232518 -111156 -303984 -50104 6691 -34928 95201
9841f2291F1056h0716r7318A722L65427A62705a22795d6183B669b14114f0349
$$ -62291 61056 -80716 -178034 1722 367149 162705 -122795 -46183 2669 -214114 -60349
9829i9092b7684j71014O0600l0391I4540a26321I6693A8340K18588f05784d6166
$$ -99092 -27684 -198698 -138098 -168489 94540 -126321 96693 18340 236928 -605784 -46166
9817c52646a65145j50363J41587C36J5189b35221a5070H1975d3417o0935o561
$$ -352646 -165145 -315508 -173921 336 15525 -235221 -15070 81975 -43417 -104352 -110913
9806a10913c1744D6791a3397k71640F9601a08723p688j42097F9155a18224k24580
$$ -110913 -31744 46791 -13397 -285037 69601 -108723 -116411 -258508 69155 -118224 -342804
9795c42804A43852E6199K3659O0681a45178g682D0455f8052o499k9094A51726
$$ -342804 143852 56199 79858 140539 -145178 -7682 40455 -68052 -74551 -103645 151726
9783b26167M5835h6796k4900K6248L12b9064m08072a06171m403D2107O5528i7779
$$ -226167 -180332 -86796 -111696 -85448 -85136 -29064 -437136 -106171 -110574 42107 107635 -97779
9770a18583p954D855a45518d5763I0833a75378k30235J46572I1675B3835a20268
$$ -118583 -126537 4855 -145518 -45763 90833 -175378 -405613 -259041 91675 23835 -120268
9758a39048j7408g3462g142H9906B0106a01388j05918K8707C55066E2996a17527
$$ -139048 -156456 -73462 -7142 89906 20106 -101388 -207306 -178599 355066 52996 -117527
9746b78932D9858h3250b1510k78875b6343A42486j3401d8450j90627R63A10703
$$ -278932 49858 -83250 -21510 -300385 -26343 142486 129085 -48450 -239077 -238114 110703
9734b11753j00620D49J57956b6261C5397H100a25656C0804P3560a31978c5997
$$ -211753 -312373 449 158405 -26261 35397 8100 -125656 30804 104364 -131978 -35997
9722C33323c5616j87685C4175c6300B90150A9514P7338f3792F1418D16Q9789a49735
$$ 333323 -35616 -223301 34175 -36300 290150 19514 96852 -63792 61418 416 90205 -149735
9709A45508b76601B35733b18287N8417q2264b7440J488A8502f1809A68468f7168
$$ 145508 -276601 235733 -218287 -159870 -242134 -27440 -25952 18502 -61809 168468 -67168
9697B94744d3001A9999e8036H0071c39402D14507e6031B17d49674A33138b4374
$$ 294744 -43001 19999 -58036 80071 -339402 414507 -56031 217 -449674 133138 -24374
9685a80572j91515J71319B69164i2383j46627g22j85768A31898A1746L5449J2847
$$ -180572 -372087 -200768 269164 -92383 -239010 -722 -186490 131898 11746 47195 60042
9674F0042a79771j58956a0892l75215a18319k96176a76782d7586B04650a11985
$$ 60042 -179771 -338727 -10892 -386107 -118319 -414495 -176782 -47586 204650 -111985
9663a5451A04a89183r6667D9604K498J43909c13696F9712Q5212f9377B75937c481
$$ -15451 104 -189183 -285850 49604 52102 196011 -313696 69712 154924 -69377 275937 -3481
9650c45518B01477b27019b6842B23657F8051f3585J0317j93533d7306k64771R8160
$$ -345518 201477 -227019 -26842 223657 68051 -63585 -53268 -246801 -47306 -312077 -213917
9639b13917C0968J75618a04619I9615i4189j44005j0444j7476C31124A7792a94500
$$ -213917 30968 206586 -104619 99615 -94189 -238194 -248638 -266114 331124 17792 -194500
9627b38430h8661b8883j8786A6947J18644C5688J39461j8161A2446c65540A17268
$$ -238430 -88661 -28883 -47669 16947 135591 35688 175149 156988 12446 -365540 117268
9615C18656a68154C41584D6027A6818e4388K4647k58154J03068h1323p0728B30135
$$ 318656 -168154 341584 46027 16818 -54388 -29741 -287895 -184827 -81323 -152051 230135
9603h4885e250l47624J22833B48166F0152a52122F6573a48865j0786M5572m3939
$$ -84885 -5250 -352874 -230041 248166 60152 -152122 66573 -148865 -159651 -114079 -158018
9592a58018A08580L6730d0700B29993C4383A82d8909l0180D692a05812M2607q8426
$$ -158018 108580 145310 -40700 229993 34383 182 -48909 -79089 4692 -105812 -63205 -151631
9580a51631C9326a31411A17347R8527C2979c85399M8054i269n9984I9128a48503
$$ -151631 39326 -131411 117347 215874 32979 -385399 -337345 -9269 -69253 99128 -148503
9568d7835m8566k0347B56564b4787l11470A22811D4688a33031o2437G3270a89404
$$ -47835 -96401 -116748 256564 -24787 -336257 122811 44688 -133031 -195468 73270 -189404
9556a08035j21739A37986o5472c95563h5767A33871b26046Q5183j42145B2317
$$ -108035 -229774 137986 72514 -395563 -85767 133871 -226046 -140863 -283008 22317
9545g9036k02694a30949A11163b8307j58403i0507j8256a5001k53409A24112a21624
$$ -79036 -281730 -130949 111163 -28307 -186710 -90507 -108763 -15001 -268410 124112 -121624
9533A89535A8113K37271p6042a31997A5694b5956j99457i4581H7582D740a57761
$$ 189535 18113 255384 179342 -131997 15694 -25956 -225413 -94581 87582 4740 -157761
9521a56914K1217B95843a29829j09705R7485D1135i7472C4390j029K1096a49569
$$ -156914 -135697 295843 -129829 -239534 -142049 41135 -97472 34390 33361 54457 -149569
9509b55129A47375c94131B10611K825j05167a42752o5546B5550f1647k57278A94028
$$ -255129 147375 -394131 210611 213436 108269 -142752 -208298 25550 -61647 -318925 194028
9497g892j71609b4483o5203B7486J8785f2712k7058o9764H9659J69357i7639j16646
$$ -7892 -179501 -24483 -89686 27486 46271 -62712 -89770 -159534 89659 259016 -97639 -214285
9485b14285B3881N8989O5925k0772b84011b5490A07125a04377a1583k23463j66655
$$ -214285 23881 82870 148795 128023 -284011 -25490 107125 -104377 -11583 -235046 -401701
9474d01701B15168h4395k21715R1210h8936I015J02156d1425q9854H2783e8205
$$ -401701 215168 -84395 -306110 -214900 -88936 9015 111171 -41425 -131279 82783 -58205
9462E8365c24664c8251j47742O5294L4597c4591C22797a80479k10496J66966l2936
$$ 58365 -324664 -38251 -185993 -120699 -86102 -34591 322797 -180479 -390975 -224009 -256945
9451b56945m2133J09020N1729l25867J89272A60775E7578j9826b00151i0177C3965
$$ -256945 -299078 -190058 -138329 -464196 -274924 160775 57578 37752 -200151 -90177 33965
9439b09827i279k8369n1056h051j7801k04991G6684g2257D7880J7539B9776J27457
$$ -209827 -9279 -37648 -88704 -8051 -25852 -230843 76684 -72257 47880 65419 29776 157233
9427A57233O2464a81649L3072F3979J6655b8319j02183H6273b41877h8455D020
$$ 157233 219697 -181649 -148577 63979 80634 -28319 -130502 86273 -241877 -88455 4020
9415g9943l49002b10599O378Q2468I6711K1050b38728B3617c02386A89441b65119
$$ -79943 -428945 -210599 -204221 -121753 96711 117761 -238728 23617 -302386 189441 -265119
9403d3087o8941j22278J9568n0899G2967e6858j6518B24101a87892E3558j6129
$$ -43087 -112028 -234306 -214738 -265637 72967 -56858 -73376 224101 -187892 53558 37429
9392C7429P3022a15844Q47H1674a90494a0409B79J55949M8376f6020A1481K82057
$$ 37429 110451 -115844 -114997 81674 -190494 -10409 279 156228 204604 -66020 11481 293538
9380B93538e3371r5222M4004l05389a44734e1705k1515k56603D6572a17078k01851
$$ 293538 -53371 -148593 -104589 -409978 -144734 -51705 -73220 -329823 46572 -117078 -318929
9369c18929A98386B4149b32700A90679c28961c1674p6805j84857d3520C5769K07403
$$ -318929 198386 24149 -232700 190679 -328961 -31674 -108479 -293336 -43520 35769 243172
9358B43172a06858B26115a6183j33837k0222M8981B4627B450a69598I3591b24068
$$ 243172 -106858 226115 -16183 -150020 -170242 -121261 24627 2450 -169598 93591 -224068
9346A70187f8942l7182j15861k61160K30375A22862n9941b74096K560d3345p4448
$$ 170187 -68942 -106124 -221985 -483145 -252770 122862 62921 -274096 -271536 -43345 -117793
9335a17793G8064h2317A2413c68822B16946r4231d0527j64991f1785j86356k0115
$$ -117793 78064 -82317 12413 -368822 216946 122715 -40527 -205518 -61785 -248141 -268256
9324b68256a0299k5882j45943j45241F0317b35351A91247a60620E8440b020k43714
$$ -268256 -10299 -36181 -182124 -327365 60317 -235351 191247 -160620 58440 -2020 -245734
9313b45734F4911c7049C03791m7692m916f1315l46569a04842L0191A04851a12650
$$ -245734 64911 -37049 303791 256099 251183 -61315 -407884 -104842 -74651 104851 -112650
9301b63767R8677H6542g6059B03148a77363A53375b27668p7677d2170A43604b20423
$$ -263767 -165090 86542 -76059 203148 -177363 153375 -227668 -305345 -42170 143604 -220423
9289c9707B41666A18361m1484e2946A4416d58458r4774b64391A34554h5284b9019
$$ -39707 241666 118361 76877 -52946 14416 -458458 -553232 -264391 134554 -85284 -29019
9277c05924M8570F8347i0895k18541J46109j11713B4149k213J29750c55961c1053
$$ -305924 -257354 68347 -90895 -309436 -163327 -275040 24149 21936 151686 -355961 -31053
9265G4077a26988q5048i3052J5339B61110B5165a02984A67643p527a03141j03277
$$ 74077 -126988 -212036 -93052 -77713 261110 25165 -102984 167643 160116 -103141 -206418
9254b06418j1024Q8318C07393h9706J9356b727A8456c11152g060B8260c89294
$$ -206418 -217442 -129124 307393 -89706 -70350 -2727 18456 -311152 -7060 28260 -389294
9242B0739e5307a1993l02169J46893d5593I0712b94063A8752i8426F8288Q5792
$$ 20739 -55307 -11993 -314162 -167269 -45593 90712 -294063 18752 -98426 68288 154080
9231A54080b21867A69030a42348d0227k19161C21028G4022b44979a78k99171a45356
$$ 154080 -221867 169030 -142348 -40227 -259388 321028 74022 -244979 -178 -299349 -145356
9219b47977h5348j73128A89018a58838B60789a3457j62942D6212a50694C2221
$$ -247977 -85348 -258476 189018 -158838 260789 -13457 -176399 46212 -150694 32221
9208c05914a17427q2560g8792k101r7154a9386B62433g2595A06701a04405g537
$$ -305914 -117427 -199987 -78792 -80893 -178047 -19386 262433 -72595 106701 -104405 -7537
9196a50065k0019B02850d21386i0929j32319A42127A0132J83614a76872B48639
$$ -150065 -170084 202850 -421386 -90929 -223248 142127 10132 193746 -176872 248639
9185a20012A17676A0691b01203N7854j24239J08863H5554J2477b62233a4799p9752
$$ -120012 117676 10691 -201203 -143349 -267588 -158725 85554 98031 -262233 -14799 -94551
9174i4551B16479m7553b30486B28093q1388a96972h2239A19415a07737j2039m3707
$$ -94551 216479 168926 -230486 228093 146705 -196972 -82239 119415 -107737 -119776 -163483
9163a63483K8830J0916K0419E8158J19670b77022B61767F0348b67144a04429d8159
$$ -163483 -134653 -123737 -103318 58158 177828 -277022 261767 60348 -267144 -104429 -48159
9151b10871A38194J8571g1433p5361j1828L7924b8712k14320c5100j32181P5480
$$ -210871 138194 156765 -71433 -146794 -158622 -120698 -28712 -243032 -35100 -167281 -91801
9140i1801B56005H7134a23512k95300B40949j18723a63335J9663A71250n2720
$$ -91801 256005 87134 -123512 -418812 240949 122226 -163335 -143672 171250 118530
9130A18530h217k57688j59340E6506c1897A96292i0300A4556R635e6531A31624
$$ 118530 -8217 -265905 -425245 56506 -31897 196292 -90300 14556 24191 -56531 131624
9118b53000d7186k58406j05199h5392k22801A17583A5809J4576a68142h203k66815
$$ -253000 -47186 -305592 -410791 -85392 -308193 117583 15809 30385 -168142 -8203 -275018
9107b75018B23421d1642A32161a03094F778Q4381d01300a24501A99657D687N3920
$$ -275018 223421 -41642 132161 -103094 6778 91159 -401300 -124501 199657 4687 58607
9096E8607B2915P1621e9172E4203J1158o662i9034A94406a09070a6098A46294
$$ 58607 22915 94536 -59172 54203 65361 58699 -99034 194406 -109070 -16098 146294
9084a82993F6370M1134a39626N1060j00386a071A44089c44469e9433A02714J8862
$$ -182993 66370 107504 -139626 -88566 -188952 -1071 144089 -344469 -59433 102714 121576
9073A21576J14091q2475N3317a27245H1124a55498l39975E700b60460b184B17619
$$ 121576 235667 153192 206509 -127245 81124 -155498 -495473 5700 -260460 -2184 217619
9061a41753e5167q485H5007b24991i7330o4108a4k49037A25723o591b02767d3672
$$ -141753 -55167 -63652 85007 -224991 -97330 -161438 -14 -249051 125723 119132 -202767 -43672
9048c02766i0784L2551J4701k74231B44744B3441c83098e1555B1086c20814a28605
$$ -302766 -90784 -58233 -43532 -317763 244744 23441 -383098 -51555 21086 -320814 -128605
9036e2610A5501b96904a41589r0501F8429b40549A45962A0444J03491c59201A30965
$$ -52610 15501 -296904 -141589 -232090 68429 -240549 145962 10444 113935 -359201 130965
9024C1860P6902a06153b4030p7031L2773q8326M5477k40464a20255n5988e9477
$$ 31860 108762 -106153 -24030 -101061 -68288 -156614 -111137 -351601 -120255 -176243 -59477
9012b03238A85938a32280n5181A09323b21323B09417f4233n962h022l47052g8290
$$ -203238 185938 -132280 -187461 109323 -221323 209417 -64233 -70195 -8022 -355074 -78290
9000d5650C820h5790F730b22923e9225p5987a3923D12081l5441i4498d1994a5611
$$ -45650 3820 -85790 6730 -222923 -59225 -135212 -13923 412081 376640 -94498 -41994 -15611
8987f4158k16729A42193M6483b0579k97727p3806O2468A18325a19606m7708B9626
$$ -64158 -280887 142193 188676 -20579 -318306 -392112 -329644 118325 -119606 -167314 29626
8975a99876A01003a77517p9089M2857K3154A09412A1156b09855b2880l91013a65320
$$ -199876 101003 -177517 -256606 -213749 -190595 109412 11156 -209855 -22880 -413893 -165320
8963A1221g9982j47923e092k12737M7952E417a1858j87118c0888k37146D7744
$$ 11221 -79982 -227905 -5092 -217829 -169877 5417 -11858 -198976 -30888 -268034 47744
8951e9352A40863P2992f6154l1174a8238C37298N5948o5706b41123G34O7419a32474
$$ -59352 140863 213855 -66154 -97328 -18238 337298 393246 327540 -241123 734 68153 -132474
8938H0638A0432a43467c3796A54656i2812A21679a84247O3622L296p371A66410
$$ 80638 10432 -143467 -33796 154656 -92812 121679 -184247 -120625 -117329 -124700 166410
8926b08223R6101A1453K6969J09534L61465J92910a0439j49951g97p2496E9569
$$ -208223 -112122 11453 38422 147956 509421 702331 -10439 -160390 -797 -73293 59569
8914D9183a03097A79642g8937k10742K5219P163A5283a63375g8810H8123b94327
$$ 49183 -103097 179642 -78937 -289679 -264460 -257297 15283 -163375 -78810 88123 -294327
8902a55432J0665A64660b34176A58521d9019F1844a79899c1565o9963k41822M8090
$$ -155432 -144767 164660 -234176 158521 -49019 61844 -179899 -31565 -101528 -343350 -295260
8891b95260B30523K411h973L245j66242A63606b60274C25657F6202c83760c4983
$$ -295260 230523 232934 -8973 -5728 -171970 163606 -260274 325657 66202 -383760 -34983
8879a9917j27756B099a28216I9765a30267A23132B7990a42082A04853c02768a48679
$$ -19917 -147673 2099 -128216 99765 -130267 123132 27990 -142082 104853 -302768 -148679
8867c4041j92118B05431R9677J01067A37922J0229K9284c09978F8220M8068l547
$$ -34041 -226159 205431 305108 406175 137922 148151 177435 -309978 68220 116288 112741
8856A12741g1308j61991D6852P2832c03150g1715A27572e918j86268b9046j52056
$$ 112741 -71308 -233299 46852 119684 -303150 -71715 127572 -5918 -192186 -29046 -181102
$$ [...]
##END NTUPLES=NMR SPECTRUM
##END=
