##TITLE=AC1737_SEN00010_9276275_QPXx5LwaLv
##JCAMPDX= 6.0         $$ Bruker NMR JCAMP-DX V2.0
##DATA TYPE= NMR SPECTRUM
##DATA CLASS= NTUPLES
##ORIGIN= BRUKER
##OWNER= Administrator
$$ 1.72 TOPSPIN		Version 2.1
$$ 2015-07-14 22:50:13.729 -0700  Administrator@X
$$ Compression mode = diff/dup
##.OBSERVE FREQUENCY= 400.02188249412
##.OBSERVE NUCLEUS= ^1H
##.ACQUISITION MODE= SIMULTANEOUS (DQD)
##.ACQUISITION SCHEME= undefined
##.AVERAGES= 64
##.DIGITISER RES= 22
##SPECTROMETER/DATA SYSTEM= spect
##.PULSE SEQUENCE= noesygpps1d.comp
##.SOLVENT NAME= COFFEE_meoh
##.SHIFT REFERENCE= INTERNAL, COFFEE_meoh, 1, 14.96096
##AUDIT TRAIL= $$ (NUMBER, WHEN, WHO, WHERE, PROCESS, VERSION, WHAT)
$$ ##TITLE= Audit trail, TOPSPIN		Version 2.1
$$ ##JCAMPDX= 5.01
$$ ##ORIGIN= Bruker BioSpin GmbH
$$ ##OWNER= Administrator
$$ $$ E:\/data/COFFEE/nmr/AC1737_SEN00010_9276275_QPXx5LwaLv/12/pdata/1/auditp.txt
$$ ##AUDIT TRAIL=  $$ (NUMBER, WHEN, WHO, WHERE, PROCESS, VERSION, WHAT)
(   1,<2015-07-14 22:50:08.682 -0700>,<Administrator>,<X>,<go>,<TOPSPIN 2.1>,
      <created by zg
	started at 2015-07-14 22:38:39.041 -0700,
	POWCHK enabled, PULCHK disabled,
       configuration hash MD5:
       21 0F 79 D6 B3 7B B4 F6 88 20 88 DB 03 48 BD 9F
       data hash MD5: 64K
       75 A2 15 30 89 15 AE 61 D9 F1 02 B1 81 CF 4D 7C>)
(   2,<2015-07-14 22:50:11.807 -0700>,<Administrator>,<X>,<proc1d>,<TOPSPIN 2.1>,
      <Start of raw data processing
       efp LB = 0.3 FT_mod = 6 PKNL = 1 PHC0 = 0 PHC1 = 0 SI = 128K 
       data hash MD5: 128K
       C0 B8 C7 F2 61 3E FD 0F 34 FA 26 6F 7F 0F 0B 49>)
(   3,<2015-07-14 22:50:12.822 -0700>,<Administrator>,<X>,<proc1d>,<TOPSPIN 2.1>,
      <pk PHC0 = -88.03894 PHC1 = 0 
       data hash MD5: 128K
       35 5A B9 48 3C 13 85 4D F9 2B 2A DA 3D C6 7C E0>)
(   4,<2015-07-14 22:50:13.213 -0700>,<Administrator>,<X>,<proc1d>,<TOPSPIN 2.1>,
      <abs ABSG = 1 
       data hash MD5: 128K
       27 2F F4 AB A1 D8 A7 E9 C3 A5 89 96 9C 90 E2 EF>)
(   5,<2015-07-14 22:50:13.322 -0700>,<Administrator>,<X>,<proc1d>,<TOPSPIN 2.1>,
      <abs ABSG = 2 
       data hash MD5: 128K
       12 72 55 8F CD DB 5B 6C 1F 89 A0 EB 0C B8 A0 8E>)
(   6,<2015-07-14 22:50:13.400 -0700>,<Administrator>,<X>,<proc1d>,<TOPSPIN 2.1>,
      <abs ABSG = 3 
       data hash MD5: 128K
       3A C2 28 45 CA 50 BB E1 E9 A2 A7 0A B8 62 82 87>)
(   7,<2015-07-14 22:50:13.479 -0700>,<Administrator>,<X>,<proc1d>,<TOPSPIN 2.1>,
      <abs ABSG = 4 
       data hash MD5: 128K
       F9 E1 BB A5 0F 19 4E ED BE E2 FA 93 D4 2F 9C BD>)
(   8,<2015-07-14 22:50:13.557 -0700>,<Administrator>,<X>,<proc1d>,<TOPSPIN 2.1>,
      <abs ABSG = 5 
       data hash MD5: 128K
       A3 A2 82 7F 0F E0 B6 A6 BD D9 A6 89 61 47 86 18>)
$$ ##END=
$$ 
$$ $$ hash MD5
$$ $$ CB 12 F4 DB 7E 70 C0 72 66 0D 0A EF 9F 53 35 EE
##$RELAX= 
##$RELAX= 
##$RELAX= 
##$RELAX= 
##$RELAX= 
##$RELAX= 
##$RELAX= 
##$RELAX= 
$$ Bruker specific parameters
$$ --------------------------
##$DU= <E:\>
##$EXPNO= 12
$$ [...]
##$TP07= 0
##$TPNAME0= <>
##$TPNAME1= <>
##$TPNAME2= <>
##$TPNAME3= <>
##$TPNAME4= <>
##$TPNAME5= <>
##$TPNAME6= <>
##$TPNAME7= <>
##$TPOAL= (0..7)
0.5 0.5 0.5 0.5 0.5 0.5 0.5 0.5
##$TPOFFS= (0..7)
0 0 0 0 0 0 0 0
##$TUNHIN= 0
##$TUNHOUT= 0
##$TUNXOUT= 0
##$USERA1= <user>
##$USERA2= <user>
##$USERA3= <user>
##$USERA4= <user>
##$USERA5= <user>
##$V9= 5
##$VALIST= <valist>
##$VCLIST= <CCCCCCCCCCCCCCC>
##$VD= 0
##$VDLIST= <DDDDDDDDDDDDDDD>
##$VPLIST= <PPPPPPPPPPPPPPP>
##$VTLIST= <TTTTTTTTTTTTTTT>
##$WBST= 2048
##$WBSW= 25
##$XGAIN= (0..3)
0 0 0 0
##$XL= 0
##$YL= 0
##$YMAX_a= 6933952
##$YMIN_a= -12880157
##$ZGOPTNS= <>
##$ZL1= 120
##$ZL2= 120
##$ZL3= 120
##$ZL4= 120
##$ABSF1= 14.96096
##$ABSF2= -5.597221
##$ABSG= 5
##$ABSL= 3
##$ALPHA= 0
##$AQORDER= 0
##$ASSFAC= 0
##$ASSFACI= 0
##$ASSFACX= 0
##$ASSWID= 0
##$AUNMP= <proc_prof1d_extract.lims>
##$AXLEFT= 0
##$AXNAME= <>
##$AXNUC= <1H>
##$AXRIGHT= 0
##$AXTYPE= 0
##$AXUNIT= <>
##$AZFE= 0.1
##$AZFW= 0.1
##$BCFW= 0
##$BC_mod= 0
##$BYTORDP= 0
##$COROFFS= 0
##$CY= 15
##$DATMOD= 1
##$DC= 0
##$DFILT= <>
##$DTYPP= 0
##$F1P= 0
##$F2P= 0
##$FCOR= 0.5
##$FTSIZE= 131072
##$FT_mod= 6
##$GAMMA= 0
##$GB= 0
##$INTBC= 1
##$INTSCL= 1
##$ISEN= 128
##$LB= 0.3
##$LEV0= 0
##$LPBIN= 0
##$MAXI= 10000
##$MC2= 0
##$MEAN= 0
##$ME_mod= 0
##$MI= 0
##$NCOEF= 0
##$NC_proc= -2
##$NLEV= 6
##$NOISF1= 0
##$NOISF2= 0
##$NSP= 0
##$NTH_PI= 0
##$NZP= 0
##$OFFSET= 14.96096
##$PC= 1
##$PHC0= -88.03894
##$PHC1= 0
##$PH_mod= 1
##$PKNL= yes
##$PPARMOD= 0
##$PPDIAG= 0
##$PPIPTYP= 0
##$PPMPNUM= 2147483647
##$PPRESOL= 1
##$PSCAL= 4
##$PSIGN= 0
##$PYNMP= <proc.py>
##$REVERSE= no
##$SF= 400.020009651439
##$SI= 131072
##$SIGF1= 0
##$SIGF2= 0
##$SINO= 400
##$SIOLD= 131072
##$SPECTYP= <>
##$SREGLST= <1H.CDCl3>
##$SSB= 0
##$STSI= 131072
##$STSR= 0
##$SW_p= 8223.68421052631
##$SYMM= 0
##$S_DEV= 0
##$TDeff= 65536
##$TDoff= 0
##$TI= <>
##$TILT= no
##$TM1= 0
##$TM2= 0
##$TOPLEV= 0
##$USERP1= <user>
##$USERP2= <user>
##$USERP3= <user>
##$USERP4= <user>
##$USERP5= <user>
##$WDW= 1
##$XDIM= 131072
##$YMAX_p= 408956226
##$YMIN_p= -11661
##$CURPLOT= <Network HP LaserJet P1505>
##$CURPRIN= <$Network HP LaserJet P1505>
##$DFORMAT= <normdp>
##$LAYOUT= <+/1D_H.xwp>
##$LFORMAT= <normlp>
##$PFORMAT= <normpl>
##$SURQMSG= 1
$$ End of Bruker specific parameters
$$ ---------------------------------
##NTUPLES= NMR SPECTRUM
##VAR_NAME=  FREQUENCY,     SPECTRUM/REAL,   SPECTRUM/IMAG
##SYMBOL=    X,             R,               I
##VAR_TYPE=  INDEPENDENT,   DEPENDENT,       DEPENDENT
##VAR_FORM=  AFFN,          ASDF,            ASDF
##VAR_DIM=   131072,        131072,          131072
##UNITS=     HZ,            ARBITRARY UNITS, ARBITRARY UNITS
##FACTOR=    0.0627417313425164, 1,          1
##FIRST=     8223.62146879497, 3602,         -62899
##LAST=      0,             5138,            -62984
##MIN=       0,             -11661,          0
##MAX=       8223.62146879497, 408956226,    0
$$ Real data points
##PAGE= N=1
##DATA TABLE= (X++(R..R)), XYDATA
$$ [...]
$$ plain form
63872 615720 623468 633675 646417 661714 679217 698382 718852 740495 763139 786622 811030 836476
63860 836476 862429 887619 910986 932499 952644 971220 987169 999688 1008948 1015329 1018336 1016864
63848 1016864 1010447 999762 985797 969027 949634 928067 904860 879999 853020 823973 793946
63837 793946 764332 735605 707090 678030 648658 620070 593138 567847 543767 520880 499682
63826 499682 480593 463542 448164 434155 421315 409439 398324 387861 377972 368565 359636 351344
63814 351344 343842 337027 330611 324494 318984 314555 311402 309248 307566 305940 304188 302253 300107 297737
63800 297737 295105 292115 288754 285297 282193 279618 277314 274970 272612 270420 268292 265914 263200 260431
63786 260431 257952 255954 254546 253747 253345 252938 252189 250949 249273 247571 246615 246953 248238 249493 250165 250485
$$ packed form
63872F15720P748J0207J2742J5297J7503J9165K0470K1643K2644K3483K4408K5446
63860H36476K5953K5190K3367K1513K0145J8576J5949J2519R260O381L007j472
63848A016864o417j0685j3965j6770j9393k1567k3207k4861k6979k9047l0027
63837G93946k9614k8727k8515k9060k9372k8588k6932k5291k4080k2887k1198
63826D99682j9089j7051j5378j4009j2840j1876j1115j0463r889r407q929q292
63814C51344p502o815o416o117n510m429l153k154j682j626j752j935k146k370
63800B97737k632k990l361l457l104k575k304k344k358k192k128k378k714k769
63786B60431k479j998j408p99m02m07p49j240j676j702r56L38J285J255O72L20
$$ plain form
63770 250485 250724 250611 249860 248772 247832 246972 245836 244632 244106 244587 245524 246196 246439 246445 246136 245202 243739 242479
63752 242479 242197 242938 243991 244630 244769 244876 245425 246607 248422 250692 252953 254713 256013 257472 259548 261976
63736 261976 264200 266153 268315 271103 274488 278166 281797 285131 288187 291379 295272 300101 305587 311178
63722 311178 316406 321152 325780 330897 336741 342864 348597 353684 358144 361633 363435 363218 361416 358696
63708 358696 355339 351388 347112 342991 339353 336307 333974 332440 331429 330304 328647 326770 325442 325169
63694 325169 325909 327443 329722 332674 335942 339120 342143 345141 347928 349968 350899 350824 350101 349185 348642 348853
63678 348853 349466 349630 349030 348351 348442 349493 351376 354271 358321 362984 367430 371437 375265 378826 381660 383729
63662 383729 385510 387134 388040 387720 386242 383804 380219 375155 368529 360525 351641 342870 335312 329279 324181
$$ packed form
63770B50485K39j13p51j088r40q60j136j204n26M81R37O72K43Ol09r34j463j260
63752B42479k82P41J053O39J39J07N49J182J815K270K261J760J300J459K076K428
63736B61976K224J953K162K788L385L678L631L334L056L192L893M829N486N591
63722C11178N228M746M628N117N844O123N733N087M460L489J802k17j802k720
63708C58696l357l951m276m121l638l046k333j534j011j125j657j877j328k73
63694C25169P40J534K279K952L268L178L023K998K787K040R31p5p23r16n43K11
63678C48853O13J64o00o79R1J051J883K895M050M663M446M007L828L561K834K069
63662C83729J781J624R06l20j478k438l585n064o626q004q884q771p558o033n098
$$ plain form
63647 324181 319541 315687 313126 311687 310720 309863 309189 308849 308949 309569 310614 311937 313863 317192 322194 327945
63631 327945 333209 337810 342558 347997 353798 359385 364589 369664 375132 381684 389786 399277 409654 420749
63617 420749 432741 445639 459360 474328 491265 510162 530152 550794 572841 597141 623294
63606 623294 650139 677205 704782 732472 758470 780585 797513 808921 814910 815950 813064 807580
63594 807580 800648 793195 786097 779916 774439 768825 762323 754594 745257 733486 718473 700296 680059
63581 680059 659151 638527 618774 600554 584590 571161 559849 550058 541735 535395 531429 529563
63569 529563 529102 529565 530963 533592 537653 542988 548999 554920 560330 565403 570570 576127 582382 589999 599681
63554 599681 611452 624620 638676 653944 671196 690927 713387 739177 769400 805001 845745
$$ packed form
63647C24181m640l854k561j439r67q57o74l40J00O20J045J323J926L329N002N751
63631C27945N264M601M748N439N801N587N204N075N468O552Q102R491J0377J1095
63617D20749J1992J2898J3721J4968J6937J8897J9990K0642K2047K4300K6153
63606F23294K6845K7066K7577K7690K5998K2115J6928J1408N989J040k886n484
63594H07580o932p453p098o181n477n614o502p729r337j1771j5013j8177k0237
63581F80059k0908k0624j9753j8220j5964j3429j1312r791q323o340l966j866
63569E29563m61M63J398K629M061N335O011N921N410N073N167N557O255P617R682
63554E99681J1771J3168J4056J5268J7252J9731K2460K5790L0223L5601M0744
$$ plain form
63543 845745 889498 932318 969559 997445 1014084 1019563 1015672 1005565 992883 980371 969189 959578
63531 959578 951779 945945 941489 937149 931641 923920 913042 898343 879758 857518 831653 802351 770756
63518 770756 738744 707706 678076 650115 624506 601725 581367 562587 544999 528804 514213
63507 514213 501104 489160 478144 468120 459434 452301 446419 441304 436948 433648 431087 428223 424477
63494 424477 420543 417577 415919 415070 414540 414130 413654 413043 412695 413171 414507 416244 418145 420419 423230 426471
63478 426471 430164 434630 439958 445570 450653 454885 458536 461850 464481 465580 464483 461320 456961 452281
63464 452281 447543 442499 436936 430949 424797 418759 413134 408238 404289 401316 399192 397708 396717 396302 396744
63449 396744 398193 400427 403090 406154 410070 415428 422514 431132 440833 451289 462455 474424 487368
$$ packed form
63543H45745M3753M2820L7241K7886J6639N479l891j0107j2682j2512j1182r611
63531I59578p799n834m456m340n508p721j0878j4699j8585k2240k5865k9302l1595
63518G70756l2012l1038k9630k7961k5609k2781k0358j8780j7588j6195j4591
63507E14213j3109j1944j1016j0024q686p133n882n115m356l300k561k864l746
63494D24477l934k966j658q49n30m10m76o11l48M76J336J737J901K274K811L241
63478D26471L693M466N328N612N083M232L651L314K631J099j097l163m359m680
63464D52281m738n044n563n987o152o038n625m896l949k973k124j484r91m15M42
63449C96744J449K234K663L064L916N358P086Q618R701J0456J1166J1969J2944
$$ plain form
63436 487368 501866 519136 540534 566643 596869 629628 662468 692146 715597 731512 740905 745893
63424 745893 748270 749445 751158 755372 763401 775602 791915 812283 836482 863900 893675 924858
63412 924858 956308 986437 1013132 1034134 1047940 1054554 1055229 1051385 1044064 1034415 1024033 1014209 1005101
63399 1005101 996009 986139 974606 960159 941740 919415 894170 866856 837884 807953 778320 750043
63387 750043 723346 697991 673977 651723 631813 614626 600019 587400 576426 567566 561581 558487
63375 558487 557457 557712 559050 561530 565239 570550 578001 587597 598538 609932 621557 633849 647474
63362 647474 662973 680437 699421 719607 741606 766582 794898 825660 857835 891148 925376
63351 925376 959173 990200 1016256 1035994 1048891 1055170 1055741 1051882 1044861 1035831 1025725 1015017 1003817
$$ packed form
63436D87368J4498J7270K1398K6109L0226L2759L2840K9678K3451J5915R393M988
63424G45893K377J175J713M214Q029J2201J6313K0368K4199K7418K9775L1183
63412I24858L1450L0129K6695K1002J3806O614O75l844p321r649j0382r824r108
63399A005101r092r870j1533j4447j8419k2325k5245k7314k8972k9931k9633k8277
63387G50043k6697k5355k4014k2254j9910j7187j4607j2619j0974q860n985l094
63375E58487j030K55J338K480L709N311P451R596J0941J1394J1625J2292J3625
63362F47474J5499J7464J8984K0186K1999K4976K8316L0762L2175L3313L4228
63351I25376L3797L1027K6056J9738J2897O279N71l859p021r030j0106j0708j1200
$$ plain form
63338 1003817 992376 981176 970186 958299 943870 925684 903322 877132 848382 819107 791138
63327 791138 765136 740847 718146 697481 679481 664653 653531 646673 644185 645167 647507 648222 644448
63314 644448 634743 619712 601386 581984 563072 545331 528752 513206 499114 487288 477980 470459
63302 470459 463838 457920 452789 448094 443423 439095 435722 433015 429810 425435 420455 415871 412154 409206
63288 409206 406722 404285 401571 398763 396407 394616 392824 390567 388134 386064 384298 382247 379591 376679
63274 376679 374240 372819 372380 372244 371592 370279 369041 368808 369860 371719 373585 374822 375333 375711 376799 378838
63258 378838 381217 383251 384986 387070 389992 393768 398119 402686 407232 412004 417742 424903 432924 440642
63244 440642 447574 454470 462531 472374 483888 496812 511162 527110 544648 563460 583238 604152
$$ packed form
63338A003817j1441j1200j0990j1887j4429j8186k2362k6190k8750k9275k7969
63327G91138k6002k4289k2701k0665j8000j4828j1122o858k488R82K340P15l774
63314F44448r705j5031j8326j9402j8912j7741j6579j5546j4092j1826r308p521
63302D70459o621n918n131m695m671m328l373k707l205m375m980m584l717k948
63288D09206k484k437k714k808k356j791j792k257k433k070j766k051k656k912
63274C76679k439j421m39j36o52j313j238k33J052J859J866J237N11L78J088K039
63258C78838K379K034J735K084K922L776M351M567M546M772N738P161Q021P718
63244D40642O932O896Q061R843J1514J2924J4350J5948J7538J8812J9778K0914
$$ plain form
63232 604152 626819 651626 678196 705790 734121 763417 793669 824187 854084 882916 910724
63221 910724 937798 964646 991885 1019788 1048076 1076400 1104841 1133599 1162370 1190368 1216795
63210 1216795 1240788 1260971 1275738 1284196 1286338 1282077 1270690 1251720 1226004 1195210 1160635 1123045
63198 1123045 1083501 1043552 1004489 967079 932214 901112 874428 851674 832127 816031 804363
63187 804363 797619 795349 796882 801954 810507 822229 836453 852388 869452 887662 907586 929534
63175 929534 952776 975932 998185 1019773 1041216 1062534 1083421 1103707 1123213 1141436 1157753
63164 1157753 1171761 1183011 1190602 1193425 1190755 1182264 1167668 1146914 1120775 1090736 1058094 1023419
63152 1023419 987006 949423 911474 874041 838221 805152 775249 747839 722033 697824 675905
$$ packed form
63232F04152K2667K4807K6570K7594K8331K9296L0252L0518K9897K8832K7808
63221I10724K7074K6848K7239K7903K8288K8324K8441K8758K8771K7998K6427
63210A216795K3993K0183J4767Q458K142m261j1387j8970k5716l0794l4575l7590
63198A123045l9544l9949l9063l7410l4865l1102k6684k2754j9547j6096j1668
63187H04363o744k270J533N072Q553J1722J4224J5935J7064J8210J9924K1948
63175I29534K3242K3156K2253K1588K1443K1318K0887K0286J9506J8223J6317
63164A157753J4008J1250P591K823k670q491j4596k0754k6139l0039l2642l4675
63152A023419l6413l7583l7949l7433l5820l3069k9903k7410k5806k4209k1919
$$ plain form
63141 675905 656587 639466 624198 611001 600151 591369 584049 577854 572774 568807 565861 563849 562668
63128 562668 562111 562022 562442 563486 565188 567605 570872 574884 579088 582908 586364 590018 594299 599084 603843
63113 603843 607959 610981 612915 614299 615697 617093 618123 618867 619913 621450 622712 622777 621687 620403 619718
63098 619718 619529 619155 618173 616822 615757 615445 615796 616374 616878 617262 617467 617376 617091 616931 617005 617156 617501 618600
63080 618600 620684 623109 625160 627220 630524 635754 642380 649473 656607 663880 671567 680087 689916 701201
63066 701201 713635 726898 741014 756151 772471 790423 810860 834442 861108 890408 922205
63055 922205 956739 994296 1035172 1079878 1128890 1182173 1239241 1299655 1363158 1429385 1497828
63044 1497828 1568083 1639720 1711839 1783177 1852853 1920780 1987255 2052536 2116962 2181079 2245271
$$ packed form
63141F75905j9318j7121j5268j3197j0850q782p320o195n080l967k946k012j181
63128E62668n57q9M20J044J702K417L267M012M204L820L456L654M281M785M759
63113F03843M116L022J934J384J398J396J030P44J046J537J262O5j090j284o85
63098F19718j89l74r82j351j065l12L51N78N04L84K05r1k85j60P4J51L45J099
63080F18600K084K425K051K060L304N230O626P093P134P273P687Q520R829J1285
63066G01201J2434J3263J4116J5137J6320J7952K0437K3582K6666K9300L1797
63055I22205L4534L7557M0876M4706M9012N3283N7068O0414O3503O6227O8443
63044A497828P0255P1637P2119P1338O9676O7927O6475O5281O4426O4117O4192
$$ plain form
63033 2245271 2309448 2373288 2436413 2497954 2556161 2608873 2654315 2691094 2717543 2731536 2731096 2715058
63021 2715058 2683335 2636952 2577803 2508019 2429465 2344040 2254315 2163389 2074014 1988206 1907616
63010 1907616 1833617 1766809 1707060 1654564 1610492 1576157 1551741 1536327 1528903 1528875 1535717 1548749
62998 1548749 1567359 1591025 1619025 1650395 1684271 1720063 1757288 1795527 1834522 1874050 1913682
62987 1913682 1952937 1991591 2029540 2066351 2101185 2133010 2160449 2181516 2194103 2196953 2189788 2172511
62975 2172511 2144831 2106847 2059365 2003330 1939542 1869422 1795498 1720401 1645567 1571542 1499310
62964 1499310 1430507 1366209 1306219 1249870 1197078 1148243 1103410 1062057 1023680 988303 956151
62953 956151 926942 899677 873265 847232 821752 797120 773510 751190 730500 711456 693722
$$ packed form
63033B245271O4177O3840O3125O1541N8207N2712M5442L6779K6449J3993m40j6038
63021B715058l1723m6383n9149o9784p8554q5425q9725r0926q9375q5808q0590
63010A907616p3999o6808n9749n2496m4072l4335k4416j5414p424k8O842J3032
62998A548749J8610K3666K8000L1370L3876L5792L7225L8239L8995L9528L9632
62987A913682L9255L8654L7949L6811L4834L1825K7439K1067J2587K850p165j7277
62975B172511k7680l7984m7482n6035o3788p0120p3924p5097p4834p4025p2232
62964A499310o8803o4298n9990n6349n2792m8835m4833m1353l8377l5377l2152
62953I56151k9209k7265k6412k6033k5480k4632k3610k2320k0690j9044j7734
$$ plain form
62942 693722 677193 662210 648854 636401 624003 611745 600499 590806 582393 574760 567715 561274
62930 561274 555488 550498 546351 542596 538487 533828 529252 525425 522317 519553 517113 515217 513674 511893
62916 511893 509572 507049 504821 502987 501275 499402 497243 494780 492131 489606 487513 485775 483844 481217
62902 481217 478070 475232 473400 472456 471713 470769 469949 469807 470313 470750 470437 469462 468508 467970 467535 466814 466064 465858
62884 465858 466179 466435 466515 467177 468982 471322 473091 474039 474821 475833 476681 476915 476723 476633 476869 477263 477593 477798
62866 477798 477919 477916 477577 476728 475588 474613 473799 472593 470902 469770 470258 471930 473383 474231 475488 477753 480165
62849 480165 481818 483219 485377 488109 490383 492008 493805 496074 497981 498792 498874 499010 499299 499302 498927 498573 498530
62832 498530 498757 499272 500386 502264 504433 506069 506889 507553 508959 511243 513757 516029 518324 521156 524641
$$ packed form
62942F93722j6529j4983j3356j2453j2398j2258j1246r693q413p633p045o441
62930E61274n786m990m147l755m109m659m576l827l108k764k440j896j543j781
62916E11893k321k523k228j834j712j873k159k463k649k525k093j738j931k627
62902D81217l147k838j832r44p43r44q20j42N06M37l13r75r54n38m35p21p50k06
62884D65858L21K56Q0O62J805K340J769R48P82J012Q48K34j92r0K36L94L30K05
62866D77798J21ll39q49j140r75q14j206j691j132M88J672J453Q48J257K265K412
62849D80165J653J401K158K732K274J625J797K269J907Q11Q2J36K89Ll75l54m3
62832D98530K27N15J114J878K169J636Q20O64J406K284K514K272K295K832L485
$$ plain form
62817 524641 528602 532938 537479 541717 545194 548101 551112 554654 558719 563281 568415 573949 579479 584942
62803 584942 590858 597804 605912 615033 625121 636209 648195 660923 674420 688893 704500 721228
62791 721228 739019 758100 779237 803612 832228 865411 902983 944879 991405 1042999 1100058
62780 1100058 1163096 1232799 1309722 1393990 1485315 1583126 1686549 1794400 1905226 2017227
62770 2017227 2128151 2235421 2336425 2428579 2509228 2575798 2626118 2658424 2671220 2663656 2636273
62759 2636273 2591010 2530241 2455958 2370009 2274734 2173027 2067912 1962201 1858148 1757048
62749 1757048 1659257 1564925 1474658 1389301 1309384 1235122 1166754 1104438 1047901 996568 950042
62738 950042 908157 870638 837060 807080 780418 756704 735764 717971 703756 692681 683421 674784
$$ packed form
62817E24641L961M336M541M238L477K907L011L542M065M562N134N534N530N463
62803E84942N916O946Q108R121J0088J1088J1986J2728J3497J4473J5607J6728
62791G21228J7791J9081K1137K4375K8616L3183L7572M1896M6526N1594N7059
62780A100058O3038O9703P6923Q4268R1325R7811J03423J07851J10826J12001
62770B017227J10924J07270J01004R2154Q0649O6570N0320L2306J2796p564k7383
62759B636273m5263o0769p4283q5949r5275j01707j05115j05711j04053j01100
62749A757048r7791r4332r0267q5357p9917p4262o8368o2316n6537n1333m6526
62738I50042m1885l7519l3578k9980k6662k3714k0940j7793j4215j1075r260q637
$$ plain form
62726 674784 666411 658483 651318 645451 641461 639320 638314 637955 638618 640937 645049 650913 658892 669261
62712 669261 681392 694235 707684 722796 740652 761662 786114 814623 847500 884208 924029
62701 924029 967132 1014539 1067102 1124799 1187038 1253411 1324106 1399573 1479707 1563356 1648788
62690 1648788 1734509 1819211 1900976 1977093 2044963 2102747 2148843 2181273 2198136 2198414 2181954 2149124
62678 2149124 2101248 2041061 1971793 1895615 1813612 1727333 1639499 1552785 1468513 1387135 1309504
62667 1309504 1236987 1170434 1109585 1053494 1001242 952361 906963 865534 828363 795217 765746
62656 765746 740016 718239 699977 684029 669291 655423 642508 630295 618166 605828 593761
62645 593761 582810 573376 565145 557653 551013 545879 542626 540764 539341 537892 536755 536471 537050 537898 538263
$$ packed form
62726F74784q373p928p165n867l990k141j006l59O63K319M112N864P979J0369
62712F69261J2131J2843J3449J5112J7856K1010K4452K8509L2877L6708L9821
62701I24029M3103M7407N2563N7697O2239O6373P0695P5467Q0134Q3649Q5432
62690A648788Q5721Q4702Q1765P6117O7870N7784M6096L2430J6863K78j6460l2830
62678B149124m7876o0187o9268p6178q2003q6279q7834q6714q4272q1378p7631
62667A309504p2517o6553o0849n6091n2252m8881m5398m1429l7171l3146k9471
62656G65746k5730k1777j8262j5948j4738j3868j2915j2213j2129j2338j2067
62645E93761j0951r434q231p492o640n134l253j862j423j449j137k84N79Q48L65
$$ plain form
62630 538263 537591 535664 532709 529370 526320 523763 521423 519111 517085 515765 515285 515570 516703 518853 521860
62615 521860 525230 528665 532327 536497 541304 546889 553458 560891 568639 576450 584908 594865 606551 619755
62601 619755 634688 651969 671738 693446 716832 742607 771881 805259 842785 884356 929808
62590 929808 978783 1030764 1085054 1140482 1195405 1248222 1297596 1341936 1379093 1407090 1425076
62579 1425076 1433162 1431506 1419985 1398755 1368723 1331414 1288627 1242182 1193631 1144067 1094290 1045110
62567 1045110 997334 951525 907975 866840 828153 791913 758392 728168 701512 677879 656374
62556 656374 636668 619061 603689 590155 577969 566960 557119 548381 540733 534247 528892 524532 521149
62543 521149 518786 517164 515712 514150 512810 512225 512609 513814 515466 516966 517774 518001 518504 520041 522487
$$ packed form
62630E38263o72j927k955l339l050k557k340k312k026j320m80K85J133K150L007
62615E21860L370L435L662M170M807N585O569P433P748P811Q458R957J1686J3204
62601F19755J4933J7281J9769K1708K3386K5775K9274L3378L7526M1571M5452
62590I29808M8975N1981N4290N5428N4923N2817M9374M4340L7157K7997J7986
62579A425076Q086j656j1521k1230l0032l7309m2787m6445m8551m9564m9777m9180
62567A045110m7776m5809m3550m1135l8687l6240l3521l0224k6656k3633k1505
62556F56374j9706j7607j5372j3534j2186j1009r841q738p648o486n355m360l383
62543E21149k363j622j452j562j340n85L84J205J652J500Q08K27N03J537K446
$$ plain form
62528 522487 525211 528154 532163 538261 546843 557659 570327 584715 600966 619342 640060 663180
62516 663180 688639 716430 746868 780619 818303 859912 904738 951998 1001387 1052737 1105196
62505 1105196 1157055 1206500 1252302 1293640 1329482 1358454 1379365 1391793 1396138 1393130 1383428 1367925
62493 1367925 1348477 1327956 1309030 1292932 1279686 1269490 1263388 1262528 1267212 1276969 1291183 1309442
62481 1309442 1331570 1357587 1387309 1419462 1451274 1479331 1501056 1515519 1523135 1524721 1520469 1509324
62469 1509324 1489308 1458759 1417457 1366854 1309616 1248995 1187934 1128033 1069332 1011419 954652
62458 954652 900214 849444 803579 763709 730050 701254 675302 651385 630313 612811 598160
62447 598160 585107 573537 564335 557718 552556 547597 542829 539237 537504 537388 538248 539737 541733 543861
$$ packed form
62528E22487K724K943M009O098Q582J0816J2668J4388J6251J8376K0718K3120
62516F63180K5459K7791L0438L3751L7684M1609M4826M7260M9389N1350N2459
62505A105196N1859M9445M5802M1338L5842K8972K0911J2428M345l008r702j5503
62493A367925j9448k0521j8926j6098j3246j0196o102q60M684R757J4214J8259
62481A309442K2128K6017K9722L2153L1812K8057K1725J4463P616J586m252j1145
62469A509324k0016l0549m1302n0603n7238o0621o1061n9901n8701n7913n6767
62458I54652n4438n0770m5865l9870l3659k8796k5952k3917k1072j7502j4651
62447E98160j3053j1570r202o617n162m959m768l592j733j16Q60J489J996K128
$$ plain form
62433 543861 545446 546015 545622 544493 542599 539845 536514 533097 529564 525259 519774 513665 507976 503243 499314
62418 499314 495930 492982 490212 487183 483784 480348 477038 473440 469146 464459 460081 456242 452649 449267
62404 449267 446610 445083 444499 444488 444946 445709 446179 445874 445193 445092 446038 447756 449985 452767 455813 458268 459704
62387 459704 460955 463304 466976 471057 474856 478719 483291 488543 494024 499677 505825 512385 518723 524532
62373 524532 530495 537714 546614 556726 567451 578636 590453 603199 617463 634010 653065 674034
62361 674034 696484 721250 749896 783051 819901 859500 901971 948039 997906 1050965 1106048
62350 1106048 1161230 1213738 1260893 1301269 1334528 1360336 1378138 1387967 1390623 1386776 1376556 1360342
62338 1360342 1339270 1314401 1285804 1253139 1216936 1178649 1139564 1100262 1061255 1023580 988384
$$ packed form
62433E43861J585N69l93j129j894k754l331l417l533m305n485o109n689m733l929
62418D99314l384k948k770l029l399l436l310l598m294m687m378l839l593l382
62404D49267k657j527n84j1M58P63M70l05o81j01R46J718K229K782L046K455J436
62387D59704J251K349L672M081L799L863M572N252N481N653O148O560O338N809
62373E24532N963P219Q900J0112J0725J1185J1817J2746J4264J6547J9055K0969
62361F74034K2450K4766K8646L3155L6850L9599M2471M6068M9867N3059N5083
62350A106048N5182N2508M7155M0376L3259K5808J7802R829K656l847j0220j6214
62338A360342k1072k4869k8597l2665l6203l8287l9085l9302l9007l7675l5196
$$ plain form
62327 988384 956181 926735 899520 874049 849903 826733 804381 782971 762723 743608 725176
62316 725176 706862 688513 670504 653219 636573 620317 604730 590688 578858 569030 560441 552684
62304 552684 546000 540689 536505 532885 529653 527163 525591 524340 522455 519672 516811 515022 514732 515432 516394
62289 516394 517452 519040 521547 524751 527996 530914 533777 536972 540318 543249 545638 548058 551117 554894
62275 554894 559228 564216 570069 576766 584241 592744 602589 613696 625862 639397 654934 672569 691857
62262 691857 712957 737165 765839 799169 836532 877771 923466 974056 1029254 1088445 1151007
62251 1151007 1215910 1281310 1344815 1404019 1456633 1500437 1533595 1555189 1565452 1565541 1557081 1541573
62239 1541573 1519806 1491719 1456931 1415456 1368019 1315928 1260798 1204250 1147587 1091782 1037891
$$ packed form
62327I88384l2203k9446k7215k5471k4146k3170k2352k1410k0248j9115j8432
62316G25176j8314j8349j8009j7285j6646j6256j5587j4042j1830r828q589p757
62304E52684o684n311m184l620l232k490j572j251j885k783k861j789k90P00R62
62289E16394J058J588K507L204L245K918K863L195L346K931K389K420L059L777
62275E54894M334M988N853O697P475Q503R845J1107J2166J3535J5537J7635J9288
62262F91857K1100K4208K8674L3330L7363M1239M5695N0590N5198N9191O2562
62251A151007O4903O5400O3505N9204N2614M3804L3158K1594J0263Q9q460j5508
62239A541573k1767k8087l4788m1475m7437n2091n5130n6548n6663n5805n3891
$$ plain form
62228 1037891 987319 941267 899880 862302 827840 796785 769796 746675 726271 707631 690795
62217 690795 676173 663474 651755 640526 630342 622073 615823 610801 606085 601239 596302 591568 587536
62204 587536 584806 583665 583813 584626 585810 587662 590630 594728 599548 604879 611110 618809 627990 638050
62190 638050 648470 659280 670622 682220 693671 705159 717345 730436 743752 756371 767866
62179 767866 778159 786975 793882 798807 802200 804695 806873 809409 813171 819007 827432 838615 852692
62166 852692 870148 891813 918307 949429 984264 1021924 1061862 1103211 1144139 1182240 1215493
62155 1215493 1242623 1262872 1276049 1282799 1284228 1280946 1272753 1259423 1241432 1219662 1194708 1166758
62143 1166758 1136015 1103034 1068839 1034963 1003156 974653 949594 927261 906926 888494 872519
$$ packed form
62228A037891n0572m6052m1387l7578l4462l1055k6989k3121k0404j8640j6836
62217F90795j4622j2699j1719j1229j0184q269o250n022m716m846m937m734m032
62204E87536k730j141J48Q13J184J852K968M098M820N331O231P699R181J0060
62190F38050J0420J0810J1342J1598J1451J1488J2186J3091J3316J2619J1495
62179G67866J0293Q816O907M925L393K495K178K536L762N836Q425J1183J4077
62166H52692J7456K1665K6494L1122L4835L7660L9938M1349M0928L8101L3253
62155A215493K7130K0249J3177O750J429l282q193j3330j7991k1770k4954k7950
62143A166758l0743l2981l4195l3876l1807k8503k5059k2333k0335j8432j5975
$$ plain form
62132 872519 859661 849982 842696 836791 831964 828679 827210 827031 827485 828738 831581 836369 842650 849845
62118 849845 857885 867038 877484 889176 901877 915086 928049 939855 949414 955399 956708 953367 946915
62105 946915 939613 933115 927778 922970 917870 912062 905641 898955 892342 886146 880806 876711 873953 872477
62091 872477 872477 874380 878269 883498 889104 894550 899999 905995 913031 921237 930296 939794 949865 961333
62077 961333 974952 990610 1007603 1025633 1044993 1065647 1086649 1106963 1126569 1146168 1165837
62066 1165837 1184616 1201752 1217933 1234788 1253284 1273044 1293247 1313618 1334154 1354160 1372062
62055 1372062 1386227 1395705 1400202 1399875 1395500 1388443 1379802 1369368 1355794 1337924 1315711 1289694 1260018
62042 1260018 1226499 1189558 1150618 1111350 1072743 1034956 997871 961609 926674 893733 863198
$$ packed form
62132H72519j2858r679p286n905m827l285j469j79M54J253K843M788O281P195
62118H49845Q040R153J0446J1692J2701J3209J2963J1806R559N985J309l341o452
62105I46915p302o498n337m808n100n808o421o686o613o196n340m095k758j476
62091H72477%J903L889N229N606N446N449N996P036Q206R059R498J0071J1468
62077I61333J3619J5658J6993J8030J9360K0654K1002K0314J9606J9599J9669
62066A165837J8779J7136J6181J6855J8496J9760K0203K0371K0536K0006J7902
62055A372062J4165R478M497l27m375p057q641j0434j3574j7870k2213k6017k9676
62042A260018l3519l6941l8940l9268l8607l7787l7085l6262l4935l2941l0535
$$ plain form
62031 863198 834952 808627 784216 762251 743217 726941 712694 699739 687609 676035 664886
62020 664886 654209 644070 634311 624600 614672 604405 593799 583177 573357 565277 559238 554711 551029
62007 551029 548159 546669 547061 549295 552952 557741 563756 571150 579610 588290 596390 603594 609745 614339
61993 614339 616818 617411 617186 617023 616694 615094 611203 604754 596247 586565 576444 566091 555382 544431
61979 544431 533770 523883 514882 506765 499704 493839 488989 484806 481041 477473 473834 470118 466799 464403
61965 464403 462986 462265 462112 462522 463234 463726 463643 462979 461972 461122 461205 462817 465854 469768 474312 479664 485840
61948 485840 492472 499378 507062 516347 527781 541540 557670 576118 596586 618545 641434 664877
61936 664877 688818 713450 738814 764439 789584 813837 837195 859482 880031 898209 914007
$$ packed form
62031H63198k8246k6325k4411k1965j9034j6276j4247j2955j2130j1574j1149
62020F64886j0677j0139r759r711r928j0267j0606j0622r820q080o039m527l682
62007E51029k870j490L92K234L657M789O015P394Q460Q680Q100P204O151M594
61993F14339K479N93k25j63l29j600l891o449q507r682j0121j0353j0709j0951
61979E44431j0661r887r001q117p061n865m850m183l765l568l639l716l319k396
61965D64403j417p21j53M10P12M92q3o64j007q50Q3J612L037L914M544N352O176
61948D85840O632O906P684R285J1434J3759J6130J8448K0468K1959K2889K3443
61936F64877K3941K4632K5364K5625K5145K4253K3358K2287K0549J8178J5798
$$ plain form
61925 914007 927802 939568 948576 953867 954857 951601 944713 935136 923954 912300 901329 892074 885243
61912 885243 881190 880114 882250 887862 897168 910283 927082 947036 969195 992251 1014484 1033833
61900 1033833 1048501 1057717 1061769 1061243 1056416 1047483 1034936 1019423 1001400 981285 959879 938296
61888 938296 917383 897352 877980 859040 840489 822362 804529 786616 768308 749790 731736
61877 731736 714692 698554 682864 667534 653170 640680 630680 623129 617349 612482 608206 605081
61865 605081 604051 605577 609365 614862 621791 630203 640297 652375 666819 683916 703755 726403 752026
61852 752026 780724 812325 846590 883534 923300 965576 1009336 1053267 1096287 1137486 1175747
61841 1175747 1209784 1238591 1261561 1278060 1287214 1288501 1282542 1271122 1256364 1239960 1223077 1206737
$$ packed form
61925I14007J3795J1766R008N291R90l256o888r577j1182j1654j0971r255o831
61912H85243m053j076K136N612R306J3115J6799J9954K2159K3056K2233J9349
61900A033833J4668R216M052n26m827q933j2547j5513j8023k0115k1406k1583
61888I38296k0913k0031j9372j8940j8551j8127j7833j7913j8308j8518j8054
61877G31736j7044j6138j5690j5330j4364j2490j0000p551n780m867m276l125
61865F05081j030J526L788N497O929Q412J0094J2078J4444J7097J9839K2648K5623
61852G52026K8698L1601L4265L6944L9766M2276M3760M3931M3020M1199L8261
61841A175747L4037K8807K2970J6499R154J287n959j1420j4758j6404j6883j6340
$$ plain form
61829 1206737 1192123 1180579 1173346 1171225 1174414 1182591 1195015 1210443 1227144 1243219 1256976 1266919
61817 1266919 1271547 1269459 1259763 1242239 1217203 1185468 1148465 1108081 1066120 1023924 982428 942297
61805 942297 903919 867510 833370 801852 772945 746147 721012 697700 676752 658406 642322
61794 642322 627910 614704 602483 591263 581222 572491 564939 558276 552286 546872 541866 537030 532316
61781 532316 527984 524292 521147 518210 515305 512558 510047 507574 505038 502878 501728 501588 501781 502009 502958
61766 502958 505399 508968 512485 515359 518005 520797 523363 525262 526799 528668 531166 534133 537338 540463
61752 540463 542970 544502 545278 545677 545557 544376 541865 538205 533709 528770 524001 519921 516558 513809 512049
61737 512049 511771 512592 513329 513303 512932 512747 512527 511949 511536 512188 513982 516224 518618 521624 525446 529428 532902
$$ packed form
61829A206737j4614j1544p233k121L189Q177J2424J5428J6701J6075J3757R943
61817A266919M628k088r696j7524k5036l1735l7003m0384m1961m2196m1496m0131
61805I42297l8378l6409l4140l1518k8907k6798k5135k3312k0948j8346j6084
61794F42322j4412j3206j2221j1220j0041q731p552o663n990n414n006m836m714
61781E32316m332l692l145k937k905k747k511k473k536k160j150j40J93K28R49
61766E02958K441L569L517K874K646K792K566J899J537J869K498K967L205L125
61752E40463K507J532P76L99j20j181k511l660m496m939m769m080l363k749j760
61737E12049k78Q21P37k6l71j85k20n78m13O52J794K242K394L006L822L982L474
$$ plain form
61720 532902 536137 539853 544012 547787 550742 553473 556792 560656 564233 566709 567631 566731 563979 559883 555231
61705 555231 550340 544893 538715 532383 526689 521736 516903 511615 505845 499944 494279 489101 484543 480633
61691 480633 477338 474552 471973 469230 466303 463595 461255 458659 455038 450609 446554 443690 441600 439378
61677 439378 436957 435216 434839 435403 435772 435249 434163 433357 433234 433455 433458 433061 432440 431763 431036 430259 429541 429146
61659 429146 429472 430809 432960 435320 437608 440282 443868 448059 451901 454850 457212 459608 462508 466270
61645 466270 470973 476013 480400 483900 487435 491972 497216 501820 504711 505913 506201 506269 506146 505243 503064
61630 503064 499919 496644 493556 490122 485930 481466 477450 473852 470241 466890 464740 464247 464902 465987 467195
61615 467195 468365 469173 469362 468850 467406 464698 460892 456661 452249 447064 440708 433985 428182 423602 419516
$$ packed form
61720E32902L235L716M159L775K955K731L319L864L577K476R22r00k752m096m652
61705E55231m891n447o178o332n694m953m833n288n770n901n665n178m558l910
61691D80633l295k786k579k743k927k708k340k596l621m429m055k864k090k222
61677D39378k421j741l77N64L69n23j086q06j23K21Ll97o21o77p27p77p18l95
61659D29146L26J337K151K360K288K674L586M191L842K949K362K396K900L762
61645D66270M703N040M387L500L535M537N244M604K891J202K88O8j23r03k179
61630E03064l145l275l088l434m192m464m016l598l611l351k150m93O55J085J208
61615D67195J170Q08J89n12j444k708l806m231m412n185o356o723n803m580m086
$$ plain form
61600 419516 415429 411559 407944 403896 398880 393455 388747 385200 382315 379472 376504 373436 370152 366636
61586 366636 363283 360685 359084 358161 357293 355967 354036 351780 349797 348681 348586 348989 348960 347872 345932 343936
61570 343936 342472 341456 340512 339612 339106 339219 339787 340472 340994 341188 341128 341233 341893 342837 343249 342804 342203 342316
61552 342316 343071 343718 344035 344590 345717 346898 347536 347934 349030 351282 354185 356791 358494 359437 360459 362591
61536 362591 366281 370997 375776 380179 384526 389158 393708 397299 399384 400140 400010 399019 396812 393331 389198
61521 389198 385211 381642 378311 375147 372259 369470 366391 363238 361062 360677 361628 362751 363569 364546 366018
61506 366018 367578 368750 369644 370508 371012 370534 369025 367126 365486 364359 363901 364389 365846 367713 369214 370044
61490 370044 370471 370770 370787 370156 368851 367327 366173 365735 366050 366988 368305 369702 370942 371954 372805 373649 374699
$$ packed form
61600D19516m087l870l615m048n016n425m708l547k885k843k968l068l284l516
61586C66636l353k598j601r23q68j326j931k256j983j116r5M03k9j088j940j996
61570C43936j464j016r44r00n06J13N68O85N22J94o0J05O60R44M12m45o01J13
61552C42316P55O47L17N55J127J181O38L98J096K252K903K606J703R43J022K132
61536C62591L690M716M779M403M347M632M550L591K085P56j30r91k207l481m133
61521C89198l987l569l331l164k888k789l079l153k176l85R51J123Q18R77J472
61506C66018J560J172Q94Q64N04m78j509j899j640j127m58M88J457J867J501Q30
61490C70044M27K99J7o31j305j524j154m38L15R38J317J397J240J012Q51Q44J050
$$ plain form
61473 374699 376051 377396 378131 378028 377678 377903 378784 379620 379889 379829 379895 380125 380415 381019 382210 383557 384149 383646
61455 383646 382746 382457 383246 384961 387173 389331 390876 391608 391850 392078 392488 393126 394243 396140 398701 401396
61439 401396 403848 406196 408831 411953 415507 419370 423442 427584 431607 435367 438766 441669 443897 445400
61425 445400 446414 447314 448198 448742 448636 448173 448192 449314 451388 453802 456150 458371 460377 461827 462334 461711
61409 461711 459982 457301 453933 450206 446433 442889 439809 437263 435039 432790 430382 428044 426104 424544
61395 424544 422838 420353 417126 414163 412629 412641 413127 413047 412396 411799 411600 411878 412945 415027 417494 419210
61379 419210 419872 420369 421568 423353 425164 426945 429090 431823 435092 438731 442316 445175 447048 448540 450517
61364 450517 453210 456261 459357 462383 465226 467970 471154 475248 479995 484797 489741 495630 502973 511512
$$ packed form
61473C74699J352J345P35j03l50K25Q81Q36K69o0O6K30K90O04J191J347N92n03
61455C83646r00k89P89J715K212K158J545P32K42K28M10O38J117J897K561K695
61439D01396K452K348K635L122L554L863M072M142M023L760L399K903K228J503
61425D45400J014R00Q84N44j06m63J9J122K074K414K348K221K006J450N07o23
61409D61711j729k681l368l727l773l544l080k546k224k249k408k338j940j560
61395D24544j706k485l227k963j534J2M86q0o51n97j99K78J067K082K467J716
61379D19210O62M97J199J785J811J781K145K733L269L639L585K859J873J492J977
61364D50517K693L051L096L026K843K744L184M094M747M802M944N889P343Q539
$$ plain form
61350 511512 520919 531405 543294 556268 569351 581491 592055 600936 608342 614489 619544 623909 628219
61337 628219 632696 636696 639363 640599 640876 640228 638126 634350 629318 623341 616333 608596 601216 595130 590267
61322 590267 586114 582676 580259 578661 577299 576084 575517 575876 576812 577848 578923 580330 582449 585658 590237
61307 590237 596189 603325 611603 621244 632328 644275 655756 665219 671633 674761 674708 671426 665049 656669
61293 656669 648150 640750 634148 627182 619296 610982 603120 596399 591195 587463 584669 582236 580123 578742
61279 578742 578359 578934 580441 582911 586142 589810 593956 598945 604858 611401 618467 626253 634574 642681 650148
61264 650148 657440 665049 672564 679425 686357 695069 706312 719015 731644 743678 755170 765486 773465
61251 773465 778763 782255 784835 786345 785932 783116 778215 771956 764987 757582 749643 741088 732339 724173
$$ packed form
61350E11512R407J0486J1889J2974J3083J2140J0564Q881P406O147N055M365M310
61337F28219M477M000K667J236K77o48k102l776n032n977p008p737p380o086m863
61322E90267m153l438k417j598j362j215n67L59R36J036J075J407K119L209M579
61307E90237N952P136Q278R641J1084J1947J1481R463O414L128n3l282o377q380
61293F56669q519p400o602o966p886q314p862o721n204l732k794k433k113j381
61279E78742l83N75J507K470L231L668M146M989N913O543P066P786Q321Q107P467
61264F50148P292P609P515O861O932Q712J1243J2703J2629J2034J1492J0316P979
61251G73465N298L492K580J510m13k816m901o259o969p405p939q555q749q166
$$ plain form
61237 724173 716976 710414 704048 697902 692103 686362 680393 674731 670485 668149 667145 666647 666440 666695 667329
61222 667329 667999 668590 669336 670405 671523 672159 672165 672182 673248 675840 679408 682937 685719 687364 687557 686395 684816
61205 684816 684007 684304 685195 686399 688339 691468 695882 701917 710415 721929 736144 752531 771078 791768
61191 791768 813682 835161 854723 871484 885042 895537 903636 910047 915145 919323 923273 927349 930908
61178 930908 932821 932497 929965 925270 918500 910351 901984 894141 886703 879056 870534 860717 849833 838721
61164 838721 827899 816791 804465 791028 777552 764591 751582 737988 724424 712277 702570 695461
61152 695461 690488 687042 684883 684325 685756 688927 692961 696843 699497 699584 696088 689298 680614 671201 661380
61137 661380 651426 642167 634337 627991 623062 619937 618938 619647 621368 624049 628281 634554 642938 653278
$$ packed form
61237G24173p197o562o366o146n799n741n969n662m246k336j004m98k07K55O34
61222F67329O70N91P46J069J118O36OJ7J066K592L568L529K782J645J93j162j579
61205F84816q09K97Q91J204J940L129M414O035Q498J1514J4215J6387J8547K0690
61191G91768K1914K1479J9562J6761J3558J0495Q099O411N098M178L950M076L559
61178I30908J913l24k532m695o770q149q367p843p438p647q522r817j0884j1112
61164H38721j0822j1108j2326j3437j3476j2961j3009j3594j3564j2147r707p109
61152F95461m973l446k159n58J431L171M034L882K654Q7l496o790q684r413r821
61137F61380r954r259p830o346m929l125r99P09J721K681M232O273Q384J0340
$$ plain form
61123 653278 665333 678856 693836 710426 728438 747247 766549 786798 808504 831450 855049
61112 855049 879020 903130 926608 948655 969403 989573 1009168 1027262 1043231 1057425 1070301
61101 1070301 1081416 1089704 1094296 1094674 1090452 1081587 1068706 1052825 1034727 1014877 993805 972129
61089 972129 950154 927831 905307 883295 862599 843346 824949 806920 789532 773549 759405
61078 759405 746851 735422 725078 716307 709630 705051 701903 699284 696701 694316 692585 691776 691938 693113
61064 693113 695302 698284 701777 705807 710697 716623 723458 731099 739663 749289 759978 771755 784754
61051 784754 799028 814547 831454 850058 870421 892217 915176 939368 964838 991225 1018030
61040 1018030 1045102 1072599 1100633 1129175 1158172 1187567 1217405 1248092 1280240 1313958 1348528
$$ packed form
61123F53278J2055J3523J4980J6590J8012J8809J9302K0249K1706K2946K3599
61112H55049K3971K4110K3478K2047K0748K0170J9595J8094J5969J4194J2876
61101A070301J1115Q288M592L78m222q865j2881j5881j8098j9850k1072k1676
61089I72129k1975k2323k2524k2012k0696j9253j8397j8029j7388j5983j4144
61078G59405j2554j1429j0344q771o677m579l148k619k583k385j731q09J62J175
61064F93113K189K982L493M030M890N926O835P641Q564R626J0689J1777J2999
61051G84754J4274J5519J6907J8604K0363K1796K2959K4192K5470K6387K6805
61040A018030K7072K7497K8034K8542K8997K9395K9838L0687L2148L3718L4570
$$ plain form
61029 1348528 1383148 1417891 1453618 1491114 1530699 1572514 1616571 1662328 1708650 1754644 1800599
61018 1800599 1848041 1898938 1954945 2017387 2087699 2167555 2258394 2361035 2476020 2604316 2747817
61007 2747817 2910002 3097029 3318065 3583573 3902828 4283349 4732488 5259134 5875041
60998 5875041 6597385 7452012 8474889 9711604 11214133 13023929 15127349 17396659
60990 17396659 19570818 21327454 22426499 22829509 22706909 22339918 22003406 21897134 22115213
60981 22115213 22614281 23191337 23528641 23323946 22434440 20931801 19036777 16998164 15004722
60972 15004722 13163520 11518987 10077569 8825790 7743668 6812785 6017261 5341535
60964 5341535 4770231 4289532 3886715 3548561 3261813 3015416 2801433 2613921 2448013
$$ packed form
61029A348528L4620L4743L5727L7496L9585M1815M4057M5757M6322M5994M5955
61018A800599M7442N0897N6007O2442P0312P9856R0839J02641J14985J28296J43501
61007B747817J62185J87027K21036K65508L19255L80521M49139N26646O15907
60998E875041P22344Q54627J022877J236715J502529J809796K103420K269310
60990A7396659K174159J756636J099045M03010j22600l66991l36512j06272K18079
60981B2115213M99068N77056L37304k04695q89506j502639j895024k038613j993442
60972A5004722j841202j644533j441418j251779j082122r30883p95524o75726
60964E341535n71304m80699m02817l38154k86748k46397k13983j87512j65908
$$ plain form
60955 2448013 2300175 2168244 2050619 1945748 1852355 1769508 1696158 1630948 1572512 1519555
60945 1519555 1470559 1423818 1377911 1331959 1285630 1239356 1194441 1152202 1112794 1075265 1038864
60934 1038864 1003835 970784 939866 910948 884078 859290 836227 814463 794091 775596 759156
60923 759156 744410 730972 718879 708379 699422 691476 683852 676216 668818 662250 657008 653239 650771
60910 650771 649197 647990 646805 645752 645246 645472 646109 646636 646752 646454 645873 645116 644121 642552 640054 636752
60894 636752 633261 629952 626386 621814 616111 609884 603684 597624 591869 587019 583518 580864 577848 573658
60880 573658 568496 563059 557658 551961 545508 538319 531072 524659 519449 514965 510440 505807 501966 499839
60866 499839 499248 498972 497964 496333 495017 494711 495305 496350 497793 500075 503510 507714 511736 514789 516772
$$ packed form
60955B448013j47838j31931j17625j04871r3393q2847p3350o5210n8436n2957
60945A519555m8996m6741m5907m5952m6329m6274m4915m2239l9408l7529l6401
60934A038864l5029l3051l0918k8918k6870k4788k3063k1764k0372j8495j6440
60923G59156j4746j3438j2093j0500q957p946p624p636p398o568n242l769k468
60910F50771j574j207j185j053n06K26O37N27J16k98n81p57r95j569k498l302
60894F36752l491l309l566m572n703o227o200o060n755m850l501k654l016m190
60880E73658n162n437n401n697o453p189p247o413n210m484m525m633l841k127
60866D99839n91k76j008j631j316l06N94J045J443K282L435M204M022L053J983
$$ plain form
60851 516772 518063 518942 519410 519538 519792 520820 522957 525968 529086 531259 531584 529843 526626 522720 518359
60836 518359 513295 507562 501814 496696 492133 487573 482821 478335 474720 472205 470657 469791 469237 468638 467861
60821 467861 466971 465908 464425 462511 460655 459312 458245 456732 454467 451878 449461 447143 444579 441860
60807 441860 439552 437981 436720 434980 432447 429638 427353 425819 424468 422591 420087 417498 415402 413933
60793 413933 412846 411755 410283 408222 405775 403576 402257 401945 402188 402347 402080 401531 401084 400890 400710 400316
60777 400316 399928 400005 400612 401299 401672 401794 401932 402290 403130 404772 407117 409527 411558 413538 415918 418344 420049
60760 420049 421141 422733 425525 428858 431548 433155 433955 434064 433283 431749 430151 429101 428628 428420 428349 428602
60744 428602 429470 431087 433170 434869 435075 433157 429379 424478 418969 413101 407386 402662 399323 396780 394079
$$ packed form
60851E16772J291Q79M68J28K54J028K137L011L118K173L25j741l217l906m361
60836E18359n064n733n748n118m563m560m752m486l615k515j548q66n54n99p77
60821D67861q90j063j483j914j856j343j067j513k265k589k417k318k564k719
60807D41860k308j571j261j740k533k809k285j534j351j877k504k589k096j469
60793D13933j087j091j472k061k447k199j319l12K43J59k67n49m47j94j80l94
60777D00316l88P7O07O87L73J22J38L58Q40J642K345K410K031J980K380K426J705
60760D20049J092J592K792L333K690J607Q00J09p81j534j598j050m73k08p1K53
60744D28602Q68J617K083J699K06j918l778m901n509n868n715m724l339k543k701
$$ plain form
60729 394079 391069 388511 386980 386067 384869 382990 380703 378427 376471 375171 374750 374917 374992 374663 374316 374437
60713 374437 374932 375323 375430 375561 376042 376851 377708 378344 378675 378873 379342 380476 382354 384654 386852 388456 389209
60696 389209 389246 389149 389641 391018 392865 394410 395185 395319 395231 395196 395257 395459 395985 397075 398878 401388 404428 407674
60678 407674 410846 413916 416985 419904 422201 423595 424454 425497 426972 428349 428871 428295 427002 425491 423896
60663 423896 421941 419275 415817 411876 408067 405118 403578 403507 404382 405508 406534 407462 408199 408469 408368 408656
60647 408656 410125 412780 415894 418752 420946 422058 421592 419452 416221 412787 409797 407478 405682 404027
60633 404027 402261 400630 399683 399629 400124 400784 401510 402153 402272 401620 400668 400231 400601 401355 401923 402081 401928 401721
60615 401721 401820 402489 403677 405079 406428 407547 408219 408317 408159 408434 409505 410944 411927 412059 411657 411294 411242 411322
$$ packed form
60729C94079l010k558j531r13j198j879k287k276j956j300m21J67P5l29l47J21
60713C74437M95L91J07J31M81Q09Q57O36L31J98M69J134J878K300K198J604P53
60696C89209L7r7M92J377J847J545P75J34q8l5O1K02N26J090J803K510L040L246
60678D07674L172L070L069K919K297J394Q59J043J475J377N22n76j293j511j595
60663D23896j955k666l458l941l809k949j540p1Q75J126J026R28P37K70j01K88
60647D08656J469K655L114K858K194J112m66k140l231l434k990k319j796j655
60633D04027j766j631r47n4M95O60P26O43J19o52r52m37L70P54N68J58j53k07
60615D01721R9O69J188J402J349J119O72R8j58K75J071J439R83J32m02l63n2Q0
$$ plain form
60597 411322 411175 410671 410171 410376 411753 414083 416691 419179 421693 424342 426651 428022 428626 429367 430750 432222
60581 432222 432938 432858 432662 432785 433043 433210 433477 434188 435472 437392 440165 444019 448943 454760 461362 468765
60565 468765 477082 486482 497102 508867 521468 534391 546813 557613 565869 571408 574540 575227 573008
60552 573008 567948 561190 554199 547775 542178 537827 535288 534642 535396 537046 539436 542620 546740 552074 558843
60537 558843 566991 576434 587502 600728 616133 633026 650507 667745 683694 697041 706823 712868
60525 712868 715496 715059 712036 707202 701299 694691 687610 680497 673634 666636 658891 650658 643222 637694
60511 637694 633996 631324 629293 628235 628573 630394 633615 638145 643810 650568 658976 670066 684493 702142
60497 702142 722842 747131 775808 808966 846022 886542 930346 976657 1023715 1069542 1112704
$$ packed form
60597D11322j47n04n00K05J377K330K608K488K514K649K309J371O04P41J383J472
60581D32222P16q0j96J23K58J67K67P11J284J920K773L854M924N817O602P403
60565D68765Q317R400J0620J1765J2601J2923J2422J0800Q256N539L132O87k219
60552E73008n060o758o991o424n597m351k539o46P54J650K390L184M120N334O769
60537E58843Q148R443J1068J3226J5405J6893J7481J7238J5949J3347R782O045
60525G12868K628m37l023m834n903o608p081p113o863o998p745q233p436n528
60511F37694l698k672k031j058L38J821L221M530N665O758Q408J1090J4427J7649
60497G02142K0700K4289K8677L3158L7056M0520M3804M6311M7058M5827M3162
$$ plain form
60486 1112704 1152130 1186693 1215367 1237410 1251992 1257944 1254378 1241355 1219531 1189388 1151413 1106921
60474 1106921 1058125 1007328 956436 907144 860885 818261 778973 742650 709482 679837 653641
60463 653641 630556 610520 593655 579627 567413 555894 544632 534063 524892 517247 510468 503811
60451 503811 497297 491629 487267 483852 480662 477359 474032 470755 467535 464670 462766 462144 462332 462344 461477
60436 461477 459760 457698 455744 454118 452971 452434 452425 452688 453159 454113 455665 457248 457891 457079 455169 452990
60420 452990 451287 450476 450529 451001 451467 452106 453595 456246 459499 462510 464985 467197 469350 471311 472894 474097
60404 474097 475021 475793 476549 477354 478136 478899 479880 481251 482740 483907 484843 486268 488753 492133 495889 499781
60388 499781 503752 507423 510223 512123 513810 515916 518337 520600 522690 525076 527982 531051 533879 536523
$$ packed form
60486A112704L9426L4563K8674K2043J4582N952l566j3023k1824l0143l7975m4492
60474A106921m8796n0797n0892m9292m6259m2624l9288l6323l3168k9645k6196
60463F53641k3085k0036j6865j4028j2214j1519j1262j0569r171p645o779o657
60451E03811o514n668m362l415l190l303l327l277l220k865j904o22J88J2q67
60436D61477j717k062j954j626j147n37rK63M71R54J552J583O43q12j910k179
60420D52990j703q11N3M72M66O39J489K651L253L011K475K212K153J961J583J203
60404D74097R24P72P56Q05P82P63R81J371J489J167R36J425K485L380L756L892
60388D99781L971L671K800J900J687K106K421K263K090K386K906L069K828K644
$$ plain form
60374 536523 539217 541841 544078 546060 548472 551814 555768 559442 562195 564107 565702 567338 568910 570168
60360 570168 571259 572727 574836 577038 578494 579205 580314 583050 587574 593132 599221 606226 614819 624956
60346 624956 635643 645581 653939 660543 665475 668550 669186 666835 661588 654395 646609 639198 632320 625578
60332 625578 618649 611660 605003 598963 593590 588845 584705 581101 577889 574912 572046 569186 566315 563580
60318 563580 561212 559300 557790 556782 556658 557729 559858 562673 566231 571290 578822 589244 602217 617040
60304 617040 633162 650364 668638 687934 707883 727598 745786 761201 773003 780622 783338 780310
60292 780310 771204 756710 738336 717815 696839 677015 659501 644499 631412 619721 609554 601253
60280 601253 594649 589047 583794 578642 573641 568893 564344 559594 554076 547748 541539 536675 533430 530945
$$ packed form
60374E36523K694K624K237J982K412L342L954L674K753J912J595J636J572J258
60360E70168J091J468K109K202J456P11J109K736M524N558O089P005Q593J0137
60346F24956J0687R938Q358O604M932L075O36k351n247p193p786p411o878o742
60332F25578o929o989o657o040n373m745m140l604l212k977k866k860k871k735
60318E63580k368j912j510j008j24J071K129K815L558N059P532J0422J2973J4823
60304F17040J6122J7202J8274J9296J9949J9715J8188J5415J1802P619K716l028
60292G80310r106j4494j8374k0521k0976j9824j7514j5002j3087j1691j0167q301
60280F01253o604n602n253n152n001m748m549m750n518o328o209m864l245k485
$$ plain form
60266 530945 528388 525907 524097 522947 521874 520691 519913 519972 520522 520848 520678 520303 520053 519940 519799 519534 519250
60249 519250 519250 519882 521150 522484 523115 522786 521980 521379 521199 521177 521090 521106 521585 522639 523989 525275 526438 527724
60231 527724 529341 531250 533293 535340 537257 538932 540585 542885 546346 550592 554611 557930 561202 565388
60217 565388 570615 576226 581806 587675 594341 601853 609881 618134 626520 635088 643985 653287 662658 671358
60203 671358 678885 685495 691738 697564 702338 705880 708993 712574 716456 719639 721531 722398 722523 721533 719000
60188 719000 715296 711354 707610 703610 698631 692356 684944 676850 668777 661527 655603 650973 647225 643868
60174 643868 640568 637354 634683 633039 632309 631816 631077 630343 630153 630547 630987 631006 630629 630107 629464 628487 627080
60157 627080 625498 624162 623341 623149 623784 625421 627701 629665 630625 631002 631875 633720 636037 638261 640486 643094
$$ packed form
60266E30945k557k481j810j150j073j183p78N9N50L26j70l75k50j13j41k65k84
60249E19250%O32J268J334O31l29q06o01j80k2q7J6M79J054J350J286J163J286
60231E27724J617J909K043K047J917J675J653K300L461M246M019L319L272M186
60217E65388N227N611N580N869O666P512Q028Q253Q386Q568Q897R302R371Q700
60203F71358P527O610O243N826M774L542L113L581L882L183J892Q67J25r90k533
60188G19000l704l942l744m000m979o275p412q094q073p250n924m630l748l357
60174F43868l300l214k671j644p30m93p39p34j90L94M40J9l77n22o43r77j407
60157F27080j582j336q21j92O35J637K280J964R60L77Q73J845K317K224K225K608
$$ plain form
60141 643094 646203 649818 654134 659242 664844 670693 677066 684387 692540 700859 708661 715484 721112 725802
60127 725802 730189 734433 737648 738810 738161 737107 736725 737018 737670 738759 740377 742115 743465 744397 745196 745959
60111 745959 746556 746843 746610 745508 743379 740486 737132 733194 728343 722659 716689 710871 705151 699314 693471
60096 693471 688107 683649 680159 677491 675705 675084 675703 677143 678830 680553 682436 684507 686543 688274 689489
60081 689489 690047 690090 690233 691088 692484 693453 693119 691257 687971 683271 677294 670572 663631 656465 648788 640747
60065 640747 633007 626032 619613 613338 607417 602716 599751 597829 595536 592213 588639 586016 584690 584256
60051 584256 584570 585859 587938 590169 592514 595880 600910 606945 612749 617885 622757 627573 632011 635895
60037 635895 639506 642997 645950 647776 648253 647431 645225 641438 636215 630253 624430 619139 614004 608271 601552
$$ packed form
60141F43094L109L615M316N108N602N849O373P321Q153Q319P802O823N628M690
60127G25802M387M244L215J162o49j054l82K93O52J089J618J738J350R32P99P63
60111G45959N97K87k33j102k129k893l354l938m851n684n970n818n720n837n843
60096F93471n364m458l490k668j786o21O19J440J687J723J883K071K036J731J215
60081F89489N58M3J43Q55J396R69l34j862l286m700n977o722o941p166p677q041
60065F40747p740o975o419o275n921m701k965j922k293l323l574k623j326m34
60051E84256L14J289K079K231K345L366N030O035N804N136M872M816M438L884
60037F35895L611L491K953J826M77q22k206l787n223n962n823n291n135n733o719
$$ plain form
60022 601552 594203 586980 580330 573929 566927 558766 549897 541527 534448 528271 522137 516018 510805 507053
60008 507053 504208 501428 498707 496789 496207 496818 498054 499292 500056 500267 500324 500745 501732 503248 505288 507839
59992 507839 510711 513742 517054 520799 524753 528471 531861 535258 538868 542365 545179 547015 548036 548613
59978 548613 548937 548793 547741 545606 542735 539669 536650 533574 530380 527315 524837 523325 522873 523225 523986
59963 523986 524995 526455 528696 531857 535774 540018 544037 547441 550245 552637 554533 555602 555778 555387 554625
59948 554625 553318 551474 549652 548421 547687 546953 545956 544600 542473 539087 534664 530187 526465 523428 520541
59933 520541 517692 515483 514690 515488 517191 518770 519697 520217 520917 522341 525080 529758 536496 544518 552600
59918 552600 559792 565583 569763 572585 574847 577331 580210 583343 586908 591236 596150 601035 605580 609929
$$ packed form
60022F01552p349p223o650o401p002q161q869q370p079o177o134o119n213l752
60008E07053k845k780k721j918n82O11J236J238P64K11N7M21R87J516K040K551
59992E07839K872L031L312L745L954L718L390L397L610L497K814J836J021N77
59978E48613L24j44j052k135k871l066l019l076l194l065k478j512m52L52P61
59963E23986J009J460K241L161L917M244M019L404K804K392J896J069J76l91p62
59948E54625j307j844j822j231p34p34r97j356k127l386m423m477l722l037k887
59933E20541k849k209p93P98J703J579R27N20P00J424K739M678O738Q022Q082
59918E52600P192N791M180K822K262K484K879L133L565M328M914M885M545M349
$$ plain form
59904 609929 614056 617517 619961 621438 622142 622294 622445 623314 625041 626979 628518 629808 631340 633208 635194
59889 635194 637368 640118 643580 647346 650803 653647 656073 658642 661903 665983 670467 674785 678751 682681
59875 682681 686972 691582 695968 699434 701500 701963 700869 698601 695825 692967 689723 685466 680252 675080
59861 675080 670945 667928 665432 662947 660294 657472 654723 652497 650952 649724 648633 648314 649587 652450
59847 652450 656326 661164 667503 675420 684229 693369 702802 712072 719659 723951 724688 723098 720837 719158
59833 719158 718788 719976 722432 725339 727487 727546 724532 718353 709885 700420 690981 682101 673972 666602 659792
59818 659792 653103 646134 639104 633074 629072 626744 624360 620545 615607 610660 605994 601152 596333 592652
59804 592652 590788 590266 590353 590952 592203 593785 595024 595360 594456 592342 589714 587620 586571 586267 586304 586570 586797
$$ packed form
59904F09929M127L461K444J477P04J52J51Q69J727J938J539J290J532J868J986
59889F35194K174K750L462L766L457K844K426K569L261M080M484M318L966L930
59875F82681M291M610M386L466K066M63j094k268k776k858l244m257n214n172
59861F75080m135l017k496k485k653k822k749k226j545j228j091l19J273K863
59847F52450L876M838O339P917Q809R140R433R270P587M292P37j590k261j679
59833G19158l70J188K456K907K148N9l014o179q468r465r439q880q129p370o810
59818F59792o689o969p030o030m002k328k384l815m938m947m666m842m819l681
59804E92652j864n22Q7N99J251J582J239L36r04k114k628k094j049l04L7K66K27
$$ plain form
59787 586797 586462 585511 584557 583927 583123 581744 580289 579331 578418 576679 574291 572533 572402 573749 575721 577516
59771 577516 578695 579352 580123 581725 584398 587865 591674 595418 598911 602486 606856 612344 618471 624605 630672
59756 630672 636818 642845 648666 655043 663079 672905 683472 693675 703150 711946 720041 727388 734010 739869
59742 739869 744954 749572 754118 758401 761602 763167 763428 763118 762518 761368 759463 757042 754552 752229 750028
59727 750028 747914 746004 744271 742306 739738 736865 734417 732473 730122 726603 722433 718905 716663 715223
59713 715223 713819 712223 710750 709851 709791 710467 711528 712862 714862 717921 721807 725779 729222 731907 733891
59698 733891 735576 737676 740634 744150 747716 751447 755820 760547 764334 765953 765215 762787 759461 755742
59684 755742 751746 747319 742453 737623 733436 729915 726394 722139 716802 710414 703361 696413 690300 685070
$$ packed form
59787E86797l35r51r54o30q04j379j455r58r13j739k388j758j31J347J972J795
59771E77516J179O57P71J602K673L467L809L744L493L575M370N488O127O134O067
59756F30672O146O027N821O377Q036R826J0567J0203R475Q796Q095P347O622N859
59742G39869N085M618M546M283L201J565K61l10o00j150j905k421k490k323k201
59727G50028k114j910j733j965k568k873k448j944k351l519m170l528k242j440
59713G15223j404j596j473q99o0O76J061J334K000L059L886L972L443K685J984
59698G33891J685K100K958L516L566L731M373M727L787J619p38k428l326l719
59684G55742l996m427m866m830m187l521l521m255n337o388p053o948o113n230
$$ plain form
59670 685070 680125 674961 669606 664435 659894 656371 653847 651727 649474 647355 646013 645388 644845 644470 645325
59655 645325 648006 651720 655407 659109 663513 668596 673532 677729 681165 683713 684808 683943 681057 676315
59641 676315 669872 662004 653260 644402 636262 629492 624163 619674 615395 611393 608281 606326 605023 603578
59627 603578 601600 599166 596414 593246 589481 585222 580943 577083 573546 569824 565680 561502 557881 555078
59613 555078 553044 551690 550792 549871 548581 547225 546564 547111 548800 551262 554041 556604 558509 559743 560632
59598 560632 561312 561599 561542 561759 562865 564706 566512 567805 568855 570189 571910 573693 575259 576595 577712
59583 577712 578412 578451 577833 576785 575428 573595 570997 567501 563185 558238 553004 548118 544345 542039 540771
59568 540771 539654 538119 536296 534592 533114 531662 530180 528922 528144 527819 527746 527799 527994 528418 529133 530065 530988
$$ packed form
59670F85070m945n164n355n171m541l523k524k120k253k119j342o25n43l75Q55
59655F45325K681L714L687L702M404N083M936M197L436K548J095q65k886m742
59641F76315o443p868q744q858q140o770n329m489m279m002l112j955j303j445
59627F03578j978k434k752l168l765m259m279l860l537l722m144m178l621k803
59613E55078k034j354q98r21j290j356o61N47J689K462K779K563J905J234Q89
59598E60632O80K87n7K17J106J841J806J293J050J334J721J783J566J336J117
59583E77712P00L9o18j048j357j833k598l496m316m947n234m886l773k306j268
59568E40771j117j535j823j704j478j452j482j258p78l25p3N3J95M24P15R32R23
$$ plain form
59551 530988 531785 532712 534175 536192 538350 540422 542745 545817 549833 554903 561377 569530 579182 590217
59537 590217 603459 620363 641372 664626 686391 702774 711466 712628 708576 702443 696716 692698 690902
59524 690902 691450 693990 697662 701456 704562 706366 706478 705002 702532 699557 695835 690554 683128 673784 663404
59509 663404 652846 642429 632069 621852 612321 604082 597300 591763 587251 583550 580222 576825 573387
59496 573387 570331 567804 565453 562976 560565 558631 557358 556722 556693 557153 557865 558754 560087 562187 565106 568727
59480 568727 572920 577457 581996 586440 591160 596608 602862 609741 617141 624875 632298 638488 642929 645822
59466 645822 647691 648910 649656 650140 650682 651565 652897 654653 656959 660249 665017 671373 678992 687523 696755
59451 696755 706287 715363 723312 730029 735764 740625 744557 747606 749688 750101 747766 742192 734010 724356
$$ packed form
59551E30988P97R27J463K017K158K072K323L072M016N070O474Q153R652J1035
59537E90217J3242J6904K1009K3254K1765J6383Q692J162m052o133n727m018j796
59524F90902N48K540L672L794L106J804J12j476k470k975l722n281p426r344j0380
59509F63404j0558j0417j0360j0217r531q239o782n537m512l701l328l397l438
59496E73387l056k527k351k477k411j934j273o36k9M60P12Q89J333K100K919L621
59480E68727M193M537M539M444M720N448O254O879P400P734P423O190M441K893
59466F45822J869J219P46M84N42Q83J332J756K306L290M768O356P619Q531R232
59451F96755R532R076P949O717N735M861L932L049K082M13k335n574q182r654
$$ plain form
59437 724356 714032 703540 693692 685692 680355 677397 675579 673530 670484 666568 662686 660112 659826 662007
59423 662007 666149 671776 678953 688056 699149 711808 725547 740227 755989 772954 791203 811106
59411 811106 833418 858438 884489 907232 921280 923355 914270 898001 879115 861077 846118 835631
59399 835631 830511 831570 839389 852786 867271 876176 874529 862016 842141 819108 795928 774650
59387 774650 756811 743041 732775 724869 718425 713015 708538 705197 703457 703647 705515 708241 710948 713240
59373 713240 715320 717611 720332 723438 726885 730676 734639 738422 741872 745223 748697 752122 755268 758428
59359 758428 762325 767366 773302 779685 786457 793948 802504 812293 823398 835905 849839 865124 881581
59346 881581 898914 916617 933999 950476 965901 980417 993828 1005223 1013497 1018261 1019963 1019050
$$ packed form
59437G24356j0324j0492r848q000n337k958j818k049l046l916l882k574k86K181
59423F62007M142N627P177R103J1093J2659J3739J4680J5762J6965J8249J9903
59411H11106K2312K5020K6051K2743J4048K075r085j6269j8886j8038j4959j0487
59399H35631n120J059P819J3397J4485Q905j647j2513j9875k3033k3180k1278
59387G74650j7839j3770j0266p906o444n410m477l341j740J90J868K726K707K292
59373G13240K080K291K721L106L447L791L963L783L450L351L474L425L146L160
59359G58428L897N041N936O383O772P491Q556R789J1105J2507J3934J5285J6457
59346H81581J7333J7703J7382J6477J5425J4516J3411J1395Q274M764J702r13
$$ plain form
59334 1019050 1015300 1008182 997739 984857 970666 955860 940616 925029 909416 894124 879214 864642
59322 864642 850732 838139 827120 817204 807952 799716 793065 787648 782291 776247 769742 763206 756683
59309 756683 750277 744459 739495 735113 731233 728484 727417 727628 728322 729449 731653 735370 740732 748261 758840
59294 758840 772619 788153 802564 812351 814644 808712 796596 781754 766793 752650 739614 728315
59282 728315 719442 713164 709318 707821 708531 711005 714831 720130 727419 736945 748244 760416 772799 785362
59268 785362 798289 811167 822950 832963 841533 849153 855339 859044 860065 859201 856911 852634 845811
59255 845811 836953 827214 817469 808205 799817 792372 785447 778833 773203 769486 767684 766849 766225 765954 766677
59240 766677 768901 772769 778034 784109 790478 797113 804211 811455 817836 822355 824693 825181 824396 822944 821246
$$ packed form
59334A019050l750p118j0443j2882j4191j4806j5244j5587j5613j5292j4910j4572
59322H64642j3910j2593j1019r916r252q236o651n417n357o044o505o536o523
59309G56683o406n818m964m382l880k749j067K11O94J127K204L717N362P529J0579
59294G58840J3779J5534J4411R787K293n932j2116j4842j4961j4143j3036j1299
59282G28315q873o278l846j497P10K474L826N299P289R526J1299J2172J2383J2563
59268G85362J2927J2878J1783J0013Q570P620O186L705J021q64k290m277o823
59255H45811q858r739r745r264q388p445o925o614n630l717j802q35o24k71P23
59240G66677K224L868N265O075O369O635P098P244O381M519K338M88p85j452j698
$$ plain form
59225 821246 819209 816123 811131 803916 794993 785420 776195 767737 759821 752057 744420 737247 730742 724737
59211 724737 719040 713828 709498 706196 703700 701719 700141 698886 697625 695874 693498 691058 689444 689061
59197 689061 689486 690086 690781 691905 693406 694732 695707 697063 699658 703401 707455 711391 715533 720172 725052
59182 725052 729940 735092 740692 746202 750908 754902 758933 763381 767981 772585 777542 783094 788962 794927
59168 794927 801376 808808 817016 825130 832369 838443 843365 847191 849847 850998 850158 847197 842574 836823
59154 836823 829961 821747 812369 802480 792559 782623 772604 762682 753149 744230 736061 728582 721400 714026
59140 714026 706367 698721 691310 684133 677408 671718 667438 664213 661337 658562 656318 655160 655173 655930 656936
59125 656936 658150 660084 663368 668217 674408 681673 689839 698630 707740 717268 727755 739509 752127
$$ packed form
59225H21246k037l086m992p215q923r573r225q458p916p764p637p173o505o005
59211G24737n697n212m330l302k496j981j578j255j261j751k376k440j614l83
59197F89061M25O00O95J124J501J326R75J356K595L743M054L936M142M639M880
59182G25052M888N152N600N510M706L994M031M448M600M604M957N552N868N965
59168G94927O449P432Q208Q114P239O074M922L826K656J151q40k961m623n751
59154H36823o862q214r378r889r921r936j0019r922r533q919q169p479p182p374
59140G14026p659p646p411p177o725n690m280l225k876k775k244j158J3P57J006
59125F56936J214J934L284M849O191P265Q166Q791R110R528J0487J1754J2618
$$ plain form
59112 752127 765034 778225 792004 806151 819921 833048 846201 860044 874174 887423 899138
59101 899138 909642 919319 927653 933540 936389 936648 935263 932879 929691 925856 921866 918491 916380 915606
59087 915606 915597 915640 915491 915360 915168 914037 910815 905148 897801 889893 881921 873587 864332 853897 842523 830887
59071 830887 819860 810057 801404 793181 784684 775928 767641 760512 754504 748972 743367 737707 732408 727805
59057 727805 723942 720675 717894 715610 713829 712326 710694 708798 707102 706283 706404 706696 706276 704974 703358
59042 703358 702155 701810 702427 703814 705523 707007 707957 708639 709981 713144 718702 726140 734337 742585 750984
59027 750984 759953 769807 780952 793985 809162 825982 843647 861735 880033 897888 914217 928165
59015 928165 939389 947632 952436 953471 950996 945902 939424 932771 926817 922020 918653 916991 917166 918970
$$ packed form
59112G52127J2907J3191J3779J4147J3770J3127J3153J3843J4130J3249J1715
59101H99138J0504R677Q334N887K849K59j385k384l188l835l990l375k111p74
59087I15606rM3j49j31j92j131l222n667p347p908p972q334r255j0435j1374j1636
59071H30887j1027r803q653q223q497q756q287p129o008n532n605n660n299m603
59057G27805l863l267k781k284j781j503j632j896j696q19J21K92m20j302j616
59042G03358j203l45O17J387J709J484R50O82J342L163N558P438Q197Q248Q399
59027G50984Q969R854J1145J3033J5177J6820J7665J8088J8298J7855J6329J3948
59015I28165J1224Q243M804J035k475n094o478o653n954m797l367j662J75J804
$$ plain form
59001 918970 922037 926107 930957 936254 941760 947510 953339 958312 961111 961117 958806 954971 949948 943744 936490
58986 936490 928370 919249 908748 896782 883973 871541 860760 852326 846096 841442 837879 835362 834166
58973 834166 834712 837433 842454 849261 856921 864749 872672 880852 889214 897536 905879 914629 923955 933297
58959 933297 941522 947651 951416 953055 952704 950228 945578 938978 930573 920273 908210 895202 882387
58946 882387 870514 859824 850450 842579 836250 831345 827771 825407 823890 822739 821698 820743 819806 818722
58932 818722 817354 815573 813299 810854 809033 808374 808417 808192 807311 806103 804743 802953 800698 798499 796730
58917 796730 795228 794043 794092 796476 801319 807765 815029 823041 832109 842354 853575 865417 877510 889582
58903 889582 901598 913854 926831 940693 954788 967775 978525 986896 993449 998632 1002609 1005823
$$ packed form
59001I18970L067M070M850N297N506N750N829M973K799Ok311l835n023o204p254
58986I36490q120r121j0501j1966j2809j2432j0781q434o230m654l563k517j196
58973H34166N46K721N021O807P660P828P923Q180Q362Q322Q343Q750R326R342
58959I33297Q225O129L765J639l51k476m650o600q405j0300j2063j3008j2815
58946H82387j1873j0690r374p871o329m905l574k364j517j151j041r55r37j084
58932H18722j368j781k274k445j821o59M3k25q81j208j360j790k255k199j769
58917G96730j502j185M9K384M843O446P264Q012R068J0245J1221J1842J2093J2072
58903H89582J2016J2256J2977J3862J4095J2987J0750Q371O553N183L977L214
$$ plain form
58891 1005823 1009217 1013702 1019727 1027458 1037051 1048448 1061152 1074358 1087219 1098955 1108996 1117152
58879 1117152 1123480 1127892 1130121 1130059 1127814 1123398 1116750 1108294 1099066 1090015 1081384 1072990 1064805 1056914
58865 1056914 1049110 1040902 1031889 1021838 1010418 997198 982071 965601 948782 932388 916530 900872
58853 900872 885220 869816 855075 841306 828826 818047 809108 801578 794787 788291 781725 774490 766137
58840 766137 756922 747410 737604 727087 716104 705779 696999 689657 683304 678019 674179 671691 669955
58827 669955 668486 667276 666552 666352 666365 666200 665945 666280 667757 670089 672558 674998 677857 681336 685090 688756
58811 688756 692106 694518 695122 693917 692193 691301 691357 691472 690849 689229 686677 683443 679950 676643 673883 671980
58795 671980 670921 670030 668422 665967 663334 660950 658610 656389 655164 655599 657167 658848 660494 662927 666945
$$ packed form
58891A005823L394M485O025P731R593J1397J2704J3206J2861J1736J0041Q156
58879A117152O328M412K229o2k245m416o648q456r228r051q631q394q185p891
58865A056914p804q208r013j0051j1420j3220j5127j6470j6819j6394j5858j5658
58853I00872j5652j5404j4741j3769j2480j0779q939p530o791o496o566p235q353
58840G66137r215r512r806j0517j0983j0325q780p342o353n285l840k488j736
58827F69955j469j210p24k00J3j65k55L35J477K332K469K440K859L479L754L666
58811F88756L350K412O04j205j724q92N6J15o23j620k552l234l493l307k760j903
58795F71980j059q91j608k455k633k384k340k221j225M35J568J681J646K433M018
$$ plain form
58780 666945 672633 679411 686376 692888 699196 706164 714015 721677 727659 731161 732009 730130 725772 719892
58766 719892 713667 707696 701972 696266 690241 683639 676868 670994 666718 663781 661769 660829 660925 661078 660246
58751 660246 658585 656940 655467 653747 652056 651469 652624 655157 658456 662294 666727 672061 678866 687296
58737 687296 696435 705055 713101 721659 731323 741309 750401 758142 764887 771243 777739 784558 791269 797134
58723 797134 801865 805842 809640 813684 818308 823655 829451 835253 841010 846972 853053 858653 863109 866009
58709 866009 867097 866280 863644 859115 852222 842621 830710 817273 802628 786624 769265 750772 731226
58696 731226 710887 690770 672195 655685 640952 627989 617372 609306 603011 597410 591916 586386
58684 586386 580818 575294 569866 564342 558571 552951 548177 544529 541930 540616 540994 542728 544731 546394
$$ packed form
58780F66945N688O778O965O512O308O968P851P662N982L502Q48j879m358n880
58766G19892o225n971n724n706o025o602o771n874m276k937k012r40R6J53q32
58751F60246j661j645j473j720j691n87J155K533L299L838M433N334O805Q430
58737F87296R139Q620Q046Q558R664R986R092P741O745O356O496O819O711N865
58723G97134M731L977L798M044M624N347N796N802N757N962O081N600M456K900
58709H66009J088q17k636m529o893r601j1911j3437j4645j6004j7359j8493j9546
58696G31226k0339k0117j8575j6510j4733j2963j0617q066o295n601n494n530
58684E86386n568n524n428n524n771n620m774l648k599j314L78J734K003J663
$$ plain form
58670 546394 548143 550583 553754 557702 563166 571065 581637 594483 609087 624727 639969 652708 660947
58657 660947 663676 661292 655255 647127 637856 628022 618372 609585 601598 593819 586126 579147 573399 568704
58643 568704 564643 561148 558390 556444 555274 554760 554612 554638 555082 556300 557985 559315 560024 560821 562435 564707
58627 564707 566908 568585 569773 570698 571605 572716 574152 576004 578474 581693 585384 589070 592708 596818 601951
58612 601951 608318 615785 623695 630745 635684 638377 639723 640446 640529 639991 639472 639551 639923 639799 638894 637621 636481
58595 636481 635542 634519 633181 631741 630897 631386 633533 637282 642465 648779 655794 663409 672152 682531 694308
58580 694308 706847 719875 733120 745466 755480 763026 769537 776481 784220 792605 801852 812373 824402
58567 824402 838284 854704 874215 896880 922590 951293 982593 1015555 1049052 1081938 1112721
$$ packed form
58670E46394J749K440L171L948N464P899J0572J2846J4604J5640J5242J2739Q239
58657F60947K729k384o037q128r271r834r650q787p987p779p693o979n748m695
58643E68704m061l495k758j946j170n14j48K6M44J218J685J330P09P97J614K272
58627E64707K201J677J188R25R07J111J436J852K470L219L691L686L638M110N133
58612F01951O367P467P910P050M939K693J346P23Q3n38n19P9L72j24r05j273j140
58595F36481r39j023j338j440q44M89K147L749N183O314P015P615Q743J0379J1777
58580F94308J2539J3028J3245J2346J0014P546O511O944P739Q385R247J0521J2029
58567H24402J3882J6420J9511K2665K5710K8703L1300L2962L3497L2886L0783
$$ plain form
58556 1112721 1139676 1161556 1177889 1188515 1193482 1193585 1190288 1184714 1177195 1168078 1158358 1149020 1140088
58543 1140088 1130667 1119619 1105990 1089264 1069558 1047345 1022925 996546 969024 941624 915208
58532 915208 890053 866617 845734 827826 812610 799791 789323 780715 772967 765704 759642 755414
58520 755414 752597 750432 748817 747851 746969 745322 742855 740375 738679 737920 737697 737425 736834 736218 735946 735804
58504 735804 735314 734644 734446 734667 734393 733118 731356 729640 727780 725653 723837 722837 722414 722393 723554 726890
58488 726890 732409 739330 747108 755718 765346 776312 789034 803605 819745 837412 856928 878147
58476 878147 900076 921591 941847 959619 973093 981028 983531 981204 974228 962925 948457 932223
58464 932223 915198 898542 884203 873920 868089 866288 868383 874207 882655 892177 902033 912333 922943
$$ packed form
58556A112721K6955K1880J6333J0626M967J03l297n574p519r117r720r338q932
58543A140088r421j1048j3629j6726j9706k2213k4420k6379k7522k7400k6416
58532I15208k5155k3436k0883j7908j5216j2819j0468q608p748p263o062m228
58520G55414k817k165j615r66q82j647k467k480j696p59k23k72n91o16k72j42
58504G35804m90o70j98K21k74j275j762j716j860k127j816j000m23k1J161L336
58488G26890N519O921P778Q610R628J0966J2722J4571J6140J7667J9516K1219
58476H78147K1929K1515K0256J7772J3474P935K503k327o976j1303j4468j6234
58464I32223j7025j6656j4339j0283n831j801K095N824Q448R522R856J0300J0610
$$ plain form
58451 922943 933003 941332 946737 948158 945091 937766 926627 912043 894927 877137 860674 846706
58439 846706 835625 827436 821666 817591 815150 815131 817936 822731 828315 834222 840527 847419 855551 865883
58425 865883 878309 891201 903199 914746 926937 939539 951095 960271 966086 967546 964417 958043
58413 958043 950251 941650 931924 921417 911227 901919 893131 884465 876024 868259 861899 857716 855693 854914
58399 854914 854957 856746 861150 867374 873809 880003 886608 893783 900796 906977 912041 915746 918237 920433 923083
58384 923083 925748 927714 929477 932105 935464 938371 940395 942218 944246 946170 948007 950336 953143 955565
58370 955565 957260 959239 962789 968081 974253 980587 987315 995350 1005251 1016585 1028561 1041108 1054560
58357 1054560 1068267 1080605 1090708 1099074 1105944 1110453 1112362 1113390 1115481 1118628 1121641 1124229 1126962
$$ packed form
58451I22943J0060Q329N405J421l067p325j1139j4584j7116j7790j6463j3968
58439H46706j1081q189n770m075k441j9K805M795N584N907O305O892Q132J0332
58425H65883J2426J2892J1998J1547J2191J2602J1556R176N815J460l129o374
58413I58043p792q601r726j0507j0190r308q788q666q441p765o360m183k023p79
58399H54914M3J789M404O224O435O194O605P175P013O181N064L705K491K196K650
58384I23083K665J966J763K628L359K907K024J823K028J924J837K329K807K422
58370I55565J695J979L550N292O172O334O728Q035R901J1334J1976J2547J3452
58357A054560J3707J2338J0103Q366O870M509J909J028K091L147L013K588K733
$$ plain form
58344 1126962 1130036 1133548 1138434 1145681 1154982 1165434 1177048 1190410 1205388 1221430 1238558 1256800
58332 1256800 1275279 1293183 1310902 1328834 1345738 1359850 1370976 1379928 1386639 1390655 1392962 1395342
58320 1395342 1398168 1400609 1402751 1405751 1410040 1415094 1420903 1428060 1436562 1446084 1457218 1470804 1486219
58307 1486219 1501928 1517540 1533753 1550627 1567621 1585108 1604052 1624252 1644484 1664182 1683405
58296 1683405 1701604 1718206 1734147 1750986 1768808 1786751 1805150 1825225 1847008 1869638 1893319
58285 1893319 1918899 1945835 1972866 2000451 2030313 2062748 2096749 2132555 2171488 2213170 2255385
58274 2255385 2296979 2338626 2380662 2422587 2464940 2509223 2555635 2603126 2651926 2703710 2759018
58263 2759018 2816769 2876531 2938989 3003989 3070422 3138164 3207838 3278602 3348590 3417526 3486579
$$ packed form
58344A126962L074L512M886P247R301J0452J1614J3362J4978J6042J7128J8242
58332A256800J8479J7904J7719J7932J6904J4112J1126Q952O711M016K307K380
58320A395342K826K441K142L000M289N054N809P157Q502R522J1134J3586J5415
58307A486219J5709J5612J6213J6874J6994J7487J8944K0200K0232J9698J9223
58296A683405J8199J6602J5941J6839J7822J7943J8399K0075K1783K2630K3681
58285A893319K5580K6936K7031K7585K9862L2435L4001L5806L8933M1682M2215
58274B255385M1594M1647M2036M1925M2353M4283M6412M7491M8800N1784N5308
58263B759018N7751N9762O2458O5000O6433O7742O9674P0764O9988O8936O9053
$$ plain form
58252 3486579 3555890 3625016 3695690 3771160 3852633 3939092 4030491 4128100 4231792 4340257 4454087
58241 4454087 4575442 4704600 4840139 4982627 5134618 5296788 5467712 5647681 5839059
58232 5839059 6042519 6256796 6482648 6723315 6980670 7254860 7548055 7864383 8205625
58223 8205625 8571168 8962709 9384782 9840326 10330374 10858777 11432636 12057553 12737340
58214 12737340 13479086 14293759 15191463 16181334 17276918 18496917 19861108 21391740 23120078
58205 23120078 25087212 27340410 29937058 32954666 36493845 40674185 45632518 51518876
58197 51518876 58481964 66660590 76204207 87312550 100265889 115443128 133342343
58190 133342343 154599857 179985107 210303096 246020102 286436067 328665052 367327694
$$ packed form
58252C486579O9311O9126P0674P5470Q1473Q6459R1399R7609J03692J08465J13830
58241D454087J21355J29158J35539J42488J51991J62170J70924J79969J91378
58232E839059K03460K14277K25852K40667K57355K74190K93195L16328L41242
58223H205625L65543L91541M22073M55544M90048N28403N73859O24917O79787
58214A2737340P41746Q14673Q97704R89871J095584J219999J364191J530632J728338
58205B3120078J967134K253198K596648L017608L539179M180340M958333N886358
58197E1518876O963088Q178626R543617J1108343J2953339J5177239J7899215
58190A33342343K1257514K5385250L0317989L5717006M0415965M2228985L8662642
$$ plain form
58183 367327694 395830470 408956226 405166070 387011016 359530144 327959418 296148060
58176 296148060 266108932 238355442 212584906 188393197 165719698 144845688 126102585
58169 126102585 109635367 95382555 83163114 72737455 63843253 56239752 49733545
58162 49733545 44163897 39384108 35268043 31717342 28648468 25982321 23653078 21613870
58154 21613870 19824137 18240473 16826171 15559267 14423185 13397295 12462879 11610308
58146 11610308 10833454 10123095 9471211 8875504 8334043 7840299 7387759 6974400 6598543
58137 6598543 6255084 5939404 5650119 5384368 5135039 4896376 4668334 4452469 4247800
58128 4247800 4053722 3872577 3705746 3550665 3404637 3268214 3142123 3024389 2913108
$$ packed form
58183C67327694K8502776J3125756l790156j8155054k7480872l1570726l1811358
58176B96148060l0039128k7753490k5770536k4191709k2673499k0874010j8743103
58169A26102585j6467218j4252812j2219441j0425659q894202p603501o506207
58162D9733545n569648m779789m116065l550701l068874k666147k329243k039208
58154B1613870j789733j583664j414302j266904j136082j025890r34416q52571
58146A1610308p76854p10359o51884n95707n41461m93744m52540m13359l75857
58137F598543l43459l15680k89285k65751k49329k38663k28042k15865k04669
58128D247800j94078j81145j66831j55081j46028j36423j26091j17734j11281
$$ plain form
58119 2913108 2808751 2711235 2618131 2528303 2444041 2366996 2295067 2225765 2159658 2097937 2039423
58108 2039423 1982529 1927642 1875240 1824059 1773277 1724185 1677700 1632569 1587906 1545068 1505135
58097 1505135 1466932 1429423 1393721 1360867 1330062 1300897 1274951 1253197 1234048 1215908 1199452
58086 1199452 1185496 1172854 1160256 1148166 1136653 1123517 1106777 1087262 1066777 1045447 1022795
58075 1022795 999760 977554 955884 934087 912716 892477 873113 854755 838711 825348 812852
58064 812852 799709 786840 775760 766295 757686 750140 743516 736188 727142 717734 709477 701555 692443
58051 692443 682583 673505 665466 657882 651019 645327 640132 634743 629842 625988 621767 615325 606944 598324
58037 598324 590042 581526 572867 564878 557708 550877 544329 538193 531965 525062 517747 510519 503295 496120
$$ packed form
58119B913108j04357r7516r3104q9828q4262p7045p1929o9302o6107o1721n8514
58108B039423n6894n4887n2402n1181n0782m9092m6485m5131m4663m2838l9933
58097A505135l8203l7509l5702l2854l0805k9165k5946k1754j9149j8140j6456
58086A199452j3956j2642j2598j2090j1513j3136j6740j9515k0485k1330k2652
58075A022795k3035k2206k1670k1797k1371k0239j9364j8358j6044j3363j2496
58064H12852j3143j2869j1080r465q609p546o624p328r046r408q257p922r112
58051F92443r860r078q039p584o863n692n195n389m901l854m221o442q381q620
58037E98324q282q516q659p989p170o831o548o136o228o903p315p228p224p175
$$ plain form
58023 496120 489762 484541 479527 474028 468854 464860 461276 456968 452375 448668 445813 443060 440655 439400
58009 439400 438960 438214 437029 436330 436593 437468 438686 440239 441875 443313 444702 446070 446788 446404 445411 444356
57993 444356 442786 440048 436530 433071 429659 425686 421060 416199 411416 407080 403803 401587 399391 396323
57979 396323 392705 389250 386015 382943 380565 379133 377877 376147 374618 374322 375153 376279 377293 377944 377515
57964 377515 375687 373435 371965 371196 370217 368693 366996 365593 365137 366361 368956 371386 372717 373713 375191
57949 375191 376455 376601 376255 376490 377039 377213 377735 379862 383297 386844 390715 396334 404002 412493 421020 430145
57933 430145 440691 452990 467075 482287 496803 508760 517766 524216 527683 527455 524277 519770 514058
57920 514058 505636 493871 480195 466441 453314 440919 429654 420023 412402 407280 405017 405311 407624
$$ packed form
58023D96120o358n221n014n499n174l994l584m308m593l707k855k753k405j255
58009D39400m40p46j185o99K63Q75J218J553J636J438J389J368P18l84r93j055
57993D44356j570k738l518l459l412l973m626m861m783m336l277k216k196l068
57979C96323l618l455l235l072k378j432j256j730j529k96Q31J126J014O51m29
57964C77515j828k252j470p69r79j524j697j403m56J224K595K430J331R96J478
57949C75191J264J46l46K35N49J74N22K127L435L547L871N619P668Q491Q527R125
57933D30145J0546J2299J4085J5212J4516J1957R006O450L467k28l178m507n712
57920E14058q422j1765j3676j3754j3127j2395j1265r631p621n122k263K94K313
$$ plain form
57907 407624 412036 418734 426670 433678 437945 438616 435354 428557 420036 412204 406279 401985 398825 396617
57893 396617 394969 393540 392901 393886 395987 397605 398115 398440 399287 400104 400230 399971 399820 399479 398270 395937 392598
57876 392598 388494 384113 379989 376124 372144 368101 364420 361063 357578 354216 352063 351712 352475 353345 354121
57861 354121 355316 357532 361245 366657 373415 380767 388162 395469 402769 410391 418911 428490 438298 447211
57847 447211 454877 461424 466443 469289 470253 470389 470072 468677 465770 461614 456305 449461 441155 432320 423807
57832 423807 415780 408361 402118 397466 394165 391790 390194 389299 388914 388905 389052 388733 387355 385162 382945 380924
57816 380924 378670 376109 373787 372038 370769 370106 370212 370203 368364 364022 358344 352742 347296 341375 335136
57801 335136 329627 325844 324201 324541 326170 328175 330098 332022 333880 335191 335714 335770 335625 335138 334406 334221
$$ packed form
57907D07624M412O698P936P008M267O71l262o797q521p832n925m294l160k208
57893C96617j648j429o39R85K101J618N10L25Q47Q17J26k59j51l41j209k333l339
57876C92598m104m381m124l865l980m043l681l357l485l362k153l51P63Q70P76
57861C54121J195K216L713N412O758P352P395P307P300P622Q520R579R808Q913
57847D47211P666O547N019K846R64J36l17j395k907m156n309o844q306q835q513
57832D23807q027p419o243m652l301k375j596q95l85rJ47l19j378k193k217k021
57816C80924k254k561k322j749j269o63J06rj839m342n678n602n446n921o239
57801C35136n509l783j643L40J629K005J923J924J858J311N23N6j45m87p32j85
$$ plain form
57785 334221 335381 337971 341695 346506 352422 359068 365967 373145 381011 389647 398416 406362 413014 418812
57771 418812 424505 429966 433958 435415 434595 432476 429400 425073 419548 413222 406040 397737 388969 381118
57757 381118 374740 369104 363521 358200 353457 349087 345081 342082 340493 339746 339070 338440 338348 339164 341164 344480
57741 344480 348464 351758 353688 355151 357418 360407 362823 363820 363927 364425 366235 369369 373049 376278 378450
57726 378450 379543 379971 380475 381834 384114 386328 387438 387628 387880 388348 388066 386482 384364 382790 381934 381254
57710 381254 380152 378056 374536 369911 365251 361319 357977 354920 352341 350401 348692 346850 345278 344783
57696 344783 345842 348538 352624 357161 360681 362273 362128 360617 357459 352449 346391 340484 335066 329724
57682 329724 324457 320013 317166 316283 317613 321439 327837 336608 347605 361060 377595 397910 422311
$$ packed form
57785C34221J160K590L724M811N916O646O899P178P866Q636Q769P946O652N798
57771D18812N693N461L992J457q20k119l076m327n525o326p182q303q768p851
57757C81118o378n636n583n321m743m370m006k999j589p47o76o30r2Q16K000L316
57741C44480L984L294J930J463K267K989K416R97J07M98J810L134L680L229K172
57726C78450J093M28N04J359K280K214J110J90K52M68k82j584k118j574q56o80
57710C81254j102k096l520m625m660l932l342l057k579j940j709j842j572m95
57696C44783J059K696M086M537L520J592j45j511l158n010o058n907n418n342
57682C29724n267m444k847q83J330L826O398Q771J0997J3455J6535K0315K4401
$$ plain form
57669 422311 450738 483709 523135 571325 628415 690516 750039 797521 824141 824877 800961 759211
57657 759211 708205 654735 603087 555875 514225 477798 445888 418556 396164 378191 363353
57646 363353 350746 340259 331886 325285 320043 315935 312850 310692 309269 308153 306909 305601 304697 304251
57632 304251 303695 302740 301948 301907 302286 302221 301329 299848 298098 296289 294593 293001 291340 289674 288255 286823
57616 286823 284590 281395 278226 276029 274630 273507 272925 273276 273868 273555 272429 271728 272025 272524 272374 271731
57600 271731 271133 270495 269285 267290 264808 262257 259838 257464 254932 252226 249564 247072 244591 242048 239738
57585 239738 237905 236293 234455 232357 230271 228261 226258 224524 223560 223517 223953 224186 223642 221988 219267 215966
57569 215966 212820 210560 209713 210209 211063 210942 209442 207496 206271 206079 206637 207791 209374 210722 211053 210235
$$ packed form
57669D22311K8427L2971L9426M8190N7090O2101N9523M7482K6620P36k3916m1750
57657G59211n1006n3470n1648m7212m1650l6427l1910k7332k2392j7973j4838
57646C63353j2607j0487q373o601n242m108l085k158j423j116j244j308r04m46
57632C04251n56r55p92m1L79o5q92j481j750j809j696j592j661j666j419j432
57616B86823k233l195l169k197j399j123n82L51N92l13j126p01K97M99j50o43
57600B71731n98o38j210j995k482k551k419k374k532k706k662k492k481k543k310
57585B39738j833j612j838k098k086k010k003j734r64m3M36K33n44j654k721l301
57569B15966l146k260q47M96Q54j21j500j946j225j92N58J154J583J348L31q18
$$ plain form
57553 210235 208806 207482 206956 207768 209831 212388 214919 217760 221274 224882 227573 229085 229877 230237 230228 230321
57537 230321 231149 232617 233990 234921 235708 236475 236826 236530 235974 235673 235677 235654 235294 234614 234075 234285 235326 236576
57519 236576 237536 238529 240166 242444 244937 247547 250342 252907 254720 256053 257646 259465 260658 260891 260894 261453
57503 261453 262611 264129 265967 267871 269136 269322 268763 267960 266867 265202 263056 260733 258261 255580 253064
57488 253064 251373 250739 250637 250235 249143 247762 246959 247245 248205 248911 248956 248842 249216 249986 250489 250388 250057 249960
57470 249960 250023 249930 249870 250412 251472 251941 250882 248825 247319 247281 248415 250101 252004 253664 254451 254481 254906 256615
57452 256615 259136 261365 262867 263906 264642 265098 265591 266441 267415 268066 268464 269080 270086 271347 272909 274945
57436 274945 277361 279932 282598 285197 287197 288282 288948 289929 291237 292331 292995 293461 293887 294358 295131 296263
$$ packed form
57553B10235j429j324n26Q12K063K557K531K841L514L608K691J512P92L60rR3
57537B30321Q28J468J373R31P87P67L51k96n56l01Mk3l60o80n39K10J041J250
57519B36576R60R93J637K278K493K610K795K565J813J333J593J819J193K33LN59
57503B61453J158J518J838J904J265J86n59q03j093j665k146k323k472k681k516
57488B53064j691o34j02m02j092j381q03K86R60P06M5j14L74P70N03j01l31r7
57470B49960O3r3o0N42J060M69j059k057j506l8J134J686J903J660P87L0M25J709
57452B56615K521K229J502J039P36M56M93Q50R74O51L98O16J006J261J562K036
57436B74945K416K571K666K599K000J085O66R81J308J094O64M66M26M71P73J132
$$ plain form
57420 296263 297189 297351 297036 296983 297402 298010 298735 299701 300797 302050 304072 307308 311154 314797 318509 322982
57404 322982 327614 330853 332232 332784 333247 333257 332685 332448 333224 334417 335183 335778 337126 339572 342706 346030
57388 346030 349361 352881 357062 362140 367544 372400 376730 381495 387211 393202 398491 402788 406385 409748
57374 409748 413489 417990 422689 426334 428324 429233 429818 430267 430682 431426 432417 432836 432144 430811 429524 428265
57358 428265 426696 424874 422984 420921 418739 417061 416352 416151 415595 414472 413285 412600 412778 413988 416025
57343 416025 418395 420917 423945 427665 431625 435367 439148 443592 448974 455187 462024 469120 476068 483010
57329 483010 490664 499269 507891 515351 521560 527409 533598 540080 546472 552560 558500 564766 571719 579016
57315 579016 585832 591944 598162 605309 613162 620851 627981 634902 642106 649830 658058 666538 674893 682998
$$ packed form
57420B96263R26J62l15n3M19O08P25R66J096J253K022L236L846L643L712M473
57404C22982M632L239J379N52M63J0n72k37P76J193P66N95J348K446L134L324
57388C46030L331L520M181N078N404M856M330M765N716N991N289M297L597L363
57374D09748L741M501M699L645J990R09N85M49M15P44R91M19o92j333j287j259
57358D28265j569j822j890k063k182j678p09k01n56j123j187o85J78J210K037
57343D16025K370K522L028L720L960L742L781M444N382O213O837P096O948O942
57329D83010P654Q605Q622P460O209N849O189O482O392O088N940O266O953P297
57315E79016O816O112O218P147P853P689P130O921P204P724Q228Q480Q355Q105
$$ plain form
57301 682998 691121 699587 708591 718401 729236 740707 751896 762349 772572 783198 794106 804784
57289 804784 815138 825534 836431 848297 861425 875421 889388 903117 917612 933874 951652
57278 951652 969979 988468 1007283 1026199 1044652 1062751 1081456 1101501 1122592 1143833 1164632
57267 1164632 1185158 1206182 1228490 1252207 1276678 1301128 1325324 1349546 1374148 1399365 1425280
57256 1425280 1451718 1478338 1505025 1532046 1559788 1588606 1618930 1651027 1684481 1718308 1751884
57245 1751884 1785416 1819383 1853975 1889347 1925925 1964087 2003849 2045107 2087818 2131724 2176331
57234 2176331 2221439 2267413 2314756 2363811 2414884 2468164 2523479 2580810 2641024 2705181 2772950
57223 2772950 2842695 2913404 2985349 3058312 3130398 3199559 3265294 3327816 3386493 3440504 3490452
$$ packed form
57301F82998Q123Q466R004R810J0835J1471J1189J0453J0223J0626J0908J0678
57289H04784J0354J0396J0897J1866J3128J3996J3967J3729J4495J6262J7778
57278I51652J8327J8489J8815J8916J8453J8099J8705K0045K1091K1241K0799
57267A164632K0526K1024K2308K3717K4471K4450K4196K4222K4602K5217K5915
57256A425280K6438K6620K6687K7021K7742K8818L0324L2097L3454L3827L3576
57245A751884L3532L3967L4592L5372L6578L8162L9762M1258M2711M3906M4607
57234B176331M5108M5974M7343M9055N1073N3280N5315N7331O0214O4157O7769
57223B772950O9745P0709P1945P2963P2086O9161O5735O2522N8677N4011M9948
$$ plain form
57212 3490452 3538003 3584131 3628865 3672483 3715727 3758752 3800938 3841904 3881914 3921112 3959139
57201 3959139 3995823 4031759 4067965 4105159 4143368 4181987 4220387 4258674 4297628 4337729 4378583
57190 4378583 4419511 4460177 4500350 4539715 4578394 4617025 4655771 4693829 4730438 4765626 4799263
57179 4799263 4830163 4857103 4880272 4900822 4919504 4936609 4952780 4968754 4984516 4999663 5014436
57168 5014436 5029538 5045125 5060747 5076086 5091109 5105807 5120529 5136135 5152993 5170170 5186504
57157 5186504 5202108 5217983 5234574 5251563 5268583 5285130 5300206 5313266 5325217 5337287 5349088
57146 5349088 5358823 5365282 5368673 5369833 5369811 5370063 5371803 5375015 5378775 5382024 5382821 5377436 5362130 5336486
57132 5336486 5304052 5269591 5236509 5206519 5180050 5156294 5133764 5111345 5088432 5064368 5038748
$$ packed form
57212C490452M7551M6128M4734M3618M3244M3025M2186M0966M0010L9198L8027
57201C959139L6684L5936L6206L7194L8209L8619L8400L8287L8954M0101M0854
57190D378583M0928M0666M0173L9365L8679L8631L8746L8058L6609L5188L3637
57179D799263L0900K6940K3169K0550J8682J7105J6171J5974J5762J5147J4773
57168E014436J5102J5587J5622J5339J5023J4698J4722J5606J6858J7177J6334
57157E186504J5604J5875J6591J6989J7020J6547J5076J3060J1951J2070J1801
57146E349088R735O459L391J160k2K52J740L212L760L249P97n385j5306k5644
57132E336486l2434l4461l3082k9990k6469k3756k2530k2419k2913k4064k5620
$$ plain form
57121 5038748 5012409 4987443 4966249 4950996 4943337 4943620 4950822 4964130 4984086 5011408 5045795 5087372
57109 5087372 5138427 5202163 5280573 5375402 5490531 5631611 5804339 6015522 6275472 6597392
57099 6597392 6995465 7486444 8092738 8840939 9756960 10864208 12184423 13735969 15531367
57090 15531367 17579962 19891817 22473389 25317308 28395755 31652986 34985977 38228067
57082 38228067 41171089 43628220 45485755 46697946 47246123 47120230 46339210 44971465
57074 44971465 43123614 40911612 38442572 35810637 33094680 30356641 27646810 25012212
57066 25012212 22498375 20144514 17979912 16023594 14283578 12755747 11425908 10274510
57058 10274510 9280083 8420838 7676598 7030466 6468173 5976464 5543429 5159887 4818823
$$ packed form
57121E038748k6339k4966k1194j5253p659K83P202J3308J9956K7322L4387M1577
57109E087372N1055O3736P8410R4829J15129J41080J72728K11183K59950L21920
57099F597392L98073M90979O06294P48201R16021J107248J320215J551546J795398
57090A5531367K048595K311855K581572K843919L078447L257231L332991L242090
57082C8228067K943022K457131J857535J212191N48177j25893p81020j367745
57074D4971465j847851k212002k469040k631935k715957k738039k709831k634598
57066B5012212k513837k353861k164602j956318j740016j527831j329839j151398
57058A0274510r94427q59245p44240o46132n62293m91709m33035l83542l41064
$$ plain form
57049 4818823 4513425 4236823 3983664 3750726 3535788 3336728 3151746 2979495 2818627
57040 2818627 2667706 2525612 2391575 2264843 2144723 2030828 1922819 1820090 1722328 1630380
57030 1630380 1545974 1470478 1404362 1348026 1302664 1270054 1251880 1249652 1264739 1296693 1339733
57019 1339733 1380715 1402583 1392629 1349144 1280805 1200137 1117412 1038777 967075 902790 845008
57008 845008 792782 745852 704050 666667 632954 602818 576421 553378 532951 514890 499511
56997 499511 486893 476403 467160 458763 451446 445586 441169 437890 435762 435338 437064 440659 445654 452406
56983 452406 461853 473872 486221 495442 498779 495345 485958 472238 455745 437738 419569 402883
56971 402883 388967 377971 369199 362175 357043 353984 352786 353113 354794 357830 362609 370167 381596 396951
$$ packed form
57049D818823l05398k76602k53159k32938k14938j99060j84982j72251j60868
57040B818627j50921j42094j34037j26732j20120j13895j08009j02729r7762r1948
57030A630380q4406p5496o6116n6336m5362l2610j8174k228J5087L1954M3040
57019A339733M0982K1868r954m3485o8339q0668q2725p8635p1702o4285n7782
57008H45008n2226m6930m1802l7383l3713l0136k6397k3043k0427j8061j5379
56997D99511j2618j0490r243q397p317n860m417l279k128m24J726L595M995O752
56983D52406R447J2019J2349R221L337l434r387j3720j6493j8007j8169j6686
56971D02883j3916j0996q772p024n132l059j198L27J681L036M779P558J1429J5355
$$ plain form
56957 396951 415214 435311 456233 475669 489460 493681 487467 473397 455240 435676 415884 396468
56945 396468 378347 362850 351061 343051 337904 334690 333314 334307 338052 344555 353860 366364 382710
56932 382710 403578 429351 459351 490974 519633 540022 548133 542867 526351 502775 476404 449970
56920 449970 424338 399404 375272 352730 332786 315909 301832 290009 280045 271616 264255 257555
56908 257555 251519 246451 242452 239294 236799 235064 234126 233619 233060 232483 232480 233472 235048 236361 237284 238849
56892 238849 242260 247667 254338 261938 271117 282741 297007 313381 330646 346590 358340 363853 363097
56879 363097 357499 348615 337795 326542 316245 307469 300141 294393 290726 289475 290744 294789 301789
56866 301789 311336 323018 337680 357233 382875 414150 450117 490465 534417 578604 616810 642310
$$ packed form
56957C96951J8263K0097K0922J9436J3791M221o214j4070j8157j9564j9792j9416
56945C96468j8121j5497j1789q010n147l214j376R93L745O503R305J2504J6346
56932C82710K0868K5773L0000L1623K8659K0389Q111n266j6516k3576k6371k6434
56920D49970k5632k4934k4132k2542j9944j6877j4077j1823r964q429p361o700
56908B57555o036n068l999l158k495j735r38n07n59n77lR92J576J313R23J565
56892B38849L411N407O671P600R179J1624J4266J6374J7265J5944J1750N513p56
56879C63097n598q884j0820j1253j0297q776p328n748l667j251J269M045P000
56866C01789R547J1682J4662J9553K5642L1275L5967M0348M3952M4187L8206K5500
$$ plain form
56854 642310 650961 642905 622131 594374 564697 536211 510326 487625 468513 453497 443221 438178
56842 438178 438460 444052 455343 472926 496908 526922 563140 606981 660395 724185 796255 870359
56830 870359 936309 982702 1001380 990653 955121 902952 842904 782170 725184 673697 628155
56819 628155 589021 556811 531386 512048 498459 491036 490297 496228 508573 527522 553797 588065
56807 588065 630187 678414 728407 772774 802526 810619 795274 760301 712262 657405 600604 545718
56795 545718 495549 451443 413723 382716 358895 342014 330813 323955 320958 322011 327296 336824
56783 336824 350714 369253 392555 419947 449201 476223 495928 504192 499554 483576 459860 432350
56771 432350 403816 375483 348023 322533 300120 280761 263416 247421 233165 221139 210987
$$ packed form
56854F42310Q651q056k0774k7757k9677k8486k5885k2701j9112j5016j0276n043
56842D38178K82N592J1291J7583K3982L0014L6218M3841N3414O3790P2070P4104
56830H70359O5950M6393J8678j0727l5532n2169o0048o0734n6986n1487m5542
56819F28155l9134l2210k5425j9338j3589p423p39N931J2345J8949K6275L4268
56807E88065M2122M8227M9993M4367K9752Q093j5345l4973m8039n4857n6801n4886
56795E45718n0169m4106l7720l1007k3821j6881j1201o858k997J053N285R528
56783C36824J3890J8539K3302K7392K9254K7022J9705Q264m638j5978k3716k7510
56771D32350k8534k8333k7460k5490k2413j9359j7345j5995j4256j2026j0152
$$ plain form
56760 210987 201957 193815 186811 180986 176001 171513 167371 163542 160086 157073 154374 151735 149260 147512
56746 147512 146871 147011 147248 147267 147239 147381 147656 147813 147602 147006 146309 145748 145169 144335 143529 143322 143609 143493 142454
56727 142454 141073 140159 139654 138993 138201 137936 138627 140177 142435 145321 148498 151466 154082 156514 158589 159708
56711 159708 159632 158964 158622 159059 160200 161775 163450 164860 165900 166904 168266 169865 171126 171687 171829 172107
56695 172107 172671 173113 172939 172099 171021 170231 169961 170071 170284 170487 170779 171166 171376 171195 170962 171355 172618 174310
56677 174310 175964 177573 179148 180255 180536 180399 180607 181289 181934 182334 182913 183989 185225 185979 185843 184753
56661 184753 183052 181524 180921 181287 182151 183396 185348 187837 189861 190663 190683 190998 192074 193489 194565 194911
56645 194911 194517 193774 193295 193454 194088 194772 195168 195033 194183 192711 190988 189322 187799 186594 186013 185980 185840
$$ packed form
56760B10987r030q142p004n825m985m488m142l829l456l013k699k639k475j748
56746A47512o41J40K37J9k8J42K75J57k11n96o97n61n79q34q06k07K87j16j039
56727A42454j381r14n05o61p92k65O91J550K258K886L177K968K616K432K075J119
56711A59708p6o68l42M37J141J575J675J410J040J004J362J599J261N61J42K78
56695A72107N64M42j74q40j078p90k70J10K13K03K92L87K10j81k33L93J263J692
56677A74310J654J609J575J107K81j37K08O82O45M00N79J076J236P54j36j090
56661A84753j701j528o03L66Q64J245J952K489K024Q02K0L15J076J415J076L46
56645A94911l94p43m79J59O34O84L96j35q50j472j723j666j523j205n81l3j40
$$ plain form
56628 185840 185000 183559 182079 180976 180407 180367 180514 180142 178748 176630 174577 173064 171935 170781 169420 168033
56612 168033 166963 166347 165955 165536 165255 165455 166064 166641 167063 167691 168705 169751 170454 170799 170767 170162 169165 168552
56594 168552 168938 170167 171824 173838 176102 177996 178952 179227 179483 179870 180113 180348 181169 182817 184815 186478
56578 186478 187431 187686 187582 187697 188457 189757 191133 192257 193156 194163 195777 198332 201536 204679 207581 211019
56562 211019 215821 221860 228431 235382 243333 252765 263228 273343 281317 285789 286708 285418 283602 282181
56548 282181 281296 280846 280527 279643 277504 274012 269564 264590 259554 255094 251683 249315 247862 247380 247581 247452
56532 247452 246164 244125 242355 240991 239259 236949 235001 234306 234603 234898 234519 233439 231967 230438 229046
56517 229046 227794 226699 225893 225271 224254 222406 220178 218416 217149 215517 213051 210427 208589 207647 206977
$$ packed form
56628A85840q40j441j480j103n69m0J47l72j394k118k053j513j129j154j361j387
56612A68033j070o16l92m19k81K00O09N77M22O28J014J046P03L45l2o05r97o13
56594A68552L86J229J657K014K264J894R56K75K56L87K43K35Q21J648J998J663
56578A86478R53K55j04J15P60J300J376J124Q99J007J614K555L204L143K902L438
56562B11019M802O039O571O951P951R432J0463J0115P974M472R19j290j816j421
56548B82181q85m50l19q84k139l492m448m974n036m460l411k368j453m82K01j29
56532B47452j288k039j770j364j732k310j948o95K97K95l79j080j472j529j392
56517B29046j252j095q06o22j017j848k228j762j267j632k466k624j838r42o70
$$ plain form
56502 206977 206055 204800 203363 201962 200806 199890 198882 197443 195699 194299 193950 194780 196132 197080 197274 197169
56486 197169 197357 197881 198386 198694 198918 199165 199508 200188 201474 203272 205121 206551 207334 207522 207457 207614 208180 208875
56468 208875 209375 209742 210229 210896 211706 212750 214029 215142 215520 214909 213477 211698 210282 209817 210172 210616 210825
56451 210825 211254 212172 212994 213266 213701 215324 217935 220397 222205 223770 225216 225947 225637 224830 224261 224228 224765
56434 224765 225771 226734 226947 226256 225111 223832 222372 220841 219626 218863 218395 218337 218989 220058 220736 220792 220903
56417 220903 221584 222449 222877 222775 222331 221648 221032 221026 221634 222006 221491 220638 220579 221657 223138 224136 224398 224312 224441
56398 224441 225019 225747 226225 226628 227635 229528 231690 233264 234048 234492 235130 236254 237914 239896 241777 243225
56382 243225 244267 245188 246224 247324 248131 248286 247968 247970 248940 250638 252285 253518 254536 255380 255624 254933 253515
$$ packed form
56502B06977r22j255j437j401j156r16j008j439j744j400l49Q30J352R48J94j05
56486A97169J88N24N05L08K24K47L43O80J286J798J849J430P83J88o5J57N66O95
56468B08875N00L67M87O67Q10J044J279J113L78o11j432j779j416m65L55M44K09
56451B10825M29R18Q22K72M35J623K611K462J808J565J446P31l10q07n69l3N37
56434B24765J006R63K13o91j145j279j460j531j215p63m68n8O52J069O78N6J11
56417B20903O81Q65M28j02m44o83o16oO08L72n15q53n9J078J481R98K62q6J29
56398B24441N78P28M78M03J007J893K162J574P84M44O38J124J660J982J881J448
56382B43225J042R21J036J100Q07J55l18KR70J698J647J233J018Q44K44o91j418
$$ plain form
56365 253515 251911 250636 250082 250399 251367 252656 254226 256200 258435 260599 262544 264195 265206 265276 264767 264448
56349 264448 264643 265149 265823 266615 267112 266858 266234 266230 267198 268533 269775 271179 272968 274836 276676 279033 282326
56332 282326 286199 290127 294045 297837 300787 302337 303060 304227 306544 309784 313457 317228 320689 323235
56318 323235 324434 324398 323658 322630 321285 319517 317835 317214 317932 319029 319550 319983 321618 324715 328296 331789
56302 331789 335788 340777 346129 350972 355367 359893 364524 368522 371154 372163 371822 370955 370687 371849 374626
56287 374626 378682 383308 387624 391247 394823 399284 404575 409776 414492 419267 424495 429919 435553 442106
56273 442106 449875 457989 465506 472686 480527 489518 499453 510096 521382 533247 545726 559021 573224
56260 573224 588306 604671 623310 645091 670213 698552 730144 765160 803915 847058 895224
$$ packed form
56365B53515j604j275n54L17R68J289J570J974K235K164J945J651J011P0n09l19
56349B64448J95N06O74P92M97k54o24mR68J335J242J404J789J868J840K357L293
56332B82326L873L928L918L792K950J550P23J167K317L240L673L771L461K546
56318C23235J199l6p40j028j345j768j682o21P18J097N21M33J635L097L581L493
56302C31789L999M989N352M843M395M526M631L998K632J009l41q67k68J162K777
56287C74626M056M626M316L623L576M461N291N201M716M775N228N424N634O553
56273D42106P769Q114P517P180P841Q991R935J0643J1286J1865J2479J3295J4203
56260E73224J5082J6365J8639K1781K5122K8339L1592L5016L8755M3143M8166
$$ plain form
56249 895224 948301 1005630 1067141 1133637 1205663 1282631 1363251 1446186 1530100 1613752 1696298
56238 1696298 1776751 1852901 1921568 1980203 2027541 2062559 2083961 2091203 2085022 2066346 2035532 1993235
56226 1993235 1941099 1880954 1814220 1742782 1669537 1597261 1527525 1461196 1399009 1340851 1285465
56215 1285465 1231899 1180521 1131803 1084949 1038791 993405 949797 908499 869453 832768 798629
56204 798629 766792 736958 709324 684139 661333 641163 624483 611479 600897 591465 583340 577082
56192 577082 571905 566273 559928 554104 549891 547342 546003 545361 544817 544030 543282 543060 543538 544809 547006 549634
56176 549634 551456 551818 551527 551786 552901 554714 557431 561142 565323 569720 575017 581693 589092 596618 604936
56161 604936 614696 625007 634644 644095 654896 667479 681255 696388 713819 733680 755143 777827
$$ packed form
56249H95224N3077N7329O1511O6496P2026P6968Q0620Q2935Q3914Q3652Q2546
56238A696298Q0453P6150O8667N8635M7338L5018K1402P242o181j8676l0814m2297
56226A993235n2136o0145o6734p1438p3245p2276o9736o6329o2187n8158n5386
56215A285465n3566n1378m8718m6854m6158m5386m3608m1298l9046l6685l4139
56204G98629l1837k9834k7634k5185k2806k0170j6680j3004j0582r432q125o258
56192E77082n177n632o345n824m213k549j339o42n44p87p48k22M78J271K197K628
56176E49634J822L62k91K59J115J813K717L711M181M397N297O676P399P526Q318
56161F04936R760J0311R637R451J0801J2583J3776J5133J7431J9861K1463K2684
$$ plain form
56149 777827 802174 828632 857703 890611 928702 972360 1021747 1078397 1144829 1222740 1312718
56138 1312718 1415347 1531030 1658487 1794274 1933488 2069917 2196328 2306778 2399458 2476762
56128 2476762 2542949 2602608 2660133 2717884 2773849 2822288 2857409 2876172 2878430 2866245 2843329
56117 2843329 2813434 2778044 2735651 2682904 2615825 2530834 2426613 2305709 2173732 2036959
56107 2036959 1901168 1771723 1652914 1546859 1453916 1373960 1306370 1249385 1200998 1160326
56097 1160326 1126989 1099686 1076846 1058258 1044391 1034333 1026071 1018715 1012798 1008486 1005154 1002804
56085 1002804 1002229 1003546 1005980 1009167 1013327 1018182 1023206 1028880 1036172 1044785 1053411 1061726 1070585 1080365
56071 1080365 1090723 1101915 1114584 1128264 1141800 1155330 1170098 1186222 1202448 1218201 1234108
$$ packed form
56149G77827K4347K6458K9071L2908L8091M3658M9387N6650O6432P7911Q9978
56138A312718J02629J15683J27457J35787J39214J36429J26411J10450R2680P7304
56128B476762O6187N9659N7525N7751N5965M8439L5121J8763K258j2185k2916
56117B843329k9895l5390m2393n2747o7079q4991j04221j20904j31977j36773
56107B036959j35791j29445j18809j06055r2943p9956o7590n6985m8387m0672
56097A160326l3337k7303k2840j8588j3867j0058q262p356n917m312l332k350
56085A002804n75J317K434L187M160M855N024N674P292Q613Q626Q315Q859R780
56071A080365J0358J1192J2669J3680J3536J3530J4768J6124J6226J5753J5907
$$ plain form
56060 1234108 1250318 1266178 1281779 1298043 1314956 1331449 1347251 1363146 1379221 1394684 1409681
56049 1409681 1425529 1442848 1461085 1480024 1500065 1520915 1541866 1563494 1587232 1613150 1640061
56038 1640061 1667801 1697341 1728518 1759829 1790665 1821805 1853644 1886049 1919965 1956858 1996500
56027 1996500 2037556 2080279 2126002 2174065 2222161 2269955 2319407 2371169 2423795 2477095 2533131
56016 2533131 2593012 2655601 2720299 2788204 2859591 2933158 3008787 3088295 3172532 3260495 3352096
56005 3352096 3448840 3550894 3656594 3765836 3880894 4002935 4130943 4265007 4407273 4558472
55995 4558472 4716933 4882368 5057275 5243321 5439737 5646588 5866184 6100047 6348079
55986 6348079 6612050 6896249 7203314 7533088 7886708 8267871 8678906 9119983 9593720
$$ packed form
56060A234108J6210J5860J5601J6264J6913J6493J5802J5895J6075J5463J4997
56049A409681J5848J7319J8237J8939K0041K0850K0951K1628K3738K5918K6911
56038A640061K7740K9540L1177L1311L0836L1140L1839L2405L3916L6893L9642
56027A996500M1056M2723M5723M8063M8096M7794M9452N1762N2626N3300N6036
56016B533131N9881O2589O4698O7905P1387P3567P5629P9508Q4237Q7963R1601
56005C352096R6744J02054J05700J09242J15058J22041J28008J34064J42266J51199
55995D558472J58461J65435J74907J86046J96416K06851K19596K33863K48032
55986F348079K63971K84199L07065L29774L53620L81163M11035M41077M73737
$$ plain form
55977 9593720 10106452 10663814 11269591 11930220 12655688 13454905 14335469 15309454 16394409
55968 16394409 17608030 18968403 20501595 22243957 24237322 26530630 29189969 32303184
55960 32303184 35976589 40335239 45523482 51691610 58979625 67527137 77508069 89159971
55952 89159971 102800805 118852099 137866777 160537409 187644053 219805734 256817763
55945 256817763 296635192 334721964 364774983 380997612 380647159 365068157 338583961
55938 338583961 306302641 272403743 239580152 209261653 182025095 157944543 136865048
55931 136865048 118568817 102816882 89340531 77857110 68097309 59809076 52755112
55924 52755112 46727977 41562465 37124076 33294167 29973291 27086368 24571901 22370883
$$ packed form
55977I593720N12732N57362O05777O60629P25468P99217Q80564R73985J084955
55968A6394409J213621J360373J533192J742362J993365K293308K659339L113215
55960C2303184L673405M358650N188243O168128P288015Q547512R980932J1651902
55952H9159971J3640834J6051294J9014678K2670632K7106644L2161681L7012029
55945B56817763L9817429L8086772L0053019J6222629l50453j5579002k6484196
55938C38583961l2281320l3898898l2823591l0318499k7236558k4080552k1079495
55931A36865048j8296231j5751935j3476351j1483421r759801q288233p053964
55924E2755112o027135n165512m438389l829909l320876k886923k514467k201018
$$ plain form
55916 22370883 20431860 18717896 17199874 15848318 14637478 13550697 12574892 11694454
55908 11694454 10895475 10170397 9512998 8913416 8362719 7857557 7395540 6970294 6575554
55899 6575554 6210045 5873830 5563351 5274108 5004899 4755639 4524137 4308494 4109583
55890 4109583 3927690 3759471 3601354 3453280 3316316 3189395 3071183 2962329 2863070 2771342
55880 2771342 2685904 2608540 2540232 2477564 2415626 2352273 2287217 2219663 2149664 2079534 2011122
55869 2011122 1943559 1876040 1810605 1749601 1692415 1637369 1585000 1536861 1492716 1451388 1412837
55858 1412837 1377071 1342441 1307344 1272436 1239251 1208040 1178821 1152863 1130931 1111373 1091950
55847 1091950 1072259 1052530 1031628 1008479 984259 961064 939391 918695 899220 881296 863962
$$ packed form
55916B2370883j939023j713964j518022j351556j210840j086781r75805q80438
55908A1694454p98979p25078o57399n99582n50697n05162m62017m25246l94740
55899F575554l65509l36215l10479k89243k69209k49260k31502k15643j98911
55890D109583j81893j68219j58117j48074j36964j26921j18212j08854r9259r1728
55880B771342q5438p7364o8308o2668o1938o3353o5056o7554o9999p0130o8412
55869B011122o7563o7519o5435o1004n7186n5046n2369m8139m4145m1328l8551
55858A412837l5766l4630l5097l4908l3185l1211k9219k5958k1932j9558j9423
55847A091950j9691j9729k0902k3149k4220k3195k1673k0696j9475j7924j7334
$$ plain form
55836 863962 846277 829109 813801 799966 786366 773098 761170 750695 741098 732313 724350 716566
55824 716566 708781 702054 696788 691145 683021 672734 662109 651859 641589 631578 622709 615065 608165
55811 608165 602187 597617 594190 591404 589529 588954 589304 590386 593165 598475 605497 612868 620484 628822 637132
55796 637132 643714 647480 648076 645118 638593 629400 618375 605482 591020 576685 564138 553358 543696
55783 543696 535566 529529 524468 518332 510120 499822 487347 473239 459729 449107 441274 434459 427960
55770 427960 422563 418622 415537 412990 411069 409124 406037 401722 397118 392739 388407 384247 380599 377107
55756 377107 373181 369206 366028 363332 359874 355199 349788 343662 336329 328184 320553 314140 308649 303948
55742 303948 300239 296950 292904 287972 283330 279697 276512 273243 270324 268226 266599 264986 263604 262850
$$ packed form
55836H63962j7685j7168j5308j3835j3600j3268j1928j0475r597q785p963p784
55824G16566p785o727n266n643q124j0287j0625j0250j0270j0011q869p644o900
55811F08165n978m570l427k786j875n75L50J082K779N310P022P371P616Q338Q310
55796F37132O582L766N96k958o525r193j1025j2893j4462j4335j2547j0780r662
55783E43696q130o037n061o136q212j0298j2475j4108j3510j0622p833o815o499
55770D27960n397l941l085k547j921j945l087m315m604m379m332m160l648l492
55756C77107l926l975l178k696l458m675n411o126p333q145p631o413n491m701
55742C03948l709l289m046m932m642l633l185l269k919k098j627j613j382p54
$$ plain form
55728 262850 262648 262656 262557 261878 260161 257586 254877 252393 249879 247209 244711 242605 240773 239299 238629 238970
55712 238970 239958 241058 241876 242196 242238 242834 244682 247428 250059 252143 254044 255934 257301 257470 256069 253097
55696 253097 249170 245601 243451 242514 241891 241478 242047 243935 246573 249455 252711 256458 260370 264131 267663
55681 267663 270691 272787 274166 275752 278143 281008 283745 286143 288119 289391 289903 290220 291202 293445 297085
55666 297085 301720 306279 309327 309810 307521 303019 297394 291893 287244 283283 279586 276320 274071 272922
55652 272922 272275 271538 270527 269133 267150 264515 261334 257662 253537 249114 244348 238761 232026 224653 217598
55637 217598 211293 205615 200547 196238 192529 189166 186407 184692 183714 182584 181023 179625 178789 178111 177042
55622 177042 175504 173605 171341 168947 167073 166277 166531 167333 168047 168164 167633 166866 166061 164720 162368 159525
$$ packed form
55728B62850k02Qr9o79j717k575k709k484k514k670k498k106j832j474o70L41
55712B38970R88J100Q18L20M2N96J848K746K631K084J901J890J367J69j401k972
55696B53097l927l569k150r37o23m13N69J888K638K882L256L747L912L761L532
55681B67663L028K096J379J586K391K865K737K398J976J272N12L17R82K243L640
55666B97085M635M559L048M83k289m502n625n501m649l961l697l266k249j149
55652B72922o47p37j011j394j983k635l181l672m125m423m766n587o735p373p055
55637B17598o305n678n068m309l709l363k759j715r78j130j561j398q36o78j069
55622A77042j538j899k264k394j874p96K54Q02P14J17n31p67q05j341k352k843
$$ plain form
55606 159525 157216 155633 154081 152247 150652 149678 149010 148319 147788 147607 147639 147872 148488 149181 149031 147521 145161
55589 145161 142823 141042 140265 140975 142972 145098 146373 147034 147944 149357 150934 152710 155336 159287 164309
55574 164309 169792 175422 181409 188203 196098 205099 215146 226190 237748 248573 257208 262898 265632
55561 265632 265462 262341 256714 249586 241775 233544 225110 216958 209417 202383 195820 190044 185243 181102
55547 181102 177262 173804 171000 168941 167657 167193 167223 167059 166456 166051 166537 167713 168798 169395 169632 169564 169002
55530 169002 167930 166646 165410 164201 162816 160962 158374 155148 151918 149376 147513 145586 142934 139698
55516 139698 136635 134257 132311 130139 127520 124979 123187 122255 121812 121562 121430 121240 120711 119911 119352 119403 119817
55499 119817 120022 119709 119008 118269 117752 117450 117069 116303 115148 113874 112775 112086 112019 112590 113484 114348 115190 116171
$$ packed form
55606A59525k309j583j552j834j595r74o68o91n31j81L2K33O16O93j50j510k360
55589A45161k338j781p77P10J997K126J275O61R10J413J577J776K626L951N022
55574A64309N483N630N987O794P895R001J0047J1044J1558J0825Q635N690K734
55561B65632j70l121n627p128p811q231q434q152p541p034o563n776m801m141
55547A81102l840l458k804k059j284m64L0j64o03m05M86J176J085N97K37o8n62
55530A69002j072j284j236j209j385j854k588l226l230k542j863j927k652l236
55516A39698l063k378j946k172k619k541j792r32m43k50j32j90n29q00n59N1M14
55499A19817K05l13p01p39n17l02l81p66j155j274j099o89o7N71Q94Q64Q42R81
$$ plain form
55481 116171 117075 117430 117186 116865 116867 116978 116740 116036 115096 114193 113507 113146 113105 113257 113392 113225 112562 111659 111246 111727
55461 111727 112479 112415 111311 110060 109483 109381 109033 108247 107564 107592 108408 109538 110400 110806 111055 111427 111725 111538
55443 111538 110855 110075 109496 109161 109121 109457 110027 110630 111371 112458 113631 114358 114612 114902 115422 115816 116003 116606
55425 116606 118114 120065 121459 121735 121047 119922 118961 118602 118837 119274 119569 119678 119662 119603 119759 120400 121435 122521
55407 122521 123485 124122 123653 121258 117436 114002 112264 111778 111352 110583 109764 108938 107893 106801 106036 105557 105135
55390 105135 105055 105866 107455 108993 109897 110265 110386 110388 110472 110958 111820 112542 112696 112449 112333 112693 113502 114459 115100
55371 115100 114960 113914 112432 111352 111251 111945 112717 113047 113028 112960 112722 111900 110460 108951 107942 107546 107568 107814
55353 107814 108056 107985 107427 106458 105266 104092 103341 103413 104280 105401 106202 106431 106075 105236 104198 103296 102632 102138
$$ packed form
55481A16171R04L55k44l21KJ11k38p04r40r03o86l61m1J52J35j67o63r03m13M81
55461A11727P52o4j104j251n77j02l48p86o83K8Q16J130Q62M06K49L72K98j87
55443A11538o83p80n79l35m0L36N70O03P41J087J173P27K54K90N20L94J87O03
55425A16606J508J951J394K76o88j125r61l59K35M37K95J09j6n9J56O41J035J086
55407A22521R64O37m69k395l822l434j738m86m26p69q19q26j045j092p65m79m22
55390A05135q0Q11J589J538R04L68J21KQ4M86Q62P22J54k47j16L60Q09R57O41
55371A15100j40j046j482j080j01O94P72L30j9o8k38q22j440j509j009l96K2K46
55353A07814K42p1n58r69j192j174p51P2Q67J121Q01K29l56q39j038r02o64m94
$$ plain form
55335 102138 101877 101979 102363 102963 104153 106258 108647 110077 110171 109798 109691 109502 108801 108177 108478 109439 109934 109409
55317 109409 108339 107369 106679 106170 105757 105470 105599 106548 108210 109667 110006 109261 108147 107107 106074 105025
55301 105025 104204 103803 103795 104007 104116 103771 103055 102545 102532 102553 102162 101825 102377 103885 105699 107412 109036 110365
55283 110365 111023 111215 111652 112543 113317 113494 113202 112649 111704 110354 109053 108252 107901 107704 107593 107769 108481 109777
55265 109777 111214 111892 111313 110217 109947 110863 111962 112278 111952 111544 110998 110009 108977 108737 109386 110034 109876
55248 109876 109037 108212 107824 107753 107677 107431 107115 106975 107192 107761 108562 109551 110758 112087 113179 113625 113384 112925
55230 112925 112789 113010 113125 112782 112104 111374 110633 109857 109338 109454 110081 110564 110407 109770 109228 109209 109724 110451 110949
55211 110949 110912 110367 109661 109287 109673 110909 112509 113602 113642 112904 112053 111323 110404 109134 107937 107471 108016 109326
$$ packed form
55335A02138k61J02L84O00J190K105K389J430R4l73j07j89p01o24L01R61M95n25
55317A09409j070r70o90n09m13k87J29R49J662J457L39p45j114j040j033j049
55301A05025q21m01qK12J09l45p16n10j3K1l91l37N52J508J814J713J624J329
55283A10365O58J92M37Q91P74J77k92n53r45j350j301q01l51j97j11J76P12J296
55265A09777J437O78n79j096k70R16J099L16l26m08n46r89j032k40O49O48j58
55248A09876q39q25l88p1p6k46l16j40K17N69Q01R89J207J329J092M46k41m59
55230A12925j36K21J15l43o78p30p41p76n19J16O27M83j57o37n42j9N15P27M98
55211A10949l7n45p06l74L86J236J600J093M0p38q51p30r19j270j197m66N45J310
$$ plain form
55193 109326 110857 112082 112777 113166 113657 114354 114967 115238 115277 115305 115241 114766 113803 112740 112118 112204 112869 113770 114505
55174 114505 114715 114275 113528 113132 113504 114502 115737 117021 118286 119264 119674 119656 119631 119683 119564 119364 119634 120526 121328
55155 121328 121282 120553 119928 119789 119810 119566 119023 118467 118276 118705 119612 120430 120610 120093 119229 118416 117951 117950 118168 118094
55135 118094 117517 116759 116123 115472 114736 114423 115014 116080 116638 116356 115814 115566 115549 115488 115365 115244 115066 114878 114971
55116 114971 115547 116475 117507 118562 119692 120901 122054 122889 123125 122733 122030 121396 121029 121069 121694 122800 123849
55099 123849 124402 124617 124850 125009 124813 124510 124708 125495 126308 126738 126909 126958 126652 125781 124543 123294 122191 121250
55081 121250 120496 119935 119567 119475 119703 120075 120420 120896 121759 122849 123682 124037 124072 123948 123731 123628 123828 124103 124045
55062 124045 123696 123424 123220 122737 122081 121878 122350 122940 123099 122880 122487 121864 121099 120666 120867 121465 122211 123229
$$ packed form
55193A09326J531J225O95L89M91O97O13K71L9K8o4m75r63j063o22Q6O65R01P35
55174A14505K10m40p47l96L72R98J235J284J265R78M10j8k5N2j19k00K70Q92Q02
55155A21328m6p29o25j39K1k44n43n56j91M29R07Q18J80n17q64q13m65jK18p4
55135A18094n77p58o36o51p36l13N91J066N58k82n42k48j7o1j23j21j78j88R3
55116A14971N76R28J032J055J130J209J153Q35K36l92p03o34l67M0O25J106J049
55099A23849N53K15K33J59j96l03J98P87Q13M30J71M9l06q71j238j249j103r41
55081A21250p54n61l68r2K28L72L45M76Q63J090Q33L55L5j24k17j03K00K75n8
55062A24045l49k72k04m83o56k03M72N90J59k19l93o23p65m33K01N98P46J018
$$ plain form
55044 123229 124446 125181 124915 124144 123865 124354 124929 124816 123832 122360 121012 120263 120148 120396 120949 122018 123481
55027 123481 124663 125146 125422 126238 127496 128255 127740 125979 123624 121557 120490 120504 120975 121277 121440 121788 122113
55010 122113 121760 120542 119071 118049 117560 117195 116571 115622 114668 114316 115035 116676 118561 120222 121838 123736
54994 123736 125616 126640 126433 125730 125734 126810 128123 128642 128281 127769 127642 127761 127777 127646 127576 127768 128332 129166 129849
54975 129849 130007 129919 130368 131708 133422 134851 135946 136964 137762 137945 137589 137289 137451 137868 138109 138086 138113 138551
54957 138551 139480 140650 141708 142440 142799 142745 142233 141339 140266 139163 138080 137104 136311 135645 135088 134992 135826 137434
54939 137434 138914 139486 139240 138799 138563 138594 138995 139960 141463 143224 144964 146547 147941 149327 151211 154181
54923 154181 158371 163231 167965 172273 176688 182012 188299 194500 199275 202034 202930 202120 199530 195299 189897
$$ packed form
55044A23229J217P35k66p71k79M89N75j13r84j472j348p49j15K48N53J069J463
55027A23481J182M83K76Q16J258P59n15j761k355k067j067J4M71L02J63L48L25
55010A22113l53j218j471j022m89l65o24r49r54l52P19J641J885J661J616J898
54994A23736J880J024k07p03MJ076J313N19l61n12j27J19J6j31p0J92N64Q34O83
54975A29849J58q8M49J340J714J429J095J018P98J83l56l00J62M17K41k3K7M38
54957A38551R29J170J058P32L59n4n12q94j073j103j083r76p93o66n57r6Q34J608
54939A37434J480N72k46m41k36L1M01R65J503J761J740J583J394J386J884K970
54923A54181M190M860M734M308M415N324O287O201M775K759Q96q10k590m231n402
$$ plain form
54908 189897 183748 177209 171004 166020 162352 159058 155235 151006 147143 144152 142107 140922 140350 140018 139904
54893 139904 140499 142079 144065 145502 145951 145603 144891 144436 144957 146623 148725 150527 152291 154940 158925 163947
54877 163947 169582 175533 181376 186735 191678 196279 199828 201197 200121 197483 194173 190329 185973 181636
54863 181636 177813 174317 170730 167268 164557 162669 160939 158842 156643 154928 153705 152290 150095 147296
54849 147296 144585 142420 140762 139436 138401 137598 136836 136041 135300 134480 133116 131008 128635 126647 125159
54834 125159 123954 123168 123206 124056 125240 126508 128118 130261 132533 134202 134800 134385 133435 132571 132188 132276 132657
54817 132657 133254 133970 134462 134407 133935 133500 133325 133316 133439 133791 134230 134300 133708 132690 131844 131736 132580 134018 135244
54798 135244 135703 135739 136238 137622 139478 141166 142395 143129 143369 143249 143044 142838 142429 141753 141136 140882 140841 140657
$$ packed form
54908A89897o149o539o205m984l668l294l823m229l863k991k045j185n72l32j14
54893A39904N95J580J986J437M49l48p12m55N21J666K102J802J764K649L985N022
54877A63947N635N951N843N359M943M601L549J369j076k638l310l844m356m337
54863A81636l823l496l587l462k711j888j730k097k199j715j223j415k195k799
54849A47296k711k165j658j326j035q03p62p95p41q20j364k108k373j988j488
54834A25159j205p86L8Q50J184J268J610K143K272J669N98m15r50q64l83Q8L81
54817A32657N97P16M92n5m72m35j75rJ23L52M39P0n92j018q46j08Q44J438J226
54798A35244M59L6M99J384J856J688J229P34K40j20k05k06m09o76o17k54m1j84
$$ plain form
54780 140657 140340 140300 140859 141966 143430 145241 147541 150397 153725 157465 161627 166051 170309 174128 177852
54765 177852 182157 187241 192727 198440 204661 211137 216399 218845 218437 216621 214522 211866 207817 202289
54751 202289 196054 189981 184549 179868 175772 171962 168270 164788 161724 159226 157404 156289 155676 155133 154289
54736 154289 153096 151838 151032 151227 152688 155180 158134 161004 163439 165363 167102 169305 172418 176321 180658
54721 180658 185310 190173 194727 198339 200978 203064 204536 204593 202591 198808 194074 188999 183825 178763 174092
54706 174092 170003 166529 163635 161300 159521 158243 157199 155982 154430 152864 151712 150991 150379 149637 148720
54691 148720 147610 146372 145259 144368 143385 142109 141060 141010 141921 143022 143948 145104 146642 147787 147716 146683
54675 146683 145727 145448 145502 145238 144485 143591 142798 141854 140456 139068 138766 139913 141460 142161 142061 142003 142015 141297
$$ packed form
54780A40657l17m0N59J107J464J811K300K856L328L740M162M424M258L819L724
54765A77852M305N084N486N713O221O476N262K446m08j816k099k656m049n528
54751B02289o235o073n432m681m096l810l692l482l064k498j822j115o13n43q44
54736A54289j193j258q06J95J461K492K954K870K435J924J739K203L113L903M337
54721A80658M652M863M554L612K639K086J472N7k002l783m734n075n174n062m671
54706A74092m089l474k894k335j779j278j044j217j552j566j152p21o12p42r17
54691A48720j110j238j113q91r83j276j049n0R11J101R26J156J538J145p1j033
54675A46683r56k79N4k64p53q94p93r44j398j388l02J147J547P01j00n8J2p18
$$ plain form
54657 141297 139815 138687 138590 138832 138554 137964 137716 137878 138256 139074 140411 141542 141746 141404 141406 141734 141577 140799
54639 140799 140332 140923 142155 143003 142995 142613 142797 144031 145788 147028 147366 147386 147516 147195 145781 143827 142594
54622 142594 142484 142777 142854 142825 142852 142687 142192 141689 141510 141698 142357 143727 145634 147330 148197 148233 147669 146618 145423
54603 145423 144829 145299 146379 147156 147157 146615 146088 146157 147182 148911 150442 150910 150227 148968 147745 146944 146853 147561
54585 147561 148705 149682 150193 150395 150516 150533 150260 149526 148305 146905 145980 146051 146975 148191 149539 151401 153831
54568 153831 156025 157126 157337 157652 158537 159402 159499 158845 157992 157256 156575 155931 155499 155429 155719 156268 156925 157547 158179
54549 158179 159011 160007 160783 161052 160970 160769 160361 159748 159537 160426 162186 163803 164780 165681 167161 168947 170202
54532 170202 170571 170485 170533 170843 170993 170510 169549 169032 169784 171495 172932 173283 172865 172377 171947 171265 170296 169443 169156
$$ packed form
54657A41297j482j128r7K42k78n90k48J62L78Q18J337J131K04l42KL28j57p78
54639A40799m67N91J232Q48ql82J84J234J757J240L38K0J30l21j414j954j233
54622A42594j10K93P7k9K7j65m95n03j79J88O59J370J907J696Q67L6n64j051j195
54603A45423n94M70J080P77Jn42n27O9J025J729J531M68o83j259j223q01r1P08
54585A47561J144R77N11K02J21J7k73p34j221j400r25P1R24J216J348J862K430
54568A53831K194J101K11L15Q85Q65R7o54q53p36o81o44m32p0K90N49O57O22O32
54549A58179Q32R96P76K69q2k01m08o13k11Q89J760J617R77R01J480J786J255
54532A70202L69q6M8L10J50m83r61n17P52J711J437L51m18m88m30o82r69q53k87
$$ plain form
54513 169156 169616 170569 171268 170941 169623 168281 167786 167948 167874 167013 165593 164249 163570 163850 164900 166125 166985
54496 166985 167288 167059 166474 166061 166495 167802 169104 169534 169142 168595 168313 168343 168769 169716 171051 172482 173847
54479 173847 174970 175535 175519 175553 176370 178018 179996 181968 183920 185791 187423 188775 189797 190263 190108 189727
54463 189727 189477 189134 188351 187433 187056 187361 187914 188472 189191 190140 191147 192091 192849 193060 192567 191961 192070 192957
54445 192957 194044 195078 196130 196731 196006 193950 191716 190272 189419 188461 187191 185838 184611 183710 183314 183264
54429 183264 183249 183514 184700 186640 188045 187939 186832 185940 185743 185927 186252 186738 187212 187369 187258 187185 187237 187247 187193
54410 187193 187248 187498 187851 188162 188333 188464 188955 190101 191460 192120 191841 191479 191942 193175 194551 195748 196739
54393 196739 197368 197578 197773 198321 198956 199209 199160 199177 199104 198373 196856 195039 193452 192434 192241 192773 193299 193138
$$ packed form
54513A69156M60R53O99l27j318j342m95J62p4q61j420j344o79K80J050J225Q60
54496A66985L03k29n85m13M34J307J302M30l92n47k82L0M26R47J335J431J365
54479A73847J123N65j6L4Q17J648J978J972J952J871J632J352J022M66j55l81
54463A89727k50l43p83r18l77L05N53N58P19R49J007R44P58K11m93o06J09Q87
54445A92957J087J034J052O01p25k056k234j444q53r58j270j353j227r01l96n0
54429A83264j5K65J186J940J405j06j107q92j97J84L25M86M74J57j11p3N2J0n4
54410A87193N5K50L53L11J71J31M91J146J359O60k79l62M63J233J376J197R91
54393A96739O29K10J95N48O35K53m9J7p3p31j517j817j587j018j93N32N26j61
$$ plain form
54375 193138 192522 192173 192085 191562 190489 189694 189771 190327 190788 191289 192263 193739 195585 198041 201347 205074 208360
54358 208360 210748 212381 213462 213965 213883 213421 212819 212148 211325 210277 209115 208135 207472 206775 205505 203650 201785
54341 201785 200234 198495 195956 192930 190490 189271 188831 188248 187014 185229 183321 181815 181181 181569 182652
54326 182652 183827 184590 184777 184630 184660 185208 185947 186002 184871 183133 181899 181550 181382 180660 179561 178677 177951 176752
54308 176752 175029 173701 173569 174285 174819 174656 174094 173555 173147 172841 172592 172191 171449 170668 170502 171116 171879 172200
54290 172200 172366 173148 174728 176444 177574 178007 178105 178210 178422 178651 178773 178831 179092 179752 180530 180794 180178 178949
54272 178949 177722 176975 176911 177528 178539 179351 179474 179075 178958 179827 181557 183279 184263 184681 185363 186760 188365
54255 188365 189414 189946 190715 192047 193310 193811 193729 193675 193690 193274 192304 191251 190454 189746 188923 188065 187193 186159
$$ packed form
54375A93138o16l49q8n23j073p95P7N56M61N01R74J476J846K456L306L727L286
54358B08360K388J633J081N03q2m62o02o71q23j048j162r80o63o97j270j855j865
54341B01785j551j739k539l026k440j219m40n83j234j785j908j506o34L88J083
54326A82652J175P63J87j47L0N48P39N5j131j738j234l49j68p22j099q84p26j199
54308A76752j723j328j32P16N34j63n62n39m08l06k49m01p42p81j66O14P63L21
54290A72200J66P82J580J716J130M33R8J05K12K29J22N8K61O60P78K64o16j229
54272A78949j227p47o4O17J011Q12J23l99j17Q69J730J722R84M18O82J397J605
54255A88365J049N32P69J332J263N01q2n4J5m16r70j053p97p08q23q58q72j034
$$ plain form
54237 186159 185141 184695 184929 185031 184141 182434 180855 179984 179649 179479 179318 179118 178906 178925 179437 180348 181337 182335
54219 182335 183508 184733 185494 185407 184591 183398 182089 180849 179847 179123 178590 178283 178405 179031 179916 180667 180985
54202 180985 180747 180052 179264 178812 178828 178992 178745 177678 175939 174357 173843 174404 175056 175027 174729 175029 175897 176506
54184 176506 176496 176279 176085 175638 175059 175165 176358 177915 178976 179640 180451 181333 181814 181952 182224 182613 182482 181409
54166 181409 179619 177668 176096 175318 175339 175612 175626 175526 175688 175811 175150 173730 172665 172913 174122 175080 175031 174315
54148 174315 173888 174450 175938 177712 179219 180420 181466 182167 182140 181404 180403 179439 178508 177793 177825 178755 179874
54131 179874 180282 179930 179566 179739 180246 180668 181095 182003 183535 185231 186605 187760 189137 190775 192199 193163
54115 193163 194118 195596 197365 198638 199053 199033 199149 199515 199891 200002 199629 198751 197849 197732 198727 200224 201311
$$ packed form
54237A86159j018m46K34J02q90j707j579q71l35j70j61k00k12J9N12R11R89R98
54219A82335J173J225P61q7q16j193j309j240j002p24n33l07J22O26Q85P51L18
54202A80985k38o95p88m52J6J64k47j067j739j582n14N61O52k9k98L00Q68O09
54184A76506j0k17j94m47n79J06J193J557J061O64Q11Q82M81J38K72L89j31j073
54166A81409j790j951j572p78K1K73J4j00J62J23o61j420j065K48J209R58m9p16
54148A74315m27N62J488J774J507J201J046P01k7p36j001r64r31p15L2R30J119
54131A79874M08l52l64J73N07M22M27R08J532J696J374J155J377J638J424R64
54115A93163R55J478J769J273M15k0J16L66L76J11l73q78r02j17R95J497J087
$$ plain form
54098 201311 201722 201809 201787 201463 200816 200413 201012 202889 205748 209135 212867 217162 222474 228937 235752 241321
54082 241321 244371 244919 243860 241768 238550 234245 229467 224774 220245 216204 213726 213562 214793 215526 214938
54067 214938 213804 212911 212001 210724 209689 209745 210723 211759 212549 213509 214867 216328 217609 218646 219303 219545
54051 219545 219995 221655 224823 228758 232663 236537 240842 245729 250948 256227 261377 266148 270310 273850
54037 273850 276953 279859 282837 286252 290509 295831 302002 308315 313985 318760 323057 327387 331823 336137
54023 336137 340165 343739 346536 348398 349625 350575 351158 351199 351033 351115 351109 350103 347730 344386 340246 334968 328705
54006 328705 322560 317420 312915 308178 303115 298216 293502 288506 283185 278123 273776 270085 266890 264151
53992 264151 261700 259252 256790 254536 252457 250224 247835 245837 244672 244126 243659 242993 242070 240691 238658
$$ packed form
54098B01311M11Q7k2l24o47m03N99J877K859L387L732M295N312O463O815N569
54082B41321L050N48j059k092l218m305m778m693m529m041k478j64J231P33n88
54067B14938j134q93r10j277j035N6R78J036P90R60J358J461J281J037O57K42
54051B19545M50J660L168L935L905L874M305M887N219N279N150M771M162L540
54037B73850L103K906K978L415M257N322O171O313N670M775M297M330M436M314
54023C36137M028L574K797J862J227R50N83M1j66Q2oj006k373l344m140n278o263
54006C28705o145n140m505m737n063m899m714m996n321n062m347l691l195k739
53992B64151k451k448k462k254k079k233k389j998j165n46m67o66r23j379k033
$$ plain form
53977 238658 236230 234075 232701 232090 231899 231805 231593 231219 230991 231523 233151 235420 237419 238708 239651 240732
53961 240732 241865 242700 243347 244363 246073 248337 251033 254332 258306 262664 267143 271989 277802 285065 293993
53946 293993 304653 317012 330958 346312 362509 378077 390761 398685 401468 400135 396157 390740
53934 390740 384775 378928 373714 369609 367006 365828 365421 365158 365067 365486 366267 366854 367227 368251 370854 375188
53918 375188 380787 387260 394473 402232 410180 418064 425964 434134 442610 450984 458731 465737 472302 478418
53904 478418 483398 486611 488357 489362 489519 487983 484703 480978 477851 474641 469901 463458 456538 450032
53890 450032 443638 436785 429462 421711 413120 403521 393635 384382 375836 367458 359084 351085 343715 336958
53876 336958 330980 326051 321900 317750 313201 308559 304124 299721 295271 291243 287973 284927 281270 277002
$$ packed form
53977B38658k428k155j374o11j91r4k12l74k28N32J628K269J999J289R43J081
53961B40732J133Q35O47J016J710K264K696L299L974M358M479M846N813P263Q928
53946B93993J0660J2359J3946J5354J6197J5568J2684P924K783j333l978n417
53934C90740n965n847n214m105k603j178m07k63r1M19P81N87L73J024K603M334
53918C75188N599O473P213P759P948P884P900Q170Q476Q374P747P006O565O116
53904D78418M980L213J746J005J57j536l280l725l127l210m740o443o920o506
53890D50032o394o853p323p751q591r599r886r253q546q378q374p999p370o757
53876C36958n978m929m151m150m549m642m435m403m450m028l270l046l657m268
$$ plain form
53862 277002 272926 269600 266952 264923 263758 263321 262686 260961 258341 255898 254396 253641 253018 252275 251567 250913
53846 250913 249975 248499 246832 245753 245682 246184 246332 245556 244072 242573 241589 241041 240362 239149 237812 237355 238254
53829 238254 239733 240542 240384 240162 240780 242157 243660 245018 246363 247637 248516 248964 249453 250438 251858 253289
53813 253289 254469 255523 256742 258328 260345 262818 265740 269010 272476 276119 280144 284788 290088 295870
53799 295870 301901 307984 313968 319915 326154 332957 340062 346722 352277 356586 359879 362486 364786 367126
53785 367126 369447 371131 371511 370587 369037 367465 365750 363173 359133 353706 347586 341541 335953 330822 326070
53770 326070 321683 317603 313660 309676 305553 301262 296887 292676 288842 285276 281644 277878 274389 271627
53756 271627 269549 267624 265283 262300 258919 255739 253404 252220 252017 252296 252365 251530 249579 247220 245672
$$ packed form
53862B77002m076l326k648k029j165m37o35j725k620k443j502p55o23p43p08o54
53846B50913r38j476j667j079p1N02J48p76j484j499r84n48o79j213j337m57Q99
53829B38254J479Q09j58k22O18J377J503J358J345J274Q79M48M89R85J420J431
53813B53289J180J054J219J586K017K473K922L270L466L643M025M644N300N782
53799B95870O031O083N984N947O239O803P105O660N555M309L293K607K300K340
53785C67126K321J684L80r24j550j572j715k577m040n427o120o045n588n131m752
53770C26070m387m080l943l984m123m291m375m211l834l566l632l766l489k762
53756B71627k078j925k341k983l381l180k335j184k03K79O9q35j951k359j548
$$ plain form
53741 245672 245510 246106 246425 246074 245317 244401 243337 242223 241314 240698 240285 240115 240336 240834 241222 241342 241491 242030
53723 242030 242981 244162 245483 246938 248389 249600 250500 251366 252676 254699 257171 259467 261219 262760 264766
53708 264766 267565 270891 274223 277117 279307 280813 282058 283644 285878 288600 291450 294131 296482 298618
53694 298618 301043 304300 308346 312514 316189 319257 321767 323521 324359 324549 324575 324655 324787 325063 325524 325769 325176
53677 325176 323625 321728 320271 319666 319940 320852 321928 322776 323563 324844 326645 328084 328303 327465 326336 325174
53661 325174 323684 321999 320868 320583 320403 319547 318244 317251 316718 316250 315886 316183 317266 318498 319346 319967 320598
53644 320598 320959 320771 320477 320852 322013 323337 324313 325057 325949 327123 328433 329675 330758 331798 333086 334768
53628 334768 336590 338072 338954 339356 339650 340334 341890 344427 347554 350917 354804 359775 365656 371398 376209
$$ packed form
53741B45672j62N96L19l51p57r16j064j114r09o16m13j70K21M98L88J20J49N39
53723B42030R51J181J321J455J451J211R00Q66J310K023K472K296J752J541K006
53708B64766K799L326L332K894K190J506J245J586K234K722K850K681K351K136
53694B98618K425L257M046M168L675L068K510J754Q38J90K6Q0J32K76M61K45n93
53677C25176j551j897j457o05K74R12J076Q48P87J281J801J439K19q38j129j162
53661C25174j490j685j131k85j80q56j303r93n33m68l64K97J083J232Q48O21O31
53644C20598L61j88k94L75J161J324R76P44Q92J174J310J242J083J040J288J682
53628C34768J822J482Q82M02K94O84J556K537L127L363L887M971N881N742M811
$$ plain form
53613 376209 380431 384937 389945 394813 398944 402427 405754 409210 412732 416130 419218 421801 423778 425342
53599 425342 426917 428741 430493 431551 431715 431584 432063 433558 435725 437854 439283 439574 438685 437121 435664
53584 435664 434719 434028 433103 431719 429873 427589 425126 423222 422590 423037 423372 422515 420546 418521 417336 416964
53568 416964 416693 415865 414331 412424 410663 409377 408517 407827 407257 407068 407436 408108 408630 408873 409052 409309 409592
53551 409592 410051 411177 413221 415702 417810 419241 420326 421367 422250 422841 423514 424960 427528 430919 434574
53536 434574 438232 442066 446310 450946 455851 461236 467659 475461 484307 493488 502645 511955 521658 531673
53522 531673 541848 552448 564181 577688 593031 609588 626433 642893 658986 675469 693419
53511 693419 713546 735672 758873 782285 805800 829918 854914 880486 906284 932478 959424
$$ packed form
53613C76209M222M506N008M868M131L483L327L456L522L398L088K583J977J564
53599D25342J575J824J752J058J64j31M79J495K167K129J429K91q89j564j457
53584D35664r45o91r25j384j846k284k463j904o32M47L35q57j969k025j185l72
53568D16964k71q28j534j907j761j286q60o90n70j89L68O72N22K43J79K57K83
53551D09592M59J126K044K481K108J431J085J041Q83N91O73J446K568L391L655
53536D34574L658L834M244M636M905N385O423P802Q846R181R157R310R703J0015
53522E31673J0175J0600J1733J3507J5343J6557J6845J6460J6093J6483J7950
53511F93419K0127K2126K3201K3412K3515K4118K4996K5572K5798K6194K6946
$$ plain form
53500 959424 986909 1014059 1040032 1064540 1087740 1110037 1132134 1154923 1178956 1203961 1229039
53489 1229039 1253322 1276468 1298623 1320041 1340817 1361013 1380915 1400918 1421039 1440795 1459831
53478 1459831 1478512 1497530 1516973 1536155 1554385 1571520 1587590 1602282 1615056 1625576 1633778
53467 1633778 1639621 1642934 1643399 1640602 1634355 1625091 1613750 1601086 1587317 1572580 1557404 1542342 1527329
53454 1527329 1511753 1495041 1476838 1456781 1434680 1411138 1387582 1365344 1344628 1324461 1303566
53443 1303566 1281344 1258240 1235332 1213571 1193440 1175215 1159330 1146197 1135793 1127653 1121208 1115902
53431 1115902 1111123 1106501 1102411 1099734 1098909 1099479 1100875 1103367 1107834 1114700 1123486 1133436 1144252 1156167
53417 1156167 1169652 1185248 1203382 1223970 1246206 1269061 1292094 1315749 1340805 1367678 1396275
$$ packed form
53500I59424K7485K7150K5973K4508K3200K2297K2097K2789K4033K5005K5078
53489A229039K4283K3146K2155K1418K0776K0196J9902K0003K0121J9756J9036
53478A459831J8681J9018J9443J9182J8230J7135J6070J4692J2774J0520Q202
53467A633778N843L313M65k797o247r264j1341j2664j3769j4737j5176j5062j5013
53454A527329j5576j6712j8203k0057k2101k3542k3556k2238k0716k0167k0895
53443A303566k2222k3104k2908k1761k0131j8225j5885j3133j0404q140o445n306
53431A115902m779m622m090k677q25N70J396K492M467O866Q786R950J0816J1915
53417A156167J3485J5596J8134K0588K2236K2855K3033K3655K5056K6873K8597
$$ plain form
53406 1396275 1426357 1457815 1490576 1524474 1559481 1596087 1635264 1677832 1723831 1772539 1823151
53395 1823151 1875372 1929382 1985371 2043181 2102397 2162669 2223895 2286083 2349010 2412017 2474232
53384 2474232 2535015 2594115 2651372 2706428 2758885 2808665 2855993 2901041 2943752 2983982 3021547
53373 3021547 3056039 3086854 3113582 3136228 3154863 3169185 3178567 3182296 3179387 3168349 3147752 3117427
53361 3117427 3078975 3034866 2987078 2936593 2883820 2829039 2772462 2714293 2655026 2595613 2537131
53350 2537131 2480277 2425270 2372208 2321335 2272772 2225954 2179446 2131576 2081568 2030228 1979465
53339 1979465 1930885 1884789 1840577 1797991 1757624 1720151 1685484 1653134 1623142 1596187 1572714
53328 1572714 1552435 1534722 1519014 1504560 1490249 1475116 1458884 1441749 1423905 1405621 1387533
$$ packed form
53406A396275L0082L1458L2761L3898L5007L6606L9177M2568M5999M8708N0612
53395A823151N2221N4010N5989N7810N9216O0272O1226O2188O2927O3007O2215
53384B474232O0783N9100N7257N5056N2457M9780M7328M5048M2711M0230L7565
53373C021547L4492L0815K6728K2646J8635J4322R382L729k909j1038k0597l0325
53361C117427l8452m4109m7788n0485n2773n4781n6577n8169n9267n9413n8482
53350B537131n6854n5007n3062n0873m8563m6818m6508m7870n0008n1340n0763
53339A979465m8580m6096m4212m2586m0367l7473l4667l2350k9992k6955k3473
53328A572714k0279j7713j5708j4454j4311j5133j6232j7135j7844j8284j8088
$$ plain form
53317 1387533 1370302 1354069 1338595 1323916 1310406 1298199 1287055 1277012 1268780 1263182 1260363 1259708
53305 1259708 1260360 1261704 1263589 1266285 1270185 1275428 1281932 1289814 1299623 1311945 1326857 1343925 1362685
53292 1362685 1383036 1405160 1429158 1454879 1482120 1510846 1540904 1571420 1600852 1628004 1652920
53281 1652920 1676483 1699264 1721041 1741311 1759757 1776171 1790330 1802068 1811152 1817075 1819395 1818381
53269 1818381 1814830 1809059 1800547 1788742 1773706 1755637 1734354 1709798 1682700 1654065 1624234 1593050
53257 1593050 1560827 1528426 1496287 1464010 1431211 1398294 1366032 1334757 1304422 1275293 1247970
53246 1247970 1222510 1197851 1172473 1145604 1117561 1088976 1060105 1031101 1002481 974824 948087
53235 948087 921824 896087 871605 848936 827990 808646 791266 776187 763122 751563 741387
$$ packed form
53317A387533j7231j6233j5474j4679j3510j2207j1144j0043q232n598k819o55
53305A259708O52J344J885K696L900N243O504P882R809J2322J4912J7068J8760
53292A362685K0351K2124K3998K5721K7241K8726L0058L0516K9432K7152K4916
53281A652920K3563K2781K1777K0270J8446J6414J4159J1738R084N923K320j014
53269A818381l551n771q512j1805j5036j8069k1283k4556k7098k8635k9831l1184
53257A593050l2223l2401l2139l2277l2799l2917l2262l1275l0335k9129k7323
53246A247970k5460k4659k5378k6869k8043k8585k8871k9004k8620k7657k6737
53235I48087k6263k5737k4482k2669k0946j9344j7380j5079j3065j1559j0176
$$ plain form
53224 741387 732490 724152 715410 705976 696149 685856 674468 661625 647693 633160 618124 602564
53212 602564 586763 571116 555803 540984 527119 514849 504506 495838 488124 480607 472946 465243
53200 465243 457542 449524 440981 432338 424186 416276 407608 397706 387344 377777 369619 362765 356933 351794
53186 351794 346868 341826 336923 332726 329429 326676 324061 321531 319199 316995 314667 312097 309560 307562
53172 307562 306334 305472 304244 302277 299812 297291 294941 292879 291320 290471 290290 290495 290685 290385 289215 287315
53156 287315 285411 284198 283678 283288 282604 281727 281064 280916 281225 281561 281445 280822 280137 279789 279680 279489 279156 278807
53138 278807 278403 277859 277443 277581 278250 279026 279747 280634 281639 282224 282139 281949 282306 283044 283527 283745 284466 286245
53120 286245 288720 291009 292455 292924 292796 292815 293621 295141 296629 297508 297938 298357 298672 298252 296649 294074 291206
$$ packed form
53224G41387q897q338q742r434r827j0293j1388j2843j3932j4533j5036j5560
53212F02564j5801j5647j5313j4819j3865j2270j0343q668p714p517p661p703
53200D65243p701q018q543q643q152p910q668r902j0362r567q158o854n832n139
53186C51794m926n042m903m197l297k753k615k530k332k204k328k570k537j998
53172C07562j228q62j228j967k465k521k350k062j559q49j81K05J90l00j170j900
53156B87315j904j213n20l90o84q77o63j48L09L36j16o23o85l48j09j91l33l49
53138B78807m04n44m16J38O69P76P21Q87J005N85q5j90L57P38M83K18P21J779
53120B86245K475K289J446M69j28J9Q06J520J488Q79M30M19L15m20j603k575k868
$$ plain form
53103 291206 288706 286849 285431 284104 282946 282508 283049 283916 284074 283202 281843 280495 279086 277542 276299
53088 276299 275837 276021 276359 276677 277114 277536 277506 276899 276201 276008 276458 277205 277784 277913 277666 277415 277435 277553 277390
53069 277390 276946 276666 276821 277076 276823 275730 273909 271821 270226 269843 270663 271699 271816 270832 269544 268732 268520
53052 268520 268748 269476 270807 272484 274088 275546 277081 278625 279606 279483 278356 276876 275650 274847 274237 273469
53036 273469 272364 271116 270265 270323 271334 272759 273850 274191 273998 273908 274393 275292 276013 276203 276048 275818 275416 274647
53018 274647 273815 273576 274163 275068 275655 275800 275800 275930 276345 277183 278430 279804 281007 282042 283048 283903 284284 284181
53000 284181 284078 284438 285136 285639 285740 285959 286994 288799 290443 291127 291146 291491 292532 293558 293722 292986 291880
52983 291880 290841 290277 290892 293179 296611 299935 302430 304419 306446 308461 310108 311353 312432 313414 314229
$$ packed form
53103B91206k500j857j418j327j158m38N41Q67J58q72j359j348j409j544j243
53088B76299m62J84L38L18M37M22l0o07o98j93M50P47N79J29k47k51K0J18j63
53069B77390m44k80J55K55k53j093j821k088j595l83Q20J036J17r84j288q12k12
53052B68520K28P28J331J677J604J458J535J544R81j23j127j480j226q03o10p68
53036B73469j105j248q51N8J011J425J091L41j93r0M85Q99P21J90j55k30m02p69
53018B74647q32k39N87R05N87J45%J30M15Q38J247J374J203J035J006Q55L81j03
53000B84181j03L60O98N03J01K19J035J805J644O84J9L45J041J026J64p36j106
52983B91880j039n64O15K287L432L324K495J989K027K015J647J245J079R82Q15
$$ plain form
52968 314229 314931 315589 316033 316093 316072 316548 317631 318733 319258 319242 319096 318957 318584 317747 316387 314447 312004 309615
52950 309615 308069 307507 307143 306190 304756 303446 302387 301224 299902 298800 298070 297510 297162 297290 297557 296987
52934 296987 295249 293297 292218 292001 292036 292184 292487 292310 290868 288519 286558 285644 285260 284831 284489 284448 284422 284114
52916 284114 283733 283600 283723 284078 284839 285961 286960 287453 287597 287654 287518 287036 286449 286144 286162 286293 286393 286392 286202 285872
52896 285872 285554 285182 284554 283875 283711 284180 284716 284945 285200 285730 286075 285868 285685 286207 286985 287041 286446 286275 286923
52877 286923 287516 287264 286523 286093 286178 286546 287236 288572 290741 293680 297118 300523 303315 305364 306990 308265
52861 308265 308781 308358 307550 306997 306622 305932 304783 303360 301634 299447 297035 294837 292729 290025 286453 282671
52845 282671 279518 277086 274842 272407 269879 267513 265455 263805 262605 261667 260598 259169 257602 256387
$$ packed form
52968C14229P02O58M44O0k1M76J083J102N25j6j46j39l73q37j360j940k443k389
52950C09615j546n62l64r53j434j310j059j163j322j102p30n60l48J28K67n70
52934B96987j738j952j079k17L5J48L03j77j442k349j961r14l84m29l42m1k6l08
52916B84114l81j33J23L55P61J122R99M93J44N7j36m82n87l05J8J31J00jj90l30
52896B85872l18l72o28o79j64M69N36K29K55N30L45k07j83N22P78N6n95j71O48
52877B86923N93k52p41m30Q5L68O90J336K169K939L438L405K792K049J626J275
52861C08265N16m23q08n53l75o90j149j423j726k187k412k198k108k704l572l782
52845B82671l153k432k244k435k528k366k058j650j200r38j069j429j567j215
$$ plain form
52831 256387 255827 255838 256230 257087 258685 260943 263080 264116 263744 262511 261111 259798 258656 258054 258372 259416
52815 259416 260586 261625 262775 264134 265373 266313 267346 268911 270806 272362 273129 273059 272223 270754 269014
52800 269014 267483 266439 265851 265466 264845 263585 261792 260104 258918 257889 256545 255109 254158 253726 253404 253184
52784 253184 253449 254188 254972 255781 257001 258419 259100 258746 258374 259072 260631 262010 262634 262574 261964 260988 260173 259949
52766 259949 260050 259947 259726 259857 260291 260503 260452 260768 261766 262841 263168 262619 261793 261448 262024 263395 264853 265622
52748 265622 265599 265494 266035 267228 268486 269391 270113 271120 272602 274313 275980 277675 279610 281674 283483 284959
52732 284959 286486 288355 290380 292201 293654 294622 294960 294884 295026 295681 296246 295896 294566 292880 291383 290284
52716 290284 289669 289309 288454 286549 284169 282594 282314 282469 281903 280318 278292 276616 275840 276089 277038 278214
$$ packed form
52831B56387n60J1L92Q57J598K258K137J036l72j233j400j313j142o02L18J044
52815B59416J170J039J150J359J239R40J033J565J895J556P67p0q36j469j740
52800B69014j531j044n88l85o21j260j793j688j186j029j344j436r51m32l22k20
52784B53184K65P39P84Q09J220J418O81l54l72O98J559J379O24o0o10r76q15k24
52766B59949J01j03k21J31M34K12n1L16R98J075L27n49q26l45N76J371J458P69
52748B65622k3j05N41J193J258R05P22J007J482J711J667J695J935K064J809J476
52732B84959J527J869K025J821J453R68L38p6J42O55N65l50j330j686j497j099
52716B90284o15l60q55j905k380j575k80J55n66j585k026j676p76K49R49J176
$$ plain form
52700 278214 279335 280236 280654 280487 280145 280217 280781 281483 282225 283217 284334 285064 285238 285270 285426 285347 284638 283520 282574
52681 282574 282076 281841 281494 280734 279533 278294 277635 277893 278930 280345 281639 282246 281811 280528 278964 277613
52665 277613 276842 277040 278256 279773 280634 280678 280605 280987 281758 282682 283748 285018 286651 289093 292551 296223 298820
52648 298820 300022 300571 300743 299723 297008 293536 290700 288927 287917 287546 287727 287940 287808 287800 288560 289853 290990
52631 290990 292019 293693 296358 299654 303269 307243 311444 315233 317693 317905 315334 310518 305129 300709
52617 300709 297447 294704 292393 290997 290415 289848 289030 288760 289817 291918 294053 295392 295588 294685 293156 291804
52601 291804 291301 291774 292819 293795 294274 294459 295029 296240 297375 297530 296763 296004 295934 296521 297490 298627 299588 300125
52583 300125 300632 301862 303911 306061 307752 309115 310334 311136 311319 311183 311012 310517 309300 307568 305977 304954
$$ packed form
52700B78214J121R01M18j67l42P2N64P02P42R92J117P30J74L2J56p9p09j118r46
52681B82574m98k35l47p60j201j239o59K58J037J415J294O07m35j283j564j351
52665B77613p71J98J216J517Q61M4p3L82P71R24J066J270J633K442L458L672K597
52648B98820J202N49J72j020k715l472k836j773j010l71J81K13j32qP60J293J137
52631B90990J029J674K665L296L615L974M201L789K460K12k571m816n389m420
52617C00709l262k743k311j396n82n67q18k70J057K101K135J339J96r03j529j352
52601B91804n03M73J045R76M79J85N70J211J135J55p67p59p0N87R69J137R61N37
52583C00125N07J230K049K150J691J363J219Q02J83j36j71m95j217j732j591j023
$$ plain form
52567 304954 304488 304425 304638 305016 305506 306034 306275 305695 304056 301745 299532 298068 297513 297399 296873 295480 293712
52550 293712 292437 291814 291257 290450 289750 289435 289278 289168 289476 290288 290882 290586 289732 289095 288749 288241 287666 287757 288803
52531 288803 290200 291254 291984 292847 294054 295472 296994 298750 300896 303298 305465 306931 307712 308269 309030
52516 309030 310125 311569 313357 315201 316615 317561 318737 320807 323605 326456 329066 331564 333771 334944
52502 334944 334391 332056 328476 324402 320442 316794 313281 309815 306702 304264 302304 300365 298455 297127
52488 297127 296796 297213 297657 297457 296454 295241 294801 295451 296281 296144 295190 294765 295648 297066 297813 297821 298074 299349
52470 299349 301596 304393 307404 310332 312906 315145 317417 320046 322955 325760 328156 330139 331876 333355
52456 333355 334205 333961 332505 330119 327058 323300 318922 314515 310939 308622 307265 306244 305149 303931 302758
$$ packed form
52567C04954m66o3K13L78M90N28K41n80j639k311k213j464n55j14n26j393j768
52550B93712j275o23n57q07p00l15j57j10L08Q12N94k96q54o37l46n08n75R1J046
52531B88803J397J054P30Q63J207J418J522J756K146K402K167J466P81N57P61
52516C09030J095J444J788J844J414R46J176K070K798K851K610K498K207J173
52502C34944n53k335l580m074l960l648l513l466l113k438j960j939j910j328
52488B97127l31M17M44k00j003j213m40O50Q30j37r54m25Q83J418P47QK53J275
52470B99349K247K797L011K928K574K239K272K629K909K805K396J983J737J479
52456C33355Q50k44j456k386l061l758m378m407l576k317j357j021j095j218j173
$$ plain form
52441 302758 301876 301498 301624 301962 302129 301982 301672 301314 300741 299729 298447 297466 297186 297368 297436 297165 296937 297286
52423 297286 298313 299600 300642 301322 301989 303045 304510 306126 307850 309932 312365 314629 316368 318097 320793
52408 320793 324862 329977 335912 342986 351565 361689 373344 386418 399879 411445 418732 420667 417625
52395 417625 410658 401193 391048 381794 373918 367059 361040 356137 352414 349477 347101 345439 344408 343485
52381 343485 342447 341771 341917 342710 343843 345466 347750 350383 353201 356896 362244 368743 374910 379935 384233
52366 384233 388239 391508 393437 394167 394196 393594 392254 390663 389796 390258 391865 393978 395940 397310 398086 398716
52350 398716 399618 400743 401805 402830 404109 405675 407186 408425 409610 411164 413386 416388 420109 424334
52336 424334 428941 434159 440354 447473 455038 462796 471115 480577 491422 503559 516836 530993 545622
$$ packed form
52441C02758q82l78J26L38J67j47l10l58n73j012j282r81k80J82O8k71k28L49
52423B97286J027J287J042O80O67J056J465J616J724K082K433K264J739J729K696
52408C20793M069N115N935P074Q579J0124J1655J3074J3461J1566P287J935l042
52395D17625o967r465j0145r254p876o859o019m903l723k937k376j662j031r23
52381C43485j038o76J46P93J133J623K284K633K818L695N348O499O167N025M298
52366C84233M006L269J929P30K9o02j340j591q67M62J607K113J962J370P76O30
52350C98716R02J125J062J025J279J566J511J239J185J554K222L002L721M225
52336D24334M607N218O195P119P565P758Q319R462J0845J2137J3277J4157J4629
$$ plain form
52323 545622 560600 576451 593823 612559 631684 650424 668838 687282 705748 724231 743395
52312 743395 764101 786163 808264 829545 850805 873545 898007 922834 946667 969486 992107
52301 992107 1014912 1037550 1059606 1081017 1101763 1121464 1139311 1154300 1165686 1173490 1178471 1181358
52289 1181358 1182164 1180558 1176722 1171444 1165394 1158782 1151825 1144995 1138525 1132085 1125365 1118749 1112964 1108162
52275 1108162 1103794 1099436 1095473 1092841 1092301 1094021 1097717 1103056 1109904 1118231 1127850 1138430 1149790 1161983
52261 1161983 1174956 1188380 1202064 1216401 1232095 1249397 1267855 1286835 1305986 1325112 1343860
52250 1343860 1361789 1378667 1394403 1408658 1420663 1429606 1435218 1437938 1438422 1436919 1433233 1427297 1419612
52237 1419612 1410967 1401849 1392271 1382023 1370868 1358563 1345085 1330922 1316839 1303097 1289157 1274448
$$ packed form
52323E45622J4978J5851J7372J8736J9125J8740J8414J8444J8466J8483J9164
52312G43395K0706K2062K2101K1281K1260K2740K4462K4827K3833K2819K2621
52301I92107K2805K2638K2056K1411K0746J9701J7847J4989J1386P804M981K887
52289A181358Q06j606l836n278o050o612o957o830o470o440o720o616n785m802
52275A108162m368m358l963k632n40J720L696N339O848Q327R619J0580J1360J2193
52261A161983J2973J3424J3684J4337J5694J7302J8458J8980J9151J9126J8748
52250A343860J7929J6878J5736J4255J2005Q943N612K720M84j503l686n936p685
52237A419612q645r118r578j0248j1155j2305j3478j4163j4083j3742j3940j4709
$$ plain form
52225 1274448 1259330 1244976 1232303 1221286 1211372 1202248 1194014 1186844 1180782 1175896 1172353 1170238 1169395
52212 1169395 1169467 1170014 1170599 1170985 1171470 1172871 1175927 1180582 1185966 1191129 1195707 1199856 1203807 1207769 1212148
52197 1212148 1217483 1223934 1231014 1238077 1245037 1252361 1260359 1268695 1276702 1283893 1289973 1294563 1297306 1298169
52183 1298169 1297316 1294671 1289974 1283360 1275537 1267163 1258340 1248990 1239369 1229884 1220678 1211861 1203920 1197300
52169 1197300 1191626 1186025 1180367 1175586 1172519 1170999 1170493 1171062 1173045 1176130 1179484 1182706 1185975 1189172
52155 1189172 1191527 1192446 1192196 1191425 1190402 1189185 1188287 1188595 1190495 1193376 1196147 1198129 1199409 1200535 1201962
52140 1201962 1203665 1205129 1205757 1205446 1204755 1204441 1204813 1205695 1207050 1209412 1213474 1219426 1227025 1236359 1248133
52125 1248133 1263022 1280975 1301381 1323636 1347239 1371657 1396675 1422805 1450753 1480303 1510187
$$ packed form
52225A274448j5118j4354j2673j1017r914r124q234p170o062m886l543k115q43
52212A169395P2N47N85L86M85J401L056M655N384N163M578M149L951L962M379
52197A212148N335O451P080P063O960P324P998Q336Q007P191O080M590K743Q63
52183A298169q53k645m697o614p823q374q823r350r621r485r206q817p941o620
52169A197300n674n601n658m781l067j520n06N69J983L085L354L222L269L197
52155A189172K355R19k50p71j023j217q98L08J900K881K771J982J280J126J427
52140A201962J703J464O28l11o91l14L72Q82J355K362M062N952P599R334J1774
52125A248133J4889J7953K0406K2255K3603K4418K5018K6130K7948K9550K9884
$$ plain form
52114 1510187 1539294 1567554 1595311 1622331 1648028 1672413 1696044 1718956 1740338 1759643 1777549
52103 1777549 1795305 1813348 1831022 1847601 1863004 1877320 1890050 1900214 1907071 1910400 1910098 1905892
$$ packed form
52114A510187K9107K8260K7757K7020K5697K4385K3631K2912K1382J9305J7906
52103A777549J7756J8043J7674J6579J5403J4316J2730J0164O857L329l02m206
$$ [...]
##END NTUPLES=NMR SPECTRUM
##END=
