##TITLE=AC1740_SEN00013_9276343_qgJO3Bddgf
##JCAMPDX= 6.0         $$ Bruker NMR JCAMP-DX V2.0
##DATA TYPE= NMR SPECTRUM
##DATA CLASS= NTUPLES
##ORIGIN= BRUKER
##OWNER= Administrator
$$ 1.72 TOPSPIN		Version 2.1
$$ 2015-07-15 00:40:10.494 -0700  Administrator@X
$$ Compression mode = diff/dup
##.OBSERVE FREQUENCY= 400.02188249412
##.OBSERVE NUCLEUS= ^1H
##.ACQUISITION MODE= SIMULTANEOUS (DQD)
##.ACQUISITION SCHEME= undefined
##.AVERAGES= 64
##.DIGITISER RES= 22
##SPECTROMETER/DATA SYSTEM= spect
##.PULSE SEQUENCE= noesygpps1d.comp
##.SOLVENT NAME= COFFEE_meoh
##.SHIFT REFERENCE= INTERNAL, COFFEE_meoh, 1, 14.96143
##AUDIT TRAIL= $$ (NUMBER, WHEN, WHO, WHERE, PROCESS, VERSION, WHAT)
$$ ##TITLE= Audit trail, TOPSPIN		Version 2.1
$$ ##JCAMPDX= 5.01
$$ ##ORIGIN= Bruker BioSpin GmbH
$$ ##OWNER= Administrator
$$ $$ E:\/data/COFFEE/nmr/AC1740_SEN00013_9276343_qgJO3Bddgf/12/pdata/1/auditp.txt
$$ ##AUDIT TRAIL=  $$ (NUMBER, WHEN, WHO, WHERE, PROCESS, VERSION, WHAT)
(   1,<2015-07-15 00:40:05.400 -0700>,<Administrator>,<X>,<go>,<TOPSPIN 2.1>,
      <created by zg
	started at 2015-07-15 00:28:35.713 -0700,
	POWCHK enabled, PULCHK disabled,
       configuration hash MD5:
       21 0F 79 D6 B3 7B B4 F6 88 20 88 DB 03 48 BD 9F
       data hash MD5: 64K
       EB 41 B5 6B CD EB B2 33 74 7A 70 55 C8 2B FD 4D>)
(   2,<2015-07-15 00:40:08.604 -0700>,<Administrator>,<X>,<proc1d>,<TOPSPIN 2.1>,
      <Start of raw data processing
       efp LB = 0.3 FT_mod = 6 PKNL = 1 PHC0 = 0 PHC1 = 0 SI = 128K 
       data hash MD5: 128K
       92 04 BF A0 58 85 2C 89 11 F6 79 DC 8F B1 7E 84>)
(   3,<2015-07-15 00:40:09.525 -0700>,<Administrator>,<X>,<proc1d>,<TOPSPIN 2.1>,
      <pk PHC0 = -88.4729 PHC1 = 0 
       data hash MD5: 128K
       DB AE 98 03 FE 14 8D 72 0C FF 50 E6 87 34 23 9A>)
(   4,<2015-07-15 00:40:09.932 -0700>,<Administrator>,<X>,<proc1d>,<TOPSPIN 2.1>,
      <abs ABSG = 1 
       data hash MD5: 128K
       7C 28 08 F5 3B A3 F2 4A 5D 09 D9 C0 C5 93 05 8C>)
(   5,<2015-07-15 00:40:10.041 -0700>,<Administrator>,<X>,<proc1d>,<TOPSPIN 2.1>,
      <abs ABSG = 2 
       data hash MD5: 128K
       5C 59 23 AA 63 52 02 4C CE 7C 64 FA 14 9B 4E 86>)
(   6,<2015-07-15 00:40:10.119 -0700>,<Administrator>,<X>,<proc1d>,<TOPSPIN 2.1>,
      <abs ABSG = 3 
       data hash MD5: 128K
       28 74 AC E1 FA CE 22 7F 67 37 F6 24 63 1E EA C9>)
(   7,<2015-07-15 00:40:10.197 -0700>,<Administrator>,<X>,<proc1d>,<TOPSPIN 2.1>,
      <abs ABSG = 4 
       data hash MD5: 128K
       F0 10 DB 82 78 67 BA 85 E4 11 D5 31 93 95 3D 92>)
(   8,<2015-07-15 00:40:10.275 -0700>,<Administrator>,<X>,<proc1d>,<TOPSPIN 2.1>,
      <abs ABSG = 5 
       data hash MD5: 128K
       2B 23 26 F0 07 04 A3 AF 9D 64 91 45 78 8D DD 5B>)
$$ ##END=
$$ 
$$ $$ hash MD5
$$ $$ 85 05 A2 45 AB 7A 27 55 69 83 03 BC 33 07 45 9C
##$RELAX= 
##$RELAX= 
##$RELAX= 
##$RELAX= 
##$RELAX= 
##$RELAX= 
##$RELAX= 
##$RELAX= 
$$ Bruker specific parameters
$$ --------------------------
##$DU= <E:\>
##$EXPNO= 12
$$ [...]
##$TP07= 0
##$TPNAME0= <>
##$TPNAME1= <>
##$TPNAME2= <>
##$TPNAME3= <>
##$TPNAME4= <>
##$TPNAME5= <>
##$TPNAME6= <>
##$TPNAME7= <>
##$TPOAL= (0..7)
0.5 0.5 0.5 0.5 0.5 0.5 0.5 0.5
##$TPOFFS= (0..7)
0 0 0 0 0 0 0 0
##$TUNHIN= 0
##$TUNHOUT= 0
##$TUNXOUT= 0
##$USERA1= <user>
##$USERA2= <user>
##$USERA3= <user>
##$USERA4= <user>
##$USERA5= <user>
##$V9= 5
##$VALIST= <valist>
##$VCLIST= <CCCCCCCCCCCCCCC>
##$VD= 0
##$VDLIST= <DDDDDDDDDDDDDDD>
##$VPLIST= <PPPPPPPPPPPPPPP>
##$VTLIST= <TTTTTTTTTTTTTTT>
##$WBST= 2048
##$WBSW= 25
##$XGAIN= (0..3)
0 0 0 0
##$XL= 0
##$YL= 0
##$YMAX_a= 6371509
##$YMIN_a= -11810806
##$ZGOPTNS= <>
##$ZL1= 120
##$ZL2= 120
##$ZL3= 120
##$ZL4= 120
##$ABSF1= 14.96143
##$ABSF2= -5.596752
##$ABSG= 5
##$ABSL= 3
##$ALPHA= 0
##$AQORDER= 0
##$ASSFAC= 0
##$ASSFACI= 0
##$ASSFACX= 0
##$ASSWID= 0
##$AUNMP= <proc_prof1d_extract.lims>
##$AXLEFT= 0
##$AXNAME= <>
##$AXNUC= <1H>
##$AXRIGHT= 0
##$AXTYPE= 0
##$AXUNIT= <>
##$AZFE= 0.1
##$AZFW= 0.1
##$BCFW= 0
##$BC_mod= 0
##$BYTORDP= 0
##$COROFFS= 0
##$CY= 15
##$DATMOD= 1
##$DC= 0
##$DFILT= <>
##$DTYPP= 0
##$F1P= 0
##$F2P= 0
##$FCOR= 0.5
##$FTSIZE= 131072
##$FT_mod= 6
##$GAMMA= 0
##$GB= 0
##$INTBC= 1
##$INTSCL= 1
##$ISEN= 128
##$LB= 0.3
##$LEV0= 0
##$LPBIN= 0
##$MAXI= 10000
##$MC2= 0
##$MEAN= 0
##$ME_mod= 0
##$MI= 0
##$NCOEF= 0
##$NC_proc= -2
##$NLEV= 6
##$NOISF1= 0
##$NOISF2= 0
##$NSP= 0
##$NTH_PI= 0
##$NZP= 0
##$OFFSET= 14.96143
##$PC= 1
##$PHC0= -88.4729
##$PHC1= 0
##$PH_mod= 1
##$PKNL= yes
##$PPARMOD= 0
##$PPDIAG= 0
##$PPIPTYP= 0
##$PPMPNUM= 2147483647
##$PPRESOL= 1
##$PSCAL= 4
##$PSIGN= 0
##$PYNMP= <proc.py>
##$REVERSE= no
##$SF= 400.020009463214
##$SI= 131072
##$SIGF1= 0
##$SIGF2= 0
##$SINO= 400
##$SIOLD= 131072
##$SPECTYP= <>
##$SREGLST= <1H.CDCl3>
##$SSB= 0
##$STSI= 131072
##$STSR= 0
##$SW_p= 8223.68421052631
##$SYMM= 0
##$S_DEV= 0
##$TDeff= 65536
##$TDoff= 0
##$TI= <>
##$TILT= no
##$TM1= 0
##$TM2= 0
##$TOPLEV= 0
##$USERP1= <user>
##$USERP2= <user>
##$USERP3= <user>
##$USERP4= <user>
##$USERP5= <user>
##$WDW= 1
##$XDIM= 131072
##$YMAX_p= 413411557
##$YMIN_p= -11643
##$CURPLOT= <Network HP LaserJet P1505>
##$CURPRIN= <$Network HP LaserJet P1505>
##$DFORMAT= <normdp>
##$LAYOUT= <+/1D_H.xwp>
##$LFORMAT= <normlp>
##$PFORMAT= <normpl>
##$SURQMSG= 1
$$ End of Bruker specific parameters
$$ ---------------------------------
##NTUPLES= NMR SPECTRUM
##VAR_NAME=  FREQUENCY,     SPECTRUM/REAL,   SPECTRUM/IMAG
##SYMBOL=    X,             R,               I
##VAR_TYPE=  INDEPENDENT,   DEPENDENT,       DEPENDENT
##VAR_FORM=  AFFN,          ASDF,            ASDF
##VAR_DIM=   131072,        131072,          131072
##UNITS=     HZ,            ARBITRARY UNITS, ARBITRARY UNITS
##FACTOR=    0.0627417313425164, 1,          1
##FIRST=     8223.62146879497, -73,          -54774
##LAST=      0,             2326,            -55306
##MIN=       0,             -11643,          0
##MAX=       8223.62146879497, 413411557,    0
$$ Real data points
##PAGE= N=1
##DATA TABLE= (X++(R..R)), XYDATA
$$ [...]
61639D04453O08J830K659K951K768K521K520K454J909J108N41P2q01j911k466
61624D21216k237j998k487l563m629n341n512m838l268j459m26o27j499j969j402
61609C79961k65J93q71l005m843n363m655l529k761k644k938l111k840k380k280
61594C38669k662l043k960k577k421k672k900k634j998j624j861k330k437k181
61580C04369k047k188k215j876j401r51k65O82J201P34j97n64j70K75L35K84L30
61563B96336J91k44m64j2Q19J374J444J359J501J932K371K385J876J351J408J800
61547C15427J575L93p51o86M80J569J785J346P52J63l86o41l36N80J983L531M471
61530C31255M030K293L70o77q26p50q38j077j481k008k214j723j052j146j942
$$ plain form
61639 404453 405061 406891 409550 412501 415269 417790 420310 422764 424673 425781 426322 426394 425593 423682 421216
61624 421216 418979 416981 414494 410931 406302 400961 395449 390611 387343 385884 385458 384831 383332 381363 379961
61609 379961 379696 379889 379018 376013 371170 365807 361152 357623 354862 352218 349280 346169 343329 340949 338669
61594 338669 336007 332964 330004 327427 325006 322334 319434 316800 314802 313178 311317 308987 306550 304369
61580 304369 302322 300134 297919 296043 294642 293691 293426 294108 295309 296043 295846 295282 295112 295387 295722 296006 296336
61563 296336 296527 296283 295819 295807 296626 298000 299444 300803 302304 304236 306607 308992 310868 312219 313627 315427
61547 315427 317002 317395 316644 315958 316438 318007 319792 321138 321890 322053 321667 321026 320690 321270 323253 326784 331255
61530 331255 335285 337578 337948 337271 336445 335695 334857 333780 332299 330291 328077 326354 325302 324156 322214
61515C22214k258j537p58r81j705j631n72M91J025J432J875J811J069L94L69O06
61499C21844O67R67J963K980K925J938J341J859K692K722J965J383J538K006K090
61484C50880J708J307J055N61m00j211r81K67J502J895J613J206P53O1p05j204
61468C58307j503j908k295k109j180q7L97O2o21j015q97o38p15j111j368j225
61452C42094q92n93k76K0L3j53J20J145K114K070J277Q73J221J603J646K038L270
61435C57610M516M561L475K478K276K347K020J535J530J963K108J573P79L41L96
61420C89508P60J346K038K407K070J327R93J435K066K037J196J94k94k40k39q03
61404D05801j761k414k410k159k186k314k007j315q42p84o73k35J68K45L19P48
$$ plain form
61515 322214 319956 318419 317661 316680 314975 313344 312772 313263 314288 315720 317595 319406 320475 320869 321238 321844
61499 321844 322511 323478 325441 328421 331346 333284 334625 336484 339176 341898 343863 345246 346784 348790 350880
61484 350880 352588 353895 354950 355511 355111 353900 352919 353186 354688 356583 358196 359402 360155 360216 359511 358307
61468 358307 356804 354896 352601 350492 349312 349225 349622 349684 349063 348048 347151 346513 345798 344687 343319 342094
61452 342094 341202 340609 340333 340353 340386 340233 340353 341498 343612 345682 346959 347832 349053 350656 352302 354340 357610
61435 357610 362126 366687 370162 372640 374916 377263 379283 380818 382348 384311 386419 387992 388771 389112 389508
61420 389508 390268 391614 393652 396059 398129 399456 400449 401884 403950 405987 407183 407377 407083 406843 406604 405801
61404 405801 404040 401626 399216 397057 394871 392557 390550 389235 388393 387609 386936 386701 386869 387114 387433 388181
61388C88181J293J521J439J323J240J185J375J924K486K682K648K810L271L752
61374D17130L973L726K903J770R35P05P04M88J77N7o9n98j436k102k329k125j428
61357D22481l25O35R51R58J477K648L670L880L609L709M441N117M883L750K689
61342D64573K482K744K553J895J742K537L473L636L114K366J351K3r64j073q55
61327D89597j170j833k021j736j659j757j217L8R65Q95N30R86K417M062N137N425
61311D98659N326N501O267P276Q052Q586R096R520R813J0319J1108J1264R786
61298F10573P034M438K762J591L91q83k255l764m932n184m927n196o139o873p044
61283E79592p231p528p051n513m066l658l656l101k352k321k728k439j205M6N46
$$ plain form
61388 388181 389474 390995 392434 393757 394997 396182 397557 399481 401967 404649 407297 410107 413378 417130
61374 417130 421103 424829 427732 429502 430437 431142 431846 432334 432511 432568 432499 431901 430465 428363 426034 423909 422481
61357 422481 422156 422791 423742 424700 426177 428825 432495 436375 439984 443693 448134 453251 458134 461884 464573
61342 464573 467055 469799 472352 474247 475989 478526 481999 485635 488749 491115 492466 492489 491525 490452 489597
61327 489597 488427 486594 484573 482837 481178 479421 478204 478242 479207 480102 480632 481618 484035 488097 493234 498659
61311 498659 503985 509486 515753 523029 531081 539667 548763 558283 568096 578415 589523 600787 610573
61298 610573 617607 622045 624807 626398 626789 625906 623651 619887 614955 609771 604844 599648 593509 586636 579592
61283 579592 572361 564833 557782 552269 548203 544545 540889 537788 535436 533115 530387 527948 526743 526789 527335
61268E27335L64j42o97r13m88L28J020J621K690M404O185P312P543P056O083M830
61252E74531L544K503J880J514R42q8j164j608j388j201j527k013k078j712j341
61237E70794j211j232j239j153j029j098j535k017j906r56L82J555K411L005L355
61222E68126L602M007M565M930N009N159N616O188O735P442Q253Q537P834O517
61208F52520N249M167L132K420K494L247M059M564M929N373N886O527P578R180
61194G21325J0971J2262J2635J2339J1978J1734J0994R043O005K838M48q69j237
61181H20466j025r55j772l485n267o362o882p478q509r655j0295j0131r582r400
61167G29668r792j0202j0329j0769j2003j3131j2747j0962r395r007r046q506
$$ plain form
61268 527335 527699 527557 526860 525947 525459 525787 526807 528428 531118 535522 541707 549019 556562 563618 569701 574531
61252 574531 578075 580578 582458 583972 584914 584826 583662 582054 580666 579465 577938 575925 573847 572135 570794
61237 570794 569583 568351 567112 565959 564930 563832 562297 560280 558374 557418 557800 559355 561766 564771 568126
61222 568126 571728 575735 580300 585230 590239 595398 601014 607202 613937 621379 629632 638169 646003 652520
61208 652520 657769 661936 665068 667488 669982 673229 677288 681852 686781 692154 698040 704567 712145 721325
61194 721325 732296 744558 757193 769532 781510 793244 804238 813281 819286 822124 822572 821703 820466
61181 820466 819441 818486 816714 813229 807962 801600 794718 787240 778731 769076 758781 748650 739068 729668
61167 729668 719876 709674 699345 688576 676573 663442 650695 639733 630338 621331 612285 603779
61155F03779p516o643n746m349k506o06J146K480K823K051R48K88j36j010k398
61140E82605l757m729n229n096m223k986j963j295o12M89K051L699M895N560O362
61125E75771P909R734J0823J1165J1908J3678J5752J7314J8535J9800K0733K0928
61113G54050K0926K1544K2664K3473K3590K3304K2957K2681K2389K1638J9908
61102I99124J7381J4829J2491R747O366L211J007o73k471m084m935n299n826o525
61088A034343p054p445p717p371o124m536l137j641J48J543K178L046N051P326
61074A008610Q482Q868R936J1793J3096J3222J2955J2947J2924J2667J2448J2329
61062A150277J2008J1484J0886R798P800N550M090L256K030L51p86j102j375j906
$$ plain form
61155 603779 596263 589620 583874 579525 577019 576413 577559 580039 582862 584913 585861 586149 586013 585003 582605
61140 582605 578848 574119 568890 563794 559571 556585 554622 553327 552715 553204 555255 558954 563849 569409 575771
61125 575771 583680 593414 604237 615402 627310 640988 656740 674054 692589 712389 733122 754050
61113 754050 774976 796520 819184 842657 866247 889551 912508 935189 957578 979216 999124
61102 999124 1016505 1031334 1043825 1053572 1059938 1063149 1064156 1063483 1061012 1056928 1051993 1046694 1040868 1034343
61088 1034343 1027289 1019844 1012127 1004756 998632 994096 990959 989318 989466 991009 993187 996233 1001284 1008610
61074 1008610 1017092 1025960 1035896 1047689 1060785 1074007 1086962 1099909 1112833 1125500 1137948 1150277
61062 1150277 1162285 1173769 1184655 1194453 1202253 1207803 1211893 1215149 1217179 1217530 1216744 1215642 1214267 1212361
61048A212361k041j508r28n90J0J025J875K408L299M826O348P420Q435R719J0984
61033A263643J2091J3366J4817J6066J7385J9704K3070K6198K8169K9629L1718
61022A495856L4545L7317L9383M0726M2094M4848M9995N7275O5860P5807Q7743
61011B071449J01362J15643J30718J48273J70112J97766K33305K78355L32085
61002C779068L92265M58986N35401O25009P31468Q61717J024838J225160J458488
60993A1092400J712362J955710K117132K087295J779106J213938N47070j2440
60985B2492573l24030l71688k23886K8362K82819M09625K81593j41002p55964
60976B1678402j367856j805541k005371k003746j875642j685785j476217j271508
$$ plain form
61048 1212361 1210320 1208812 1207884 1207294 1207304 1208329 1210204 1212612 1215911 1220737 1227085 1234505 1242940 1252659 1263643
61033 1263643 1275734 1289100 1303917 1319983 1337368 1357072 1380142 1406340 1434509 1464138 1495856
61022 1495856 1530401 1567718 1607101 1647827 1689921 1734769 1784764 1842039 1907899 1983706 2071449
61011 2071449 2172811 2288454 2419172 2567445 2737557 2935323 3168628 3446983 3779068
61002 3779068 4171333 4630319 5165720 5790729 6522197 7383914 8408752 9633912 11092400
60993 11092400 12804762 14760472 16877604 18964899 20744005 21957943 22505013 22492573
60985 22492573 22168543 21796855 21572969 21601331 21884150 22293775 22575368 22434366 21678402
60976 21678402 20310546 18505005 16499634 14495888 12620246 10934461 9458244 8186736
60968H186736j083571r15845p68769o42592n36339m47442l73636l13687k65863
60959B838992k27412j96067j70732j50311j33204j18395j05823r5172q5348p5564
60949A480964o6075n7487n0112m4261m0323l8202l7184l6620l6141l5293l3676
60938A005590l1571k9720k8378k7191k5972k4854k3660k1946j9862j8123j6940
60927G37373j5753j4256j2973j2370j2031j1169r583p735o271n675n999o672o904
60914F09982o488n911n545n166m477l648l033k617k138j585j283j500k125k779
60900E61687l191l475l975m750n360n375m972m796n252o085o711o774o392n930
60886D88649n539n036m268l491l012k666k090j521j666k573l318l221k769k802
$$ plain form
60968 8186736 7103165 6187320 5418551 4775959 4239620 3792178 3418542 3104855 2838992
60959 2838992 2611580 2415513 2244781 2094470 1961266 1842871 1737048 1641876 1556528 1480964
60949 1480964 1414889 1357402 1307290 1263029 1222706 1184504 1147320 1110700 1074559 1039266 1005590
60938 1005590 974019 944299 915921 888730 862758 837904 814244 792298 772436 754313 737373
60927 737373 721620 707364 694391 682021 669990 658821 649238 641503 635232 629557 623558 616886 609982
60914 609982 603494 597583 592038 586872 582395 578747 575714 573097 570959 569374 568091 566591 564466 561687
60900 561687 558496 555021 551046 546296 540936 535561 530589 525793 520541 514456 507745 500971 494579 488649
60886 488649 483110 478074 473806 470315 467303 464637 462547 461026 459360 456787 453469 450248 447479 444677
60872D44677l288l482k992k095j212n81k23J79J062K341L340L719L920M222M070
60857D53657L135K367K944M517N585N462M814M241L472K217Q93R8p3J56N32O87
60841D94704K77n86j500k427l681n215o529p401q158q910r136q337o716n007l901
60826D17477l764m461n296n446m716l581k541j750j369j677k681l888m694m781
60812C66832m118k948j824j322j592k257k787k732j928p77r8j97l83J08R24J112
60796C46013N93K38M92Q70R56J012J227J246Q99P07J054J521J586J424J445J528
60780C62811J324R89Q87Q59M22m13j116j410j544j779k011k012j751j400j160
60765C52696j122j139q77j88O61J252J440J382J211R09M21k03q12j213j272r95
$$ plain form
60872 444677 441389 437907 434915 432820 431608 431027 430804 430983 432045 434386 437726 441445 445365 449587 453657
60857 453657 456792 459159 462103 466620 472205 477667 482481 486722 490194 492411 493304 493402 493329 493485 494017 494704
60841 494704 494981 494395 492895 490468 486787 481572 475043 467642 459484 450574 441438 433101 426385 421378 417477
60826 417477 413713 409252 403956 398510 393794 390213 387672 385922 384553 382876 380195 376307 371613 366832
60812 366832 362714 359766 357942 356620 355028 352771 349984 347252 345324 344547 344449 344252 343869 343977 344901 346013
60796 346013 346606 346844 347336 348206 349162 350174 351401 352647 353546 354253 355307 356828 358414 359838 361283 362811
60780 362811 364135 365124 366011 366870 367292 366879 365763 364353 362809 361030 359019 357007 355256 353856 352696
60765 352696 351574 350435 349558 349370 350031 351283 352723 354105 355316 356225 356646 356443 355631 354418 353146 352151
60749C52151n07Q4P27J371J873K010J576O38k59n20k90n46j932l823n033n297
60733C42223n343n583n464m441k808j257m4Q62J307J118N86K74M68J109K026K910
60717C27943L272K886K211J982K355K772K667K037J270O75K66j36o07r44q35k80
60701C47534K97M86K68j90q88j837k668k849k352j775j584j539j169n96m91j138
60685C29509j903j881q98L98J313J678J651J390J125J227J856K643L053L004K865
60670C47030K900K997K923K530J654K23j394k472k655k415k446k716k538j635
60656C41986o87n55j121j386o87N53J475J819J940K065K063J924J953K266K481
60641C56089K149J257J16j006j916k461k675k804k945k902k571k182j917j540
$$ plain form
60749 352151 351644 351728 352455 353826 355699 357709 359285 359923 359664 359144 358854 358308 356376 352553 347520 342223
60733 342223 336880 331297 325833 321392 318584 317327 317283 318145 319452 320570 321156 321430 321898 323007 325033 327943
60717 327943 331215 334101 336312 338294 340649 343421 346088 348125 349395 350070 350336 350200 349593 348649 347814 347534
60701 347534 347831 348317 348585 348395 347507 345670 343002 340153 337801 336026 334442 332903 331734 331138 330647 329509
60685 329509 327606 325725 324827 325225 326538 328216 329867 331257 332382 333609 335465 338108 341161 344165 347030
60670 347030 349930 352927 355850 358380 360034 360257 358863 356391 353736 351321 348875 346159 343621 341986
60656 341986 341299 340744 339623 338237 337550 338103 339578 341397 343337 345402 347465 349389 351342 353608 356089
60641 356089 358238 359495 359611 358605 356689 354228 351553 348749 345804 342902 340331 338149 336232 334692
60627C34692q17o0K35J11R9M37Q06Q84P80P32O90M27n0l95l16J2L5n68j439j893
60607C34402j679j114n62j36J24K53O25J610K759K990J967P35M44J004J504J539
60591C46465J391J264J136J202J676K268K437K152J832J617J296Q49N05L30K54
60576C66674L98Q10J088R24Q43J630L111M323M812N030N335N587N904O875Q625
60561D21969J0339J1137J0875R832Q233O384M668L001R01j549l423m104m076m080
60547D70107l992l227j878o87kO34J816L569N443O975Q054Q870R670J0621J2057
60532E28030J4469J7788K0791K1891K0723J8419J6024J3232R121L718j697n803
60520F76706q300r743j0731j1361j1407j0830r890q754p348n768m443l562k732
$$ plain form
60627 334692 333875 333815 334050 334161 334260 334697 335503 336387 337167 337899 338589 339016 338966 338571 338255 338267 338302 337734 336295 334402
60607 334402 332723 331609 331047 330911 331035 331288 331913 333523 336282 339272 341239 341974 342418 343422 344926 346465
60591 346465 347856 349120 350256 351458 353134 355402 357839 359991 361823 363440 364736 365585 366090 366420 366674
60576 366674 367072 367882 368970 369894 370737 372367 375478 379801 384613 389643 394978 400565 406469 413344 421969
60561 421969 432308 443445 454320 464152 472385 478769 483437 486438 487339 485790 482367 478263 474187 470107
60547 470107 466115 462888 461010 460323 460321 460955 462771 466340 471783 478758 486812 495682 505352 515973 528030
60532 528030 542499 560287 581078 602969 623692 642111 658135 671367 680488 684206 682509 676706
60520 676706 668406 658663 647932 636571 625164 614334 604444 595690 588342 582574 578131 574569 571837
60507E71837j608m72L98J452L182N105O461P707J0066J3627J7137K0024K3203
60494F78119K7338L1546L4712L7027L9125M0610M0582L9131L7153L4938L1997
60483A072278K8142K3689J8595J2255M339m702j4118k3279l1667l8884m4763m9097
60471I52788n1323n0940m8294m4541m0764l7292l3878l0274k6596k3261k0547
60460E45078j8225j5891j3654j2099j1350j0644r234p356n919n414n580n860n822
60447D18030n295m448l638k975k247j400p67n64n68n93q80j638k516l005l042
60432C84454k856k464j791r96l34J05K25j29p44r88o09j40o6j05K06O83R13J029
60414C76393J318J497J187Q06J047J710J954J622J374J500J550J254R87J037J211
$$ plain form
60507 571837 570229 569757 570155 571607 574789 579894 586355 594062 604128 617755 634892 654916 678119
60494 678119 705457 737003 771715 808742 847867 888477 929059 968190 1005343 1040281 1072278
60483 1072278 1100420 1124109 1142704 1154959 1159298 1154596 1140478 1117199 1085532 1046648 1001885 952788
60471 952788 901465 850525 802231 757690 716926 679634 645756 615482 588886 565625 545078
60460 545078 526853 510962 497308 485209 473859 463215 453981 446625 440706 435292 429712 423852 418030
60447 418030 412735 408287 404649 401674 399427 398027 397260 396696 396128 395535 394655 393017 390501 387496 384454
60432 384454 381598 379134 377343 376347 376013 376118 376343 376214 375470 374482 373873 373733 373667 373562 373768 374451 375364 376393
60414 376393 377711 379208 380395 381201 382248 383958 385912 387534 388908 390408 391958 393212 394199 395236 396447
60399C96447J384J780K422K893K926K714K440K089J865K126K691K865K508K362
60385D29512K886L421L161K414K087K301K281J623Q39N49O80Q31R42J237J753
60370D56517K234K541K752K866K630J897J010N78Q12J335J670J757J847K087K376
60355D84909K570K665K801L098L431L499L286L354M241N551O133N426M091K987
60341E38042K036P15p81j694j937k340l423m569m862m264l543l231l121k820k370
60326E01838k140k267k536k826l336m065m397l705k335j361j205j067j14J314
60312D71798K267K565K950L987N496P060Q461R474R723R114Q122P411P322P783
60298E63533Q543R262R510Q882P213M696J741j383m749q413j1892j4218j4705
$$ plain form
60399 396447 397831 399611 402033 404926 407852 410566 413006 415095 416960 419086 421777 424642 427150 429512
60385 429512 432398 435819 438980 441394 443481 445782 448063 449686 450525 451074 451754 452585 453527 454764 456517
60370 456517 458751 461292 464044 466910 469540 471437 472447 473025 473837 475172 476842 478599 480446 482533 484909
60355 484909 487479 490144 492945 496043 499474 502973 506259 509613 513854 519405 525538 530964 535055 538042
60341 538042 540078 540793 540012 538318 536381 534041 530618 526049 521187 516923 513380 510149 507028 504208 501838
60326 501838 499698 497431 494895 492069 488733 484668 480271 476566 474231 472870 471665 470598 470484 471798
60312 471798 474065 476630 479580 483567 489063 496123 504584 514058 523781 532895 541017 548428 555750 563533
60298 563533 572076 581338 590848 599730 606943 611639 613380 611997 607248 598835 586943 572725 558020
60285E58020j3528j1473r326p534o218n297m692m475m582m601m187l680l754m339
60271D70334m616m281m054m514n059m739l568k402j809j786k167k626k552j675
60257D24486o27k56n05o64m87l03j39L91J253J851J862J578J235O66j34o87n91
60240D28929L0Q61J706K223J897O67o43r88j70J001J622J632J729K378L125L243
60224D49242K921L191M464N779N970N138M317M173M637N490O519P330P671P837
60210E24679Q127Q161P542O882P182Q261Q825Q166O889N802N045M585M573M832
60196F19551M695L857K731J698O89k24o96r06j647l029m015l927l568l967m766
60181F06476m954m664m983o042o614n839m415l526l357l237k773k257k009j940
$$ plain form
60285 558020 544492 533019 523693 516159 509941 504644 499952 495477 490895 486294 482107 478427 474673 470334
60271 470334 465718 461437 457383 452869 447810 443071 439503 437101 435292 433506 431339 428713 426161 424486
60257 424486 423859 423603 423098 422434 421947 421644 421505 421896 423149 425000 426862 428440 429675 430341 430207 429520 428929
60240 428929 428959 429820 431526 433749 435646 436313 435670 434682 434512 435513 437135 438767 440496 442874 445999 449242
60224 449242 452163 455354 459818 465597 471567 476705 481022 485195 489832 495322 501841 509171 516842 524679
60210 524679 532806 540967 548509 555391 562573 570834 579659 587825 594714 600516 605561 610146 614719 619551
60196 619551 624246 628103 630834 632532 633221 632997 632301 631395 629748 626719 622704 618777 615209 611242 606476
60181 606476 601522 596858 591875 585833 579219 573380 568965 565439 562082 558845 556072 553815 551806 549866
60167E49866j833j729j779j885j795j543j539k047k702k796k021p60K76N76J48
60152E28437m58n21J58J015J369J234J184J548K123K610K915L009K937K945L254
60137E53759L628L700L650M115N250O370O715O202N275M459M167M486M895M617
60123F21288L475K106J166P26O19Q73J454K019K318K515K784K849K371J520P74
60108F48857L00j37p33j441k127k666k926k877k667k445k206j909j585j207o65
60093F23566j2M33M18Q7k07l05k87k44k15l11o84j326j961k267k222k207k608
60076F09648l352m000m364m730n344o008o497o988p603p885p303o173n406n304
60062E28691n273m820m231l986m006l867l369k646j936j444j237j113p45k5Q87
$$ plain form
60167 549866 548033 546304 544525 542640 540845 539302 537763 535716 533014 530218 528197 527437 527713 528289 528437
60152 528437 527979 527458 527616 528631 530000 531234 532418 533966 536089 538699 541614 544623 547560 550505 553759
60137 553759 557387 561087 564737 568852 574102 580472 587187 593389 598664 603123 607290 611776 616671 621288
60123 621288 624763 626869 628035 628761 629380 630253 631707 633726 636044 638559 641343 644192 646563 648083 648857
60108 648857 649157 649020 648287 646846 644719 642053 639127 636250 633583 631138 628932 627023 625438 624231 623566
60093 623566 623554 623987 624405 624492 624285 623980 623693 623449 623234 622923 622239 620913 618952 616685 614463 612256 609648
60076 609648 606296 602296 597932 593202 587858 581850 575353 568365 560762 552877 545574 539401 533995 528691
60062 528691 523418 518598 514367 510381 506375 502508 499139 496493 494557 493113 491876 490763 490018 489993 490880
60047D90880J829K609K949K808K790L628N207O542O923O574O088N667N157M395
60033E54046L264J780L04o29r61j265k059l244m391n247n768n966o000o194o788
60018E10882p700q549q838q214o897n663n096m914m471l673k926k332j617q72
60004D39120o13r49j355j437j311j096o60o7L76P28J427K359K678J966R64O60
59988D42790J157J859K357K591K605K589K826L255L358K849K026J227L54o24j241
59973D69978j154q53j116j975k656k570j954j508j634k015j905q81O92K112L012
59958D55573L345K995K003J002P31J049J078L87n88j289j497j034J33J321J533
59943D66742O96k25o20q57j289j625j642j635j715j512j018p55o09M14K593M685
$$ plain form
60047 490880 492709 495318 498267 501075 503865 507493 512700 519242 526165 532739 538827 544494 549651 554046
60033 554046 557310 559090 559394 558765 557804 556539 554480 551236 546845 541598 535830 529864 523864 517670 510882
60018 510882 503182 494633 485795 477581 470684 465021 459925 455011 450540 446867 443941 441609 439992 439120
60004 439120 438507 437558 436203 434766 433455 432359 431699 431632 432008 432736 434163 436522 439200 441166 442130 442790
59988 442790 443947 445806 448163 450754 453359 455948 458774 462029 465387 468236 470262 471489 471843 471219 469978
59973 469978 468824 467971 466855 464880 462224 459654 457700 456192 454558 452543 450638 449757 450449 452561 455573
59958 455573 458918 461913 463916 464918 465649 466698 467776 468163 467575 466286 464789 463755 463888 465209 466742
59943 466742 467438 467213 466593 465736 464447 462822 461180 459545 457830 456318 455300 454545 453936 454350 456943 461628
59927D61628N554N669O048O590O529N752M614L057J049o00j096q97j013j408j199
59912E00277k32O92J119J459K132L002L740M110L927L277K597K026J033o56k187
59897E26316k479j722j089j168j443j244l81J027K567L506L461L037L137L767
59883E37292M221M200M000L823L692L894M702N714O227O151N813N119L834K444
59869F01126J744J609J098o4j118j458j322j071o32J7M97N14J50m22r95j098l66
59852E98209P51J362J329J416K102K968L498L869M560N678O894P636P219N290
59838F52781K353m57k267k881k442j190M30J857K689K631J399q69l340n175o307
59823F39212p053p310o893o394o651p408p479o378m903l860l098k176j208n12
$$ plain form
59927 461628 467182 472851 478899 485489 492018 497770 502384 505441 506490 505890 504794 503897 502884 501476 500277
59912 500277 500045 500737 501856 503315 505447 508449 512189 516299 520226 523503 526100 528126 529159 528503 526316
59897 526316 523837 522115 521026 519858 518415 517171 516790 517817 520384 523890 527351 530388 533525 537292
59883 537292 541513 545713 549713 553536 557228 561122 565824 571538 577765 583916 589729 594848 598682 601126
59869 601126 602870 604479 605577 605513 604395 602937 601615 600544 599912 599929 600426 600940 601090 600668 599673 598575 598209
59852 598209 598960 600322 601651 603067 605169 608137 611635 615504 620064 625742 632636 640272 647491 652781
59838 652781 655134 654677 652410 649529 647087 645897 646327 648184 650873 653504 654903 654034 650694 645519 639212
59823 639212 632159 624849 617956 611562 604911 597503 590024 583646 578743 574883 571785 569609 568401 567889
59809E67889LO17J199J323P64j90r20r58n67n34j138j616j237n55q06k252l856
59792E57166m642m595m184l767l568l621l560l054k423k309k676k879k629k252
59778E11007j988j791j775k069k169j354J37J190J310J245J805K851L804M475
59764E16678M972N327N533N594N380M834M344M396M869N324N850O864Q180R111
59750E97256R594J0174J0781J0576R342Q010P325O921O254N544N109M452K865
59737F94203N73j367k149j843j272j352k265l176l176k416j753j419r49l86m71
59722F70782j285j789j242k21K77Q4l46o67o74k23M55Q91J085J488K057K190J890
59705F74752J989K874L911M643N438O407O798O348O056O651P218O651N624N705
$$ plain form
59809 567889 567892 568509 569708 571031 571795 571605 570685 569727 569160 568626 567488 565872 564635 564080 563274 561022 557166
59792 557166 552524 547929 543745 539978 536410 532789 529229 526175 523752 521443 518767 515888 513259 511007
59778 511007 509019 507228 505453 503384 501215 499861 499998 501188 502498 503743 505548 508399 512203 516678
59764 516678 521650 526977 532510 538104 543484 548318 552662 557058 561927 567251 573101 579965 588145 597256
59750 597256 606850 617024 627805 638381 647723 655733 663058 669979 676233 681777 686886 691338 694203
59737 694203 694776 693409 691260 689417 688145 686793 684528 681352 678176 675760 674007 672588 671639 671253 670782
59722 670782 669497 667708 666466 666245 666522 666606 666260 665593 664919 664696 665151 666042 667127 668615 670672 672862 674752
59705 674752 676741 679615 683526 688169 693607 700014 706812 713160 719216 725867 733085 739736 745360 751065
59691G51065O994Q036P800O472M365J424j936m587n797n946n819n747n705n744
59677G44875n981o355o707o983p292p701p972p642o644n698n535n798n362l917
59663F55288k448j832j694j202l35L74P93J236J872K699L829N118N881N588M634
59648F79801L873L479K846J436o52k885m734o038p173q579r941j0336r444q114
59634F23539p257o760o062n216m655m208l305k112j690k746m702o204o430n778
59620E56414n353n789o603o887o407n663n038m479l968l599l111k109r29m60q15
59605D95204j071o66j32O2M05J359K286K268J401M95k1j34K70J171K040K405K422
59588E09764K325J799N85q20j720k038j978j491p76o36j471k486k709k331k138
$$ plain form
59691 751065 758059 766095 773895 780367 784732 786156 784220 779633 773836 767890 762071 756324 750619 744875
59677 744875 738894 732539 725832 718849 711557 703856 695884 688242 681598 675900 670365 664567 659205 655288
59663 655288 652840 651008 649314 648112 647777 648151 648944 650180 652052 654751 658580 663698 669579 675167 679801
59648 679801 683674 687153 689999 691435 690783 687898 683164 677126 669953 661374 651433 641097 631653 623539
59634 623539 616282 609522 603460 598244 593589 589381 586076 583964 582274 579528 574826 568622 562192 556414
59620 556414 551061 545272 538669 531782 525375 519712 514674 510195 506227 502628 499517 497408 496479 496019 495204
59605 495204 494133 493467 493335 493397 493802 495161 497447 499715 501116 501611 501590 501456 501726 502897 504937 507342 509764
59588 509764 512089 513888 514473 513653 511933 509895 507917 506426 505650 505014 503543 501057 498348 496017 493879
59573D93879k216k208k336l035l892m017l317k430j694j108r59j455j945j601
59559D61666p09k50l77l47J63P24J158J698K152J933J176Q33J390K340L046L382
59543D79978L435L377L791N226P268Q826R577J0352J2056J4758J7883K0344K0431
59530F17302J6708R576J436n099q801r789q845p029n178l435j559J55R24M99n29
59515E96336j559k510l441m319n301o531p553p643o853n952n232m281l153k750
59501E29258l526m666n150m956m583m031k982j623n02K03P16J124J292J240J238
59486E03052J420J627J710J900K662M041N189N069L813K893L436M828N599N323
59472E52562M767M433M024L345K704K197J490N87lj73m34r47j098n26K59P57J299
$$ plain form
59573 493879 491663 489455 487119 484084 480192 476175 472858 470428 468734 467626 466667 465212 463267 461666
59559 461666 460957 460707 460330 459983 460146 460870 462028 463726 465878 467811 468987 469820 471210 473550 476596 479978
59543 479978 483413 486790 490581 495807 503075 511901 521478 531830 543886 558644 576527 596871 617302
59530 617302 634010 643586 645022 639923 631122 621333 612488 605459 600281 596846 595287 595442 596366 596865 596336
59515 596336 594777 592267 588826 584507 579206 572675 565122 557479 550626 544674 539442 535161 532008 529258
59501 529258 525732 521066 515916 510960 506377 502346 499364 497741 497239 497442 498158 499282 500574 501814 503052
59486 503052 504472 506099 507809 509709 512371 516412 521601 526670 530483 533376 536812 541640 547239 552562
59472 552562 557329 561762 565786 569131 571835 574032 575522 576109 576106 575933 575499 574552 573454 572928 573187 573944 575243
59455E75243K319L524M376M929N509N988O036N839N849O014N802M865L290J292
59441F40875q83k785m004m609n079n678o060n618m223k594j723j870k285k194
59427E91270j719j452j399j006m8J208K697M644O861Q789J0362J2098J4008J5286
59413F61599J5509J5384J5836J7087J9123K1934K4329K3452J7104O587l880j0721
59401H23343j3212j2408r337m761M01N464J0228J3960J4582J0115J221q467j5129
59388H16000j7615j7351j6059j4292j2008r538p519o178n251m472l914l743l849
59375F94211l741k942j610o54q21j738k369k426k651l389l689k525l93J243J765
59360F68271J856K186K632K892L193L939N205O792Q439R816J0695J1243J1936
$$ plain form
59455 575243 577562 581086 585462 590391 595900 601888 607924 613763 619612 625626 631428 636293 639583 640875
59441 640875 639992 637207 633203 628594 623515 617837 611777 606159 601936 599342 597619 595749 593464 591270
59427 591270 589551 588099 586700 585694 585646 586854 589551 594195 601056 609845 620207 632305 646313 661599
59413 661599 677108 692492 708328 725415 744538 766472 790801 814253 831357 837944 834064 823343
59401 823343 810131 797723 788386 783625 784026 789490 799718 813678 828260 838375 839596 831129 816000
59388 816000 798385 781034 764975 750683 738675 729137 721618 715440 710189 705717 701803 698060 694211
59375 694211 690470 687528 685918 685264 684443 682705 680336 677910 675259 671870 668181 665656 665263 666506 668271
59360 668271 670127 672313 674945 677837 681030 684969 690174 696966 705405 715221 725916 737159 749095
59347G49095J2988J4180J5255J6141J6707J6733J6189J5288J4143J2652J0788
59336I10159Q665O306L644Q34j820m280o868r726j2478j4482j5398j5402j5013
59323H34141j4645j4264j3657j2997j2801j3135j3325j2838j1989j1357j0894
59312F92239j0218r440q982q785q363p619o847o017m742k976j194K48J393K348
59298F21045L223M446O517R365J2226J4116J4050J1230N753q99o814j1061j3680
59285F69517j4629j3756j1683r599p908n957l390q69R71K465M223O098P471Q211
59271F31165Q827R836J1220J2358J2416J1138R228P722O888O217N326M319L251
59258G39911J870J66j428k534l180l537l672l630l391k834k049j512j429j205
$$ plain form
59347 749095 762083 776263 791518 807659 824366 841099 857288 872576 886719 899371 910159
59336 910159 918824 925130 928774 929608 927788 923508 916640 906914 894436 879954 864556 849154 834141
59323 834141 819496 805232 791575 778578 765777 752642 739317 726479 714490 703133 692239
59312 692239 682021 672581 663599 654814 646451 638832 631985 625968 621226 618250 617056 617304 618697 621045
59298 621045 624268 628714 635231 644596 656822 670938 684988 696218 701971 701072 694258 683197 669517
59285 669517 654888 641132 629449 619850 611942 605985 602595 601726 602697 605162 609385 615483 622954 631165
59271 631165 639992 649828 661048 673406 685822 696960 706188 713910 720798 727015 732341 736660 739911
59258 739911 741781 741947 740519 737985 734805 731268 727596 723966 720575 717741 715692 714180 712751 711546
59244G11546j95J180J931J939K097K939M062M908N344N260M398K868J184l41j723
59229G47397k869l695m575n875p134p610p533p791q444q711q509q669r319r398
59215F47265q330o985o266n832m888l465k188j422j185j326j340p14K49P12O12
59200F04897P22J233J477J394J916L275M244M001L446L664M208M110L666L839
59186F46092M602N141N228N281N387N354N343N503N277M016K001R9j305k262k642
59171F93115k313j695j378j491j961k822l652l413j824k62k28j402k284k362k432
59156F63596l062l879m458m831n030m983n000n540o376o699o157n243m576m424
59142E93338m796n483n928n670m985m587m631m598m149l682l774m403m912m620
$$ plain form
59244 711546 711351 712531 714462 716401 718498 721437 725499 730407 735751 741011 745409 748277 749461 749120 747397
59229 747397 744528 740833 736258 730383 723249 715639 708106 700315 691871 683160 674651 665982 656663 647265
59215 647265 638935 631950 625684 619852 614964 611499 609311 607889 606704 605378 604038 603324 603573 604285 604897
59200 604897 605619 606852 608329 609723 611639 614914 619158 623159 626605 630269 634477 638587 642253 646092
59186 646092 650694 655835 661063 666344 671731 677085 682428 687931 693208 697224 699225 699324 698019 695757 693115
59171 693115 690802 689107 687729 686238 684277 681455 677803 674390 672566 672304 672076 670674 668390 666028 663596
59156 663596 660534 656655 652197 647366 642336 637353 632353 626813 620437 613738 607581 602338 597762 593338
59142 593338 588542 583059 577131 571461 566476 561889 557258 552660 548511 544829 541055 536652 531740 527120
59128E27120l473k019p15O25K299L872M541M388M437N238O213O770P216Q012Q920
59113E83444R633J0484J1730J2819J3141J2980J2873J2591J1632J0225Q977P897
59101G18426O675N513M771M105K906J297j16j264k464l505l827l495l100k758
59087G23164k040q59L08J063J276P71m58j842k764l406m390n694o658p026p144
59072F84301p244p145o790o340n807n149m772n183o117o634o239n368m696m394
59058F02423m189l732k845j728r79j028j661k282k576k585k350j879j322q47m09
59043E72011J07O75J210J664J886J771J647K003K705L121L207L711M935O146O721
59028F13520P074P759Q501Q924R447J0562J1818J2499J2714J2856J2578J1341
$$ plain form
59128 527120 523647 521628 520913 521538 523837 527709 532250 536638 541075 546313 552526 559296 566512 574524 583444
59113 583444 593077 603561 615291 628110 641251 654231 667104 679695 691327 701552 710529 718426
59101 718426 725101 730614 735385 739490 742396 743693 743577 742313 739849 736344 732517 729022 725922 723164
59087 723164 721124 720265 720573 721636 722912 723683 723225 721383 718619 715213 710823 705129 698471 691445 684301
59072 684301 677057 669912 663122 656782 650975 645826 641054 635871 629754 623120 616881 611513 606817 602423
59058 602423 598234 594502 591657 589929 588950 587922 586261 583979 581403 578818 576468 574589 573267 572420 572011
59043 572011 572118 572793 574003 575667 577553 579324 580971 582974 585679 588800 592007 595718 600653 606799 613520
59028 613520 620594 628353 636854 645778 655225 665787 677605 690104 702818 715674 728252 739593
59016G39593R544P960O425M241J571o81k239l531m524m589l717k804k474k346
59002G42429j723l95J419L340M953O023O682P075P016O281M978L257J069j389
58988G91015l392m436m917n525o312o842o831o212n046l747k929k526j752k75
58974G30273J377K929M851P142Q850R607J0416J1809J2644J1966J0848J0678J0803
58961H44193R714P748O577O514O324N362M000K189n00l435n382o385p562r002
58947H60355r638r254q875q892q523p439o359n702n151m763m976n258m376k472
58933G68677j182j258j580j155m77j51L25J430K474K668K345K265K409K327K010
58918G81127J800J864K241K929L750M583N678P156Q369Q726Q933J0257J2581J4351
$$ plain form
59016 739593 749137 757097 763522 767763 769334 768653 766414 762883 758359 753770 750053 747249 744775 742429
59002 742429 740706 740311 741730 745070 750023 756046 762728 769803 776819 783100 788078 791335 792404 791015
58988 791015 787623 783187 778270 772745 766433 759591 752760 746548 741502 737755 734826 732300 730548 730273
58974 730273 731650 734579 739430 746572 755422 765029 775445 787254 799898 811864 822712 833390 844193
58961 844193 853907 861655 868232 874746 881070 886432 890432 892621 892121 888686 883304 876919 869357 860355
58947 860355 850717 841463 832588 823696 815173 807734 801375 795673 790522 785759 780783 775525 771149 768677
58933 768677 767495 766237 764657 763502 763025 762874 763199 764629 767103 769771 772116 774381 776790 779117 781127
58918 781127 782927 784791 787032 789961 793711 798294 803972 811128 819497 828223 837156 847413 859994 874345
58904H74345J4563J3665J2477J1421J0918J1231J1691J1193R667P941O228M082
58892I99422J882P01N45L02j88L13K365M909P022Q983J0855J1627J0738R143P880
58877A076499O755N265L665K246O40j213k490k688k405k248j999j660k122l891
58863A074354o142p962r534j1246j2720j3684j4819j6587j8103j8290j7524j7030
58851I10713j7190j7409j7209j6576j5561j4296j3089j2076j1132j0429j0473
58840G55273j1229j1910j2003j1761j1384j0621r531q668q013o799m953l591l299
58827F41511l057j802j22O54M09J67N82J433K304K982L426L825M507N424O100
58812F68343O273O095N607M648L401K283J185l12j861k591k564k898m068n213
$$ plain form
58904 874345 888908 902573 915050 926471 937389 948620 960311 971504 981171 989112 995340 999422
58892 999422 1001304 1002005 1002550 1002852 1002664 1002977 1005342 1010251 1017273 1026256 1037111 1048738 1059476 1068619 1076499
58877 1076499 1083254 1088519 1092184 1094430 1095070 1093857 1091367 1088679 1086274 1084026 1082027 1080367 1078245 1074354
58863 1074354 1068212 1060250 1050716 1039470 1026750 1013066 998247 981660 963557 945267 927743 910713
58851 910713 893523 876114 858905 842329 826768 812472 799383 787307 776175 765746 755273
58840 755273 744044 732134 720131 708370 696986 686365 676834 668166 660153 653354 648401 644810 641511
58827 641511 638454 636652 636530 637184 637593 637760 638342 639775 642079 645061 648487 652312 656819 662243 668343
58812 668343 674616 680711 686318 690966 694367 696650 697835 697523 695662 693071 690507 687609 683541 678328
58798F78328n547n323m954m304l451l056l394l912m243m623m914m351k868j548
58784F21840j058p38K03J554K834M096N367O291O860P557Q279Q197P015N293L119
58769F86709j01m010o943p931p780p496p055o413o240o710o942o507o166o301
58755F00114o031m835l580k992k556j944j950k863l425k691j451o65R1J276K070
58740E68568J947K032L276M708N156N328O371P633P808P231P082P258O950O495
58726F47843O633O693N519L681K848L316L900L927L659L139K264J776K517L896
58712G01611M536M265M015M033L586K395R26p06k899n622q199j0101j1300j2000
58698F74540j2680j3908j5532j6618j6699j6278j5581j3970j1378r064p917p191
$$ plain form
58798 678328 672781 667458 662504 658200 654749 651693 648299 644387 640144 635521 630607 626256 623388 621840
58784 621840 620782 620044 620247 621801 624635 628731 634098 640389 647249 654806 663085 671282 678297 683590 686709
58769 686709 686608 682598 675655 667724 659944 652448 645393 638980 632740 626030 619088 612581 606415 600114
58755 600114 594083 589248 585668 582676 580120 578176 576226 573363 569938 567247 565796 565131 565222 566498 568568
58740 568568 570515 572547 575823 580531 585687 591015 597386 605019 612827 620058 627140 634398 641348 647843
58726 647843 654476 661169 666688 670369 673217 676533 680433 684360 688019 691158 693422 695198 697715 701611
58712 701611 706147 710412 714427 718460 722046 724441 725367 724661 721762 716140 707941 697840 686540 674540
58698 674540 661860 647952 632420 615802 599103 582825 567244 553274 541896 532832 524915 517724
58686E17724o063n168n251n552n067m330m318m573m072l092k567k368j787r95
58672D62521m64K88J791L271L746L830M738O300P544Q582J0105J1607J1793J0337
58658E45989P808M343j3m250p144q633r263r000p902o996o988o963n869m335l436
58643D77348k837j860j214j737k418j825n04J33L38J214K273K241J618J856K626
58628D77252K380J265R60J788K427K337K211K115J380L38K0K75K86N74K239M431
58612E02278N054M010L328L935M594M285L423K410J043k85p10l95k05k1P67J365
58596E34876M30j421k253j836j670j965j238P92K567L345M158N472O345O515P165
58581E61282Q709R975J0315J0546J1046J0902R773Q818Q833R051Q587P706P056
$$ plain form
58686 517724 511661 506493 501242 495690 490623 486293 481975 477402 473330 470238 467671 465303 463516 462521
58672 462521 462057 462345 464136 467407 471153 474983 479721 486021 493565 502147 512252 523859 535652 545989
58658 545989 553797 558140 558127 553877 546733 538100 528837 519837 511935 504939 497951 490988 485119 480784 477348
58643 477348 474511 472651 471437 469700 467282 465457 464953 465086 465424 466638 468911 471152 472770 474626 477252
58628 477252 479632 480897 481857 483645 486072 488409 490620 492735 494115 494453 494473 494748 495034 495608 497847 502278
58612 502278 507332 511342 514670 518605 523199 527484 530907 533317 534360 534075 533365 532970 532765 532744 533511 534876
58596 534876 535306 533885 531632 529796 528126 526161 524923 525715 528282 531627 535785 541257 547602 554117 561282
58581 561282 569991 579966 590281 600827 611873 622775 632548 641366 650199 659250 667837 675543 682599
58568F82599O984Q000J0541J3928J6909J9379K2168K5213K7528K8888K9818K9962
58556I21917K8295K4924K0823J5997R914L607r02l351n220o984p664p214o858
58543I87284o863o364n796p048j0614j4834j8396k1435k3767k4463k3773k3173
58531H00758k2920k1696j9128j6455j4286j2039j0008r409r874r359p300n360
58519F42924m430l451k009j406k142k836k721k764l296k987j419k29m02o83k7
58504F12122O13K95j32L00J042J317J372J344O44n64j009k95N10R34J856L500
58488F23849M721N034N365O189O982Q046J0469J3638J5354J5245J5508J7363J9325
58475G67088J9954J9676J8715J5965J1301O521K648j371n995r681j1383j1991
$$ plain form
58568 682599 689583 697583 708124 722052 738961 758340 780508 805721 833249 862137 891955 921917
58556 921917 950212 975136 995959 1011956 1021870 1025477 1024575 1021224 1016004 1009020 1001356 994142 987284
58543 987284 980421 974057 968261 961213 950599 935765 917369 895934 872167 847704 823931 800758
58531 800758 777838 756142 737014 720559 706273 694234 684226 674817 664943 655584 648284 642924
58519 642924 638494 635043 633034 631628 629486 626650 623929 621165 617869 614882 613463 613234 612832 612149 612122
58504 612122 612735 613030 612898 613198 614240 615557 616929 618273 618917 618353 617344 617049 617559 618493 620349 623849
58488 623849 628570 633604 638969 645158 652140 660186 670655 684293 699647 714892 730400 747763 767088
58475 767088 787042 806718 825433 841398 852699 859220 861868 860497 854502 844821 833438 821447
58463H21447j1969j0154o330k421M23L348O901R322R505R170J0002J0998J0549
58450H60791R117P748N986L073m48m002q036j2368j5427j6488j6754j6955j6060
58437G80177j3604j0981r027o673l471r67m0P43K494M167M933N911P825R372R685
58422G80544R990J1066J1407R757P117M578J554k134m891n879o502p724q436q033
58408G92414p883q468p999n776l989m085m274k845j092n61j59J518L579M894O215
58393G61489P922Q347O727N242N705O799O848O570O771O224M345L198M201N523
58379H45911N282M546M688M677L602K952L684L993K708J865L053M321L652K446
58365H97380K592L164L134M057O870R127Q855Q055Q989J0119R268P604O902N937
$$ plain form
58463 821447 809478 799324 792994 790573 790996 794344 801245 810567 820072 829242 839244 850242 860791
58450 860791 869908 877656 883642 886715 886267 882265 874229 861861 846434 829946 813192 796237 780177
58437 780177 766573 755592 746565 739892 736421 735454 735414 736157 738651 742818 747751 753662 761487 770859 780544
58422 780544 790534 801600 813007 822764 829881 834459 836013 833879 828988 823109 816607 808883 800447 792414
58408 792414 784531 776063 768064 762288 758299 754214 749940 747095 746003 745442 745283 746801 750380 755274 761489
58393 761489 769411 777758 784485 789727 795432 802231 809079 815649 822420 828644 832989 836187 840388 845911
58379 845911 851193 855739 860427 865104 868706 871658 875342 879335 882043 883908 886961 891282 894934 897380
58365 897380 899972 903136 906270 910327 917197 926324 935179 943234 952223 962342 971610 979214 986116 992053
58351I92053L341R74O76P53n61j369K68K252K148J748L639O357P347P770R835
58336A037231J2262J2941J3249J5171J6997J6446J5243J5889J6768J5283J2993
58325A200473J2604J2649J0272O760N178M989M034L313M705O442N954M852O026
58312A288251Q306R047R339J1507J4067J4470J4235J5975J8042J7577J6156J6867
58300A453839J8475J8089J6905J7565J8654J7577J6047J6960J8712J8506J8126
58289A649455K0377K3112K3146K2665K5178K8549K9027K8650L1407L5416L6471
58278A953453L6080L8257M1487M1829M0843M2378M4571M3303M0570M1011M3250
58267B407032M3168M2601M5842N0731N2378N2696N6702O2438O4367O3781O5873
$$ plain form
58351 992053 995394 996368 997044 997797 997236 995867 996135 998387 1000535 1002283 1005922 1012279 1019626 1027396 1037231
58336 1037231 1049493 1062434 1075683 1090854 1107851 1124297 1139540 1155429 1172197 1187480 1200473
58325 1200473 1213077 1225726 1235998 1242758 1247936 1252925 1256959 1260272 1264977 1271419 1277373 1282225 1288251
58312 1288251 1296557 1305604 1314943 1326450 1340517 1354987 1369222 1385197 1403239 1420816 1436972 1453839
58300 1453839 1472314 1490403 1507308 1524873 1543527 1561104 1577151 1594111 1612823 1631329 1649455
58289 1649455 1669832 1692944 1716090 1738755 1763933 1792482 1821509 1850159 1881566 1916982 1953453
58278 1953453 1989533 2027790 2069277 2111106 2151949 2194327 2238898 2282201 2322771 2363782 2407032
58267 2407032 2450200 2492801 2538643 2589374 2641752 2694448 2751150 2813588 2877955 2941736 3007609
58256C007609O9356O9341O7671O9844P4377P5909P6127Q0546Q7288R0390R1541
58245C859999R6925J05162J10266J13734J21451J31446J37376J41269J49849J61308
58235E128785J69159J75812J88096K02891K12289K19597K34327K54554K70877
58226G056387K84755L05523L32154L56068L79255M10862M48562M82751N16431
58217A0572748N60585O13022O63400P16014P84686Q68332R56031J052940J175107
58208A7962865J322163J483486J668616J901934K190861K531909K945028L466611
58200C5473473M110376M869965N753609O775416P922622R184829J0614717J2311851
58192I7016858J4358966J6832851J9848218K3484884K7647341L2020182L6006850
$$ plain form
58256 3007609 3076965 3146306 3213977 3283821 3358198 3434107 3510234 3590780 3678068 3768458 3859999
58245 3859999 3956924 4062086 4172352 4286086 4407537 4538983 4676359 4817628 4967477 5128785
58235 5128785 5297944 5473756 5661852 5864743 6077032 6296629 6530956 6785510 7056387
58226 7056387 7341142 7646665 7978819 8334887 8714142 9125004 9573566 10056317 10572748
58217 10572748 11133333 11746355 12409755 13125769 13910455 14778787 15734818 16787758 17962865
58208 17962865 19285028 20768514 22437130 24339064 26529925 29061834 32006862 35473473
58200 35473473 39583849 44453814 50207423 56982839 64905461 74090290 84705007 97016858
58192 97016858 111375824 128208675 148056893 171541777 199189118 231209300 267216150
58185B67216150L8436778L7395991L0955659J8742730K946272j2531938k4240820
58178C58920822l0778990l2750786l1719442k9292928k6673719k4438389k2534722
58171A60731846k0619991j8500504j6261482j4079219j2058718j0250611q693381
58164F0267940p384826o276208n329151m538842l891878l349110k883934k497071
58156B4116920k181820j911370j670935j469097j307247j167626j040080r32604
58148A2436141q47121p70437o96590o34274n85195n37473m86696m42392m07874
58139G028089l73796l37011l06368k84565k62851k38849k21730k14413k07532
58130D580974j96169j86388j80469j71529j57741j46830j41389j34057j21987
$$ plain form
58185 267216150 305652928 343048919 374004578 392747308 395693580 383161642 358920822
58178 358920822 328141832 295391046 263671604 234378676 207704957 183266568 160731846
58171 160731846 140111855 121611351 105349869 91270650 79211932 68961321 60267940
58164 60267940 52883114 46606906 41277755 36738913 32847035 29497925 26613991 24116920
58156 24116920 21935100 20023730 18352795 16883698 15576451 14408825 13368745 12436141
58148 12436141 11589020 10818583 10121993 9487719 8902524 8365051 7878355 7435963 7028089
58139 7028089 6654293 6317282 6010914 5726349 5463498 5224649 5002919 4788506 4580974
58130 4580974 4384805 4198417 4017948 3846419 3688678 3541848 3400459 3266402 3144415
58121C144415j12246j08139j03527r5425q9328q7417q3861p6417p0817o9280o6244
58110B181714n9716n5526n6013n5444n0959m7491m7614m6854m3215m1310m2942
58099A634630m3256m0278l8684m0317m0351l6709l3950l3925l1939k6156k1680
58088A247385k1115k0017j5934j3240j4466j5361j3204j1920j4295j6810j6813
58077A074210j7325k0188k1728j9840j8346j9782k0668j8451j6483j7480j8420
58066H65499j6491j4138j3788j3311j0964r195r518r131o521m899o327p968p796
58053G35452q326j0947j2374j0741r458j0882j1758r348o596o654p381o027m502
58040F20458n256o339n267l758m161n109m777m660o009o551m739l449n208p604
$$ plain form
58121 3144415 3032169 2924030 2820503 2725078 2635750 2548333 2464472 2388055 2317238 2247958 2181714
58110 2181714 2121998 2066472 2010459 1955015 1904056 1856565 1808951 1762097 1718882 1677572 1634630
58099 1634630 1591374 1551096 1512412 1472095 1431744 1395035 1361085 1327160 1295221 1269065 1247385
58088 1247385 1226270 1206253 1190319 1177079 1162613 1147252 1134048 1122128 1107833 1091023 1074210
58077 1074210 1056885 1036697 1014969 995129 976783 957001 936333 917882 901399 883919 865499
58066 865499 849008 834870 821082 807771 796807 787612 778094 768963 762442 757543 751216 743248 735452
58053 735452 727126 716179 703805 693064 683606 672724 660966 651618 645022 638368 630987 624960 620458
58040 620458 615202 608863 603596 599838 595677 590568 585791 581131 575122 568571 563832 560383 555175 547571
58026E47571p604o744p760r389q931p045n867n039l399k055k280k829k533k809
58012D73287m584n706m492k896l021l537k632j489j605j634j94J102O58L9R45
57997D44241J890J122m9p6m37k683m923m727l074k080j355Q5Q26n62k412k567
57981D23219j984k568l606l522l033l383l592k516j518k008k469j142M87J97r79
57966C91583o71P35J233Q06O75M23r68k528k734k272k596l075k322r62m58m66
57950C76403N5M80k57j363j590j512k143k730k233j436j300q34R93K880L216K847
57934C71476L417M575N214N811P014P556O211M330L798L961L025J098o93k545
57920D24248m891o528o392n831o535p660p520o638o486o548n466l782k914k538
$$ plain form
58026 547571 539967 533223 525463 516074 507143 500098 494231 489192 485793 483738 481458 478629 476096 473287
58012 473287 468703 462997 458505 455609 452588 449051 446419 444930 443325 441691 441497 442599 443257 443296 444241
57997 444241 446131 447253 447204 447128 446691 444008 439085 434358 431284 429204 427849 427934 428760 428198 425786 423219
57981 423219 421235 418667 415061 411539 408506 405123 401531 399015 397497 395489 393020 391878 392365 392562 391583
57966 391583 390912 391647 392880 393686 394361 394784 393816 391288 388554 386282 383686 380611 378289 377327 376869 376403
57950 376403 376458 376938 376681 375318 373728 372216 370073 367343 365110 363674 362374 361540 362533 365413 368629 371476
57934 371476 374893 379468 384682 390493 397507 405063 411274 415604 419402 423363 426388 427486 426793 424248
57920 424248 419357 412829 406437 400606 394071 386411 378891 372253 365767 359219 353753 349971 347057 344519
57906C44519j615q17j318k422k870l276m662n843m970k633q40M6Q28J106J43r61
57890C14415n94P45J580K212L773N597O116N555N194M857L605K055J499J563J116
57875C59288N02O06P29j15r31l18P91O55j22K35J390J702J380J840K635K131P12
57858C73110L04J027J249P11P81J643K011J607J507J933K077J988K484L310L453
57843C99195K986K630K018N26q62q27k41r60k649l377k846k477k606k196j133
57828C87181l59J33J085K058K036J589K074L042K888J719J044J004M20o56j107
57813D04151j145j887k801k317r63r92k844m672n535o335p343p491o585n702n001
57798C42538l539j596p06j017j053m31l78j155j485j058j116j968k277j466o47
$$ plain form
57906 344519 342904 342087 340769 338347 335477 332201 327539 321696 316726 314093 313253 313299 314127 315233 315376 314415
57890 314415 313821 314566 316146 318358 322131 327728 333844 339399 344593 349450 353055 355110 356609 358172 359288
57875 359288 359790 360396 361125 361010 360079 359761 360552 361207 361085 361320 362710 364412 365792 367632 370267 372398 373110
57858 373110 373414 374441 375690 376401 377182 378825 380836 382443 383950 385883 387960 389948 392432 395742 399195
57843 399195 402181 404811 406829 407355 406493 405666 405425 404465 401816 398439 395593 393116 390510 388314 387181
57828 387181 386822 386955 388040 390098 392134 393723 395797 398839 401727 403446 404490 405494 405914 405258 404151
57813 404151 403006 401119 398318 396001 395038 394046 391202 386530 380995 374660 367317 359826 353241 347539 342538
57798 342538 338999 337403 336697 335680 334627 334196 333818 332663 331178 330120 329004 327036 324759 323293 322646
57783C22646m66j58O94J433J827K325K584J886J108J855L502L734K322J509K040
57768C48841J852k23k373k867k625l135l996m225m107m146l806k760j865j648
57754C12917j256n5J106J428J498K026K590K679K745L186L549L607L987M931N622
57739C50560N539N196M914M197K969K029J603R00k75r59p99p99j524k147k099
57724C69305k110k607k669j676n64l15m55k12J12O6J85R93J772J610Q82O54J184
57707C66155J851J999J293j71j512j607m33Q29J400J748K521L586M592N489O062
57692C93802N807M651L052J210r47k967m128m626n336o332o803o491n962n362
57678C59568m242k716j418j76J806M295O121P133Q503J0889J3894J7520K2408
$$ plain form
57783 322646 322180 322022 322716 324149 325976 328301 330885 332771 333879 335734 339236 342970 345292 346801 348841
57768 348841 350693 350470 348097 345230 342605 339470 335474 331249 327142 322996 319190 316430 314565 312917
57754 312917 311661 311606 312712 314140 315638 317664 320254 322933 325678 328864 332413 336020 340007 344938 350560
57739 350560 356099 361295 366209 370406 373375 375404 377007 377907 377632 376673 375874 375075 373551 371404 369305
57724 369305 367195 364588 361919 360243 359679 359364 358909 358697 358809 358875 359060 360053 361825 363435 364317 364971 366155
57707 366155 368006 370005 371298 371127 369615 368008 367575 368404 369804 371552 374073 377659 382251 387740 393802
57692 393802 399609 404260 407312 408522 407575 404608 400480 395854 390518 384186 377383 370892 364930 359568
57678 359568 355326 352610 351192 351016 352822 357117 363238 370371 378874 389763 403657 421177 443585
57665D43585K8270L3786L8262M1506M1679L5583K2192M341j3746k9106l9827m4587
57653E61938m3786l9767l4710k9367k4166j9891j6511j3077r622p533p246p244
57641C09018o242m722l435k089n20M77N38M03L42m23j833k359j312k3M53Q34J659
57624B90766J782M14j169j670j840k742l527k915j589j101j435j481j143j142
57610B71208j459j510j238p87R6J228J520N75l47j64L70J97j44K35O59Lj263j894
57592B67285j967k409l156l444l359l490l558k916j927j455j440j278j055j162
57578B34669j268r86q72j467k102k002j765k292k987k652j590j158j625k010j813
57563B08080j481j367j459j824k223j778k17J112Q38l43o33K72J046R48O36P79
$$ plain form
57665 443585 471855 505641 543903 585409 627088 662671 684863 689204 675458 646352 606525 561938
57653 561938 518152 478385 443675 414308 390142 370251 353740 340663 331041 323508 316262 309018
57641 309018 302776 298054 294619 292530 292010 292487 293025 293428 293770 293347 291514 289155 287843 287820 288273 289107 290766
57624 290766 292548 292962 291793 290123 288283 285541 282014 279099 277510 276409 274974 273493 272350 271208
57610 271208 269749 268239 267001 266214 266310 267538 269058 269633 269286 269122 269492 269689 269545 269780 270439 270442 269179 267285
57592 267285 265318 262909 259753 256309 252950 249460 245902 242986 241059 239604 238164 236886 235831 234669
57578 234669 233401 232415 231543 230076 227974 225972 224207 221915 218928 216276 214686 213528 211903 209893 208080
57563 208080 206599 205232 203773 201949 199726 197948 197731 198843 199681 199338 198705 198977 200023 200971 201607 202386
57547B02386J180J443J538J576J706K145K661K506J469L87m2k12n60n16L78J276
57531B19321J141L37j89n34j305k135k164j490p43J85J594K690K451J427J118
57516B21704J805K385K244J947K099K668L325L559K751J080j13P0Q01Q53N09P14
57500B48401J129O89l55o97r6L84J91j61m09r32j695k057j805j375j073r46j200
57483B37993j778j870r54O9k6r65j489j292j076r79m63L32N52k9p89j329j684
57466B24223j626r56k49j87m45l00L4m5k26R1M06q2o89j36J127J432O84N80J809
57447B25445K974K872K089J618J361Q81M33M32P26R63J123J326J677K278K806
57432B49004K421R55l07j42P37P27j66m59L27J088J079Q40Q69R28R44J215J460
$$ plain form
57547 202386 203566 205009 206547 208123 209829 211974 214635 217141 218610 218997 218955 218743 218183 217667 218045 219321
57531 219321 220462 220799 220610 220076 218771 216636 214472 212982 212239 212424 214018 216708 219159 220586 221704
57516 221704 223509 225894 228138 230085 232184 234852 238177 241736 244487 245567 245454 245524 246325 247178 247687 248401
57500 248401 249530 250219 249864 249167 249071 249455 249646 249485 249076 248144 246449 244392 242587 241212 240139 239193 237993
57483 237993 236215 234345 233391 233460 233434 232469 230980 229688 228612 227633 227170 227502 228054 228025 227236 225907 224223
57466 224223 222597 221641 221392 221205 220760 220460 220494 220449 220223 220314 220720 220638 219949 219813 220940 222372 223056 223636 225445
57447 225445 228419 231291 233380 234998 236359 237240 237673 238105 238831 239794 240917 242243 243920 246198 249004
57432 249004 251425 252380 252073 251931 252668 253395 253229 252770 253097 254185 255264 256104 256973 257901 258845 260060 261520
57415B61520J042L50N18J555K201J961J713K005K354K647L563M919N189L647J624
57400B96808O77O29L59m07j041j041l52Q08J924K526K793L203L589L450L120L449
57384C20494M269M467L889L745M631N493N219M070K869J903J340J613K614L358
57370C69974L235K827K864L140L133K913K829K900L113L703M723N779O563P105
57356D24801P314O965O273N782N616N481N419N712O037N844N480N831O722O920
57342E10197N985M867M346M077L633L310L372L463L307L131L109L149L360L844
57328E63150M063L564L149L909N179N191L884L182M010M998M924M498M701N106
57314F23508N096N241O142P152P572P889Q560Q720P554O036N807O970Q263Q884
$$ plain form
57415 261520 262562 262912 263430 264985 267186 269147 270860 272865 275219 277866 281429 286348 291537 295184 296808
57400 296808 297485 298114 298473 298066 297025 295984 295632 296440 298364 300890 303683 306886 310475 313925 317045 320494
57384 320494 324763 329230 333119 336864 341495 346988 352207 356277 359146 361049 362389 364002 366616 369974
57370 369974 373209 376036 378900 382040 385173 388086 390915 393815 396928 400631 405354 411133 417696 424801
57356 424801 432115 439080 445353 451135 456751 462232 467651 473363 479400 485244 490724 496555 503277 510197
57342 510197 516182 521049 525395 529472 533105 536415 539787 543250 546557 549688 552797 555946 559306 563150
57328 563150 567213 570777 573926 577835 583014 588205 592089 595271 599281 604279 609203 613701 618402 623508
57314 623508 628604 633845 639987 647139 654711 662600 671160 679880 687434 693470 699277 706247 714510 723394
57300G23394R016R066R339J0030J0748J0644R737R311J0189J1472J1938J1799
57288H46683J1995J2500J2585J2229J2103J2403J2775J3072J3468J3952J4395
57277I88160J4869J5418J5873J6268J6871J7534J7693J7360J7261J7637J7856
57266A172800J7682J7830J8632J9297J9269J9145J9403J9375J8572J7910J8317
57255A378232J9121J9157J8744J9059K0166K1102K1558K2131K3051K3833K4202
57244A610356K4391K4594K4846K5304K5949K6382K6442K6623K7235K7681K7292
57233A897095K6342K5510K4858K4159K3674K3734K4060K4294K4734K5730K6848
57222B171038K7498K7954K8830L0009L0941L1662L2572L3537L3977L3710L3018
$$ plain form
57300 723394 732410 741476 750815 760845 771593 782237 791974 801285 811474 822946 834884 846683
57288 846683 858678 871178 883763 895992 908095 920498 933273 946345 959813 973765 988160
57277 988160 1003029 1018447 1034320 1050588 1067459 1084993 1102686 1120046 1137307 1154944 1172800
57266 1172800 1190482 1208312 1226944 1246241 1265510 1284655 1304058 1323433 1342005 1359915 1378232
57255 1378232 1397353 1416510 1435254 1454313 1474479 1495581 1517139 1539270 1562321 1586154 1610356
57244 1610356 1634747 1659341 1684187 1709491 1735440 1761822 1788264 1814887 1842122 1869803 1897095
57233 1897095 1923437 1948947 1973805 1997964 2021638 2045372 2069432 2093726 2118460 2144190 2171038
57222 2171038 2198536 2226490 2255320 2285329 2316270 2347932 2380504 2414041 2448018 2481728 2514746
57211B514746L2168L1436L1138L1073L0388K8679K6699K5405K4907K4968K5751
57200B827358K7242K8571K8953K8868K9410L0783L2271L3381L4262L5282L6745
57189C173126L8706M0610M1614M1779M2210M3537M5065M5968M6480M6979M6923
57178C652997M5666M3658M1803M0258L8739L7391L6362L5258L3937L3129L3259
57167D072457L3407L2548L1120L0217K9909K9603K9339K9408K9248K8164K6738
57156D402158K6106K6084K5345K3370K0963J8961J7450J6252J5123J3559J1314
57145D616685Q992P455O863P052Q372J1237J5237J9629K4335K9468L4379L8217
57133D827921M1127M3798M6012M6626M4894M1120L6214L1275K7252K4420K2558
$$ plain form
57211 2514746 2546914 2578350 2609488 2640561 2670949 2699628 2726327 2751732 2776639 2801607 2827358
57200 2827358 2854600 2883171 2912124 2940992 2970402 3001185 3033456 3066837 3101099 3136381 3173126
57189 3173126 3211832 3252442 3294056 3335835 3378045 3421582 3466647 3512615 3559095 3606074 3652997
57178 3652997 3698663 3742321 3784124 3824382 3863121 3900512 3936874 3972132 4006069 4039198 4072457
57167 4072457 4105864 4138412 4169532 4199749 4229658 4259261 4288600 4318008 4347256 4375420 4402158
57156 4402158 4428264 4454348 4479693 4503063 4524026 4542987 4560437 4576689 4591812 4605371 4616685
57145 4616685 4625677 4633132 4639995 4647047 4655419 4666656 4681893 4701522 4725857 4755325 4789704 4827921
57133 4827921 4869048 4912846 4958858 5005484 5050378 5091498 5127712 5158987 5186239 5210659 5233217
57122E233217K2083K4249K9635L7305M6197N6390O8037Q0089R1273J01567J11815
57111E901857J22863J36158J54159J78726K09816K46854K90422L41770M02214
57102G984839M74635N64526O77990Q19850R94909J209378J468891J776209K132097
57093A8103324K536523K986802L476207L996080M536474N081443N605144O073183
57085E2395180O440898O644460O603267O252421N586279M668004L591169K432043
57077I4613721J236220L8099j120357k191001l132250l918761m543490n012996
57069G5969185n338073n525885n580156n507621n322589n045965m701954m315390
57061C4631552l909370l503072l111088k743928k408106k106197j838222j603363
$$ plain form
57122 5233217 5255300 5279549 5309184 5346489 5392686 5449076 5517113 5597202 5688475 5790042 5901857
57111 5901857 6024720 6160878 6315037 6493763 6703579 6950433 7240855 7582625 7984839
57102 7984839 8459474 9024000 9701990 10521840 11516749 12726127 14195018 15971227 18103324
57093 18103324 20639847 23626649 27102856 31098936 35635410 40716853 46321997 52395180
57085 52395180 58836078 65480538 72083805 78336226 83922505 88590509 92181678 94613721
57077 94613721 95849941 95888040 94767683 92576682 89444432 85525671 80982181 75969185
57069 75969185 70631112 65105227 59525071 54017450 48694861 43648896 38946942 34631552
57061 34631552 30722182 27219110 24108022 21364094 18955988 16849791 15011569 13408206
57053A3408206j400085j225355j075034r45268q33039p35703o50849n76570n11325
57044E454978m53617m02208l56498l16323k81425k51244k24929k01491j80237
57035B787006j61031j43790j28029j13400j00201q8450p6904o4272n1036l8578
57025A821315k6768j4049K80J5719L1963M7372N5252M5594J4076l1489p5897j07347
57013A776021j22784j25131j18912j08520r7501q7484p8260o9403o1253n4347
57003H52426m8668m3853l9637l5982l3011l0706k8568k5910k2720j9773j7625
56992E05973j5930j4025j1602q516m652l81L553O984J0602J4741J8521K0534J9718
56979E45520J5401P589k097j0708j6077j8306j8729j8223j7047j5432j3471j0972
$$ plain form
57053 13408206 12008121 10782766 9707732 8762464 7929425 7193722 6542873 5966303 5454978
57044 5454978 5001361 4599153 4242655 3926332 3644907 3393663 3168734 2967243 2787006
57035 2787006 2625975 2482185 2354156 2240756 2140555 2052105 1975201 1910929 1859893 1821315
57025 1821315 1794547 1780498 1780778 1796497 1828460 1875832 1931084 1976678 1990754 1959265 1883368 1776021
57013 1776021 1653237 1528106 1409194 1300674 1203173 1115689 1037429 968026 906773 852426
57003 852426 803758 759905 720268 684286 651275 620569 592001 566091 543371 523598 505973
56992 505973 490043 476018 464416 455900 451248 450867 454420 461404 472006 486747 505268 525802 545520
56979 545520 560921 568510 566413 555705 539628 521322 502593 484370 467323 451891 438420 427448
56967D27448q063n405l262j082J522M095O313Q814J2353J6751K1273K5245K7593
56954E33595K6516K0691J0619j584j3298k2187k6960k8132k7368k5608k2512j8114
56942D05658j3694j0365p762n059k223N77L879Q076J2534J6661K1101K6682L2576
56929D88641L6435L5918K9529J7082O82j5392k7214l3674l5980l5594l3559l0986
56917C95888k8615k6113k2849j9240j6397j4703j3593j2441j0907q842o635n228
56905B10325m974m939m089k699j676j108m30M20J052J472K016K695L370M187N174
56890B10796N928O454P681J0255J3400J5828J7094J7097J5079J0507M404j380
56878C33143n950r360j1322j1274r538p217m973k793o90J282L409N844Q128J0051
$$ plain form
56967 427448 419385 413980 410718 409636 411158 415253 421566 430380 442733 459484 480757 506002 533595
56954 533595 560111 580802 591421 589837 576539 554352 527392 499260 471892 446284 423772 405658
56942 405658 391964 381599 373837 368778 366555 367132 371011 379087 391621 408282 429383 456065 488641
56929 488641 525076 560994 590523 607605 608287 592895 565681 532007 496027 460433 426874 395888
56917 395888 367273 341160 318311 299071 282674 267971 254378 241937 231030 222188 215553 210325
56905 210325 205351 200412 196323 193624 191948 190840 190410 190830 191882 193354 195370 198065 201435 205622 210796
56890 210796 216724 223178 230859 241114 254514 270342 287436 304533 319612 330119 334523 333143
56878 333143 327193 317833 306511 295237 285699 278482 273509 270716 270026 271308 274717 280561 288689 298740
56864B98740J2506J6425K1424K6558L1851L7613M2548M3920L9669K9566J4894
56853F15714j669j6290k5879l0155l0920k9557k6309k1651j6642j1759o690j455
56841C96738L442Q178J3649K0120K6882L3533M0577M8478N6806O4248O8327O5311
56829H46289N2070K8992O81k6499m7310n9072o2115n9387n4396m8749m2025l3918
56817D94561k5467j7978j1834o697k079K655Q080J4214K0752K7828L5706M3433
56805E83174M8390M7448L8455K1352r72k3085l9766m9103n2524n2135m9018m3909
56793D28307l7826l1450k4788j8075j2149p540l868m62L030O886J1267J5791J9838
56780C48961K3397K6590K8111K5378J7077M865p925j8656k6075k9701k9706k7247
$$ plain form
56864 298740 311246 327671 349095 375653 407504 445117 487665 531585 571254 600820 615714
56853 615714 614045 597755 571876 541721 510801 481244 454935 433284 416642 404883 398193 396738
56841 396738 400180 408358 422007 442127 469009 502542 543119 591597 648403 712651 780978 846289
56829 846289 898359 927351 928032 901533 854223 795151 733036 673649 619253 570504 528479 494561
56817 494561 469094 451116 439282 432585 430506 433161 441241 455455 476207 504035 539741 583174
56805 583174 631564 679012 717467 738819 737847 714762 674996 625893 573369 521234 472216 428307
56793 428307 390481 359031 334243 316168 304019 296479 292611 292149 295179 302065 313332 329123 348961
56780 348961 372358 398948 427059 452437 469514 474379 466454 447798 421723 392022 362316 335069
56768C35069k4041k1314j9300j7601j5851j4026j2270j0523q695p179o633o872
56756A70764o670n305l742l389m166m851m915m778m432l238j295K68P84P99R06
56741A26740Q31K10n59q34n30J4M91O32L07j60k30M4O0m02q16o90p6P48J556K046
56721A29382K015J786J781J708R24k85o66L92J964K733K429J742J264J027P76
56706A48972L88N1J45P43J375J543J273Q92M75K5j24K74P96Q02L59P9K26N23P21
56687A59538Q00P66Q47J431K265K263R32n00n28N11J031N99L20P61J008K24j020
56670A71248j645j445r95p44o68n72l96l33n67p84m27L34O11K32K59J244J971
56653A67323J250l9k32N08O96J47R7P48Q14k09j168j157p22n26k94K44O50O22
$$ plain form
56768 335069 311028 289714 270414 252813 236962 222936 210666 200143 191448 184269 177636 170764
56756 170764 164094 158789 155047 151658 147492 142641 137726 132948 128516 125278 123983 124251 125035 125834 126740
56741 126740 127571 127781 127222 126388 125858 125872 126363 126995 127302 127142 126912 126956 127016 126614 125798 125108 125032 125780 127336 129382
56721 129382 131397 133183 134964 136672 137596 137311 136645 137037 139001 141734 144163 145905 147169 148196 148972
56706 148972 149360 149411 149556 150299 151674 153217 154490 155382 155857 155882 155758 156032 156828 157630 157989 158068 158294 158817 159538
56687 159538 160338 161104 161951 163382 165647 167910 168842 168342 167814 168325 169356 169955 170275 171036 172044 172268 171248
56670 171248 169603 168158 167163 166419 165751 165179 164783 164450 163883 163099 162672 163006 163617 163849 164108 165352 167323
56653 167323 168573 168534 168302 168810 169506 169653 169750 170498 171312 171103 169935 168778 168056 167530 167236 167480 168130 168752
56635A68752N21N18K78j60k13J80L61O9k61m81q97j325j191p40q80j571j760j194
56617A60006q81j334j732j332m95J52M82L95k57r34p57J99J119J846K726L126
56601A62329J966j13j108o04k84r27j099J92J653J821J259J125J171O25k16o62
56585A67128q19r15n57K69O72L54L54J188J673Q91l6L34J516K111K043K117K254
56568A80577J817J126J105J824K621L219L738M117M548N797Q127J0609J2350J3558
56554B55133J4416J3897J1059O707K593m45k452l349l198k862l067l357l041k566
56540B79468k812l538l722l088k223j642j601k327l488m017l338k340k181k794
56526B40357l369l592l508k828j521n00o08j345j518p67K82R33P17n21k126k831
$$ plain form
56635 168752 169273 169791 170069 169909 169696 169876 170237 170306 170045 169564 168667 167342 166151 165411 164531 162960 161200 160006
56617 160006 159125 157791 156059 154727 154232 154384 154866 155261 155004 154070 153313 153512 154631 156477 159203 162329
56601 162329 164295 164182 163074 162470 162186 161259 160160 160352 162005 163826 165085 166210 167381 168006 167790 167128
56585 167128 166309 165394 164837 165106 165778 166132 166486 167674 169347 170238 170202 170536 172052 174163 176206 178323 180577
56568 180577 182394 183520 184625 186449 189070 192289 196027 200144 204692 210489 218616 229225 241575 255133
56554 255133 269549 283446 294505 301212 303805 303360 300908 297559 294361 291499 288432 285075 282034 279468
56540 279468 276656 273118 269396 266308 264085 262443 260842 258515 255027 251010 247672 245332 243151 240357
56526 240357 236988 233396 229888 227060 225539 225039 224431 223086 221568 220801 221083 222016 222733 222212 220086 217255
56510B17255k177j141p53r18j139j411j679j422o26k08o22j044q31o29j057j426
56494B00172r01P1O08P53Q31N38k19n65O7Q09P11J93P0J62P9K45Q84J099L13m96
56474B05424l61K2l18p50k22P29R41O75R34J547J612J206R80P61R9m90l34L7j63
56455B12329n17l69k70p65q64M55K068K161J050N05Q88J092Q71J080J765J990
56439B23469J504R21L97l49j007j105r96j142j035k99R1o82j536j127k37l99j114
56422B15354p76M11R13O55Q42J419J256N53N44J004O26k62pJ300J741Q50K51O26
56404B27300O07n22j488j245n13j34K30Q97J378J508J829K203J607p5j484j595
56388B30503p68L14J392K047J800J143J103J677J937J678J496J240J58j427k199
$$ plain form
56510 217255 215078 213937 213184 212266 211127 209716 208037 206615 205989 205781 205159 204115 203284 202655 201598 200172
56494 200172 199271 199342 199950 200703 201534 202072 201853 201288 201355 202164 202875 203068 203138 203300 203379 203624 204508 205607 205920 205424
56474 205424 205063 205085 204767 204017 203795 204524 205465 206140 207074 208621 210233 211439 212419 213180 213279 212789 212455 212492 212329
56455 212329 211812 211443 211173 210408 209544 209999 212067 214228 215278 215783 216671 217763 218634 219714 221479 223469
56439 223469 224973 225894 226291 225942 224935 223830 222834 221692 220657 220358 220449 219767 218231 217104 216867 216468 215354
56422 215354 214578 214989 215902 216557 217399 218818 220074 220627 221171 222175 222801 222539 222532 223832 225573 226423 226674 227300
56404 227300 227907 227385 225897 224652 224139 224005 224235 225132 226510 228018 229847 232050 233657 233582 232098 230503
56388 230503 229735 230049 231441 233488 235288 236431 237534 239211 241148 242826 244322 245562 245720 244293 242094
56373B42094j762r62k14P82J699J661Q48L90N94P58P04Q45Q80K17m45J44J609
56356B49842K376K168K029K048J300J24M9J177J836J245M40K32K36K66P02J159
56340B67229P95J32N22J718K133J675J935L273M158L877L557L901M212M193M488
56325C07798M885M291K943K386K752K515J414J036J816K077R51k52m91l87l15
56310C33419M16J582J754R52R93K260K840J999J711L218M862N063M928N958P372
56295C79327P701P097O281M996L246K320K890L761L975M378N652O638O305N684
56281D50251O101P048P432P515Q030Q634Q731Q640Q789Q882Q883R481J0817J2136
56267E71370J3360J5241J7429J8383J8106J8793K1683K5363K8262L0769L3708
$$ plain form
56373 242094 240332 239370 239156 239938 241637 243298 244146 244536 245130 245888 246592 247437 248317 248534 248089 248233 249842
56356 249842 252218 254386 256415 258463 259763 259887 259936 261113 262949 264194 264634 264866 265102 265368 266070 267229
56340 267229 268024 268156 268678 270396 272529 274204 276139 279412 283570 287447 291004 294905 299117 303310 307798
56325 307798 312683 316974 319917 322303 325055 327570 328984 330020 331836 333913 334864 334612 334121 333734 333419
56310 333419 333835 335417 337171 338123 339116 341376 344216 346215 347926 351144 356006 361069 365997 371955 379327
56295 379327 387028 394125 400406 405402 408648 410968 413858 417619 421594 425972 431624 438262 444567 450251
56281 450251 456352 463400 470832 478347 486377 495011 503742 512382 521171 530053 538936 548417 559234 571370
56267 571370 584730 599971 617400 635783 653889 672682 694365 719728 747990 778759 812467
56256H12467L6859M0281M5099N1567N8356O4829P2109Q0797Q9787R8420J07611
56245A558182J17563J26705J34113J40706J46820J50986J52441J52198J50227
56236B829941J44181J32627J17054R9041P8122N4131K8971M070k1263m6962p0402
56225C349511q9657j05893j20183j30692j35643j36675j36376j34693j30546j24955
56215B104198j19698j14527j08422j01980r6081q9862q2449p5126o9367o4376
56205A182310n8801n3226m8770m4890m0798l7227l4695l1876k7920k4310k2226
56194G57571k0263j7178j4582j4144j4298j2683r986q426q043p405o469o002n574
56181F12518m643m119m630m850l763k596k307j456Q85K645J995P03J187K552K834
$$ plain form
56256 812467 849326 889607 934706 986273 1044629 1109458 1181567 1262364 1352151 1450571 1558182
56245 1558182 1675745 1802450 1936563 2077269 2224089 2375075 2527516 2679714 2829941
56236 2829941 2974122 3106749 3223803 3322844 3400966 3455097 3484068 3488138 3466875 3419913 3349511
56225 3349511 3259854 3153961 3033778 2903086 2767443 2630768 2494392 2359699 2229153 2104198
56215 2104198 1984500 1869973 1761551 1659571 1563490 1473628 1391179 1316053 1246686 1182310
56205 1182310 1123509 1070283 1021513 976623 935825 898598 863903 832027 804107 779797 757571
56194 757571 737308 720130 705548 691404 677106 664423 654437 646011 637968 630563 624094 618092 612518
56181 612518 607875 603756 599126 594276 590513 587917 585610 584154 585039 587684 589679 590382 591569 594121 596955
56166E96955K822M137N596N225M115M574O059O542O392P344Q960R731J0309J2167
56152F90928J4346J5031J5173J7047K0300K2885K4835K7845L2013L6180M0468
56141I57051M5694N1356N6968O3854P2717Q1164Q6576Q9562R1472R0627Q4712
56130A771753P5024O4768N4974M5756L9385L7845L8726L7638L3409K7295J9047
56119B245620Q015l384j1891j7998k4452l1635l8554m6703n8307p1634q2441q9197
56107A777439r2960r3432q9411q2161p4147o5430n5119m4940l7318l1419k5171
56096A085931j9527j6394j4249j0489o315m469l834j398K036L366K974L647N130
56083A026409N127M485N834Q138Q209O627O697Q453R165Q897J0005J2001J2441
$$ plain form
56166 596955 599777 603914 609510 614735 618850 623424 629483 636025 642417 649761 658721 668452 678761 690928
56152 690928 705274 720305 735478 752525 772825 795710 820545 848390 880403 916583 957051
56141 957051 1002745 1054101 1111069 1174923 1247640 1328804 1415380 1504942 1596414 1687041 1771753
56130 1771753 1846777 1911545 1966519 2012275 2051660 2089505 2128231 2165869 2199278 2226573 2245620
56119 2245620 2253635 2250251 2238360 2220362 2195910 2164275 2125721 2079018 2020711 1949077 1866636 1777439
56107 1777439 1684479 1591047 1501636 1419475 1345328 1279898 1224779 1179839 1142521 1111102 1085931
56096 1085931 1066404 1050010 1035761 1025272 1018957 1014488 1010654 1009256 1011292 1014658 1017632 1021279 1026409
56083 1026409 1031536 1036021 1041855 1049993 1058202 1064829 1071526 1079979 1089144 1098041 1108046 1120047 1132488
56070A132488J2018J3340J5596J6030J5555J7196K0035K0633J9323J9231K0191
56059A321636J9714J8668J9699K1321K0150J7622J7737J9523J8931J6945J8128
56048A530074K1936K3425K2084K2259K4908K6645K6948K8732L1742L2776L2390
56037A823919L4028L6913L7291L6020L7105L9561L9103L7007L8408M2527M3914
56026B245796M2922M5239N1079N4698N4973N6452N9578O0038N8396O0093O5130
56015B854394O8048O8798P2896Q0104Q4069Q4314Q7243R3921R8469R9973J04222
56004C796451J11974J17444J20191J26343J36261J43457J47531J55272J67159
55995E022083J76121J81665J91279K05713K17274K25115K37360K55563K72378
$$ plain form
56070 1132488 1144506 1157846 1173442 1189472 1205027 1222223 1242258 1262891 1282214 1301445 1321636
56059 1321636 1341350 1360018 1379717 1401038 1421188 1438810 1456547 1476070 1495001 1511946 1530074
56048 1530074 1552010 1575435 1597519 1619778 1644686 1671331 1698279 1727011 1758753 1791529 1823919
56037 1823919 1857947 1894860 1932151 1968171 2005276 2044837 2083940 2120947 2159355 2201882 2245796
56026 2245796 2288718 2333957 2385036 2439734 2494707 2551159 2610737 2670775 2729171 2789264 2854394
56015 2854394 2922442 2991240 3064136 3144240 3228309 3312623 3399866 3493787 3592256 3692229 3796451
56004 3796451 3908425 4025869 4146060 4272403 4408664 4552121 4699652 4854924 5022083
55995 5022083 5198204 5379869 5571148 5776861 5994135 6219250 6456610 6712173 6984551
55986F984551K87156L07720L34153L57751L78832M07819M45664M81956N15682
55977A0501284N57908O10334O62461P14264P79403Q61189R48908J043186J159991
55968A7838928J303998J464866J646471J871638K151718K483007K881005L384240
55960C5025871M014685M768566N651967O683391P854957R143978J0579871J2251751
55952I5975037J4244509J6633280J9543508K3111559K7330938L1971852L6544170
55945B65354853M0021686M0499918L5632482K4208991P693627j0007416k4681499
55938C78722642l4002269l8027238l8146631l5885046l2406605k8502316k4638116
55931A47114421k1024735j7759225j4915537j2516452j0510677q832458p447405
$$ plain form
55986 6984551 7271707 7579427 7913580 8271331 8650163 9057982 9503646 9985602 10501284
55977 10501284 11059192 11669526 12331987 13046251 13825654 14686843 15635751 16678937 17838928
55968 17838928 19142926 20607792 22254263 24125901 26277619 28760626 31641631 35025871
55960 35025871 39040556 43809122 49461089 56144480 63999437 73143415 83723286 95975037
55952 95975037 110219546 126852826 146396334 169507893 196838831 228810683 265354853
55945 265354853 305376539 345876457 381508939 405717930 413411557 403404141 378722642
55938 378722642 344720373 306693135 268546504 232661458 200254853 171752537 147114421
55931 147114421 126089686 108330461 93414924 80898472 70387795 61555337 54107932
55924E4107932o320692n391340m608347l956215l422577k974397k585663k256895
55916B2591806j987886j758493j552744j375703j230602j103097r82767q77677
55908A1722837p93627p19611o46930n83092n34097m91168m47107m08618l80819
55899F717768l55643l26684l00468k82358k65660k44775k25496k12592k00185
55890D303907j83771j69227j60844j52492j39508j27677j21727j16056j05545
55881C027060r4829q8443q2017p1855o3550o2604o5155o5909o6734o9956p1564
55870B224444o8655o5848o7019o8106o4873o0415n8385n6033n0727m6172m5577
55859A572634m5311m1812l8330l8549l9743l8411l6608l6697l5803l1458k7115
$$ plain form
55924 54107932 47787240 42395900 37787553 33831338 30408761 27434364 24848701 22591806
55916 22591806 20603920 18845427 17292683 15916980 14686378 13583281 12600514 11722837
55908 11722837 10929210 10209599 9562669 8979577 8445480 7954312 7507205 7098587 6717768
55899 6717768 6362125 6035441 5734973 5452615 5186955 4942180 4716684 4504092 4303907
55890 4303907 4120136 3950909 3790065 3637573 3498065 3370388 3248661 3132605 3027060
55881 3027060 2932231 2843788 2761771 2689916 2626366 2563762 2498607 2432698 2365964 2296008 2224444
55870 2224444 2155789 2089941 2022922 1954816 1889943 1829528 1771143 1715110 1664383 1618211 1572634
55859 1572634 1527323 1485511 1447181 1408632 1368889 1330478 1293870 1257173 1221370 1189912 1162797
55848A162797k6265k6462k4675k3063k4003k4804k2858k0865k1536k2185j9929
55837I06152j7244j7060j7206j5044j2884j3473j4595j3393j1779j2327j2972
55826G48175j0927q092p512q018p157o015o675q112q737r662j1638j2352j0436
55813F32842q507q634q685o773n101n542n694l387r40p79q90J074L211L225K952
55798E88372M512N853M595K586K071J065k657o670p866p946r889j2168j1658r522
55784E40678q898r213p852n455m663n365n778o443q780j1390j1989j1356j1433
55771D32063j1353r286o393n006m568l226j678j635k267j939j725l348n386n345
55757C68908l966l717m552m804m774n698o564n552l440k188j550l32N13o47k873
$$ plain form
55848 1162797 1136532 1110070 1085395 1062332 1038329 1013525 990667 969802 948266 926081 906152
55837 906152 888908 871848 854642 839598 826714 813241 798646 785253 773474 761147 748175
55826 748175 737248 729156 721644 713626 706469 700454 693779 685667 676930 667268 655630 643278 632842
55813 632842 624335 615701 607016 600243 595142 589600 583906 580519 579579 578800 577910 578984 582195 585420 588372
55798 588372 592884 598737 603332 605918 607989 609054 606397 599727 591861 583915 574026 561858 550200 540678
55784 540678 531780 522567 514715 509260 504597 499232 493454 487011 478231 466841 454852 443496 432063
55771 432063 420710 411424 405031 400025 395457 392231 390553 388918 386651 384712 382987 379639 374253 368908
55757 368908 364942 361225 356673 351869 347095 341397 334833 329281 325841 323653 322103 321771 322284 321637 318764
55742C18764m153m620n299n345l822k393k995m429m583m122m574m811l175j302
55728B63141j733l382l422k317k739m566n206m130l144k715j740m69j64l56K33
55713B27291Q52J00q55J3J627J307n17r82L27J021K07o01q14j485k573k834k498
55696B19586k983l945l690k422j944k253j624j65P5j196j846q29M74J007J468
55681A99713K394L174L518L834L973L450K827K895K899J690R0k45K09l69j891
55666B28161k609k228k014k116j601r41j478k466j684Q67K799L170L482M467M781
55651B30590L640K147J176K46p84j190j154j980l824n242n518n452n477n011m112
55636A98055l714l795l267k182j914k692l004k061r39n72m41J4L47K01J1k6l36
$$ plain form
55742 318764 314611 309991 304692 299347 295525 293132 290137 285708 281125 277003 272429 267618 264443 263141
55728 263141 261408 258026 254604 252287 249548 244982 239776 235646 232502 229787 228047 227578 227414 227058 227291
55713 227291 228143 228243 227388 227401 229028 230335 229818 228836 229163 230184 230391 229790 228976 227491 224918 222084 219586
55696 219586 216603 212658 208968 206546 204602 202349 200725 200560 200635 199439 197593 196764 197238 198245 199713
55681 199713 202107 205281 208799 212633 216606 220056 222883 225778 228677 230367 230457 230212 230421 230052 228161
55666 228161 225552 223324 221310 219194 217593 216652 215174 212708 211024 211891 214690 217860 221342 225809 230590
55651 230590 234230 236377 237553 237799 237015 235825 234671 232691 228867 223625 218107 212655 207178 202167 198055
55636 198055 194341 190546 187279 185097 183183 180491 177487 175426 174487 173915 173474 173488 173835 174036 174047 174021 173685
55619A73685r73j396j557j915k288j971j118o18p09r27j273j997k540k206j612
55604A50585j788k261j823p86n09r29p87r5j41r91j205l81K04o3k11L59Q21M95
55586A40494j26m52n16k97L61R95J012R46J762L087L593L118K759L054L682M725
55570A68197O524Q425R482J0154J1482J2813J2462J0404Q156O111L241m48l555
55557B63448n570p305q812r145q491q292q760q574p426o644o662o205m719l427
55543A63416l157l086k584k275k462k283j403p57q05o87K9M33p0p53r91j137j353
55526A40075j133o39q22j652j898j283j129k090l036l031k670k589k302j507r58
55511A13336j064j032l52K36J24k17l84p84j469j619r91m95n91n24J12N01R0l90
$$ plain form
55619 173685 172712 171316 169759 167844 165556 163585 162467 161849 161140 160213 158940 156943 154403 152197 150585
55604 150585 148797 146536 144713 143927 143418 142489 141702 141607 141466 140475 139270 138889 139093 139030 138819 139178 139999 140494
55586 140494 140368 139916 139400 139103 139464 140459 141471 142417 144179 147266 150859 153977 156736 159790 163472 168197
55570 168197 174721 183146 192628 202782 214264 227077 239539 249943 258099 264210 267451 267003 263448
55557 263448 257878 250573 241761 232616 224125 215833 207073 198499 191073 184429 177767 171562 166843 163416
55543 163416 160259 157173 154589 152314 149852 147569 146166 145409 144604 143917 143946 144379 144309 143556 142565 141428 140075
55526 140075 138942 138303 137481 135829 133931 132648 131519 129429 126393 123362 120692 118103 115801 114294 113336
55511 113336 112272 111240 110888 111124 111248 111031 110647 109863 108394 106775 105784 105289 104698 104174 104286 104787 104877 104487
55493A04487k58P5J09R4J75n9n97p81n53n89q90o74m8r0q07q74%M15l13r79o64
55472I7179j75k25o5Q39J447Q77m2k76j89l58k35O59J438J182M45J70J56j28l43
55453A02356n4K35n0m94n48n18p78r44p18o01r53j274j173j048j126r41l88m9
55435I0934Q9Q10J938K033O56o98q48n07n00k23Q23J588J156M38N84J054Q42M20
55417A00589P63J459J475R48P29R13J180J722K472K316N66j581k421j909j139
55402A08082n85j62k67j216k254k443k010j698j461r49n01n26n55r6M03M34M59
55385I4655Q31P69k85j216o41R78K044K045J650J208N92N2o1rq1Q5O43P83l2r23
55365A03087q50j53L34P13J279J393O04r5K88R68P53J75L59P26q2j587k079j442
$$ plain form
55493 104487 104229 104304 104413 104507 104682 104623 104026 103245 102692 102103 101213 100539 100491 100401 99594 98720 98720 99135 98822 97843 97179
55472 97179 97004 96779 96714 97553 99000 99877 99835 99559 99370 99012 98777 99436 100874 102056 102501 102671 102827 102699 102356
55453 102356 102302 102537 102487 101993 101445 100927 100149 99205 98487 97886 96933 95659 94486 93438 92312 91371 90983 90934
55435 90934 91023 91833 93771 95804 96460 95762 94914 94407 93907 93684 94507 96095 97251 97689 98273 99327 100169 100589
55417 100589 101352 102811 104286 105234 105963 106876 108056 109778 112250 114566 115132 113551 111130 109221 108082
55402 108082 107497 107335 107068 105852 103598 101155 99145 97447 95986 95037 94536 94010 93455 93359 93762 94196 94655
55385 94655 95486 96255 95970 94754 94113 95091 97135 99180 100830 102038 102630 102682 102621 102612 102531 102616 103259 104042 104010 103087
55365 103087 102237 102084 102418 103131 104410 105803 106407 106312 106600 107568 108321 108496 108855 109581 109499 107912 105833 104391
55347A04391j142j544j465n45J16j6j46J53J98k71n06k21k04p44q88M8J314J795
55329A00323J349N35j81m47j29K63p4j051j605j095j04M59M18J23j94n17p83q29
55311I6461n03R7M16j35j199j505m48Q95J074J80m69k59J24qm29n21j58K27J37
55292I3977m08o84mJ222J779J312Q59J188J516P82o28j411j084j97O96J301J254
55275A01470N14k43m53m26n53m07L92J059O27m68r84o50j77J36N36Q15N03r0k13
55256A01388Kk72j052j402q77j07K18Q6k40n58n81j04N89J000R32M33l88j089
55238I7978j043m72m65j328j800r38K62L68k96m50p0n6k67K22J206J490Q99M16
55220I5656K71k99j256j427m58M94N60K56K30J83k71p69q50o33l39J56Q65J451
$$ plain form
55347 104391 103249 101705 100240 99695 99811 99795 99649 99802 100000 99729 99223 99002 98798 98054 97166 97214 98528 100323
55329 100323 101672 102207 102026 101579 101450 101713 101639 100588 98983 97888 97784 98243 98661 98784 98590 98073 97290 96461
55311 96461 95958 96055 96471 96336 95137 93632 93184 94079 95153 95333 94864 94605 94729 94721 94292 93771 93613 93840 93977
55292 93977 93569 92885 92881 94103 95882 97194 98053 99241 100757 101539 100911 99500 98416 98219 98915 100216 101470
55275 101470 101984 101741 101288 100862 100309 99902 100294 101353 101980 101512 100528 99878 99701 99837 100373 101188 101691 101601 101388
55256 101388 101390 101118 100066 98664 97787 97680 97898 97984 97744 97186 96605 96501 97090 98090 99022 99455 99067 97978
55238 97978 96935 96463 95998 94670 92870 91932 92194 92562 92266 91816 91746 91690 91423 91645 92851 94341 95240 95656
55220 95656 95927 95628 94372 92945 92487 92981 93541 93797 94027 94210 93939 93170 92320 91687 91348 91504 92369 93820
55202I3820J694J624J154K72m18k76L39M81M9k32k06n01j212j521r26L8O32P05
55184I5516L93j10l77j03K68L4o33q37k42O31J321J758J746J101K84n4p0l46o94
55165I9586m80N9O7l99l74M18J209J554J713J560N46r38j617j153o44q40j122
55148I9145q20l42k12j77P9J75k54q40j078r85p14k27K87L62j1k97l03l39l79
55129I3070L1P92J169R59P89R07P36J0o30o61l89j76R4L56R3o92j140p29k2K58
55109I4825J62R3J73M34R87J584J731J434J160R01K07p09r75m27Q4J00J80P21
55091A02665J229J290J184J094P14J44J08O85R51M37m1K84R93J373J401J187M73
55074A16171n69j047o24j80l47m84O9O37L03n35p76k34L77N81M10k0m29l32K42
$$ plain form
55202 93820 95514 97138 98292 98564 98146 97870 98209 98690 98739 98507 98301 97800 96588 95067 94141 94179 94811 95516
55184 95516 95909 95799 95422 95319 95587 95621 94988 94151 93909 94540 95861 97619 99365 100466 100750 100696 100626 100280 99586
55165 99586 99106 99165 99232 98833 98459 98877 100086 101640 103353 104913 105459 104521 102904 101751 101107 100267 99145
55148 99145 98325 97983 97771 97594 97673 97848 97594 96754 95676 94691 93977 93750 94037 94399 94388 94091 93788 93449 93070
55129 93070 93101 93893 95062 96021 96810 97717 98453 98463 97833 97172 96783 96607 96701 97057 97150 96458 95318 94589 94567 94825
55109 94825 94987 95080 95253 95687 96674 98258 99989 101423 102583 103484 103691 102982 102007 101580 101664 101764 101944 102665
55091 102665 103894 105184 106368 107462 108176 108320 108428 109113 110064 110501 110460 110744 111737 113110 114511 115698 116171
55074 116171 115602 114555 113931 113751 113404 112920 112989 113626 113929 113394 112618 112384 112761 113342 113752 113732 113303 112971 113213
55055A13213N71L05lJ1k45j190k062j952j147m76k7M80O92J38o71p61q1N56O62
55036A08013M18Q7j45J0N68R89Q29L39q7n41j081j200n74K18M76L82M81O75N95
55017A10452M83P33R67N03n07j293j581j597j283l53Q67J568J422P94Q9n06p84
55000A09974n89j29K82O47J067J372J371J173R21N12j2k13J06N02N35L50J72j63
54982A17878o86r34p56p92j399j795j150P6Q00Q63Q97J084J061P98O42O54P30
54965A17971R86J339J152K02n52k52L85R2q64j090l73M9l70o44n4O65O12N7l15
54946A18996m96p00o08M7O93O17M9j61K60Q05R98P78K18n17r36n88K14N57J01
54927A20327l53J22J316K204K424K681L517M365M421L888L625L799L802L324K708
$$ plain form
55055 113213 113784 114089 114086 114097 113852 112662 110600 108648 107501 107025 106998 107478 108170 108308 107637 106876 106795 107351 108013
55036 108013 108431 108518 108373 108383 108951 109940 110769 111108 111021 110480 109399 108199 107625 107843 108319 108701 109182 109857 110452
55017 110452 110935 111668 112635 113138 112631 111338 109757 108160 106877 106524 107391 108959 110381 111175 111264 110758 109974
55000 109974 109385 109256 109538 110185 111252 112624 113995 115168 116089 116601 116589 116376 116482 116984 117519 117869 118041 117878
54982 117878 117192 116258 115502 114710 113311 111516 110366 110442 111242 112105 113002 114086 115147 115945 116587 117241 117971
54965 117971 118957 120296 121448 121650 121098 120846 121231 121323 120459 119369 118996 119045 118675 118031 117977 118642 119254 119311 118996
54946 118996 118500 117800 117192 117239 117932 118549 118598 118437 118697 119502 120500 121278 121496 120979 120043 119455 119669 120226 120327
54927 120327 119974 120096 121412 123616 126040 128721 132238 136603 141024 144912 148537 152336 156138 159462 162170
54912A62170K082J113j86j255j880k475l186l542l429l509m080m407l892l086
54898A30438k692k318j275L1N88L18K3O2J35K40P51J511J783J296N64J24J15O19
54880A32313J680K801L219K909K729L288M195M679M492L904L126K153J019l0p79
54865A71698j371k266l627m863n103m248l094k364k051j871j791j777j567j126
54851A34579q23q12p54n30n99j135j495j211q46j089j565j428p46l36m70o70o32
54834A19438n62o38q38j144j340q55M62J695J734O63m47q96p52k30M13N74j59
54817A17118j150j353p77m20o92r09n46oJ82J89L70O27O91N35K60r6k80J66J267
54798A15176K349K662K084J116M11L50P78J112R12L59p6k94n54r28j175j095p10
$$ plain form
54912 162170 164252 165365 165179 163924 162044 159569 156383 152841 149412 145903 141823 137416 133524 130438
54898 130438 127746 125428 124153 124184 124772 125090 125113 125175 125310 125550 126301 127812 129595 130891 131455 131579 131694 132313
54880 132313 133993 136794 140013 142922 145651 148939 153134 157813 162305 166209 169335 171488 172507 172477 171698
54865 171698 170327 168061 164434 159571 154468 150220 147126 144762 142711 140840 139049 137272 135705 134579
54851 134579 133756 132944 132190 131660 131061 129926 128431 127220 126374 125285 123720 122292 121546 121210 120740 120070 119438
54834 119438 118876 118238 117400 116256 114916 114061 114523 116218 117952 118615 118168 117272 116520 116290 116703 117277 117118
54817 117118 115968 114615 113838 113418 112726 111817 111271 111265 111447 111636 112006 112633 113324 113859 114119 114023 113743 113909 115176
54798 115176 117525 120187 122271 123387 123798 124148 124926 126038 126950 127309 127233 126939 126385 125457 124282 123187 122477
54781A22477r8N52Q75O64K40J82O46J263J606J574J439J681K574L731M424M477
54765A48307M418M527M365L684L161L497M294M500L653K098L75j035j731j918
54751A82195k514m005n573o030n245m036l045k515k590k982k805j694o10n77j117
54736A36857j104o01n64j045j190p95m36j28O35J480J411O59O67J813K834L000
54720A43493L267M365N298M955L916L373L148K217N66q43j685k566l723m520m480
54705A56781m042l952m260m281l372j692j53M05Pp08j248j475j234m38M31N34
54689A31303l19j432k087k249k198k020j698j261o25K87J193J618J585J585J694
54674A25376J345K34j047j645j341n73O3J34m00j042j192q13l60k7L72P96Q65
$$ plain form
54781 122477 122379 122931 123806 124470 124710 124892 125538 126801 128407 129981 131420 133101 135675 139406 143830 148307
54765 148307 152725 157252 161617 165301 168462 171959 176253 180753 184406 186504 186879 185844 184113 182195
54751 182195 179681 175676 170103 164073 158828 154792 151747 149232 146642 143660 140855 139161 138551 137974 136857
54736 136857 135753 135152 134588 133543 132353 131558 131122 130994 131629 133109 134520 135179 135846 137659 140493 143493
54720 143493 146760 151125 156423 161378 165294 168667 171815 174032 174598 173755 172070 169504 165781 161261 156781
54705 156781 152739 148787 144527 140246 136874 135182 135029 135434 135441 134733 133485 132010 130776 130338 130769 131303
54689 131303 130984 129552 127465 125216 123018 120998 119300 118039 117414 117701 118894 120512 122097 123682 125376
54674 125376 126721 126955 125908 124263 122922 122349 122412 122546 122146 121104 119912 119099 118739 118712 119084 119880 120745
54657A20745N63L72M76L87j87p26o30j52k2l97o55k86M52Q87Q04P09J035J351
54639A24726Q19m84j406j186l89J34M45Q96J056L86m97n96k57o73j733j948p69
54622A18524M65N38nl1M66O74K99k81o60n70P8Q50R83M22L2L57P84N40j58n41
54602A22766m32k85l78m86k48N11J558K203J867Q06j29n32o79p03l07M12O96J38
54584A26778o43q64n68k85k03j56o5L0N2j29n10o75k17N54R33Q66Q82R93O11k34
54564A27150o72k94K58M08L73L42K3m43j96R31J761J362L98o1j18l91n92n2Q54
54545A31041J083N18M4J45L48J94j12j46J56M75M49N3k30P4O46O28j23p58p06
54526A33779l95l18k18J11J36m71r23l92N94Q53K23m67p75r68j176j112o92j49
$$ plain form
54657 120745 121308 121680 122156 122543 122356 121630 121000 120848 120826 120429 119774 119488 119940 120827 121631 122340 123375 124726
54639 124726 125545 125061 123655 122469 122080 122214 122659 123555 124611 124997 124500 123904 123647 122974 121241 119293 118524
54622 118524 118989 119527 119522 119491 119957 120631 120930 120649 119989 119419 119497 120347 121330 121752 121784 122141 122925 123465 123307 122766
54602 122766 122334 122049 121671 121185 120937 121448 123006 125209 127076 127882 127753 127221 126542 125839 125532 125944 126640 126778
54584 126778 126135 125271 124703 124418 124215 124059 123994 124024 124076 123947 123437 122762 122545 123099 124032 124898 125780 126773 127384 127150
54564 127150 126478 126184 126442 126850 127223 127565 127588 127145 126949 127880 129641 131003 131401 131340 131222 130831 130239 130187 131041
54545 131041 132124 132642 132686 132831 133179 133373 133261 133115 133271 133746 134195 134248 134018 134092 134738 135366 135243 134485 133779
54526 133779 133384 133066 132848 132959 133095 132624 131701 131309 131903 132756 132979 132512 131737 130769 129593 128481 127789 127640
54508A27640L31N64K12p09j456j312m78L82J074J670J857J314M57m3k56o67j109
54491A29471q61J79J267J774J701J326R07P03P33N83L3l66M1R67J466J131L84
54474A41439k28m03J15J261K249K189J178K35J23P10J456J934J865J219L90j19
54458A55613k04j64l04p09j264j566j272o48l97n69l70N26J199P68k09n62k06
54441A49662K5j85m17n52r25j495j822j803j648j173n4J210J604R77K46N0P6m0
54423A43736M5P04J550J776J117J42k98L0M04q7j300j996j428l22K15K02L48O82
54405A45520O39J84r0M9L50P82J435J871J534P91N83R61J027L59l93n52j56N20
54387A55414J317J823J485M07o74j330j699j717j038O6O51K98l15m38r6L72Q77
$$ plain form
54508 127640 127971 128535 128747 128038 126582 125270 124792 125174 126248 127918 129775 131089 131546 131503 131247 130580 129471
54491 129471 128610 128789 130056 131830 133531 134857 135764 136467 137200 137783 137816 137450 137491 138458 139924 141055 141439
54474 141439 141211 140808 140923 142184 144433 146622 147800 148035 148158 148868 150324 152258 154123 155342 155732 155613
54458 155613 155409 155245 154941 154232 152968 151402 150130 149482 149085 148516 148146 148672 149871 150639 150430 149868 149662
54441 149662 149687 149502 149085 148533 147608 146113 144291 142488 140840 139667 139613 140823 142427 143404 143650 143700 143776 143736
54423 143736 143781 144485 146035 147811 148928 149070 148772 148802 149206 149119 147819 145823 144395 144073 144288 144490 144838 145520
54405 145520 146159 146343 146253 146302 146652 147434 148869 150740 152274 153065 153648 154609 155636 155995 155602 155050 154894 155414
54387 155414 156731 158554 160039 160446 159772 158442 156743 155026 153988 154054 154705 155003 154688 154250 154154 154526 155403
54370A55403J348J525J414J357J452J451J398J683K202K271J654J008Q85J029
54356A76080J035R59Q58M23l71r07q42p37j221j969k202j865j567j637j839j921
54340A62277j897j786j470r64n32m96r24j434j391n31O23J227R97L73j28k86m7
54323A53611M87Q52N94q5m88l33m0J7m3JR6J46J70O1l33q26j055j082j272j520
54303A48958j272n12M9j2k60k21q7j28n9M42J072J278R98N09m2n32n98n2O40Q46
54283A51017N46K69L46N92O45L70o4k91j14K54M29M02N13Q10Q95O26M85Q63J305
54264A59898J021Pp93n12P23J922K182J445M40j20j91k02l59m20j05M97J040J262
54246A67735J153Q96N62m1j023j830j578k04J156J402O81j27o59j057j131m80
$$ plain form
54370 155403 156751 158276 159690 161047 162499 163950 165348 167031 169233 171504 173158 174166 175051 176080
54356 176080 177115 178074 178932 179355 178984 178077 177235 176498 175277 173308 171106 169241 167674 166037 164198 162277
54340 162277 160380 158594 157124 156160 155628 155132 154208 152774 151383 150852 151475 152702 153699 154072 153944 153658 153611
54323 153611 154098 154950 155544 155459 154971 154638 154598 154615 154572 154573 154669 154815 154985 155046 154713 153887 152832 151750 150478 148958
54303 148958 147686 147174 147223 147211 146951 146730 146643 146515 146456 146898 147970 149248 150246 150755 150713 150181 149583 149531 150171 151017
54283 151017 151563 151832 152178 152770 153415 153785 153721 153430 153316 153570 153999 154401 154914 155724 156619 157245 157730 158593 159898
54264 159898 160919 160926 160133 159621 160344 162266 164448 165893 166333 166213 166022 165820 165461 165041 164936 165433 166473 167735
54246 167735 168888 169784 170346 170305 169282 167452 165874 165670 166826 168228 168909 168782 168123 167066 165935 165455
54230A65455O26J410J612J566J283M15p72j362j036n12m11m54k44o0l67j015j462
54213A64672j407r19k92N3r8l52j43M37P44O03M27K93j84q72j018n39m14j188
54195A59803j974j694o16K03M22M75N71N07L11K97N41Q08R08P65L60m1O2P75J508
54176A63991J727J601J484J217M81m56r79r17o23m27l99n87r68j375j683j913
54160A60174j896j251m3Q96Q78K62n9J49L72L00K19L71M74J99k99o28p88j142
54142A58188j719j848r67L21O67l29j445j423o32l14o39o06K42J184J610J786
54126A54076J961J783J135O22O49P58N42L55N11N58J69jP69J999K655K607K497
54109A73645K487K128J361Q11R32J584K416L194L649L491K661J377Lr84j194p64
$$ plain form
54230 165455 166081 167491 169103 170669 171952 172367 171595 170233 169197 168685 168274 167820 167576 167516 167149 166134 164672
54213 164672 163265 162346 162054 162107 162009 161657 161514 161951 162695 163298 163725 164018 163834 162962 161944 161405 160991 159803
54195 159803 157829 156135 155519 155722 156144 156619 157190 157697 158008 158305 158846 159654 160562 161327 161687 161646 161708 162483 163991
54176 163991 165718 167319 168803 170020 170501 170045 169066 168149 167526 167099 166700 166113 165145 163770 162087 160174
54160 160174 158278 157027 156984 157880 158758 159020 158961 159110 159482 159782 160001 160372 160846 161045 160746 160118 159330 158188
54142 158188 156469 154621 153654 153975 154642 154313 152868 151445 150813 150499 149860 149254 149496 150680 152290 154076
54126 154076 156037 157820 158955 159577 160226 160984 161526 161881 162392 162950 163119 163118 163887 165886 168541 171148 173645
54109 173645 176132 178260 179621 180432 181364 182948 185364 188558 192207 195698 198359 199736 199739 198755 197561 196797
54093A96797l56m01p10j034j498k195k747k752k266j498n06M22O41k1q09r74o78
54076A79415m39k41J21L33O2j76M00J588K286J867P51k50o27k78M78J008R38N62
54058A87798L37K64J92L29Q17J115O06l60p18l7R92J487J307J052J428K614L980
54041B03203M595M208L466L014K872K996L755N277O865P779Q154Q466Q576Q076
54027B81302P213O532N941M970L802L102K980K918K663K401K122J590R32N44M19
54012C29431J79l19r88j951l245m398m994n455o316p020o525n071m129m426n047
53997B69726m868l980l166k801k776k914l032k969k784k621k292j579r05r71j562
53982B30506j589n52P42J345J296J193J221J210J154J154J184J324J903L002M186
$$ plain form
54093 196797 196441 196040 195330 194296 192798 190603 187856 185104 182838 181340 180834 181256 181897 181876 181067 180093 179415
54076 179415 178976 178735 178856 179189 179251 179075 179475 181063 183349 185216 185967 185717 185090 184812 185290 186298 187236 187798
54058 187798 188135 188399 188591 188920 189737 190852 191458 191098 190380 190343 191335 192822 194129 195181 196609 199223 203203
54041 203203 207798 212006 215472 218486 221358 224354 228109 233386 240251 248030 256184 264650 273226 281302
54027 281302 288515 295047 300988 305958 309760 312862 315842 318760 321423 323824 325946 327536 328468 329012 329431
54012 329431 329610 329291 328303 326352 323107 318709 313715 308260 301944 294924 288399 283328 279199 274773 269726
53997 269726 264858 260878 257712 254911 252135 249221 246189 243220 240436 237815 235523 233944 233039 232068 230506
53982 230506 228917 228365 229107 230452 231748 232941 234162 235372 236526 237680 238864 240188 242091 245093 249279
53967B49279N087N908O811P179O047L309j4k760m555n676o304o259n441m210l064
53952B45337k103j095j00M59M45L16N29R49J208J304J431J561J581J645J963K459
53936B57889K972L507L951L918L442L282L946M795M894M400M224M556M701M383
53922C14860M218M682N375N693N620N538N676O010O408O731O980P374Q034Q779
53908D01978R417R922J0036R229P564N961M936L620J084j870l484l407k941k949
53894D49096k887k276j785k187l180m001m599n534p146r212j1101j1972j1331
53881C71885r636p996p098o768o581o305n748m870m118m058m521m789m694m756
53867B89947n079n027m249l348l011l170l324l241k948k539k197k045j947j826
$$ plain form
53967 249279 254366 260274 267085 274264 280311 283620 283606 280846 276291 270615 264311 258052 252611 248401 245337
53952 245337 243234 242139 242039 242498 242943 243259 243788 244737 245945 247249 248680 250241 251822 253467 255430 257889
53936 257889 260861 264368 268319 272237 275679 278961 282907 287702 292596 296996 301220 305776 310477 314860
53922 314860 319078 323760 329135 334828 340448 345986 351662 357672 364080 370811 377791 385165 393199 401978
53908 401978 411395 421317 431353 440582 448146 454107 459043 462663 463747 461877 458393 454986 452045 449096
53894 449096 446209 443933 442148 439961 436781 432780 428181 422647 415501 406289 395188 383216 371885
53881 371885 362249 354253 347155 340387 333806 327501 321753 316883 312765 308707 304186 299397 294703 289947
53867 289947 284868 279841 275592 272244 269233 266063 262739 259498 256550 254011 251814 249769 247822 245996
53853B45996k028k765l372l024k076j666k014k222j882j639j815j718q88Q5N91
53838B19563Q41J042P31k86j228j350r90q47r13q14n40j94L62R84J066N06Q2L06
53820B18321O63O43O56J096J429J192J063J823K915L207K643K042J709J429J464
53805B42295K271L464M187M400M745N239N329N126N478O569P481P448O722N959
53791C16713N460N259N279N138M436L408K781K751K638J769K68j168k002k217
53777C50513k285k798l848m859n288n281n330n498n482n220m856m351l709l409
53763B88299l960n033n683n445m640l698k826k320k459k993l278l126k880k621
53749B37337k030j194q03j102j327p71Q6K05n48j239j139n45j57j74l04l87n45
$$ plain form
53853 245996 243968 241203 237831 234807 232731 231065 229051 226829 224947 223308 221493 219775 218887 218972 219563
53838 219563 220404 221446 222177 221891 220663 219313 218323 217476 216563 215749 215209 215015 215377 216361 217427 217933 218015 218321
53820 218321 218984 219627 220283 221379 222808 224000 225063 226886 229801 233008 235651 237693 239402 240831 242295
53805 242295 244566 248030 252217 256617 261362 266601 271930 277056 282534 289103 296584 304032 310754 316713
53791 316713 322173 327432 332711 337849 342285 345693 348474 351225 353863 355632 355900 354732 352730 350513
53777 350513 348228 345430 341582 336723 331435 326154 320824 315326 309844 304624 299768 295417 291708 288299
53763 288299 284339 279306 273623 268178 263538 259840 257014 254694 252235 249242 245964 242838 239958 237337
53749 237337 235307 234113 233310 232208 230881 230110 230196 230401 229853 228614 227475 226930 226773 226599 226295 225908 225363
53732B25363p46o75k55Q3jj32L14J248J846J654J125Q64Q62P96O87Q03J153J490
53714B36479J641J534J111N81M67J029J827K219K164K118K292K448K382K246K350
53699B62888K771L222L273K832K448K796L784M552M505L924L257K413J212J31
53685C04008j63J65K31m44j329j571r27M1N50L26j90m09l20l91p86j093r49m63
53667B96286R7N27M47n06j923k648k062q07J80P46J109J087N31K8K62R45J200
53650B95499P88K63O1J30L83Q16J249J412J288R12K40m14k59R96K440L032K905
53633C11741K843K847K372J708J870L018M042M042L263K362J566R39P43J071J594
53618C46021J986K179K132J843J616J771K029J850J431J645K836M324N293N507
$$ plain form
53732 225363 224617 223942 223687 223770 223769 223637 223951 225199 227045 228699 229824 230688 231550 232346 233033 233836 234989 236479
53714 236479 238120 239654 240765 241346 241813 242842 244669 246888 249052 251170 253462 255910 258292 260538 262888
53699 262888 265659 268881 272154 274986 277434 280230 284014 288566 293071 296995 300252 302665 303877 304008
53685 304008 303845 304010 304241 303797 302468 300897 299970 300011 300561 300887 300697 300288 299968 299577 298791 297698 296749 296286
53667 296286 296383 296910 297357 296851 294928 292280 290218 289411 289591 290337 291446 292533 293064 293092 293354 294299 295499
53650 295499 296287 296550 296611 296741 297124 297940 299189 300601 301889 302801 303041 302627 302368 303364 305804 308836 311741
53633 311741 314584 317431 319803 321511 323381 326399 330441 334483 337746 340108 341674 342613 343356 344427 346021
53618 346021 348007 350186 352318 354161 355777 357548 359577 361427 362858 364503 367339 371663 376956 382463
53604C82463N060M090L062K638K903L204L106K876K822K697K129J196K29m96p10
53589D17269k47N05Q12N03J06j00n43j448k169k053j449j206j516j888k106k453
53573D02017l049l553l638l412l181l003k667k018j221o11l09o2L62P32O13L7
53557C77037l89j67N37J101J053M56j95m23k01J35M41R39J637K073J985J844K091
53540C89954K258J644O77O01J779L217L998M302M692N155N402N485N644N901O275
53525D46984O955P897Q667R049R398J0015J0641J0960J1200J1785J2688J3629
53513E69868J4568J5537J6290J6645J7011J8022J9670K1240K2143K2463K2667
53502G76124K3038K3438K3496K3007K2214K1593K1264K0842J9996J8984J8374
$$ plain form
53604 382463 387523 391613 394675 397313 400216 403420 406526 409402 412224 414921 417050 418246 418475 417979 417269
53589 417269 417022 417527 418339 418842 418948 418848 418305 416857 414688 412635 411186 409980 408464 406576 404470 402017
53573 402017 398968 395415 391777 388365 385184 382181 379514 377496 376275 375664 375355 375293 375655 376387 377000 377037
53557 377037 376648 376481 377018 378119 379172 379628 379433 379010 378809 378944 379385 380324 381961 384034 386019 387863 389954
53540 389954 392212 393856 394533 395134 396913 400130 404128 408430 413122 418277 423679 429164 434808 440709 446984
53525 446984 453939 461836 470503 479552 488950 498965 509606 520566 531766 543551 556239 569868
53513 569868 584436 599973 616263 632908 649919 667941 687611 708851 730994 753457 776124
53502 776124 799162 822600 846096 869103 891317 912910 934174 955016 975012 993996 1012370
53491A012370J8331J8470J8363J7975J7601J7440J7315J6904J6200J5619J5508
53480A202096J5698J5795J5726J5694J5671J5401J4854J4332J3962J3411J2244
53469A364884J0322P800N047K497M00j436l371n427p361r116j0880j2670j4243
53456A326446j5428j6137j6159j5431j4525j4296j4924j5803j6455j7068j7880
53445A152340j8542j8492j7649j6526j5769j5722j6133j6279j5583j4082j2104
53434I75459r705o967m554l203k663j960p54L12P73J054J698K693L936N543P313
53419I68975Q590R238J0090J1777J3772J5181J6012J6988J8525K0466K2480K4123
53407A156217K4918K4953K5138K6216K7874K9312L0389L1564L3011L4482L5950
$$ plain form
53491 1012370 1030701 1049171 1067534 1085509 1103110 1120550 1137865 1154769 1170969 1186588 1202096
53480 1202096 1217794 1233589 1249315 1265009 1280680 1296081 1310935 1325267 1339229 1352640 1364884
53469 1364884 1375206 1383006 1388053 1390550 1390950 1389514 1386143 1380716 1373355 1364239 1353359 1340689 1326446
53456 1326446 1311018 1294881 1278722 1263291 1248766 1234470 1219546 1203743 1187288 1170220 1152340
53445 1152340 1133798 1115306 1097657 1081131 1065362 1049640 1033507 1017228 1001645 987563 975459
53434 975459 965754 958787 954233 951030 948367 946407 945653 945965 946738 947792 949490 952183 956119 961662 968975
53419 968975 977565 986803 996893 1008670 1022442 1037623 1053635 1070623 1089148 1109614 1132094 1156217
53407 1156217 1181135 1206088 1231226 1257442 1285316 1314628 1345017 1376581 1409592 1444074 1480024
53396A480024L7754M0056M2591M4946M6808M8049M8872M9688N0612N1270N1387
53385A992057N1255N1274N1352N1079N0247M8840M6846M4432M1952L9463L6624
53374B505421L3360L0131K7114K3703J9394J4639J0214O218K370j337n105r952
53362B656170j6646k4264l0885l5705l9505m2980m5746m7304m8055m8730m9443
53351B226907m9768m9473m8682m7588m6199m4288m1694l8870l6932l6660l7558
53340A749195l8332l8293l7698l6866l5700l4180l2620l1153k9441k7247k4836
53329A382829k2597k0562j8545j6473j4462j2794j1863j1787j2127j2399j2769
53318A216451j3716j4963j5435j4536j2913j1608j0905j0302r321p922o362m920
$$ plain form
53396 1480024 1517778 1557834 1600425 1645371 1692179 1740228 1789100 1838788 1889400 1940670 1992057
53385 1992057 2043312 2094586 2145938 2197017 2247264 2296104 2342950 2387382 2429334 2468797 2505421
53374 2505421 2538781 2568912 2596026 2619729 2639123 2653762 2663976 2670194 2672564 2671227 2666122 2656170
53362 2656170 2639524 2615260 2584375 2548670 2509165 2466185 2420439 2373135 2325080 2276350 2226907
53351 2226907 2177139 2127666 2078984 2031396 1985197 1940909 1899215 1860345 1823413 1786753 1749195
53340 1749195 1710863 1672570 1634872 1598006 1562306 1528126 1495506 1464353 1434912 1407665 1382829
53329 1382829 1360232 1339670 1321125 1304652 1290190 1277396 1265533 1253746 1241619 1229220 1216451
53318 1216451 1202735 1187772 1172337 1157801 1144888 1133280 1122375 1112073 1102752 1094830 1088468 1083548
53306A083548l637k273o59R33K143L155M493O136P443Q191R051J0697J2849J4676
53292A156746J5842J6696J7734J9213K1086K2996K4431K5133K5227K4848K3954
53281A393906K2657K1296J9929J8120J5624J2908J0578Q626O692M685K679M89
53269A538189k067m703p112r628j2692j5791j7830j8654j9379k0854k2632k3895
53257A362952k4727k5739k6941k7751k7892k7604k7100k6451k5938k5827k5769
53246A071213k5063k3697k2503k2025k1875k1565k1378k1772k2354k2243k1311
53235H25427k0344j9830j9315j8299j7139j6519j6241j5302j3270j1054r865r679
53223F38570r302q036o682o471p455q556r122r558j0345j1247j1963j2832j4119
$$ plain form
53306 1083548 1079911 1077638 1076979 1077912 1080055 1083210 1087703 1093839 1101282 1109473 1118524 1129221 1142070 1156746
53292 1156746 1172588 1189284 1207018 1226231 1247317 1270313 1294744 1319877 1345104 1369952 1393906
53281 1393906 1416563 1437859 1457788 1475908 1491532 1504440 1515018 1523644 1530336 1535021 1537700 1538189
53269 1538189 1536122 1531419 1524307 1514679 1501987 1486196 1468366 1449712 1430333 1409479 1386847 1362952
53257 1362952 1338225 1312486 1285545 1257794 1229902 1202298 1175198 1148747 1122809 1096982 1071213
53246 1071213 1046150 1022453 999950 977925 956050 934485 913107 891335 868981 846738 825427
53235 825427 805083 785253 765938 747639 730500 713981 697740 682438 669168 658114 648249 638570
53223 638570 629268 621232 614550 608079 600624 592068 582946 573388 563043 551796 539833 527001 512882
53210E12882j5082j4657j2876j0826r299q252p597p584q145q623q541q090p528
53197C85782o780n941n579n951o449o382n920n687n787n867n875o011o041n465
53183C02047m449l884m197m649m276l172k362k439k826k632j890j385j472j606
53169B60808j354j159j527j952j538n44k09r27j611j335o06l92o18o07l81n43
53153B45505j097j381j119p44n85m89l56l73n51n39j97J35J32p5k05k72m37o13
53135B36739m96K2N92O90J94l83m02J91Q61J217J348J373J167Q12P71J189J440
53118B47325J006L88M96J311J908J706J036M22l6m17o31n79l10P2L95L67j13o39
53100B53707p11m24k77l96m47l45l94o23o33l35k94r78k015k601k398j731j082
$$ plain form
53210 512882 497800 483143 470267 459441 450142 441890 434293 426709 418564 409941 401400 393310 385782
53197 385782 379002 373061 367482 361531 355082 348700 342780 337093 331306 325439 319564 313553 307512 302047
53183 302047 297598 293714 289517 284868 280592 277420 275058 272619 269793 267161 265271 263886 262414 260808
53169 260808 259454 258295 256768 254816 253278 252734 252525 251598 249987 248652 248046 247654 247036 246429 246048 245505
53153 245505 244408 243027 241908 241164 240579 240090 239734 239361 238810 238271 238074 238209 238341 238266 238061 237789 237352 236739
53135 236739 236243 236265 236857 237547 237741 237358 236956 237147 238008 239225 240573 241946 243113 243925 244696 245885 247325
53118 247325 248331 248719 249215 250526 252434 254140 255176 255598 255562 255145 254514 253935 253625 253697 254092 254459 254346 253707
53100 253707 252996 252572 252295 251899 251452 251107 250713 250090 249457 249122 248828 247850 245835 243234 240836 239105 238023
53083B38023o76m08j09J43L3m71p60k29P92J269P77J6k33j13k31o01o86l58j44
53064B36034m38q53p85l30k29q08j403j218m71j54o13r92m33P48J556J606J293
53047B32510R56N61J56l7nM6J18L59N45K83k53m01nL26J83m5O6J81k70j140j701
53026B32433j590j062m44K22Q81J221R90M29J43M66J018J118O33J67K04M02J03
53009B37334o41j090q19j86L30P11J081J299J191R40Q82J073J245J120N87k41
52993B44816r97j247q70j73M69R81J488J986K175J731O90l55o20J15J253K039
52977B53481K308K351K254J884J359J024Q77N25j11n01j98N46J086J113Q15N05
52961B69318L00J24j21m23o49o83n65m21l93o59j244j765j717j236j105j652k104
$$ plain form
53083 238023 237347 236939 236830 236973 237006 236535 235775 235546 236338 237607 238384 238400 238167 238054 237823 237222 236536 236178 236034
53064 236034 235596 234743 233958 233628 233399 232591 231188 229970 229499 229345 228732 227740 227307 228055 229611 231217 232510
53047 232510 233466 234027 234183 234146 234141 234187 234305 234664 235209 235492 235239 234838 234833 235159 235342 235297 235363 235544 235274 234134 232433
53026 232433 230843 229781 229337 229559 230440 231661 232651 233080 233223 233689 234707 235825 236458 236625 236829 237231 237334
53009 237334 236693 235603 234784 234598 234928 235639 236720 238019 239210 240150 241032 242105 243350 244470 245057 244816
52993 244816 243819 242572 241702 241529 241998 242979 244467 246453 248628 250359 251049 250694 250074 250189 251442 253481
52977 253481 255789 258140 260394 262278 263637 264661 265538 266063 265952 265451 265253 265799 266885 267998 268813 269318
52961 269318 269618 269742 269621 269198 268549 267866 267301 266880 266487 265828 264584 262819 261102 259866 258761 257109 255005
52944B55005j640o20n7j92m44n62q06j036o41L49J038Q47J44n65j182j459q68
52927B47311L76J072N70k15j19N89P70J55n15q13j071j432j413o80L68J063J142
52910B47158Q45N72N14L88l27j670k843k968k086j001k57K54P49J149J412J736
52894B43625K211K509K269J500M80n57j338j373l85J043J721J075j19o71m60l47
52878B51183o82p25O0R47J008N78P70J692K287K015J600J760K140K044J499R48
52862B69124M38j85o24m16L14Q39N87m38j806k951l454l292k783k243j827j717
52846B49566k006k411k457k135j870j774j482q81l88k14m1K14L6p55j391j156
52830B30855m69k02m00m46k00q6j83j6O12J187J000q6j424j947j102L40Q72J2
$$ plain form
52944 255005 253365 252745 252688 252496 252052 251490 250684 249648 249007 249356 250394 251241 251385 250820 249638 248179 247311
52927 247311 247687 248759 249329 249114 248995 249584 250354 250509 249994 249181 248110 246678 245265 244585 244953 246016 247158
52910 247158 248003 248575 249089 249477 249150 247480 244637 241669 239583 238582 238325 238579 239328 240477 241889 243625
52894 243625 245836 248345 250614 252114 252594 252037 250699 249326 248941 249984 251705 252780 252661 251990 251530 251183
52878 251183 250501 249776 249836 250783 251791 252369 253139 254831 257118 259133 260733 262493 264633 266677 268176 269124
52862 269124 269562 269377 268753 268337 268651 269490 270077 269639 267833 264882 261428 258136 255353 253110 251283 249566
52846 249566 247560 245149 242692 240557 238687 236913 235431 234550 234162 233948 233907 234121 234157 233402 232011 230855
52830 230855 230386 230184 229784 229338 229138 229052 228869 228853 229465 230652 231652 231566 230142 228195 227093 227433 228305 228317
52812B28317j037r85o3O49Q52J021J188R35M57N17J110J247L41j026k020k472
52796B29031k510k026j043r9K85K10R4Q9J03R0P4M6M7J36J64j26o28q41m66J90
52776B22820N82M90J53oK85P87Q47J43p24q42k20J68k81j010j128n62P3L34K18
52757B22127j88p45j041o36L81J385J861J889J817J738J475J000O32P34J320K094
52741B35843K806L363L640L417K651J625O66q3m99l71K16O71M91n3k47N4K58o4
52723B54384n99p89n72k76j42k38o48j336j871j713q90j33j48q15j344j146m20
52706B41304J66K01j46m29l90q9K92P44J361J978K058J245Lp21n99k36j92k31
52688B46319j2R2l63q69n54L59P32K42k07j0K34r1n81o17l82k76j05K84K29q52
$$ plain form
52812 228317 227280 226295 226232 226881 227733 228754 229942 230877 231334 231851 232961 234208 234549 233523 231503 229031
52796 229031 226521 224495 223452 223353 223638 223848 223942 224031 224134 224224 224298 224344 224391 224527 224691 224565 223937 223096 222630 222820
52776 222820 223402 223892 224045 224039 224324 225111 225958 226101 225377 224535 224315 224483 224202 223192 222064 221502 221575 221909 222127
52757 222127 221939 221194 220153 219517 219898 221283 223144 225033 226850 228588 230063 231063 231695 232429 233749 235843
52741 235843 238649 242012 245652 249069 251720 253345 254011 253928 253429 253058 253274 253945 254436 254383 254136 254190 254448 254384
52723 254384 253785 252996 252424 252148 252006 251768 251120 249784 247913 246200 245310 245177 245029 244214 242870 241724 241304
52706 241304 241470 241671 241525 241096 240706 240617 240909 241653 243014 244992 247050 248295 248298 247577 246978 246742 246550 246319
52688 246319 246307 246399 246036 245167 244613 244972 245704 245946 245739 245729 245963 245872 245291 244674 244292 244016 243911 244195 244424 243572
52668B43572k179k360j188K14R04R41P81P09R12J381J775J884K069K598K851K096
52652B56960Q29L85J135K084K317J840Q86n82k193l023k734k135k031k162j872
52637B49704j261q47n70R9J109J693J369O38M05R78J828K294K296K151J803P53
52621B64442r29k102j775n58k7o71j352j061k70j1l35m20J50R02J182P74j05j027
52603B56807j523j348o47K30R82J390J324Q88M07J27N6J24K71L26P4l81n89k56
52585B58262M28J078J456J502J222Q22O38P94J042J102R94Q78P56N11Q5m15p70
52568B70385q03o55p82j360j833j512o00l9k41n85n18m28q35j293r23Q2M79k88
52550B58251j183r51J12N74j38j042j048l96J7J17N19J175J201L44m16k69K78
$$ plain form
52668 243572 241393 239033 237845 238059 238963 239904 240685 241394 242306 243687 245462 247346 249415 252013 254864 256960
52652 256960 257789 258174 259309 261393 263710 265550 266436 265854 263661 260638 257904 255769 253738 251576 249704
52637 249704 248443 247596 247026 247125 248234 249927 251296 251934 252339 253317 255145 257439 259735 261886 263689 264442
52621 264442 263513 261411 259636 259078 259051 258380 257028 255967 255697 255686 255351 254931 255081 255983 257165 257939 257834 256807
52603 256807 255284 253936 253289 253519 254501 255891 257215 258103 258510 258637 258693 258817 259088 259414 259488 259107 258518 258262
52585 258262 258690 259768 261224 262726 263948 264770 265408 266202 267244 268346 269340 270218 270974 271485 271570 271155 270385
52568 270385 269582 268927 268145 266785 264952 263440 262840 262801 262560 261975 261457 261029 260194 258901 257978 258060 258539 258251
52550 258251 257068 256117 256229 256803 256665 255623 254575 254179 254196 254313 254832 256007 257208 257552 257136 256867 257145
52533B57145L72K42O44J367J444P06O2J42N36O59N25L85L05L95Q32J347J294N54
52515B68956j52j94K27N93Q13J086J557K321L405M390M603L958L108K423J420
52500B98514k74k040l041l385l769m258m236l457k387j466o87r4J1m16p98n69
52484B67648P9M56K38j90k56J69P79J243J435J294Q33L22K65Q92J798K258J882
52467B81145Q91m4k27N61J727K383K391K531L251L798L192J686M43m8m08j188
52451C02084k141k832l165l082k402j381p98j088j815k304k390k244j971j675
52437B72796j574j690j678j212l30O75J374J294L86n68n95K52R24P32P1l46k99
52420B70212J36Q27J328J077K58j90J67O71P62R28J811K992L521L305L158L701
$$ plain form
52533 257145 257517 257759 258403 259770 261214 261920 261982 262124 262660 263319 263844 264229 264534 264929 265761 267108 268402 268956
52515 268956 268804 268610 268837 269430 270243 271329 272886 275207 278612 283002 287605 291563 294671 297094 298514
52500 298514 298240 296200 293159 289774 286005 281747 277511 274054 271667 270201 269514 269420 269431 269015 268217 267648
52484 267648 267727 268183 268421 268231 267975 268144 268923 270166 271601 272895 273728 274050 274315 275207 277005 279263 281145
52467 281145 282036 281992 281765 282326 284053 286436 288827 291358 294609 298407 301599 303285 303728 303680 303272 302084
52451 302084 299943 297111 293946 290864 288462 287081 286283 285195 283380 281076 278686 276442 274471 272796
52437 272796 271222 269532 267854 266642 266312 266987 268361 269655 270041 269473 268878 269130 270054 270786 270857 270511 270212
52420 270212 270348 271175 272503 273580 273838 273648 273815 274486 275248 276176 277987 280979 284500 287805 290963 294664
52404B94664M878O374P920R137R576Q925P045M054N73k473m578n902o663o735
52390C26795o096n239m650m293l820l007j759k38R02J005M02J35M61N49Q0P8J398
52373C02703L226M132L869L253K835K776L447M946O311O322N016L473K283J120
52359C55712k60j559k439k732k188q76L58O19J60L5O30J326J598J589J553J466
52343C54992J379J429J446J152P93R23J536K061K276K591L333M367N480O591P533
52328C97882Q102Q373Q544Q628Q764R555J1329J3334J4480J4759J5056J5687J6108
52315E50601J6045J5849J5628J5051J4313J4275J5188J6166J6400J6210J6332
52304G22058J6922J7691J8405J8799J8485J7492J6466J5940J5785J5566J5018
$$ plain form
52404 294664 299542 305916 313836 322973 332549 341474 348519 352573 353146 350673 346095 340193 333530 326795
52390 326795 320699 315460 310810 306517 302697 299690 297931 297693 298595 299600 300002 300137 300598 301147 301227 301305 302703
52373 302703 305929 310061 313930 317183 320018 322794 326241 331187 337498 343820 348836 352309 354592 355712
52359 355712 355452 353893 351454 348722 346534 345658 346016 346635 346795 346830 347460 348786 350384 351973 353526 354992
52343 354992 356371 357800 359246 360398 361191 362114 363650 365711 367987 370578 373911 378278 383758 390349 397882
52328 397882 405984 414357 422901 431529 440293 449848 461177 474511 488991 503750 518806 534493 550601
52315 550601 566646 582495 598123 613174 627487 641762 656950 673116 689516 705726 722058
52304 722058 738980 756671 775076 793875 812360 829852 846318 862258 878043 893609 908627
52293I08627J3875J1856R133O386M020J829l21k124l446m752o320p519p529o453
52279I17262n256m665m599m521m074l376k769k290j507k07J077J783K420M031
52265H93309O504Q335Q482P705P513Q461R992J1389J2223J2405J2398J2990J4294
52252A026000J5436J5709J5541J5670J5877J5392J4141J2676J1034Q625N347J942
52240A173390q98l151m961o255p129q096r504j1023j2018j2166j1608j0792j0338
52227A065451j0587j1102j0999j0054r106q900r013q532p474o689o402n781m356
52214I56456k980k670l030k773j523j81N93J302K604M115M857M552L864L490L420
52199I72096L176K541J973K271L721N612O925P401P512P514P152O392N642M984
$$ plain form
52293 908627 922502 934358 943491 949877 953897 955726 955405 953281 949835 945083 938763 931244 923715 917262
52279 917262 912006 907341 902742 898221 894147 890771 888002 885712 884205 883998 885075 886858 889278 893309
52265 893309 899813 908148 916630 924335 931848 940309 950301 961690 973913 986318 998716 1011706 1026000
52252 1026000 1041436 1057145 1072686 1088356 1104233 1119625 1133766 1146442 1157476 1166101 1171448 1173390
52240 1173390 1172492 1169341 1164380 1158125 1150996 1142900 1133396 1122373 1110355 1098189 1086581 1075789 1065451
52227 1065451 1054864 1043762 1032763 1022709 1013603 1004703 995690 987158 979684 972995 966593 960812 956456
52214 956456 953476 950806 947776 945003 943480 943299 943892 945194 947798 951913 956770 961322 965186 968676 972096
52199 972096 975272 977813 979786 982057 985778 991390 998315 1005716 1013228 1020742 1027894 1034286 1039928 1044912
52185A044912L945K384Q41m63k043m009n409n669n768o855q336q727p899p072
52171I89832o769o264n232m364m047l637k636j577j035o70J62J412K525L102L042
52156I63844K511K005J937J989J490N22q9r8j78o77r59n23Q3J57o5P6N74R02Q85
52137I74386P77P44P68Q33Q44O26K90L10R88K206L874O127Q793J1261J3138J4676
52121A040641J6214J7759J9350K1229K3224K4548K4750K4309K3924K3591K2939
52110A282478K1975K0967J9958J8815J7518J6043J4337J2672J1617J1380J1520
52099A459280J1560J1362J0793R597P878N995L709L01m089q076j0630j2247j3909
52086A471524j5654j6926j7644j8000j7811j6937j5886j5135j4273j2709j0762
$$ plain form
52185 1044912 1048857 1051241 1052082 1051619 1049576 1045567 1040158 1034489 1028721 1021866 1013530 1004803 996904 989832
52171 989832 983063 976799 971567 967203 963156 959519 956883 955306 954271 953601 953763 955175 957700 960802 963844
52156 963844 966355 968360 970297 972286 973776 974298 974209 974111 973933 973256 972297 971774 971857 972014 971949 972025 972599 973501 974386
52137 974386 975163 975907 976675 977508 978352 978978 979268 979578 980566 982772 986646 992773 1001566 1012827 1025965 1040641
52121 1040641 1056855 1074614 1093964 1115193 1138417 1162965 1187715 1212024 1235948 1259539 1282478
52110 1282478 1304453 1325420 1345378 1364193 1381711 1397754 1412091 1424763 1436380 1447760 1459280
52099 1459280 1470840 1482202 1492995 1502592 1510470 1516465 1520174 1520475 1516386 1508310 1497680 1485433 1471524
52086 1471524 1455870 1438944 1421300 1403300 1385489 1368552 1352666 1337531 1323258 1310549 1299787
52075A299787r217q119o927n546m259k858q24J664L764N083O043P137Q401R704
52061A303833J0940J1970J2752J3463J4164J4559J4510J4410J4587J4612J3840
52050A453640J2271J0346Q198N699K972K09k654n596q119r901j1378j3056j4631
52037A428000j5510j5795j5968j6000j5587j4963j4579j4276j3610j2756j2260
52026A266696j2247j2621j3568j4836j5211j3936j2202j1793j2572j2893j2277
52015A122540j1945j2452j2700j1768j0236r008q191p906q749j0560j1991j2272
52003I94762j2422j3626j5391j6468j6751j7023j7306j6777j5145j3056j1231
51992H29566j0034r776j0589j1942j2939j3262j3350j3701j4341j4952j5240j5188
$$ plain form
52075 1299787 1290570 1282451 1275524 1269978 1265719 1262861 1262037 1263701 1267465 1272548 1278591 1285728 1294129 1303833
52061 1303833 1314773 1326743 1339495 1352958 1367122 1381681 1396191 1410601 1425188 1439800 1453640
52050 1453640 1465911 1476257 1484455 1490154 1493126 1493335 1490681 1485085 1476966 1467065 1455687 1442631 1428000
52037 1428000 1412490 1396695 1380727 1364727 1349140 1334177 1319598 1305322 1291712 1278956 1266696
52026 1266696 1254449 1241828 1228260 1213424 1198213 1184277 1172075 1160282 1147710 1134817 1122540
52015 1122540 1110595 1098143 1085443 1073675 1063439 1054431 1046240 1038334 1029585 1019025 1007034 994762
52003 994762 982340 968714 953323 936855 920104 903081 885775 868998 853853 840797 829566
51992 829566 819532 809756 799167 787225 774286 761024 747674 733973 719632 704680 689440 674252
51980F74252j5121j5308j5507j5215j4522j4099j4031j3367j1363q679o635n580
51968E24825m718l354j580K70K150M064N721O641O538N578M374L480K772J594
51954E58355k74k201l527m432n406o146n711l828j379O02J998L452N440P808J0084
51939E54835J2041J3901J6063J8634K1268K3408K4553K4185K1701J6745R772K062
51927G59168m950j0449j4439j7287j9242k0412k1043k1441k1551k0900j9301j7327
51915E50826j5810j4967j4320j3386j1969r995p592n377m053l477k665j000R82
51902D47197K351K885L068L269L416L293K667J227j158m030o500p985q589q719
51888D32392q496p752o499n149m110l234j975j57J648K699K939L018L596M775
$$ plain form
51980 674252 659131 643823 628316 613101 598579 584480 570449 557082 545719 537040 530405 524825
51968 524825 520107 516753 515173 515443 517593 521657 527378 534019 540557 546135 550509 553989 556761 558355
51954 558355 558081 555880 552353 547921 542515 536369 530658 526830 525451 526053 528051 531503 536943 544751 554835
51939 554835 566876 580777 596840 615474 636742 660150 684703 708888 730589 747334 757106 759168
51927 759168 754218 743769 729330 712043 692801 672389 651346 629905 608354 587454 568153 550826
51915 550826 535016 520049 505729 492343 480374 470379 462787 457410 453357 449880 447215 446215 447197
51902 447197 449548 452433 455501 458770 462186 465479 468146 469373 468215 464185 457685 449700 441111 432392
51888 432392 423896 416144 409645 404496 400386 397152 395177 395020 396668 399367 402306 405324 408920 413695
51874D13695O142P173P635P736P704P229N705L236R20l59r71j770k647k744j946
51859D56738j220j208j428j188n53P9P18J528K218K193J161p02k917m784n735
51844D44900n931o190o981p795p835o963n678m458l556l157l185l087k298r13
51830C76873L81J093J317J430J618J789J718J263M87l84j174j871k513k989l004
51815C76034k263q76N15J264J493J901K575K597J368j72n79J46N96m2j084j586
51799C81887j474r99q3J224K267K469J975J198K49p26j294j356j523k199k773
51784C78842k333q58Q63K130K631K298J448P36M43J77k87l58N19J908L000L734
51768C94893M534N312N689N952O692P571P420N802L600J842N94o97k347m170n709
$$ plain form
51874 413695 419837 427010 434645 442381 450085 457314 463019 466255 467175 466816 465845 464075 461428 458684 456738
51859 456738 455518 454310 452882 451694 451141 451220 451938 453466 455684 457877 459038 458336 455419 450635 444900
51844 444900 438969 432779 425798 418003 410168 403205 397527 393069 389513 386356 383171 380084 377786 376873
51830 376873 377254 378347 379664 381094 382712 384501 386219 387482 387969 387585 386411 384540 382027 379038 376034
51815 376034 373771 372895 373410 374674 376167 378068 380643 383240 384608 384436 383857 384003 384599 384557 383473 381887
51799 381887 380413 379414 379331 380555 382822 385291 387266 388464 388713 387987 386693 385337 383814 381615 378842
51784 378842 376509 375651 376514 378644 381275 383573 385021 385757 386200 386377 386090 385732 386251 388159 391159 394893
51768 394893 399427 404739 410428 416380 423072 430643 438063 443865 447465 449307 449901 449204 446857 442687 436978
51753D36978o529o686o816p360p782p173n564l997l262l156l135k992k682k067
51739C67777j172k26P83K126L682M813N188N303N717O153N763M174J913l9r14
51724D11041n35O97K168L457M369M685M186K885J067r29k693l689l637k981k488
51709D17603k374k282k136k375l142l805l696k858j634q3J654K699K053n5k030
51694C97539k506j697r20r64j302r48K05J247J350O49j96r83j966l061l620l291
51678C79536k566k121j930j432l92Q39J856K563L057L461L913M378M538M254M197
51663D04151N437Q075J0659J1457J0039P224L746k26m286p368q640q315p065n094
51649D19794k338P12L166M629N219M770K860j97l111m868n604n900n775n005l937
$$ plain form
51753 436978 430449 423763 416947 409587 401805 394632 389068 385071 381809 378653 375518 372526 369844 367777
51739 367777 366605 366379 367162 369288 372970 377783 382971 388274 393991 400144 405907 410081 411994 411955 411041
51724 411041 410506 411203 413371 416828 421197 425882 430068 432953 434020 433091 430398 426709 423072 420091 417603
51709 417603 415229 412947 410811 408436 405294 401489 397793 394935 393301 393218 394872 397571 399624 399569 397539
51694 397539 395033 393336 392416 391452 390150 389202 389407 390654 392004 392653 392457 391474 389508 386447 382827 379536
51678 379536 376970 374849 372919 371487 371095 371934 373790 376353 379410 382871 386784 391162 395700 399954 404151
51663 404151 409588 417663 428322 439779 449818 457042 460788 460562 456276 448908 440268 431953 424888 419794
51649 419794 417456 418168 421334 425963 431182 435952 438812 438615 435504 430636 425032 419132 413357 408352 404415
51634D04415l193k866k630k624l366m746n670n172l525j926j235j293j435j462
51620C63272j809k734l618l517k382j242r95j414j710j612j484j571j706j639
51606C35839j291o93J6N63Q45J112J640K356L048L741M492N135N585O217P415
51591C76020Q896R852R673Q143N246J402k348m946o135o289n646m310k771j556
51577C85231m25J361L880O480Q762J0777J2110J1903J0300Q929R194J0633J1685
51564D90820J1513J0465R229Q406Q673J0417J3160J5946J8389K0918K3803K6407
51552F68146K7573K6527K3285J8369J2379N919k41n258q854j1660j4537j7441
51540G24207j9422j9849j9189j8318j7507j6474j5109j3723j2732j2374j2616
$$ plain form
51634 404415 401222 398356 395726 393102 389736 384990 379320 374148 370623 368697 367462 366169 364734 363272
51620 363272 361463 358729 355111 351594 349212 347970 346975 345561 343851 342239 340755 339184 337478 335839
51606 335839 334548 333855 333871 334434 335279 336391 338031 340387 343435 347176 351668 356803 362388 368605 376020
51591 376020 384916 394768 404441 412584 417830 419232 416884 411938 405803 399514 393868 389558 386787 385231
51577 385231 384806 386167 390047 396527 405289 416066 428176 440079 450379 459308 468502 479135 490820
51564 490820 502333 512798 522027 530433 539106 549523 562683 578629 597018 617936 641739 668146
51552 668146 695719 722246 745531 763900 776279 782198 781957 776699 767845 756185 741648 724207
51540 724207 704785 684936 665747 647429 629922 613448 598339 584616 571884 559510 546894
51529E46894j3177j3724j4160j4426j4127j2812j0843r295q661q225p204n919
51517D14321n193n117n166n159n195m855l546j639l54k19m66l71k90q85j922k585
51501C71359k610k382k056j273J80J866L033L248K584J466M55M2L52R89J277Q71
51485C79401J66p9L34O85K08q74j587j469j099j236j855k410k670k850l042l063
51469C58560k894k880l276l819l999l673l241l122l175k870j994j036n53l41K60
51454C21947J272J820J309L71J01P39J660K492L472M677N670O196O631P450Q693
51439C74500J0240J1974J3326J3231J1201Q066N103K750P79p60j668k449m004
51426D42289o311q265r043q881q306p457o512n932n718n154l956k963k881k995
$$ plain form
51529 546894 533717 519993 505833 491407 477280 464468 453625 444330 435669 427444 420240 414321
51517 414321 409128 404011 398845 393686 388491 383636 380090 378451 378097 377878 377412 377041 376751 375866 373944 371359
51501 371359 368749 366367 364311 363038 363218 365084 368117 371365 373949 375415 375870 375912 376264 377253 378530 379401
51485 379401 379567 379488 379822 380507 380715 379841 378254 376785 375686 374450 372595 370185 367515 364665 361623 358560
51469 358560 355666 352786 349510 345691 341692 338019 334778 331656 328481 325611 323617 322581 322028 321687 321947
51454 321947 323219 325039 326348 326719 326820 327559 329219 331711 335183 339860 345530 351726 358357 365807 374500
51439 374500 384740 396714 410040 423271 434472 442538 447641 450391 451170 450410 448742 446293 442289
51426 442289 435978 427713 418670 409789 401483 394026 387514 381582 375864 370710 366754 363791 360910 357915
51412C57915k147o47J5o15j209m23J392K759K810J905J009Q64J592K722L610M007
51396C75559M112M088L851L408L039K957L082L390M195N755P710R345J0389J1287
51382D52167J2657J4650J6961J9328K1858K4844K8264L1683L4667L7234L9591
51371G33904M1314M0962L6869K8686J8111P844m63p196j3659k0263k6182l0607
51359H09320l3596l5551l6502l6421l5718l4816l3486l1175k7899k4256k0702
51348D59198j7279j4080j1372r266p629o444n765n356m736l738k639j711j031
51335C68152p32r97j665k195k250j972j692j626j876k341k587k263j678j547k069
51320C40662k693k851k449j579l46P84J092M62k93l47K93J146K022K938L607L476
$$ plain form
51412 357915 355768 355121 355136 354521 353312 352889 354281 357040 359850 361755 362764 363628 365220 367942 371552 375559
51396 375559 379671 383759 387610 391018 394057 397014 400096 403486 407681 413436 421146 430491 440880 452167
51382 452167 464824 479474 496435 515763 537621 562465 590729 622412 657079 694313 733904
51371 733904 775218 816180 853049 881735 899846 907690 907227 900031 886372 866109 839927 809320
51359 809320 775724 740173 703671 667250 631532 596716 563230 532055 504156 479900 459198
51348 459198 441919 427839 416467 407201 399572 393128 387363 382007 377271 373533 370894 369183 368152
51335 368152 367420 366423 364758 362563 360313 358341 356649 355023 353147 350806 348219 345956 344278 342731 340662
51320 340662 337969 335118 332669 331090 330744 331528 332620 333082 332789 332442 332735 333881 335903 338841 342448 345924
51304C45924K327N67r59j457q34M3Q4q17j671j658j062o79p44q96p76l08L73Q87
51286C38344Q71N24N53J200J818J897J931K707M051N101N590N993O454O315M950
51271C88299K574L4j818k536k306j894j974k334k066o44J402K948L156J995J75
51256C85011j358k197k729l394l877l503k354j382j238j524j557j372j488j971
51242C55067k263j902j003MP37Q97L27o39j193q31j22j96j345k543k644j755q55
51225C39741m07L9P78J319J122M70Q5J95M43N50O13P91J001J025P50L23Q7K96
51207C49221Q24J329J701K113K612K950K995K932K953L042L169L292L026J843
51193C84002p3j667k091j616j097r74j149j463j699j510r00m92p57j188q88K28
$$ plain form
51304 345924 348251 348818 347859 346402 345568 345611 345695 344878 343207 341549 340487 339808 339064 338168 337392 337084 337457 338344
51286 338344 339215 339739 340292 341492 343310 345207 347138 349845 353896 358997 364587 370580 377034 383349 388299
51271 388299 390873 390907 389089 386553 384247 382353 380379 378045 375979 375335 376737 379685 382841 384836 385011
51256 385011 383653 381456 378727 375333 371456 367953 365599 364217 362979 361455 359898 358526 357038 355067
51242 355067 352804 350902 349899 349903 350640 351537 351864 351225 350032 349201 349079 348883 347538 344995 342351 340596 339741
51225 339741 339334 339373 340151 341470 342592 343062 343147 343342 343785 344335 344948 345739 346740 347765 348515 348838 348925 349221
51207 349221 350045 351374 353075 355188 357800 360750 363745 366677 369630 372672 375841 379133 382159 384002
51193 384002 383929 382262 380171 378555 377458 376484 375335 373872 372173 370663 369763 369271 368514 367326 366438 366666
51177C66666J333J741J526J130Q60O85K72p10k015k864k853k428k063j502m53
51162C59325N10O70M11P56J796K549K354J539O93J39J52P25J120N52n09p80JO95
51144C72698N20M0q1j74o48r82n79R5K01j41j12M88J096J292J125O64q3q16j100
51125C73503q69m18O3N81J101J560J943K101J766J078P99J488K676L356L094K375
51109C96197J931K077K544K670J940O33l18l82J8L20O80J478K403K764K469J999
51093D19423J500O95l36j017j103j021j160j313j095m85K51R03J327J324Q17P5
51077D18785m23l46K16Q00J005R57J140J755K446K864L133L548M103M693N498
51062D50174O699Q146R679J1568J4047J6698J8820K0223K0990K0675J8587J4958
$$ plain form
51177 366666 367999 369740 371266 372396 373256 373941 374213 373503 371488 368624 365771 363343 361280 359778 359325
51162 359325 359835 360505 360916 361672 363468 366017 368371 369910 370603 370742 370894 371619 372739 373291 372782 372002 372003 372698
51144 372698 373218 373258 373177 373003 372355 371373 370794 370889 371090 370949 370837 371325 372421 373713 374838 375502 375419 374603 373503
51125 373503 372634 372216 372279 372860 373961 375521 377464 379565 381331 382409 383208 384696 387372 390728 393822 396197
51109 396197 398128 400205 402749 405419 407359 407992 407674 407292 407310 407630 408310 409788 412191 414955 417424 419423
51093 419423 420923 421618 421282 420265 419162 418141 416981 415668 414573 414088 414339 415242 416569 417893 418710 418785
51077 418785 418362 418016 418232 419032 420037 420994 422134 423889 426335 429199 432332 435880 439983 444676 450174
51062 450174 456873 465019 474698 486266 500313 517011 535831 556054 577044 597719 616306 631264
51050F31264J1033P873N726M735N208O714P653O644L994J170r91k903n274q139
51036F74707j0914j2895j3475j2263r413n936l466l370n785r424j2515j3967j3754
51023E47530j2337j0163p671n295l164j042J212L273M676N439O121P291R009J0750
51009E55629J1807J1811J0922R559Q090O818O002N471M504K604L66j042j362j579
50995F29600k509l649l950l257k297j521o41O33K056L254M273N443O936Q649J0444
50980F53464J2287J4168J5992J7561J8675J9163J8858J7741J6303J5599J6533
50969H36344J9095K2580K6535L0993L5702L9811M2777M5189M8134N1926N5883
50958A254969N9184O1488O2868O3556O3661O2789O0101N5215M8904M2411L6142
$$ plain form
51050 631264 642297 650170 655896 660631 665839 672553 680206 686850 690844 692014 691023 688120 682846 674707
51036 674707 663793 650898 637423 625160 615747 609811 606345 602975 597190 587766 575251 561284 547530
51023 547530 535193 525030 517359 512064 508900 507858 509070 512343 517019 522458 528579 535870 544879 555629
51009 555629 567436 579247 590169 599728 607818 614636 620638 626109 630613 633217 633583 632541 631179 629600
50995 629600 627091 623442 619492 616235 613938 612417 611776 612409 614465 617719 621992 627435 634371 643020 653464
50980 653464 665751 679919 695911 713472 732147 751310 770168 787909 804212 819811 836344
50969 836344 855439 878019 904554 935547 971249 1011060 1053837 1099026 1147160 1199086 1254969
50958 1254969 1314153 1375641 1438509 1502065 1565726 1628515 1688616 1743831 1792735 1835146 1871288
50947A871288K9734K3275J7615J3231R567O003K919J160P99R75P23m58k634n409
50933A968788p987r815j1209j2993j5439j8020k0248k2286k4634k7563l1175l5536
50921A731883m0424m5095m8712n0992n2211n2693n2530n1712n0157m7660m4122
50910A195575m0000l6103l2791k9682k6404k3353k1244k0105j9137j7657j5744
50899I13355j3899j2373j1109j0028r122q355p544o399m741k892j657j487j701
50886H22048j170J55J061P86J67M09J381K100K509L591N648P572Q259P947P642
50871H70105P872Q503R340J0373J1659J3301J5315J7296J8668J9571K0945K3339
50859A046287K6155K8614L1047L4436L8987M3900M8547N3170N8456O4940P2812
$$ plain form
50947 1871288 1901022 1924297 1941912 1955143 1964710 1970713 1973632 1974792 1975591 1976566 1977289 1976831 1974197 1968788
50933 1968788 1960801 1950986 1939777 1926784 1911345 1893325 1873077 1850791 1826157 1798594 1767419 1731883
50921 1731883 1691459 1646364 1597652 1546660 1494449 1441756 1389226 1337514 1287357 1239697 1195575
50910 1195575 1155575 1119472 1086681 1056999 1030595 1007242 985998 965893 946756 929099 913355
50899 913355 899456 887083 875974 865946 856824 848469 840925 834526 829785 826893 825236 823749 822048
50886 822048 820878 821033 822094 822880 823047 823456 824837 826937 829446 833037 838685 846257 854516 862463 870105
50871 870105 877977 886480 895820 906193 917852 931153 946468 963764 982432 1002003 1022948 1046287
50859 1046287 1072442 1101056 1132103 1166539 1205526 1249426 1297973 1351143 1409599 1474539 1547351
50848A547351Q1685R0514R8318J05191J12033J19170J25864J31379J35851J39593
50838B686949J42038J41983J38731J32392J23120J10649R4848P6444N6944L7789
50828C741887J9762L269j1060k2366l0300l5426l8462l9223l6791l0872k2615
50817C497803j3946o445j141R61j132p647j7547k9150m1264n3716o6814q0429
50805C179533r3757j05761j15690j23133j27850j29645j28356j23975j16963j08399
50795B006004r9463r0608q1524p2044o2678n4008m6002l8334l1063k4498j8703
50784A387079j3669r675o853m613k262j22P76J73r52j680k199l202m748o229p123
50769A324701p471p816q826j0738j2981j4712j5718j6475j7306j8019j8429j8644
$$ plain form
50848 1547351 1629036 1719550 1817868 1923059 2035092 2154262 2280126 2411505 2547356 2686949
50838 2686949 2828987 2970970 3109701 3242093 3365213 3475862 3570710 3647154 3704098 3741887
50828 3741887 3761649 3764918 3753858 3731492 3701192 3665766 3627304 3588081 3551290 3520418 3497803
50817 3497803 3483857 3477412 3476271 3477232 3476100 3468453 3450906 3421756 3380492 3326776 3259962 3179533
50805 3179533 3085776 2980015 2864325 2741192 2613342 2483697 2355341 2231366 2114403 2006004
50795 2006004 1906541 1815933 1734409 1662365 1599687 1545679 1499677 1461343 1430280 1405782 1387079
50784 1387079 1373410 1363735 1356882 1352269 1350007 1349885 1350661 1350834 1349882 1348202 1346003 1342801 1338053 1331824 1324701
50769 1324701 1317230 1309414 1300588 1289850 1276869 1262157 1246439 1229964 1212658 1194639 1176210 1157566
50757A157566j8666j8285j7474j6365j4685j2060r001o676n255l413r5M035P708
50744A047334J0771J3830J6897J9575K2204K5562K9516L3105L6017L8975M2500
50733A336286M6276N0031N4127N8785O3387O7000O9341P0835P2018P2994P3246
50722B034326P1970O8907O4805O0623N6403N1308M4623L6129K5628J3028r03j4543
50710B512304k6482l6077m2769m5705m4542m0189l4190k7624k0924j4384q327
50699B171091k939J612M778N651L442j926r626j8418k7552l7121m7233n7008o4821
50686A919930o9598p1389p0769o8268o4418n9782n4520m8388m1432l4263k7469
50675A309634k1083j4879q727k503L906J0140J5395J9253K2174K4763K6901K7973
$$ plain form
50757 1157566 1138900 1120615 1103141 1086776 1072091 1060031 1051030 1044354 1039099 1035686 1035591 1039626 1047334
50744 1047334 1058105 1071935 1088832 1108407 1130611 1156173 1185689 1218794 1254811 1293786 1336286
50733 1336286 1382562 1432593 1486720 1545505 1608892 1675892 1745233 1816068 1888086 1961080 2034326
50722 2034326 2106296 2175203 2240008 2300631 2357034 2408342 2452965 2489094 2514722 2527750 2526847 2512304
50710 2512304 2485822 2449745 2406976 2361271 2316729 2276540 2242350 2214726 2193802 2179418 2171091
50699 2171091 2168152 2169764 2174542 2180193 2183635 2181709 2172083 2153665 2126113 2088992 2041759 1984751 1919930
50686 1919930 1850332 1778943 1708174 1639906 1575488 1515706 1461186 1412798 1371366 1337103 1309634
50675 1309634 1288551 1273672 1264945 1262442 1266348 1276488 1291883 1311136 1333310 1358073 1384974 1412947
50663A412947K7665K6187K3944K1386J8994J7089J5734J4979J4926J5353J5601
50652A624805J5231J4546J4140J4116J4114J3963J3991J4689J6328J8748K1363
50641A796034K3557K5275K7113K9716L3217L7260M1199M4186M5562M5488M4777
50630B193384M3803M2046L9114L5735L3109L1649L1000L0863L0668K8397K0958
50619B560726O827j1729k9476m1522m6089m4634l9932l4083k7910k1541j5120
50608B255517q944l403J023L835M813M029J526k868r187j7013k5690l4668m3453
50595B125517n1480n8244o3549o7393o9730p0511o9784o7735o4713o1245n7678
50584A423455n3823m9365m4717m0792l7700l4362l0004k5404k1857j9354j6674
$$ plain form
50663 1412947 1440612 1466799 1490743 1512129 1531123 1548212 1563946 1578925 1593851 1609204 1624805
50652 1624805 1640036 1654582 1668722 1682838 1696952 1710915 1724906 1739595 1755923 1774671 1796034
50641 1796034 1819591 1844866 1871979 1901695 1934912 1972172 2013371 2057557 2103119 2148607 2193384
50630 2193384 2237187 2279233 2318347 2354082 2387191 2418840 2449840 2480703 2511371 2539768 2560726
50619 2560726 2567553 2555824 2526348 2484826 2438737 2394103 2354171 2320088 2292178 2270637 2255517
50608 2255517 2246573 2243170 2244193 2248028 2252841 2256870 2258396 2255528 2246341 2229328 2203638 2168970 2125517
50595 2125517 2074037 2015793 1952244 1884851 1815121 1744610 1674826 1607091 1542378 1481133 1423455
50584 1423455 1369632 1320267 1275550 1234758 1197058 1162696 1132692 1107288 1085431 1066077 1049403
50573A049403j3155r414o254l682j289J145L691O389R008J1116J2689J4228J6001
50560A089876J7657J8962K0376K2437K4773K6396K6910K6946K7312K8099K8784
50549A358528K8975K8841K8860K9241K9610K9298K8065K6522K5769K6445K8273
50538A668427L0525L2826L5382L8530M2342M6724N1616N6863O2031O6606P0467
50527B202339P4065P8140Q3233Q9282R5537J01063J05460J08934J11488J12460
50517C162001J11160J07568J01840R3515Q2008O7798N2142L5556J7565j719k0794
50506C808640l8205n3964o8671q1834r2026r8424j01258j00746r6518q8280p6470
50495B912244o2099m6295l0113j4384M42J4060K5925L5238M1218M3174M0471L2762
$$ plain form
50573 1049403 1036248 1026834 1020580 1016898 1015609 1016754 1020445 1026834 1035842 1046958 1059647 1073875 1089876
50560 1089876 1107533 1126495 1146871 1169308 1194081 1220477 1247387 1274333 1301645 1329744 1358528
50549 1358528 1387503 1416344 1445204 1474445 1504055 1533353 1561418 1587940 1613709 1640154 1668427
50538 1668427 1698952 1731778 1767160 1805690 1848032 1894756 1946372 2003235 2065266 2131872 2202339
50527 2202339 2276404 2354544 2437777 2527059 2622596 2723659 2829119 2938053 3049541 3162001
50517 3162001 3273161 3380729 3482569 3576084 3658092 3725890 3778032 3813588 3831153 3829434 3808640
50506 3808640 3770435 3716471 3647800 3565966 3473940 3375516 3274258 3173512 3076994 2988714 2912244
50495 2912244 2850145 2803850 2773737 2759353 2759795 2773855 2799780 2835018 2876236 2919410 2959881 2992643
50483B992643K0226L426j6821l9094o1123q0457r5559j06185j12841j16133j16509
50472B271573j14359j10229j04866r8817r2087q4670p7242p0732o5075n9326n3207
50461A340963m7527m2607l7479l1507k5769k1534j8188j4127r157m473n95L043
50449A091043O483Q959J0456J2057J4307J6581J8530K0770K3551K6006K7468K8255
50437A304466K8343K6440K1604J4856Q144K415k251n440o647o354n588m558k787
50424A372643l98J744L237M593O416Q770J1425J4162J6774J9330K2365K6335L0994
50411A538390L5772M0565M5451M9838N2781N4234N5238N6622N8004N8357N7047
50400B102299N4123N0006M5146L9758L3669K6589J8482R475n86j1967k4387l6809
$$ plain form
50483 2992643 3012869 3016295 2999474 2960380 2899257 2818800 2723241 2617056 2504215 2388082 2271573
50472 2271573 2157214 2046985 1942119 1843302 1751215 1666545 1589303 1518571 1453496 1394170 1340963
50461 1340963 1293436 1250829 1213350 1181843 1156074 1134540 1116352 1102225 1093068 1088595 1088000 1091043
50449 1091043 1097526 1106485 1116941 1128998 1143305 1159886 1178416 1199186 1222737 1248743 1276211 1304466
50437 1304466 1332809 1359249 1380853 1395709 1403853 1406268 1404017 1398577 1391930 1385576 1379988 1375430 1372643
50424 1372643 1372245 1373989 1377226 1381819 1388235 1397005 1408430 1422592 1439366 1458696 1481061 1507396 1538390
50411 1538390 1574162 1614727 1660178 1710016 1762797 1817031 1872269 1928891 1986895 2045252 2102299
50400 2102299 2156422 2206428 2251574 2291332 2325001 2351590 2370072 2379547 2378961 2366994 2342607 2305798
50388B305798m8047n7342o4337o8838p0792p0282o7492o2789n6724m9757m1979
50377A647419l3414k4498j5860p698J42P429J3294J6975J8378J7697J4869R828
50365A664561L003m881j3365k2237l0845l8000m2773m5124m5494m4032m0749l6337
50353A303727l2232k9492k8000k7228k7404k9222l2408l5336l6405l5372l2982
50342I57646k9791k5945k1800j8049j5084j2639j0243p777n454l401j541K31J830
50329H07983L080M011M834N559N759N125M167L957N010O729Q125Q827R133R359
50315H91658R492R332Q745P776O668N653M711L702K783K415K875M100O001Q455
50301I74366J0848J2225J2374J2321J3190J4970J6830J8382K0030K2227K5030
$$ plain form
50388 2305798 2257751 2200409 2136072 2067234 1996442 1926160 1858668 1795879 1739155 1689398 1647419
50377 1647419 1614005 1589507 1573647 1565949 1566091 1573520 1586814 1603789 1622167 1639864 1654733 1664561
50365 1664561 1667564 1662683 1649318 1627081 1596236 1558236 1515463 1470339 1424845 1380813 1340064 1303727
50353 1303727 1271495 1242003 1214003 1186775 1159371 1130149 1097741 1062405 1026000 990628 957646
50342 957646 927855 901910 880110 862061 846977 834338 824095 816318 810864 807463 805922 806153 807983
50329 807983 811063 815074 819908 825467 831226 836351 840518 844475 849485 856214 864339 873166 882299 891658
50315 891658 901150 910482 919227 927003 933671 939324 944035 947737 950520 952935 955810 959910 965911 974366
50301 974366 985214 997439 1009813 1022134 1035324 1050294 1067124 1085506 1105536 1127763 1152793
50290A152793K8419L2513L7229M1559M3056L8249K4830M371j7473l4482m3880
50279A307184m6708m5189m0800l4653k8109k2197j7108j2688q913n594k265J142
50267A044102L971N666O511P274Q366R773J1379J3018J4427J5571J6793J8329
50255A175180J9802K0465J9817J7847J5035J2235J0323R564R460R298Q588O897
50243A334511L820n54n461j0143j4392j8103k0682k1421k0257j7726j4354j0561
50231A184677p118n070n088p104j0546j4681j8759k2186k4612k5807k5627k4356
50219I93723k2819k1694k0819j9552j7720j5773j4089j2715j1753j1343j1117
50208H14329j0325q825p426o815o630o072n157m646m891n358n385m907m264l677
$$ plain form
50290 1152793 1181212 1213725 1250954 1292513 1335569 1373818 1398648 1403019 1385546 1351064 1307184
50279 1307184 1260476 1215287 1174487 1139834 1111725 1089528 1072420 1059732 1050819 1045225 1042960 1044102
50267 1044102 1048073 1053739 1060250 1067524 1075890 1085663 1097042 1110060 1124487 1140058 1156851 1175180
50255 1175180 1194982 1215447 1235264 1253111 1268146 1280381 1290704 1300268 1309728 1319026 1327614 1334511
50243 1334511 1338331 1337777 1332316 1322173 1307781 1289678 1268996 1247575 1227318 1209592 1195238 1184677
50231 1184677 1177559 1172489 1167401 1160297 1149751 1135070 1116311 1094125 1069513 1043706 1018079 993723
50219 993723 970904 949210 928391 908839 891119 875346 861257 848542 836789 825446 814329
50208 814329 804004 795179 787753 780938 774308 768236 763079 758433 753542 748184 742799 737892 733628 729951
50194G29951l231l071l307l778m133m160l943l696l583l667l896m069l932l365
50180F78120k606k121k115k217j828r00j37k29j004j634j639j359j297j351r93
50165F56690j08P54J102J187J722K954M296N043N244N543O274P127P897R116J1468
50150G26309J4739J7949K0534K2889K5557K8366L0760L2659L4519L6639L8730
50139A029650M0137M0288L9040L6864L4663L3105L2201L1652L1398L1434L1174
50128A411606K9391K5017J7773Q181k717j3584k3158l0738l6334m0296m2899m4214
50116A258028m4142m2605l9837l6397l2709k8759k4633k1073j8866j7736j6576
50105I34695j4956j3673j3371j3399j2639j1045r572q786q289p568o746o274o328
$$ plain form
50194 729951 726720 723649 720342 716564 712431 708271 704328 700632 697049 693382 689486 685417 681485 678120
50180 678120 675514 673393 671278 669061 667233 666333 666196 665967 664963 663329 661690 660331 659034 657683 656690
50165 656690 656582 657336 658438 659625 661347 664301 668597 673640 678884 684427 690701 697828 705725 714841 726309
50150 726309 741048 758997 779531 802420 827977 856343 887103 919762 954281 990920 1029650
50139 1029650 1069787 1110075 1149115 1185979 1220642 1253747 1285948 1317600 1348998 1380432 1411606
50128 1411606 1440997 1466014 1483787 1491968 1489251 1475667 1452509 1421771 1385437 1345141 1302242 1258028
50116 1258028 1213886 1171281 1131444 1095047 1062338 1033579 1008946 987873 969007 951271 934695
50105 934695 919739 906066 892695 879296 866657 855612 846040 837254 828965 821397 814651 808377 802049
50092H02049o739p162p170o468n152l614k072m75J121K338K932L166L478L914
50078G80146M218M329M494M809N059N166N474O273P199P554P116O281N359M264
50064H57741L036K170J985K013J510L43j045k294l231l610l340k922k989l451
50050H45916l737l771l898l861k865r29P96J616K264L609N283O507P587R327J1399
50035H75243J2555J2502J2480J3627J5705J7766J9362K0668K1965K3514K5484
50024A070871K7573K8939K8943K7822K6403K5197K4006K2334J9974J7168J4260
50013A333490J1338Q310N284K601L30k032n206r593j5177k1637k8290l4195l8664
50000A206559m1463m2402m1130l7791l3461k9318k5586k1841j8118j5058j3024
$$ plain form
50092 802049 795310 788148 780978 774510 769358 765744 763672 763197 764318 766656 769588 772754 776232 780146
50078 780146 784364 788693 793187 797996 803055 808221 813695 819968 827167 834721 841837 848118 853477 857741
50064 857741 860777 862947 864932 866945 868455 868798 867753 865459 862228 858618 855278 852356 849367 845916
50050 845916 842179 838408 834510 830649 827784 826855 827651 829267 831531 835140 840423 846930 854517 863844 875243
50035 875243 887798 900300 912780 926407 942112 959878 979240 999908 1021873 1045387 1070871
50024 1070871 1098444 1127383 1156326 1184148 1210551 1235748 1259754 1282088 1302062 1319230 1333490
50013 1333490 1344828 1353138 1358422 1361023 1361353 1359321 1354115 1344522 1329345 1307708 1279418 1245223 1206559
50000 1206559 1165096 1122694 1081564 1043773 1010312 980994 955408 933567 915449 900391 887367
49989H87367j1755j0843j0059r217q413q312r478j1398j2866j3439j3739j4125
49977G53723j4034j3033j1761j1109j0949j0398r074p484o318n825n808n867n641
49964F36422n059m309l545k840k436k637l255l524k852j390L29J983L413M463
49950F14763N215O097P345Q474Q711P803O146M349K891K006J516R59J37o28r99
49935F74785j135j400j890k654m029o211q609j0199j0551j0069r306q488p749
49922E92495p200o595n354l332j213J34N61O41R09J360J708J868K058K499L102
49907E83641L546L640L638M064N241O954Q596R603R791R374Q722Q105P591P055
49893F79561O270N054L479J839L86r32k341l957n725p508r113j0291j0865j0860
$$ plain form
49989 887367 875612 864769 854710 845493 837080 828768 819290 807892 795026 781587 767848 753723
49977 753723 739689 726656 714895 703786 692837 682439 673365 665881 659563 653738 647930 642063 636422
49964 636422 631363 627054 623509 620669 618233 615596 612341 608817 605965 604575 604904 606887 610300 614763
49950 614763 619978 626075 633420 641894 650605 658408 664554 668903 671794 673800 675316 676275 676412 675784 674785
49935 674785 673650 672250 670360 667706 663677 657466 648857 638658 628107 618038 608732 600244 592495
49922 592495 585295 578700 573346 570014 568801 568935 569496 570137 571046 572406 574114 575982 578040 580539 583641
49907 583641 587187 590827 594465 598529 603770 610724 619320 628923 638714 648088 656810 664915 672506 679561
49893 679561 685831 690885 694364 696203 696589 695657 693316 689359 683634 676126 667013 656722 645857 634997
49879F34997j0404r622q777q264q146p868o826n198l755k872k168j206n1J048
49865E60888K047K880L295L289L399M166N476O770P705Q302Q606Q623Q508Q510
49851F42464Q701Q929Q985Q609P518N675L501J564J24q73j537k054k828m220o066
49836F78492p684q467q346p698p008o549o216n635m598l405k595k303k053j284
49822F04651nJ206J836J992K296L239M698O188P409Q398R137R331Q674P240N461
$$ plain form
49879 634997 624593 614971 606194 597930 589784 581916 575090 569892 566137 563265 561097 559891 559840 560888
49865 560888 562935 565815 569110 572399 575798 579964 585440 592210 599915 608217 616823 625446 633954 642464
49851 642464 651165 660094 669079 677688 685206 690881 694382 695946 696070 695197 693660 691606 688778 684558 678492
49836 678492 670808 662341 653995 646297 639289 632740 626524 620889 616291 612886 610291 607988 605935 604651
49822 604651 604646 605852 607688 609680 611976 615215 619913 626101 633510 641908 651045 660376 669050 676290 681751
$$ [...]
##END NTUPLES=NMR SPECTRUM
##END=
